##TITLE=AC1458_PAST313264_8026666_PJXO6PTAY7
##JCAMPDX= 6.0         $$ Bruker NMR JCAMP-DX V2.0
##DATA TYPE= NMR SPECTRUM
##DATA CLASS= NTUPLES
##ORIGIN= BRUKER
##OWNER= Administrator
$$ 1.72 TOPSPIN		Version 2.1
$$ 2013-07-11 16:05:24.821 -0700  Administrator@X
$$ Compression mode = diff/dup
##.OBSERVE FREQUENCY= 400.02188249412
##.OBSERVE NUCLEUS= ^1H
##.ACQUISITION MODE= SIMULTANEOUS (DQD)
##.ACQUISITION SCHEME= undefined
##.AVERAGES= 8
##.DIGITISER RES= 22
##SPECTROMETER/DATA SYSTEM= spect
##.PULSE SEQUENCE= zg30
##.SOLVENT NAME= COFFEE_meoh
##.SHIFT REFERENCE= INTERNAL, COFFEE_meoh, 1, 14.98509
##AUDIT TRAIL= $$ (NUMBER, WHEN, WHO, WHERE, PROCESS, VERSION, WHAT)
$$ ##TITLE= Audit trail, TOPSPIN		Version 2.1
$$ ##JCAMPDX= 5.01
$$ ##ORIGIN= Bruker BioSpin GmbH
$$ ##OWNER= Administrator
$$ $$ E:\/data/COFFEE/nmr/AC1458_PAST313264_8026666_PJXO6PTAY7/10/pdata/1/auditp.txt
$$ ##AUDIT TRAIL=  $$ (NUMBER, WHEN, WHO, WHERE, PROCESS, VERSION, WHAT)
(   1,<2013-07-11 16:05:17.509 -0700>,<Administrator>,<X>,<go>,<TOPSPIN 2.1>,
      <created by zg
	started at 2013-07-11 16:04:11.837 -0700,
	POWCHK enabled, PULCHK disabled,
       configuration hash MD5:
       C8 4E 4E 5D D3 5C D8 9E 9F 52 82 E0 59 8A DE 15
       data hash MD5: 64K
       A2 98 41 FA DB 63 1D BD F1 1F F4 4F AA F5 D8 3A>)
(   2,<2013-07-11 16:05:20.509 -0700>,<Administrator>,<X>,<proc1d>,<TOPSPIN 2.1>,
      <Start of raw data processing
       efp LB = 0 FT_mod = 6 PKNL = 1 PHC0 = 0 PHC1 = 0 SI = 32K 
       data hash MD5: 32K
       D1 C7 32 87 68 78 E8 77 94 3F 90 A4 D6 FA E4 BF>)
(   3,<2013-07-11 16:05:20.915 -0700>,<Administrator>,<X>,<proc1d>,<TOPSPIN 2.1>,
      <pk PHC0 = 98.23425 PHC1 = 0 
       data hash MD5: 32K
       B2 73 24 C1 0C 55 67 1A 58 8D D5 D5 2A 85 98 7E>)
(   4,<2013-07-11 16:05:21.103 -0700>,<Administrator>,<X>,<proc1d>,<TOPSPIN 2.1>,
      <abs ABSG = 1 
       data hash MD5: 32K
       C4 2B AA A8 18 17 2A 4F 61 A6 35 93 0B C5 29 37>)
(   5,<2013-07-11 16:05:21.165 -0700>,<Administrator>,<X>,<proc1d>,<TOPSPIN 2.1>,
      <abs ABSG = 2 
       data hash MD5: 32K
       12 DA 44 19 FB A3 25 F8 EF C9 DA AC 12 27 11 3A>)
(   6,<2013-07-11 16:05:21.228 -0700>,<Administrator>,<X>,<proc1d>,<TOPSPIN 2.1>,
      <abs ABSG = 3 
       data hash MD5: 32K
       E9 1B DD 9A 86 B8 AD 07 49 98 45 A2 3F 1E 16 1A>)
(   7,<2013-07-11 16:05:21.275 -0700>,<Administrator>,<X>,<proc1d>,<TOPSPIN 2.1>,
      <abs ABSG = 4 
       data hash MD5: 32K
       3B F5 E3 72 6B 93 1D 38 46 07 D9 35 6B 58 EE BB>)
(   8,<2013-07-11 16:05:21.337 -0700>,<Administrator>,<X>,<proc1d>,<TOPSPIN 2.1>,
      <abs ABSG = 5 
       data hash MD5: 32K
       72 92 0E 20 9A F0 B6 17 CC AA 97 10 D1 CD D4 81>)
$$ ##END=
$$ 
$$ $$ hash MD5
$$ $$ CC F0 84 13 D1 34 B1 0E E2 27 33 01 91 99 18 FD
##$RELAX= 
##$RELAX= 
##$RELAX= 
##$RELAX= 
##$RELAX= 
##$RELAX= 
##$RELAX= 
$$ Bruker specific parameters
$$ --------------------------
##$DU= <E:\>
##$EXPNO= 10
##$NAME= <AC1458_PAST313264_8026666_PJXO6PTAY7>
$$ [...]
150 150 150 150 150 150 150 150
##$TP07= 0
##$TPNAME0= <>
##$TPNAME1= <>
##$TPNAME2= <>
##$TPNAME3= <>
##$TPNAME4= <>
##$TPNAME5= <>
##$TPNAME6= <>
##$TPNAME7= <>
##$TPOAL= (0..7)
0.5 0.5 0.5 0.5 0.5 0.5 0.5 0.5
##$TPOFFS= (0..7)
0 0 0 0 0 0 0 0
##$TUNHIN= 0
##$TUNHOUT= 0
##$TUNXOUT= 0
##$USERA1= <user>
##$USERA2= <user>
##$USERA3= <user>
##$USERA4= <user>
##$USERA5= <user>
##$V9= 5
##$VALIST= <valist>
##$VCLIST= <CCCCCCCCCCCCCCC>
##$VD= 0
##$VDLIST= <DDDDDDDDDDDDDDD>
##$VPLIST= <PPPPPPPPPPPPPPP>
##$VTLIST= <TTTTTTTTTTTTTTT>
##$WBST= 1024
##$WBSW= 4
##$XGAIN= (0..3)
0 0 0 0
##$XL= 0
##$YL= 0
##$YMAX_a= 645075
##$YMIN_a= -548637
##$ZGOPTNS= <>
##$ZL1= 120
##$ZL2= 120
##$ZL3= 120
##$ZL4= 120
##$ABSF1= 14.98509
##$ABSF2= -5.573092
##$ABSG= 5
##$ABSL= 3
##$ALPHA= 0
##$AQORDER= 0
##$ASSFAC= 0
##$ASSFACI= 0
##$ASSFACX= 0
##$ASSWID= 0
##$AUNMP= <proc_prof1d_extract_pilot.lims>
##$AXLEFT= 0
##$AXNAME= <>
##$AXNUC= <1H>
##$AXRIGHT= 0
##$AXTYPE= 0
##$AXUNIT= <>
##$AZFE= 0.1
##$AZFW= 0.1
##$BCFW= 0
##$BC_mod= 0
##$BYTORDP= 0
##$COROFFS= 0
##$CY= 15
##$DATMOD= 1
##$DC= 0
##$DFILT= <>
##$DTYPP= 0
##$F1P= 0
##$F2P= 0
##$FCOR= 0.5
##$FTSIZE= 32768
##$FT_mod= 6
##$GAMMA= 0
##$GB= 0
##$INTBC= 1
##$INTSCL= 1
##$ISEN= 128
##$LB= 0
##$LEV0= 0
##$LPBIN= 0
##$MAXI= 10000
##$MC2= 0
##$MEAN= 0
##$ME_mod= 0
##$MI= 0
##$NCOEF= 0
##$NC_proc= -8
##$NLEV= 6
##$NOISF1= 0
##$NOISF2= 0
##$NSP= 0
##$NTH_PI= 0
##$NZP= 0
##$OFFSET= 14.98509
##$PC= 1
##$PHC0= 98.23425
##$PHC1= 0
##$PH_mod= 1
##$PKNL= yes
##$PPARMOD= 0
##$PPDIAG= 0
##$PPIPTYP= 0
##$PPMPNUM= 2147483647
##$PPRESOL= 1
##$PSCAL= 4
##$PSIGN= 0
##$PYNMP= <proc.py>
##$REVERSE= no
##$SF= 400.02
##$SI= 32768
##$SIGF1= 0
##$SIGF2= 0
##$SINO= 400
##$SIOLD= 32768
##$SPECTYP= <>
##$SREGLST= <1H.CDCl3>
##$SSB= 0
##$STSI= 32768
##$STSR= 0
##$SW_p= 8223.68421052631
##$SYMM= 0
##$S_DEV= 0
##$TDeff= 65536
##$TDoff= 0
##$TI= <>
##$TILT= no
##$TM1= 0
##$TM2= 0
##$TOPLEV= 0
##$USERP1= <user>
##$USERP2= <user>
##$USERP3= <user>
##$USERP4= <user>
##$USERP5= <user>
##$WDW= 1
##$XDIM= 32768
##$YMAX_p= 443754470
##$YMIN_p= -762026
##$CURPLOT= <Network HP LaserJet P1505>
##$CURPRIN= <$Network HP LaserJet P1505>
##$DFORMAT= <normdp>
##$LAYOUT= <+/1D_H.xwp>
##$LFORMAT= <normlp>
##$PFORMAT= <normpl>
##$SURQMSG= 1
$$ End of Bruker specific parameters
$$ ---------------------------------
##NTUPLES= NMR SPECTRUM
##VAR_NAME=  FREQUENCY,     SPECTRUM/REAL,   SPECTRUM/IMAG
##SYMBOL=    X,             R,               I
##VAR_TYPE=  INDEPENDENT,   DEPENDENT,       DEPENDENT
##VAR_FORM=  AFFN,          ASDF,            ASDF
##VAR_DIM=   32768,         32768,           32768
##UNITS=     HZ,            ARBITRARY UNITS, ARBITRARY UNITS
##FACTOR=    0.250966925370066, 1,           1
##FIRST=     8223.43324360094, -73569,       -34650
##LAST=      0,             35608,           -216160
##MIN=       0,             -762026,         0
##MAX=       8223.43324360094, 443754470,    0
$$ Real data points
##PAGE= N=1
##DATA TABLE= (X++(R..R)), XYDATA
$$ [...]
$$ plain form
19529 97161 -43086 418025 42197 -19286 125447 20958 86405 -59470 -188095 -178784 -608942
19518 -608942 -17541 109157 -9142 -63977 -175413 -339638 54596 -271424 -280671 -220967 -272702
19507 -272702 1044 18808 -36630 -100187 130526 -196033 43162 -9168 -34099 -252556 118785
19495 -89473 47471 54272 43253 -111419 -226977 -187313 376318 -278871 206197 -102629 37685
19483 42607 135376 88395 143220 -61142 -34590 -13107 -202673 196266 -163568 -364162 -13032
19471 60632 11119 -46996 -34864 -91703 -154042 -197821 -125635 -82735 -96888 126399 -311902
19459 -281845 -305855 44777 -237545 -128953 -185068 210037 93034 -44988 -33849 -17888 143004
19447 -79241 244324 -88505 141591 -133081 23279 -332621 -56541 -173144 -293287 -200226
$$ packed form
19529I7161d3086D18025D2197a9286A25447B0958O5447e9470j28625R311m30158
19518f08942a7541A09157i142n4835j11436j64225E4596b71424r247N9704n1735
19507b72702A044J7764c6630o3557A30526a96033D3162i168k4931k18457A18785
19495h9473D7471O801j1019a11419j15558L9664C76318b78871B06197a02629C7685
19483D2607R2769m6981N4825f1142K6552a3107j89566A96266a63568k00594a3032
19471F0632A1119d6996J2132n6839o2339m3779P2186M2900j4153A26399c11902
19459b81845k4010D4777b37545J08592n6115B10037I3034d4988J1139J5961A43004
19447g9241B44324h8505A41591a33081B3279c32621e6541j16603j20143R3061
$$ plain form
19437 -200226 -11132 -118596 -535572 -254225 25720 -209820 -193613 -141247 176308 -123922
19426 74269 213130 -25975 -121100 -107337 116246 -312126 -93889 93542 147283 115 -51782
19414 -109649 -82032 171667 -217838 -16382 -49411 9696 -273612 -184157 -92944 83921 128624
19403 128624 -129734 -13454 203728 -182941 -149113 -71849 -132984 55073 -251499 -121502
19392 -177405 -178647 84200 -202493 73687 31671 -92813 256943 -55461 7338 229580 -99404
19380 -473321 -58266 -511115 -26266 336680 8936 -63520 40194 -32117 -69941 30850 65274
19369 65274 60701 -188339 -163148 33138 146682 52440 256 -21963 51068 199317 32865 159902
19357 159902 80570 -198900 -327821 -32733 44826 -258109 -312059 -27149 324551 64172 -74562
$$ packed form
19437b00226a1132j07464m16976b54225B5720b09820J6207N2366A76308a23922
19426G4269J38861b5975r5125J3763A16246c12126i3889I3542N3741A15e1782
19414a09649K7617A71667b17838a6382l3029I696b73612Q9455R1213H3921M4703
19403A28624a29734a3454B03728a82941L3828g1849o1135E5073b51499a21502
19392a77405j242H4200b02493G3687C1671i2813B56943e5461G338K22242i9404
19380d73321e8266m52849b6266C36680H936f3520D0194c2117l7824C0850L4424
19369F5274m573a88339K5191C3138J13544E2440B56b1963E1068J48249C2865J27037
19357A59902p9332a98900j28921c2733D4826b58109n3950b7149C24551F4172g4562
$$ plain form
19345 -54308 -58315 116296 253162 -103282 -331402 -52506 -114268 36492 40654 361847 -172281
19333 12047 396094 -307326 -90548 -318737 114012 -24950 -276438 -138086 -96452 -19398
19322 -187093 -28499 -116238 -29028 -375487 -206054 -57785 130283 55674 39375 185707 -111443
19310 -99252 232670 -201071 -93520 -135007 -120032 -67329 50900 -147051 91856 185757 -253345
19298 186398 -24577 97400 -64664 119179 -232142 51274 -295548 -24191 -147449 -279600
19288 -279600 -232908 150070 143416 160265 -351199 115411 225209 -279466 -135417 -300436
19278 -300436 -245131 66023 -277702 8056 125703 255266 -201339 35059 -75892 5950 40389
19267 40389 -270023 -117343 -263472 -94593 -150924 -96241 25062 -155004 -10586 121687 113030
$$ packed form
19345e4308m007A16296J36866a03282k28120e2506o1762C6492M162L21193a72281
19333A2047L84047c07326i0548k28189A14012b4950k51488a38086M1634a9398
19322a87093b8499q7739b9028l46459J69433e7785A30283E5674j6299J46332a11443
19310i9252B32670b01071i3520m1487J4975N2703E0900a47051I1856R3901b53345
19298A86398b4577I7400f4664A19179b32142E1274b95548b4191j23258j32151
19288b79600M6692A50070o654J6849c51199A15411J09798b79466a35417j65019
19278c00436N5305F6023b77702H056J17647J29563b01339C5059g5892E950L4439
19267D0389b70023a17343j46129i4593n6331N4683B5062a55004a0586A21687q657
$$ plain form
19256 113030 -391574 -69575 56941 146091 -143705 51269 -196861 88079 4107 -24075 -49050
19245 -49050 54050 135972 174208 -503474 -110089 -191890 -211451 -56572 105874 105583 62342
19234 62342 -88462 -131088 139659 23490 -75761 -140373 75731 -130485 -78422 -100810 218965
19222 67109 -217061 -20835 -385448 -300153 -409318 -139591 31954 4632 -224908 29822 -90425
19210 86718 -288899 -33289 -178297 -371509 -126352 -210987 235309 -61843 -81300 224980
19199 28203 -213178 177540 -100439 -146955 -501254 -205294 -207722 -153142 -58407 118679 -92827
19187 -212423 98943 40360 30905 -270039 366399 -198939 -246715 -3911 -43823 305960 -235525
19175 52494 -121665 -51442 -186053 -236374 179745 129158 49943 -1275 19071 -17538 -326608
$$ packed form
19256A13030c91574f9575E6941Q9150a43705E1269a96861H8079D107b4075k4975
19245d9050E4050Q1922L8236e03474a10089q1801j9561e6572A05874k91m3241
19234F2342h8462m2626A39659B3490g5761o4612G5731a30485N2063k2388B18965
19222F7109b17061b0835l64613Q5295j09165a39591C1954D632b24908B9822i0425
19210H6718b88899c3289j45008j93212a26352q4635B35309f1843j9457B24980
19199B8203b13178A77540a00439m6516l54299b05294k428N4580e8407A18679i2827
19187b12423I8943D0360r455b70039C66399a98939m7776c911l9912C05960b35525
19175E2494a21665e1442j34611n0321A79745n0587D9943a275A9071a7538l09070
$$ plain form
19164 -326608 -15882 -156833 41157 2830 105681 68686 -191184 -20755 -325179 -76838 -329386
19153 -329386 -36367 -188555 186291 1201 -144592 128527 -163746 96869 -98412 -369124
19143 -369124 -115350 237161 -434800 138958 162921 165010 -189495 -23475 48073 -401336
19132 -316909 -2872 -61877 138268 -306115 69916 -17328 -159115 -277931 62892 -360007 -293996
19121 -293996 -142184 41480 -440016 76638 195277 -196644 -41710 10017 -171469 -229082
19111 -229082 32990 -120888 -420100 -281546 -169793 -60443 155745 206959 -51700 14942
19100 -99151 -203485 -290501 31474 130245 76703 11370 -61077 -99776 -274477 -48582 39979
19088 -157636 -196094 -120815 -231736 197912 -215038 -13197 138414 -220854 135372 31448
$$ packed form
19164c26608a5882j40951D1157B830J02851l6995a91184b0755l04424g6838k52548
19153c29386c6367j52188A86291A201a44592A28527a63746I6869i8412k70712
19143c69124a15350B37161d34800A38958K3963K089a89495b3475D8073d01336
19132c16909b872n9005A38268c06115F9916a7328j41787j18816F2892c60007O6011
19121b93996a42184D1480d40016G6638J18639a96644d1710A0017a71469n7613
19111b29082C2990a20888k99212J38554J11753f0443A55745N1214e1700A4942
19100i9151j04334q7016C1474R8771n3542A1370f1077l8699j74701d8582C9979
19088a57636l8458P5279j10921A97912b15038a3197A38414b20854A35372C1448
$$ plain form
19077 -120066 163767 83270 -164639 61716 137210 -191236 95894 99333 -78728 -203429 -162299
19066 -162299 -376081 -242241 83232 78730 -484141 -223553 -426885 -237621 -205514 6975 -3923
19054 -158218 -230116 -139597 -133709 -255892 210702 -3794 75158 45452 -46420 -38210 -46888 -62537
19042 -62537 245665 15038 -157321 117116 -209408 -131150 166873 30762 146753 286110
19032 286110 41997 -25865 442703 65683 -61329 6855 244540 333221 -69708 46118 -208657
19020 149839 99879 47395 -95846 80932 -31303 -51620 -57274 -29338 81599 -67579 84625 -229791
19007 -6433 98567 -479784 -22979 98199 -66694 140979 226653 1018 207128 -136157 9495
18995 -126026 -178084 41748 143435 -65563 -27628 -55714 239663 464647 -73671 -144772 -483571
$$ packed form
19077a20066A63767q0497a64639F1716P5494a91236I5894L439g8728j24701M1130
19066a62299k13782J33840H3232m502d84141b23553k03332J89264L2107F975c923
19054a58218p1898R0519N888j22183B10702c794G5158k9706d6420Q210q678j5649
19042f2537B45665A5038a57321A17116b09408P8258A66873C0762J15991J39357
19032B86110D1997b5865D42703F5683f1329F855K37685Q8681f9708D6118b08657
19020A49839m9960D7395i5846H0932c1303k0317n654K7936H1599f7579H4625b29791
19007f433I8567d79784b2979I8199f6694A40979Q5674A018K06110a36157I495
18995a26026n2058D1748J01687f5563b7628k8086B39663K24984g3671p1101l38799
$$ plain form
18984 -483571 73 -341664 -499785 -183837 160151 -208992 -134382 288877 -1483 -1186 -128642
18973 -128642 -56297 -253856 -116375 -6096 -203988 358695 -352813 -308476 -171897 54633
18962 -315422 20168 33351 244174 50639 327011 -31379 263570 176537 142969 208795 74859
18950 1697 -116175 -136896 -271002 -1904 -139195 -295000 -33392 101138 2481 -176225 74069
18938 -67512 239380 -79423 -161245 -460462 -21443 -200564 -91300 194956 58 -126920 123090
18926 -183330 -490967 -227037 -117899 233559 -412109 70178 24192 23857 -66295 -329780 183390
18914 70567 -241729 71504 50736 -121698 319712 -170703 176746 -240419 -135115 -309483
18904 -309483 -57219 -76272 -225204 13341 177574 76122 -167965 -56633 -131609 21957 -21331
$$ packed form
18984d83571G3c41664j58121a83837A60151b08992P4610B88877a483K97j27456
18973a28642e6297j97559a16375f096j97892C58695c52813M4337J36579E4633
18962c15422B0168J3183K10823E0639K76372c1379B63570q7033l3568O5826G4859
18950A697a16175k0721j34106a904j37291j55805c3392A01138B481a76225G4069
18938f7512B39380g9423q1822k99217b1443j79121i1300A94956E8a26920A23090
18926a83330l07637b27037J09138B33559d12109G0178B4192l35f6295k63485A83390
18914G0567b41729G1504k0768a21698C19712a70703A76746b40419J05304j74368
18904c09483e7219j9053j48932A3341J64233G6122a67965e6633p4976B1957b1331
$$ plain form
18892 -206014 -75105 -94948 -285639 -33027 -214790 -87667 -8300 -233372 170473 -292767 -3503
18880 -192659 -222159 11220 -18192 101643 312727 -125388 10427 208933 107073 147232
18870 147232 303734 -12606 20528 -169859 -98183 -69002 71597 -24807 148455 -150812 202585
18858 -155024 -15340 -91450 -161358 -187302 -473448 -189174 35588 412533 45644 -123533 -146955
18847 -146955 22475 -104308 -102628 -92213 -160492 -227756 -118312 100902 79294 -132239 154941
18835 -21145 -194153 -179934 159513 76409 -34094 -132616 -314122 222542 139487 -346271 -200563
18824 -200563 -183350 28506 165407 -253437 33865 -21532 -115036 -124785 8865 -136821 121935
18812 412386 -56714 198684 208265 490597 116503 -47816 120954 17035 50191 215650 140612
$$ packed form
18892b06014g5105j9843j90691c3027j81763h7667h300k25072A70473b92767c503
18880a92659k9500A1220a8192A01643K11084a25388A0427J98506j01860M0159
18870A47232J56502a2606B0528a69859P1676K9181G1597b4807A48455a50812B02585
18858a55024a5340p6110o9908k5944k86146a89174C5588L76945D5644a23533k3422
18847a46955B2475a04308J680J0415o8279o7264J09444A00902k1608a32239A54941
18835b1145j73008J4219A59513G6409c4094r8522j81506B22542q3055c46271J45708
18824b00563J7213B8506J36901b53437C3865b1532r3504r749H865a36821A21935
18812D12386e6714A98684R581K82332A16503d7816A20954A7035L3156J65459p5038
$$ plain form
18801 140612 94567 237379 195191 -37078 35479 -306037 -353603 -125304 -388543 20349 -63611
18789 7541 70436 -1887 -174011 -387734 -40964 -208186 -141775 234682 41160 -53254 -33236
18778 -33236 7807 -155111 81054 -14810 -134378 -183281 -255543 140509 -84802 94610 -193216
18766 -157918 -143567 -208473 -97625 -8429 -80458 233298 -225324 -9349 -113885 244633 65759
18754 25421 194539 498800 -137239 -115732 -286051 15373 -351999 -316054 -208862 21536
18743 -234172 -118260 187919 66327 -70227 117145 -217190 -263750 -160207 156493 86170
18733 86170 -103287 -174631 -149798 -122849 144334 310275 -46686 -231044 -27603 -132434 -128646
18722 -128646 -76453 -210951 -121807 -273688 -220517 -38698 173123 -238378 6608 155205 -108115
$$ packed form
18801A40612m6045J42812m2188c7078C5479c06037m7566a25304k63239B0349f3611
18789G541O2895a887j72124k13723d0964j67222O6411B34682D1160e3254K0018
18778c3236G807a55111H1054a4810j19568m8903p2262A40509h4802I4610a93216
18766a57918J4351o4906i7625h429p2029B33298b25324i349j04536B44633F5759
18754B5421J69118L04261a37239K1507j70319A5373c51999L5945J07192B1536
18743b34172J15912A87919F6327g0227A17145b17190m6560J03543A56493p0323
18733H6170a03287p1344K4833K6949A44334J65941d6686j84358b7603j04831L788
18722a28646N2193j34498Q9144j51881N3171c8698A73123b38378F608J48597a08115
$$ plain form
18710 -114233 -2567 -311970 121617 -278568 -140793 122839 -23974 -183103 -60219 368306
18699 -34402 -28681 151367 111236 67460 127175 -109773 -264828 282639 93652 163724 -111281
18687 46272 -25585 -131670 -136675 178939 111321 -188890 -280132 125165 4693 -274876 96062
18675 -174133 73416 -299502 228044 197704 -79447 34080 -129406 136084 -317323 -124714
18664 -221847 369549 -104617 172905 -36296 169088 -136053 148449 168267 -152937 102992
18653 -333907 -54381 -230815 -138377 114877 24767 19649 -7085 9146 -176199 -206582 -217405
18642 -217405 -93726 -212680 203684 -19094 -120775 31757 -126606 53280 -28611 -37817 327028
18630 53888 -154545 -141321 -21121 170816 -176871 -46869 -123196 -49655 -14369 276979 214891
$$ packed form
18710a14233b567l09403A21617b78568J37775A22839b3974j59129f0219C68306
18699c4402N721A51367m0131m3776N9715a09773j55055B82639I3652P0072a11281
18687D6272b5585j06085n005A78939o7618a88890r1242A25165D693b74876I6062
18675a74133G3416b99502B28044l0340g9447C4080a29406A36084c17323a24714
18664b21847C69549a04617A72905c6296A69088a36053A48449J9818a52937A02992
18653c33907e4381j76434R2438A14877B4767n118g085I146a76199l0383j0823
18642b17405i3726j18954B03684a9094j01681C1757a26606E3280b8611r206C27028
18630E3888a54545J3224b1121A70816a76871d6869p6327d9655a4369B76979o2088
$$ plain form
18619 214891 161161 -206063 -394191 -34949 205151 80297 181111 -193940 -172856 -103091
18609 -103091 -82185 -159664 232414 39019 -283725 -220978 -323005 -51328 -53206 -200842 -114141
18598 -114141 -4497 -186233 69517 -226890 -338362 160954 -128268 -90584 4441 103108 -114983
18586 -71565 -262912 -71622 -163736 -253688 -126020 -83888 47128 -53184 -99347 -103198 209892
18574 314110 -442904 217043 8061 -116288 195174 -95346 36216 -78368 -195343 -103890 -67453
18563 -67453 -22199 -14428 136663 59833 -172339 -22853 -168817 226501 -112809 87185 17273
18551 -88905 -133905 -214661 -551898 206968 -211098 -152555 -379401 3021 165926 297612 -192444
18539 209822 149035 -197593 -157879 16009 252079 157471 2526 -18226 -71145 -49943 -290100
$$ packed form
18619B14891n3730b06063j88128c4949B05151H0297J00814a93940K1084O9765
18609a03091K0906p7479B32414C9019b83725O2747j02027e1328j878j47636Q6701
18598a14141d497j81736F9517b26890j11472A60954a28268L7684D441R8667a14983
18586g1565j91347g1622r2114q9952a26020M2132D7128e3184m6163l851B09892
18574C14110d42904B17043H061a16288A95174i5346C6216g8368j16975R1453L6437
18563f7453b2199P771A36663E9833a72339b2853j45964B26501a12809H7185A7273
18551h8905m5000q0756l37237B06968b11098N8543k26846C021J62905J31686a92444
18539B09822o0787a97593L9714A6009K36070r4608B526a8226n2919K1202k40157
$$ plain form
18528 -290100 -311740 -17287 -58259 -376265 -291251 -300401 11360 -4063 21838 -62314 -181094
18517 -181094 24581 100522 9942 38812 94647 -34165 21598 -16878 168446 -297391 29049
18505 -236202 179550 94560 -5089 -110350 100412 -50341 -35412 243197 39650 -71335 -43538
18494 -43538 56200 195815 372861 11878 -324628 -212441 281465 -111353 220042 181384
18484 181384 206422 28726 -49514 159790 -337375 197898 -490767 -197461 -263022 -151870
18474 -151870 -10126 -114913 -342915 -149531 -277374 -55923 105755 -77097 -83137 -74418 143232
18462 -10036 -76571 -7667 345048 63660 -53658 -178203 -33320 58763 -528008 -351554 59377
18450 -250534 -166246 76488 18427 -277478 -210625 69132 -23569 -115060 213269 -82495 -337248
$$ packed form
18528b90100k1640a7287m0972l18006Q5014r150A1360d063B1838f2314j18780
18517a81094B4581P5941I942K8870N5835c4165B1598a6878A68446b97391B9049
18505b36202A79550q4990e089j05261A00412e0341J4929B43197C9650g1335K7797
18494d3538E6200J39615J77046A1878c24628J12187B81465a11353B20042l8658
18484A81384K5038B8726d9514A59790c37375A97898d90767a97461o5561J11152
18474a51870a0126j04787k28002a49531j27843e5923A05755g7097o040Q719A43232
18462a0036o6535g667C45048F3660e3658j24545c3320E8763e28008J76454E9377
18450b50534Q4288G6488A8427b77478O6853F9132b3569r1491B13269h2495k54753
$$ plain form
18439 -337248 97570 207613 -102526 -105787 337330 143773 120879 146333 -242882 -224576 -167842
18428 -167842 128249 -92393 -241169 82095 120576 -5962 -252987 -198669 -30632 11148 -29999
18416 -103051 244911 -23682 50290 -35287 200339 -83031 -148475 -147346 -41189 -64923 -20990
18404 -222551 54950 -26579 79045 -173050 -231704 -26437 216047 -235472 77600 -46485 28796
18392 57735 -101748 -218872 223555 31940 -166629 -160192 -207459 -326156 -355315 33565 -118425
18380 -267856 144446 30738 -9559 -7774 -98239 61154 236402 -148744 -24838 298634 -146965
18368 -154343 -127216 -299412 15706 66136 187764 192448 -84913 -263817 -37267 90526 -162530
18356 -242452 -112066 -229140 -9430 91376 -73963 -113423 93749 48996 64389 -95613 155958
$$ packed form
18439c37248I7570J10043a02526l261C37330A43773k2894K5454b42882J8306N6734
18428a67842A28249i2393j48776H2095L8481e962k47025N4318c0632A1148b9999
18416a03051B44911b3682E0290c5287B00339h3031o5444J129d1189k3734b0990
18404b22551E4950b6579G9045a73050n8654b6437B16047b35472G7600d6485B8796
18392E7735a01748j17124B23555C1940a66629O437m7267j18697k9159C3565a18425
18380b67856A44446C0738i559J785r0465F1154J75248a48744b4838B98634a46965
18368a54343K7127j72196A5706N0430J21628M684h4913j78904c7267I0526a62530
18356b42452a12066j17074i430I1376g3963l9460I3749m4753J5393i5613A55958
$$ plain form
18344 24428 8175 -215873 -126114 -145906 -73730 -33875 270752 -72901 -114349 -197558 -177023
18333 -177023 210453 174434 -220390 24336 -5205 124720 -101372 -1020 -64426 -152241 -27370
18321 -84684 107398 525676 175746 121776 -185774 -84721 99321 86930 210923 -235375
18310 -333385 -57752 -258810 -63676 -185538 -259235 47824 -403029 -32396 -49899 -57280 -152483
18299 -152483 -193653 182854 -185673 -118044 -95911 -316594 113935 -397821 -21818 -289803
18289 -289803 276071 1066 4334 -396067 -5402 184715 -72374 123895 -177813 -101749 332941
18277 76468 -192043 -50736 135228 128791 52630 37119 -190283 16703 175489 -212690 -131199
18266 -131199 -120092 113023 -106675 36396 -338711 -41326 7142 33469 -292112 10055 156119
$$ packed form
18344B4428H175b15873Q9759j9792P2176c3875B70752g2901m1448q3209K0535
18333a77023B10453l6019b20390B4336e205A24720a01372a020o3406q7815b7370
18321h4684A07398M18278A75746n3970a85774h4721I9321j2391J23993b35375
18310c33385e7752k01058f3676j21862p3697D7824d03029c2396j7503p381r5203
18299a52483m1170A82854a85673O7629K2133k20683A13935c97821b1818k67985
18289b89803B76071A066L268c96067e402A84715g2374A23895a77813P6064C32941
18277G6468a92043e0736A35228o437E2630j5511a90283A6703J58786b12690Q1491
18266a31199J1107A13023a06675C6396c38711d1326G142K6327b92112A0055J46064
$$ plain form
18255 156119 -160787 20778 -275616 173929 -188418 -84533 48727 100290 -28290 -54142 -172175
18244 -172175 297193 -280878 45105 -74470 -375792 -27116 147926 84477 54045 272984
18234 272984 -280387 93375 5416 -67160 -197362 -213674 85983 71228 -90190 262887 -149523
18222 213588 -8098 -167237 28364 -224012 -105707 344314 -242006 76487 -180264 -116868
18212 -116868 -540099 -32738 -118291 47265 -23603 -12957 -27586 -71569 191375 -161632 -396258
18201 -396258 66567 -136200 -51741 -170144 -204626 190701 -175565 -54449 -186237 115649
18190 140337 -187626 251838 -301168 136769 -55192 -55475 -281254 29310 -5927 122914 80174
18179 80174 -22170 -25605 -299376 95823 -200099 219374 115439 206489 205638 -76315 -23732
$$ packed form
18255A56119a60787B0778b75616A73929a88418h4533D8727N1563b8290k5852j18033
18244a72175B97193b80878D5105g4470l01322b7116A47926o3449l0432K18939
18234B72984b80387I3375E416f7160j30202j6312H5983j4755i0190B62887a49523
18222B13588h098j59139B8364b24012a05707C44314b42006G6487a80264O3396
18212a16868m23231c2738q5553D7265b3603J0646j4629m3983A91375a61632k34626
18201c96258F6567a36200e1741j18403l4482A90701a75565e4449j31788A15649
18190A40337a87626B51838c01168A36769e5192k83k25779B9310e927A22914m2740
18179H0174b2170l435k73771I5823b00099B19374j03935R1050q51g6315b3732
$$ plain form
18167 -128604 -9677 -215020 -166659 47132 212755 -33276 -321722 -7206 10341 3716 -129379
18155 5645 17492 19152 43540 -176402 -55028 -29964 13599 -225270 50295 -52514 -219404
18144 -219404 98622 -176558 -149330 -93169 238498 -24463 -94237 -199047 -379287 -186926
18133 263690 -36246 -331967 273082 101066 24042 -247743 -156357 -115432 -380132 -41894
18122 -117477 171289 -73407 29392 -232710 -242979 99399 -149898 -19347 -36505 65120 -51536
18110 -191684 -413291 -93648 -287093 -178631 -2828 -431438 205383 -137983 -392634 189918
18099 109822 -49733 33679 57540 -40244 -167556 82013 -364124 3954 59293 -169641 28794
18087 -284348 -89398 -67474 83102 -223216 -76214 -40959 49690 -70091 42554 -160878 -71657
$$ packed form
18167a28604i677k05343M8361D7132J65623c3276k88446g206A0341C716a29379
18155E645J1847J660K4388a76402e5028K5064A3599b25270E0295e2514j66890
18144b19404I8622a76558K7228N6161B38498b4463o9774j04810j80240a86926
18133B63690c6246k95721B73082A01066B4042b47743R1386M0925k64700d1894
18122a17477A71289g3407B9392b32710j0269I9399a49898a9347j7158F5120e1536
18110a91684k21607i3648j93445J08462b828m28610B05383a37983k54651A89918
18099A09822d9733C3679K3861d0244j27312H2013c64124C954N5339a69641B8794
18087b84348h9398K1924H3102b23216g6214L5255D9690g0091D2554a60878g1657
$$ plain form
18075 150157 -131595 232786 130302 30669 25038 -3910 87398 137961 117287 204597 -106576
18063 3662 -178957 41195 -83071 -221437 -284536 -153447 -114083 -6783 234569 100156 23160
18051 -31859 -233684 -417236 85214 26020 326166 -106280 -346969 17677 40703 108841 -179699
18039 -297471 52936 -47951 32567 -47228 506875 116818 -63150 -281689 77303 313698 48601
18027 67080 -32515 7630 148224 -209638 426020 -376573 14654 4013 115568 162234 -230785
18015 -155486 -122262 5837 122200 -196999 -325264 175281 48805 197820 -394611 114567
18004 -26483 51387 -110262 123836 209871 -156476 256738 -163375 223002 111169 132303
17994 132303 -321562 36149 -213222 -159066 404852 -70881 -212315 69595 223880 -58328
$$ packed form
18075A50157a31595B32786j02484C0669n631c910H7398N0563k0674Q7310a06576
18063C662a78957D1195h3071j38366o3099J31089L9364f783B34569A00156B3160
18051c1859k01825j83552H5214B6020L00146a06280k40689A7677K3026O8138a79699
18039b97471E2936d7951C2567d7228E06875A16818f3150k18539G7303K36395D8601
18027F7080c2515G630J40594b09638D26020c76573A4654D013J11555M6666b30785
18015a55486L3224E837J16363a96999j28265A75281D8805J49015c94611A14567
18004b6483E1387a10262A23836Q6035a56476B56738a63375B23002A11169K1134
17994A32303c21562C6149b13222N4156D04852g0881j41434F9595J54285e8328
$$ plain form
17983 -122209 12958 -143188 56986 -190482 -410239 -152770 -290040 65693 318378 -210239
17972 -178805 113957 -223073 -291505 213460 -108537 -64025 286755 29626 177063 -65440
17961 -135305 145287 -158727 207893 67357 6448 -389702 -192761 -134259 177532 176989 -80647
17949 -19583 452738 -119914 115834 -205536 -368956 188437 -51776 -128202 -79378 380963
17938 -44297 69937 -109479 74060 69205 173995 -224091 -48373 -34045 -249651 163014 9142
17926 -138475 20634 -126777 -279148 -156437 -83758 172380 8444 99616 181194 -80208 17166
17914 206051 -164516 86248 58962 -197590 112361 -341863 41013 -201369 69597 248050
17904 248050 73451 90782 -175056 -6896 357265 -79736 21033 -135395 -190682 -278693 -295108
$$ packed form
17983a22209A2958a43188E6986a90482k19757a52770j37270F5693K52685b10239
17972a78805A13957b23073o8432B13460a08537M4512B86755B9626J47437f5440
17961a35305A45287a58727B07893F7357F448c89702a92761N8502A77532n43h0647
17949a9583D52738a19914A15834b05536j63420A88437e1776p6426M8824C80963
17938d4297F9937a09479G4060m855J04790b24091d8373J4328k15606A63014I142
17926a38475B0634a26777j52371J22711P2679A72380H444R1172Q1578h0208A7166
17914B06051a64516H6248k7286a97590A12361c41863D1013b01369F9597J78453
17904B48050G3451J7331a75056f896C57265g9736B1033a35395n5287q8011j6415
$$ plain form
17893 -295108 -162423 -87476 130488 31786 166324 390486 216489 131620 -47825 46802
17882 -230416 -108049 219609 -188082 -25784 -118295 185154 -52079 -159474 70504 -108344
17871 1824 -29642 -136211 -77671 -120092 -5408 -142969 141845 -229315 98260 25775 41504
17860 41504 254551 -51570 -152609 -18543 -32464 116068 -33384 282324 -208396 98401 -80750
17848 35377 159298 -18455 -207945 -104029 -137324 243423 -103017 -203194 16811 153263
17838 153263 -163218 97628 71573 -66834 -235592 -226799 23182 280834 10873 -18414 -158007
17827 -158007 237577 -132817 272232 66737 -95257 109272 -26222 -18254 284408 42139 38593
17816 38593 33248 -261789 -152895 163837 -118446 74024 177280 83019 -20374 -54361 -104852
$$ packed form
17893b95108J32685P4947A30488C1786J34538K24162j73997q4869d7825D6802
17882b30416a08049B19609a88082b5784r2511A85154e2079j07395G0504a08344
17871A824b9642j06569N8540m2421e408j37561A41845b29315I8260B5775J5729
17860D1504K13047e1570j01039a8543j3921A16068c3384B82324b08396I8401h0750
17848C5377J23921a8455j89490J03916l3295B43423a03017j00177A6811J36452
17838A53263a63218I7628k6055f6834j68758Q793B3182K57652A0873a8414j39593
17827a58007B37577a32817B72232F6737i5257A09272b6222P968B84408D2139l546
17816C8593n345b61789J08894A63837a18446G4024J03256H3019b0374l3987n0491
$$ plain form
17805 -104852 -157942 -291545 -241632 -131816 255340 260179 -6777 201124 -92542 150989 344190
17794 344190 -18012 -70314 -255133 191612 232371 -128379 -181242 -189397 -31648 28905 110808
17783 110808 22582 361401 -220617 276093 -400446 -47625 42618 -36120 238203 -165278
17772 340309 -168618 73980 -490572 -147696 214104 -180556 -47625 -92080 -49190 19476
17761 -231210 -42448 -67979 -98203 -122440 174858 -113985 34699 47790 -180778 -62741 215759
17749 53394 -106455 -274531 102463 -176245 -124844 171517 166968 19746 -62928 -148596 -49088
17737 -26921 294036 -762026 -24096 -155283 92220 257902 -166780 125026 2360 72012 178117
17726 178117 91111 87263 172405 -232554 105146 175703 10705 129828 -164594 77340 -52332
$$ packed form
17805a04852n3090j33603M9913J09816B55340M839f777B01124i2542A50989J93201
17794C44190a8012n2302j84819A91612M0759a28379n2863q155c1648B8905Q1903
17783A10808B2582L38819b20617B76093d00446d7625D2618c6120B38203a65278
17772C40309a68618G3980d90572a47696B14104a80556d7625m4455M2890A9476
17761b31210d2448k5531l0224k4237A74858a13985C4699J3091a80778f2741B15759
17749E3394a06455j68076A02463a76245N1401A71517m549A9746f2928q5668d9088
17737b6921B94036g62026b4096j31187I2220J65682a66780A25026B360O9652J06105
17726A78117q7006l848Q5142b32554A05146P0557A0705J19123a64594G7340e2332
$$ plain form
17714 -171696 126026 -68033 -113692 -34577 -212252 -101745 242344 -46909 26589 -291639
17703 11686 77720 -253047 -134660 90471 178021 113485 -90204 476152 -50695 354727 -209942
17691 60447 17154 74334 -116682 -17417 -107444 64703 140836 -129385 129923 80242 20975
17679 -8826 75940 94264 -133622 -73735 -111250 320170 -55623 42567 48495 31937 68148 79945
17667 79945 230001 218319 -46805 -107809 -324459 88052 168075 166527 -2284 29643 97891 -12271
17654 -375048 68106 -136167 171208 103684 -364518 323156 -94291 -24759 237796 108087
17643 -359127 -43639 -143033 25425 26605 -290238 355553 -217097 -306480 4521 175504 -51787
17631 -39571 -233236 -64459 273225 13120 229606 242978 188457 227038 -92475 256458 -96447
$$ packed form
17714a71696A26026f8033m5659c4577j77675a01745B42344d6909B6589b91639
17703A1686O6034b53047J18387I0471Q7550o4536i0204D76152e0695C54727b09942
17691F0447A7154N7180a16682a7417r0027F4703P6133a29385A29923m9681B0975
17679h826G5940J8324a33622N9887l7515C20170e5623D2567N928j6558L6211J1797
17667G9945J50056j1682d6805o1004k16650H8052Q0023j548b284B9643O8248a2271
17654c75048F8106a36167A71208o7524c64518C23156i4291b4759B37796A08087
17643c59127d3639r9394B5425J180b90238C55553b17097q9383D521J70983e1787
17631c9571j93665f4459B73225A3120K16486J3372n4521L8581i2475B56458i6447
$$ plain form
17619 -46362 182852 -300998 -161959 -221075 58363 -106155 118244 33184 -40187 78833 172803
17608 172803 -16148 -1420 128254 309760 -113234 150988 350680 321542 20390 263561
17598 263561 -1346 -89414 310971 -233901 -134367 -43779 -190393 78074 -82162 34930 368947
17587 368947 19768 261603 137460 -26827 18318 6463 223326 205409 -17281 -49386 171795
17575 275123 58923 300970 124526 87985 -262093 234841 152373 115865 505542 -99899
17564 -174477 157873 242891 37069 158454 -74438 41381 16473 125118 -206360 -298166 139028
17552 172063 -328777 160754 9412 -294164 -309769 45963 245420 24564 -60804 -318966 75486
17540 -330363 253260 13929 -238738 -96748 -303407 -61994 7499 220966 240158 199216 204708
$$ packed form
17619d6362A82852c00998J39039n9116E8363a06155A18244C3184d0187G8833R3970
17608A72803a6148a420A28254J81506a13234A50988J99692k9138B0390K43171
17598B63561a346q8068C10971b33901R9534d3779j46614G8074h2162C4930L34017
17587C68947A9768K41835j24143b6827A8318F463K16863j7917a7281l2105A71795
17575B75123E8923K42047A24526l6541b62093B34841q2468l6508L89677i9899
17564a74477A57873Q5018C7069J21385g4438D1381A6473J08645b06360r1806A39028
17552A72063c28777A60754I412b94164j5605D5963J99457B4564f0804k58162G5486
17540c30363B53260A3929b38738i6748k06659f1994G499K13467J9192m0942N492
$$ plain form
17529 204708 31764 -5735 365588 268066 362020 149760 -268113 43413 307033 -63200 9633
17517 4320 -115484 229537 -227658 206543 223785 58520 262979 148776 28460 -76571 -83129
17506 -83129 253541 136635 -35060 264795 65354 -13980 263770 122243 -43230 101237
17495 -31724 -101522 214983 -26328 140235 55297 76425 107362 112820 -128498 218710 67469
17483 43454 80873 -31977 309323 -44458 268010 229 132699 -69835 251732 212363 320366
17472 320366 202562 -238572 137784 226791 179516 -40231 18921 152473 -72596 158665
17461 123053 118226 -52602 307716 124954 357143 186741 187566 50818 404758 -32238 277813
17449 233305 113793 30230 544424 371167 169873 128504 256644 465953 210445 256429
$$ packed form
17529B04708C1764e735C65588r7522R3954A49760b68113D3413K63620f3200I633
17517D320a15484B29537b27658B06543J7242E8520K04459j14203B8460g6571o558
17506h3129B53541j16906c5060B64795F5354a3980B63770A22243d3230A01237
17495c1724o9798B14983b6328A40235E5297K1128L0937N458a28498B18710F7469
17483D3454L7419c1977C09323d4458B68010B29J32470f9835B51732l9369J08003
17472C20366j17804b38572A37784Q9007m7275d0231A8921J33552g2596A58665
17461A23053m827e2602C07716A24954K32189j70402Q25E0818L53940c2238B77813
17449B33305A13793C0230N14194j73257A69873m1369J28140K09309B10445M5984
$$ plain form
17439 256429 338397 247247 136139 199218 403960 181854 200917 -12265 302491 311073 500321
17428 500321 433222 354861 490784 194094 25612 17357 155394 89359 173891 255838 401495
17417 401495 244708 420559 439595 385744 317791 439432 434092 364106 198879 368467 203078
17406 203078 -4617 121271 20979 506670 107103 -14650 -4748 -142278 31669 97055 -78426
17394 264715 127278 348013 278514 441401 -121748 180199 106380 651573 219302 47685
17383 297336 243922 259508 -189443 310061 59405 -202962 83899 390365 -206705 -31554
17372 -174302 30621 -15915 88798 214360 66523 265205 105317 -88479 421830 181970
17361 446328 260233 -182619 145635 16585 318299 -14479 -113739 28104 129738 -126277
$$ packed form
17439B56429Q1968r1150j11108O3079K04742A81854J9063a2265C02491Q582J89248
17428E00321o7099p8361J35923A94094B5612q255J38037o6035Q4532Q1947J45657
17417D01495j56787J75851J9036n3851o7953J21641n340o9986j65227J69588j65389
17406B03078d617A21271B0979M85691A07103a4650d748j37530C1669O5386g8426
17394B64715A27278K20735o9499J62887a21748A80199p3819N45193B19302D7685
17383B97336n3414J5586a89443C10061E9405b02962H3899L06466b06705c1554
17372a74302C0621a5915H8798J25562F6523J98682A05317h8479D21830A81970
17361D46328j86095a82619A45635A6585L01714a4479r9260B8104J01634a26277
$$ plain form
17350 -60651 -39601 207344 304 230462 139932 382124 100219 63893 152623 176763 153070
17339 153070 82982 21622 340286 78221 110310 -16415 171547 -194625 36355 161291 165380
17328 165380 42302 131761 201219 -71010 171286 92242 177312 87198 198808 157908 44504
17316 177402 247331 34351 292603 103370 700635 413317 200425 224495 276466 -209722
17305 347903 -38117 133023 103870 429607 216401 -118725 2461 176290 274033 313515 -163987
17293 303130 -4841 96501 134622 170215 103053 289149 338317 521745 -310182 208651 3591
17281 62101 16772 298120 -22212 111724 -56253 262849 419835 101639 103729 -128229 112142
17269 122832 37009 123752 311509 387896 -108109 65949 290182 398727 147143 295298
$$ packed form
17350f0651K1050B07344C04K30158r0530K42192A00219l6326Q8730K4140k3693
17339A53070p0088B1622L18664G8221L2089a6415A71547a94625C6355J24936M089
17328A65380D2302Q9459O9458g1010A71286p9044Q5070H7198J11610m0900D4504
17316A77402O9929C4351K58252A03370N97265k87318B00425K4070N1971b09722
17305C47903c8117A33023k9153L25737k13206a18725B461J73829R7743L9482a63987
17293C03130d841I6501L8121L5593o7162J86096M9168J83428c10182B08651C591
17281F2101A6772K81348b2212A11724e6253B62849J56986A01639K090a28229A12142
17269A22832C7009Q6743J87757P6387a08109F5949K24233J08545A47143J48155
$$ plain form
17259 295298 71354 152989 113601 152982 -58518 -30717 319550 189138 86045 105195 209407
17248 209407 141207 248177 73521 236670 64567 438023 254935 380478 246962 295964
17238 295964 331667 420733 -47023 396080 -40490 91067 -13738 561920 332846 -26253 159184
17226 42948 57860 156486 207495 99564 264855 233644 101627 332633 63552 193901 374736
17215 374736 384751 66337 -9022 620930 301344 234794 -23838 -90695 221046 332040 280958
17204 280958 116924 208580 57976 413548 383347 314340 322798 222664 187722 36318 368772
17193 368772 408285 307677 172929 308111 237590 507845 241012 385096 225666 61886
17182 134051 337587 -95977 279702 223406 642707 308269 300552 313450 204940 332096
$$ packed form
17259B95298G1354Q1635l9388L9381e8518K7801C19550j30412H6045J9150J04212
17248B09407o8200J06970G3521J63149F4567L73456j83088J25543j33516M9002
17238B95964L5703Q9066d7023C96080d0490I1067a3738E61920k29074b6253A59184
17226D2948J4912R8626N1009I9564J65291l1211A01627K31006F3552J30349J80835
17215C74736J0015F6337i022F20930C01344o6550b3838o6857B21046J10994n1082
17204B80958A16924R1656E7976L55572l0201o9007Q458j00134l4942C6318L32454
17193C68772L9513j00608j34748J35182p0521K70255B41012J44084j59430F1886
17182A34051K03536i5977B79702n6296M19301C08269p717J2898j08510J27156
$$ plain form
17172 332096 231996 458146 304951 145862 243264 82969 146543 714052 409216 -13955
17161 339842 265387 360580 468425 207687 308968 265153 253502 243821 331384 253539 406556
17150 406556 263021 283139 234658 232308 9130 277778 437057 178852 427663 289073 513222
17139 513222 448815 302052 418108 383903 309300 366481 302747 443414 279720 245934 317423
17128 317423 204935 475323 518475 197012 113707 551543 394579 308011 143654 -119090
17117 478410 465782 225817 64284 491318 319955 362064 68171 683734 313667 370145
17107 370145 431846 496998 469528 669947 440104 297664 377667 766397 300629 388126
17097 388126 384819 182951 481855 133623 554505 218655 531788 538912 511284 277645
$$ packed form
17172C32096j00100K26150j53195A45862R7402H2969O3574N67509l04836a3955
17161C39842p4455R5193J07845B07687J01281m3815j1651r681Q7563p7845J53017
17150D06556j43535K0118m8481k350I130K68648J59279A78852K48811j38590K24149
17139E13222o4407j46763J16056l4205p4603N7181o3734J40667j63694l3786P1489
17128C17423j12488K70388M3152A97012q3305M37836j56964q6568A43654a19090
17117D78410j2628B25817F4284M27034j71363M2109F8171O15563C13667N6478
17107C70145O1701O5152k7470K00419k29843j42440Q0003L88730C00629Q7497
17097C88126l307A82951K98904A33623M20882B18655L13133P124k7628k33639
$$ plain form
17087 277645 466583 446407 413977 116398 491623 621306 424528 565321 505544 237867
17076 262234 315005 415872 469973 539935 621650 842855 578671 400588 430852 264070
17066 264070 424462 568056 350412 360948 541945 267206 357527 803953 507512 678140
17056 678140 528456 505378 496013 256682 651049 301850 432663 519816 964938 566261
17046 566261 179865 406170 864384 779153 477391 750999 902036 631693 618163 614507
17036 614507 707938 328362 303596 709509 519892 741092 507535 811681 766476 897046
17026 897046 570557 731338 670938 459049 683503 557258 705358 696718 678274 620936
17016 620936 705586 664412 598249 700291 1201183 776386 642143 520065 788749 764348
$$ packed form
17087B77645J88938k0176l2430A16398L75225J29683j96778J40793n9777B37867
17076B62234N2771J00867N4101O9962Q1715K21205k64184j78083L0264j66782
17066B64070J60392J43594k17644J0536J80997B67206R0321M46426k96441J70628
17056F78140j49684k3078r365k39331L94367C01850J30813Q7153M45122l98677
17046E66261A79865K26305M58214q5231l01762K73608J51037k70343j3530l656
17036F14507R3431C28362k4766M05913j89617K21200k33557L04146m5205J30570
17026H97046l26489J60781o0400k11889K24454j26245J48100q640j8444n7338
17016F20936Q4650m1174o6163J02042N00892m24797j34243j22078K68684k4401
$$ plain form
17006 764348 520882 504047 324521 847291 765276 807761 957029 1008960 872065 839855
16996 839855 676666 958032 762650 931616 649576 798485 772854 598394 549964 936935
16986 936935 927987 900772 949984 1120379 864269 843519 592475 858745 622823 1163932
16976 1163932 1036716 741028 1059501 917415 988123 716414 1112922 929411 943413 1226624
16966 1226624 877425 790618 1044748 1230250 1133118 958180 843116 891064 1068510 1219607
16956 1219607 1206384 1039329 1158221 1382017 1127951 1069585 1097213 922242 1377117 1280917
16946 1280917 1376500 1103830 951550 1056311 1120611 1149393 1388626 1118998 1551263 1291245
16936 1291245 1338747 1305026 1295152 1470878 1206715 1448851 1364591 1365569 1501129 1311568 1592626
$$ packed form
17006G64348k43466j6835j79526N22770q2015M2485J49268N1931j36895l2210
16996H39855j63189K81366j95382J68966k82040J48909k5631j74460m8430L86971
16986I36935q948k7215M9212J70395k56110k0750k51044K66270k35922N41109
16976A163932j27216k95688L18473j42086P0708k71709L96508j83511J4002K83211
16966A226624l49199q6807K54130J85502r7132j74938j15064M7948J77446J51097
16956A219607j3223j67055J18892K23796k54066n8366K7628j74971M54875r6200
16946A280917R5583k72670j52280J04761O4300K8782K39233k69628M32265k60018
16936A291245M7502l3721r874J75726k64163K42136q4260R78J35560j89561K81058
$$ plain form
16925 1592626 1380952 1657207 1397696 1515256 1223916 1615956 1497251 1758428 1381485
16916 1381485 1970901 1802220 1719147 1757528 1825392 2060076 1730735 1551954 1839653 1546207
16906 1546207 1747687 2130444 1904089 1601625 1972006 1664927 1778758 2104668 1687623
16897 1687623 1689219 2044327 2029718 1829632 2272077 1959774 2078153 2102762 2090877 2017852
16887 2017852 2270549 2306487 2236257 2284635 2024236 2246148 2262108 2468412 2194662 2238009
16877 2238009 2515648 2576697 2849291 2892683 2524092 2391448 3068305 2712515 2864525 2724098
16867 2724098 3043834 2799384 2774565 2869602 3283897 3469407 2953046 3263329 3137983 3417693
16857 3417693 3142517 3329596 3221079 3326239 3191838 3578934 3772349 3709212 3313657 3531844
$$ packed form
16925A592626k11674K76255k59511J17560k91340L92040j18705K61177l76943
16916A381485N89416j68681q3073L8381O7864K34684l29341j78781K87699k93446
16906A546207K01480L82757k26355l02464L70381l07079J13831L25910m17045
16897A687623J596L55108j4609k00086M42445l12303J18379K4609j1885p3025
16887B017852K52697L5938p0230M8378k60399K21912J5960K06304k73750M3347
16877B238009K77639O1049K72594M3392l68591j32644O76857l55790J52010j40427
16867B724098L19736k44450k4819R5037M14295J85510n16361L10283j25346K79710
16857C417693k75176J87079j08517J05160j34401L87096J93415o3137l95555K18187
$$ plain form
16847 3531844 3963887 3790409 3811290 3952400 3809518 4003066 3706569 4091783 4085939 4295799
16837 4295799 4139960 4779689 4587922 4477515 4978039 4486892 4942398 4893145 4815859 5142751
16827 5142751 4924140 5494205 5442984 5330937 5519009 5600081 5753956 5706734 5980965 6140344
16817 6140344 6108428 6366205 6558927 6393432 6657807 6851402 7298585 7124226 7114462 7640462
16807 7640462 7418530 7812507 8202712 8198664 8471499 8643314 8583709 9066802 9200901 9416160
16797 9416160 9616752 9640181 10237790 10335818 10727711 10898033 11116785 11384245 11631106 12146830
16787 12146830 12436126 12743968 13001532 13441256 13750328 14362238 14590564 15202868 15661247
16778 15661247 16113434 16446469 16992571 17750972 18020884 18707972 19502359 20307772 20825982
$$ packed form
16847C531844M32043j73478K0881J41110j42882J93548k96497L85214n844K09860
16837D295799j55839O39729j91767j10407N00524m91147M55506m9253p7286L26892
16827E142751k18611N70065n1221j12047J88072Q1072J53875m7222K74231J59379
16817F140344l1916K57777J92722j65495K64375J93595M47183j74359r764N26000
16807G640462k21932L93977L90205m048K72835J71815n9605M83093J34099K15259
16797I416160K00592K3429N97609R8028L91893J70322K18752K67460K46861N15724
16787A2146830K89296L07842K57564M39724L09072O11910K28326O12304M58379
16778A5661247M52187L33035N46102P58401K69912O87088P94387Q05413N18210
$$ plain form
16769 20825982 21342810 22123196 23254356 24012454 24906205 25727018 26890854 27496305 28869187
16760 28869187 29924418 31457719 32788489 34104945 35317139 36968193 38473099 39966954
16752 39966954 42442387 44354943 46012417 48334144 50417128 53143996 56141855 58686775
16744 58686775 61516085 64957399 68420567 71925974 75581231 79859530 83939779 88313046
16736 88313046 93250572 97996853 103584632 108963081 114425249 120224690 126117986 131694628
16728 131694628 137551598 143227912 148569938 153545424 158489719 162823684 166367156 169160091
16720 169160091 171135279 172650287 172696068 171773507 170472118 167617024 164711271 160687199
16712 160687199 156461377 151213002 145844108 140417384 134324990 128429756 122617343 116824043
$$ packed form
16769B0825982N16828P80386J131160P58098Q93751Q20813J163836O05451J372882
16760B8869187J055231J533301J330770J316456J212194J651054J504906J493855
16752C9966954K475433J912556J657474K321727K082984K726868K997859K544920
16744E8686775K829310L441314L463168L505407L655257M278299M080249M373267
16736H8313046M937526M746281N587779N378449N462168N799441N893296N576642
16728A31694628N856970N676314N342026M975486M944295M333965L543472K792935
16720A69160091J975188J515008M5781r22561j301389k855094k905753m024072
16712A60687199m225822n248375n368894n426724o092394n895234n812413n793300
$$ plain form
16704 116824043 110972028 105487224 99681860 94489681 89594608 85199041 80597099 76658499
16696 76658499 72404124 68678759 65328986 62255608 58813502 55711153 53216691 50703577
16688 50703577 48240524 45798449 43761798 42105786 40059100 38221906 36535638 34729690
16680 34729690 33501135 32094876 30684924 29667581 28655289 27375573 26595182 25279522
16672 25279522 24479030 23411592 22929700 21611728 20908151 20352212 19718559 18813088 18373099
16663 18373099 17903285 16928415 16320330 16280407 15742452 15143005 14582980 14344518 13683613
16654 13683613 13222127 13191893 12914745 12289497 11864978 11432835 10996622 10740727 10944296
16645 10944296 10747382 10271894 9778102 9390349 9330165 8702114 9034289 8554892 8499974 8615333
$$ packed form
16704A16824043n852015n484804n805364n192179m895073m395567m601942l938600
16696G6658499m254375l725365l349773l073378l442106l102349k494462k513114
16688E0703577k463053k442075k036651j656012k046686j837194j686268j805948
16680C4729690j228555j406259j409952j017343j012292j279716p80391j315660
16672B5279522q00492j067438m81892j317972p03577n55939o33653r05471m39989
16663A8373099m69814r74870o08085l9923n37955n99447n60025k38462o60905
16654A3683613m61486l0234k77148o25248m24519m32143m36213k55895K03569
16645A0944296j96914m75488m93792l87753o0184o28051L32175m79397n4918J15359
$$ plain form
16635 8615333 8254661 7631017 7454501 7667789 7466136 7059679 6833238 7190304 6599995
16626 6599995 6589026 6350540 6160586 5879834 5865888 5827576 5836464 5535984 5311154 5485029
16616 5485029 5097497 5097923 5484185 4956330 5094201 4970411 4661850 5020105 4766527 4726787
16606 4726787 4526818 4147812 4445957 4063822 4155949 4099861 3808223 3777138 4206619 3731132
16596 3731132 3567707 3767042 3810347 3694425 3303222 3407194 3494999 3370370 3500183 3301286
16586 3301286 3089757 2986931 3320086 3040441 2757275 3190370 2779200 2651006 2738341 2665609
16576 2665609 2527226 2604547 2631349 2667139 2472259 2485144 2491985 2543925 2252989 2268579 2132069
16565 2132069 2463688 2262868 2099355 2076852 2130337 2136418 2251248 2132653 2164964 2008419
$$ packed form
16635H615333l60672o23644j76516K13288k01653m06457k26441L57066n90309
16626F599995j0969k38486j89954k80752j3946l8312Q888l00480k24830J73875
16616E485029l87532M26L86262n27855J37871j23790l08561L58255k53578l9740
16606D726787j99969l79006K98145l82135R2127n6088k91638l1085M29481m75487
16596C731132j63425J99335M3305j15922l91203J03972Q7805j24629J29813j98897
16586C301286k11529j02826L33155k79645k83166M33095m11170j28194Q7335p2732
16576B665609j38383P7321K6802L5790j94880J2885O841N1940k90936J5590j36510
16565B132069L31619k00820j63513k2503N3485O081J14830j18595L2311j56545
$$ plain form
16555 2008419 2285252 2097271 2000225 2137209 1851484 1972725 1563645 1970267 1794367 2135459
16545 2135459 2017083 1611755 1620612 1773873 1690326 1856913 2012068 1796865 1416255 1312384
16535 1312384 1727130 1547748 1719696 1588122 1478118 1502979 1680706 1476791 1899924 1462726
16525 1462726 1483645 1537276 1352692 1499445 1353398 1535399 1468969 1319787 892100 1462551
16515 1462551 1364532 983445 1297176 960828 1102268 1089710 975822 1063503 1167992 1154391
16505 1154391 1203645 1235806 1034710 1019043 1105035 873819 875257 1064544 814636 1104713
16495 1104713 804942 1088933 1289644 1216324 887201 1121165 1065204 1148196 938480 1015895
16485 1015895 806274 1064211 1080766 1044319 976634 971477 616637 830878 1124539 1085667
$$ packed form
16555B008419K76833j87981r7046J36984k85725J21241m09080M06622j75900L41092
16545B135459j18376m05328Q857J53261q3547J66587J55155k15203l80610j03871
16535A312384M14746j79382J71948j31574j10004K4861J77727k03915M23133m37198
16525A462726K0919N3631j84584J46753j46047J82001o6430j49182m27687N70451
16515A462551r8019l81087L13731l36348J41440j2558j13888Q7681J04489j3601
16505A154391M9254L2161k01096j5667Q5992k31216J438J89287k49908K90077
16495A104713k99771K83991K00711p3320l29123K33964n5961Q2992k09716P7415
16485A015895k09621K57937J6555l6447o7685n157l54840K14241K93661l8872
$$ plain form
16475 1085667 900625 909474 836972 1114923 505798 802495 780519 677500 622966 691259
16465 691259 1135389 935108 854628 739061 744073 736153 693449 807832 731302 677364 604364
16454 604364 427457 514606 793001 382568 535539 775090 725139 480647 472669 272640
16444 272640 595457 330809 607603 790110 640811 676934 483584 652018 668105 707979
16434 707979 911697 369069 758065 439351 579602 381109 528681 516410 621423 355634
16424 355634 710415 738839 862951 387045 927530 600597 453247 476112 398231 695663
16414 695663 337546 422509 332362 596065 573747 421765 520726 530274 345859 685202 572934
16403 572934 528226 707505 643808 639262 582898 805911 183837 265162 571787 555355 476877
$$ packed form
16475A085667j85042Q849p2502K77951E05798K96697k1976j03019n4534O8293
16465F91259M44130k00281q0480j15567N012p920m2704J14383p6530n3938p3000
16454F04364j76907Q7149K78395C82568J52971K39551m9951k44492p978k00029
16444B72640L22817k64648K76794J82507j49299L6123j93350J68434J6087L9874
16434G07979K03718C69069L88996l18714J40251j98493J47572j2271J05013k65789
16424C55634L54781K8424J24112C87045N40485l26933j47350K2865p7881K97432
16414F95663C37546Q4963r0147K63703k2318j51982R8961R548j84415L39343j12268
16403E72934m4708J79279o3697m546n6364K23013A83837Q1325L06625j6432p8478
$$ plain form
16392 476877 340536 432344 384476 566054 140249 522104 474102 547638 689789 466136
16382 466136 480095 306842 210018 494899 284001 470941 291799 200038 72744 450501
16372 450501 671649 476562 364510 180693 582067 312589 356699 208818 322069 353673
16362 353673 202567 178350 440676 155627 644380 161763 233602 177546 171372 305783
16352 305783 355463 192476 316980 542883 168216 128376 301568 155264 361231 434839
16342 434839 312134 266356 198706 360215 470279 417597 367470 195590 264857 277018 385702
16331 385702 365108 186308 284691 110218 461187 46415 395176 411578 211154 285819
16321 285819 337437 290943 97203 244188 70509 137962 237394 488804 -39405 115935 128218
$$ packed form
16392D76877j36341R1808m7868J81578A40249L81855m8002P3536J42151k23653
16382D66136J3959j73253r6824K84881k10898J86940j79142r1761G2744L77757
16372D50501K21148j95087j12052A80693M01374k69478M4110j47881J13251L1604
16362C53673j51106k4217K62326A55627M88753A61763P1839n6056o174J34411
16352C05783M9680j62987J24504K25903A68216l9840J73192j46304K05967P3608
16342D34839j22705m5778o7650J61509J10064n2682n0127j71880O9267J2161J08684
16331C85702k0594j78800R8383A10218L50969D6415L48761J6402k00424P4665
16321B85819N1618m6494I7203J46985G0509O7453R9432K51410c9405A15935J2283
$$ plain form
16310 128218 53516 352228 167768 14100 349128 393861 296964 -52888 371689 209016
16300 209016 373670 139741 -9827 273491 339903 106284 329028 110351 172298 78278
16289 246887 92720 291233 -13812 143278 330605 51482 -98898 104721 -63248 66376 41966
16278 41966 97463 41097 127933 -267568 68182 13373 119516 221944 140862 403095 211357
16267 211357 261800 359016 23534 -48971 -43920 185605 232074 164975 101016 401658 109884
16255 -113254 181966 54772 -77243 313165 -19623 -153702 269664 121773 -176108 27212
16244 -77158 -277490 389200 150243 116439 110295 182874 199520 431731 -10780 32006 -77201
16232 88445 167364 325906 182896 181481 -25908 -215037 -3147 75369 254152 -87849 267428
$$ packed form
16310A28218E3516K98712A67768A4100L35028M4733r6897e2888C71689j62673
16300B09016J64654A39741i827B73491O6412A06284K22744A10351O1947G8278
16289B46887I2720J98513a3812A43278J87327E1482i8898A04721f3248F6376k4410
16278D1966N5497D1097Q6836b67568F8182A3373J06143J02428q1082K62233j91738
16267B11357N0443R7216B3534d8971N051A85605M6469o7099o3959L00642A09884
16255a13254A81966E4772g7243C13165a9623j34079B69664A21773a76108B7212
16244g7158k00332C89200A50243l3804o144P2579J6646K32211a0780C2006g7201
16232H8445P8919J58542j43010j415b5908j89129c147G5369J78783h7849B67428
$$ plain form
16220 303646 188268 -262037 -38725 187076 188857 118473 140360 350181 217774 198407 100145
16209 100145 192316 -4895 137788 117604 143010 4615 171721 175549 -38269 99377 -23134 -61338
16197 -61338 177457 150620 216828 179534 -10217 222340 14570 164248 -17673 -183243 222848
16185 -69610 196361 257716 52457 234970 -2438 -71295 105794 98934 336211 125201 121241
16174 121241 70938 62154 20350 146513 242148 222413 163199 157090 -15451 131789 88986
16163 88986 212467 -198195 166701 -116985 146330 160223 -39491 23198 -13156 -128957
16153 -128957 -144783 302914 276337 60683 73980 312590 214909 352527 -99719 210739 -31656
16141 -106322 317929 31886 130834 283844 -47663 255864 298478 -201230 132688 -20339
$$ packed form
16220C03646j15378b62037c8725A87076J781p0384K1887K09821j32407j9367r8262
16209A00145R2171d895A37788k0184K5406D615J67106L828c8269I9377b3134l8204
16197f1338A77457k6837O6208l7294a0217B22340A4570J49678a7673j65570B22848
16185f9610A96361O1355E2457J82513b438o8857A05794o860K37277A25201l960
16174A21241n0303q784B0350J26163R5635j9735n9214o109a5451A31789m2803
16163H8986J23481a98195A66701a16985A46330J3893c9491B3198a3156j15801
16153a28957j5826C02914k6577F0683J3297K38610r7681J37618i9719B10739c1656
16141a06322C17929C1886R8948J53010d7663B55864M2614b01230A32688b0339
$$ plain form
16130 -79780 326640 -227427 10493 -168174 223894 -135382 -173184 261396 592284 -172835
16119 -46218 314477 -67488 -53482 125721 -3736 356833 282113 28256 172751 238275 80206
16107 -140934 810 -64650 3550 36431 123859 -145450 52712 -228354 42889 172829 80839
16095 221359 29999 323157 -160068 -106954 212729 -256662 -17973 -95331 -372878 308152
16084 -115194 58304 -5832 -371936 -35508 311257 160936 -97988 416088 -16628 -111920 -208310
16073 -208310 -166835 107800 -143375 -94896 128090 -126487 -147645 -271304 -276638 -164924
16063 -164924 316545 155407 -194046 -280821 -252180 -149267 -104213 -125371 140488 -141650
16052 -24577 200680 60380 -98167 100014 -88651 228485 -87666 279843 -167410 297424
$$ packed form
16130g9780C26640b27427A0493a68174B23894a35382l7802B61396L30888a72835
16119d6218C14477f7488J4006A25721c736C56833p4720B8256J44495O5524H0206
16107a40934H10f4650C550L2881Q7428a45450E2712b28354D2889J29940H0839
16095B21359B9999K93158a60068N3114B12729b56662a7973p7358k77547C08152
16084a15194E8304e832l66104c5508C11257j50321i7988D16088a6628r5292r6390
16073b08310M1475A07800a43375M8479A28090a26487k1158j23659n334J11714
16063a64924C16545A55407a94046q6775K8641J02913M5054k1158A40488a41650
16052b4577B00680F0380i8167A00014h8651B28485h7666B79843a67410B97424
$$ plain form
16041 185290 -82483 -222538 90602 -234463 -36229 47117 348388 21679 -197514 -39531 267282
16029 17160 135707 29785 151444 109014 127923 -4294 63214 35202 -26935 27904 46719
16018 46719 -245093 55670 -104476 -287915 -363510 -106472 -140713 -24174 -226124 69257 -87570
16006 -64846 240102 -222748 37272 -44550 -206838 -117177 -381385 -163762 -22876 -233007
15996 -233007 -204982 38656 181085 -541046 -178795 63754 -83427 -221461 -402142 -24178
15985 84888 -143911 231000 130916 248845 195374 82450 360678 252893 219626 -126415
15974 -63152 186401 -137472 219059 199312 44430 -103378 168625 328588 -269662 -25556
15963 -142650 -29173 145662 283914 -217446 77992 -291123 -99345 308543 -58079 -372517
$$ packed form
16041A85290h2483j40055I0602b34463c6229D7117L01271B1679a97514c9531B67282
16029A7160J18547B9785J21659m2430J8909d294F3214k8012b6935B7904J8815
16018D6719b45093E5670a04476j83439p5595a06472l4241b4174k01950F9257h7570
16006f4846B40102b22748C7272d4550j62288Q9661k64208a63762b2876k10131
15996b33007K8025C8656J42429e41046a78795F3754h3427j38034j80681b4178
15985H4888a43911B31000j00084J17929n3471H2450K78228j07785l3267a26415
15974f3152A86401a37472B19059j9747D4430a03378A68625J59963b69662b5556
15963a42650b9173A45662J38252b17446G7992b91123i9345C08543e8079l14438
$$ plain form
15953 -372517 -65854 29261 349618 -13996 58535 272521 302519 -60761 -27395 -230644 -379585
15942 -379585 23690 121489 -308419 -42075 -256191 -166422 -57759 -188103 38155 49282 -125468
15930 581070 87942 -42576 99582 68097 180622 14726 -8591 -128972 -116852 -85481 183922
15918 207959 136055 43411 -111166 -247559 -305889 -89128 103969 151669 -327132 156105
15907 -243295 11340 16504 226114 254107 190269 298396 -4429 -26593 -156236 -4798 -25260
15896 -25260 -344961 34071 347305 210501 145695 -65293 94589 360007 -96130 20022 -82665
15884 164821 184245 44996 -36072 -139328 36132 -260281 137820 -179123 -332340 -84763
15873 -80577 53623 -112454 -6030 -117074 67123 -147269 148134 -72793 -25425 427197 -144019
$$ packed form
15953c72517f5854B9261L20357a3996E8535K13986K9998f0761b7395k03249j48941
15942c79585B3690R7799c08419d2075k14116Q9769e7759j30344C8155J1127a25468
15930E81070H7942d2576I9582l1485J12525A4726h591j20381J2120L1371A83922
15918B07959p1904D3411a11166j36393n8330h9128A03969M7700c27132A56105
15907b43295A1340N164K09610K7993o3838J08127d429k2164j29643d798k0462
15896b5260l19701C4071L13234j36804o4806f5293I4589K65418i6130B0022h2665
15884A64821J9424D4996c6072j03256C6132b60281A37820a79123j53217h4763
15873h0577E3623a12454f030j11044F7123a47269A48134g2793b5425D27197a44019
$$ plain form
15861 -22853 -421651 -118795 -8411 -159945 341437 -149816 -218541 -124925 35449 -212706 -188404
15850 -188404 255847 -308869 -79006 150888 103299 296737 -136952 -188591 18552 54166
15840 54166 -242509 -207353 38669 125996 153148 -208916 -161855 152991 54566 -254622 -603
15828 -56158 32778 51058 70525 -47199 -355193 193539 -172928 -61184 -257223 -202938 15658
15816 95397 -14828 -217926 -254020 38201 178665 81793 58721 218453 16177 -438427 103062
15804 -528424 20771 -145469 227282 188927 238218 -108726 -234235 137206 153998 160705 -72588
15792 -98443 5710 416253 1147 71440 -133156 -73874 -101243 -327976 117000 -211064 -161193
15781 -161193 -70332 1676 -301210 180522 -204546 -92884 153721 -189067 247995 -299591
$$ packed form
15861b2853l98798a18795h411j51534C41437a49816o8725R3616C5449b12706K4302
15850a88404B55847c08869g9006A50888m7589J93438a36952n1639A8552L5614
15840E4166b42509L5156C8669Q7327K7152b08916M7061A52991E4566b54622f03
15828e6158C2778J8280J9467d7199l07994A93539a72928f1184j96039N4285A5658
15816I5397a4828k03098l6094C8201J40464H1793k3072J59732A6177d38427A03062
15804e28424B0771a45469B27282l8355M9291a08726j25509A37206J6792O707g2588
15792i8443E710M10543A147P0293a33156N9282k7369k26733A17000b11064M9871
15781a61193g0332A676c01210A80522b04546i2884A53721a89067B47995b99591
$$ plain form
15770 93707 -263707 8822 -220863 -94360 91527 -247712 -107800 -229503 -149359 -34700 241236
15758 145861 18768 -160746 324641 113956 228928 -140448 55398 -467425 -5692 150048
15747 186113 -16124 173554 -151319 175211 462914 422697 137119 267814 -73742 -209210
15737 -209210 -196182 -251926 16152 -158685 -48907 114419 -38745 33631 -73169 -281281 140097
15725 -145279 -318824 22754 -70625 -145849 111411 -45245 -83070 -163634 -37585 60263 -68385
15713 -66782 -182688 -50863 233873 33886 -274187 -43454 -25523 34736 184312 -161061 129866
15701 -100673 -236069 -76584 41351 35052 -114581 -227755 130397 -244135 -27163 -104146 -80514
15690 -80514 -46454 222408 85202 192432 -70122 -76301 -21623 60587 49055 27298 -386323
$$ packed form
15770I3707b63707H822b20863i4360I1527b47712a07800j21703Q0144c4700B41236
15758A45861A8768a60746C24641A13956J14972a40448E5398d67425e692A50048
15747A86113a6124A73554a51319A75211K87703m0217A37119J30695g3742j35468
15737b09210J3028n5744A6152a58685d8907A14419c8745C3631g3169k08112A40097
15725a45279j73545B2754g0625p5224A11411d5245l7825q0564c7585F0263f8385
15713f6782j15906e0863B33873C3886b74187d3454J7931C4736J49576a61061A29866
15701a00673j35396g6584D1351o299a14581j13174A30397b44135b7163p6983K3632
15690h0514L4060B22408H5202J07230g0122o179b1623F0587j1532k1757c86323
$$ plain form
15678 -226957 30509 -104680 -250535 53324 53065 -100035 -23493 -168103 -174730 -164989 -4430 -9199
15666 -9199 302079 135633 36464 7743 56976 -380149 -383333 27697 44346 -240680 -118920
15654 77487 -83652 13028 -75094 168586 -70021 176817 -25254 -475778 -53088 236793 62397
15642 -36443 -137239 -108575 -45359 -194929 64672 291770 -284004 -52264 -35389 -120222 63830
15630 -497872 283676 91100 74532 -268108 26274 282605 29681 34397 -224118 50412 -93133
15618 291847 -202951 -53593 169367 87746 107786 221701 -15236 47190 -352628 117588
15607 -100014 -101071 -25244 -87054 -36155 -414413 74109 -44115 -262565 127549 31403 -127237
15595 -51274 -191607 264528 244581 -34154 -24107 -349234 130170 294717 196628 81930 124489
$$ packed form
15678b26957C0509a04680j45855E3324k59a00035b3493j44610o627R741d430m769
15666i199C02079A35633C6464G743M9233c80149l184B7697J6649b40680a18920
15654G7487h3652A3028g5094A68586g0021A76817b5254m50524e3088B36793F2397
15642c6443j00796K8664d5359j49570F4672K27098b84004e2264J6875q4833F3830
15630d97872B83676I1100j6568b68108B6274K56331B9681M716b24118E0412i3133
15618B91847b02951e3593A69367q1621K0040J13915a5236D7190c52628A17588
15607a00014j057b5244o1810c6155l78258G4109d4115k18450A27549C1403a27237
15595e1274j40333B64528j9947c4154J0047l25127A30170J64547r8089H1930M2559
$$ plain form
15584 124489 -75664 20916 -283159 12217 56613 -119988 -14254 -11110 180145 122283 -18062
15572 -100412 153709 345 129903 -141132 301489 -146484 -342384 -97196 26368 63319 -131645
15560 26807 150700 -33568 135512 50672 -306220 94588 -42753 -63522 -179639 -317989 75797
15548 -140981 -57707 283000 -177056 -1613 -15656 21842 -78784 4266 -42099 74515 10930
15536 -46262 -309253 -96015 -222907 -119451 68883 -208803 114432 52575 8610 -88012 -156654
15525 -156654 7641 109170 -110366 -9049 -155470 48173 10270 -10828 -163087 17637 -141861
15513 76056 230397 46470 -226757 -102276 94246 -172842 301486 -143511 -48196 41311
15502 -159688 -244962 57563 59468 15556 -333651 -129989 317094 -151324 200278 88480 26894
$$ packed form
15584A24489g5664B0916b83159A2217M4396a19988a4254L144A80145n7862a8062
15572a00412A53709C45J29558a41132C01489a46484j95900i7196B6368L6951a31645
15560B6807J23893c3568A35512E0672c06220I4588d2753k0769j16117j38350G5797
15548a40981e7707B83000a77056a613j4043B1842g8784D266d2099G4515A0930
15536d6262k62991i6015j26892J03456F8883b08803A14432E2575H610h8012o8642
15525a56654G641J01529a10366i049j46421D8173A0270a0828j52259A7637a41861
15513G6056J54341D6470b26757a02276I4246a72842C01486a43511d8196D1311
15502a59688q5274E7563J905A5556c33651a29989C17094a51324B00278H8480B6894
$$ plain form
15490 -77511 75895 -337429 301853 -193790 -195901 14609 90805 25714 -139346 -194531 203938
15478 -128730 532179 142988 57658 14985 140607 -107576 435141 -54297 -69344 -61066 245163
15466 56708 259207 42255 -193216 49716 -187569 699 -127704 -121635 -251476 334602 -212656
15454 72997 106937 144559 37709 26084 -28069 5294 -34049 131941 -192420 154497 175670
15443 175670 -49056 60557 259379 -89329 -219481 193191 -1679 115795 155449 -17111 -79863
15432 -79863 127886 55737 266634 -305781 365191 -134152 -61422 -33540 -173455 248165
15421 -82389 119809 247006 8978 -64427 105832 38874 68959 -276456 248153 -22391 -98604
15410 -98604 -157919 16558 5758 -66097 -178255 208313 145724 122434 -134611 -183638 -57068
$$ packed form
15490g7511G5895c37429C01853a93790k111A4609P6196B5714a39346n5185B03938
15478a28730E32179A42988E7658A4985J25622a07576D35141e4297j5047Q278B45163
15466E6708K02499D2255a93216D9716a87569F99a27704O069j29841C34602b12656
15454G2997L3940L7622C7709j1625b8069E294c4049A31941a92420A54497K1173
15443A75670d9056F0557J98822h9329j30152A93191a679A15795L9654a7111o2752
15432g9863A27886E5737K10897c05781C65191a34152f1422K7882j39915B48165
15421h2389A19809J27197H978f4427A05832C8874L0085b76456B48153b2391p6213
15410i8604n9315A6558E758f6097j12158B08313o2589k3290a34611m9027e7068
$$ plain form
15398 -146141 -208267 223896 50579 -119407 119963 330560 78909 -109683 -36062 -160220
15388 -160220 -1685 -181600 -71247 -52244 -75100 228213 -248169 202527 22359 168720 173460
15377 173460 141108 96792 -164226 101903 7527 56020 -173421 48585 341512 253630 -166834
15365 -46626 11142 99797 22533 -72408 -437267 291237 -171194 -83193 22710 -106612 134159
15353 -1918 135204 283278 113482 32527 115839 65020 -23028 -185571 -221396 -292649 -260041
15342 -260041 -114623 157704 -601400 137464 -322193 247272 131900 -76831 15472 -101778
15331 49541 113324 180407 -85781 -86629 -101377 -4683 240671 147507 -384882 -267540 -130758
15319 -138787 -393147 437112 119056 -76190 219875 -16396 -189757 -172835 -350747 -203665
$$ packed form
15398a46141o2126B23896E0579a19407A19963K10597G8909a09683c6062j24158
15388a60220a685j79915g1247J9003k2856B28213b48169B02527B2359J46361M740
15377A73460l2352m4316a64226A01903G527M8493a73421D8585K92927q7882a66834
15365d6626A1142Q8655B2533g2408l64859B91237a71194h3193B2710a06612A34159
15353a918A35204J48074A13482C2527Q3312n0819b3028j62543l5825p1253L2608
15342b60041a14623A57704f01400A37464c22193B47272j15372g6831A5472a01778
15331D9541O3783O7083h5781q48j4748d683B40671r3164c84882J17342a30758
15319a38787k54360D37112A19056g6190B19875a6396j73361J6922j77912J47082
$$ plain form
15309 -203665 17333 -81042 -72347 238103 35541 72894 268475 -122459 153439 100653 345
15297 95644 68382 -116872 151098 198030 200479 11577 193616 238053 -8686 -212720 -354673
15286 -354673 239090 -106487 12643 -165999 -457012 43920 26484 -50818 89876 -97421 -132214
15275 -132214 -99927 165001 12569 221973 147620 30985 -205854 -30030 -31524 137360 39150
15263 310568 -239632 19401 250473 287538 323017 131023 268880 -16753 -201137 -137304
15253 -137304 179128 81384 220640 349398 885052 1175575 1061522 1289409 887141 347197
15242 261929 -194882 2007 112374 259720 338465 49408 205528 116815 -38006 141939 -100758
15230 101420 -104424 139194 -113548 -242171 -242943 108907 -140773 -104527 -15349 168815
$$ packed form
15309b03665A7333h1042Q695B38103C5541L7353J95581a22459A53439n2786C45
15297I5644k7262a16872A51098M6932K449A1577J82039M4437h686k04034j41953
15286c54673B39090a06487A2643a65999k91013D3920j7436e0818H9876i7421l4793
15275a32214L2287A65001A2569K09404p4353C0985b05854c0030j494A37360C9150
15263C10568b39632A9401K31072L7065L5479A31023J37857a6753j84384O3833
15253a37304A79128H1384J39256J28758N35654K90523j14053K27887m02268C47197
15242B61929a94882B007J10367J47346P8745D9408J56120q8713c8006A41939a00758
15230A01420a04424A39194a13548j28623p72A08907a40773L6246a5349A68815
$$ plain form
15219 203082 -123912 32469 -129681 27421 1046 -36173 8384 -11150 233070 -347270 53621
15207 129600 -152577 134506 34112 118066 -14985 167730 64957 -68585 196697 306722
15197 306722 -310171 34038 252741 117099 124102 -119713 418650 13039 -176251 164445
15186 -122019 158211 372040 30964 237843 191258 -133080 131178 366280 -79161 325923
15175 70090 151092 -130710 226690 -109714 125192 224380 69907 238411 360729 -226317
15164 -93007 206461 183111 59487 352221 17281 -176679 266990 262000 -49871 93880 259857
15153 259857 -354006 211920 356742 123323 113653 -12681 48884 -346075 101104 255062
15143 255062 117939 286708 41061 104713 179733 239385 206407 124251 -138622 120323 -297221
$$ packed form
15219B03082a23912C2469a29681B7421A046c6173H384a1150B33070c47270E3621
15207A29600a52577A34506C4112Q3954a4985A67730F4957f8585A96697J10025
15197C06722c10171C4038K18703A17099P003a19713D18650A3039a76251A64445
15186a22019A58211K13829C0964K06879m6585a33080A31178K35102g9161C25923
15175G0090Q1002a30710B26690a09714A25192R9188F9907J68504J22318b26317
15164i3007B06461k3350E9487K92734A7281a76679B66990m990d9871I3880J65977
15153B59857c54006B11920J44822A23323r670a2681D8884c46075A01104J53958
15143B55062A17939J68769D1061O3652P5020N9652l2978q2156a38622A20323b97221
$$ plain form
15131 535802 120670 240350 -38032 178309 -66590 -8367 230919 141884 176264 -89148 250928
15119 402099 98336 151837 395223 69715 212958 -84145 -129367 266088 -94759 220955 207256
15108 207256 -111424 17482 202754 -24058 -2632 -83638 122108 260622 207722 32177 321306
15097 321306 -38091 -65870 91052 118274 108733 45101 -12374 -69282 69588 -33255 -15480 206178
15084 419344 318987 196422 147345 -61303 -298926 97095 95748 311946 430430 135723
15073 196121 209718 370880 295156 203124 491099 -111426 158338 18139 155025 110685
15063 110685 -82510 416049 -202302 139269 188994 196284 532659 220122 136185 134325 167550
15052 167550 491207 346976 212743 44158 150338 182486 154482 -52057 -22423 341189
$$ packed form
15131E35802A20670J19680c8032A78309f6590h367B30919q9035L4380h9148B50928
15119D02099I8336N3501K43386F9715J43243h4145m5222B66088i4759B20955j3699
15108B07256a11424A7482J85272b4058b632q1006A22108J38514n2900C2177K89129
15097C21306c8091k7779I1052K7222r541D5101a2374n6908F9588c3255a5480B06178
15084D19344j00357j22565m9077f1303k37623I7095j347K16198J18484A35723
15073A96121J3597J61162p5724r2032K87975a11426A58338A8139J36886m4340
15063A10685h2510D16049b02302A39269M9725P290L36375B20122q3937j860L3225
15052A67550L23657j44231j34233D4158J06180L2148k8004e2057b2423C41189
$$ plain form
15041 324649 262577 121725 -55333 -143852 136265 153873 139156 37679 8472 -172505 -106366
15030 -106366 297027 286914 110222 -11938 237408 17585 151816 206554 272449 -119764
15019 325343 369001 126407 214594 3144 101064 298701 71860 21566 72008 376509 113550
15007 91603 73210 456661 232636 280269 -129048 -128942 525686 491439 241083 274155 62567
14995 272610 365898 265855 392017 -177910 181067 119704 102126 327138 256414 154797
14985 154797 489560 -225399 532965 562942 235206 115421 80670 411170 325353 112658
14974 191350 213147 407668 274527 312035 146003 119818 297827 169803 229513 137510
14964 137510 148206 -59125 158530 366980 190896 140784 689019 -38955 392832 704109
$$ packed form
15041C24649o2072A21725e5333q8519A36265J7608j4717C7679H472a72505O6139
15030a06366B97027j0113A10222a1938B37408A7585J34231N4738O5895a19764
15019C25343M3658A26407Q8187C144R7920J97637G1860B1566N0442L04501A13550
15007I1603j8393L83451k24025M7633a29048J06E25686l4247B41083L3072F2567
14995B72610R3288j00043J26162a77910A81067o1363j7578K25012p0724j01617
14985A54797L34763b25399E32965K9977B35206A15421l4751L30500q5817A12658
14974A91350K1797J94521j33141L7508A46003k6185J78009j28024N9710r2003
14964A37510J0696e9125A58530K08450j76084n0112N48235c8955C92832L11277
$$ plain form
14954 704109 -186209 119633 151104 187544 268967 212833 387592 374781 2438 369761 143305
14942 383707 346881 194220 28988 421343 280942 272541 359103 238629 482468 404949 175022
14930 241033 125035 187089 295131 442050 453662 499934 382136 262908 848 362138 288080
14919 288080 -55191 274106 70487 182154 159292 573516 285636 -111289 195641 138458
14909 138458 584966 57160 299691 578037 394769 544215 46931 198372 351274 513736
14899 513736 138569 562568 504481 505699 -102589 123600 277156 152353 328890 294401
14889 294401 97583 324414 258115 287201 377317 450795 220749 144621 420754 279432 193461
14878 193461 242047 522833 534108 206370 628842 413492 49252 243013 311004 188808
$$ packed form
14954G04109a86209A19633L1471L6440Q1423n6134J74759j2811B438L67323A43305
14942C83707l6826j52661B8988L92355j40401q401Q6562j20474K43839p7519A75022
14930B41033j15998O2054J08042J46919J1612M6272j17798j19228H48L61290p4058
14919B88080e5191B74106G0487J11667k2862M14224B85636a11289A95641n7183
14909A38458M46508E7160K42531K78346j83268J49446D6931J51441J52902J62462
14899E13736A38569M23999n8087J218a02589A23600J53556j24803J76537l4489
14889B94401I7583K26831o6299K9086R0116P3478B20749p6128K76133j41322q5971
14878A93461M8586K80786J1275B06370M22472k15350D9252J93761O7991j22196
$$ plain form
14868 188808 133892 100619 345473 459061 786270 123748 50191 412437 341953 597336
14858 597336 191896 427909 427027 130244 590441 306384 730201 446227 214833 511026
14848 511026 180308 645236 269589 115313 438428 563606 279635 431732 505698 279346
14838 279346 207294 321249 577204 796480 696260 361721 420435 549767 860755 714710
14828 714710 316550 451305 583294 511755 555598 532743 309738 494099 297437 761121
14818 761121 -60329 522961 713461 471082 353682 636062 575004 338851 773885 937882
14808 937882 592109 538073 298662 481031 585064 692157 287173 565872 210477 418610
14798 418610 390274 195947 383598 378409 447915 602059 586902 515900 538167 559677 574297
$$ packed form
14868A88808n4916l3273K44854J13588L27209A23748E0191L62246p0484K55383
14858E97336A91896K36013q82A30244M60197k84057M23817k83974B14833K96193
14848E11026A80308M64928B69589A15313L23115J25178B79635J52097P3966k26352
14838B79346p2052J13955K55955K19276j00220l34539N8714J29332L10988j46045
14828G14710C16550J34755J31989p1539M3843k2855k23005J84361j96662M63684
14818G61121f0329E22961J90500k42379j17400K82380o1058k36153M35034J63997
14808I37882l45773n4036k39411J82369J04033J07093B87173K78699B10477K08133
14798D18610k8336j94327J87651n189O9506J54144j5157p1002K2267K1510J4620
$$ plain form
14787 574297 531185 476517 659748 538569 572356 459180 695486 444053 671538 851932
14777 851932 454330 695984 567435 497073 552552 539803 706456 660920 461048 873339
14767 873339 993408 727460 447079 441962 765493 819046 548335 792388 505021 563225
14757 563225 574693 703115 456533 754858 386452 585162 768020 792741 553459 502134
14747 502134 539035 460833 762623 580942 741601 553104 599490 454511 690874 683156
14737 683156 708183 847244 886144 525495 817549 648131 682318 627808 818872 521480
14727 521480 762696 578819 816142 788913 908376 598793 621081 1031051 892814 720378
14717 720378 847815 1105715 879409 837359 751102 938725 924986 1108897 693546 811880
$$ packed form
14787E74297m3112n4668J83231j21179L3787j13176K36306k51433K27485J80394
14777H51932l97602K41654j28549p0362N5479j2749J66653m5536j99872M12291
14767H73339J20069k65948k80381n117L23531N3553k70711K44053k87367N8204
14757E63225J1468J28422k46582K98325l68406J98710J82858K4721k39282n1325
14747E02134L6901p8202L01790j81681J60659j88497M6386j44979K36363p718
14737F83156K5027J39061L8900l60649K92054j69418L4187n4510J91064k97392
14727E21480K41216j83877K37323k7229J19463l09583K2288M09970j38237j72436
14717G20378J27437K57900k26306m2050q6257J87623j3739J83911m15351J18334
$$ plain form
14707 811880 629198 1070827 488434 804736 659228 991752 613524 943586 776570 869977
14697 869977 920129 719439 913550 1007079 1083467 818594 485103 1070821 1040064 912696
14687 912696 1058076 971228 783513 890547 959886 1095397 1144679 805788 881288 939181
14677 939181 851196 871383 532195 903505 963278 866001 910442 1042755 1084838 1104016 1000640
14666 1000640 800360 819213 1299454 1200140 984215 1092301 1414286 1089235 946289 1104713
14656 1104713 969673 1175267 1430887 862800 942677 1298617 939722 1204208 803417 1069879
14646 1069879 1163956 1436439 1112869 1693357 1106476 1045229 1332382 1192682 1456730 1323361
14636 1323361 1332109 1315388 1504692 890434 935395 1447407 1209218 1004714 1098462 1264606
$$ packed form
14707H11880j82682M41629D88434L16302j45508L32524l78228L30062j67016R3407
14697H69977N0152k00690J94111R3529P6388k64873l33491N85718l0757j27368
14687I12696J45380q6848j87715J07034O9339J35511M9282l38891P5500N7893
14677I39181q7985K0187l39188L71310N9773r7277M4441J32313M2083J9178j03376
14666A000640k00280J8853M80241r9314k15925J08086L21985l25051j42946J58424
14656A104713j35040K05594K55620n68087P9877L55940l58895K64486m00791K66462
14646A069879R4077K72483l23570N80488n86881o1247K87153j39700K64048j33369
14636A323361Q748j6721J89304o14258M4961N12012k38189k04504R3748J66144
$$ plain form
14626 1264606 1136126 1320816 1320662 1385037 1315282 1442187 1594300 1394231 1116697 1472364
14616 1472364 1285349 1450330 1519259 1101223 1303308 1536276 1477209 1610630 1289467 1778287
14606 1778287 1860303 1465422 1256412 1721477 1881564 1764008 1463445 1700506 1348192 1671559
14596 1671559 1700630 1960851 1613666 1523609 1548689 1735773 1749300 1742752 1881861 1854416 1846923
14585 1846923 1866342 1551444 1759381 1784218 1628935 2000720 1624016 1673488 2223547 1915653
14575 1915653 1990037 2674070 1844447 2286268 1802622 2005801 2078492 2086038 1850468 2324142
14565 2324142 2322282 2441969 2544709 2512891 2393839 2731564 2704618 2893210 2928879 3239957
14555 3239957 3303996 3322976 4202627 3919746 4524811 5615898 6985540 10836628 20441460
$$ packed form
14626A264606j28480J84690j54O4375o9755J26905J52113k00069k77534L55667
14616A472364j87015J64981O8929m18036K02085K32968n9067J33421l21163M88820
14606A778287Q2016l94881k09010M65065J60087j17556l00563K37061l52314L23367
14596A671559K9071K60221l47185r0057K5080J87084J3527o548J39109k7445p493
14585A846923J9419l14898K07937K4837j55283L71785l76704M9472N50059l07894
14575A915653P4384O84033q29623M41821m83646K03179P2691P546k35570M73674
14565B324142j860J19687J02740l1818j19052L37725k6946J88592L5669L11078
14555C239957O4039J8980Q79651k82881O05065J091087J369642L851088R604832
$$ plain form
14546 20441460 39310099 43810752 23059576 10092702 4979768 2900004 2646556 2154038
14538 2154038 2010087 1853310 2195413 1854653 1862864 1820623 1798747 2005784 1984574 1905241
14528 1905241 2096170 2430788 2276007 2369654 2543913 2298718 2385849 2676259 2641996 2348784
14518 2348784 2449648 2424944 2436223 2869990 2661895 2777612 2696243 2583462 2505512 2818398
14508 2818398 2848915 2636636 2943699 2939764 2656282 2787116 3165539 3144372 3378046 2976845
14498 2976845 2875991 3134805 3471353 3081650 3666430 3737243 3558259 3238795 3584246 3470092
14488 3470092 3440841 3655685 3703813 3534143 3507005 3747315 3558293 3691489 4095540 4169513
14478 4169513 3963047 3875483 3974065 3853157 4243949 4133241 4371532 4122781 4461364 4342491
$$ packed form
14546B0441460J8868639M500653k0751176A0092702D979768k079764k53448m92518
14538B154038j43951j56777L42103l40760Q211m2241k1876K07037k1210p9333
14528A905241J90929L34618j54781R3647J74259k45195Q7131K90410l4263k93212
14518B348784J00864k4704J1279M33767k08095J15717q1369j12781p7950L12886
14508B818398L0517k12279L07063l935k83482J30834L78423k1167K33674m01201
14498B976845j00854K58814L36548l89703N84780P0813j78984l19464L45451j14154
14488C470092k9251K14844M8128j69670k7138K40310j89022J33196M04051P3973
14478D169513k06466q7564R8582j20908L90792j10708K38291k48751L38583j18873
$$ plain form
14468 4342491 4698497 4434261 4377320 4593959 4515176 4699814 4498705 4724983 4982161 4594227
14458 4594227 5052158 4889655 5025736 5180641 4885929 4993533 5435739 5250504 5369875
14449 5369875 5764845 5578826 5707208 5879429 6001391 5549847 5968373 6104905 5931530
14440 5931530 6125042 6257439 6173765 6376088 6351034 6729323 6677209 6436919 6714034 6852084
14430 6852084 6534572 6994963 6997863 7619148 7090930 6980705 7419917 7629003 7633670 7996465
14420 7996465 7781713 7816483 8152545 8532246 8362324 8015280 8477223 8579247 8995018 8883272
14410 8883272 8969005 9097995 8965288 9545704 9749267 9643263 10051953 9769105 10216201 10642689
14400 10642689 10506190 10375644 10681683 11075146 11111227 11401921 11428670 12034547 12128934 12028336
$$ packed form
14468D342491L56006k64236n6941K16639p8783J84638k01109K26278K57178l87934
14458D594227M57931j62503J36081J54905k94712J07604M42206j85235J19371
14449E369875L94970j86019J28382J72221J21962m51544M18526J36532j73375
14440E931530J93512J32397q3674K02323k5054L78289n2114k40290K77115J38050
14430F852084l17512M60391K900O21285n28218j10225M39212K09086M667L62795
14420G996465k14752L4770L36062L79701j69922l47044M61943J02024M15771j11746
14410H883272Q5733J28990j32707N80416K03563j06004M08690k82848M47096M26488
14400A0642689j36499j30546L06039L93463L6081K90694K6749O05877R4387j00598
$$ plain form
14390 12028336 12202351 12697018 12772319 13308318 12994768 12981334 13640336 13993169 13802118 14141321
14380 14141321 14404041 15202182 15115121 15531438 15936438 15762765 16596209 16697282 16982883
14371 16982883 17479434 17432062 18036481 18627437 19138352 19169622 19610843 19843664 20429030 20733068
14361 20733068 21259195 21529647 22061420 22832120 23188668 23526214 24361024 24955644 25428978
14352 25428978 25485106 26503233 27512639 27663293 28556565 29242434 30077008 30862304 31828633
14343 31828633 32475778 32989663 34272546 34776294 36208648 36959563 38239452 39064865 40075428
14334 40075428 41286585 42710059 43964154 45273800 46479665 47838557 49461432 51265699
14326 51265699 52990727 54287215 56104581 58140255 60220870 61971147 64467099 66884627
$$ packed form
14390A2028336J74015M94667P5301N35999l13550j3434O59002L52833j91051L39203
14380A4141321K62720P98141q7061M16317M05000j73673Q33444J01073K85601
14371A6982883M96551m7372O04419N90956N10915L1270M41221K32821N85366L04038
14361B0733068N26127K70452N31773P70700L56548L37546Q34810N94620M73334
14352B5428978N6128J018127J009406J50654Q93272O85869Q34574P85296R66329
14343C1828633O47145N13885J282883N03748J432354P50915J279889Q25413J010563
14334D0075428J211157J423474J254095J309646J205865J358892J622875J804267
14326E1265699J725028J296488J817366K035674K080615J750277K495952K417528
$$ plain form
14318 66884627 68962675 71294305 74284133 76927505 80105768 83088266 86541451 89717423
14310 89717423 93364008 97325186 101547978 105796367 110324396 114986337 120378731 125640842
14302 125640842 131135894 137505931 143725415 150476316 157822124 165347111 173312822 181849488
14294 181849488 190479763 199990904 209874116 220470873 231238660 243002303 254915081
14287 254915081 267776642 280471504 294035456 307605367 321558472 335525517 349499693
14280 349499693 363441673 377219553 390030924 402508577 414211977 424357311 433066815
14273 433066815 439299269 442870695 443637294 443754470 443532635 440573846 438454681 436146759
14265 436146759 430022506 421659662 411206462 399235382 386323995 372505374 358071129
$$ packed form
14318F6884627K078048K331630K989828K643372L178263K982498L453185L175972
14310H9717423L646585L961178M222792M248389M528029M661941N392394N262111
14302A25640842N495052O370037O219484O750901P345808P524987P965711Q536666
14294A81849488Q630275R511141R883212J0596757J0767787J1763643J1912778
14287B54915081J2861561J2694862J3563952J3569911J3953105J3967045J3974176
14280C49499693J3941980J3777880J2811371J2477653J1703400J0145334Q709504
14273D33066815O232454L571426P66599J17176k21835k958789k119165k307922
14265D36146759o124253q362844j0453200j1971080j2911387j3818621j4434245
$$ plain form
14258 358071129 343318943 328450617 314214767 300519680 286543545 273095624 260288508
14251 260288508 247850192 236075599 224363936 213655749 203515616 193548418 184665465
14244 184665465 176343048 168093312 160469225 152666047 146143070 139459672 133973338 128180424
14236 128180424 122401428 117171430 112298396 107689461 103335951 99588473 95932139 91878446
14228 91878446 88229580 84633457 81606237 78669865 75740808 73199199 70297986 68228164
14220 68228164 65875506 63748195 61355203 59691331 57360613 55663855 53972336 52790082
14212 52790082 50893580 49169459 47559102 46523261 45205762 44495613 42887324 41882479
14204 41882479 40397543 39399168 38141457 37426815 37023457 35506534 34673285 33574709 32510379
$$ packed form
14258C58071129j4752186j4868326j4235850j3695087j3976135j3447921j2807116
14251B60288508j2438316j1774593j1711663j0708187j0140133r967198q882953
14244A84665465q322417q249736p624087p803178o522977o683398n486334n792914
14236A28180424n778996n229998m873034m608935m353510l747478l656334m053693
14228I1878446l648866l596123l027220k936372k929057k541609k901213k069822
14220F8228164k352658k127311k392992j663872k330718j696758j691519j182254
14212E2790082j896502j724121j610357j035841j317499p10149j608289j004845
14204D1882479j484936r98375j257711p14642m03358j516923q33249j098576j064330
$$ plain form
14195 32510379 31678846 31423471 30423245 29908314 28954647 28049963 27673225 26913314 26278654
14186 26278654 25601666 24989350 24509018 23889714 23347303 23056504 22322090 22081351 21533822
14177 21533822 21250468 20609456 20025616 19687375 19418930 18833772 18693882 18455765 18060062
14168 18060062 17793164 17224028 16894277 16517589 16315738 16201171 15557336 15200648 15427279
14159 15427279 14716735 14657130 14344446 14232148 13935467 13629578 13641523 13263310 13069257 13032889
14149 13032889 12699407 12422631 12360652 12157360 11631433 11736894 11796522 11146010 11249421 11422557
14139 11422557 10808868 10870538 10544042 10404483 10375294 10079674 10396472 10065121 9593509 9385817
14129 9385817 8952713 9218052 9432383 8971563 8967626 8575578 8563760 8843051 8425510 8016861
$$ packed form
14195C2510379q31533k55375j000226n14931r53667r04684l76738p59911o34660
14186B6278654o76988o12316m80332o19304n42411k90799p34414k40739n47529
14177B1533822k83354o41012n83840l38241k68445n85158j39890k38117l95703
14168A8060062k66898n69136l29751l76688k01851j14567o43835l56688K26631
14159A5427279p10544n9605l12684j12298k96681l05889J1945l78213j94053l6368
14149A3032889l33482k76776o1979k03292n25927J05461N9628o50512J03411J73136
14139A1422557o13689O1670l26496j39559k9189k95620L16798l31351m71612k07692
14129I385817m33104K65339K14331m60820l937l92048j1818K79291m17541m08649
$$ plain form
14119 8016861 8257565 7598854 7832663 7754018 7764105 7512381 7321206 7415757 7241059 7287645
14109 7287645 7062329 7260119 6898505 7049398 6613864 6680777 6719108 6442255 6623380 6522373
14099 6522373 6083555 6324768 6308699 6146504 6199376 6151619 5562490 5600111 5657104 5781675
14089 5781675 5673505 5421168 5535820 5309954 5366877 5387138 5170980 5648160 4953392 4931896
14079 4931896 5022802 5089898 5202491 4966320 5071893 5148929 4883970 4489764 4269401 4740710
14069 4740710 4809897 4597912 4604225 4390788 4258324 4386189 4033224 4089557 4139392 4322871
14059 4322871 4169209 4194805 4028915 4169270 3980862 3859817 4000996 3771530 4019908 3951258
14049 3951258 3722131 3610558 3784142 3482350 3720309 3836790 3667575 3680207 3673529 3579429
$$ packed form
14119H016861K40704o58711K33809p8645J0087k51724j91175R4551j74698M6586
14109G287645k25316J97790l61614J50893m35534O6913L8331k76853J81125j01007
14099F522373m38818K41213j6069j62195N2872m7757n89129L7621N6993J24571
14089E781675j08170k52337J14652k25866N6923K0261k16158M77180o94768k1496
14079D931896R0906O7096J12593k36171J05573P7036k64959l94206k20363M71309
14069D740710O9187k11985O313k13437j32464J27865l52965N6333M9835J83479
14059D322871j53662K5596j65890J40355j88408j21045J41179k29466K48378o8650
14049C951258k29127j11573J73584l01792K37959J16481j69215J2632o678r4100
$$ plain form
14039 3579429 3487862 3498146 3395580 3303175 3605639 3377672 3438529 3538304 3607564 3106027
14029 3106027 3202418 3322381 3316929 3133133 2939976 3050974 3015310 2933207 2909660 2637906
14019 2637906 3101459 2685021 2532204 2641226 2828061 2756449 2552939 2650379 2483219 2283429
14009 2283429 2539644 2642813 2595203 2470031 2403535 2511336 2320264 2356313 2392615 2518171
13999 2518171 2292930 2284401 2111052 2515641 2092304 2111670 2114227 2214832 2490627 2584394
13989 2584394 3449469 6196946 12855451 31169666 44461657 28427709 15330192 9590056
13981 9590056 6541841 5403327 4752642 3644637 3374786 3296683 3134753 3019615 2857688
13972 2857688 2913244 2930938 2663682 2644839 2782221 2514030 2273532 2511186 2620662 2467986
$$ packed form
14039C579429r1567J0284j02566r2405L02464k27967O0857R9775O9260n01537
14029C106027R6391J19963n452j83796j93157J10998l5664q2103k3547k71754
14019B637906M63553m16438j52817J09022J86835p1612k03510R7440j67160j99790
14009B283429K56215J03169m7610j25172o6496J07801j91072L6049L6302J25556
13999B518171k25241q529j73349M04589m23337J9366K557J00605K75795R3767
13989B584394Q65075K747477O658505J8314215J3291991j6033948j3097517n740136
13981I590056l048215j138514o50685j108005k69851p8103j61930j15138j61927
13972B857688N5556J7694k67256j8843J37382k68191k40498K37654J09476j52676
$$ plain form
13962 2467986 2617162 2370022 2733285 2370628 2445658 2361448 2125884 1987403 2069044 2049482
13952 2049482 2182261 2210558 1916149 2096679 1971886 2024000 2046875 1826255 2175883 1957459
13942 1957459 1926114 1699772 2053869 1487258 1835560 1901857 1623744 1862057 1666681 1910986
13932 1910986 1759978 2010779 1837190 1768345 1503009 1674270 1582624 1848925 1674516 1777246
13922 1777246 1688387 1612902 2154161 1756545 1937401 1478467 1681165 1677456 1584589 1323913
13912 1323913 1842139 1702858 1396343 1591464 1854588 1537259 1841207 1566536 1788729
13903 1788729 1469023 1474442 1530034 1470269 1345675 1321754 1583603 1475438 1443519 1481558 1355496
13892 1355496 1258549 1077890 1472360 1169503 1321777 1288987 1269365 1151949 1391846 1552433
$$ packed form
13962B467986J49176k47140L63263l62657P5030q4210k35564j38481Q1641j9562
13952B049482J32779K8297k94409J80530j24793N2114K2875k20620L49628k18424
13942A957459l1345k26342L54097n66611L48302O6297k78113K38313j95376K44305
13932A910986j51008K50801j73589o8845k65336J71261r1646K66301j74409J02730
13922A777246q8859p5485N41259l97616J80856m58934K02698l709r2867k60676
13912A323913N18226j39281l06515J95121K63124l17329L03948k74671K22193
13903A788729l19706N419N5592n9765j24594k3921K61849j08165l1919L8039j26062
13892A355496r6947j80659L94470l02857J52274l2790j9622j17416K39897J60587
$$ plain form
13882 1552433 1158870 1233250 1386399 1256466 1442679 1297059 1310165 1457000 1136049 1354871
13872 1354871 1267702 1121403 1102936 1345489 1139367 1249970 1142184 1195153 1401766 1157832
13862 1157832 1003838 984743 1685805 1111783 1266694 1263162 1067839 1384317 1194294 1475807
13852 1475807 1031125 1233327 1139639 1054213 1206859 1142148 1161716 842434 1056587 790033
13842 790033 1259012 1150744 574605 1056639 1277123 1131582 1016208 1110341 966419 877959
13832 877959 1342786 1086216 1069657 1118553 835768 1023074 1220059 1125575 703271 1227938
13822 1227938 1090927 867617 1133967 741705 1072664 848164 1039087 805990 1100876
13813 1100876 1053981 914031 1108951 939551 880294 545467 981259 609374 1016087 594676
$$ packed form
13882A552433l93563P4380J53149j29933J86213j45620J3106J46835l20951K18822
13872A354871q7169j46299j8467K42553k06122J10603j07786N2969K06613k43934
13862A157832j53994j9095P01062n74022J54911l532j95323L16478j90023K81513
13852A475807m44682K02202r3688q5426J52646o4711J9568l19282K14153k66554
13842G90033M68979j08268E74605M82034K20484j45541j15374R4133j43922q8460
13832H77959M64827k56570j6559M8896k82785J87306J96985r4484m22304N24667
13822A227938j37011k23310K66350l92262L30959k24500J90923k33097K94886
13813A100876m6895j39950J94920j69400n9257l34827M35792l71885M06713m21411
$$ plain form
13803 594676 933069 735853 815637 1221209 963242 849865 725308 980932 791339 727844
13793 727844 715876 978406 1139866 547958 911299 712439 649126 949766 879863 764167
13783 764167 956059 662770 1054600 301820 732916 982055 885373 545902 774066 863439
13773 863439 664861 1003919 862413 558274 387362 853886 913018 688606 813172 854687
13763 854687 813034 747853 725467 622889 709350 608220 835081 522103 571276 813943
13753 813943 714109 715693 693808 437715 712814 329787 855510 755613 694869 473286 570190
13742 570190 709778 414000 594625 639702 598757 481050 563734 464801 723615 302067
13731 469319 798015 272523 845370 653475 534428 617257 794357 552311 826483 831487
$$ packed form
13803E94676L38393j97216P9784M05572k57967j13377j24557K55624j89593o3495
13793G27844j1968K62530J61460E47958L63341j98860o3313L00640o9903j15696
13783G64167J91892k93289L91830C01820M31096K49139r6682l39471K28164Q9373
13773H63439j98578L39058j41506l04139j70912M66524N9132k24412J24566M1515
13763H54687m1653o5181k2386j02578Q6461j01130K26861l12978M9173K42667
13753H13943r9834J584k1885k56093K75099C29787N25723r9897o0744k21583R6904
13742E70190J39588k95778J80625M5077m0945j17707Q2684r8933K58814C02067
13731D69319L28696B72523N72847j91895j19047Q2829J77100k42046K74172N004
$$ plain form
13721 831487 592497 699951 891727 562805 571560 488350 564024 667576 1083740 363201
13710 794501 342618 451634 578259 814744 567070 664977 682690 754895 526655 750987
13700 750987 574786 404478 715111 594575 544992 473834 790866 682466 871668 475600
13690 475600 496989 422496 858496 308862 541562 409585 953260 645240 586714 820064
13680 820064 695654 395529 651058 739221 510374 446479 350367 683746 560380 322421
13670 322421 2653 -61967 443172 637563 353173 587688 474843 585647 664891 374665
13660 374665 324128 529150 549536 355277 352536 440662 598687 492153 219909 245524 533199
13649 533199 411664 352909 460012 559792 219978 545754 567270 103748 173756 320771
$$ packed form
13721H31487k38990J07454J91776l28922Q755q3210P5674J03552M16164C63201
13710G94501C42618J09016J26625K36485k47674R7907J7713P2205k28240K24332
13700G50987j76201j70308L10633j20536m9583p1158L17032j08400J89202l96068
13690D75600K1389p4493M36000C08862K32700j31977N43675l08020n8526K33350
13680H20064j24410l00125K55529Q8163k28847o3895r6112L33379j23366k37959
13670C22421B653f1967D43172J94391k84390K34515j12845J10804P9244k90226
13660C74665n0537K05022K0386j94259k741Q8126J58025j06534B19909K5615K87675
13649E33199j21535n8755J07103R9780B19978L25776K1516A03748P0008J47015
$$ plain form
13639 320771 349029 451314 286300 623374 406761 626807 582039 184214 587565 252592
13628 551911 409747 336375 488344 271235 308090 196290 272489 497686 354450 465283
13618 465283 372528 109395 180332 380460 383682 477787 229554 731263 441799 821379
13608 821379 470653 266604 785718 301065 393138 559283 199636 108172 720654 248410
13597 611935 685433 211340 432683 290417 248072 223024 288536 424639 572361 329294
13587 329294 356394 328684 603920 244730 410599 605099 300705 264476 443833 510279
13577 510279 711282 375813 443588 433340 279851 176098 401962 523349 312064 112441
13566 193065 332307 185039 425389 282182 625846 293776 478542 418114 252871 307338
$$ packed form
13639C20771K8258J02285j65014L37074k16613K20046m4768A84214M03351B52592
13628E51911j42164p3372J51969k17109L6855j11800P6199K25197j43236J10833
13618D65283r2755A09395P0937K00128L222R4105B29554N01709k89464L79580
13608H21379l50726k04049N19114C01065R2073J66145A99636r1464O12482B48410
13597F11935P3498B11340K21343j42266m2345k5048O5512J36103J47722k43067
13587C29294K7100k7710K75236B44730J65869J94500C00705l6229J79357O6446
13577E10279K01003l35469O7775j0248j53489j03753K25864J21387k11285A12441
13566A93065J39242j47268K40350j43207L43664B93776J84766o0428j65243N4467
$$ plain form
13556 307338 391348 524711 632453 293672 202575 287642 476963 288553 373310 50373
13545 252011 410085 691381 283922 412919 158413 577176 574056 406058 497669 489696
13535 489696 284928 301913 306586 -989 343823 272970 303198 374758 177105 281046 228334
13524 228334 48978 446611 436626 331323 169702 621041 90960 288930 428326 400042
13514 400042 -142177 334135 79455 42561 265789 369669 -15592 502791 353345 307357
13504 307357 121700 378700 78181 29969 322528 208671 389229 543609 146082 226410
13494 226410 311323 330353 88891 222227 -60330 356993 602918 308433 291251 500868
13484 500868 380310 310341 433909 158748 234619 306022 505754 363883 303976 364180
$$ packed form
13556C07338Q4010J33363J07742B93672r1097Q5067J89321j88410Q4757E0373
13545B52011J58074K81296B83922J28997A58413M18763l120j67998R1611p973
13535D89696k04768J6985M673i89C43823p0853L0228P1560A77105J03941n2712
13524B28334D8978L97633r985j05303j61621M51339I0960J97970J39396k8284
13514D00042a42177C34135G9455l6894K23228J03880a5592E02791j49446m5988
13504C07357A21700K57000G8181B9969K92559j13857J80558J54380A46082Q0328
13494B26410Q4913J9030H8891J33336f0330C56993K45925k94485j7182K09617
13484E00868j20558o9969J23568A58748P5871P1403J99732j41871n9907O0204
$$ plain form
13474 364180 247806 -24112 311404 23905 190204 -188194 236603 494407 99302 144081
13464 144081 365282 141728 532709 217444 149717 210764 78626 214510 41941 360400
13454 360400 442012 88927 184529 61252 274923 328748 -207346 189042 178142 330457 -125883
13442 232736 142269 162175 327761 369711 143133 -84743 154465 -73950 424108 279087
13432 279087 -263488 255333 367018 159849 194908 245993 273379 147350 40348 133010
13422 133010 499773 369519 250807 407377 397507 318754 355580 116535 304754 274110
13412 274110 121384 154885 371828 113510 184816 204502 239671 283950 155917 178685 337788
13401 337788 50851 119958 -97186 564316 211079 221781 156424 -73209 312151 -32938 -58759
$$ packed form
13474C64180j16374b4112C11404B3905J66299a88194B36603K57804I9302M4779
13464A44081K21201A41728L90981B17444o7727O1047G8626J35884D1941L18459
13454C60400Q1612H8927R5602F1252K13671N3825b07346A89042j0900J52315a25883
13442B32736r0467J9906J65586M1950A43133h4743A54465g3950D24108j45021
13432B79087b63488B55333J11685A59849L5059N1085K7386j26029D0348R2662
13422A33010L66763j30254j18712J56570r870p8753L6826A16535J88219l0644
13412B74110A21384L3501K16943A13510P1306J9686L5169M4279j28033K2768J59103
13401C37788E0851O9107i7186E64316B11079J0702o5357g3209C12151c2938k5821
$$ plain form
13390 -58759 170752 226844 379222 147615 -27764 318537 476724 -273684 -11967 -217 115480
13378 169935 380897 167818 222806 225455 295884 360248 259691 338557 393021 333977 258404
13367 258404 186117 104890 319918 181885 265270 -101467 -52594 623274 260546 -89294
13356 127473 269888 238750 358483 454493 211815 -6057 222349 300821 205499 147614 373036
13345 373036 -71347 261672 198826 108288 442181 713708 515478 -46707 298774 306998 38749
13333 160994 389437 15329 221379 548445 198897 12832 268271 288145 182778 308772
13323 308772 355455 -53763 87680 398554 502973 40236 162804 298284 510004 346782
13313 346782 64131 169918 198317 293299 52989 169243 350829 35841 97027 22241 400144
$$ packed form
13390e8759A70752N6092J52378A47615b7764C18537J58187b73684a1967b17A15480
13378A69935K10962A67818N4988K649P0429O4364j00557P8866N4464n9044p5573
13367B58404p2287q1227K15028j38033Q3385a01467M8873F23274B60546h9294
13356A27473J42415l1138J19733R6010B11815f057B22349P8472r5322n7885K25422
13345C73036g1347B61672o2846r0538L33893K71527j98230d6707B98774Q224C8749
13333A60994K28443A5329K06050L27066A98897A2832K55439J9874j05367J25994
13323C08772M6683e3763H7680L10874J04419D0236J22568J35480K11720j63222
13313C46782F4131J05787K8399R4982E2989J16254J81586C5841O1186B2241L77903
$$ plain form
13302 400144 -114227 193129 109914 169781 281421 95618 174777 85372 325489 216442
13292 216442 259319 676331 -216768 41203 -231948 -98074 202251 -105569 -145296 282087
13281 241863 7402 325149 39934 68936 -201459 282685 125047 155830 228222 435043 153397
13269 322967 51830 270161 -118069 520084 160085 245676 279293 240616 267475 72016 -112778
13257 -1299 250449 -88420 428508 183779 367338 224297 181668 36852 24052 24353 108886
13246 108886 39742 243303 156424 311170 -27082 189210 20804 -36504 -184100 174977
13235 384945 325562 -187518 -37887 -109904 80426 230132 -234535 20049 337955 134552
13224 -186818 -103906 106758 477547 235773 -207149 184078 -42465 42855 64655 295141
$$ packed form
13302D00144a14227A93129q3215N9867J11640I5618P9159H5372K40117j09047
13292B16442M2877M17012b16768D1203b31948i8074B02251a05569l9727B82087
13281B41863G402L17747C9934K9002b01459B82685A25047L0783P2392K06821A53397
13269C22967E1830K18331a18069E20084A60085Q5591L3617l8677K6859G2016a12778
13257a299B50449h8420D28508A83779J83559j43041m2629C6852j2800L01Q4533
13246A08886C9742K03561q6879J54746b7082A89210B0804c6504j47596A74977
13235C84945n9383a87518c7887p2017H0426J49706b34535B0049L17906A34552
13224a86818Q2912A06758L70789B35773b07149A84078d2465D2855K1800K30486
$$ plain form
13214 295141 56559 414514 263173 -202928 59701 -6899 148372 -21622 268609 353057 24774
13202 194464 -46221 111146 308736 131972 48725 556357 120282 19634 152166 128777
13192 128777 238158 375459 196125 421976 16445 139715 24345 299126 264415 306493
13182 306493 -370477 -160739 220934 136930 313820 -207423 85018 212977 241819 181063
13172 181063 70878 -206432 139081 -201334 70100 -13068 201555 -166146 344829 63504
13161 79158 259905 213669 148228 -11275 44186 192158 138295 -52262 -13113 -196712 261253
13149 -62889 -31909 -152676 -6136 -53448 148942 269502 402767 -287452 -76479 210026 -136531
13137 230825 28242 127910 -229883 -18413 282958 -124666 70199 1720 104989 135422 87331
$$ packed form
13214B95141E6559L57955j51341b02928E9701f899A48372b1622B68609Q4448B4774
13202A94464d6221A11146J97590A31972D8725N07632A20282A9634J32532k3389
13192A28777J09381J37301j79334K25851A6445J23270B4345K74781l4711M2078
13182C06493c70477a60739B20934q4004J76890b07423H5018J27959K8842o0756
13172A81063G0878b06432A39081b01334G0100a3068B01555a66146C44829F3504
13161G9158J80747m6236o5441a1275D4186J47972n3863e2262a3113j83599B61253
13149f2889L0980j20767f136m7312A48942J20560J33265b87452g6479B10026a36531
13137B30825B8242R9668b29883a8413B82958a24666G0199A720J03269L0433m8091
$$ plain form
13126 87331 180150 307118 -111361 -163997 -91501 -215178 229322 52047 -88902 -139206 260017
13114 -12657 241989 233798 -186795 287884 -252366 35488 373408 129518 -44971 162319
13103 149427 25391 212410 157430 27550 239122 -51158 21192 -245237 -289400 63901 93426
13092 93426 -59495 294659 -256815 -49770 -14725 156959 147353 -235093 -82290 89008 215412
13081 215412 -146020 282673 -190244 -157719 -269185 -25717 293736 307261 17598 306930
13071 306930 -100861 418600 48494 335966 106775 101513 275398 -96158 337465 -24672
13060 251835 327353 110006 -148141 33772 -95212 -23318 435912 -30943 -138008 217625
13049 66972 205877 482323 -91214 127774 220823 125790 41327 -181816 169150 5262 -255193
$$ packed form
13126H7331R2819J26968a11361n2636P2496j23677B29322E2047h8902n0304B60017
13114a2657B41989q191a86795B87884b52366C5488L37920A29518d4971A62319
13103A49427B5391J87019n4980B7550K11572e1158B1192b45237m4163F3901K9525
13092I3426e9495B94659b56815d9770a4725A56959r606b35093h2290H9008J26404
13081B15412a46020B82673a90244L2525j11466b5717B93736J3525A7598K89332
13071C06930a00861D18600D8494K87472A06775n262J73885i6158C37465b4672
13060B51835P5518A10006a48141C3772i5212b3318D35912c0943j07065B17625
13049F6972J38905K76446i1214A27774R3049r5033D1327a81816A69150E262b55193
$$ plain form
13037 40105 -26627 -131999 -52171 -96385 382526 377236 31584 -4145 305195 69616 -154433
13025 -39978 322114 -198760 238135 -192658 -159243 50056 231171 349427 456509 276738
13015 276738 396471 269829 160758 -52953 200638 205252 27270 -41346 114452 26266 196700
13004 196700 329852 231132 -205860 218702 352129 214719 -33737 70542 222007 -14336
12993 198116 117433 99021 547411 334007 -216639 -8203 -86941 83582 164260 360567 -23712
12981 166877 142404 113820 38572 15864 -59353 179670 -92998 117346 46759 -75358 -31023
12969 268776 84835 33780 178222 129375 260549 223915 20610 -294215 186206 -51953 43397
12957 -33324 263773 67348 20643 7742 494635 106766 36581 67818 80988 155588 30556
$$ packed form
13037D0105b6627j05372e2171m4214C82526n290C1584d145C05195F9616a54433
13025c9978C22114a98760B38135a92658L3415E0056J81115J18256J07082j79771
13015B76738J19733j26642j09071e2953B00638M614B7270d1346A14452B6266J70434
13004A96700J33152r8720b05860B18702J33427j37410c3737G0542J51465a4336
12993A98116q0683j8412M48390k13404b16639h203p8738H3582Q0678J96307b3712
12981A66877k4473k8584C8572A5864e9353A79670i2998A17346D6759g5358c1023
12969B68776H4835C3780J44442m8847J31174l6634B0610b94215A86206e1953D3397
12957c3324B63773F7348B0643G742M86893A06766C6581L1237J3170P4600C0556
$$ plain form
12945 50151 150630 -79530 -213067 194494 247816 147706 173497 -12757 182380 -124131
12934 -107386 179710 135474 -64760 7697 -19176 42578 32406 328229 -141010 -86549 -371317
12923 -371317 -78876 253868 -125070 193484 -287394 32284 -3995 -238776 209211 73700
12912 289853 43261 -27142 -128957 95570 -182436 -248364 -1674 181398 139261 290428 61627
12900 -42372 28446 -204286 91192 471744 -156692 -37442 145692 54878 261241 64133 -98761
12888 284455 -88953 34537 -9417 183343 -213660 192301 -60908 -176157 121558 -114045
12877 -88043 142086 318408 45679 -44382 101479 -200024 186459 4801 -54348 15757 -255105
12865 35940 259713 -183844 15526 62058 -65228 -675 110216 13625 8509 -79707 301187
$$ packed form
12945E0151J00479g9530j33537A94494N3322j00110K5791a2757A82380a24131
12934a07386A79710m4236f4760G697a9176D2578j0172K95823a41010N4461k84768
12923c71317g8876B53868a25070A93484b87394C2284c995k34781B09211G3700
12912B89853D3261b7142j01815I5570a82436o5928a674A81398m2137J51167F1627
12900d2372B8446b04286I1192L80552a56692c7442A45692E4878K06363F4133i8761
12888B84455h8953C4537i417A83343b13660A92301f0908j15249A21558a14045
12877h8043A42086J76322D5679d4382A01479b00024A86459D801e4348A5757b55105
12865C5940K23773a83844A5526M6532f5228f75A10216A3625n116g9707C01187
$$ plain form
12853 146366 -3165 104288 -142314 -95986 -254748 223965 -64167 -235999 136008 80967
12843 80967 -169666 70507 250518 356211 -103996 31633 83733 -78627 99242 69867 -103585
12831 65903 82561 -132517 16751 69517 41378 -131260 308041 15805 22200 -441 145656
12819 -277023 49526 387637 87071 153931 11996 -179974 84075 334872 94498 -304748 -89183
12807 149241 -193090 -202342 201952 232353 366604 167109 241589 -250159 -173431 -90109 -336065
12796 -336065 66752 268480 -94174 44929 -146575 207489 -124304 -262022 -256346 221779
12785 205838 -46231 -170703 63811 87536 176312 110569 107651 51895 24060 -83453 116080
12773 170458 233155 41778 20469 -159579 -164728 2837 -70167 51565 -194854 115689 -20851
$$ packed form
12853A46366c165A04288a42314M6328j58762B23965f4167j71832A36008n5041
12843H0967a69666G0507J80011J05693a03996C1633N2100g8627I9242k9375a03585
12831F5903J6658a32517A6751N2766k8139a31260C08041A5805O395d41A45656
12819b77023D9526L38111H7071O6860A1996a79974H4075K50797I4498c04748h9183
12807A49241a93090r252B01952L0401J34251A67109P4480b50159P6728Q3322k45956
12796c36065F6752K01728i4174D4929a46575B07489a24304j37718N676B21779
12785B05838d6231j24472F3811K3725Q8776o5743k918E1895B4060h3453A16080
12773A70458O2697D1778B0469a59579n149B837g0167E1565a94854A15689b0851
$$ plain form
12761 363395 78452 -110108 -1195 157259 167552 -164456 245059 141994 165519 -44092 139548
12749 67825 194107 -16436 -43073 -140619 -90584 -26978 87033 140436 -205937 -43573 73411
12737 258119 89551 -10589 -15569 -26321 269969 -49652 -180364 -206498 112263 -31453 86990
12725 239060 93037 126414 -123420 169245 252 -146305 -67436 -197827 -110969 329034 128534
12713 32455 279363 214766 405455 68371 266662 -87616 441043 262901 136653 525655
12703 525655 171452 -106356 -55371 78654 17739 57247 31640 -403555 -287261 235878
12692 -314265 -103630 -30407 51517 31506 -69798 240534 -37031 46478 421374 205420 -57366
12680 -58583 -104229 96311 26312 -177403 163703 271559 -141055 250727 256793 272122 64818
$$ packed form
12761C63395G8452a10108a195A57259J0293a64456B45059j03065K3525d4092A39548
12749F7825J26282a6436k6637r7546N0035b6978H7033N3403b05937d3573G3411
12737B58119H9551a0589m980j0752B69969d9652j30712k6134A12263c1453H6990
12725B39060I3037L3377a23420A69245B52a46305f7436j30391Q6858C29034A28534
12713C2455K46908o4597J90689F8371J98291h7616D41043j78142j26248L89002
12703E25655A71452a06356N0985G8654A7739L9508k5607d03555J16294B35878
12692c14265a03630c0407E1517k0011f9798B40534c7031D6478L74896B05420e7366
12680e8583m5646I6311B6312a77403A63703J07856a41055B50727O066J5329F4818
$$ plain form
12668 421499 112244 -262299 -94434 256215 -32018 119414 -11601 140769 -10720 -30805
12658 -30805 229396 157346 -80573 12213 237017 189379 -129675 75101 476161 -17195 115896
12646 184132 257880 7062 -398789 68117 -42128 11289 35140 166541 -36985 139236 185288
12635 185288 224880 -190565 282681 -72176 210178 333235 -62286 469820 486132 248266
12625 248266 78195 82013 224747 123885 12593 56538 135865 119122 -247526 100121 77536
12614 77536 -116523 -245023 68934 23828 40046 256399 -69363 182192 72301 357704 122674
12602 27244 104065 401518 422609 4260 -33068 95477 189421 70262 110371 141444 -87163 58536
12589 374293 -89480 -30048 42188 -84032 -5387 -120101 259051 -16225 11617 119377 31174
$$ packed form
12668D21499A12244b62299i4434B56215c2018A19414a1601A40769a0720k0085
12658c0805B29396p2050h0573A2213K24804m7638a29675G5101M01060a7195A15896
12646A84132P3748G062c98789F8117d2128A1289K3851J31401c6985A39236M6052
12635A85288L9592a90565B82681g2176B10178J23057f2286D69820J6312k37866
12625B48266G8195L818J42734j00862A2593M3945P9327j6743b47526A00121k2585
12614G7536a16523j28500F8934B3828J6218K16353f9363A82192G2301K85403A22674
12602B7244P6821K97453K1091D260c3068I5477R3944G0262M0109L1073h7163E8536
12589C74293h9480c0048D2188h4032e387j14714B59051a6225A1617J07760C1174
$$ plain form
12577 -189077 -64304 -47396 -1758 -12934 72856 19656 90784 -98703 -64095 -43497 44409 273412
12565 273412 132773 209670 96550 -329432 -180015 138043 -30041 166291 -145753 67149
12554 227955 -72007 266138 -505371 341745 -31930 120972 -263885 -66963 85449 110762
12544 110762 -167484 -335090 -181199 -151777 -15478 -36085 -44407 -128259 -101845 -159944 172532
12532 179173 -133318 507913 228243 -12411 320153 41999 -101579 -39547 66566 -129499
12521 -309472 -41103 12970 223975 100981 223083 -59633 100366 157552 34450 -441792
12510 84923 95870 49778 78004 -177098 358129 29496 149063 43825 -11749 25014 117672
12499 117672 -289 96792 311438 158083 -153606 11427 -211285 68778 186701 -8147 -263590
$$ packed form
12577a89077f4304J6908a758j1176G2856A9656P1128i8703L4608K0598D4409K29003
12565B73412A32773P6897I6550c29432J49417A38043c0041A66291a45753F7149
12554B27955g2007B66138e05371C41745c1930A20972b63885f6963H5449K5313
12544A10762a67484j67606J53891K9422a5478k0607q322q3852K6414n8099A72532
12532A79173a33318E07913B28243a2411C20153D1999a01579c9547F6566a29499
12521c09472d1103A2970K11005A00981J22102e9633A00366N7186C4450d41792
12510H4923J0947m6092K8226a77098C58129B9496J19567D3825a1749B5014R2658
12499A17672b89I6792K14646j53355a53606A1427b11285F8778J17923h147k55443
$$ plain form
12488 -263590 157363 -172601 227698 264923 -136015 239430 71354 87979 -295718 24381
12477 50383 360033 -219325 48111 272350 75581 -160203 -7302 216159 68322 262514 -70863
12465 -5116 60126 -115497 -197199 355173 -34637 285483 79719 -147021 27903 146535 -78889
12453 -203098 -130333 -78007 -194703 126327 118623 -63471 2539 -42790 -91454 106211 226767
12442 226767 -21737 102336 250929 -90203 72344 61279 -91458 29820 -52150 100246 412450
12431 412450 -50596 246488 117078 40017 -150235 -97397 -188300 -114491 327127 84388 -228142
12419 250373 203426 116642 51520 -423 -267626 82718 135399 -130454 -107642 -401231 -66445
12407 -195010 -8606 -206967 130448 -43150 325936 -127889 -31320 154313 -152892 65492
$$ packed form
12488b63590A57363a72601B27698L7225a36015B39430G1354J6625b95718B4381
12477E0383L09650b19325D8111K24239G5581a60203g302B16159F8322J94192g0863
12465e116F0126a15497q1702C55173c4637B85483G9719a47021B7903J18632g8889
12453b03098P2765N2326j16696A26327p704f3471B539d2790m8664A06211J20556
12442B26767b1737A02336J48593i0203G2344j1065i1458B9820e2150A00246L12204
12431D12450e0596B46488A17078D0017a50235N2838r0903P3809C27127H4388b28142
12419B50373m6947q6784E1520d23k67203H2718N2681a30454K2812k93589f6445
12407a95010h606j98361A30448d3150C25936a27889c1320A54313a52892F5492
$$ plain form
12396 159637 -106773 98066 26950 -162402 -209703 3406 322053 211031 247891 82084 -243813
12384 136660 -8156 -125090 -207868 4868 -41510 -60719 60252 -396741 -270745 -198148 42506
12372 -164020 59631 64409 46646 -342002 -63200 -181764 126955 -77479 -112237 171233 -193204
12360 -179975 34312 46530 11337 65437 -42352 -143026 -134370 -36590 146405 58462 -212264
12348 -41575 10973 77993 -275681 -73345 -201964 133829 -37740 -33001 -177435 24060 -258996
12336 281359 110570 60696 -198158 250637 -28787 -241296 116915 -2192 298415 46835
12325 -100159 132176 184156 -92586 -18269 226662 166484 -91581 185108 111152 -12859 108751
12313 332528 48632 374351 14204 -338455 168328 -160319 16726 42953 171229 139314
$$ packed form
12396A59637a06773I8066B6950a62402m7301C406L18647j11022L6860H2084b43813
12384A36660h156j16934q2778D868d1510j9209F0252c96741J25996P2597D2506
12372a64020E9631M778j7763c42002f3200j18564A26955g7479l4758A71233a93204
12360a79975C4312J2218A1337N4100d2352j00674Q656c6590A46405E8462b12264
12348d1575A0973O7020b75681g3345j28619A33829c7740M739j44434B4060b58996
12336B81359A10570m9874a98158B50637b8787k12509A16915b192B98415D6835
12325a00159A32176N1980i2586a8269B26662o0178i1581A85108p3956a2859A08751
12313C32528D8632L25719A4204c38455A68328a60319A6726K6227J28276l1915
$$ plain form
12303 139314 -111817 202677 380275 57598 -6503 -106234 392432 205491 12087 65665 -71710
12291 206845 62344 7564 -182126 -162702 60503 -64143 -223119 107439 224031 233050 274283
12280 274283 -45892 -80327 -120701 134018 64095 48556 145012 39404 254673 136984 212566
12269 212566 -228979 186798 -163622 -69734 1814 184579 272746 137022 260293 -318126
12258 117255 137351 56126 9419 -141943 109502 288973 97874 23205 80483 -94792 -80658
12247 -80658 315641 152694 56115 -215399 -17974 129131 -80913 -90246 88167 -64629 284139
12235 -137151 65656 -151068 93075 197513 30411 -7687 -143684 -53798 68550 126825 254329
12224 254329 129943 284400 90043 213857 298106 94752 -31745 408322 44076 45027 428498
$$ packed form
12303A39314a11817B02677J77598E7598f503r9731C92432j86941A2087N3578g1710
12291B06845F2344G564a82126J9424F0503f4143j58976A07439J16592R019M1233
12280B74283d5892l4435m0374A34018F4095j5539R6456C9404K15269j17689P5582
12269B12566b28979A86798a63622f9734A814J82765Q8167j35724J23271c18126
12258A17255K0096E6126I419a41943A09502J79471I7874B3205N7278i4792J4134
12247h0658C15641A52694E6115b15399a7974A29131h0913r333H8167f4629B84139
12235a37151F5656a51068I3075J04438C0411g687j35997e3798F8550N8275J27504
12224B54329j24386J54457I0043J23814Q4249I4752c1745D08322D4076R51L83471
$$ plain form
12213 428498 275038 -166893 145341 227627 -44681 234811 78751 178968 149684 208552
12203 208552 282123 167122 124661 182983 295843 127574 390587 26816 294574 39070
12192 67228 -27957 209979 104976 356275 134140 206235 477281 -93994 -149343 73432 -103986
12180 66956 -75746 72859 -182661 89070 31650 247592 251046 227369 42317 85027 227139
12169 227139 91137 101585 80274 -26828 5839 71805 255282 -178658 413565 290237 -99371
12157 235513 -121180 411829 -34275 182724 141734 -280139 515431 38646 203260 6817
12146 181759 62141 -35604 -85306 130724 57943 -166766 14163 49349 106366 -146592 9916
12134 -203532 -220817 384432 185852 71108 223606 -45276 -22748 -154607 -123666 249591
$$ packed form
12213D28498j53460a66893A45341Q2286d4681B34811G8751J00217k9284N8868
12203B08552P3571j15001m2461N8322J12860A27574K63013B6816K67758C9070
12192F7228b7957B09979A04976K51299A34140P2095K71046i3994n5349G3432a03986
12180F6956g5746G2859a82661H9070C1650K15942L454k3677D2317M2710J42112
12169B27139I1137J0448k1311b6828E839O5966J83477a78658D13565j23328i9371
12157B35513a21180D11829c4275A82724m0990b80139E15431C8646J64614F817
12146A81759F2141c5604m9702A30724E7943a66766A4163L5186N7017a46592I916
12134b03532j7285C84432A85852G1108J52498d5276K2528j31859L0941B49591
$$ plain form
12123 108633 200944 403163 -75167 55482 2548 77560 -274078 76382 52422 89822 21137
12111 134615 -94682 50049 106837 119392 -244171 154855 332199 322628 121953 492729 -297463
12099 -47035 207824 -139624 131645 -173565 -29293 -110738 -19753 -137274 506670 227063
12088 113993 37651 -37772 -54887 291453 -511854 -298771 209144 36039 193431 101261
12078 101261 165399 192946 8554 106732 760727 1755334 1512675 658662 183628 -156769
12067 -36137 231786 143824 429155 -60394 -191641 -25924 -40276 -112348 -7888 42737 173543
12056 173543 -147784 -42874 138748 -107709 -165525 77622 -259651 -63658 174449 64934
12045 -97949 -69310 -101546 -160369 -87932 -263823 -133139 -25114 -392936 372893 266476 -10246
$$ packed form
12123A08633R2311K02219g5167E5482B548P5012b74078G6382k3960L7400B1137
12111A34615i4682E0049N6788J2555b44171A54855J77344r571A21953L70776b97463
12099d7035B07824a39624A31645a73565b9293q1445a9753j17521E06670B27063
12088A13993C7651c7772j7115B91453e11854K13083B09144C6039J57392r2170
12078A01261O4138K7547H554R8178O53995R94607k42659F58662A83628a56769
12067c6137B31786q7962K85331f0394j31247b5924j4352p2072g888D2737J30806
12056A73543a47784d2874A38748a07709n7816G7622b59651f3658A74449F4934
12045i7949K8639l2236n8823P2437j75891J30684b5114l67822C72893j06417a0246
$$ plain form
12033 -277016 -40266 -220415 -212581 25682 -18899 -264577 127606 94516 -181586 126448 -198195
12021 -79869 357313 13942 -326339 155873 100847 305496 -233357 -150333 -122872 145795
12010 -109863 10342 346675 186555 139184 -75481 -29360 132372 334090 -326552 269063
11999 -113186 -131361 -207693 -217544 85578 18286 65690 -262352 -1687 472 -182061 55892 81383
11987 81383 -269442 10959 123394 104138 -105860 -149534 -3887 -11891 -164989 39863 -208090
11975 46841 -303317 -40073 -242156 81531 115683 -36200 -86461 9762 -192435 -512465 60421
11963 134140 -2779 -7486 -229041 -130447 -75685 35519 59934 60767 129458 118874 -240073 84832
11950 -244493 100129 -257037 90968 162745 -23974 -146900 -334127 155502 255013 11232
$$ packed form
12033b77016d0266j80149P834B5682a8899k45678A27606l3090a81586A26448a98195
12021g9869C57313A3942c26339A55873n5026K04649b33357Q3024K7461A45795
12010a09863A0342L36333j60120m7371g5481b9360A32372K01718c26552B69063
11999a13186j8175p6332r851H5578A8286M7404b62352a687D72a82061E5892K5491
11987H1383b69442A0959J12435j9256a05860m3674c887q004j53098C9863b08090
11975D6841c03317d0073k02083H1531L4152c6200n0261I762a92435l20030F0421
11963A34140b779m707k21555R8594N4762C5519K4415Q33O8691j0584b40073H4832
11950b44493A00129b57037I0968P1777b3974j22926j87227A55502R9511A1232
$$ plain form
11939 -29491 -57210 -69511 -149450 203689 16676 418527 184170 -223820 20354 -97816 -50517
11928 -50517 -170448 560 61878 70314 58634 139415 63435 -156227 96758 -219546 202480
11916 135398 -13237 74305 85743 -80490 4755 -374869 -97264 -264739 -181600 -122046 -91090
11905 -91090 -307983 -251777 413729 70533 -93143 -127382 -10807 88769 69938 160781 -368174
11893 -158013 83963 -114722 90778 -116362 -301177 -108137 -79209 147036 -187089 155418
11882 -231316 119983 -903 -449210 144581 272371 95497 92890 -141951 -241447 85276 -48256
11870 71791 60720 112031 120695 -34832 29631 -42739 237385 -52057 -211285 -34367 241499
11858 -262881 158416 -132612 58449 87165 -112676 140567 77045 -105661 -468558 -97644
$$ packed form
11939b9491k7719j2301p9939B03689A6676M01851A84170b23820B0354i7816M7299
11928e0517j19931E60O1318Q436j1680Q0781F3435a56227I6758b19546B02480
11916A35398a3237G4305J1438h0490D755c74869i7264j67475Q3139N9554L0956
11905i1090k16893N6206D13729G0533i3143l4239a0807H8769j8831R0843c68174
11893a58013H3963a14722I0778a16362j84815a08137K8928A47036a87089A55418
11882b31316A19983i03m48307A44581J27790I5497k607a41951r9496H5276d8256
11870G1791j1071N1311Q664c4832B9631d2739B37385e2057j59228c4367B41499
11858b62881A58416a32612E8449K8716a12676A40567o3522a05661l62897i7644
$$ plain form
11847 5724 116347 9620 79458 -6472 -98559 -204617 52498 -93949 25533 -131151 -259153
11836 -259153 -443450 -203577 29480 -196643 49103 -773 81435 7502 -126783 158757 -50367
11824 -21129 -3388 5424 15975 291826 96330 -175905 240563 172732 -46162 -274773 308513
11812 152260 25033 -173308 152848 -21482 17332 -12749 -245519 63866 98633 70353 -4 92647
11799 189209 48112 -118019 -239763 -69959 -14913 -74979 -357352 -218571 252629 -131030
11788 125396 -110674 -63449 32418 -86571 109318 323895 239925 361597 -294480 5396 186621
11777 186621 -45292 -92502 123367 23107 -90796 62045 -348802 -283295 -238945 157024 114444
11766 114444 48383 106369 69644 127404 -405829 -213898 362972 -61606 12364 110103 -76425
$$ packed form
11847E724J10623I620O9838f472r2087j06058E2498i3949B5533a31151j28002
11836b59153j84297b03577B9480a96643D9103g73H1435G502a26783A58757e0367
11824b1129c388E424J0551K75851I6330a75905B40563o7831d6162k28611C08513
11812A52260B5033a73308A52848b1482A7332a2749k32770F3866L4767k8280dI2647
11799A89209D8112a18019j21744f9959a4913o0066k82373J38781B52629a31030
11788A25396a10674M7225C2418h6571A09318K14577q3970J21672b94480E396J81225
11777A86621d5292m7210A23367B3107i0796F2045c48802O5507M4350A57024m2580
11766A14444D8383N7986l6725N7760d05829J91931C62972f1606A2364R7739g6425
$$ plain form
11754 69635 -114946 64834 259328 -241115 -138923 195595 121915 -51484 25168 150707
11744 150707 3058 185600 -17677 -57712 -159158 -76026 -225124 150800 357119 -17696 -4773
11732 79899 35242 192119 121819 -101120 86734 121754 111763 -75112 253995 186566 -64678
11720 -30597 101294 228341 -261667 -118272 -120968 245057 109440 -120382 -234545 106576
11709 -27369 -53278 -210857 12931 82087 98218 206526 -106286 -218822 130208 -52246 -92986
11698 -92986 -330422 -70957 44106 306188 -42623 13134 -97166 -14218 -54496 -55213 145821
11686 53164 70903 -88809 -218997 -87154 -311004 -200563 -308265 -99124 -55188 99969 6927
11674 -264936 -11157 -89846 212152 -49012 100374 -133364 -217351 -103945 24805 203689
$$ packed form
11754F9635a14946F4834J94494b41115J02192A95595p3680e1484B5168J25539
11744A50707C058J82542a7677m0035j01446g6026j49098A50800K06319a7696d773
11732G9899C5242J56877p0300a01120H6734L5020r991g5112B53995o7429f4678
11720c0597A01294J27047b61667a18272k696B45057A09440a20382j14163A06576
11709b7369k5909j57579A2931O9156J6131J08308a06286j12536A30208e2246m0740
11698i2986k37436g0957D4106K62082d2623A3134i7166a4218m0278p17A45821
11686E3164J7739h8809j30188h7154k23850J10441j07702i9124M3936I9969F927
11674b64936a1157p8689B12152d9012A00374a33364q3987a03945B4805J78884
$$ plain form
11664 203689 143027 -61297 -4757 -51959 111154 -186045 98845 -75357 112487 178626 -152963
11652 250731 138128 125071 252040 52820 -33633 -133583 225651 -101553 -214258 -150936
11642 -150936 50385 140919 57901 -22135 -24948 -201494 21560 65601 37748 -36152 111984
11630 443996 -69930 185859 -108753 -50475 220282 135697 -275343 140874 8903 253866
11620 253866 -30435 48433 6077 -70689 -85678 -16455 339625 -129111 -91679 -198793 -941
11608 -185344 15667 117118 333449 44309 102429 -87194 141773 109927 -18270 -3369 266385
11596 82978 87550 -128297 -49063 162573 -4982 264488 165218 381822 48398 397718 -140301
11584 213147 -37803 134364 305106 164348 -194769 -676 -224757 129123 -144130 49083
$$ packed form
11664B03689o0662f1297d757m7202A11154a86045I8845g5357A12487O6139a52963
11652B50731j12603j3057J26969E2820c3633r9950B25651a01553j12705O3322
11642a50936E0385R0534E7901b2135k813j76546B1560M4041k7853c6152A11984
11630D43996f9930A85859a08753e0475B20282q4585b75343A40874H903K44963
11620B53866c0435D8433F077g0689j4989a6455C39625a29111L7432j07114i41
11608a85344A5667J01451K16331D4309N8120h7194A41773l1846a8270c369B66385
11596H2978M572a28297d9063A62573d982B64488r9270K16604D8398L49320a40301
11584B13147c7803A34364J70742j40758a94769f76k24081A29123a44130D9083
$$ plain form
11573 253345 24538 -50354 83738 -141026 74398 460123 152980 22575 -15070 25046 360651
11562 360651 15303 -40574 -6803 17172 453240 96203 -19751 363919 99363 141413 -147648
11550 81545 152652 316110 -97858 -267311 -26263 352043 146388 182681 154019 29834 196551
11539 196551 117261 -83781 405477 135300 292882 -74213 -111557 -333750 18508 65319 -35263
11527 74046 308938 -85570 -15988 5335 131716 -13036 33094 -10983 9820 45979 -23675 61382
11514 -143556 234599 75595 147973 -241314 -13910 -21351 258790 199870 208903 18267 -183863
11502 73667 387715 -113268 119799 -165 -12548 -148022 -15523 73652 161188 215750 140341
11491 140341 452863 346701 -42215 147905 160306 185761 -63549 70997 447491 58166 151810
$$ packed form
11573B53345B4538e0354H3738a41026G4398L85725A52980B2575a5070B5046L35605
11562C60651A5303d0574f803A7172M36068I6203a9751C63919I9363M2050a47648
11550H1545P1107J63458i7858j69453b6263C52043A46388L6293k8662B9834J66717
11539A96551p9290h3781D05477A35300J57582g4213l7344k22193A8508M6811c5263
11527G4046K34892h5570a5988E335J26381a3036C3094a0983I820L6159b3675F1382
11514a43556B34599G5595P2378b41314a3910p441B58790n8920R033A8267a83863
11502G3667L14048a13268A19799a65j2383j35474a5523G3652Q7536N4562p5409
11491A40341L12522j06162d2215A47905J2401K5455f3549G0997L76494E8166R3644
$$ plain form
11480 151810 67186 -13222 81198 -18507 -77412 55754 291640 163588 355415 -31988 45922
11468 225732 310658 368318 136263 -63641 324165 -219325 98705 68777 19654 8055 -48599
11456 -8477 152970 164123 87449 -87565 108513 14953 373769 46137 -14472 -48087 -69597
11445 -69597 161137 77201 54847 -165218 149754 -67364 188557 41384 223129 227064 72742
11433 -7585 231555 133820 -232694 5050 -93740 382384 -171785 -166016 -225220 -64602 31887
11421 156794 -44747 73813 -39269 187687 -345534 -198594 -58538 -63647 268280 40750 132986
11410 132986 304553 -296226 25366 88562 144293 100641 -141499 -26447 107054 -91201 66
11398 174147 96516 106335 -318726 -212494 -84165 211567 87671 54221 217478 -109613 -47908
$$ packed form
11480A51810F7186a3222H1198a8507n8905E5754K35886j28052J91827c1988D5922
11468B25732Q4926N7660A36263f3641C24165b19325I8705k9928A9654H055d8599
11456h477A52970J1153p6674h7565A08513A4953L58816D6137a4472l3615k1510
11445f9597A61137G7201k2354a65218A49754f7364A88557D1384J81745L935G2742
11433g585B31555r7735b32694E050i3740C82384a71785N769n9204f4602C1887
11421A56794d4747G3813c9269A87687c45534J46940e8538n109B68280D0750R2236
11410A32986J71567b96226B5366O3196N5731m3652a41499b6447A07054i1201F6
11398A74147p7631R819c18726J06232h4165B11567H7671l3450J63257a09613d7908
$$ plain form
11386 -57833 168742 -327849 114343 -217816 -84374 -119087 236896 -39643 181764 -205486
11375 150818 253565 -6993 324991 -221360 -257103 -1377 -14816 -39177 -178506 48890 71941
11364 71941 -123316 -101775 -219990 129558 -142584 29214 144129 -133386 166603 84104
11354 84104 189 64726 51641 -268537 134069 -106075 -164977 -109329 12436 27543 162331
11343 162331 189313 -85492 -59070 189486 -6159 29867 -117042 53310 218305 -244703 -17558
11331 66688 66420 -215973 -246527 -172321 91638 -166326 -114951 -295999 316582 -234760 383106
11319 -234541 -146529 221342 -88106 366663 -362909 -128829 -61876 -118951 -238256 -72638
11308 -8593 98097 277518 12905 -36984 -364847 163974 159412 314951 -311662 -48757 -418727
$$ packed form
11386e7833A68742c27849A14343b17816h4374l4713B36896c9643A81764b05486
11375A50818J02747f993C24991b21360l5743a377j3439k4361j39329D8890K3051
11364G1941a23316K1541j18215A29558a42584B9214J14915a33386A66603q2499
11354H4104A89O4537j3085b68537A34069a06075n8902N5648A2436J5107J34788
11343A62331K6982h5492K6422A89486f159B9867a17042E3310J64995b44703a7558
11331F6688k68b15973l0554P4206I1638a66326N1375j81048C16582b34760C83106
11319b34541Q8012B21342h8106C66663c62909a28829f1876n7075j19305g2638
11308h593I8097J79421A2905c6984l27863A63974m562J55539c11662d8757l69970
$$ plain form
11297 -418727 -74734 -75078 47486 -184946 -342063 219747 -257599 -145063 -226401 -247376 -162656
11286 -162656 -293469 -60468 -55891 179682 -95412 30734 -129386 136543 -111692 -235347
11276 -235347 -99719 151772 -2806 52126 339723 -73811 61534 181908 -12689 301358 -114464
11264 -333123 -270653 61027 -93825 124555 -167274 -331643 -321220 -81766 109857 2075 -37225
11252 -151241 186855 -167664 50493 -327900 93244 304230 10777 -24175 -172542 105559
11241 -266899 -363910 -50936 -60244 -95569 206021 246902 -173602 206506 209878 53920 210658
11230 210658 106235 -230914 -301311 24645 38531 144114 -138120 116353 -53529 -77183
11220 -77183 72426 73749 -60301 124413 -166839 -212433 -194457 -37813 33872 318163 -17593
$$ packed form
11297d18727g4734l44D7486a84946j57117B19747b57599J12536q1338k0975Q4720
11286a62656j30813f0468M577A79682i5412C0734a29386A36543a11692j23655
11276b35347i9719A51772b806E2126K87597g3811F1534J20374a2689C01358a14464
11264c33123O2470F1027i3825A24555a67274j64369J0423h1766A09857B075c7225
11252a51241A86855a67664E0493c27900I3244K10986A0777b4175j48367A05559
11241b66899r7011e0936r308l5325B06021M0881a73602B06506L372E3920J56738
11230B10658j04423b30914p0397B4645J3886J05583a38120A16353e3529k3654
11220g7183G2426J323f0301A24413a66839m5594J7976c7813C3872K84291a7593
$$ plain form
11208 -198221 6157 -148986 -99717 -139655 77909 -223891 13200 -6069 41365 400981 38527
11196 96910 -357825 138345 -96985 -246071 -204831 116130 -93029 -375385 17396 -123698
11185 -148187 120616 -90372 -34649 -158806 40445 -360928 -186179 92108 79239 183192
11175 183192 -86212 -161598 167160 72788 -55203 145102 53096 -136158 184200 205347 -273682
11163 -51344 86741 192924 333844 -104106 31380 130397 53698 115173 310912 -187270 -131850
11152 -131850 -246089 159257 -133700 431782 56077 -76786 -392881 -236224 -78317 166362
11141 -218802 376467 145223 252351 193096 -366820 204597 198279 50931 243746 -58621
11130 368024 -519422 -201791 283089 89643 93451 -120606 59828 -125298 -383549 242063
$$ packed form
11208a98221F157a48986M9269l9938G7909b23891A3200f069D1365L59616C8527
11196I6910c57825A38345i6985j49086M1240A16130i3029k82356A7396a23698
11185a48187A20616i0372c4649j24157D0445c60928J74749I2108j2869J03953
11175A83192h6212p5386A67160G2788e5203A45102E3096a36158A84200K1147b73682
11163e1344H6741J06183J40920a04106C1380R9017E3698O1475J95739a87270N5420
11152a31850j14239A59257a33700D31782E6077g6786l16095J56657g8317A66362
11141b18802C76467A45223J07128n9255c66820B04597o318E0931J92815e8621
11130C68024e19422b01791B83089H9643L808a20606E9828a25298k58251B42063
$$ plain form
11119 -29552 -121566 -280063 147281 24284 -93702 135167 9670 143330 151802 86884 94536
11108 94536 270647 1272 -216990 20113 -75728 172225 297846 137839 -34817 18081 64074
11097 64074 116741 449345 65196 406416 260074 222994 15269 445260 -26731 343064 -175679
11085 189165 366202 407900 407671 304207 443923 267085 128834 78530 -255555 45942 344708
11074 344708 317362 424572 60477 4719 698967 317699 352671 423563 49330 563802 348994
11063 348994 224125 488547 416057 405495 645783 259457 509013 428796 417722 523301
11053 523301 411143 646299 900310 618926 690074 604304 761510 475007 241651 758424
11043 758424 676971 635260 564915 828190 694601 581623 706219 613023 681290 654907 624536
$$ packed form
11119b9552r2014j58497A47281B4284i3702A35167I670J33660Q472o4918P652
11108I4536J76111A272b16990B0113g5728A72225J25621A37839c4817A8081M5993
11097F4074N2667L32604F5196L41220j46342l7080A5269M29991b6731C43064a75679
11085A89165J77037M1698k29j03464J39716j76838A28834n0304b55555D5942K98766
11074C44708k7346J07210F0477D719O94248C17699L4972P0892D9330N14472k14808
11063C48994j24869K64422p2490j0562K40288B59457K49556q0217j1074J05579
11053E23301j12158K35156K54011k81384P1148q5770J57206k86503k33356N16773
11043G58424q1453m1711p0345K63275j33589j12978J24596r3196O8267k6383l0371
$$ plain form
11032 624536 772866 572816 471463 691542 776980 521719 610440 793287 417136 677705
11022 677705 840113 616922 802137 661752 794204 664224 637252 464847 561618 521831
11012 521831 637358 203812 452703 180401 280437 712362 610597 1005241 993549 789137
11002 789137 555384 747346 567818 580751 584210 423731 825654 831117 462557 686102
10992 686102 762651 810954 846864 952193 793452 811163 1117229 506409 1089581 894879
10982 894879 756943 722884 1237971 1286334 1602601 1488184 1448304 2030580 2350186 2460452
10972 2460452 2514780 2974845 2949704 2929099 2619856 2427148 1981176 1954370 1616633 1272544
10962 1272544 1641714 1492957 1389450 1443402 1854327 1636021 1709642 1592002 1340865 1506563
$$ packed form
11032F24536J48330k00050j01353K20079Q5438k55261Q8721J82847l76151K60569
11022F77705J62408k23191J85215j40385J32452j29980k6972j72405R6771l9787
11012E21831J15527B03812K48891A80401J00036M31925j01765L94644j1692k04412
11002G89137k33753J91962j79528J2933L459j60479M01923N463l68560K23545
10992F86102P6549M8303L5910J05329j58741J7711L06066E06409N83172j94702
10982H94879j37936l4059N15087M8363L16267j14417l9880N82276L19606J10266
10972B460452N4328M60065k5141k0605l09243j92708m45972k6806l37737l44089
10962A272544L69170j48757j03507N3952M10925k18306P3621j17640k51137J65698
$$ plain form
10952 1506563 1347691 1124423 886151 771610 574454 417131 365488 294814 279177 109351
10941 191965 240376 331776 10322 218202 27471 289601 -5308 -4071 -38923 -138304 83797
10929 398809 -23528 -208633 -53873 9459 -80699 499266 21407 25164 229166 945 41940 159710
10917 159710 -359783 65472 217889 46896 97912 -153212 42428 197375 109001 -73905 311729
10905 -62229 185977 -29928 297397 72552 -227111 162751 -145377 36857 302319 -148318
10894 134760 -104148 -48238 -148503 43208 122683 -51405 49993 12678 215707 -389851 216746
10882 272385 -42994 112925 -83418 420594 -141687 -5453 140389 -32235 -73812 16277 -293115
10870 113299 87843 192904 -124162 156104 -84107 -304895 -31350 -862 492304 -252825 68697
$$ packed form
10952A506563j58872k23268k38272j14541j97156j57323n1643p0674j5637A09351
10941A91965M8411R1400A0322K07880B7471K62130e308J237l4852r9381H3797
10929C98809b3528j85105e3873I459h0699D99266B1407L757K04002I45M0995J17770
10917A59710c59783F5472J52417D6896N1016a53212D2428J54947q8374g3905C11729
10905f2229A85977b9928B97397G2552b27111A62751a45377C6857K65462a48318
10894A34760a04148d8238j00265D3208P9475e1405D9993A2678K03029c89851B16746
10882B72385d2994A12925h3418D20594a41687e453A40389c2235m1577A6277b93115
10870A13299k5456J05061a24162A56104h4107k20788c1350h62D92304b52825F8697
$$ plain form
10858 -222303 -306161 -271863 14215 -77448 -56416 -146199 -101417 -53148 -175108 33899 112362
10847 112362 159092 106325 224087 -119755 93115 313743 683 -397827 -352069 387083 63449
10835 -26096 -192458 98316 -113286 -40640 393365 -18298 -215479 -7927 28339 -224077 -76377
10823 -152130 146425 -350567 -230133 128866 32236 198470 -374688 -342953 -306753 172020
10812 -94571 -125366 42304 -45290 -176786 -117008 -54539 58805 -299488 -419422 -35591 -154804
10801 -154804 -192348 43385 -407680 -148815 -66643 -95072 10717 -3889 3658 27604 70292
10790 70292 370121 178779 -49513 -31437 -86326 10049 314534 242725 -99474 -3970 -191134
10779 -191134 108449 137673 51186 -69038 23392 -127566 -236995 430341 -189942 147727
$$ packed form
10858b22303q3858L4298A4215g7448K1032q9783M4782M8269j21960C3899P8463
10847A12362M6730n2767J17762a19755I3115K20628F83c97827M5758C87083F3449
10835b6096j66362I8316a13286d0640C93365a8298j97181g927B8339b24077g6377
10823a52130A46425c50567J20434A28866C2236J66234c74688L1735L6200A72020
10812i4571l0795D2304d5290j31496N9778e4539E8805b99488j19934c5591j19213
10801a54804l7544D3385d07680a48815f6643k8429A0717c889C658K3946M2688
10790G0292K99829A78779d9513J8076n4889A0049L04485p1809i9474c970j87164
10779a91134A08449K9224E1186f9038B3392a27566j09429D30341a89942A47727
$$ plain form
10768 117102 154914 3337 125544 -100612 -268957 -51738 259010 -96729 -329286 -61832 291989
10756 100821 -237725 46794 -269282 171315 247029 -91231 50690 -9921 -153981 -111278 -17753
10744 8182 -121146 -54791 48382 55509 -255541 148405 -99694 71592 -242976 50571 79409
10733 79409 -34414 -62050 -97173 3745 -14810 384633 -63514 -18988 210428 -307322 60372
10721 279242 -54111 -133188 -143709 -105268 -40079 100813 118745 -14617 -300195 -284538 1483
10709 -235535 -367991 -215819 139946 -330560 -127491 -305758 240702 258413 184800 -59263
10698 59382 365468 51065 122162 -59202 370504 -212730 -201822 48249 18492 -446004 -125849
10686 100063 267819 346129 -25680 -104993 56247 153951 -108655 -86373 80674 67146 75366
$$ packed form
10768A17102L7812C337J22207a00612j68345e1738B59010i6729k32557f1832B91989
10756A00821b37725D6794b69282A71315P5714i1231E0690i921j44060M2703a7753
10744H182a21146e4791D8382P127b55541A48405i9694G1592b42976E0571K8838
10733G9409c4414k7636l5123C745a4810C84633f3514a8988B10428c07322F0372
10721B79242e4111p9077j0521L8441d0079A00813J7932a4617k85578J5657A483
10709b35535j32456J52172A39946c30560a27491j78267B40702J7711p3613e9263
10698E9382L06086E1065P1097e9202C70504b12730J0908D8249A8492d46004a25849
10686A00063J67756P8310b5680p9313E6247R7704a08655K2282H0674j3528Q220
$$ plain form
10675 75366 7666 -167554 -68650 -148763 110254 -173410 -162743 -237081 -256169 -371995 -71550
10663 223634 61400 -226332 -196489 120259 84255 130482 -145456 -158287 -41990 15246 20881
10652 20881 -97532 102237 -4740 -65327 -35658 -270267 418837 -146681 191173 -92233 -611451
10641 -611451 91220 -288676 -60734 -285713 -130627 -105071 -62464 96579 26471 56364 23731
10629 -112387 14412 -343767 -335643 -44251 -23705 -2047 -65829 29794 -76981 -25959 -60471 -29767
10616 124590 65945 -100831 134970 -54533 -126767 59763 -86396 -131609 -210073 -221321 -161284
10605 -161284 -76651 -185879 -297842 177443 -382711 107045 337495 100451 -65059 -146973
10595 -146973 52438 -219816 -1398 38836 212654 382134 -37459 -100064 -127945 -32871 45755
$$ packed form
10675G5366G666a67554f8650q0113A10254a73410J0667p4338j9088j15826g1550
10663B23634F1400b26332K9843A20259l6004M6227a45456j2831d1990A5246N635
10652B0881i7532A02237d740o0587K9669k34609D18837a46681A91173i2233n19218
10641f11451I1220b88676f0734k24979a30627K5556M2607I6579B6471K9893B3731
10629a12387A4412c43767Q124d4251K0546b047o3782B9794g6981b5959l4512b9767
10616A24590n8645a00831A34970e4533p2234E9763h6396m5213p8464j1248O0037
10605a61284g6651j09228j11963A77443c82711A07045K30450A00451f5059q1914
10595a46973E2438b19816a398C8836J73818J69480c7459o2605k7881c2871D5755
$$ plain form
10583 281802 -316724 198937 60027 -38577 69935 -265655 -141378 33086 -282052 -434858
10573 -434858 -266057 -347297 -163725 -119411 48264 61814 -225045 140116 -116962 395605
10562 95580 11367 226544 213877 76210 45644 -336144 -81667 7034 33318 -291740 323762
10550 -9195 -38619 -231079 18315 -87741 -273394 23123 -26376 43177 -260429 -108701 -30299
10538 -417092 -112128 -137059 -143522 -232528 214 302568 -214968 126016 93785 -185026 -121929
10527 -121929 -256399 219496 -7776 -151530 -6297 -32327 -302732 -216510 -480252 221602 -273497
10515 -173335 -71800 -106404 -147893 -9134 -218727 120106 -71812 -100902 -179857 -236364 -198027
10504 -198027 55360 170510 121798 -321633 89575 5851 96312 -99572 -374915 55689 -124766
$$ packed form
10583B81802c16724A98937F0027c8577F9935b65655J24277C3086b82052j52806
10573d34858J68801q1240a63725M4314D8264J3550b25045A40116a16962C95605
10562I5580A1367K15177j2667G6210l0566c36144h1667G034K6284b91740C23762
10550i195k9424j92460A8315h7741j85653B3123b6376D3177b60429a08701c0299
10538d17092a12128k4931o463q9006B14L02354b14968A26016l2231a85026O3097
10527a21929j34470B19496g776j43754f297k6030k70405Q6222k63742B21602b73497
10515a73335g1800l4604m1489i134k09593A20106g1812k9090p8955n6507L8337
10504a98027E5360J15150m8712c21633H9575E851R0461i9572k75343E5689a24766
$$ plain form
10492 -49757 -222288 194070 72398 155412 -228656 59517 -340639 -314090 230585 428596
10482 428596 300679 462507 515576 362360 367749 140319 300488 -3391 -13507 204328 -24240
10470 131132 -103365 -69908 58269 -176571 -48490 50798 204099 -118605 24697 -21902 118322
10458 233270 -6649 94975 -51179 54772 -189399 151337 -608579 111395 36655 -39672 -459795
10447 -459795 -220252 191012 -134451 14555 143977 -59586 10513 358240 -11254 -275351
10437 -275351 9041 32936 -51301 -127136 97794 -218619 -289538 -146069 60848 91235 46784
10426 46784 -338845 -33633 296681 -52343 19881 100433 172395 -4441 255665 -105768 16222
10414 -124126 119344 373563 -128909 -47827 -107164 -60109 -538319 229355 184156 365567
$$ packed form
10492d9757j72531A94070G2398Q3014b28656E9517c40639K6549B30585J98011
10482D28596j27917J61828N3069j53216N389A40319J60169c391j0116B04328b4240
10470A31132a03365L3457E8269a76571d8490E0798J53301a18605B4697b1902A18322
10458B33270f649I4975e1179E4772a89399A51337f08579A11395C6655c9672m20123
10447d59795b20252A91012a34451A4555J29422e9586A0513L47727a1254k64097
10437b75351I041K3895e1301p5835I7794b18619p0919J43469F0848L0387m4451
10426D6784c38845c3633B96681e2343A9881Q0552P1962d441B55665a05768A6222
10414a24126A19344K54219a28909d7827n9337M7055m78210B29355m5199J81411
$$ plain form
10404 365567 -276119 6716 -296519 -108193 -10950 191663 24368 43837 206911 121593 327684
10393 327684 161839 318277 44752 232626 301892 -86896 307875 227047 146664 299339
10383 299339 -2655 -189229 224772 349753 218444 35002 236770 217630 553493 268295
10372 97619 280878 407443 418434 431038 454800 339416 405550 305613 138739 542866 2060
10360 319546 -125248 -5239 358203 57761 69236 61953 -97346 284300 348034 212758 517900
10349 517900 528548 147339 439650 317603 275811 253291 226245 321022 -115875 188259
10338 287373 265095 190194 106921 607267 428687 293849 257866 -44004 -188664 58301 -17092
10326 214929 244778 426061 113568 36059 386809 385908 -6262 -321230 311039 -165268 236047
$$ packed form
10404C65567b76119F716b96519a08193a0950A91663B4368J9469J63074q5318K06091
10393C27684A61839J56438D4752J87874O9266h6896C07875q0828q0383J52675
10383B99339b655j86574B24772J24981j31309C5002K01768j9140L35863B68295
10372I7619J83259J26565J0991J2604K3762j15384O6134r9937A38739M04127B060
10360C19546a25248e239C58203E7761J1475p283i7346B84300O3734j35276L05142
10349E17900J0648A47339K92311j22047m1792k2520k7046R4777a15875A88259
10338B87373k2278p4901q3273N00346j78580j34838l5983d4004j44660E8301a7092
10326B14929K9849J81283A13568C6059L50750r01f262l14968C11039a65268B36047
$$ plain form
10314 586613 -263172 -173113 -76677 144202 -30769 -320074 -102733 96795 -76515 23725 43532
10303 43532 21931 -59113 166496 -58779 -191533 -178529 5840 -3850 289508 59010 160560
10292 160560 -219241 68991 -49320 -87027 -242163 -186952 -234553 109322 190128 243894 -100461
10280 -104434 -20696 -255256 -186387 -197340 -111945 -143209 -9827 123531 -34603 211668 -140485
10268 -103627 142905 6645 -182542 208497 389937 111098 69066 70726 145898 373448 -94346
10256 105128 176899 -82144 98989 -111881 -62701 -194693 -101263 45632 104892 -14785 -97994
10245 -97994 -34480 -226982 69439 208390 -97557 162952 -17375 187125 -259583 -46350 -74825
10234 -74825 148094 -273221 -88265 -232204 76589 60505 -181244 -395391 5159 269749 -327302
$$ packed form
10314E86613b63172R0059g6677A44202c0769k89305a02733I6795g6515B3725J9807
10303D3532k1601e9113A66496e8779j32754J3004E840c850B89508E9010J01550
10292A60560b19241F8991d9320l7707j55136N5211m7601A09322Q0806N3766a00461
10280a04434b0696k34560O8869j0953Q5395l1264i827A23531c4603B11668a40485
10268a03627A42905F645a82542B08497J81440A11098m2032J660P5172K27550i4346
10256A05128P1771h2144I8989a11881M9180j31992R3430D5632N9260a4785q3209
10245i7994c4480j92502F9439J38951i7557A62952a7375A87125b59583d6350k8475
10234g4825A48094b73221h8265j43939G6589j6084a81244k14147E159K64590c27302
$$ plain form
10222 -134695 166397 312705 -105678 80720 -57154 -189510 -115713 10228 -131391 31506
10211 50400 132964 -220264 -97301 -215948 -74435 -211791 -22572 -127358 -161552 28918 186661
10200 186661 -52525 -352840 -159685 118278 -32019 -427789 -153054 90459 -55826 57104
10189 165819 -466680 -97125 -214715 27023 -121460 -397393 -8663 -220272 -75581 158005
10178 8762 -164259 -234975 68396 -165275 -16721 -175389 69596 -88549 94416 -153681 -221010
10167 -221010 -43276 70161 -160120 -171688 73546 -11341 277329 26469 274320 211633 -17830
10155 93988 -128906 208030 -58087 -23099 96115 280849 144063 173561 -78948 -532618 -133142
10143 -141573 190475 -49089 -76401 2223 -262478 -434824 182956 -292609 150456 -55677
$$ packed form
10222a34695A66397J46308a05678H0720e7154j32356P3797A0228a31391C1506
10211E0400Q2564b20264i7301j18647g4435j37356b2572j04786l4194B8918J57743
10200A86661e2525l00315a59685A18278c2019l95770a53054I0459e5826E7104
10189A65819d66680i7125j17590B7023a21460k75933h663k11609g5581A58005
10178H762a64259p0716F8396a65275a6721j58668F9596h8549I4416a53681o7329
10167b21010d3276G0161a60120j1568G3546a1341B77329B6469K47851o2687a7830
10155I3988a28906B08030e8087b3099I6115J84734j36786K9498g8948m53670a33142
10143a41573A90475d9089k7312B223b62478j72346A82956b92609A50456e5677
$$ plain form
10132 -326812 -125458 141679 -119706 -78626 -237519 161111 117142 -105069 -326134 -11968
10121 1643 38907 -58629 23652 -183795 -46799 300032 30604 -282594 242738 -43140 -302871
10110 -302871 -82033 156368 -465630 3205 70490 -191006 156927 48441 -176740 267428
10099 -146234 -157801 -92510 -57485 -26632 -389837 -83967 -83148 -332339 -349062 28991 -13735
10087 -24137 -112337 -22931 62378 -134669 -200559 34351 -208031 64657 311454 47525 61596
10076 61596 -191383 -94471 2078 -110519 -117297 -241915 165362 -185283 -175339 84152 159570
10065 159570 57885 51324 79034 105187 221794 32439 -38067 136311 -297007 41668 84584
10054 84584 313944 -152739 -115126 136924 -91617 -440540 -321575 224158 -158094 -501256
$$ packed form
10132c26812a25458A41679a19706M1080j58893A61111m3969a05069k21065a1968
10121A643L7264e8629B3652a83795d6799C00032C0604b82594B42738d3140k59731
10110c02871h2033A56368d65630C205O7285a91006A56927D8441a76740B67428
10099a46234j1567O5291L5025b6632l63205h3967Q19k49191j6723B8991a3735
10087b4137q8200b2931F2378a34669o5890C4351b08031F4657K46797D7525J4071
10076F1596a91383i4471B078a10519o778j24618A65362a85283R944H4152P5418
10065A59570E7885o561K7710K6153J16607C2439c8067A36311b97007D1668M2916
10054H4584K29360a52739L7613A36924i1617l48923J18965B24158a58094l43162
$$ plain form
10044 -501256 -155289 111751 -337253 -188539 -92044 -456551 -93754 134761 25486 138724
10034 138724 -15115 254377 222015 125563 -47004 -150877 153177 -191304 253610 -38344
10023 -94924 -59121 161639 -295944 112530 -226967 -126849 -378951 -241220 -67100 178654
10012 381137 -26862 73268 -99071 -226 66529 -106560 -285958 -93272 -427257 -236547 84180
10000 -2483 165207 -51021 -104115 -237601 -151391 -418186 -121805 -10333 -172416 -9594 -195499
9989 -195499 -248474 111624 -111670 -20006 240327 -188446 38396 -303647 110350 -179531
9978 -93407 -408623 -73934 -185631 -238776 -99090 -348775 -43215 144342 122280 48408 -121097
9966 -25873 -93175 -36386 -352691 37319 129044 56070 165822 182680 27386 -109210 -139107
$$ packed form
10044e01256a55289A11751c37253J48714i2044l64507i3754A34761B5486J13238
10034A38724a5115B54377l2362r6452d7004j03873A53177a91304B53610c8344
10023i4924L5803A61639b95944A12530b26967J00118k52102J37731f7100A78654
10012C81137b6862G3268i9071b26F6529a06560j79398i3272l33985J90710H4180
10000b483A65207e1021n3094j33486Q6210k66795a21805a0333j62083i594j85905
9989a95499n2975A11624a11670b0006B40327a88446C8396c03647A10350a79531
9978i3407l15216g3934j11697n3145i9090k49685d3215A44342k2062D8408a21097
9966b5873o7302c6386l16305C7319R1725E6070J09752J6858B7386a09210k9897
$$ plain form
9955 -139107 -80305 -314745 53049 -170497 -229415 -221662 -395835 12879 -221750 -88390 -195661
9944 -195661 -358214 140703 -227771 -282174 -153282 1418 59616 -55197 -219116 -238492 -300435
9933 -300435 213477 -165683 -77646 86752 -314106 47308 -166099 14690 -61741 217657 -112356
9921 125039 -132255 -7057 -159252 -105359 -33040 127885 9685 -170933 -30591 1102 -155744
9909 501 57939 -60833 -217228 13841 -134351 -124841 -83837 -14291 -304445 -106231 -10329 -32396
9897 -32396 66525 410985 -305395 284027 -305490 -30350 -113759 -20901 -220787 -200809 -86207
9885 303590 146796 -60468 196078 -49399 -119173 -45745 -222352 -71567 -60542 -5001 -196636
9874 -196636 -423809 -219183 -131396 10294 4882 56684 -319290 42966 -336274 -62254 11083
$$ packed form
9955a39107N8802k34440E3049a70497n8918P753j74173A2879b21750h8390j07271
9944a95661j62553A40703b27771n4403J28892A418N8198e5197j63919j9376o1943
9933c00435B13477a65683g7646H6752c14106D7308a66099A4690f1741B17657a12356
9921A25039a32255g057j52195N3893c3040A27885I685a70933c0591A102a55744
9909E01N7438f0833j56395A3841a34351R510M1004a4291k90154a06231a0329k2067
9897c2396F6525L44460c05395B84027c05490c0350q3409b0901j99886J9978h6207
9885C03590A46796f0468A96078d9399o9774d5745j76607g1567J1025e001j91635
9874a96636k27173K04626Q7787A0294D882N1802c19290D2966c36274f2254A1083
$$ plain form
9862 -42973 -191586 39422 -394532 -139876 209144 -71586 -224220 -66686 118717 -228239
9851 -303344 -67300 -94272 -348218 57067 -146037 66324 144954 232323 -7703 -278993 -210203
9840 -210203 182270 -520919 -458094 177913 64824 -407676 -83193 132625 158296 198233 28610
9828 148530 -308274 113495 7370 -255741 5597 -98905 -56777 84954 187934 -58278 -317107
9817 -317107 -229716 420724 103928 -85949 -69032 347224 147956 137924 -18673 -305548 -198086
9806 -198086 -29869 240715 -3041 -43235 98338 -363954 83950 -95972 -115113 324868 85971
9794 -306045 196359 -132387 -221581 -69194 -104431 -235961 -272277 -372594 119926 -282696
9783 -129377 -253433 111726 70817 -380102 23487 -345001 -201827 53134 -120605 -277375
$$ packed form
9862d2973j48613C9422c94532a39876B09144g1586j52634f6686A18717b28239
9851c03344f7300k6972k53946E7067a46037F6324P8630Q7369g703k71290O8790
9840b10203A82270e20919O2825A77913F4824d07676h3193A32625K5671L9937B8610
9828A48530c08274A13495G370b55741E597i8905M2128H4954J02980e8278k58829
9817c17107Q7391D20724A03928h5949J6917C47224A47956j0032a8673k86875J07462
9806a98086b9869B40715c041m0194I8338c63954H3950i5972j9141C24868H5971
9794c06045A96359a32387q9194f9194l5237j31530l6316j00317A19926b82696
9783a29377j24056A11726m0909c80102B3487c45001J43174E3134a20605j56770
$$ plain form
9773 -277375 -8461 -239842 156574 124059 8449 -197511 55335 51014 157369 -190642 -74355
9761 -93098 -183962 111527 -10714 -181025 276938 -5263 -327206 -167376 13404 -308630 -74776
9749 -88733 -310735 -234032 208191 318713 149926 105429 -208038 218653 -377461 -57620
9738 -138966 -86116 144977 72288 -231420 -98182 -132465 5031 -29768 -75901 -119264 122815
9726 -147397 122970 261735 -107923 -325643 -50348 13303 -53601 -80334 -217574 -1083 -234365
9715 -234365 -184538 -11097 218610 97969 -121183 -123099 -294579 -413017 -58252 -119960 57232
9703 43606 -46842 181885 165949 4093 -124933 -106232 -73773 127690 -52473 13250 -223144
9691 147118 -31126 -29662 20102 66272 -32884 -201494 -298288 35854 -351481 37069 11110
$$ packed form
9773b77375h461k31381A56574l2515H449a97511E5335m321J06355a90642g4355
9761i3098r0864A11527a0714j70311B76938e263l21943J59830A3404c08630g4776
9749h8733k22002P6703B08191J10522A49926m4497b08038B18653c77461e7620
9738a38966N2850A44977G2288b31420i8182l4283E031b9768m6133m3363A22815
9726a47397A22970J38765a07923k17720e0348A3303e3601k6733j37240a083k33282
9715b34365M9827a1097B18610I7969a21183j916j71480j18438e8252o1708E7232
9703D3606d6842A81885j5936D093a24933J8701L2459A27690e2473A3250b23144
9691A47118c1126J464B0102M6170c2884j68610r6794C5854c51481C7069A1110
$$ plain form
9679 -62554 -83772 -94473 103476 258034 -57870 -26986 26472 -34415 270048 -3439 -17639
9668 -17639 242230 129600 -96492 -74459 -168034 356060 -89545 -384423 -101011 46669 160553
9657 160553 -389169 -251415 -101774 -195559 -46102 -40236 -157498 -315377 -36898 250977 -111228
9645 205378 -228621 -53359 -16098 74914 -198036 205015 64041 -146312 -152965 163625 -287001
9633 -1904 -88255 29636 -365486 70183 -6041 -181973 73918 -314282 8844 -184419 -229103 -139475
9621 -139475 -241554 -474786 -98665 -87960 -322561 -65239 -434959 -40815 -120860 14610 -246022
9609 -115493 117382 221633 82341 139627 7229 -40497 -180714 -46264 43293 -187594 -144270
9598 -144270 -140408 -293492 120221 166844 153027 30899 -285065 83425 -15884 -146681 206138
$$ packed form
9679f2554k1218j0701A03476J54558e7870b6986B6472c4415B70048c439j4200
9668a7639B42230j12630i6492K2033r3575C56060h9545k94878a01011D6669J13884
9657A60553c89169J37754a01774r3785d6102N866j17262j57879c6898B50977a11228
9645B05378b28621e3359a6098G4914a98036B05015F4041a46312o653A63625b87001
9633a904q6351B9636c65486G0183f041j75932G3918c14282H844a84419m4684Q9628
9621a39475j02079k33232i8665J0705k34601f5239l69720d0815q0045A4610b46022
9609a15493A17382J04251H2341N7286G229d0497j40217d6264D3293a87594M3324
9598a44270L862j53084A20221M6623j3817C0899b85065H3425a5884j30797B06138
$$ plain form
9586 -418849 -436737 -243995 198445 212245 -148717 -197128 30073 206422 165957 -167666 -166370
9575 -166370 -238009 -126798 -134005 -315151 -72627 -57295 31710 -261274 -72831 90755 97939
9564 97939 115290 -123495 102323 -207445 151816 78252 -194283 -117638 259484 158502
9554 158502 283018 -117743 165112 26991 24576 -135802 -49416 -65754 -181575 175795 -365039
9542 -71137 25315 9978 59629 -19975 -322545 -15204 47761 -220677 -8508 -175211 -8970 -152412
9530 -152412 154640 -461138 111202 7239 -248895 -182846 -158862 -158514 33620 -54795 -310842
9519 -310842 26884 -238120 -55184 -98287 -339697 53308 -204836 40455 6662 179504 336022
9508 336022 -183121 18319 226385 100830 -69081 -228431 -249440 32280 111732 61156 -80328
$$ packed form
9586d18849j7888J92742A98445J3800a48717m8411C0073J76349m0465a67666J296
9575a66370p1639J11211p207j81146g2627J5332C1710b61274g2831I0755P184
9564I7939J7351a23495A02323b07445A51816p3564a94283P6645B59484j00982
9554A58502J24516a17743A65112B6991k415a35802d9416j6338j15821A75795c65039
9542g1137B5315I978M9651a9975l02570a5204D7761b20677h508j66703h970j43442
9530a52412A54640d61138A11202G239b48895O6049K3984L48C3620e4795k56047
9519c10842B6884b38120e5184m3103k41410E3308b04836D0455F662J72842J56518
9508C36022a83121A8319K08066A00830f9081j59350k1009C2280P9452n0576h0328
$$ plain form
9496 -27110 16259 21130 230544 -71450 -195026 -139822 -330628 304606 -95177 -22126 -245613
9485 -245613 -145944 -111274 -92188 10804 22585 187445 260769 76289 -254640 -3596 235500
9473 -385518 -140257 -16646 -106150 -73734 -20384 201588 339991 -149966 -212572 160579 -154165
9461 -17413 -384412 -408213 81803 -312639 179600 189775 289631 -192030 89414 -89640 -264351
9450 -264351 -4156 42023 -186579 -37821 -349785 94996 -190834 68725 23244 384129 186207
9438 -191778 15052 -213929 -19458 -133786 -267535 -106941 28482 -21895 -169467 19114 71219
9427 71219 168104 210481 -97407 -274012 167973 -139005 -206426 -277968 -51993 -230946 -176068
9416 -176068 -72863 -84108 -172077 -20926 -121965 145858 -84212 -4185 -228844 78232 -344860
$$ packed form
9496b7110A6259M871K09414g1450j23576N5204j90806C04606i5177b2126k23487
9485b45613R9669L4670J9086A0804J1781J64860P3324G6289b54640c596B35500
9473c85518a40257a6646q9504L2416b0384B01588J38403a49966o2606A60579a54165
9461a7413l66999k3801H1803c12639A79600J0175R9856a92030H9414h9640j74711
9450b64351d156D2023a86579c7821l11964I4996a90834F8725B3244L60885A86207
9438a91778A5052b13929a9458j14328j33749a06941B8482b1895j47572A9114N2105
9427G1219R6885M2377i7407j76605A67973a39005o7421p1542e1993j78953N4878
9416a76068g2863j1245q7969b0926j01039A45858h4212d185k24659G8232c44860
$$ plain form
9404 -255595 23507 -60816 -171624 -75743 57772 -215915 -158882 141375 -239511 -37710 -79680
9393 -79680 -335422 -86366 51187 190088 69222 149014 97398 1959 63756 -9404 -116436 -77932
9381 -77932 -34328 -258709 -182665 167998 50586 141205 -459026 -42712 -395060 77172 -127288
9369 -35858 -277794 -111468 -1342 -23534 -100909 12650 110052 -118048 201006 121461 -108785
9357 -3615 -185652 321678 60132 -138026 -72176 -283766 14931 129446 9351 -193604 -198811
9346 -198811 82928 -47983 -247312 28373 -221790 -406657 187492 185731 150383 -72403 -108323
9335 -108323 104159 -120234 35854 -96978 188150 -49122 -279769 -39604 -259913 -120013
9324 127479 331873 -115387 -279114 -17809 -201056 69075 -212184 -64975 -178639 -323702
$$ packed form
9404b55595B3507f0816j10808g5743E7772b15915N7033A41375b39511c7710m1970
9393g9680k55742h6366E1187J38901F9222P9792n1616A959O1797i404j07032L8504
9381g7932c4328k24381P6044A67998E0586R0619d59026d2712l52348G7172a27288
9369c5858k41936a11468a342k2192p7375A2650R7402a18048B01006p9545a08785
9357c615j82037C21678F0132a38026O5850k11590A4931J14515I351a93604n207
9346a98811H2928d7983j99329B8373b21790j84867A87492j761l5348g2403l5920
9335a08323A04159a20234C5854i6978A88150d9122k30647c9604k20309a20013
9324A27479K04394a15387j63727a7809j83247F9075b12184f4975j13664j45063
$$ plain form
9314 -323702 149662 58681 -17307 -109936 177573 1590 -96691 178862 67723 -72587 -152205
9303 -152205 -61479 133552 -494407 -148280 -6439 -187403 -312147 -22871 -67810 16579 -11983
9291 129297 -165510 200297 152517 -8882 234268 223605 -223995 102630 288085 -57584 -148308
9280 -148308 109351 -68150 -218902 -234090 111867 -219615 3406 -57303 -135468 -158725 -32097
9268 -158471 -119828 -17965 -66662 -349387 21590 -168043 -50255 -121557 -144101 -225991 -103976
9256 5319 -17047 -304836 190776 -197618 -257482 -64528 -282168 -32325 104913 137366 112787
9245 112787 -7228 -92626 -130364 69097 52698 -117422 135077 95388 -60823 -73343 167293
9233 -274287 -253355 -111838 26856 -60487 90926 -118390 -70897 -210193 -118985 33787 -340485
$$ packed form
9314c23702A49662E8681a7307r2629A77573A590i6691A78862F7723g2587p9618
9303a52205f1479A33552d94407a48280f439j80964j24744b2871m4939A6579a1983
9291A29297a65510B00297m7780h882B34268j0663b23995A02630J85455e7584r0724
9280a48308A09351f8150j50752j5188A11867b19615C406e7303p8165k3257c2097
9268a58471L8643a7965m8697k82725B1590a68043e0255p1302k2544q1890a03976
9256E319a7047k87789A90776a97618n9864f4528k17640c2325A04913L2453k4579
9245A12787g228q5398l7738F9097j6399a17422A35077l9689f0823j2520A67293
9233b74287K0932a11838B6856f0487I0926a18390M7493j39296R1208C3787c40485
$$ plain form
9221 -81850 -251019 -231928 204692 102186 -162566 -59503 -406405 -10420 56543 106252 -200125
9209 178095 -309965 -291086 3219 -240795 2117 -179979 -218205 41975 -281121 -143376 -285711
9198 -285711 -4945 129353 17649 -198711 -25855 269494 -32063 -40904 -456661 11783 176230
9187 176230 -292525 -119491 -212916 1333 26464 -119399 55022 -28864 -102484 -42102 -238177
9176 -238177 -35718 -183067 -35660 -31468 186772 -37515 -102435 104215 -354401 48151 -98813
9164 129538 135828 347111 -85289 -70411 23860 136025 -126391 -101556 -18884 206418 -317716
9152 -165309 185676 -290591 26256 -86982 -251498 -330685 -180173 -97001 189041 122956 -61638
9140 84910 -282628 -128551 195920 -219592 130397 317407 -84067 -173677 131751 -162922
$$ packed form
9221h1850j69169J9091B04692A02186a62566e9503l46902a0420E6543M9709b00125
9209A78095c09965J8879C219b40795B117a79979l8226D1975b81121J37745j42335
9198b85711d945A29353A7649a98711b5855B69494c2063q841m15757A1783J64447
9187A76230b92525a19491r3425A333K5131a19399E5022b8864p3620d2102j96075
9176b38177c5718j47349c5660M192A86772c7515o4920A04215c54401D8151i8813
9164A29538O290K11283h5289J4878B3860J12165a26391K4835a8884B06418c17716
9152a65309A85676b90591B6256h6982j64516p9187J50512Q3172A89041o6085f1638
9140H4910b82628a28551A95920b19592A30397J87010h4067q9610A31751a62922
$$ plain form
9129 -150604 -326772 132687 35840 -154885 -157201 -286264 -247018 -223775 169586 -196682 -132371
9118 -132371 -394684 -54130 -259962 -521 -42777 -244817 -385147 -160789 -114819 -189227 -169979
9107 -169979 -169955 346228 -95250 69896 -8950 12709 -127962 156901 -59605 -79498 -125184 -197547
9095 -197547 102992 -130979 -213304 82306 54259 75962 -132165 -11092 230658 1217 -174953
9083 77192 -101611 -149206 -41186 -307037 14858 -409362 180358 66309 -201797 -60313 -70506
9072 -70506 -47950 13986 151211 33283 -128102 85609 334996 180670 172211 -325462 -34051
9060 -374655 -25426 -241151 -150371 -38630 -91151 -191484 467885 -355233 -211982 -136403 45076
9048 76478 -110256 -86732 -184152 214835 -83926 -170424 -507884 -239346 -14896 -62337 -76430
$$ packed form
9129a50604j76168A32687C5840a54885k316j29063L9246K3243A69586a96682O4311
9118a32371k62313e4130k05832e21m2256k02040j40330a60789M5970p4408J9248
9107a69979K4C46228i5250F9896h950A2709a27962A56901e9605j9893m5686p2363
9095a97547A02992a30979q2325H2306k8047K1703a32165a1092B30658A217a74953
9083G7192a01611m7595d1186k65851A4858d09362A80358F6309b01797f0313j0193
9072g0506K2556A3986J37225C3283a28102H5609K49387j54326q459c25462c4051
9060c74655b5426k15725R0780c8630n2521j00333D67885c55233J43251P5579D5076
9048G6478a10256K3524r7420B14835h3926q6498l37460b39346a4896m7441j4093
$$ plain form
9037 -76430 94246 -111721 -135687 -51773 -168305 243332 115486 42889 204945 -199652 -301544
9026 -301544 -401915 -412577 40953 152534 -194987 -295342 -169682 -52408 39599 69994 -226149
9014 88404 -46629 -238647 92734 -39499 -99133 -155943 -106054 -167654 -10681 -56717 -145177 -30937
9001 -223521 120881 -203191 54851 -108133 146436 312859 -88631 169217 225239 301088
8991 301088 44299 26421 55087 299675 62380 4012 -140443 -218866 117986 -112926 193404
8979 -58525 -216626 -89023 43593 38298 -43295 -41579 -63244 -221908 -246873 38767 -48899 219096
8966 -299573 110787 354095 -283969 156116 -244439 -38419 -161578 -105028 141577 -96559
8955 148311 -15051 -201354 77927 -206072 6128 116467 -149527 -239073 -456638 -15212 -97708
$$ packed form
9037g6430I4246a11721k3966e1773j16532B43332A15486D2889J62056a99652j01892
9026c01544j00371j0662D0953J11581a94987j00355J25660e2408C9599L0395b26149
9014H8404d6629j92018I2734c9499n9634n6810M9889o1600a0681m6036q8460c0937
9001b23521A20881b03191E4851a08133A46436J66423h8631A69217N6022P5849
8991C01088D4299j7878K8666K44588F2380D012a40443p8423A17986a12926A93404
8979e8525j58101h9023D3593n295d3295J716k1665j58664k4965C8767d8899B19096
8966b99573A10787K43308b83969A56116b44439c8419j23159N6550A41577i6559
8955A48311a5051j86303G7927b06072F128J10339a49527q9546k17565a5212q2496
$$ plain form
8944 -97708 -201634 -196821 -251480 44049 -313876 76485 -354666 14463 -80213 11549 32370
8933 32370 134126 26608 -24723 -91757 -22800 -125038 66212 131699 -249967 6433 224375
8922 224375 89658 535257 346555 237054 -10113 -188039 95787 -60832 22514 167718 -145234
8910 -276752 66365 -94847 118407 -63427 94401 -171142 -180766 106759 7281 -124859 -347573
8899 -347573 -14289 -125409 -104168 -25236 -11545 -24795 70153 -136623 -61193 -156596 -154409
8888 -154409 -165197 -192096 184713 94998 -67990 -62934 -220834 -45326 -90374 -184350 -16969
8876 -93195 -566649 -71492 -334071 241837 189222 14298 -168441 -198259 -237709 -54989 -98888
$$ packed form
8944i7708j03926M813n4659D4049c13876G6485c54666A4463h0213A1549K0821
8933C2370J01756B6608b4723o7034b2800j02238F6212O5487b49967F433K17942
8922B24375H9658M45599j88702j09501a0113j77926I5787f0832B2514J45204a45234
8910b76752F6365i4847A18407f3427I4401a71142r624A06759G281a24859k22714
8899c47573a4289j11120K1241b5236a1545j3250G0153a36623f1193r5403K187
8888a54409j0788k6899A84713q9715f7990N056j57900d5326m5048r3976a6969
8876i3195m73454g1492k62579B41837n2615A4298a68441k9818l9450e4989m3899
$$ [...]
##END NTUPLES=NMR SPECTRUM
##END=
