##TITLE=AC1458_PAST313264_7819537_9jyCbH7Ab4
##JCAMPDX= 6.0         $$ Bruker NMR JCAMP-DX V2.0
##DATA TYPE= NMR SPECTRUM
##DATA CLASS= NTUPLES
##ORIGIN= BRUKER
##OWNER= Administrator
$$ 1.72 TOPSPIN		Version 2.1
$$ 2013-04-30 20:50:23.927 -0700  Administrator@X
$$ Compression mode = diff/dup
##.OBSERVE FREQUENCY= 400.02188249412
##.OBSERVE NUCLEUS= ^1H
##.ACQUISITION MODE= SIMULTANEOUS (DQD)
##.ACQUISITION SCHEME= undefined
##.AVERAGES= 8
##.DIGITISER RES= 22
##SPECTROMETER/DATA SYSTEM= spect
##.PULSE SEQUENCE= zg30
##.SOLVENT NAME= COFFEE_meoh
##.SHIFT REFERENCE= INTERNAL, COFFEE_meoh, 1, 14.98509
##AUDIT TRAIL= $$ (NUMBER, WHEN, WHO, WHERE, PROCESS, VERSION, WHAT)
$$ ##TITLE= Audit trail, TOPSPIN		Version 2.1
$$ ##JCAMPDX= 5.01
$$ ##ORIGIN= Bruker BioSpin GmbH
$$ ##OWNER= Administrator
$$ $$ E:\/data/COFFEE/nmr/AC1458_PAST313264_7819537_9jyCbH7Ab4/10/pdata/1/auditp.txt
$$ ##AUDIT TRAIL=  $$ (NUMBER, WHEN, WHO, WHERE, PROCESS, VERSION, WHAT)
(   1,<2013-04-30 20:50:17.161 -0700>,<Administrator>,<X>,<go>,<TOPSPIN 2.1>,
      <created by zg
	started at 2013-04-30 20:49:10.817 -0700,
	POWCHK enabled, PULCHK disabled,
       configuration hash MD5:
       F7 49 AB AC A2 8D 51 76 73 8D C1 9A A6 38 9F DE
       data hash MD5: 64K
       75 4D 4F 7D 8E 54 5E FB 1A E3 8D 34 90 36 23 7D>)
(   2,<2013-04-30 20:50:20.114 -0700>,<Administrator>,<X>,<proc1d>,<TOPSPIN 2.1>,
      <Start of raw data processing
       efp LB = 0 FT_mod = 6 PKNL = 1 PHC0 = 0 PHC1 = 0 SI = 32K 
       data hash MD5: 32K
       AC 28 67 45 18 13 79 C7 A9 17 6D B5 99 11 E2 39>)
(   3,<2013-04-30 20:50:20.473 -0700>,<Administrator>,<X>,<proc1d>,<TOPSPIN 2.1>,
      <pk PHC0 = 96.95984 PHC1 = 0 
       data hash MD5: 32K
       E0 1C 90 19 A1 17 AD 54 05 81 C3 6F 75 CD D7 9B>)
(   4,<2013-04-30 20:50:20.567 -0700>,<Administrator>,<X>,<proc1d>,<TOPSPIN 2.1>,
      <abs ABSG = 1 
       data hash MD5: 32K
       86 AA 6E 6A 22 02 88 93 EB 27 54 DA BB 7D 49 38>)
(   5,<2013-04-30 20:50:20.661 -0700>,<Administrator>,<X>,<proc1d>,<TOPSPIN 2.1>,
      <abs ABSG = 2 
       data hash MD5: 32K
       4C 26 99 5D ED B5 D6 44 94 63 63 B4 88 DE 45 93>)
(   6,<2013-04-30 20:50:20.723 -0700>,<Administrator>,<X>,<proc1d>,<TOPSPIN 2.1>,
      <abs ABSG = 3 
       data hash MD5: 32K
       83 46 32 CB F3 A9 54 7F CC C8 B5 1C 87 6F 09 B0>)
(   7,<2013-04-30 20:50:20.786 -0700>,<Administrator>,<X>,<proc1d>,<TOPSPIN 2.1>,
      <abs ABSG = 4 
       data hash MD5: 32K
       05 D5 58 4A AA FE 50 7F 08 61 0F C7 CE FD CA F8>)
(   8,<2013-04-30 20:50:20.833 -0700>,<Administrator>,<X>,<proc1d>,<TOPSPIN 2.1>,
      <abs ABSG = 5 
       data hash MD5: 32K
       E2 06 7E 31 39 1F 95 50 73 8F 8A D3 EF CA 1C 95>)
$$ ##END=
$$ 
$$ $$ hash MD5
$$ $$ 18 2D 3E 7C 12 13 82 2E F8 3F E0 D9 75 2D 24 80
##$RELAX= 
##$RELAX= 
##$RELAX= 
##$RELAX= 
##$RELAX= 
##$RELAX= 
##$RELAX= 
$$ Bruker specific parameters
$$ --------------------------
##$DU= <E:\>
##$EXPNO= 10
##$NAME= <AC1458_PAST313264_7819537_9jyCbH7Ab4>
$$ [...]
150 150 150 150 150 150 150 150
##$TP07= 0
##$TPNAME0= <>
##$TPNAME1= <>
##$TPNAME2= <>
##$TPNAME3= <>
##$TPNAME4= <>
##$TPNAME5= <>
##$TPNAME6= <>
##$TPNAME7= <>
##$TPOAL= (0..7)
0.5 0.5 0.5 0.5 0.5 0.5 0.5 0.5
##$TPOFFS= (0..7)
0 0 0 0 0 0 0 0
##$TUNHIN= 0
##$TUNHOUT= 0
##$TUNXOUT= 0
##$USERA1= <user>
##$USERA2= <user>
##$USERA3= <user>
##$USERA4= <user>
##$USERA5= <user>
##$V9= 5
##$VALIST= <valist>
##$VCLIST= <CCCCCCCCCCCCCCC>
##$VD= 0
##$VDLIST= <DDDDDDDDDDDDDDD>
##$VPLIST= <PPPPPPPPPPPPPPP>
##$VTLIST= <TTTTTTTTTTTTTTT>
##$WBST= 1024
##$WBSW= 4
##$XGAIN= (0..3)
0 0 0 0
##$XL= 0
##$YL= 0
##$YMAX_a= 649650
##$YMIN_a= -552148
##$ZGOPTNS= <>
##$ZL1= 120
##$ZL2= 120
##$ZL3= 120
##$ZL4= 120
##$ABSF1= 14.98509
##$ABSF2= -5.573092
##$ABSG= 5
##$ABSL= 3
##$ALPHA= 0
##$AQORDER= 0
##$ASSFAC= 0
##$ASSFACI= 0
##$ASSFACX= 0
##$ASSWID= 0
##$AUNMP= <proc_prof1d_extract_pilot.lims>
##$AXLEFT= 0
##$AXNAME= <>
##$AXNUC= <1H>
##$AXRIGHT= 0
##$AXTYPE= 0
##$AXUNIT= <>
##$AZFE= 0.1
##$AZFW= 0.1
##$BCFW= 0
##$BC_mod= 0
##$BYTORDP= 0
##$COROFFS= 0
##$CY= 15
##$DATMOD= 1
##$DC= 0
##$DFILT= <>
##$DTYPP= 0
##$F1P= 0
##$F2P= 0
##$FCOR= 0.5
##$FTSIZE= 32768
##$FT_mod= 6
##$GAMMA= 0
##$GB= 0
##$INTBC= 1
##$INTSCL= 1
##$ISEN= 128
##$LB= 0
##$LEV0= 0
##$LPBIN= 0
##$MAXI= 10000
##$MC2= 0
##$MEAN= 0
##$ME_mod= 0
##$MI= 0
##$NCOEF= 0
##$NC_proc= -8
##$NLEV= 6
##$NOISF1= 0
##$NOISF2= 0
##$NSP= 0
##$NTH_PI= 0
##$NZP= 0
##$OFFSET= 14.98509
##$PC= 1
##$PHC0= 96.95984
##$PHC1= 0
##$PH_mod= 1
##$PKNL= yes
##$PPARMOD= 0
##$PPDIAG= 0
##$PPIPTYP= 0
##$PPMPNUM= 2147483647
##$PPRESOL= 1
##$PSCAL= 4
##$PSIGN= 0
##$PYNMP= <proc.py>
##$REVERSE= no
##$SF= 400.02
##$SI= 32768
##$SIGF1= 0
##$SIGF2= 0
##$SINO= 400
##$SIOLD= 32768
##$SPECTYP= <>
##$SREGLST= <1H.CDCl3>
##$SSB= 0
##$STSI= 32768
##$STSR= 0
##$SW_p= 8223.68421052631
##$SYMM= 0
##$S_DEV= 0
##$TDeff= 65536
##$TDoff= 0
##$TI= <>
##$TILT= no
##$TM1= 0
##$TM2= 0
##$TOPLEV= 0
##$USERP1= <user>
##$USERP2= <user>
##$USERP3= <user>
##$USERP4= <user>
##$USERP5= <user>
##$WDW= 1
##$XDIM= 32768
##$YMAX_p= 461885941
##$YMIN_p= -687070
##$CURPLOT= <Network HP LaserJet P1505>
##$CURPRIN= <$Network HP LaserJet P1505>
##$DFORMAT= <normdp>
##$LAYOUT= <+/1D_H.xwp>
##$LFORMAT= <normlp>
##$PFORMAT= <normpl>
##$SURQMSG= 1
$$ End of Bruker specific parameters
$$ ---------------------------------
##NTUPLES= NMR SPECTRUM
##VAR_NAME=  FREQUENCY,     SPECTRUM/REAL,   SPECTRUM/IMAG
##SYMBOL=    X,             R,               I
##VAR_TYPE=  INDEPENDENT,   DEPENDENT,       DEPENDENT
##VAR_FORM=  AFFN,          ASDF,            ASDF
##VAR_DIM=   32768,         32768,           32768
##UNITS=     HZ,            ARBITRARY UNITS, ARBITRARY UNITS
##FACTOR=    0.250966925370066, 1,           1
##FIRST=     8223.43324360094, -212200,      115377
##LAST=      0,             13738,           -265988
##MIN=       0,             -687070,         0
##MAX=       8223.43324360094, 461885941,    0
$$ Real data points
##PAGE= N=1
##DATA TABLE= (X++(R..R)), XYDATA
$$ [...]
$$ plain form
19545 -240044 211820 63275 -20268 9395 -189064 -143008 -152614 -98156 -3591 -189945 -10979
19533 120091 60954 -153142 94589 -235625 -67193 -25304 -166887 12951 -54932 -6134 -253201
19522 -253201 -57139 -30748 -113777 -128357 30733 -125358 -81515 144145 95141 -1366 -152026
19511 -152026 146654 45557 -149321 -139776 -306189 -256408 -108941 -114983 -55144 -29630 -65376
19500 -65376 -60894 79824 -452057 -159272 -203958 172147 -337699 -67291 -87899 -44881 99223
19488 -162167 -53774 237345 197032 83172 -239932 -85093 20116 174882 -59896 55101 -107629
19476 -57633 -453300 -218795 82565 -106347 -54264 -10912 -125862 -62163 11339 118633 79841
19465 79841 -389289 -76389 -109740 36897 127302 130751 229674 -198348 30479 -166348 -126340
$$ packed form
19545b40044B11820F3275b0268I395a89064M6056r606N4458c591j86354a0979
19533A20091n9137a53142I4589b35625f7193b5304j41583A2951e4932f134k47067
19522b53201e7139K6391q3029j4580C0733a25358M3843A44145m9004a366j50660
19511a52026A46654D5557a49321R545j66413M9781a08941o042e5144K5514l5746
19500f5376M482G9824d52057a59272m4686A72147c37699f7291k0608M3018I9223
19488a62167e3774B37345m0313H3172b39932h5093B0116J54766e9896E5101a07629
19476e7633l95667b18795H2565a06347N2083a0912j14950f2163A1339J07294l8792
19465G9841c89289g6389l3351C6897R0405L449R8923a98348C0479a66348M0008
$$ plain form
19454 -126340 -112098 -434298 -74111 -44794 -264272 -214924 -43096 -5016 -244495 -165841 -234930
19443 -234930 -185020 -264452 13559 -265866 -533572 124950 348366 55744 -29944 21887 -21387
19431 -324299 -20490 -11322 -84898 -163288 -161237 -141612 -196921 -170615 -95013 109394 -354054
19419 241057 21918 71299 -37306 -84980 57362 -141844 14093 -81325 -35075 -165270 484503
19407 32469 -68877 15738 291641 -28961 146092 231937 -43686 260311 263374 -200372 100466
19395 120299 22142 61120 -124714 150415 -164061 166892 -273865 -327166 -83984 -39108
19384 -132520 -140822 209090 77262 -92499 48119 128011 -27143 -173699 58898 103909 -549785
19372 -46673 -72885 251048 -295318 13394 -195551 -16051 74845 148370 149675 192462 218736
$$ packed form
19454a26340J4242l22200g4111K9317k19478M9348d3096e016k39479P8654o9089
19443b34930M9910p9432A3559b65866k67706A24950K23416E5744b9944B1887b1387
19431c24299b0490R168p3576p8390K051J9625n5309K6306P5602A09394c54054
19419B41057B1918M9381c7306m7674E7362a41844A4093h1325c5075j30195D84503
19407C2469f8877A5738K75903b8961A46092Q5845d3686B60311L063b00372A00466
19395A20299B2142L8978a24714A50415a64061A66892b73865n3301h3984c9108
19384a32520q302B09090G7262i2499D8119P9892b7143j46556E8898M5011e49785
19372d6673k6212B51048b95318A3394a95551a6051G4845P3525J305M2787K6274
$$ plain form
19361 218736 206666 -163902 -237774 -216354 -50265 -102288 -60041 -122533 -476274 44107 129936
19350 129936 -267588 -353058 -91247 -361632 -57140 -258635 223013 -20436 -321046 -173724
19340 -173724 -449120 89086 -278826 -104507 -256417 -26214 -165418 -85265 -286277 34771
19329 -71267 -119916 -38589 -113680 -171696 32459 168997 68435 17977 121045 58304 212732
19318 212732 15571 357572 21632 250241 83780 -138098 73629 -40329 98772 9526 -174353
19306 -100752 -202421 78207 -16143 -160062 -379327 -8933 -301180 -250784 232860 -336074
19295 -342359 71416 -5045 58055 -119950 290009 -155287 -109195 -228536 -227712 -165714 -118585
19284 -118585 -357887 -227588 -66948 105177 149150 -30010 156788 -312299 48002 -19040
$$ packed form
19361B18736j2070a63902p3872K1420e0265n2023M2247o2492l53741D4107Q5829
19350A29936b67588q5470i1247k70385e7140k01495B23013b0436l00610J47322
19340a73724k75396H9086b78826a04507j51910b6214j39204Q0153k01012C4771
19329g1267m8649c8589p5091n8016C2459J36538F8435A7977J03068E8304J54428
19318B12732A5571L42001B1632K28609H3780a38098G3629d0329I8772I526a74353
19306a00752j01669G8207a6143j43919k19265h933k92247N0396B32860c36074
19295c42359G1416e045E8055a19950B90009a55287M6092j19341Q24O1998M7129
19284a18585k39302J30299f6948A05177M3973c0010A56788c12299D8002a9040
$$ plain form
19273 -24301 -43363 -106820 -6158 -15559 -165073 275522 -296933 146733 -204556 33971 -338
19261 102820 -106380 257045 -59732 -370048 -121117 -242178 49426 -83246 -378062 291118
19250 105254 -259008 -171382 -332728 -61967 20269 -77279 -177313 -42524 -72637 -204834 264053
19238 -250643 92794 -141765 534856 -16408 -26453 -31631 -14839 -97052 13964 -38723 -366356
19227 -366356 -82165 50094 -55983 87301 192019 57219 -321329 143490 78889 -45386 -210991
19216 -210991 -108926 -26745 -78242 -177855 -395055 -241857 -241340 -36464 -61259 29754 -270827
19204 39122 24624 -36183 -191445 98342 100196 22800 -197559 -162001 -201738 -352137 -32284
19192 -125171 -82452 -127103 -344280 -219159 -167064 -174192 -205877 -231972 -169681 -251081 -10178
$$ packed form
19273b4301j9062o3457f158r401j49514B75522b96933A46733b04556C3971c38
19261A02820a06380B57045e9732l10316a21117j21061D9426h3246k94816B91118
19250A05254b59008Q7626j61346f1967B0269g7279j00034d2524l0113j32197B64053
19238b50643I2794a41765E34856a6408j0045n178a4839q2213A3964c8723l27633
19227c66356h2165E0094e5983H7301J04718E7219c21329A43490o4601d5386j65605
19216b10991J02065b6745n1497r9613k17200J53198N17c6464k4795B9754b70827
19204C9122j4498c6183j55262I8342J854B2800a97559L5558l9737j50399c2284
19192a25171M2719m4651k17177J25121N2095p128l1685k6095O2291q1400a0178
$$ plain form
19180 -286305 169261 -146871 -138372 -126324 47337 -11954 -178177 9940 -778 -143120 -141723 -176171
19168 -176171 334813 -286668 272170 -45087 72711 -117541 346548 -54507 -214788 47707
19157 -238419 137063 -84965 -39196 -83231 -14810 122331 -181941 77984 -264222 18227 -38247
19145 -66325 -151847 -182210 106232 -76074 -8210 149233 5799 53632 -417896 -143854 8194
19133 -212266 -102925 -97467 17193 -86837 -13978 -222662 208881 -142980 -200113 117928 -59327
19121 89995 -8952 -134636 -251429 344497 80661 32894 61907 123965 -32336 -177743 34005
19109 -122982 -118982 -213125 -22693 -125484 -112774 -93282 -5311 -216843 -36016 -43553 -101224 -148709
19097 -148709 -21598 -370658 17286 126336 -1288 -177509 -126552 91483 -24085 -175643 -177423
$$ packed form
19180b86305A69261a46871Q499J2048D7337a1954j66223I940g78j42342J397l4448
19168a76171C34813b86668B72170d5087G2711a17541C46548e4507j60281D7707
19157b38419A37063h4965c9196m4035a4810A22331a81941G7984b64222A8227c8247
19145f6325q5522l0363A06232g6074h210A49233E799M7833d17896a43854H194
19133b12266a02925N458A7193h6837a3978k08684B08881a42980n7133A17928e9327
19121H9995h952j25684j16793C44497H0661C2894K9013O2058c2336j45407C4005
19109a22982M000r4143b2693j02791J2710J9492e311k11532c6016p537n7671m7485
19097a48709b1598l49060A7286J09050a288j76221N0957I1483b4085j51558j780
$$ plain form
19086 -177423 1240 -67773 -194284 -95431 -22288 -119920 -98047 154086 -190696 208242 -220571
19074 9619 -128991 54098 -83978 349889 30970 -22837 -73230 -78253 -393881 -251914 -335949
19063 -335949 -43227 89879 -12064 -246110 108289 4487 -144530 125295 -27634 -97167 -257376
19052 -257376 -1362 -312310 -224855 147055 -367475 62385 -128615 -104900 51904 46983 51670
19041 51670 -12192 -212062 -35404 -395094 -167171 -92182 -109443 81884 -203342 -35268 -459043
19030 -459043 102417 421370 70118 160276 247889 -98033 -89034 246941 -107265 633 10269
19019 10269 5910 -235078 -90181 -9019 245762 -198703 67909 5165 533355 196166 211415
19008 211415 -52895 66623 -235735 -212133 -123435 -42955 -192776 111596 -40955 -70925 -79848
$$ packed form
19086a77423A240f7773j26511i5431b2288r7632K1873A54086a90696B08242b20571
19074I619a28991E4098h3978C49889C0970b2837n0393n023l15628J41967q4035
19063c35949d3227H9879a2064k34046A08289D487a44530A25295b7634o9533j60209
19052b57376a362l10948Q7455A47055c67475F2385a28615K3715E1904m921M687
19041E1670a2192j99870c5404l59690a67171P4989j7261H1884b03342c5268m23775
19030d59043A02417L18953G0118R0158Q7613i8033Q999B46941a07265F33R636
19019A0269m359b35078i0181i019B45762a98703F7909E165N28190A96166J5249
19008B11415e2895F6623b35735K3602Q8698d2955j49821A11596d0955k9970q923
$$ plain form
18997 -79848 101319 37819 107000 193554 -144119 -18310 66511 -142769 -196439 -302551 20014
18985 35524 85580 -105445 -291074 103162 -248539 -78967 -396481 -350202 -159135 794 -80051
18973 -72680 105903 -169756 37439 -187593 225129 165590 281746 -139949 47406 26118
18963 26118 2796 11690 177577 91875 205795 21857 -63852 -61039 124805 395570 -165439
18951 1632 -183856 3144 216401 -149904 201798 91265 65376 41743 168562 153453 316197
18940 316197 -180007 72881 -49921 -11453 74632 177466 -13830 -317524 -339330 3383 190814
18929 190814 23118 104289 -107762 -12304 -309289 7935 37876 94016 145414 63095 -78155
18917 -94203 141558 -334098 -70842 -78386 -30568 92413 135900 181190 -66595 -209246 -169433
$$ packed form
18997g9848A01319C7819O9181Q6554a44119a8310F6511a42769n3670j06112B0014
18985C5524N0056a05445j85629A03162b48539g8967l17514M6279a59135G94h0051
18973g2680A05903a69756C7439a87593B25129n9539J16156a39949D7406k1288
18963B6118B796Q894J65887q5702J13920B1857f3852K813A24805K70765a65439
18951A632a83856C144K13257a49904B01798I1265k5889k3633J26819j5109J62744
18940C16197a80007G2881d9921a1453G4632J02834a3830l03694k1806C383J87431
18929A90814B3118Q1171a07762a2304k96985G935K9941N6140N1398F3095g8155
18917i4203A41558c34098g0842p544c0568I2413M3487M5290f6595j42651L9813
$$ plain form
18906 -169433 148930 33028 32235 -298577 -451361 -262659 -4016 134475 -107285 68797 267205
18895 267205 -121303 -32929 13306 273237 -126380 64948 195449 51699 150501 -204446
18884 78132 69383 179658 -292223 104920 -29232 -57440 239208 -76179 279806 -379949 307542
18872 85198 -220116 -365200 9835 -253729 94257 -138501 -56660 67467 -10870 -140966 116583
18860 261024 -418769 35190 -78262 -271870 -236715 -136600 66418 -40178 -42989 -107639 -111645
18849 -111645 -119263 -146759 152797 124782 -86358 70164 131622 -132500 260670 -83321 -258929
18838 -258929 -45422 216418 83581 -18184 -74022 -257139 13357 -125985 -311920 90830 -414948
18826 -35518 -153062 118185 -272504 168178 52428 -335174 -83852 -153716 40181 211406
$$ packed form
18906a69433A48930C3028p93b98577j52784J88702d016A34475a07285F8797J98408
18895B67205a21303c2929A3306K59931a26380F4948J30501E1699R8802b04446
18884G8132q749J10275b92223A04920b9232k8208B39208g6179B79806c79949C07542
18872H5198b20116j45084I835b53729I4257a38501e6660F7467a0870j30096A16583
18860B61024d18769C5190g8262j93608L5155J00115F6418d0178k811o4650m006
18849a11645p618k7496A52797k8015h6358G0164O1458a32500B60670h3321j75608
18838b58929d5422B16418H3581a8184n5838j83117A3357a25985j85935I0830d14948
18826c5518j17544A18185b72504A68178E2428c35174h3852o9864D0181J71225
$$ plain form
18816 211406 123932 -133588 81005 -157368 148555 157620 -290322 -221227 -96914 7663 292297
18805 292297 -8145 -234937 -172822 -99017 -542469 -346053 -107180 -9931 -32767 -48215 -173172
18794 -173172 -94001 -75094 -201946 -15871 -23630 -108820 -76996 -49554 136206 -101504 -256035
18783 -256035 -60140 28089 178082 -283555 -94674 195077 -69325 -167766 112246 75502 -43224
18771 203006 129495 450129 -25160 85874 -244552 -16533 6790 -220119 -265391 -33277 142335
18759 -115076 -175606 -266872 -276870 32558 296852 -34171 186258 -306833 105092 106551 -270888
18747 -327411 110231 23515 440 -42724 -359125 -201559 189758 -11061 -50110 -244370 61044
18735 -111837 -151061 26950 65686 -99308 -188407 -149529 -16510 -10914 27808 -251159 -38600
$$ packed form
18816B11406q7474a33588H1005a57368A48555R065b90322O9095i6914G663K84634
18805B92297h145k26792O2115P3805m43452J96416a07180i931k2836j5448j24957
18794a73172P9171J8907j26852a5871p759q5190L1824K7442A36206a01504j54531
18783b56035f0140B8089J49993b83555i4674A95077f9325r8441A12246l6744d3224
18771B03006p3511L20634b5160H5874b44552a6533F790b20119m5272c3277A42335
18759a15076o0530r1266r998C2558K64294c4171A86258c06833A05092J459b70888
18747c27411A10231B3515D40d2724l16401J57566A89758a1061l9049j94260F1044
18735a11837l9224B6950L8736i9308q9099L8878a6510N596B7808b51159c8600
$$ plain form
18723 -132829 -199551 -210438 -120982 -133167 -130643 155074 88227 346121 -234436 155636 192122
18712 192122 -439227 -163924 -307259 -83833 -24833 -27912 -15033 -102255 -94745 -306868 -223737
18701 -223737 -226899 -45603 -26609 -293211 -200147 -45836 47960 -144301 -390870 96836 -45710
18689 25229 260630 -11877 182556 290764 -9203 -184043 52821 -170081 32074 209025 -112982
18677 -47102 180657 -95078 -187091 -345476 -294981 -23862 260684 222610 -36282 170317 -37689
18665 245798 274335 -4855 -63106 134716 -229515 -239601 89088 -58488 30437 -94113 -124407
18654 -124407 -46129 -118221 29210 198585 -100032 -69734 -38746 -2423 -272185 171929 -186441
18642 152288 -40757 -110786 23406 -22764 -28860 -90128 -74515 -120890 146737 -38443 -132900
$$ packed form
18723a32829o6722j0887Q9456j2185K524A55074o6847K57894b34436A55636L6486
18712A92122d39227a63924j43335h3833b4833l079J2879q7222P510k12123Q3131
18701b23737l162d5603J8994k66602R3064d5836D7960a44301k46569I6836d5710
18689B5229K35401a1877A82556J08208i203j74840E2821a70081C2074J76951a12982
18677d7102A80657i5078r2013j58385N0495b3862B60684l8074c6282A70317c7689
18665B45798K8537d855n8251A34716b29515j0086H9088e8488C0437i4113l0294
18654a24407d6129p2092B9210J69375a00032L0298L0988b423k69762A71929a86441
18642A52288d0757p0029B3406b2764o096o1268J5613m6375A46737c8443r4457
$$ plain form
18631 -132900 -69957 -162764 -18081 37438 101804 -294825 -195457 -72525 123861 -113823 -22280
18619 49755 -160313 205605 -140 -190333 -81759 95289 193465 354311 -103862 -214664 -148556
18608 -148556 170056 55311 9851 107868 258982 -227434 30536 -171462 -88800 -227341 -262282
18597 -262282 196768 253843 -212251 98976 -234814 20214 -187686 109965 -108602 185936
18586 -481551 -284739 -82869 211789 -287658 -139118 -128340 -38535 -104304 -218065 -279614
18576 -279614 93001 -170406 -70385 -90070 -123138 138272 -89096 1919 141196 177057 -55187
18564 347780 -8007 -158032 -24069 -117981 -224033 -205399 -140897 -217475 114223 -134984 137702
18552 86167 36707 115419 -39205 27826 51065 -92706 185753 303061 -33066 -63885 -241234
$$ packed form
18631a32900O2943r2807a8081C7438O4366b94825R9368g2525A23861a13823b2280
18619D9755a60313B05605a40j90193h1759I5289R8176J60846a03862j10802O6108
18608a48556A70056E5311I851R8017J51114b27434C0536a71462Q2662j38541l4941
18597b62282A96768N7075b12251I8976b34814B0214a87686A09965a08602A85936
18586d81551J96812h2869B11789b87658a39118J0778c8535o5769j13761o1549
18576b79614I3001a70406g0385j9685l3068A38272h9096A919J39277L5861e5187
18564C47780h007j50025b4069r3912j06052J8634O4502p6578A14223a34984A37702
18552H6167C6707P8712c9205B7826K3239i2706A85753J17308c3066l0819j77349
$$ plain form
18541 -241234 210834 -277244 6160 -391050 -460564 -76927 -359333 87809 114255 -70084 -125923
18530 -125923 44665 24057 -66365 134100 5084 -178552 117343 -54459 -138335 -141435 115742
18518 120959 -99206 22108 256821 121163 -209223 55023 -235275 -107557 -125035 -115670 396946
18506 -71676 -8078 -217016 -232324 -65438 -11342 -102404 -13792 -123899 -118965 157015 25024
18494 -97059 -84592 -12117 -423297 -246970 -75958 -44753 -184702 205814 -175595 53810 -279211
18482 138901 -84855 143780 51531 -172396 -126478 325199 137797 -136820 -405569 -85292
18471 197889 108648 -187788 -127344 70019 -235381 -50751 -60149 46135 96236 -112495 100263
18459 -64121 108691 -427558 -67921 -96359 122808 -3662 87832 -181703 2244 -144122 -173932
$$ packed form
18541b41234B10834b77244F160c91050o9514g6927k82406H7809K6446g0084n5839
18530a25923D4665k0608f6365A34100E084a78552A17343e4459q3876l100A15742
18518A20959i9206B2108K34713A21163b09223E5023b35275a07557j7478R365C96946
18506g1676h078k08938j5308f5438a1342r1062a3792j10107M934A57015B5024
18494i7059J2467a2117m11180J76327g5958L1205j39949B05814a75595E3810b79211
18482A38901h4855A43780E1531a72396M5918C25199A37797a36820k68749h5292
18471A97889q9241a87788O0444G0019b35381e0751r398D6135N0101a12495A00263
18459f4121A08691d27558f7921k8438A22808c662H7832a81703B244a44122k9810
$$ plain form
18448 -173932 73986 109159 -206992 -92389 -336233 116867 -188741 -23808 49420 -230513
18437 -181385 -314517 -141225 98946 -24552 -179857 -62811 -39734 -70624 117290 -65873 -283336
18426 -283336 -79448 -48371 -59271 -137637 -93179 -238442 24561 59735 -104683 -171471 -34843
18414 188041 -111481 -115463 124385 31344 362350 139973 -8471 130613 -52695 -80221 808
18402 174189 -75435 -230525 -160667 -139517 48022 56422 -140363 -32993 -50629 87135 -301255
18390 -77079 23316 4154 47315 -344928 -117696 -192701 20611 -203334 75938 -97052 145790
18378 -80725 103244 -412218 -106819 49852 26851 -8689 -212609 278596 -100406 217003
18367 239979 -383691 -43356 135455 13784 65585 -166729 -114887 70375 -307809 -270081 -121516
$$ packed form
18448a73932G3986L5173b06992i2389k43844A16867a88741b3808D9420b30513
18437a81385j33132a41225I8946b4552j55305f2811K3077l0890A17290f5873k17463
18426b83336g9448L1077j0900p8366M4458j45263B4561L5174a04683o6788c4843
18414A88041a11481l982A24385C1344L31006A39973h471A30613e2695k7526H08
18402A74189g5435j55090O9858K1150D8022Q400a40363c2993j7636H7135c01255
18390g7079B3316D154M3161c44928a17696p5005B0611b03334G5938i7052A45790
18378h0725A03244d12218a06819D9852k3001h689k03920B78596a00406B17003
18367B39979c83691d3356A35455A3784N1801a66729N1842G0375c07809L7728a21516
$$ plain form
18355 133661 306741 -160243 78075 -143159 21086 -127712 -40046 339821 -50293 -135774
18345 -135774 -171293 -1879 -82931 98321 7897 132864 -225050 -226588 -425591 254606 257336
18334 257336 56712 177134 -80465 -113302 -64312 -66194 71063 46310 -104124 -81413 219096
18322 -158991 -159520 -165069 -185014 178287 -330126 137352 128091 301352 -21456 -150296 50937
18310 157042 38581 -139228 -11916 -249512 -223577 151957 184716 204140 201936 -102166 -155145
18299 -155145 -141300 -106803 -474925 -62976 -178771 -156822 -309353 169566 -135980 -173585
18289 -173585 -132230 299223 66340 60267 185049 -235948 -240924 -224677 31256 -33554 -188725
18278 -188725 26643 -145447 -168954 -93874 -18960 -55850 46400 -148422 77954 -159673 119496
$$ packed form
18355A33661J73080a60243G8075a43159B1086a27712d0046C39821e0293q5481
18345a35774l5519a879q1052I8321G897J24967b25050j538j99003B54606K730
18334B57336E6712J20422h0465l2837M8990j882G1063k4753a04124K2711B19096
18322a58991n29n549j9945A78287c30126A37352r261J73261b1456j28840E0937
18310A57042C8581a39228a1916k37596K5935A51957L2759J9424k204a02166n2979
18299a55145J3845L4497l68122f2976j15795K1949j52531A69566a35980l7605
18289a73585M1355B99223F6340o073J24782b35948m976J6247C1256c3554j55171
18278a88725B6643a45447k3507P5080a8960l6890D6400a48422G7954a59673A19496
$$ plain form
18266 -227851 -334144 -53759 -47840 -166621 62640 -30858 -283164 -59952 125909 -16190 -11628
18255 -11628 -230766 -171222 -53916 165267 27618 -89159 50462 -269130 170782 -230030 79512
18243 13086 27340 -246480 -209547 -74409 -141753 72165 -290619 113994 -335613 378537 -215898
18231 -118405 7828 -226674 -21649 46011 -23810 -31952 -144147 -57670 -43777 144244 -129495
18219 170284 -68215 -406888 256769 74910 234912 11880 261551 -50299 144767 -17030
18208 -77574 10483 9688 -197868 164469 98276 220495 -107360 -49205 -108483 -150581 -203220
18197 -203220 223387 323948 -240582 -90865 -149764 -8247 -182653 136321 -133489 -162753
18187 -162753 356835 -65066 -45900 -39177 93426 -40923 111670 -67283 -209977 160473 -104655
$$ packed form
18266b27851j06293e3759N919j18781F2640c0858k52306e9952A25909a6190M562
18255a1628k19138N9544e3916A65267B7618h9159E0462b69130A70782b30030G9512
18243A3086J4254b46480L6933g4409o7344G2165b90619A13994c35613C78537b15898
18231a18405G828b26674b1649D6011b3810q142j12195e7670J3893A44244a29495
18219A70284f8215l38673B56769G4910J60002A1880K49671e0299A44767a7030
18208g7574A0483p95a97868A64469o6193J22219a07360d9205n9278m2098n2639
18197b03220B23387J00561b40582i0865n8899h247j74406A36321a33489k9264
18187a62753C56835f5066J9166O723I3426d0923A11670f7283j42694A60473a04655
$$ plain form
18175 -119270 -4811 154637 83257 -127918 37523 -137515 309382 17062 -20348 39841 -163033
18163 219876 -15183 190089 -30279 -253505 -324075 -165567 -239961 -160798 -30849 200711 46349
18151 177344 -293601 150087 147429 -67655 -256693 -149827 -107009 -5282 -280235 -87252 268122
18139 179073 -88909 -237419 110463 -537999 -34113 43913 42254 387953 -520528 165533
18128 -162850 56790 -178920 -265564 -197212 285152 290177 -160943 -52673 55343 -30047 -141496
18117 -141496 126345 7700 -4311 366482 -76073 -82072 -58117 316692 153901 -119684 91840
18105 -130245 71181 -31655 -169865 -345026 -41762 -248270 218596 -226985 113645 56010
18094 187812 79238 87005 -159599 -139268 128312 111967 -30959 75640 -3038 -207818 -89536
$$ packed form
18175a19270d811A54637p1380a27918C7523a37515C09382A7062b0348C9841a63033
18163B19876a5183A90089c0279k23226p0570J58508p4394P9163c0849B00711D6349
18151A77344b93601A50087k658f7655j89038J06866M2818e282k74953h7252B68122
18139A79073h8909j48510A10463e37999c4113D3913j659L45699e20528A65533
18128a62850E6790a78920q6644O8352B85152N025a60943e2673E5343c0047j11449
18117a41496A26345G700d311C66482g6073n999K3955C16692A53901a19684I1840
18105a30245G1181c1655j38210j75161d1762k06508B18596b26985A13645E6010
18094A87812G9238P767a59599K0331A28312j6345c0959G5640c038k04780h9536
$$ plain form
18082 129672 33227 -101092 -228142 -140063 11042 15596 126062 4671 -212578 -117950 -49560
18070 -344531 -35103 -259456 -16795 -230473 -27876 -128194 59520 -145567 -143399 177031 -9106
18058 -95929 61704 -142259 229336 -69209 -160608 -300198 28559 -328633 -225276 -445744
18048 -445744 -215617 15992 -168261 -143134 -98750 -123359 -18692 -33259 165601 48111 174213
18037 174213 -199530 68116 -39982 -125922 179969 -188720 35735 -307263 -272216 89273 -210361
18025 67891 182548 159924 -197099 -14812 -114884 -196853 -100237 -358598 157448 -32224 89614
18013 12059 107299 -528393 5235 29354 245206 -158029 238852 218322 -357147 -114878 135559
18001 -60064 -44955 -83002 -54494 158173 -343726 -357896 -261521 -94496 116935 372611 161415
$$ packed form
18082A29672C3227a01092j27050Q8079A1042M554J10466D671b12578R4628d9560
18070c44531c5103k24353a6795k13678b7876j00318E9520a45567K168A77031i106
18058i5929F1704a42259B29336f9209r1399j39590B8559c28633J03357k20468
18048d45744b15617A5992a68261K5127M4384k4609a8692j4567A65601D8111J26102
18037A74213a99530F8116c9982q5940A79969a88720C5735c07263L5047H9273b10361
18025F7891J14657k2624a97099a4812j00072q1969R6616k58361A57448c2224H9614
18013A2059R5240e28393E235K4119K15852a58029B38852k0530c57147a14878A35559
18001f0064J5109l8047K8508A58173c43726j4170R6375i4496A16935K55676A61415
$$ plain form
17989 -115568 -91316 157511 43131 -105251 120675 60611 -170897 30322 -82402 255999
17978 64030 -245295 -21424 204389 -14405 305945 -158324 -138780 8324 47855 -215078 -53290
17966 -9163 -78142 -326080 83565 -152119 -87599 236871 55302 -60369 26753 83271 228910
17955 228910 -220713 49745 -50202 -50073 113605 -32144 -170239 -227987 2916 1759 -370540
17943 117812 -15384 -122031 61901 -183779 5136 270903 54686 13100 -134680 -144930 296895
17931 -122206 -111529 -21968 -197385 -189175 -154541 91006 59738 -210170 106099 -84529 -16251
17919 74030 112974 -14808 -221119 92619 -168946 -112559 -118109 -117082 6634 62274 40951 72003
17907 72003 227992 259980 111355 31118 69459 -101025 30350 -192825 219959 -48163 -323234
$$ packed form
17989a15568K4252A57511D3131a05251A20675o0064a70897C0322h2402B55999
17978F4030b45295b1424B04389a4405C05945a58324J9544H324L9531b15078e3290
17966i163o8979k47938H3565a52119O4520B36871E5302f0369B6753N6518J45639
17955B28910b20713D9745e0202J29A13605c2144j38095n7748B916j157c70540
17943A17812a5384j06647F1901a83779E136K65767E4686A3100a34680j0250B96895
17931a22206J0677b1968j75417Q210L4634I1006l1268b10170A06099h4529a6251
17919G4030L8944a4808k06311I2619a68946N6387n550J027F634N5640k1323L1052
17907G2003J55989L1988A11355C1118L8341a01025C0350a92825B19959d8163k75071
$$ plain form
17896 -323234 258565 289982 -171160 -86774 -301750 225369 -87693 -69560 104026 55848
17886 55848 31986 -255803 -93641 114758 -259938 76982 -109648 -273304 -57733 -340320
17876 -340320 192485 -162840 -211002 141328 83992 -95071 121061 -263444 181421 215675
17866 215675 -93465 -146586 207771 210981 188450 76880 -214284 127504 237239 -57281 -213645
17855 -213645 -68407 -66483 46290 305336 -202093 242801 -120669 21574 213571 124562 353109
17844 353109 -994 122184 33778 21030 -215199 88003 -19466 298689 -17495 -148746 93478
17832 -98668 121501 -16809 86745 6531 35049 141447 39105 -147992 79438 -25787 -303345
17821 -303345 189487 -38192 65456 229219 195683 242080 143186 92643 353199 126417 -150832
$$ packed form
17896c23234B58565L1417a71160Q4386k14976B25369h7693J8133A04026m8178
17886E5848k3862b55803i3641A14758b59938G6982a09648j63656e7733k82587
17876c40320A92485a62840m8162A41328n7336i5071A21061b63444A81421L4254
17866B15675i3465n3121B07771L210k2531G6880b14284A27504J09735e7281j56364
17855b13645f8407J924D6290K59046b02093B42801a20669B1574J91997q9009K28547
17844C53109i94A22184C3778j2748b15199H8003a9466B98689a7495j31251I3478
17832i8668A21501a6809H6745F531K8518J06398C9105a47992G9438b5787k77558
17821c03345A89487c8192F5456J63763l3536M6397r8894n0543K60556A26417a50832
$$ plain form
17809 -57650 106339 274566 -237403 -36975 -183980 -195531 -100247 -84627 -266273 -27240 33386
17797 -215913 58351 -89799 -74833 -120813 168529 179125 -133495 -39714 -30264 1432 18285
17786 18285 -120827 -38125 -145386 796 157443 -176611 -138217 174048 76434 138670 194807
17775 194807 -52073 239627 20390 -232451 -45594 -165544 106950 -65371 261032 -87316
17764 76085 9384 -6989 210580 152650 -37615 -356322 91917 -54991 -158703 -192561 11209
17752 28868 193612 147753 41055 -44350 -107473 80129 -35214 -158701 240147 9816 137468
17741 137468 -33718 78782 -17958 286241 269719 -113815 13134 126023 188778 -226729 -194029
17730 -194029 -103003 17815 -199277 -245508 -94498 -37500 -55311 -159268 -244792 -161694 -109621
$$ packed form
17809e7650A06339J68227b37403c6975j47005j1551R5284J5620j81646b7240C3386
17797b15913E8351h9799J4966m5980A68529J0596a33495c9714R450A432J6853
17786A8285a20827c8125j07261G96J56647a76611L8394A74048G6434O2236N6137
17775A94807e2073B39627B0390b32451d5594j19950A06950f5371B61032h7316
17764G6085I384f989B10580n7930c7615l18707I1917e4991j03712l3858A1209
17752B8868J64744m5859D1055d4350o3123H0129c5214j23487B40147I816J27652
17741A37468c3718G8782a7958B86241j6522a13815A3134J12889O2755b26729L2700
17730a94029R1026A7815a99277m6231i4498c7500j7811j03957q5524Q3098N2073
$$ plain form
17719 -109621 120695 -139956 143147 -46994 -126096 -13148 -202455 -121665 -99401 -70764 223707
17707 -97296 -466575 243257 92962 -100574 -68247 45767 -132544 -105424 -51785 120144 -33913
17695 131569 -80883 202753 -68044 -16956 33386 -164755 -34205 123475 -94903 61010 -8488
17683 103147 144211 -87053 -103969 -395694 -100453 -100722 19581 17575 75749 -36464 -78971 -313043
17671 -313043 97286 234926 -63688 35435 -28178 196869 396962 207954 -321445 -192722
17661 -192722 49909 93207 213156 117263 -70708 -22911 -225273 100347 92178 121823 78903
17650 78903 -49491 168510 20755 -72260 216948 21854 10115 429352 103672 254833 66920
17638 -363553 220587 -88634 32473 -137472 186983 -92229 49988 152603 -338050 -25968
$$ packed form
17719a09621A20695a39956A43147d6994p9102a3148j89307Q0790K2264K8637B23707
17707i7296l69279B43257I2962a00574L2327D5767a32544K7120e1785A20144c3913
17695A31569h0883B02753f8044a6956C3386a64755c4205A23475i4903F1010h488
17683A03147M1064h7053j6916k91725a00453k69A9581k006N8174c6464m2507k34072
17671c13043I7286J37640f3688C5435b8178A96869K00093j89008c21445J28723
17661a92722D9909M3298J19949r5893g0708b2911k02362A00347q169K9645m2920
17650G8903d9491A68510B0755g2260B16948B1854A0115M19237A03672J51161F6920
17638c63553B20587h8634C2473a37472A86983i2229D9988J02615c38050b5968
$$ plain form
17627 -80309 -350366 31424 86963 -187172 -5196 46034 241222 -116223 -391085 -103064 -153223
17616 -153223 327089 308155 -51620 328183 -288638 -248296 22506 252 8982 208953 -18989
17604 212260 116182 158916 -202873 196493 191577 225292 -18418 125130 43996 156066 211654
17593 211654 -246332 6613 -251183 39460 76911 -239444 -16493 -275505 256706 -323289
17582 344379 -317810 87627 122731 42772 66955 -8071 -141726 37963 68765 -258904 -104953
17570 -95243 -178338 256756 197836 278837 -157007 -7939 -210076 194442 23476 -266993 -62183
17558 -166193 17795 81171 19128 -67808 -84188 67863 -77314 -59901 78377 95808 266590
17547 266590 130104 372329 263376 113778 -35089 -78748 166025 54726 190343 -206436
$$ packed form
17627h0309k70057C1424N5539a87172e196D6034J95188a16223k74862a03064n0159
17616a53223C27089j8934e1620C28183b88638M0342B2506B52Q730J99971a8989
17604B12260r6078M2734b02873A96493m916L3715a8418A25130D3996J12070N5588
17593B11654b46332F613b51183C9460L7451b39444a6493k59012B56706c23289
17582C44379c17810H7627L5104D2772K4183h071j33655C7963L0802b58904a04953
17570i5243q3095B56756n8920Q1001a57007g939k02137A94442B3476b66993f2183
17558a66193A7795O3376A9128f7808j6380F7863g7314J7413G8377J7431J70782
17547B66590A30104K42225j08953A13778c5089m3659A66025E4726J35617b06436
$$ plain form
17536 -108738 -263600 195884 58374 246508 -129722 180264 108539 212517 135195 347654
17526 347654 304966 -218674 287864 95584 -102395 61960 -245 177398 188989 -76784 -9901
17514 285718 267799 138559 172737 231129 395213 -178396 267874 -31171 279653 111988
17503 -122019 -40864 -88957 -96679 138270 121959 82328 -14932 -70466 20256 -197295 239414
17491 -8668 201976 476 73200 406755 162875 -163476 95128 295024 215159 273868 33007
17479 -46803 17077 96396 399000 109859 44822 212793 213765 -129217 328941 209918 302976
17468 302976 209996 195911 213293 -71202 15594 191577 268413 52572 306312 33804 291348
17457 291348 132182 127401 282310 103186 261263 246696 134128 243742 207080 328218
$$ packed form
17536a08738j54862A95884E8374J88134a29722A80264p1725J03978p7322K12459
17526C47654m2688b18674B87864I5584a02395F1960b45A77398J1591g6784i901
17514B85718j7919j29240L4178N8392J64084a78396B67874c1171B79653A11988
17503a22019d0864m8093p722A38270j6311l9631a4932n5534B0256a97295B39414
17491h668B01976D76P2724L33555A62875a63476I5128J99896p9865N8709C3007
17479d6803A7077P9319L02604A09859D4822J67971R72a29217C28941j19023R3058
17468C02976r2980j4085J7382g1202A5594J75983P6836E2572K53740C3804K57544
17457B91348A32182m781J54909A03186J58077j4567j12568J09614l6662J21138
$$ plain form
17447 328218 412324 300152 208195 277859 35539 280750 203337 446419 204869 356287
17437 356287 354054 356166 347814 241784 243168 3910 427956 275171 153630 51995 367526
17426 367526 148858 323213 403899 243553 97404 188613 266951 -8105 198531 119060 182814
17415 182814 491336 112749 437802 174929 199505 -98783 -126366 -4758 191984 786098
17405 786098 -47870 169595 -111200 119010 166864 -1682 120879 459091 -170105 311681
17394 391223 31333 303090 340101 170303 -246739 292552 354615 141262 154629 242924
17384 242924 201967 279085 -88579 73454 79209 45509 130761 92692 151399 276891 256527
17373 256527 127681 30020 105921 446437 54032 108593 38585 -12035 -49272 184977 372396
$$ packed form
17447C28218Q4106j12172r1957O9664C5539K45211p7413K43082B04869J51418
17437C56287k233K112q352j06030J384C910M24046j52785j21541E1995L15531
17426C67526A48858J74355Q0686j60346I7404R1209P8338h105A98531p9471O3754
17415A82814L08522A12749L25053A74929K4576i8783k7583d758A91984N94114
17405G86098d7870A69595a11200A19010M7854a682A20879L38212a70105C11681
17394C91223C1333K71757L7011j69798b46739B92552O2063A41262J3367Q8295
17384B42924m0957P7118h8579G3454N755l3700Q5252l8069N8707J25492k0364
17373B56527A27681C0020P5901L40516E4032N4561C8585a2035l7237A84977J87419
$$ plain form
17362 372396 220083 67230 -349936 180134 3570 51151 248129 213401 206442 39465 406547
17351 406547 173115 259006 -110947 303737 -54392 120343 8048 257971 -2157 298225 123935
17339 352637 -27007 163534 -101132 104553 18822 12870 -175308 86702 120465 58646 149170
17328 149170 159305 -34453 411350 215831 306927 154058 -53354 418864 301627 404060
17318 404060 -24393 133567 281536 234229 191377 160289 74903 194218 406734 332470 77343
17306 172516 202266 50452 136577 92722 338749 303341 353993 374427 -57850 350708 86936
17294 -54738 259154 -265275 62604 334326 43946 310102 169582 129251 -198105 248837
17283 571626 463829 174157 -102681 94930 47739 76101 -111871 -45329 338594 201000
$$ packed form
17362C72396j52313F7230c49936A80134C570M7581J96978l4728o959C9465L67082
17351D06547A73115Q5891a10947C03737e4392A20343H048K49923b157B98225A23935
17339C52637b7007A63534a01132A04553A8822n952a75308H6702L3763E8646R0524
17328A49170J0135c4453D11350j95519R1096j52869e3354D18864j17237J02433
17318D04060b4393A33567J47969m7307m2852l1088G4903J19315K12516p4264G7343
17306A72516K9750E0452Q6125m3855K46027l5408N0652K0434e7850C50708H6936
17294e4738B59154b65275F2604K71722D3946K66156j40520m0331a98105B48837
17283E71626j07797A74157a02681I4930m7191K8362a11871d5329C38594j37594
$$ plain form
17273 201000 71913 26583 39460 114151 135436 -52030 247997 372489 633117 241056 382506
17262 382506 71152 66767 174435 -22580 -56971 210108 150642 152547 184624 204254 214304
17251 214304 61602 154076 108316 147631 280178 308975 -18694 208088 100158 469253 72391
17239 89724 33048 171043 -154393 139072 2107 -10101 463522 241017 402236 156963
17228 -32233 378867 41828 111948 198418 64893 558995 170603 421329 260168 207488 348010
17217 348010 130311 524985 272156 268864 133380 217208 -26130 521119 197127 473008
17207 473008 288455 116088 482821 83085 204231 192079 194856 2036 53450 10819 301299
17196 301299 516141 67212 500205 456912 165728 350106 215966 8164 263396 403568
$$ packed form
17273B01000G1913B6583J2877P4691K1285e2030B47997J24492K60628B41056J41450
17262C82506G1152m385J07668b2580l4391B10108n9466J905L2077J9630J0050
17251B14304F1602R2474m5760L9315J32547K8797a8694B08088A00158L69095G2391
17239H9724C3048J37995a54393A39072B107a0101D63522k22505J61219A56963
17228c2233C78867D1828P0120Q6470F4893M94102A70603K50726j61161n2680J40522
17217C48010A30311L94674k52829l292A33380Q3828b6130E21119A97127K75881
17207D73008j84553A16088L66733H3085J21146j2152K777B036N1414A0819K90480
17196C01299K14842F7212M32993m3293A65728J84378j34140H164K55232J40172
$$ plain form
17186 403568 -234275 94906 346704 324174 258549 128485 260742 221657 407507 84456
17175 250796 397259 13735 680205 373741 284534 250059 82686 434400 374433 405429 164903
17163 301131 254690 -25414 249571 123003 252362 400789 403658 239328 67768 232060
17153 232060 402438 135707 311248 33118 459651 369732 309138 89401 338823 115628
17142 224063 565893 323410 -19114 257800 294521 755812 392175 431024 259231 206744
17132 206744 93542 357804 423033 173288 489059 251556 360594 287353 381682 319867
17122 319867 294724 194547 107277 277636 338321 132674 237191 144989 232528 445734
17112 445734 425071 312392 252404 488218 248185 308162 482637 367270 186978 424232
$$ packed form
17186D03568b34275I4906K51798k2530o5625A28485J32257l9085J85850H4456
17175B50796J46463A3735O66470l06464q9207l4475H2686L51714n9967L0996A64903
17163C01131m6441b5414B49571A23003J29359J48427K869j64330F7768J64292
17153B32060J70378A35707J75541C3118M26533q9919o0594H9401K49422A15628
17142B24063L41830k42483a9114B57800L6721M61291l63637L8849j71793n2487
17132B06744I3542K64262O5229A73288L15771k37503J09038p3241R4329o1815
17122C19867k5143j00177q7270J70359O0685A32674J04517r2202Q7539K13206
17112D45734k0663j12679n9988K35814k40033N9977J74475j15367j80292K37254
$$ plain form
17102 424232 397013 183188 473617 644060 155317 475198 426101 670321 247335 553306
17092 553306 343769 121786 397572 -15784 729727 47314 741916 522706 428208 402360
17082 402360 304734 314908 376721 320430 536497 272160 379994 453594 984429 450717
17071 439614 622752 526292 355026 709517 548627 495301 406542 371318 670712 556928
17061 556928 745295 449525 452899 523584 381492 496089 387382 332384 815477 139611
17050 213083 266293 362834 348282 426436 487969 509459 772789 376126 600151 560244 440033
17039 440033 783440 515202 418859 445238 375107 408524 486905 900575 335263 719794
17029 719794 608537 757448 862259 678207 472893 575633 714631 793097 717162 838021
$$ packed form
17102D24232k7219A83188K90429J70443A55317L19881m9097K44220B47335L05971
17092E53306k09537A21786K75786a5784G29727D7314O94602k19210r4498k5848
17082D02360r7626J0174O1813n6291K16067k64337J07834P3600N30835D50717
17071D39614J83138r6460j71266L54491j60890n3326q8759l5224K99394j13784
17061E56928J88367k95770L374P0685j42092J14597j08707n4998M83093A39611
17050B13083N3210R6541j4552P8154O1533K1490K63330C76126K24025l9907j20211
17039D40033L43407k68238r6343K6379p0131L3417P8381M13670C35263L84531
17029G19794j11257J48911J04811j84052k05314J02740J38998P8466p5935J20859
$$ plain form
17019 838021 653773 586377 925966 1034753 629261 664546 345798 581577 750117 754404
17009 754404 470672 280219 738694 434236 799294 1135038 594757 864464 538020 632660
16999 632660 967137 919516 620779 682427 504850 775306 923141 908369 497107 745730
16989 745730 896777 653514 883929 723043 393579 1038173 1085857 606782 735114 788748
16979 788748 1030685 798228 707438 861587 858142 989283 1005270 847598 789399 730456 899631
16968 899631 1260010 902250 702296 1112970 996652 1030568 832166 1128975 1215980 1020662
16958 1020662 955836 846293 889638 813099 859923 908633 1223424 1046460 1287676 1049785
16948 1049785 943059 1241915 1035871 891536 1096451 932120 947960 995210 1216009 1153808
$$ packed form
17019H38021j84248o7396L39589J08787m05492L5285l18748K35779J68540M287
17009G54404k83732j90453M58475l04458L65058L35744n40281K69707l26444R4640
16999F32660L34477m7621k98737O1648j77577K70456J47835j4772m11262K48623
16989G45730J51047k43263K30415j60886l29464O44594M7684m79075J28332N3634
16979G88748K41937k32457r0790J54149l445J31141J5987j57672n8199n8943J69175
16968H99631L60379l57760j99954M10674j16318L3916j98402K96809Q7005j95318
16958A020662o4826j09543M3345p6539M6824M8710L14791j76964K41216k37891
16948A049785j06726K98856k06044j44335K04915j64331J5840M7250K20799o2201
$$ plain form
16938 1153808 1343518 1317031 1401623 1147418 1115713 1072207 1196910 1154024 1238614 1059006
16928 1059006 1504441 1132676 1289758 1328088 1229067 1412672 1446584 1426865 1435191 1333504
16918 1333504 1533981 1145972 1105207 1570529 1286096 1283570 1582094 1469997 1359225 1566314
16908 1566314 1786558 1991829 1611023 1788976 1419212 1717117 1670840 1667719 1736234 1868791
16898 1868791 1544948 1804133 1624821 1723836 1961540 1933883 1797543 2063984 2094308 1831807
16888 1831807 2117650 1950986 2059941 2144974 2077991 2333822 2199531 2173188 2192476 2159594
16878 2159594 2283928 2434219 2321432 2672689 2358506 2299513 2398714 2159539 2383875 2337046
16868 2337046 2604445 2342336 2555482 2631018 2885196 2722169 2617363 2714368 2673909 2995013
$$ packed form
16938A153808J89710k6487Q4592k54205l1705m3506J24703m2886Q4590j79608
16928A059006M45435l71765J57082L8330r9021J83605L3912j9719Q326j01687
16918A333504K00477l88009m0765M65322k84433k526K98524j12097j10772K07089
16908A566314K20244K05271l80806J77953l69764K97905m6277l121O8515J32557
16898A868791l23843K59185j79312R9015K37704k7657j36340K66441L0324k62501
16888A831807K85843j66664J08955Q5033o6983K55831j34291k6343J9288l2882
16878B159594J24334J50291j12787L51257l14183n8993R9201k39175K24336m6829
16868B337046K67399k62109K13146P5536K54178j63027j04806R7005m0459L21104
$$ plain form
16858 2995013 3031750 2843350 3273066 2735098 3238939 2990371 3113623 3373616 3239233 3398326
16848 3398326 3033209 3336757 3220582 3461937 3492144 3705353 3656556 3619010 3804828 3474979
16838 3474979 4314201 4125205 4179486 4399496 4057982 4177503 4618016 4570185 4628324 4662490
16828 4662490 4458771 4431458 4801631 4914345 5111595 5194281 5302583 5077726 5449198 5294373
16818 5294373 5614755 5420286 5654446 5903064 6148548 6429646 5840882 6206637 6567458
16809 6567458 6585056 6539744 7100338 7103970 7172967 7236144 7024469 7692692 7946936 7949406 7666870
16798 7666870 8339748 8372206 8478471 8763821 9049175 9498283 9944326 9893398 10373623 10520398
16788 10520398 10678264 10775147 11238404 11518991 11862373 12029837 12296136 12895631 13408227
$$ packed form
16858B995013L6737j88400M29716n37968N03841k48568J23252K59993j34383J59093
16848C398326l65117L03548j16175K41355L0207K13209m8797l7546J85818l29849
16838C474979Q39222j88996N4281K20010l41514J19521M40513m7831N8139L4166
16828D662490k03719k7313L70173J12714J97250Q2686J08302k24857L71472j54825
16818E294373L20382j94469K34160K48618K45484K81098n88764L65755L60821
16809F567458J7598m5312N60594L632O8997O3177k11675O68223K54244K470k82536
16798G666870O72878L2458J06265K85350K85354M49108M46043n0928M80225J46775
16788A0520398J57866R6883M63257K80587L43382J67464K66299N99495N12596
$$ plain form
16779 13408227 13815602 14209684 14398580 14748937 15103029 15611556 15973585 17043323 17531117
16770 17531117 18011234 18954716 19385822 19856133 20700848 21336361 22691716 23005363 24357738
16761 24357738 25138256 25954579 26985593 28245723 29022724 30696218 31515785 33369145 34818220
16752 34818220 36136217 38269926 40044903 42096570 44007682 46268707 48679596 51040968
16744 51040968 53872863 56404225 59639149 62996842 66885567 70328653 74547970 78919295
16736 78919295 83735379 88847693 93911141 99640005 105757353 111664930 118511950 125466367
16728 125466367 132188395 139747485 147182662 154607877 161853121 168507589 175005438 180361075
16720 180361075 185555014 189655728 192311698 193940312 194177244 193249936 191271513 187431034
$$ packed form
16779A3408227M07375L94082J88896L50357L54092N08527L62029J069738M87794
16770A7531117M80117R43482M31106M70311Q44715O35513J355355L13647J352375
16761B4357738P80518Q16323J031014J260130P77001J673494Q19567J853360J449075
16752C4818220J317997K133709J774977K051667J911112K261025K410889K361372
16744E1040968K831895K531362L234924L357693L888725L443086M219317M371325
16736G8919295M816084N112314N063448N728864O117348N907577O847020O954417
16728A25466367O722028P559090P435177P425215P245244O654468O497849N355637
16720A80361075N193939M100714K655970J628614K36932r27308j978423l840479
$$ plain form
16712 187431034 182829246 178104766 171528546 164520923 157286113 150127782 142404444 134909503
16704 134909503 127275871 120470229 114022982 106978199 100654213 94637161 88962871 84007739
16696 84007739 78955304 74290296 70195476 66011031 62533803 59109154 56086442 52939820
16688 52939820 50265809 47708904 44914617 42917172 40700500 38468184 36638700 35430751
16680 35430751 33752664 31988949 30788823 29245822 28096761 27044438 25909340 24366534
16672 24366534 23663759 22720752 22140664 21190147 20226484 19605738 18666148 18049914 17517566
16663 17517566 16828602 16166821 15785264 15276160 14503078 14077181 13738618 13191967 12857172
16654 12857172 12805859 12225758 11845097 11064491 10756948 10843288 10742006 10156673 9892834 9532975
$$ packed form
16712A87431034m601788m724480o576220p007623p234810p158331p723338p494941
16704A34909503p633632o805642o447247p044783o323986o017052n674290m955132
16696H4007739n052435m665008m094820m184445l477228l424649l022712l146622
16688E2939820k674011k556905k794287j997445k216672k232316j829484j207949
16680C5430751j678087j763715j200126j543001j149061j052323j135098j542806
16672B4366534p02775r43007n80088r50517r63663o20746r39590o16234n32348
16663A7517566o88964o61781l81557n09104p73082m25897l38563n46651l34795
16654A2857172n1313n80101l80661p80606l07543Q6340j01282n85333k63839l59859
$$ plain form
16644 9532975 8987338 9038977 8818541 8614899 8680972 8267534 7848125 7661773 7699966 7207939
16634 7207939 7374263 6989288 6879838 6676538 6393731 6471733 6139321 6580770 5858389 5650147
16624 5650147 5820920 5560617 5411755 5064898 5325278 5015204 5139483 4917435 5002016 4668897
16614 4668897 4507888 4321334 4390683 4071622 3900592 4215843 4284530 3859952 3898631 3651999
16604 3651999 3600940 3756330 3609699 3291698 3538941 3552437 3578483 3525488 3210141 3420999
16594 3420999 2929831 3241207 3126103 2719398 3255672 3141649 2744646 2514104 2516216 2433774
16584 2433774 2847032 2652283 2690971 2428508 2471921 2672925 2547457 2805026 2388311 2356631
16574 2356631 2315478 2191345 2328785 2199301 2141952 2229778 1875058 2266313 1767136 2035710
$$ packed form
16644I532975n45637N1639k20436k03642O6073m13438m19409j86352L8193m92027
16634G207939J66324l84975j09450k03300k82807P8002l32412M41449p22381k08242
16624E650147J70773k60303j48862l46857K60380l10074J24279k22048Q4581l33119
16614D668897j61009j86554O9349l19061j71030L15251O8687m24578L8679k46632
16604C651999n1059J55390j46631l18001K47243J3496K6046n2995l15347K10858
16594C420999m91168L11376j15104m06705N36274j14023l97003k30542K112q2442
16584B433774M13258j94749L8688k62463M3413K01004j25468K57569m16715l1680
16574B356631m1153j24133J37440j29484n7349Q7826l54720L91255m99177K68574
$$ plain form
16564 2035710 1940316 1985018 2312639 1944725 2213216 1704014 1998062 1720131 1672322 1866279
16554 1866279 1891091 2009502 1751076 1335116 1584666 1729445 1820613 1375327 1588824 1515081
16544 1515081 1252734 1554487 1617487 1316638 1450111 1690618 1322897 1483851 1013563 1376221
16534 1376221 1277694 1521671 1242943 1518769 1386607 994210 986742 1083752 1237662 1364308
16524 1364308 1190733 1181999 1033297 1001870 945271 1176421 1130314 1177917 910789 1114200
16514 1114200 766845 1152473 938176 1154195 996084 903440 929873 1111489 989437 860669
16504 860669 1064258 945986 948957 1366314 1059873 663191 1022932 735208 937399 1064115
16494 1064115 775477 926493 772472 876517 855262 809098 669650 1012428 727541 588118
$$ packed form
16564B035710r5394M4702L27621l67914K68491n09202K94048k77931m7809J93957
16554A866279K4812J18411k58426m15960K49550J44779R1168m45286K13497p3743
16544A515081k62347L01753O3000l00849J33473K40507l67721J60954m70288L62658
16534A376221r8527K43977k78728K75826j32162l92397p468R7010J53910J26646
16524A364308j73575q734j48702l1427n6599K31150m6107M7603k67128K03411
16514A114200l47355L85628k14297K16019j58111r2644K6433J81616j22052j28768
16504H60669K03589j18272K971M17357l06441l96682L59741k87724K02191J26716
16494A064115k88638J51016j54021J04045k1255m6164j39448L42778k84887j39423
$$ plain form
16484 588118 772038 643319 669249 805060 829841 1005948 920683 626845 630407 675559 652474
16473 652474 389208 710344 731335 445621 475825 711004 913345 492325 819349 467500
16463 467500 777375 820296 514084 789851 660495 646009 546600 314107 412015 494957
16453 494957 546296 481074 809574 638645 1064023 1018450 432037 587904 664245 580508
16443 580508 459853 669443 905180 678501 380307 433031 151064 560046 359680 438408
16433 438408 432247 406251 593516 199825 796685 400202 406765 533695 401676 1009234
16423 1009234 504433 258527 103530 490908 469012 411239 270832 535536 434330 515825
16413 515825 320425 754996 275370 276727 552130 569572 175377 96703 611614 522608
$$ packed form
16484E88118J83920j28719K5930J35811K4781J76107q5265k93838L562M5152k3085
16473F52474k63266L21136K0991k85714L0204K35179K02341m21020L27024l51849
16463D67500L09875M2921l06212K75767j29356j4486r9409k32493R7908Q2942
16453D94957N1339o5222L28500j70929M25378m5573D32037J55867P6341q3737
16443E80508j20655K09590K35737k26679k98194N2724A51064M08982k00366P8728
16433D38408o161k5996J87265A99825N96860l96483O563J26930j32019O07558
16423A009234E04433k45906A03530L87378k1896n7773j40407K64704j01206Q1495
16413E15825j95400M34571B75370J357K75403J7442A75377p8674N14911q9006
$$ plain form
16403 522608 266492 94247 340891 588922 485908 429168 712941 230177 498966 539395
16393 539395 213351 128499 186267 460704 358369 299988 539955 263169 252945 519163
16383 519163 196122 168501 445234 438400 304365 190254 112525 354082 308361 348841 416322
16372 416322 115312 314518 432023 204753 318781 354710 485312 425100 85543 129886
16362 129886 119563 28115 41451 72977 287499 129417 222486 433927 -45460 178411 475907
16351 475907 136474 496610 39454 356691 31552 254161 269970 318307 325901 9453 203257
16340 203257 329059 144915 521067 444165 71205 11585 263800 229640 468682 311163
16330 311163 500360 111807 9378 119177 5628 -3800 35100 -249021 68162 318596 -102448
$$ packed form
16403E22608k56116I4247K46644K48031j03014n6740K83773B30177K68789M0429
16393E39395B13351q4852N7768K74437j02335n8381K39967B63169j0224K66218
16383E19163A96122k7621K76733o834j34035j14111p7729K41557m5721M0480O7481
16372D16322A15312J99206J17505B04753J14028L5929J30602o0212H5543M4343
16362A29886j0323B8115J3336L1526K14522A29417R3069K11441d5460A78411K97496
16351D75907A36474L60136C9454L17237C1552K22609J5809M8337P594I453J93804
16340B03257J25802A44915L76152p6902G1205A1585K52215l4160K39042j57519
16330C11163J89197A11807I378J09799E628c800C5100b49021F8162K50434a02448
$$ plain form
16318 183103 144621 465160 465804 232951 191623 -113171 195705 297298 256604 110953 255698
16307 255698 532319 461673 453705 50263 423071 -379643 251605 -80090 177090 -200700
16296 126381 242273 25718 201873 128126 266413 135013 292157 128513 -119111 157023
16285 291481 313930 74471 94082 214247 -37920 495374 195941 80747 35287 651 262746
16274 262746 227321 299374 243844 201511 154993 200882 226591 35008 354333 209534 467456
16263 467456 22655 57491 48131 -190642 212113 -271303 86682 190191 246149 -227904 223671
16251 -37417 128866 -81035 259775 203616 270479 158185 194489 30644 240891 -126 201425
16239 212859 -221697 -89566 61185 -363341 -93867 255919 140785 31511 162467 259617
$$ packed form
16318A83103l8482L20539O44k32853m1328a13171A95705J01593m0694A10953J44745
16307B55698K76621p0646p968E0263L72808c79643B51605h0090A77090b00700
16296A26381J15892B5718J76155p3747J38287j31400J57144A28513a19111A57023
16285B91481K2449G4471J9611J20165c7920D95374A95941H0747C5287F51K62095
16274B62746l5425P2053n5530m2333m6518M5889K5709C5008L19325j44799K57922
16263D67456B2655L4836r360a90642B12113b71303H6682J03509N5958b27904B23671
16251c7417A28866h1035B59775n6159O6863j12294L6304C0644K10247a26B01425
16239B12859b21697h9566F1185c63341i3867B55919j15134C1511J30956R7150
$$ plain form
16229 259617 -109103 -164458 190053 70277 271032 177649 64305 -71374 301086 344273 239683
16218 239683 378129 -33176 91533 26966 135447 -91921 334914 179117 16042 -140426
16207 -79653 -174033 -87792 -329284 46616 268736 320531 174857 5915 345678 296550 46843
16195 80690 15032 28268 132516 129348 336567 227846 226412 12374 -316152 -323724 36001
16183 -30819 140264 112147 123932 -200221 123554 25665 -131033 88604 -20715 -481378 174277
16171 122122 -140778 -27436 261950 -10451 67413 209564 361247 -128012 7259 283677
16161 283677 92580 62889 -35379 233617 46005 120523 -28493 214507 102321 -135591 96723
16149 57490 172239 96237 127560 289449 87297 325232 98958 45173 274491 99910 -2807
$$ packed form
16229B59617a09103n5355A90053G0277K00755r3383F4305g1374C01086M3187j04590
16218B39683J38446c3176I1533B6966J08481i1921C34914j55797A6042a40426
16207g9653r4380Q6241k41492D6616K22120N1795j45674E915L39763m9128D6843
16195H0690A5032J3236J04248l168K07219j08721j434A2374c16152p572C6001
16183c0819A40264k8117J1785b00221A23554B5665a31033H8604b0715m60663A74277
16171A22122a40778b7436B61950a0451F7413J42151J51683a28012G259K76418
16161B83677I2580k9691c5379B33617D6005P4518b8493B14507A02321a35591I6723
16149E7490J14749p6002L1323J61889H7297K37935I8958D5173K29318I9910b807
$$ plain form
16137 -119681 40632 -171993 39743 111515 159124 84173 -242815 131714 -245907 -259177 159699
16125 19686 169438 -24768 -21632 155702 -75757 155839 -24371 89553 10514 -163651 283522
16113 -231638 -31527 126448 210401 -176776 -32671 99928 -184780 80048 -62049 217970 281012
16102 281012 -14498 87827 445086 -197808 77372 -164004 -19034 4947 -80475 160877 -47064
16090 -170715 -74208 280538 99704 -42362 -19743 -27264 172970 -37992 -142574 -127800 -83112
16079 -83112 -130135 -296150 109754 -116844 128053 168524 158942 -250437 109606 -170890
16068 -183760 -196662 67356 -171720 -147864 -143914 118802 -87804 139790 -193072 26947 -236101
16056 52661 -3072 -221967 152448 -70902 122678 -530345 -193146 45422 -122306 -249813
$$ packed form
16137a19681D0632a71993C9743P1772M7609p4951b42815A31714b45907j3270A59699
16125A9686J49752b4768L136A55702g5757A55839b4371H9553A0514a63651B83522
16113b31638c1527A26448Q3953a76776c2671I9928a84780H0048f2049B17970O3042
16102B81012a4498H7827L57259a97808G7372a64004a9034D947h0475A60877d7064
16090a70715g4208B80538I9704d2362a9743p521A72970c7992j04582J4774M4688
16079h3112m7023j66015A09754a16844A28053M0471r582b50437A09606a70890
16068a83760j2902F7356a71720K3856L950A18802h7804A39790a93072B6947b36101
16056E2661c072k18895A52448g0902A22678e30345a93146D5422a22306j27507
$$ plain form
16046 -249813 23 365516 -8830 228619 139483 -59456 -337591 -48022 -129861 112486 -422389
16034 -287474 -148388 11314 26978 -186305 -90587 98495 -197624 -167933 100618 150544 73045
16022 80752 159731 -94567 4845 -131656 76296 1197 177320 -183128 168235 -59693 166514
16010 97013 366115 267513 196972 62691 83028 64622 -38022 -207713 -225617 101534 103033
15999 103033 68010 -48267 -47739 130033 3265 -7799 -123125 417 -163196 -280106 -6503 149615
15986 198651 23505 136781 114863 378957 247469 76893 214463 351727 121996 -143587
15975 86981 51223 28658 8987 181151 41161 -201202 -80376 -344643 191118 -169107 40523
15963 -35069 147791 -1509 247443 -100680 -80965 -440277 -380517 -70870 -191555 -89727 -309924
$$ packed form
16046b49813B3L65493h830B28619q9136e9456k78135d8022q1839A12486d22389
16034b87474J39086A1314J5664a86305i0587I8495a97624K9691A00618M9926G3045
16022H0752P8979i4567D845a31656G6296A197J76123a83128A68235e9693A66514
16010I7013K69102r8602p0541F2691K0337j8406c8022j69691j7904A01534J499
15999A03033l5023d8267N28A30033C265g799j15326D17a63196j16910f503A49615
15986A98651B3505J13276k1918K64094j31488G6893J37570J37264A21996a43587
15975H6981l5758k2565H987J72164D1161b01202h0376k64267A91118a69107D0523
15963c5069A47791a509B47443a00680J9715l59312N9760g0870j20685h9727k20197
$$ plain form
15952 -309924 -82148 49101 130794 -345448 -24120 -99008 -324893 173945 101860 117953 327741
15941 327741 -191122 37532 -102948 -202630 -50065 -60882 -151334 -16175 15913 107946 -81449
15929 -112185 -92855 159184 -313092 51249 -199465 -20906 2577 207160 -55020 -29717 -317630
15918 -317630 145700 -24251 76854 -117069 -151351 -72004 -507997 131734 -333544 -77350
15907 596966 285326 -251762 -251172 -310792 -258844 -239081 -18232 -165877 -302731 -70257 98542
15895 42113 -230816 53799 161590 193272 135987 -47189 178537 -198545 -218681 -217846 213577
15883 95621 -35403 -229364 -26784 -138780 -160827 -70302 -225362 -45889 -85463 -273861 38068
15871 75101 -227942 -27226 -11839 2346 -122990 -91734 93352 -204715 132694 24788 -161243
$$ packed form
15952c09924h2148D9101Q1693c45448b4120p4888k25885A73945p2085J6093K09788
15941C27741a91122C7532a02948r9682e0065j0817r0452a6175A5913R2033h1449
15929a12185J9330A59184c13092E1249a99465b0906B577K04583e5020K5303k87913
15918c17630A45700b4251G6854a17069l4282g2004m35993A31734c33544g7350
15907E96966B85326b51762N90n9620N1948J9763a8232j47645j36854g0257I8542
15895D2113b30816E3799J07791L1682n7285d7189A78537a98545k0136Q35B13577
15883I5621c5403j93961b6784j11996k2047g0302j55060d5889l9574j88398C8068
15871G5101b27942b7226a1839B346a22990L1256I3352b04715A32694B4788a61243
$$ plain form
15859 -228386 -269147 -7447 -225796 -46470 -44011 26546 -25283 -203587 327519 -162509 55281
15847 257878 -86466 -139269 -99393 -214441 -251425 175926 -253012 29592 5887 -276291 234536
15835 59049 -116539 -142637 -38208 -31173 110453 34500 114535 -62803 -374391 -29774 -327872
15824 -327872 -137822 -57514 -203254 -223219 -43710 -38584 181627 23149 -294136 -120458 35912
15812 -193960 49456 138631 -40168 51948 -200740 -187768 125488 273531 -127229 53798 -36564
15800 193544 137556 2120 -52968 19696 -11294 76747 -188257 37439 -19408 -144534 88701
15788 -129155 63120 133639 297083 -18921 -15974 -377463 -13788 160201 105904 410928 -322326
15776 139863 -102339 55969 -111109 -57586 -119315 211382 -47059 -511580 205731 29732
$$ packed form
15859b28386m0761g447k18349d6470K459B6546b5283j78304C27519a62509E5281
15847B57878h6466n2803L9876j15048l6984A75926b53012B9592E887b76291B34536
15835E9049a16539k6098c8208P035A10453C4500Q0035f2803l11588b9774k98098
15824c27872a37822e7514j45740j9965d3710N126A81627B3149b94136a20458C5912
15812a93960D9456Q9175d0168E1948b00740J2972A25488J48043a27229E3798c6564
15800A93544n5988B120e2968A9696a1294G6747a88257C7439a9408j25126H8701
15788a29155F3120P0519J63444a8921K947l61489a3788A60201n4297L05024c22326
15776A39863a02339E5969a11109N3523o1729B11382d7059m64521B05731B9732
$$ plain form
15765 -205910 -488468 -59650 -410006 9177 109347 -101511 -154316 260360 -58437 168889
15754 -79115 261090 -43925 -98006 -297426 30842 -113392 -112882 209227 219884 271109 192277
15743 192277 11428 137756 257623 -181482 -1497 -83262 92070 187353 -20650 -89503 94105
15731 -69952 -55983 -166617 -218081 -5168 -134781 332987 -352656 224046 -271687 77236 75475
15720 75475 -446540 -58541 94596 327549 -157375 -56707 -42955 -2650 -19919 117098 137591
15709 137591 45149 -374384 -291029 -51259 -504248 -139575 -100231 -34124 -87247 16779 -173514
15697 -89055 -349090 -77993 -423323 261884 -129509 50 78379 206113 103385 118079 -2070
15685 -44009 -10498 181456 234000 -90703 146713 -153128 -81208 -8325 -140218 90525 -217251
$$ packed form
15765b05910k82558e9650l50356I177J00170a01511n2805B60360e8437A68889
15754g9115B61090d3925n4081j99420C0842a13392N10B09227J0657N1225p8832
15743A92277A1428J26328J19867a81482a497q1765I2070R5283b0650o8853I4105
15731f9952J3969j10634n1464e168j29613C32987c52656B24046b71687G7236j761
15720G5475d46540e8541I4596K32953a57375e6707J3752b650j7269A17098K0493
15709A37591D5149c74384Q3355e1259m52989a39575L9344c4124n3123A6779a73514
15697h9055k60035g7993l45330B61884a29509E0P8329J27734j02728J4694b070
15685d4009a0498A81456N2544i0703A46713a53128P1920h325j31893I0525b17251
$$ plain form
15673 144993 102924 102051 60807 92537 19716 -136293 -193309 -108196 44468 79802 -2282 -178035
15661 -178035 185894 -109813 19356 287459 65418 78862 332306 123642 -35074 48860
15650 20450 115950 207439 115133 -159948 176328 856 -59191 -15443 -156793 161664 149114
15639 149114 -243619 5193 144712 18479 5991 302406 -283966 -106319 13886 -171473 58
15627 138333 -360992 54512 -222925 -481898 128091 182042 -7930 36385 -137456 -59659 26000
15615 -397693 -387589 16542 -73011 -78769 101810 -60886 94842 -245601 -208210 -336621 -273092
15604 -273092 -103927 126680 -283037 -31951 111736 -5482 -217725 -46243 -11060 -387866
15594 -387866 -45392 -261087 -285586 2955 -3104 157681 82234 118043 -48984 333805 70551
$$ packed form
15673A44993m2069q73m1244L1730A9716a36293n7016Q5113D4468L5334b282j75753
15661a78035A85894a09813A9356K68103F5418J3444K53444A23642c5074D8860
15650B0450R5500R1489r2306a59948A76328H56e9191a5443j41350A61664j2550
15639A49114b43619E193J39519A8479E991K96415b83966a06319A3886a71473E8
15627A38333c60992E4512b22925k58973A28091N3951g930C6385a37456e9659B6000
15615c97693J0104A6542g3011n758A01810f0886I4842b45601L7391j28411O3529
15604b73092a03927A26680b83037c1951A11736e482k12243d6243a1060l76806
15594c87866d5392k15695k4499B955c104A57681p5447L5809d8984C33805G0551
$$ plain form
15582 177276 96333 219287 -130458 -39637 28864 -22906 -130739 48488 203401 -116439
15571 66676 251982 -77298 -42209 -51959 97166 -71608 -80753 -269 29012 196901 -23721 7275
15558 11986 51881 153774 112531 259493 -196100 195017 52467 -200792 -31947 24932 89076
15547 89076 -170874 -222987 -180249 -163814 -199426 -18214 -128098 153271 -237419 -39331 -1034
15535 -73620 39893 -312651 62563 -59057 -475476 -96223 186515 -21625 -28907 -22691 102481
15523 -202480 103884 -71081 119876 113914 44861 -100496 208490 -74146 -12675 248407 108191
15511 28764 -554149 -72436 -11780 124960 -46837 -9334 37405 -51311 -274342 113304 42091
15499 -26860 -243945 125859 221647 180337 39085 -115534 197159 221216 56557 -169193 52834
$$ packed form
15582A77276q0943J22954a30458c9637B8864b2906j07833D8488J54913a16439
15571F6676J85306g7298L5089r750I7166g1608r145b69B9012J67889b3721G275
15558A1986L9895J01893m1243J46962a96100A95017E2467b00792c1947B4932O4144
15547H9076a70874n2113M2738J6435l5612a8214j09884A53271b37419c9331a034
15535g3620C9893c12651F2563e9057m16419i6223A86515b1625p282O216A02481
15523b02480A03884g1081A19876n962D4861a00496B08490g4146a2675B48407A08191
15511B8764e54149g2436a1780A24960d6837i334C7405e1311k23031A13304D2091
15499b6860k17085A25859R5788m1310C9085a15534A97159K4057E6557a69193E2834
$$ plain form
15487 -189186 -102473 -301062 -38071 -14970 141298 -182654 307545 16226 178145 384530
15477 384530 -325199 201486 -275631 75964 57323 22575 -123511 -22870 44459 334954
15467 334954 245740 -402372 -93300 258464 -13161 -62944 -222204 -59767 33714 71891 88698
15456 88698 345948 129086 75604 -206462 272162 -250560 -55426 -98881 -163465 139321
15445 -136005 -151255 411428 -94860 133276 -78969 58730 -174896 -26478 229466 -155713
15434 -30827 83666 -139738 -170768 286419 339708 104542 -159958 31500 -304812 113436
15423 -236809 340899 74955 -71201 -209835 -140739 174425 94648 128528 123390 -169198 102999
15411 -54441 94211 -232555 221596 226308 54489 164042 -186396 -72840 269939 36047 -171216
$$ packed form
15487a89186Q6713j98589c8071a4970A41298a82654C07545A6226J61919K06385
15477C84530c25199B01486b75631G5964j8641B2575a23511b2870D4459K90495
15467C34954q9214d02372i3300B58464a3161m9783j59260e9767C3714L8177J6807
15456H8698K57250A29086n3482b06462B72162b50560e5426m3455o4584A39321
15445a36005j5250D11428i4860A33276g8969E8730a74896b6478B29466a55713
15434c0827H3666a39738l1030B86419N3289A04542a59958C1500c04812A13436
15423b36809C40899G4955g1201j38634O9096A74425p9777L3880n138a69198A02999
15411e4441I4211b32555B21596M712E4489J09553a86396g2840B69939C6047a71216
$$ plain form
15399 267472 153389 139151 63390 -294453 -54295 -62802 -42730 21900 -30153 -12095 86813
15387 -43872 -146187 -53853 106807 -166392 -119928 -13208 -158660 -187372 -81525 274154 42106
15375 -39374 -205379 -359145 171472 -7712 -228884 -193122 114639 249864 -136227 53311
15364 -129040 73477 136716 213323 230387 -166786 -20865 245494 -222623 36635 -234582 145267
15352 114485 122547 -6630 -110021 -297951 -246808 60246 -91315 31040 129620 23550 -122367
15340 15474 78165 -5078 -46188 -103777 132721 62726 362783 188134 12939 -261639 -6745
15328 112235 55954 -32559 -106469 -75813 -171806 -325050 66567 103806 -153622 -103973 157783
15316 -58203 64695 -265629 58571 29021 -94329 170992 241728 -167412 219880 -401667 82350
$$ packed form
15399B67472j14083j4238F3390b94453e4295q507K0072B1900c0153a2095H6813
15387d3872j02315e3853A06807a66392M6464a3208j45452k8712h1525B74154D2106
15375c9374j66005j53766A71472g712k21172L5762A14639J35225a36227E3311
15364a29040G3477O3239P6607J7064a66786b0865B45494b22623C6635b34582A45267
15352A14485Q062f630j03391j87930N1143F0246i1315C1040R8580B3550a22367
15340A5474O2691e078m1110n7589A32721F2726L00057j74649A2939b61639f745
15328A12235E5954c2559p3910L0656r5993j53244F6567L7239a53622M9649A57783
15316e8203F4695b65629E8571B9021i4329A70992P0736a67412B19880d01667H2350
$$ plain form
15304 -160594 -157817 14067 261171 238027 -45197 -12842 379433 244965 359946 -23548 324853
15292 206909 72072 91636 288372 199754 -124827 50610 -12097 -261100 -305482 16033 -46554
15280 147665 -135404 -330629 147791 74793 -344868 213218 23716 176924 15907 -174186
15269 -278682 -387204 217180 -108569 -190539 -80062 152845 193641 257231 254184 -100240 75685
15257 69373 5490 259922 -36914 124912 386155 179905 391146 249262 363472 1277378
15247 1277378 1214693 1175967 1525985 1128005 495579 -46458 127357 61144 93901 200091
15237 200091 -3262 -220728 2613 265563 10474 -24633 87403 -78195 174182 50836 38052
15226 38052 2884 336498 181017 413949 186838 -180449 -70609 28253 106083 104284 -74806
$$ packed form
15304a60594K777A4067K47104k3144d5197a2842C79433j34468J14981b3548C24853
15292B06909G2072J9564J96736q8618a24827E0610a2097k49003m4382A6033d6554
15280A47665a35404j95225A47791p2998c44868B13218B3716J53208A5907a74186
15269b78682j08522B17180a08569q1970h0062A52845M0796O3590l047a00240G5685
15257F9373E490K54432c6914A24912K61243A79905K11241j41884J14210R13906
15247A277378o2685l8726L50018l97980D95579d6458A27357F1144L2757J06190
15237B00091c262k17466B613K62950A0474b4633H7403g8195A74182E0836j2784
15226C8052B884L33614j55481K32932A86838a80449g0609B8253P7830j799g4806
$$ plain form
15214 236090 298143 -188459 316577 97767 204315 50679 108906 379092 -73126 41301 -46651
15202 -248443 -232405 -36220 357886 -58640 220340 -143553 266245 -45701 -56040 -107228 239811
15190 -82621 -219595 -377138 164116 126642 61217 202891 120294 252111 -250639 193024
15179 257658 253447 171721 -199233 -128618 254056 -240617 69023 202132 440007 28885 -8447
15167 37118 -187958 51612 257975 461393 218280 232336 -52830 -6571 198390 -185796 388068
15155 96950 -157702 203068 151846 -142934 407026 64020 41546 275925 -124449 -4373 -29793
15144 -29793 121739 -67320 -163052 454512 263863 76220 44015 67498 168039 41688 -184013
15132 34882 139363 226506 -4974 261997 -35518 110442 64605 279605 114698 60742 186401
$$ packed form
15214B36090O2053a88459C16577I7767J06548E0679N8227K70186g3126D1301d6651
15202b48443J6038c6220C57886e8640B20340a43553B66245d5701j0339n1188B39811
15190h2621j36974j57543A64116l7474F1217J41674q2597J31817b50639A93024
15179B57658m211q1726a99233P0615B54056b40617F9023J33109K37875B8885h447
15167C7118a87958E1612K06363K03418B18280J4056e2830f571A98390a85796C88068
15155I6950a57702B03068n1222a42934D07026F4020k2474K34379a24449d373k5420
15144b9793A21739f7320r5732D54512j90649G6220l2205K3483J00541D1688a84013
15132C4882J04481Q7143d974B61997c5518A10442m5837K15000A14698n3956J25659
$$ plain form
15121 186401 281663 206495 152243 167462 62746 7450 32382 86554 -47272 129861 85068
15110 85068 117379 109012 -134273 310473 210116 81259 400653 -128241 67204 235153 -57688
15098 251215 365342 58251 230102 -177373 33933 23183 359960 93460 79387 74671 99684
15087 99684 304136 90626 222380 158530 286605 172987 207774 341282 21438 -64180 72918
15075 -68004 18958 24396 -173806 49820 196151 -189241 -42278 85491 -21085 327764 36822
15063 322765 439491 136376 158778 -96910 -36274 207933 181095 86136 48070 -171903 -16736
15051 243192 350423 24240 130323 95495 107647 630388 209916 -8259 29864 137179 60618
15039 308283 -243142 27953 503400 526690 285061 262259 62069 9446 95538 330582 269195
$$ packed form
15121A86401R5262p5168n4252J5219F2746G450K4932N4172d7272A29861m4793
15110H5068L2311q367a34273C10473j00357H1259L19394a28241F7204J67949e7688
15098B51215J14127E8251J71851a77373C3933j0750L36777I3460j4073m716K5013
15087I9684K04452I0626J31754o3850J28075j13618L4787J33508B1438f4180G2918
15075f8004A8958N438a73806D9820J46331a89241d2278H5491b1085C27764C6822
15063C22765J16726A36376K2402i6910c6274B07933k6838H6136l8066a71903a6736
15051B43192J07231B4240J06083l4828J2152N22741B09916h259B9864J07315F0618
15039C08283b43142B7953M75447K3290k41629k2802F2069I446Q6092K35044o1387
$$ plain form
15028 269195 263742 153274 187072 136441 178855 360203 35709 534432 141262 143329 63707
15016 -10182 527875 -186035 367503 94871 361412 -14432 46918 157898 105305 401283
15006 401283 200977 91782 151449 310761 47204 300354 337959 41392 139583 38175 214966
14995 214966 120910 222386 287467 -4897 230543 -73257 221575 429178 -94471 -497 376959
14983 -238286 -8790 76380 384861 164437 51073 395805 328694 278629 315508 85645 770
14971 -51020 442927 155109 100970 124969 108677 191368 155731 108655 225963 50041 202891
14960 202891 246287 301303 187074 227509 94744 412699 52313 416019 304218 241978 302077
14949 302077 310028 -69750 85358 411421 308819 320767 287552 101214 535383 71530 175069
$$ packed form
15028B69195n453j10468L3798n0631M2414J81348C5709M98723A41262K067F3707
15016a0182E27875a86035C67503I4871K66541a4432D6918J10980n2593K95978
15006D01283k00306I1782N9667J59312D7204K53150L7605D1392R8191C8175J76791
14995B14966r4056J01476O5081d897B30543g3257B21575K07603i4471d97C76959
14983b38286h790G6380L08481A64437E1073L44732o7111n0065L6879H5645G70
14971e1020D42927A55109n4139K3999j6292Q2691l5637m7076J17308E0041J52850
14960B02891M3396N5016j14229M0435I4744L17955E2313L63706j11801o2240O0099
14949C02077P951f9750H5358L26063j02602J1948l3215A01214M34169G1530J03539
$$ plain form
14938 175069 105742 444524 704443 161434 426976 221488 586964 272704 476317 376049
14928 376049 548786 174539 264137 370031 139244 290814 57085 443835 231289 52075
14917 40281 123712 340826 -33004 339852 333532 551458 434086 192461 398159 428019 113402
14905 182772 279887 104262 214746 248369 186841 283443 417566 410749 266789 140173 277052
14894 277052 295304 419392 354218 706418 404125 308864 752545 705739 162385 641217
14884 641217 44544 151708 267558 310609 458427 288871 560222 501000 259492 264815
14874 264815 269754 643109 288993 247489 639864 364714 524099 272604 99356 643732
14864 643732 421445 -36802 623707 449614 203878 433497 719150 456768 648130 398921
$$ packed form
14938A75069o9327L38782K59919A61434K65542k05488L65476B72704K03613j00268
14928C76049J72737A74539Q9598J05894A39244J51570E7085L86750k12546E2075
14917D0281Q3431K17114c3004C39852o320K17926j17372A92461K05698K9860A13402
14905A82772R7115A04262J10484L3623o1528R6602J34123o817j43960j26616J36879
14894B77052J8252J24088o5174L52200l02293r5261M43681m6806A62385M78832
14884F41217D4544J07164J15850M3051J47818j69556K71351n9222k41508N323
14874B64815M939L73355B88993m1504L92375k75150J59385k51495I9356N44376
14864F43732k22287c6802F23707j74093B03878K29619K85653k62382J91362k49209
$$ plain form
14854 398921 318180 373522 260558 351104 375290 119078 312531 652509 393722 423444
14844 423444 269383 709970 874097 633446 138481 230692 482047 411663 662484 233962
14833 709953 173343 336287 596889 505858 155817 525625 506154 477828 412850 79398
14822 529120 562835 472564 45300 637954 123042 782454 291018 464037 411618 341903
14812 341903 303753 459772 504325 463729 327380 597542 452995 559362 552435 416482
14802 416482 624234 474739 660186 725271 480271 483394 721693 392799 450662 493352
14792 493352 629567 592374 218720 696461 626461 571170 419518 440706 496722 478070 485243
14781 485243 543141 618006 381836 242249 430777 640045 658581 486023 601283 882655
$$ packed form
14854C98921q0741N5342j12964R0546K4186A19078J93453L39978k58787K9722
14844D23444j54061M40587J64127k40651A38481R2211K51355p0384K50821B33962
14833G09953A73343J62944K60602r1031A55817L69808j9471k8326o4978G9398
14822E29120L3715r0271D5300N92654A23042O59412B91018J73019n2419o9715
14812C41903l8150J56019M4553m0596j36349K70162j44547J06367o927j35953
14802D16482K07752j49495J85447O5085k45000L123K38299l28894N7863M2690
14792D93352J36215l7193B18720M77741p0000n5291j51652K1188N6016j8652P173
14781D85243N7898P4865k36170j39587J88528K09268J8536j72558J15260K81372
$$ plain form
14771 882655 709905 577240 493770 803557 572284 501154 278752 571623 671385 467824
14761 467824 759102 698671 549153 718292 633906 886639 481817 618757 706952 548699
14751 548699 667179 526387 760119 557500 791213 909132 603235 775923 697384 941122
14741 941122 763645 571470 953982 586736 350793 758850 658800 764235 708950 727195
14731 727195 518412 748677 767275 774467 932143 695346 733734 545408 575102 604538 683304
14720 683304 648109 1081451 805139 684240 726971 875254 564550 905885 932445 706342
14710 706342 930725 888262 733330 854107 1029973 984617 1111210 1097402 780657 766120
14700 766120 930338 767895 390800 817895 662161 458762 994019 1198095 754724 945776
$$ packed form
14771H82655j72750j32665q3470L09787k31273p1130k22402K92871R9762k03561
14761D67824K91278o0431j49518J69139q4386K52733m04822J36940Q8195j58253
14751E48699J18480j40792K33732k02619K33713J17919l05897J72688p8539K43738
14741I41122j77477j92175L82512l67246k35943M08057j00050J05435n5285J8245
14731G27195k08783K30265J8598P192J57676k36797L8388j88326K9694K9436P8766
14720F83304l5195M33342k76312j20899M2731J48283l10704L41335K6560k26103
14710G06342K24383m2463j54932J20777J75866m5356J26593j3808l16745j4537
14700G66120J64218j62443l77095M27095j55734k03399N35257K04076m43371J91052
$$ plain form
14690 945776 1008961 1128430 859191 562340 877812 1122260 737790 972963 890965 946827
14680 946827 1043723 992184 932393 1233077 968257 1023143 1264068 745010 1108131 750431
14670 750431 1055376 973872 861213 1023362 1251069 1205321 986348 1385936 1112048 1307587
14660 1307587 1199763 1138719 1176910 1113101 1015166 757673 1162221 1143346 1265582 1235955
14650 1235955 988002 1192552 1113144 835901 1346204 1404199 1114722 1177286 919524 1446195
14640 1446195 1100550 1377929 1129418 1414954 1330061 1435990 1267858 1148298 1260924 1459511
14630 1459511 1140463 1190509 1214878 951035 1372295 1564098 1658447 1498840 1542662 1583060
14620 1583060 1479251 1644166 1427378 1559990 1401202 1247158 1506768 1535377 1244698 1278196
$$ packed form
14690I45776O3185J19469k69239k96851L15472K44448l84470K35173q1998N5862
14680I46827R6896n1539n9791L00684k64820N4886K40925n19058L63121l57700
14670G50431L04945q1504j12659J62149K27707m5748k18973L99588k73888J95539
14660A307587j07824o1044L8191o3809r7935k57493M04548j8875J22236k9627
14650A235955k47953K04550p9408k77243N10303N7995k89477O2564k57762N26671
14640A446195l45645K77379k48511K85536q4893J05929j68132j19560J12626J98587
14630A459511l19048N0046K4369k63843M21260J91803R4349j59607M3822M0398
14620A583060j03809J64915k16788J32612j58788j54044K59610K8609k90679L3498
$$ plain form
14610 1278196 1658452 1395450 1413209 1396592 1425192 1319860 1675275 1772874 1270565 1598092
14600 1598092 1425560 1722248 1701948 1573217 1518887 1857759 1672178 1671336 1832208 1642132
14590 1642132 1738736 1882227 1638045 1693010 2065174 2001534 1863610 1880125 1970837 1931832
14580 1931832 1957043 1644724 2128745 2499644 2063422 1720715 1889611 2087500 2393583 2158295
14570 2158295 2378602 2471192 2330471 2452914 2010381 2401268 2351174 2977847 2660205 2509941
14560 2509941 2665857 2664825 2848274 2751969 2902193 3052360 3521894 3327392 3738618 4592224
14550 4592224 5440764 7976536 11985302 19545712 36183248 46033697 25317833 11234573
14541 5234682 3253348 2759469 2147084 2475332 1924859 1995808 1905598 2036023 1784788 2034682
$$ packed form
14610A278196L80256k63002J7759j6617K8600j05332L55415R7599n02309L27527
14600A598092j72532K96688k0300j28731n4330L38872j85581q42J60872j90076
14590A642132R6604J43491k44182N4965L72164o3640j37924J6515R0712l9005
14580A931832K5211l12319M84021L70899m36222l42707J68896J97889L06083k35288
14570B158295K20307R2590j40721J22443m42533L90887n0094O26673l17642j50264
14560B509941J55916j032J83449r6305J50224J50167M69534j94502M11226Q53606
14550D592224Q48540K535772M008766P560410J6637536R850449k0715864A1234573
14541E234682j981334m93879o12385L28248n50473P0949r0210J30425k51235K49894
$$ plain form
14531 2034682 2306299 2285989 2070108 2174905 2586072 2427202 2454241 2054269 1971090 2451379
14521 2451379 2560331 2545034 2431227 2562144 2375494 2646554 2328942 2734028 3056519 2611138
14511 2611138 2703498 2717188 3062352 2855321 3165855 2928338 3040513 3198198 3229241 2976406
14501 2976406 2978074 3295256 3368968 3211276 2897390 3113836 3332272 3240334 3325050 3488147
14491 3488147 3444851 3496744 3574169 3422530 3322392 3592190 3406808 3857838 3678820 3823100
14481 3823100 3958969 4261878 4230221 4141052 3837079 4135085 4107952 4054592 4246754 4666232
14471 4666232 4411484 4459343 4279113 4829767 4311626 4484021 4318655 4410221 4709046 4723266
14461 4723266 4554856 4603373 5106807 4734339 4868136 5049152 5243136 5153005 5054016 5149478
$$ packed form
14531B034682K71617k0310k15881J04797M11167j58870K7039l99972q3179M80289
14521B451379J08952j5297j13807J30917j86650K71060l17612M05086L22491m45381
14511B611138R2360J3690L45164k07031L10534k37517J12175J57685L1043k52835
14501B976406J668L17182P3712j57692l13886K16446K18436r1938Q4716J63097
14491C488147m3296N1893P7425j51639j00138K69798j85382M51030j79018J44280
14481C823100J35869L02909l1657q9169l03973K98006k7133n3360J92162M19478
14471D666232k54748M7859j80230N50654n18141J72395j65366R1566K98825J4220
14461D723266j68410M8517N03434l72468J33797J81016J93984r0131r8989R5462
$$ plain form
14451 5149478 5096241 5366740 5370955 5712532 5709750 5604200 5830582 6022960 5713769 5582155
14441 5582155 5761838 6064117 6185674 6150760 6283400 6221027 6587947 6377822 6632433 6783531
14431 6783531 6881124 6734316 6890483 7535871 7194501 7386205 7382765 7541595 7486021 7379957
14421 7379957 7672140 7730416 8112060 8059188 8143909 8232514 8655085 8659789 8843977 9060029
14411 9060029 8847265 8855801 9165676 9423225 9206843 9619082 10012713 9830244 10305326 10179412
14401 10179412 10226101 10277066 10893351 11218157 10774895 11305232 11266734 11643306 11866368 11811360
14391 11811360 12105340 12581325 12641691 12735099 13172066 13219682 13379681 13404847 14210274 14374774
14381 14374774 14578534 14695086 14915440 15295409 15568501 15610062 16265736 16536120 16654665
$$ packed form
14451E149478n3237K70499M215L41577k782j05550K26382J92378l09191j31614
14441E582155J79683L02279J21557l4914J32640o2373L66920k10125K54611J51098
14431F783531R7593j46808J56167O45388l41370J91704l440J58830n5574j06064
14421G379957K92183N8276L81644n2872Q4721Q8605M22571M704J84188K16052
14411I060029k12764Q536L09875K57549k16382M12239L93631j82469M75082j25914
14401A0179412M6689N0965O16285L24806m43262N30337l8498L76572K23062n5008
14391A1811360K93980M75985O0366R3408M36967M7616J59999K5166Q05427J64500
14381A4374774K03760J16552K20354L79969K73092M1561O55674K70384J18545
$$ plain form
14372 16654665 17047922 17379146 17675701 17996287 18680336 19061615 19493835 19677755 20195318
14363 20195318 20869611 21258353 21386611 22022712 22054739 22673546 23279704 23879846 24533506
14354 24533506 24967332 25506067 26020057 26834216 27431313 28000026 28472882 29513930 30417422
14345 30417422 31151589 31702769 32972687 33691344 34294795 35455703 36451073 37290864 38338905
14336 38338905 39285130 40276887 41671873 43137910 44088178 45795978 46876074 48455424
14328 48455424 49685580 51282239 52839471 54936988 57162122 58752160 60376342 62629149
14320 62629149 65017470 67052293 69654972 72415092 75062629 78207730 80669782 83968357
14312 83968357 87108405 90934446 94351776 98387367 102676051 107338845 111716628 116919293
$$ packed form
14372A6654665L93257L31224K96555L20586O84049L81279M32220J83920N17563
14363B0195318O74293L88742J28258O36101L2027O18807O06158O00142O53660
14354B4533506M33826N38735N13990Q14159N97097N68713M72856J041048R03492
14345C0417422P34167N51180J269918P18657O03451J160908R95370Q39791J048041
14336C8338905R46225R91757J394986J466037R50268J707800J080096J579350
14328D8455424J230156J596659J557232K097517K225134J590038J624182K252807
14320F2629149K388321K034823K602679K760120K647537L145101K462052L298575
14312H3968357L140048L826041L417330M035591M288684M662794M377783N202665
$$ plain form
14304 116919293 122103182 127626648 133541937 139806038 146284598 153212688 160536324 168425490
14296 168425490 176799584 185700729 195055756 204798645 215328883 226264433 237754815
14289 237754815 250295505 262843282 276136707 289891469 304276422 319220115 333894814
14282 333894814 349249117 364409403 379357568 394256235 408559178 421599554 433539149
14275 433539149 444371048 452691898 456850626 457427855 458592796 461360594 461885941 457217978
14267 457217978 453958832 450912992 443245498 433111282 421727641 409095382 394527351
14260 394527351 379225690 363536866 347855838 331820202 316375008 301519499 287496226
14253 287496226 273472302 259721727 246754398 234575876 223085052 211786086 201397717
$$ packed form
14304A16919293N183889N523466N915289O264101O478560O928090P323636P889166
14296A68425490Q374094Q901145R355027R742889J0530238J0935550J1490382
14289B37754815J2540690J2547777J3293425J3754762J4384953J4943693J4674699
14282C33894814J5354303J5160286J4948165J4898667J4302943J3040376J1939595
14275D33539149J0831899Q320850M158728N77229J164941K767798N25347m667963
14267D57217978l259146l045840p667494j0134216j1383641j2632259j4568031
14260C94527351j5301661j5688824j5681028j6035636j5445194j4855509j4023273
14253B87496226j4023924j3750575j2967329j2178522j1490824j1298966j0388369
$$ plain form
14246 201397717 191624918 182347351 173855415 165673172 157544677 150204815 143305680 136463762
14238 136463762 130864636 125408047 119532492 114437192 109641032 104980041 100955263 97113370
14230 97113370 93276976 89359836 86131461 82429834 79322823 76559671 73345172 70990167
14222 70990167 68232636 65909840 63877983 61757298 59684046 57868921 55877478 53812152
14214 53812152 52669560 51084780 49518097 47509021 45903128 44830907 43314132 42953404
14206 42953404 41808233 40453130 38915547 37706012 36959327 36060216 35367444 34349470
14198 34349470 33464188 32460041 31453868 30441990 30191252 29202032 28825705 27977549 27172950
14189 27172950 26338969 26014248 25239920 24956908 24228387 23778881 23335701 22542135 21973790
$$ packed form
14246B01397717r772799r277567q491936q182243q128495p339862o899135o841918
14238A36463762n599126n456589n875555n095300m796160m660991m024778l841893
14230I7113370l836394l917140l228375l701627l107011k763152l214499k355005
14222G0990167k757531k322796k031857k120685k073252j815125j991443k065326
14214E3812152j142592j584780j566683k009076j605893j072221j516775l60728
14206D2953404j145171j355103j537583j209535p46685q99111o92772j017974
14198C4349470q85282j004147j006173j011878k50738r89220l76327q48156q04599
14189B7172950q33981l24721p74328k83012p28521m49506m43180p93566n68345
$$ plain form
14180 21973790 21722554 20829292 20766820 20429631 19913238 19523164 19056012 18727273 18202608
14171 18202608 18151280 18076617 16999642 16863041 16318621 16193905 16001723 15284741 15500767
14162 15500767 15281393 14935416 14462378 14211470 14394506 13668169 13782186 13446932 13396842
14153 13396842 12959420 12717279 12750891 12113307 12166050 12209310 11904350 11574819 11416517 11226418
14143 11226418 11309792 10800622 10584356 10762141 10426363 10055682 9992999 9776871 9862269 9781473
14133 9781473 9366846 9518278 9340116 9378568 8819764 9168145 8476207 8601197 8538082 8334384
14123 8334384 8157676 8056320 7676892 8057560 7790027 7458403 7256409 7875252 7581107
14114 7581107 7491261 7200931 7395265 7320038 6986295 6850746 6599645 6710821 6691084 6728856
$$ packed form
14180B1973790k51236q93262o2472l37189n16393l90074m67152l28739n24665
14171A8202608n1328p4663j076975j36601n44420j24716j92182p16982K16026
14162A5500767k19374l45977m73038k50908J83036p26337J14017l35254n0090
14153A3396842m37422k42141L3612o37584N2743M3260l04960l29531j58302j90099
14143A1226418Q3374n09170k16266J77785l35778l70681o2683k16128Q5398q0796
14133I781473m14627J51432j78162L8452n58804L48381o91938J24990o3115k03698
14123H334384j76708j01356l79428L80668k67533l31624k01994O18843k94145
14114G581107q9846k90330J94334p5227l33743j35549k51101J11176j9737L7772
$$ plain form
14104 6728856 6391806 6478557 6373323 6077134 6424747 5840049 6285274 5955636 5597185 5848298
14094 5848298 5776102 5596837 5520256 5452304 5747980 5505516 5480891 5177914 5202827 5266410
14084 5266410 5018046 5143694 5150621 4925742 4782702 4884688 4616015 5043236 4374714 4580863
14074 4580863 4440534 4536503 4477136 4271261 4807710 4274742 4461120 4345445 4150044 4160804
14064 4160804 4081882 3838248 4028632 4011570 4182397 4194747 3853948 4280051 3954775 3758296
14054 3758296 3868843 3882968 3538775 3846103 3471241 3629345 3750687 3479381 3524701 3244325
14044 3244325 3618260 3478324 3706047 3692989 3474169 3026768 3220398 3347559 3063825 3173914
14034 3173914 3063112 3405565 3172646 3125258 3064185 3170764 3130379 3003325 2927549 3070600
$$ packed form
14104F728856l37050Q6751j05234k96189L47613n84698M45225l29638l58451K51113
14094E848298p2196j79265p6581o7952K95676k42464k4625l02977K4913O3583
14084E266410k48364J25648O927k24879j43040J01986k68673M27221o68522K06149
14074D580863j40329R5969n9367k05875N36449n32968J86378j15675j95401J0760
14064D160804p8922k43634J90384j7062J70827J2350l40799M26103l25276j96479
14054C758296J10547J4125l44193L07328l74862J58104J21342k71306M5320k80376
14044C244325L73935j39936K27723j3058k18820m47401J93630J27161k83734J10089
14034C173914j10802L42453k32919m7388o1073J06579m0385j27054p5776J43051
$$ plain form
14024 3070600 2918783 2962451 2737476 2811231 2813540 2659025 2795210 2633608 2726273 2588221
14014 2588221 2913177 2606074 2618675 2539770 2538205 2439123 2115971 2601212 2247261 2191394
14004 2191394 2415693 2534900 2179656 2222630 2149749 2048417 2037984 2272491 1983683 2043866
13994 2043866 2139786 2124499 2254724 2449520 2887621 3982956 6993677 13464013 28700712
13985 28700712 46728293 29158616 15419525 9016472 6193011 5103356 4182601 3671354
13977 3671354 3574690 3141446 3025016 2820987 2724973 2982794 2271123 2771776 2311415 2353355
13967 2353355 2314430 2507748 2423544 2165216 2373629 2246691 2172784 2021285 2399968 2085869
13957 2085869 2381541 2229058 1848236 2175221 2175740 2057091 2175631 2073646 1952229 1790533
$$ packed form
14024C070600j51817M3668k24975P3755K309j54515J36185j61602R2665j38052
14014B588221L24956l07103J2601p8905j565r9082l23152M85241l53951n5867
14004B191394K24299J19207l55244M2974p2881j01332j0433K34507k88808O0183
13994B043866R5920j5287J30225J94796M38101J095335L010721O470336J5236699
13985B8700712J8027581j7569677j3739091o403053k823461j089655r20755n11247
13977C671354r6664m33244j16430k04029r6014K57821p11671N00653m60361M1940
13967B353355l8925J93318q4204k58328K08413j26938p3907j51499L78683l14099
13957B085869K95672j52483l80822L26985N19j18649J18540j01985j21417j61696
$$ plain form
13947 1790533 1862566 1686734 1908552 2044212 1950022 1835603 1953346 1859005 1783532 1893194
13937 1893194 2156189 1971445 1565534 1884335 1782651 1707483 1541383 1774273 1505891 1448195
13927 1448195 1370267 1221914 1511755 1704619 1491392 1550447 1479115 1562526 1760409 1501797
13917 1501797 1456788 1635506 1858165 1618852 1298575 1535710 1331599 1585413 1521729 1466266
13907 1466266 1462489 1580929 1250011 1646182 1437535 1320048 1592870 1226546 1424805 1381394
13897 1381394 1399036 1327242 1173998 1746749 1345198 1193777 1625912 1474931 1477789 1272713
13887 1272713 1344210 1281923 1176198 1144699 1364752 1194490 1471835 1179278 941774 979859
13877 979859 1051858 1434449 1201109 1227322 1407489 1150725 994125 1124406 1076879 1328370
$$ packed form
13947A790533P2033j75832K21818J35660r4190j14419J17743r4341p5473J09662
13937A893194K62995j84744m05911L18801j01684p5168j66100K32890k68382n7696
13927A448195p7928j48353K89841J92864k13227N9055p1332Q3411J97883k58612
13917A501797m5009J78718K22659k39313l20277K37135k04111K53814o3684n5463
13907A466266l777J18440l30918L96171k08647j17487K72822l66324J98259m3411
13897A381394J7642p1794j53244N72751m01551j51421M32135j50981K858k05076
13887A272713P1497o2287j05725l1499K20053j70262K77345k92557k37504L8085
13877I79859P1999L82591k33340K6213J80167k56764j56600J30281m7527K51491
$$ plain form
13867 1328370 1111363 1429912 1200979 1552048 1081171 865358 932597 821634 1093015 993357
13857 993357 1234829 958409 1077448 1013023 921882 1146200 828467 1094769 898604 1072070
13847 1072070 1039888 1104659 1250565 740301 960749 1173068 767432 785839 914195 1338083
13837 1338083 1177822 888365 909912 1200698 1086694 847913 973614 1160151 1102567 840679
13827 840679 629967 942183 1111653 1072393 754106 836282 937453 1078316 802911 559187
13817 559187 942280 1039781 823722 995142 840910 863286 438216 724640 1006558 1243938
13807 1243938 938099 1008055 902738 1123232 906323 828583 626316 890369 686023 985107
13797 985107 703659 928371 485154 396078 871610 779779 1041753 846043 848893 647497
$$ packed form
13867A328370k17007L18549k28933L51069m70877k15813O7239j10963K71381r9658
13857I93357K41472k76420J19039o4425r1141K24318l17733K66302j96165J73466
13847A072070l2182O4771J45906n10264K20448K12319m05636J8407J28356M23888
13837A338083j60261k89457K1547K90786j14004k38781J25701J86537n7584k61888
13827H40679k10712L12216J69470l9260l18287Q2176J01171J40863k75405k43724
13817E59187L83093R7501k16059J71420j54232K2376m25070K86424K81918K37380
13807A243938l05839O9956j05317K20494k16909p7740k02267K64053k04346K99084
13797I85107k81448K24712m43217q9076M75532r1831K61974j95710K850k01396
$$ plain form
13787 647497 785456 788029 984519 760015 666751 744453 651631 806588 925722 443282
13776 690071 983497 726730 953136 658519 802816 659760 591553 728321 689951 586023
13766 586023 953920 614594 411481 564508 950637 863016 859647 666206 869915 747077
13756 747077 787581 684310 445287 513117 661320 639199 617528 603197 849323 521515
13746 521515 688389 947576 798383 718680 804678 659682 571106 615708 681505 583303 601426
13735 601426 383937 639243 900366 880449 563017 628325 895061 519921 673560 659144
13725 659144 709717 698205 530266 478099 553513 569402 824706 784295 712109 491593 493983
13714 493983 293055 527395 184132 426877 889940 652999 577866 476991 505207 690736
$$ packed form
13787F47497J37959K573J96490k24504r3264P7702r2822J54957J19134D43282
13776F90071K93426k56767K26406k94617J44297j43056o8207J36768l8370j03928
13766E86023L67897l39326k03113J53027L86129q7621l369j93441K03709j22838
13756G47077M0504j03271k39023O7830J48203k2121k1671j4331K46126l27808
13746E21515J66874K59187j49193p9703Q5998j44996q8576M4602O5797r8202J8123
13735F01426k17489K55306K61123j9917l17432O5308K66736l75140J53639j4416
13725F59144N0573j1512j67939n2167P5414J5889K55304m0411p2186k20516K390
13714D93983k00928K34340A84132K42745M63063k36941p5133j00875K8216J85529
$$ plain form
13704 690736 533878 687958 307211 466790 863072 483236 931798 492368 613616 555455
13694 555455 703791 611237 532561 753500 555527 564709 716263 285079 403527 621815
13684 621815 715159 369071 590628 364801 706952 201915 784948 523500 212952 270939
13674 270939 251221 286028 108937 510488 554000 412879 489684 401919 757714 459443
13664 459443 766784 750459 246885 311387 459533 167260 370082 485226 364413 952332
13654 952332 125402 257653 699145 535912 542974 200266 498755 422759 642263 523202
13644 523202 118245 653943 310494 404473 348474 370180 334877 226446 339763 618601
13634 618601 274451 288091 461329 423783 264632 362989 340327 319343 464521 381673 316949
$$ packed form
13704F90736j56858J54080C07211J59579L96282l79836M48562m39430J21248n8161
13694E55455J48336r2554p8676K20939j97973R182J51554B85079J18448K18288
13684F21815R3344l46088K21557k25827L42151B01915N83033k61448B12952N7987
13674B70939j9718L4807A08937M01551M3512j41121P6805q7765L55795k98271
13664D59443L07341j6325B46885O4502J48146A67260K02822J15144j20813N87919
13654I52332A25402J32251M41492j63233P062B00266K98489p5996K19504j19061
13644E23202A18245N35698C10494R3979n5999K1706l5303j08431J13317K78838
13634F18601B74451J3640J73238l7546j59151R8357k2662k0984J45178q2848o4724
$$ plain form
13623 316949 602360 268426 23529 123168 520822 342568 573068 793770 662873 417733
13613 417733 467683 455581 391293 418330 660350 335253 487207 242281 506620 412061
13603 412061 210364 54670 328512 555137 413629 427345 351356 578633 194940 103567
13593 103567 422356 178959 417686 406870 452515 115917 108018 459488 284763 316739
13583 316739 290348 253725 297641 406780 350074 425905 214744 307936 842262 201100 320841
13572 320841 202597 538803 352031 398293 234287 264471 333244 204070 271130 -174210
13561 458703 288303 371766 571496 148975 380727 495688 123656 293686 414573 191614
13550 396036 436751 388468 381399 149920 437342 205853 311189 271186 357473 112952 563518
$$ packed form
13623C16949K85411B68426B3529R9639L97654j78254K30500K20702j30897k45140
13613D17733M9950j2102o4288K7037K42020l25097J51954B42281K64339r4559
13603D12061k01697E4670K73842K26625j41508J3716p5989K27277A94940r1373
13593A03567L18789A78959K38727j0816M5645A15917p899L51470j74725L1976
13583C16739k6391l6623M3916J09139n6706P5831k11161R3192N34326B01100J19741
13572C20841j18244L36206j86772M6262j64006L0184O8773j29174O7060a74210
13561D58703j70400Q3463J99730A48975K31752J14961A23656J70030J20887A91614
13550C96036M0715m8283p069A49920K87422B05853J05336m0003Q6287A12952M50566
$$ plain form
13539 563518 126277 224367 381541 401163 362216 219778 -43683 422376 -21151 271352
13528 240623 286088 53671 242501 316082 579608 370852 596506 359423 392494 346375
13518 346375 98571 325845 452023 178349 177282 201116 321452 325529 529763 483326 174175
13506 342244 444529 283153 557978 277486 -57218 508650 190031 287765 135620 259413
13496 259413 261583 276208 86411 265548 137689 219952 198971 293840 335411 537038 -106606
13484 344024 292547 34329 9465 519946 162995 389934 209170 78902 161554 191108 153785
13473 153785 289222 53841 456623 409493 175040 275145 95473 -125033 86035 510902
13463 510902 -29226 188224 197705 295685 248085 180266 336575 401593 252593 268830 334729
$$ packed form
13539E63518A26277R8090J57174J9622l8947j42438d3683D22376b1151B71352
13528B40623M5465E3671J88830P3581K63526k08756K25654k37083L3071m6119
13518C46375I8571K27274J26178A78349j067K3834J20336M077K04234m6437A74175
13506C42244J02285j61376K74825B77486e7218E08650A90031R7734A35620J23793
13496B59413K170J4625H6411J79137j27859Q2263k0981R4869M1571K01627a06606
13484C44024n1477C4329I465N10481A62995K26939j80764G8902Q2652K9554l7323
13473A53785J35437E3841M02782m7130A75040J00105I5473a25033H6035M24867
13463E10902b9226A88224R481R7980m7600o7819J56309O5018j49000J6237O5899
$$ plain form
13452 334729 103421 388724 226111 481047 256743 30357 134001 77668 357543 235409
13442 235409 -238918 171211 130715 617345 18342 82458 -146925 232173 159240 163828 87424
13431 87424 296202 170079 -70007 40042 -35176 145693 304833 -109678 357593 178822
13421 178822 477971 -1251 256880 254640 383630 -244714 -67865 25244 411537 215088 26086
13409 235944 -45393 380074 308207 -30571 -187527 520052 -89813 285929 -103253 150170
13398 421638 385537 75211 451400 141240 23850 118128 320769 155796 506321 308234
13388 308234 45496 286882 96061 295505 309671 226333 56178 145652 49292 160553 273381
13377 273381 115610 116158 529834 139920 227984 432784 -189513 267385 420676 486236
$$ packed form
13452C34729A03421K85303j62613K54936k24304C0357J03644n6333K79875j22134
13442B35409b38918A71211m0496M86630A8342O4116a46925B32173p2933M588p6404
13431H7424K08778j26123g0007D0042c5176A45693J59140a09678C57593j78771
13421A78822K99149a251B56880k240J28990b44714f7865B5244L86293j96449B6086
13409B35944d5393C80074p1867c0571j56956E20052h9813B85929a03253A50170
13398D21638l6101G5211L76189A41240B3850R4278K02641A55796L50525j98087
13388C08234D5496K41386I6061J99444J4166q3338E6178Q9474D9292J11261J12828
13377B73381A15610N48M13676A39920Q8064K04800a89513B67385J53291O5560
$$ plain form
13367 486236 393954 348764 356734 58180 115099 315372 77628 285314 -164077 519791 345770
13356 345770 278749 166739 130902 269367 144682 273863 20961 -95808 302097 230381
13346 230381 134870 205940 268645 231829 267868 419861 398977 523371 541315 234407 247427
13335 247427 154525 -58996 632979 561546 -156648 497147 343773 255697 393771 381212
13325 381212 391372 177386 384301 312223 -77906 -86077 -9230 335882 267813 50341 296740
13314 296740 -53315 618419 197595 269817 346459 84548 396008 229231 321969 -247763
13303 231841 -62055 -129866 159184 50325 470460 112384 -182354 -282615 504742 314230
13293 314230 -41018 263041 -185411 192027 195245 310482 47452 79325 210295 108637
$$ packed form
13367D86236r2282m5190P970E8180N6919K00273G7628K07686a64077E19791j74021
13356C45770o7021j12010l5837J38465j24685J29181B0961i5808C02097p1716
13346B30381r5511P1070O2705l6816L6039J51993k0884J24394J7944B34407J3020
13335B47427r2902e8996F32979p1433a56648D97147j53374q8076J38074j2559
13325C81212J0160A77386K06915p2078g7906q171i230C35882o8069E0341K46399
13314B96740e3315F18419A97595P2222P6642H4548L11460j66777R2738b47763
13303B31841f2055o7811A59184E0325M20135A12384a82354j00261E04742j90512
13293C14230d1018B63041a85411A92027L218J15237D7452L1873J30970j01658
$$ plain form
13283 108637 182152 205578 153465 198936 117965 179554 240418 17186 -90107 17401 190028
13272 190028 -247465 300757 150695 184345 165295 -139225 305821 207634 438451 250946
13262 250946 411719 -260866 102932 205474 98842 132349 67518 65254 93582 35386 119875
13251 119875 428328 307565 -42374 160180 100400 -288992 213921 304108 -293847 -51952
13240 79340 -172720 -37054 -180006 121709 -37450 75483 454918 -91393 463443 131010
13229 -95130 639677 60159 277931 177873 26973 62100 -132623 37447 380115 209037
13219 209037 71149 77137 237293 -54834 283720 72070 10471 -125407 178114 287005 260966
13208 260966 246825 -84633 104771 197172 38146 73827 403112 368745 -211284 162375 287856
$$ packed form
13283A08637P3515K3426n2113M5471q0971O1589O0864A7186i0107A7401J72627
13272A90028b47465C00757j50062L3650j9050a39225C05821r8187K30817j87505
13262B50946J60773b60866A02932J02542I8842L3507o4831k264K8328C5386Q4489
13251A19875L08453j20763d2374A60180n9780b88992B13921R0187b93847e1952
13240G9340a72720c7054j42952A21709c7450G5483L79435i1393D63443A31010
13229i5130F39677F0159K17772j00058B6973L5127a32623C7447L42668j71078
13219B09037G1149N988J60156e4834B83720G2070A0471a25407A78114J08891k6039
13208B60966j4141h4633A04771R2401C8146L5681L29285l4367b11284A62375J25481
$$ plain form
13197 287856 -118258 -56616 9091 25198 120380 -168818 -107254 97251 157646 257941 176824
13186 176824 169058 16953 -104669 -157713 -91607 8268 129854 152198 -59359 354290 42573
13174 141927 82461 256993 -99672 151082 36830 123534 -78222 42105 -3211 223835 70720
13162 -340789 173195 53745 403325 -261223 -116466 35586 -79665 -38254 43424 -76774 -43562
13151 -43562 258336 -243478 -133371 60930 236278 152772 47059 -11416 343504 -26421 -83287
13140 -83287 153825 -131279 -358746 124229 106905 99675 180595 151249 225979 299565 77443
13128 127571 288279 96952 14754 -23836 -12560 242210 -101737 22888 -74782 108206 96010
13117 96010 -37485 -29026 -216611 -38415 104953 -23041 191316 147967 -106813 109717 57115
$$ packed form
13197B87856a18258e6616I091J6107R5182a68818O1564I7251O0395J00295q1117
13186A76824p766A6953a04669n3044O6106H268J21586K2344e9359C54290D2573
13174A41927n9466J74532i9672A51082C6830Q6704g8222D2105c211B23835G0720
13162c40789A73195E3745L49580b61223a16466C5586g9665c8254D3424g6774L3212
13151d3562B58336b43478J10107F0930J75348q3506D7059a1416C43504b6421n6866
13140h3287A53825a31279k27467A24229j7324p230Q0920k9346P4730P3586G7443
13128A27571J60708I6952A4754b3836J1276B42210a01737B2888g4782A08206j2196
13117I6010c7485Q459j87585c8415A04953b3041A91316m3349a06813A09717n2602
$$ plain form
13106 57115 322437 182741 -37814 42510 -97059 1613 130241 -66479 -38177 298071 -119964
13094 -5480 -184743 97329 243352 99044 -190637 345287 -6775 -168116 187513 117529 186464
13083 186464 -55406 -2420 361167 284211 -16306 -44469 -55706 -272266 -99251 -15868 144593
13071 -188058 39695 215862 -20381 96181 56655 17643 129775 -24748 113138 150189 -293961
13059 336282 -65686 -27977 -141751 238168 -72573 -84172 7319 452308 116688 -63678 -80609
13048 -80609 -132966 242463 318599 163664 294228 347315 103809 110846 353989 -166523 -33322
13036 71492 268836 172957 352134 115658 104440 159993 353885 96400 139622 319438 -56146
13024 265076 -30171 69711 -271331 392147 334529 58697 -81291 -117146 125004 204661 192570
$$ packed form
13106E7115K65322j39696c7814D2510i7059A613J28628f6479K8302B98071a19964
13094e480j79263I7329J46023I9044a90637C45287f775j61341A87513o9984O8935
13083A86464e5406b420C61167p6956a6306k8163j1237k16560i9251a5868A44593
13071a88058C9695J76167b0381I6181l9526A7643J12132b4748A13138L7051b93961
13059C36282f5686b7977j13774B38168g2573j1599G319M44989A16688f3678j6931
13048h0609n2357B42463P6136j54935J30564N3087A03809P037K43143a66523c3322
13036G1492J97344r5879J79177A15658j1218N5553J93892I6400M3222J79816e6146
13024B65076c0171F9711b71331C92147n7618E8697h1291l5855A25004P9657j2091
$$ plain form
13013 192570 -126088 -152547 96105 373408 413118 178897 393580 229461 99138 223286
13003 223286 -52634 179064 145128 57563 76266 111736 62570 261658 -168782 -73048 190063
12991 191116 70620 86335 21341 -172643 216766 248949 226759 203080 123478 197129 115212
12980 115212 86849 -106098 -52150 -192736 -6390 203768 237132 -18341 188460 -142316 -92307
12969 -92307 -106177 160735 -8044 109053 173339 294483 -101739 298228 -251498 260602
12958 360102 -110929 89096 63878 126405 -17422 254722 -78514 -92673 -119052 -126443 267756
12946 298314 311824 126122 164103 18496 126861 106067 -88852 -11254 103292 210679 21668
12934 -193243 -207202 -281408 314108 -70209 87515 -64953 51290 -178973 73530 449902 -171348
$$ packed form
13013A92570a26088k6459I6105K77303L9710A78897K14683j64119I9138J24148
13003B23286e2634A79064l3936E7563J8703L5470m9166J99088a68782g3048A90063
12991A91116G0620J5715B1341a72643B16766L2183k2190k3679p9602P3651q1917
12980A15212k8363a06098e2150j40586f390B03768L3364a8341A88460a42316N0009
12969i2307j3870A60735h044A09053O4286J21144a01739B98228b51498B60602
12958C60102a10929H9096k5218O2527a7422B54722g8514j4159k6379p391B67756
12946B98314J3510A26122L7981A8496J08365k0794h8852a1254A03292J07387B1668
12934a93243j3959p4206C14108g0209H7515f4953E1290a78973G3530L76372a71348
$$ plain form
12922 -40636 270240 5900 82604 89758 8422 -148707 51046 158708 163331 349687 -48365 31413
12909 284119 26251 156477 183495 -151059 272829 195154 -36992 16332 147079 -138451
12898 11739 431159 183746 67337 -139471 52760 4487 10318 98648 299367 238546 -53721
12886 -669 75604 42981 -255488 98957 91764 -2900 -96655 170424 23669 84837 55290 40844
12874 40844 162845 109215 252354 194783 -26652 57173 132738 80324 -156131 153061 -113382
12862 163028 -42066 -120057 -232206 41088 -340399 -4052 -243279 269908 -249715 -43143 -209430
12851 -209430 63030 10286 -209403 -156266 -40873 -76479 112791 301655 -70278 80491 -43693
12839 -57764 141734 205481 -318890 -56691 181858 -352444 -25041 -132175 -77745 308444
$$ packed form
12922d0636B70240E900P6704P154H422a48707E1046J07662M623J86356d8365C1413
12909B84119B6251J30226K7018a51059B72829p7675c6992A6332J30747a38451
12898A1739M19420A83746F7337a39471E2760D487N831Q8330K00719o0821e3721
12886f69G5604l2623b55488I8957p193b900r3755A70424B3669O1168k9547j4446
12874D0844J22001n3630J43139n7571b6652E7173P5565n2414a56131A53061a13382
12862A63028d2066p7991j12149D1088c40399d052k39227B69908b49715d3143j66287
12851b09430F3030A0286b09403N3137d0873l5606A12791J88864g0278H0491d3693
12839e7764A41734O3747c18890e6691A81858c52444b5041j07134N4430C08444
$$ plain form
12828 -184877 360581 82633 -177699 422663 177220 -56065 226934 128196 2672 50241 -274940
12816 76081 -174478 41289 -145772 124535 110843 171774 -3078 -196419 -52540 131183 95809
12805 95809 7750 -252828 -257007 91398 38269 -488292 -11242 1651 -193894 179376 -101867
12793 -4882 -14059 -223345 182407 119492 -443460 -60188 -143702 370305 -20809 484652 104690
12781 -25522 -168866 147194 -96999 -55059 -81748 334825 -25774 24878 139675 -168673 -5991
12769 -98722 162303 22329 -17778 17181 40150 -95250 -277886 241973 200806 -46636 177658
12757 251967 -149728 -111130 90511 44012 -67716 -49949 213586 -122657 158035 249268 5401
12745 25970 -63139 200978 266075 328058 22421 -55774 -195373 471796 178033 223296 -142265
$$ packed form
12828a84877C60581H2633a77699D22663A77220e6065B26934r8738B672M7569b74940
12816G6081a74478D1289a45772A24535j3692O0931c078j93341e2540A31183l5374
12805I5809G750b52828m179I1398C8269d88292a1242A651a93894A79376a01867
12793d882r177k09286A82407o2915d43460f0188q3514C70305b0809D84652A04690
12781b5522j43344A47194i6999M1940k6689C34825b5774B4878J14797a68673e991
12769i8722A62303B2329a7778A7181K2969i5250j82636B41973m1167d6636A77658
12757B51967a49728L8598I0511D4012f7716J7767B13586a22657A58035R1233E401
12745B5970f3139B00978O5097O1983B2421e5774j39599D71796A78033M5263a42265
$$ plain form
12733 315160 -250805 83198 31515 78832 203113 -181865 -170372 -182026 -4173 -36223 147860
12721 -474641 176283 -4545 475339 -180632 -100377 -34069 -216708 -96656 49569 69360 227277
12710 227277 82859 44428 423613 203470 285667 -712 -58755 234829 271050 6187 78340
12699 78340 -27045 356267 249972 133293 311787 189426 -39471 156452 161943 163744 30382
12687 238282 163058 -188258 -258772 -151802 200167 159559 143014 207522 4557 135980 103758
12676 103758 145685 58678 108121 232732 137704 -8809 103556 212766 481726 -130288 -197144
12665 -197144 -110462 247893 -119565 300689 -38420 -44920 40788 291527 160203 19820 144788
12654 144788 10677 -18134 60745 179593 76431 193009 -51760 -74276 416695 -83620 129891
$$ packed form
12733C15160b50805H3198C1515M7317J24281a81865J1493j1654d173l2050A47860
12721d74641A76283d545D75339a80632Q0255c4069j82639i6656D9569J9791J57917
12710B27277H2859l8431L79185B03470Q2197g12n8043B34829L6221F187P2153
12699G8340b7045C56267j06295j16679J78494j22361c9471A56452N491J801C0382
12687B38282p5224a88258p0514J06970B00167m0608j6545O4508D557J31423l2222
12676A03758M1927E8678M9443J24611r5028h809A03556J09210K68960a30288o6856
12665a97144Q6682B47893a19565C00689c8420o500D0788K50739j31324A9820J24968
12654A44788A0677a8134F0745J18848G6431J16578e1760k2516D16695h3620A29891
$$ plain form
12642 59285 4638 -69415 -527934 297174 131054 -41206 -96972 93165 390572 132595 365624
12631 365624 28667 246591 135052 420122 204471 49369 353453 217179 52581 195289
12621 195289 192525 415047 118600 405764 52968 267226 -58805 279941 -178865 96147
12610 189359 -239046 161407 67166 -302591 39112 181948 127323 174053 -109344 -192532
12600 -192532 346987 356232 229048 78281 253347 284870 93384 289344 172720 133571 -58968
12588 425050 271156 -84960 -279584 26310 -344529 368558 228341 69525 44996 144286
12578 144286 -5910 -23878 281774 173116 212913 42645 -16122 136358 -108611 105686 -133808
12566 -168460 -305696 157603 221866 -30659 108219 -44993 -68294 44342 -33418 280387 -96070
$$ packed form
12642E9285D638f9415m58519B97174A31054d1206n5766I3165K97407A32595K33029
12631C65624B8667K17924j11539K85070B04471D9369L04084j36274E2581J42708
12621A95289k764K22522A18600K87164E2968K14258e8805B79941a78865I6147
12610A89359b39046A61407F7166c02591C9112J42836n4625M6730a09344q3188
12600a92532C46987R245j27184G8281J75066L1523I3384J95960j16624l9149e8968
12588D25050j53894h4960j94624B6310c44529C68558j40217F9525k4529R9290
12578A44286e910j7968B81774j08658L9797D2645a6122A36358a08611A05686a33808
12566a68460j37236A57603O4263c0659A08219d4993k3301D4342c3418B80387i6070
$$ plain form
12554 225069 331924 192127 35734 -101344 136798 -264909 -33095 310422 296170 86840
12543 287141 43376 162656 228450 182835 -17252 -386984 201421 272995 -176383 -132366 240863
12531 206765 -4240 -11265 -113892 23779 -116055 18355 173998 92028 148161 -312406 -50304
12519 73588 -106469 451401 -171699 -139709 253429 -205046 288447 -33098 95347 -10724
12508 -327438 234047 -63764 -183934 -41787 133584 -201257 117852 -284065 -155292 121866
12497 263338 -37646 -178582 -130486 -121826 -80657 -33905 305308 218817 270167 280109 59054
12485 -52663 -285848 127307 -13875 -2871 206579 187561 -130839 105600 174945 -89627 70482
12473 186403 -63973 237425 34070 115154 -163903 -89071 -390644 84984 9259 15351 -278551
$$ packed form
12554B25069J06855j39797C5734a01344A36798b64909c3095C10422j4252H6840
12543B87141D3376J19280O5794m5615a7252l69732B01421P1574a76383M4017B40863
12531B06765d240p025j02627B3779a16055A8355J55643q1970N6133c12406e0304
12519G3588a06469D51401a71699L1990B53429b05046B88447c3098I5347a0724
12508c27438B34047f3764j20170d1787A33584b01257A17852b84065J28773A21866
12497B63338c7646j40936M8096Q660M1169c3905C05308q6491N1350R942E9054
12485e2663k33185A27307a3875b871B06579j9018a30839A05600O9345h9627G0482
12473A86403f3973B37425C4070Q1084a63903P4832l01573H4984I259O092b78551
$$ plain form
12461 -150658 126004 86997 84449 40382 -131184 -146446 -211040 -355727 153928 127921 -47358
12449 -140695 81026 -102363 182767 -237039 -22198 20576 -147862 103088 -75091 89112
12438 87914 -187854 234217 285943 24437 -21861 429468 -44616 -30752 -76737 -98548 32401
12426 61357 -53464 -157940 267523 -29609 -81152 426654 -120051 -41312 -185816 -19917 66771
12414 -92936 109122 -25047 314887 187036 -139888 96985 -56327 165319 284594 114769
12403 -45394 29406 -159892 164893 21529 294886 -109506 -270128 -210570 236250 -123677
12392 209427 -34653 87715 -20214 -348259 127020 78944 -19196 96527 49117 -29494 79740
12380 148774 345694 281791 -161724 25940 -136767 103518 83918 -129789 198867 209193
$$ packed form
12461a50658A26004l9007k548D0382a31184j5262o4594j44687A53928k6007d7358
12449a40695H1026a02363A82767b37039b2198B0576a47862A03088g5091H9112
12438H7914a87854B34217N1726B4437b1861D29468d4616J3864m5985k1811C2401
12426F1357e3464j04476B67523b9609n1543D26654a20051d1312j44504a9917F6771
12414i2936A09122b5047C14887j27851a39888I6985e6327A65319J19275A14769
12403d5394B9406a59892A64893B1529K73357a09506j60622N9558B36250a23677
12392B09427c4653H7715b0214l28045A27020m8076a9196I6527m7410b9494G9740
12380A48774J96920o3903a61724B5940a36767A03518j9600a29789A98867J0326
$$ plain form
12370 209193 -187554 -215242 -151579 198494 51874 213551 -200655 56080 291181 115869
12359 -107421 -172473 164037 -97529 32729 -166103 -18857 18672 -134600 180308 64086 20592
12347 228429 78013 -338431 -59662 -89719 -45898 81696 -192597 -36363 7802 12254 138698
12336 138698 -41545 -220812 -87048 -227776 31400 -69221 244132 -123 78912 -121196 47965
12324 -180741 -147044 91867 -35338 -6664 74087 75421 306769 -310573 68377 52780 -317584
12312 -63337 -261238 -80544 -14650 -247752 149925 65848 106559 161301 189178 -27233 80504
12300 51877 130538 251022 265198 76260 -229974 -66063 -101499 13450 -116991 206546 -58052
12288 352650 175217 -184894 181153 -86866 -16169 153106 78110 21049 112846 -42823 202656
$$ packed form
12370B09193a87554k7688O3663A98494E1874J61677b00655E6080K35101A15869
12359a07421o5052A64037i7529C2729a66103a8857A8672a34600A80308F4086B0592
12347B28429G8013c38431e9662l0057M3821H1696a92597c6363G802M452J26444
12336A38698d1545j79267h7048j40728C1400f9221B44132a23G8912a21196D7965
12324a80741L3697I1867c5338f664G4087J334K31348c10573F8377j5597c17584
12312f3337j97901h0544a4650k33102A49925F5848M0711N4742K7877b7233H0504
12300E1877P8661J20484J4176G6260b29974f6063l5436A3450a16991B06546e8052
12288C52650A75217a84894A81153h6866a6169A53106p4996B1049R1797d2823B02656
$$ plain form
12276 189435 68877 226255 26101 560163 246565 448839 146835 170078 47169 41447 -27392
12264 143357 131361 -82827 339139 153956 -7439 81160 387568 -62194 83870 -161749 243658
12252 -203778 76495 -21052 349578 89475 101747 106462 34440 -193927 -187477 78812 49728
12241 49728 32283 77209 57558 170310 -377918 205639 -70348 47548 41624 183372 423561
12230 423561 105059 1383 -156279 41307 111788 332503 121808 392503 410061 55469 458346
12219 458346 275116 306785 -31014 234679 77775 392416 11025 174229 160700 272913
12209 272913 -44318 -346 349133 126675 253325 318598 81286 245062 -130100 -61925 299511
12197 121948 361063 315652 221938 173795 167375 327004 598059 15186 -97209 -64300 158401
$$ packed form
12276A89435F8877J57378B6101N34062B46565K02274A46835K3243D7169n722b7392
12264A43357j1996h2827C39139A53956g439H1160L06408f2194H3870a61749B43658
12252b03778G6495b1052C49578H9475J2272M715C4440a93927O450G8812k9084
12241D9728j7445M4926j9651J12752c77918B05639g0348D7548n924J41748K40189
12230D23561A05059A383a56279D1307P0481K20715A21808K70695J7558E5469M02877
12219D58346j83230L1669c1014B34679G7775L14641A1025J63204j3529J12213
12209B72913d4318c46C49133A26675J26650O5273H1286J63776a30100f1925B99511
12197A21948K39115m5411r3714m8143o420J59629K71055A5186i7209L2909A58401
$$ plain form
12185 313418 165913 190676 107331 205440 282524 227748 270811 292266 63213 6892 186009
12174 186009 378401 147317 77242 201765 13678 321041 157178 509797 38590 46326
12164 46326 319 346264 191912 -170797 176592 -27538 86369 77496 171857 -180662 -27935
12152 59447 140095 -81160 123296 -51326 -8151 -49516 552190 39978 32200 12098 -90963 187841
12139 387253 -113886 -232352 223038 -69419 -377097 -366747 263962 166862 163815 -292664
12128 176609 -106576 -55344 283722 -233259 -154030 -32392 24946 81246 122933 93335 -302217
12116 -193611 236519 -4358 149823 319847 -91420 82901 273 -50351 -401982 -47288 95472
12104 -188293 -57644 -168715 101749 -331606 68286 7796 45139 -304596 -51512 94147 -319060
$$ packed form
12185C13418j47505K4763q3345R8109P7084n4776M3063K1455F3213F892J79117
12174A86009J92392A47317p0075J24523A3678L07363A57178L52619C8590P736
12164D6326C19L45945j54352a70797A76592b7538H6369q873R4361a80662b7935
12152E9447Q0648h1160A23296e1326h151m1365E52190C9978p778A2098i0963A87841
12139C87253a13886j18466B23038f9419l07678J0350B63962r7100l047b92664
12128A76609a06576N1232B83722b33259P9229c2392B4946N6300M1687k9598c02217
12116a93611B36519d358A49823J70024i1420H2901B73e0351l51631d7288I5472
12104a88293e7644j11071A01749c31606F8286G796L7343c04596e1512I4147c19060
$$ plain form
12092 27521 127966 -96114 195484 -164654 -242432 149743 -95016 192375 -198056 113741
12081 -185201 -285035 -299046 227575 60207 -71022 77478 401232 300903 237716 449362 1214739
12070 1214739 1655534 991076 486863 132447 -115254 210688 53092 -135976 199406 -177402
12059 242228 89099 84965 103709 266472 244835 -28354 -55590 84338 247828 96761 428057
12048 428057 39330 -41940 188581 52191 108616 13338 -359231 -265945 78392 300619 255205
12037 255205 100802 -412514 -71964 -161059 -44557 -55985 -165599 188880 34849 -311013
12026 -25813 -96477 -50680 449500 110008 -73467 -183163 -277697 -141880 71867 -114468 141777
12014 -76715 -152826 66077 -74768 5725 103241 -140968 128175 -62592 61203 -139341 -77371
$$ packed form
12092B7521J00445i6114A95484a64654p7778A49743i5016A92375a98056A13741
12081a85201r9834j4011B27575F0207g1022G7478L23754j00329o3187K11646P65377
12070A214739M40795o64458D86863A32447a15254B10688E3092a35976A99406a77402
12059B42228H9099m134J8744J62763k1637b8354k7236H4338J63490I6761L31296
12048D28057C9330d1940A88581E2191N6425A3338c59231R3286G8392K22227m5414
12037B55205A00802d12514g1964q9095d4557j1428j09614A88880C4849c11013
12026b5813p0664M5797D49500A10008g3467j09696r4534J35817G1867a14468A41777
12014g6715p6111F6077g4768E725R7516a40968A28175f2592F1203a39341O1970
$$ plain form
12003 -77371 -20296 309118 -231258 67005 221504 49410 229907 40225 -131562 -51648 -14917
11991 -176613 -165463 97587 -55580 14402 -98530 -61076 -161812 88118 186283 -33977 73542
11979 -64009 -4459 16427 84284 -41998 132402 -57057 -147687 -104455 -27626 -25243 -287784 -33402
11966 292103 78358 -159107 72366 331698 -144608 100366 -169279 -58864 15709 -99131
11955 -48431 -443405 -275257 115363 -69672 478872 258055 8528 70946 -127061 -153433 -4732
11943 -79207 -67227 -86946 -286768 -65044 199976 -106548 310296 -204642 -155807 45074 -150997
11931 78243 -2239 -104872 -104023 87087 -23710 -242911 -7498 -25869 -40827 -172696 -285638 -203673
11919 -203673 -140299 -25293 126316 54655 -20247 66950 14769 -60073 -9678 251955 -43706
$$ packed form
12003g7371b0296C09118b31258F7005J54499D9410J80497D0225a31562e1648a4917
11991a76613J1150I7587e5580A4402i8530L7454j00736H8118R8165c3977G3542
11979f4009d459A6427O7857d1998A32402e7057r0630M3232b7626K383k62541c3402
11966B92103G8358a59107G2366K59332a44608A00366a69279e8864A5709i9131
11955d8431l94974J68148A15363f9672D78872k20817H528O2418a27061k6372d732
11943g9207J1980j9719j99822f5044A99976a06548C10296b04642M8835D5074a50997
11931G8243b239j02633Q49H7087b3710k19201g498j8371j4958j31869j12942Q1965
11919b03673O3374b5293A26316E4655b0247F6950A4769f0073i678B51955d3706
$$ plain form
11907 -7904 -20366 321510 111605 190472 -114502 44315 -121536 -229886 118003 -195057
11896 176731 -171187 43767 -12829 -27963 -93798 -107382 -375266 -23960 179895 209069 44551
11884 232380 214070 534293 -235866 -249438 64075 178613 58554 -16041 153107 -77130 -377694
11873 -377694 -168458 -167578 189160 42487 328395 -204457 130422 -71816 -87509 -14616 126566
11861 -55842 -206481 -178345 124565 193073 -106580 -133384 106445 -369662 78567 -20387 -58493
11850 -58493 67971 344877 -220180 323981 -29430 -47215 201010 -82873 -100977 269122 -100924
11838 -42871 -181944 -26960 -102815 62153 -297863 75374 -175997 -117305 -106341 -256291 -202108
11827 -202108 58002 557097 -104390 -156699 -305576 25956 -240015 118155 -59995 -201497
$$ packed form
11907g904j2462C21510A11605P8867a14502D4315a21536j08350A18003a95057
11896A76731a71187D3767a2829j5134o5835j3584k67884b3960A79895K9174D4551
11884B32380j8310L20223b35866j3572F4075J14538E8554a6041A53107g7130l00564
11873c77694a68458Q80A89160D2487K85908b04457A30422g1816j5693a4616A26566
11861e5842j50639K8136A24565O8508a06580k6804A06445c69662G8567b0387l8106
11850e8493F7971K76906b20180C23981b9430j7785B01010h2873j8104B69122a00924
11838d2871j39073b6960p5855F2153b97863G5374a75997N8692J0964j49950N4183
11827b02108E8002M99095a04390n2309j48877B5956b40015A18155e9995j41502
$$ plain form
11817 -201497 16910 163095 -138702 260762 -21477 83758 -197010 123255 237060 -77615
11806 46158 35428 21934 -237757 -41949 -130662 198700 306960 -284454 -89948 246619 147762
11795 147762 131681 -22994 -238701 331041 -155579 -59428 98772 -179120 26973 -651079
11784 -116429 -6516 -77404 48116 -25536 -114090 90413 -223619 221723 -182624 76631 32273
11772 66610 23239 27747 -454169 360885 -84811 184311 -154294 -546280 -79297 15850 139610
11761 139610 59758 414747 144396 36910 -41418 -125488 -116369 -79473 -303876 -217314 63592
11749 -142737 -94096 -201177 107182 -46076 -6868 -199294 10698 254188 -189536 40202 -1843
11737 366861 30160 -75134 1864 -33347 159979 52051 -300044 -8780 -56910 251855 -36151
$$ packed form
11817b01497A6910J46185a38702B60762b1477H3758a97010A23255J13805g7615
11806D6158j0730j3494b37757d1949q8713A98700J08260b84454h9948B46619r8857
11795A47762j6081b2994k15707C31041a55579e9428I8772a79120B6973f51079
11784a16429f516p0888D8116b5536q8554I0413b23619B21723a82624G6631C2273
11772F6610B3239M508d54169C60885h4811A84311a54294l91986g9297A5850J23760
11761A39610E9758L54989A44396C6910d1418q4070R119L6896k24403Q6562F3592
11749a42737M8641j07081A07182d6076f868j92426A0698K43490a89536D0202a843
11737C66861C0160g5134A864c3347A59979E2051c00044h780m8130B51855c6151
$$ plain form
11725 -101493 16169 75024 129942 -144967 160548 -394309 32029 -45621 -35717 125705 -272661
11713 -470143 210643 224807 -86109 -122914 -36697 314161 76146 273523 116798 -95725 70014
11701 -61646 263306 91655 57758 228674 158249 4786 146771 -94214 -288529 -99108 -129769
11690 -129769 219150 -244085 -34882 336868 -53223 129615 293361 -234014 414798 170915
11679 -69984 145881 -17262 234454 177936 112232 285863 -38184 -75549 199745 -163922 194318
11667 -211565 -99045 29962 -1960 163749 -82069 79384 173530 264123 29768 -330863 80886
11655 243430 -71908 25430 -79998 227098 -122369 -24687 48944 -89748 58917 -95194 70403
11643 -7113 -703 -69251 323795 210852 -72904 -41642 33875 -26736 -211347 220160 -241644
$$ packed form
11725a01493A6169N8855N4918a44967A60548c94309C2029d5621R904A25705b72661
11713d70143B10643J4164h6109l6805c6697C14161G6146J97377A16798i5725G0014
11701f1646B63306I1655l3897J70916p0425D786J41985i4214j94315i9108l0661
11690a29769B19150b44085c4882C36868e3223A29615J63746b34014D14798A70915
11679f9984A45881a7262B34454n6518o5704J73631c8184l7365A99745a63922A94318
11667b11565i9045B9962a960A63749h2069G9384R4146R0593B9768c30863H0886
11655B43430g1908B5430g9998B27098a22369b4687D8944h9748E8917i5194G0403
11643g113g03o8548C23795j12943g2904L1262C3875b6736j84611B20160b41644
$$ plain form
11631 153322 366554 -11653 178691 339547 50835 306661 44272 98603 -63533 30614 -102249
11619 272 -189292 -15351 295476 131923 357837 -211178 -251706 310307 34368 -953 78046
11607 -60321 45016 75791 -38115 -190544 -65660 35777 -224227 -190394 4121 273765 30670
11595 -260999 -194591 -120982 -33265 200137 29885 339535 32730 -67265 -103697 203113 209865
11584 209865 306970 249457 409271 -209243 336337 144479 155406 144700 -171037 248395
11573 -245018 110482 6457 -11129 -97398 -38067 102487 131712 -279140 -107528 -34232 94337
11561 100220 44428 79590 -130876 -35691 -61680 174826 -43222 -79170 269799 164510 295121
11550 295121 -224482 254061 1869 28694 61942 79579 2508 95669 -210231 24706 -172315
$$ packed form
11631A53322K13232a1653A78691J60856E0835K55826D4272N4331f3533C0614a02249
11619B72a89292a5351B95476A31923K25914b11178m0528C10307C4368i53G8046
11607f0321D5016L0775c8115j52429f5660C5777b24227L3833D121K69644C0670
11595b60999O6408P3609c3265B00137B9885L09650C2730f7265l6432B03113O752
11584B09865R7105n7513J59814b09243C36337A44479J0927j0706a71037B48395
11573b45018A10482F457a1129q6269c8067A02487K9225b79140a07528c4232I4337
11561A00220D4428L5162a30876c5691k5989A74826d3222l5948B69799j05289J30611
11550B95121b24482B54061A869K6825L3248J7637B508R3161b10231B4706a72315
$$ plain form
11538 306391 -80365 -49815 -7830 105267 122324 -44688 135739 170916 12767 -110984 -9119
11526 -7344 17611 297567 373743 -354394 190843 190988 248236 90699 -64261 137323 118642
11515 118642 89153 143329 30372 71101 173822 327116 262956 -57926 178999 -195416 169921
11503 244003 -167099 278910 105649 377507 171586 257869 74450 187371 99389 242179
11493 242179 -24437 103022 248429 223728 231841 -69998 -499 62784 479888 -174807 17675
11481 8644 310235 354870 52302 35334 219096 189561 18028 -155347 -124979 480007 101124
11469 187024 260463 -67139 392762 83288 -76410 186016 -40639 273444 151715 87069 113571
11458 113571 344653 361988 -89388 251211 344213 -27584 245530 -177150 56364 44359 -29423
$$ packed form
11538C06391h0365L0550g830A05267J7057d4688A35739L5177A2767a10984i119
11526g344A7611K79956P6176c54394A90843J45N7248I0699f4261A37323j8681
11515A18642k9489N4176C0372M0729J02721J53294o4160e7926A78999a95416A69921
11503B44003a67099B78910A05649K71858A71586Q6283G4450J12921q7982J42790
11493B42179b4437A03022J45407k4701Q113f9998d99F2784M17104a74807A7675
11481H644L01591M4635E2302j6968J83762k9535A8028a55347L0368D80007A01124
11469A87024P3439f7139C92762H3288g6410A86016d0639B73444j21729o4646K6502
11458A13571K31082J7335h9388B51211R3002b7584B45530a77150E6364j2005b9423
$$ plain form
11446 -73968 53602 -330577 256038 50996 255846 -51544 118824 56018 99997 102983 156110
11435 156110 -21807 123598 2156 160668 -735 230104 -299903 18802 -92164 384714 181355
11423 280863 -133874 -97381 18085 234833 386453 -294718 -22605 -266593 127245 407016
11413 407016 10286 199196 142012 63135 114909 -128935 -99335 55386 -136444 -61945 -114873
11402 -114873 104419 -268114 -57525 137573 51105 284220 -360025 269478 310282 -76581
11391 99940 -165537 -238635 117946 -134705 283268 341601 67733 -69281 222888 63304 -268166
11379 197422 13748 11829 98258 138264 148611 43048 37673 21683 60267 -33000 -98277 74324
11366 -79458 -13341 92042 -156083 -15266 -345461 22428 -112662 -125080 3616 -310579 -356896
$$ packed form
11446g3968E3602c30577B56038E0996K04850e1544A18824E6018M3979K986N3127
11435A56110b1807A23598B156J58512g35B30104b99903A8802i2164C84714A81355
11423B80863a33874L6493A8085K16748J51620b94718b2605k43988A27245K79771
11413D07016A0286J88910n7184F3135N1774a28935K9600E5386a36444f1945n2928
11402a14873A04419b68114e7525A37573E1105K33115c60025B69478M0804g6581
11391I9940a65537p3098A17946a34705B83268N8333F7733f9281B22888F3304b68166
11379A97422A3748j919Q6429M0006J0347D3048n375j5990L8584c3000o5277G4324
11366g9458a3341I2042a56083a5266l30195B2428a12662j2418C616c10579m6317
$$ plain form
11355 -356896 17085 -17750 209396 -430908 38498 -390117 185922 205736 94693 -326046
11344 72176 108731 -154314 165985 164194 -25672 -68700 -231881 -240772 -94296 -67767 -216450
11333 -216450 -83033 -86754 16847 -113878 -44058 -89331 95164 -18640 -85331 96584 115194
11322 115194 257897 152242 -31346 228618 -64842 131852 97990 127621 157481 7846 115782
11311 115782 85424 19889 257918 -15602 -147125 -239537 196430 -405738 35795 -360247
11300 160205 117669 -58139 -11537 -86898 155549 -289339 -218571 177643 -10890 14689 -237803
11288 -7866 -18765 -240779 -91949 190879 53873 56560 -306364 -220581 41921 19239 -8558 56041
11275 -105790 -69570 -59782 -36983 -240167 -145379 213814 -14571 -32379 37302 44608 37207 -215070
$$ packed form
11355c56896A7085a7750B09396d30908C8498c90117A85922J9814I4693c26046
11344G2176L6555a54314A65985j791b5672m3028j63181q891i4296K6529j48683
11333b16450h3033l721A6847a13878d4058m5273I5164a8640o6691I6584J8610
11322A15194J42703j05655c1346B28618f4842A31852l3862K9631K9860G846J07936
11311A15782l0358A9889K38029a5602j31523r2412A96430d05738C5795c60247
11300A60205m2536e8139a1537p5361A55549b89339P0768A77643a0890A4689b37803
11288g866j0899k22014i1949A90879E3873K687c06364Q5783D1921A9239h558E6041
11275a05790L6220R788K2799k03184R4788B13814a4571j7808C7302P306p401b15070
$$ plain form
11262 -153679 -33021 -41184 337581 -79415 -104288 155402 -319677 -160372 -316726 -168808
11252 -168808 -147737 9103 3778 -206011 70442 -289342 -190664 67730 -25467 -226705 -89075
11240 -89893 -97641 -39998 -417186 -262721 79109 -171732 6957 38738 -20843 -213061 278182
11228 38579 -392544 -229435 108736 -100251 -14130 30798 213019 -284589 -212332 -66618
11217 -121364 65477 -193466 75563 -2364 -182138 112589 -522649 54953 194929 295170
11207 295170 28968 141293 133941 105839 -232219 35860 275845 -79164 69954 -171564 -149756
11196 -149756 33188 -212176 -186921 -77776 49471 -444522 -78392 -85046 20708 -141328 -547887
11185 -547887 181267 -12923 -137522 277718 -199106 16855 -222089 -170034 -271188 153189
$$ packed form
11262a53679c3021q163C37581g9415k4873A55402c19677J59305j56354J47918
11252a68808K1071I103C778b06011G0442b89342R8678F7730b5467k01238h9075
11240h9893p748c9998l77188J54465G9109a71732F957L1781b0843j92218B78182
11228C8579c92544J63109A08736a00251a4130C0798J82221b84589P2257f6618
11217a21364F5477a93466G5563b364j79774A12589e22649E4953J39976J00241
11207B95170B8968J12325p352k8102b32219C5860K39985g9164F9954a71564K1808
11196a49756C3188b12176K5255g7776D9471d44522g8392o654B0708a41328m06559
11185e47887A81267a2923j24599B77718a99106A6855b22089N2055j01154A53189
$$ plain form
11174 -149172 -271355 -1340 4564 -61779 -100346 -10457 224375 79792 -389476 -311825 98266
11162 -194858 -108794 -123099 53464 39977 176865 64350 5998 15614 -204962 -158092 -348161
11151 -348161 26288 231774 -261910 89680 -99531 187469 70489 40013 -30914 86468 62046
11140 62046 294226 2068 -47829 -150555 -954 63244 24719 36652 19595 342 98784 216176
11128 216176 303344 77929 57173 -195482 -158902 82859 -160930 224269 7381 57396 69293
11117 69293 149696 246052 -30131 104794 6479 66709 225799 -156336 -62377 238500 310226
11106 310226 376776 -159840 44464 32015 398814 181314 108366 147157 208388 221585 259075
11095 259075 -58962 424652 543613 282892 439736 58239 204199 -184209 287275 187552
$$ packed form
11174a49172j22183a340D564f1779l8567a0457B24375G9792c89476P7651I8266
11162a94858Q6064j4305E3464j3487J36888F4350E998R616b04962M6870j90069
11151c48161B6288K05486b61910H9680i9531A87469G0489l0476c0914H6468k4422
11140F2046K32180B068d7829j02726i54F3244B4719J1933j7057C42R8442J17392
11128B16176Q7168G7929k0756a95482L6580H2859a60930B24269G381N0015J1897
11117F9293Q0403R6356c0131A04794F479O0230J59090a56336f2377B38500P1726
11106C10226O6550a59840D4464j2449L66799A81314p2948L8791O1231J3197L7490
11095B59075e8962D24652J18961k60721J56844E8239J45960a84209B87275r9723
$$ plain form
11085 187552 277162 193978 56968 248210 501927 54232 -84574 356789 188477 574734
11075 574734 367755 370891 520799 556422 334120 324351 199766 93565 340041 396829 41071
11063 723297 675322 659165 673741 491211 561215 288109 736973 759699 590614 901887
11053 901887 605902 859965 845629 832500 985933 1177507 854037 732005 1157668 784737
11043 784737 926687 600713 673317 704859 884053 678308 919186 553817 776036 830137
11033 830137 761385 692797 762171 879688 670882 1024309 717573 908815 937568 1000702
11023 1000702 842296 648875 687667 923636 713634 505090 658736 448175 753653 545150
11013 545150 903956 665887 648683 653956 793364 585542 590776 402050 571737 351678
$$ packed form
11085A87552Q9610q3184E6968J91242K53717E4232h4574C56789j68312L86257
11075E74734k06979L136J49908L5623k22302r769j24585I3565K46476N6788D1071
11063G23297m7975j6157J4576j82530P0004k73106M48864K2726j69085L11273
11053I01887k95985K54063j4336j3129J53433J91574l23470j22032M25663l72931
11043G84737J41950l25974P2604L1542J79194k05745K40878l65369K22219N4101
11033H30137o8752o8588O9374J17517k08806L53427l06736J91242K8753O3134
11023A000702j58406j93421L8792K35969k10002k08544J53646k10561L05478k08503
11013E45150L58806k38069j7204N273J39408k07822N234j88726J69687k20059
$$ plain form
11003 351678 516938 788225 528847 716965 755770 697774 831000 757295 698318 437157
10993 437157 1016180 729022 518354 935062 1104981 1015562 693843 1009076 938013 804548
10983 804548 1307563 958826 1124417 1318539 1613877 1433396 1582698 2186814 2238657 2313480
10973 2313480 2841625 2666932 2897690 2730336 2881252 2631333 2758048 2210244 2014287
10964 2014287 1808312 1727479 1584896 1532636 1569165 1421282 1623943 1595433 1628713 1372240
10954 1372240 1618149 1434377 1366141 816160 904517 1006173 593621 753798 296113 127958
10943 454428 324428 602734 464172 -7495 -55173 -142697 -49332 386879 309865 162702 38250
10931 203536 35635 110747 -23146 -21693 -49803 149552 -61300 53010 122508 105025 152437
$$ packed form
11003C51678J65260K71287k59378J88118L8805n7996J33226p3705n8977k61161
10993D37157N79023k87158k10668M16708J69919q9419l21719L15233p1063j33465
10983H04548N03015l48737J65591J94122K95338j80481J49302O04116N1843P4823
10973B313480N28145j74693K30758j67354J50916k49919J26715n47804j95957
10964B014287k05975q0833j42583n2260L6529j47883K02661k8510L3280k56473
10954A372240K45909j83772o8236n49981Q8357J01656m12552J60177B96113A27958
10943D54428j30000K78306j38562g495m7678q7524d9332C86879p7014j47163C8250
10931B03536C5635P5112b3146J453k8110A49552f1300E3010O9498j7483M7412
$$ plain form
10920 152437 -17761 70924 46645 75361 2543 -113777 -103495 32664 -146156 288591 -72427
10908 -304808 -83994 200937 51470 1316 -128429 73538 279453 -15076 -101422 30813 -157872
10896 -110754 111163 -172554 -36269 108170 -190110 273411 -9289 -81315 -170738 173205
10885 43539 -147738 311718 -107613 -37613 -52958 -209710 -91842 73824 -129167 163635
10874 -259742 -156649 -70391 -35711 -224709 -177590 38540 138217 -166217 -169566 -192673 -79308
10862 78858 -341736 -214782 42831 -209043 -212109 -97810 -120145 -253053 78663 -253652 -4918
10850 118242 155762 -86867 -292511 75480 -79132 -35986 30092 41955 233568 -30592 153765
10838 -48139 210649 155946 135853 -210064 -223537 -108234 -138932 87288 -35831 -176507 -98498
$$ packed form
10920A52437a7761G0924k4279K8716B543a13777J0282C2664a46156B88591g2427
10908c04808h3994B00937E1470A316a28429G3538K05915a5076q6346C0813a57872
10896a10754A11163a72554c6269A08170a90110B73411i289p2026q9423A73205
10885D3539a47738C11718a07613c7613j5345j56752i1842G3824a29167A63635
10874b59742J03093g0391L4680j88998M7119C8540R9677a66217l349k3107g9308
10862G8858c41736J26954D2831b09043l066i7810k2335j32908G8663b53652d918
10850A18242L7520h6867k05644G5480g9132c5986C0092J1863J91613c0592A53765
10838d8139B10649n4703k0093b10064j3473a08234l0698H7288c5831j40676P8009
$$ plain form
10827 -98498 -117562 52740 -85993 -111190 -59566 69355 -21431 -77847 130833 -24263 -26824 172485
10814 -152886 71224 -194509 46975 -203676 -28464 -237319 -20092 151345 -212025 -108480
10804 -108480 83315 34207 203290 -117576 -41565 69557 -278929 173106 42751 412395
10794 412395 207159 -275605 -86345 -115562 20914 40623 264953 -95664 184384 -190424
10783 93315 274429 -272381 186124 27644 -79069 275113 -162632 -160594 -136090 -45753 202164
10771 97555 14062 46785 -38819 87458 -156873 32751 -79699 105251 276529 174145 319214
10760 319214 -61832 -1706 -38347 -242799 224884 177417 222159 -243942 268286 93911 64264
10749 64264 -63281 -95642 -117265 -919 -140 38924 -297991 182366 -111208 -198586 9004 -224188
$$ packed form
10827i8498j9064E2740h5993k5197N1624F9355b1431n6416A30833b4263k561A72485
10814a52886G1224a94509D6975b03676b8464k08855b0092A51345b12025J03545
10804a08480H3315C4207J69083a17576d1565F9557b78929A73106D2751L69644
10794D12395k05236b75605h6345k9217B0914J9709K24330i5664A84384a90424
10783I3315J81114b72381A86124B7644g9069B75113a62632K038K4504d5753B02164
10771I7555A4062L2723c8819H7458a56873C2751g9699A05251J71278j02384J45069
10760C19214f1832a706l6641k04452B24884m7467M4742b43942B68286I3911k9647
10749F4264f3281l2361k1623i19a40C8924b97991A82366a11208q7378I004b24188
$$ plain form
10736 -56958 -231283 94569 -76316 -15483 174194 3862 61114 -270456 140 -60588 -268756
10725 -268756 -9314 162213 -136908 67363 -26145 60613 68242 -188168 -220713 157068 -101816
10713 62151 -141365 -218162 -125428 -66124 -62058 -41167 160177 29603 -98907 -435289 -63246
10701 71452 194239 73820 -150571 61359 -174139 74988 -120119 -67573 -293568 -319309 -294791
10690 -294791 276976 263561 278718 21300 -121425 -38602 -199703 166478 198995 126115 -171641
10678 -223405 144891 -295751 -5424 -84411 78571 -4525 74945 -242945 184729 -62350 -61339
10667 -61339 -26985 -119778 -72318 -237638 51026 153865 -79582 -52298 33735 -166109 68935
10655 -99643 -179791 54349 -15198 14807 102918 -16501 -7209 134695 1226 -167530 -52652 -90500
$$ packed form
10736e6958j74325I4569g6316a5483A74194C862N7252b70456A40f0588k08168
10725b68756i314A62213a36908F7363b6145F0613P629a88168l2545A57068a01816
10713F2151a41365p6797R2734N9304M066K0891A60177B9603i8907l36382f3246
10701G1452J22787G3820a50571F1359a74139G4988a20119N2546k25995k5741K4518
10690b94791B76976j3415J5157B1300a21425c8602j61101A66478L2517p2880a71641
10678b23405A44891b95751e424p8987G8571d525G4945b42945A84729f2350J011
10667f1339b6985r2793M7460j65320E1026J02839g9582K7284C3735a66109F8935
10655i9643q0148E4349a5198A4807Q8111a6501g209A34695A226a67530e2652l7848
$$ plain form
10643 -90500 36406 6436 -8143 27297 -154165 -185114 -159934 -151990 66230 -120877 -23605 -12629
10631 -12629 187548 -243406 -114362 33408 244578 -24129 102594 262445 26984 20906 -81638
10619 -166758 -179556 -160424 -92515 -45963 -161624 -203397 76027 -309449 -289002 -116018 -267663
10608 -267663 -160787 83188 -310173 122008 -80422 245113 -34111 58710 -263164 -203653
10598 -203653 -115348 232307 148137 324831 -153263 244694 251078 431897 -372141 -152038
10587 202868 3315 91255 -67135 -101685 -56761 -346743 50142 -321101 -438840 -89792 -81538
10576 -81538 212833 -201530 -149348 -40688 231098 -179179 -414272 -179936 76968 -258342
10565 -196571 105320 -202455 53393 107174 -236679 297685 51686 60561 -126222 -165230 152135
$$ packed form
10643i0500C6406F436h143B7297a54165l0949K5180P944F6230a20877b3605J0976
10631a2629A87548b43406a14362C3408K11170b4129A02594J59851B6984o078h1638
10619a66758j2798J9132O7909d5963j15661m1773G6027c09449K0447a16018j51645
10608b67663J06876H3188c10173A22008h0422B45113c4111E8710b63164N9511
10598b03653Q8305B32307q4170J76694a53263B44694O384J80819c72141a52038
10587B02868C315Q7940f7135l4550M4924k89982E0142c21101j17739h9792Q254
10576h1538B12833b01530N2182d0688B31098a79179k35093a79936G6968b58342
10565a96571A05320b02455E3393N3781b36679B97685E1686Q875a26222l9008A52135
$$ plain form
10553 206364 -150755 163565 159873 402791 150973 143964 -1037 177484 -199171 -62302 203566
10541 63993 310386 -235620 -259495 -100362 -898 -53745 -178940 -69079 -104108 342974 49007
10529 113902 115967 -86979 -38811 89193 -45361 90776 -4319 -293549 -96374 -51891 159466
10517 28583 -44288 -17762 -297027 -85567 -248592 -179807 -322731 43494 185900 -13230 -313583
10506 -313583 141281 -59581 -86547 -179113 241988 -288905 -326713 278817 -206582 -14173
10495 4945 -49367 -202496 -168905 -240271 -435260 -442673 -94901 -116026 157669 -20523 -128670
10484 -128670 50842 -46900 147873 289610 513110 598215 261935 192959 160512 -39481 419797
10472 201352 178934 35244 -181284 80277 137784 141074 112334 226400 35459 76257 -68075
$$ packed form
10553B06364a50755A63565l692K42918A50973p009a037A77484a99171f2302B03566
10541F3993K46393b35620k3875a00362h98n2847j25195f9079l5029C42974D9007
10529A13902K065h6979c8811H9193d5361I0776d319k89230i6374M4483A59466
10517B8583d4288a7762k79265h5567j63025O8785j42924D3494J42406a3230l00353
10506c13583A41281e9581k6966r2566B41988b88905l7808B78817b06582a4173
10495D945d9367j53129L3591p1366j94989p413i4901k1125A57669b0523j08147
10484a28670E0842d6900A47873J41737K23500Q5105B61935o8976l2447c9481D19797
10472B01352k2418C5244a81284H0277N7507L290k8740J14066C5459M0798f8075
$$ plain form
10460 14522 -296287 130227 -148426 2768 105746 181320 -97713 91858 105896 170203 -70508
10448 100015 -56332 -316122 38017 161061 -59680 170523 -86059 -219641 334740 -320640
10437 -73503 89744 -88143 -207188 38762 -163421 -47254 98320 246675 120715 31373 -256694
10425 -129462 131701 326858 -107036 -129532 -151183 19798 147625 -84226 -258907 -60036
10414 137440 18659 124275 -1978 93136 -38880 -212977 99545 -297555 40254 -192087 98018
10402 -140600 -203918 -192434 324622 -126833 -87923 85767 94852 -89609 17873 165310 309398
10391 309398 185129 211928 -40910 -74850 50628 15199 375316 -43635 8965 -73472 104622
10379 -55503 457960 115190 426823 -474 308676 416429 142796 247707 272910 451232
$$ packed form
10460A4522b96287A30227a48426B768J02978P5574i7713I1858J4038O4307g0508
10448A00015e6332k59790C8017J23044e9680A70523h6059j33582C34740c20640
10437g3503H9744h8143j19045C8762a63421d7254I8320J48355A20715C1373b56694
10425a29462A31701J95157a07036k2496k1651A9798J27827h4226j74681f0036
10414A37440A8659J05616a978I3136c8880j74097I9545b97555D0254a92087I8018
10402a40600o3318J1484C24622a26833L8910H5767R085h9609A7873J47437J44088
10391C09398j24269K6799d0910l3940E0628A5199L60117d3635H965g3472A04622
10379e5503D57960A15190L11633d74C08676J07753A42796J04911K5203J78322
$$ plain form
10369 451232 -88373 388327 330488 452587 428231 52817 350357 276005 -22965 285119 451963
10358 451963 221065 213493 470584 -69189 -29652 176445 393187 994106 589826 208486
10347 362729 558236 270252 339360 148907 123602 542686 131394 431589 261772 -15042
10336 400544 207547 -62233 217748 176068 53995 68593 5524 171259 181694 275878 312238
10325 312238 416356 118619 163734 449908 85076 44228 -165135 137144 103570 382176
10315 382176 -283324 87763 220243 115787 36466 138329 -56007 -7314 -132529 -338046
10305 -338046 403517 228270 -97112 -89732 -216451 -88307 51572 51514 91180 -173366 -11486
10293 75028 -149894 -61000 136015 222852 -276974 -133507 30656 -64167 -303458 28176 95443
$$ packed form
10369D51232h8373C88327n7839J22099k4356E2817K97540p4352b2965B85119J66844
10358D51963B21065p572K57091f9189b9652A76445K16742O00919m04280B08486
10347C62729J95507B70252O9108A48907k5305M19084A31394L00195j69817a5042
10336D00544j92997f2233B17748m1680E3995J4598E524J65735J0435R4184L6360
10325C12238J04118A18619M5115K86174H5076m0848a65135A37144l3574K78606
10315C82176b83324H7763J32480j04456C6466J01863e6007g314j25215k05517
10305c38046D03517j75247i7112P380j26719h8307E1572n8L9666a73366a1486
10293G5028a49894f1000A36015Q6837b76974a33507C0656f4167k39291B8176O7267
$$ plain form
10282 95443 152688 163015 14059 -56578 -218479 -222856 -155297 309584 376251 97291 -210682
10270 165072 -47164 -397903 -376125 -57145 222585 38691 -254209 414898 116305 172576
10260 172576 634706 222631 178122 338859 150053 72522 274458 317903 187706 50169
10249 42591 -372490 -98054 -201962 115591 -14995 -106715 191960 -42195 -194397 200339
10238 15022 -71087 190172 -236744 -238634 -113517 135306 145460 294696 48435 -272628 64611
10226 51477 -197038 197964 23361 -50800 177589 -168145 38356 -7964 -27533 -22581 -449102
10215 -449102 -34123 7226 41342 72390 -432044 -342349 140672 -309761 -202020 95510 129673
10204 129673 -55671 -153221 22547 79702 194564 -538370 147372 -356452 102182 -319693
$$ packed form
10282I5443N7245J0327A4059e6578j61901m377O7559C09584O6667I7291b10682
10270A65072d7164l50739K1778e7145B22585C8691b54209D14898A16305N6271
10260A72576M62130B22631m4509J60737A50053G2522K01936M3445j30197E0169
10249D2591c72490i8054j03908A15591a4995r1720A91960d2195j52202B00339
10238A5022g1087A90172b36744j890a13517A35306J0154J49236D8435b72628F4611
10226E1477a97038A97964B3361e0800A77589a68145C8356g964j9569M952m26521
10215d49102c4123G226L4116L1048d32044Q9695A40672c09761J07741I5510L4163
10204A29673e5671r7550B2547N7155J14862e38370A47372c56452A02182c19693
$$ plain form
10193 304274 -316818 -47800 -241782 -176861 85333 -46227 392079 107399 -222699 270022
10182 12683 29932 108884 -217151 -110007 -143002 -313477 24921 -106398 -79816 -193472 -224230
10171 -224230 -134642 103946 -181677 -408123 -26577 110489 -271334 -277329 -196756 -39641 -253217
10160 -253217 -196952 -90762 -217291 456816 -69048 149478 190204 -200698 44422 -211440
10149 273029 -141413 -69584 138522 41886 258044 77434 -242936 -311139 -249586 110886
10138 -13968 31577 -107958 -30169 -130534 241020 225159 -239081 -64886 -60979 -349263 -207196
10127 -207196 448748 -150727 -73074 -158307 -235794 -91415 -207478 -119180 72595 16851 136227
10116 136227 -74022 31202 -242894 -45133 -58525 -391205 44729 40082 232185 -154017 -117836
$$ packed form
10193C04274c16818d7800j93982O4921H5333d6227C92079A07399b22699B70022
10182A2683J7249P8952b17151J07144l2995j70475B4921a06398K6582j13656l0758
10171b24230Q9588A03946a81677k26446b6577A10489b71334n995Q0573c9641k13576
10160b53217N6265i0762j26529D56816f9048A49478M0726b00698D4422b11440
10149B73029a41413f9584A38522D1886K16158G7434b42936o8203O1553A10886
10138a3968C1577a07958c0169j00365B41020j5861b39081f4886L907k88284J42067
10127b07196D48748a50727g3074q5233p7487i1415j16063Q8298G2595A6851J19376
10116A36227g4022C1202b42894d5133j3392l32680D4729m647J92103a54017L6181
$$ plain form
10105 -117836 193163 -73417 -363597 -113241 -398206 -135105 -195472 -55639 -48472 -18586 -23853
10094 -23853 -108539 -36145 69896 -115872 -128680 -246266 167641 73369 -161979 -149261 -165410
10083 -165410 10615 -183607 -199837 5014 58190 36125 -225203 473 80675 -6548 -73624 -241066
10071 -241066 -48529 -125989 -66429 -14615 -88109 115276 116099 -85431 -170758 -106692 123149
10059 -235093 7508 117380 -236775 144257 12181 -139040 16454 100984 -88024 11130 -48897
10047 -224398 -124273 -112554 -204875 57923 -205837 152763 -294571 71439 106211 -99248 -73048
10036 -73048 -183157 -183434 -155771 58732 -215989 271020 -68378 -213012 -271892 181246 -113563
10024 -33163 -175641 65677 -50817 -181600 219316 -149187 106687 253228 -190978 -173784
$$ packed form
10105a17836A93163g3417k90180a13241k84965a35105o0367e5639P167a8586n267
10094b3853q4686c6145F9896a15872j2808j17586A67641G3369a61979J2718j6149
10083a65410A0615a83607j6230E014N3176k2065b25203D73Q0202f548o7076j67442
10071b41066d8529p7460N9560a4615p3494A15276Q23h5431q5327O4066A23149
10059b35093G508J09872b36775A44257A2181a39040A6454Q4530h8024A1130d8897
10047b24398J00125J1719r2321E7923b05837A52763b94571G1439L4772i9248K6200
10036g3048j10109k77K7663E8732b15989B71020f8378j44634n8880A81246a13563
10024c3163j42478F5677e0817j30783B19316a49187A06687J46541a90978J7194
$$ plain form
10014 -173784 26567 162970 48204 -146251 6428 -205423 108080 75108 56788 83797 -153984
10002 83871 209836 -27665 -86232 -212008 -119509 -27955 148450 -236557 106270 29300 -167050
9990 632 208851 -164213 -263895 56394 -202564 -162525 54582 -200291 -136639 -195093 94629
9978 -446169 -55636 -276635 -120095 -155747 -249163 -99764 -197957 -66562 -167508 4862 -8814
9966 63539 -21468 -200096 -88576 188554 -68879 227246 -236902 57326 -448445 200486 141925
9955 141925 69215 -129436 -329568 187809 -300160 12704 33973 184066 -162951 49819
9944 56659 -346838 -21595 -99492 58794 -109141 -120620 -30122 -56452 -164099 -157715 42374
9932 47037 -3407 -270288 -31392 241882 367437 -107417 89216 180867 -31668 61596 -32390
$$ packed form
10014a73784B6567J36403D8204a46251F428b05423A08080l2972j8320K7009a53984
10002H3871J25965b7665n8567j25776R2499b7955A48450b36557A06270B9300a67050
9990F32K08219a64213r9682E6394b02564M0039E4582b00291O3652n8454I4629
9978d46169e5636k20999a20095l5652r3416i9764r8193f6562j00946D862h814
9966F3539b1468j78628h8576A88554f8879B27246b36902E7326d48445B00486n8561
9955A41925F9215a29436k00132A87809c00160A2704K1269J50093a62951D9819
9944E6659c46838b1595p7897E8794a09141j1479c0122k6330j07647O384D2374
9932D7037c407k66881c1392B41882J25555a07417H9216R1651c1668F1596c2390
$$ plain form
9920 -87361 58023 -6588 -64462 -295641 -282185 -83952 -12182 -379708 -72132 -89573 -14138 -341197
9908 -341197 -269312 -170925 -232644 -50811 -222112 -304674 -97602 28115 -90407 -91663 90759 -109705
9895 873 214943 -99195 -387472 -251652 36863 -2772 208261 -93744 -160480 14160 95790 56062
9883 56062 -5342 -219308 -152563 191773 -167120 -344607 -29727 -223580 -29951 -150469 43024
9871 -302023 2734 56790 -384362 -122140 169496 86598 68331 -735 -13547 -65271 -59143 -3357
9858 -223262 -180820 -216926 137508 231198 -198944 -28147 175865 -32233 -410890 -84315 54420
9846 -163082 68381 269679 144712 -75610 -264277 -250430 -86481 -124017 -46816 62445 -180172
9834 -324113 89038 -98397 -53867 130494 292 168891 -258767 32349 -264316 -125991 -204547
$$ packed form
9920h7361E8023f588n7874k31179J3456h3952a2182l67526g2132j7441a4138l27059
9908c41197P1885R8387o1719e0811j71301q2562i7602B8115i0407j256I0759a09705
9895H73K14070i9195k88277J35820C6863b772B08261i3744o6736A4160Q1630l9728
9883E6062e342k13966O6745A91773a67120j77487b9727j93853b9951j20518D3024
9871c02023B734N4056c84362a22140A69496q2898j8267g35j2812n1724O128c357
9858b23262M2442l6106A37508R3690a98944b8147A75865c2233l78657h4315E4420
9846a63082F8381K01298j24967g5610j88667J3847h6481l7536d6816F2445a80172
9834c24113H9038i8397M4530A30494B92J68599b58767C2349b64316a25991p8556
$$ plain form
9823 -204547 -311522 -51446 -119581 123024 -6278 -84991 32962 128892 -48891 127988 -154883
9811 43812 -333330 16268 -310706 -98947 -286900 -63778 -328419 -7924 108945 -86417 -150558
9800 -150558 -366222 -323186 -72618 -74317 -6201 79367 -123793 -66322 -180468 -141039 47927
9788 -393777 -48204 191072 -1751 -195247 -152458 247387 118691 278673 -2186 -173709 193101
9776 -279894 262500 105752 -171304 201169 -104339 -185015 -338126 94314 81691 80511 -74626
9764 182176 -11006 69730 100618 -16321 -149324 149389 -183849 143585 -303516 -104612
9753 -92447 284734 81297 43545 82467 -146510 -313590 169662 91180 -27424 -198016 2083
9741 -114880 -290145 -429861 23610 -436787 62391 -413579 -78144 187365 109940 -363383
$$ packed form
9823b04547j06975e1446o8135A23024f278p8713C2962R5930d8891A27988a54883
9811D3812c33330A6268c10706i8947j87953f3778k64641g924A08945h6417o4141
9800a50558k15664M3036g2618j699f201G9367a23793N7471j14146L9429D7927
9788c93777d8204A91072a751j93496M2789B47387A18691J59982b186j71523A93101
9776b79894B62500A05752a71304B01169a04339q0676j53111I4314j2623j180g4626
9764A82176a1006F9730L0888a6321j33003A49389a83849A43585c03516a04612
9753i2447B84734H1297l7752L8922a46510j67080A69662p8482b7424j70592B083
9741a14880j75265j39716B3610d36787F2391d13579g8144A87365p7425c63383
$$ plain form
9730 -44773 -458798 56409 -384207 -119263 -375938 -65758 178426 -46410 -108122 228160 -85852
9718 -74442 -122084 12169 -5889 -154269 -73457 14158 217829 -264685 -288227 35126 5740 -47083
9705 -83163 -31679 -134642 103840 -156095 -53430 -241820 -55477 -45647 -71295 -317362 -377722
9694 -377722 149084 149702 -204365 256164 -177280 -240717 174339 18619 196597 -213097 -376640
9683 -376640 29207 -164463 -24450 -71932 -12574 -28631 -55082 -14666 -321620 -395176 1586
9671 51624 106071 -92721 -67481 62135 -153493 -17655 -243723 -317808 123635 -312580 149923
9659 56762 29545 247766 118236 51703 -273314 -77236 -167321 105485 -471162 -98896 -162414
9648 -162414 -213923 276452 -41067 -364733 -75733 145062 -223614 -129612 -50314 12084 -47883
$$ packed form
9730d4773m14025E6409c84207a19263k56675f5758A78426d6410o1712B28160h5852
9718g4442m7642A2169e889j48380g3457A4158K03671b64685k3542C5126E740d7083
9705h3163c1679j02963A03840a56095e3430j88390e5477R830k5648k46067o0360
9694c77722A49084O18b04365B56164a77280o3437A74339A8619J77978b13097j63543
9683c76640B9207a64463b4450m7482a2574j6057k6451a4666l06954p3556A586
9671E1624N4447i2721K5240F2135a53493a7655k26068p4085A23635c12580A49923
9659E6762k7217K18221A18236E1703b73314g7236r0085A05485d71162i8896o3518
9648a62414n1509B76452d1067l23666g5733A45062b23614R4002e0314A2084d7883
$$ plain form
9636 103609 103690 -30524 92796 -22380 49694 -252526 -123665 46993 -90561 -67803 -377131 157887
9623 -7910 -168663 160222 -119045 128970 -210571 -132532 5214 -371296 -41662 -3202 -117264
9612 -117264 -99985 -40696 22892 181192 27792 -161394 47730 79192 -181516 188029 -181225
9600 -52675 142432 175896 -156279 -172336 -49644 -163600 -5802 94120 38018 -51271 -120189
9589 -120189 -131435 -70823 32480 -120540 61681 128923 62908 -125466 -21998 -221630 183811
9577 -232023 -265237 -242049 -179042 -192597 47918 -242902 -284576 -2430 -329733 -201553 -106018
9566 -106018 -46545 118357 -23417 -116467 16718 161643 -122140 267607 115418 139972 -200863
9554 58989 -52908 -7131 4445 -197991 181079 -251146 -267204 84089 -141757 4482 6629 68587
$$ packed form
9636A03609Q1c0524I2796b2380D9694b52526a23665D6993i0561K2758l09328A57887
9623g910j60753A60222a19045A28970b10571P8039E214c71296d1662c202j14062
9612a17264J7279d0696B2892J58300B7792a61394D7730L1462a81516A88029a81225
9600e2675A42432L3464a56279j6057d9644j13956e802I4120C8018e1271o8918
9589a20189j1246O0612C2480a20540F1681O7242F2908a25466b1998j99632A83811
9577b32023l3214K3188O3007j3555D7918b42902m1674b430l27303J28180R5535
9566a06018d6545A18357b3417r3050A6718J44925a22140B67607A15418K4554b00863
9554E8989e2908g131D445a97991A81079b51146j6058H4089a41757D482K147O1958
$$ plain form
9542 68587 -277592 108364 -36309 -334860 -10509 -73628 -142444 -139477 -319562 -250753 199348
9530 -157873 -148901 -218552 23920 -162725 -67038 -32418 -189221 -16096 129883 318274 18288
9518 -74155 287342 -143088 -233956 -31434 34636 -134311 -309084 -83446 -292109 81065 36183
9506 -179829 -178074 180896 249861 -66205 -65851 -29696 155592 139738 -294097 307253 -90111
9494 -244256 -165800 285206 183819 -288389 121567 -16899 -245152 -132649 196678 236071
9484 236071 193515 -81241 95829 -105921 18968 -195415 -310277 33616 -283401 -7983 254065
9472 -45476 50419 34507 -323459 -309625 -338628 -356161 119420 -164403 -16422 -86992 -106971
9461 -106971 -129704 -42821 -89251 41476 -97871 -237020 -229690 339519 -90765 77060 -42065
$$ packed form
9542F8587b77592A08364c6309k98551a0509o3119o8816K967j80085O8809A99348
9530a57873Q972o9651B3920a62725f7038c2418j56803a6096A29883J88391A8288
9518g4155B87342a43088r0868c1434C4636a34311j74773h3446k08663H1065C6183
9506a79829J755A80896O8965f6205L54b9696A55592j5854b94097C07253i0111
9494b44256P8456B85206j01387b88389A21567a6899k28253J12503A96678L9393
9484B36071m2556h1241I5829a05921A8968a95415j14862C3616b83401g983B54065
9472d5476E0419j5912c23459J3834k9003j7533A19420a64403a6422p0570j9979
9461a06971k2733d2821m6430D1476i7871j39149P330C39519i0765G7060d2065
$$ plain form
9449 -105700 81221 -43274 -64933 80785 -263671 -161611 -256000 -26459 -141815 -157468 -147857
9438 -147857 -44027 313470 -159486 -55393 63232 -329852 -173657 -169989 26579 -116929 215192
9426 129957 63620 -73371 22497 112279 21569 -184688 -79020 -104697 288326 -149139 -9890
9414 208480 61049 -16268 -23658 49510 -59545 146823 -274526 -55641 -407769 142836 -346687
9402 48572 242180 -626683 -77340 -154449 -457503 -94825 -227974 87304 73800 85027 121595
9391 121595 -50290 -444091 90642 -250498 49216 -11939 57733 -118427 88650 134543 164668
9380 164668 134153 -126240 246765 -564457 -153404 -78029 132530 -348509 -69615 -324230
9370 -324230 120173 64915 40976 -173414 -204384 97067 -282630 49647 67700 81640 -119885
$$ packed form
9449a05700H1221d3274k1659H0785b63671J02060r4389b6459j15356j5653R611
9438a47857d4027C13470a59486e5393F3232c29852J56195L668B6579a16929B15192
9426A29957F3620g3371B2497Q9782B1569a84688g9020k5677B88326a49139i890
9414B08480F1049a6268p390D9510e9545A46823b74526e5641l52128A42836c46687
9402D8572J93608f26683g7340p7109l03054i4825j33149H7304j3504J1227L6568
9391A21595e0290l93801I0642b50498D9216a1939E7733a18427H8650M5893L0125
9380A64668l0515a26240B46765e64457a53404P5375A32530c48509f9615k54615
9370c24230A20173n5258k3939a73414l0970I7067b82630D9647J8053J3940a19885
$$ plain form
9358 -338362 50527 -59500 94944 -70329 -175395 -724 116334 62027 45769 -121498 -115851 18240
9345 -76036 -225596 188760 41358 -273638 -303088 133151 -237017 -115636 65532 319366
9335 319366 202759 -5572 -131132 -219233 -86417 -163747 -195980 -202440 90673 -277979 -108871
9323 -175853 -227764 -33510 -164719 51646 -261896 50657 -196339 -63540 103399 -189768 -216
9311 275762 -195120 -26400 -132482 -221917 -94273 -119122 24947 38308 -66186 -6553 -171619
9300 -171619 -342978 52115 217401 -103004 42265 -54879 12536 30609 -359470 -288349 -55793
9288 184361 -335705 133772 -282178 56806 -231671 23316 -237434 43612 33482 -154129
9277 -489225 288912 10770 -242169 26383 -12067 -19532 -72260 -232498 -157900 -59303 -172097
$$ packed form
9358c38362E0527e9500I4944g0329j05066g24A16334n4307j6258a21498N647A8240
9345g6036j49560A88760D1358b73638k9450A33151b37017a15636F5532K53834
9335C19366j16607e572j25560q8101h6417p7330l2233o460I0673b77979a08871
9323a75853n1911c3510j31209E1646b61896E0657a96339f3540A03399a89768b16
9311B75762a95120b6400j06082q9435i4273k4849B4947J3361f6186f553j65066
9300a71619j71359E2115J65286a03004D2265e4879A2536J8073c59470P1121e5793
9288A84361c35705A33772b82178E6806b31671B3316b37434D3612j0130a54129
9277d89225B88912A0770b42169B6383a2067p465n2728j60238P4598e9303j12794
$$ plain form
9266 -172097 -153395 -497374 -257587 18877 -52796 -25725 -298367 -83527 247353 -152795 -18793
9254 145605 65457 33195 278107 123491 -360988 -132498 -40941 -165014 -194689 -155167 67537
9242 -216211 -159046 -37860 298490 -21936 -139557 -19039 16053 26102 -287746 -124920 -82917
9231 -82917 37540 74222 -187986 -289331 134178 -231484 10362 -163833 67884 8159 97528
9220 97528 -183950 211853 -312845 47446 361011 81880 -122017 -282544 191689 -108003
9209 -9131 -115543 3072 -102119 -350382 -100341 -231441 -53342 131437 245162 376685 -245209
9197 31525 -94012 82442 -207864 123251 104683 -257897 -19809 -96739 -193719 47245 -95112
9185 108572 113998 -274188 53657 -367678 93294 108926 164158 -206032 -309447 -24994 -195469
$$ packed form
9266a72097J8702l43979K39787A8877e2796b5725k72642h3527B47353a52795a8793
9254A45605F5457l2262K44912A23491c60988a32498d0941j24073k9675L9522F7537
9242b16211N7165c7860B98490b1936j17621a9039A6053J0049b87746a24920M2003
9231h2917C7540L6682a87986j01345A34178b31484A0362a63833F7884H159Q9369
9220I7528a83950B11853c12845D7446L13565H1880a22017j60527A91689a08003
9209i131j06412C072a02119k48263a00341j31100e3342A31437J13725J31523b45209
9197C1525i4012H2442b07864A23251j8568b57897a9809p6930r6980D7245i5112
9185A08572N426b74188E3657c67678I3294J5632N5232b06032j03415b4994j70475
$$ plain form
9174 -195469 -71391 19503 -135239 -194206 -36004 -174492 -171663 -120066 14870 -76735 -313502
9163 -313502 -378946 -70674 -143913 -271417 -347495 224440 192304 -96497 -110904 -2547 -213357
9152 -213357 39152 -171784 -23620 -83112 7076 6812 -260845 140480 180587 36439 -237940
9140 148047 -4533 -392140 -191391 251646 -24607 -360407 -220897 119675 56202 -146095
9129 68527 -374320 -268938 -113187 -49595 -23787 -122446 35909 -306584 -62468 56351 -290676
9117 600154 37739 5727 36153 50211 -238721 -74928 96927 -116465 185366 -34038 225665
9105 34200 -428714 -6847 -14473 59881 -212566 -198615 -110150 -9935 -14677 -55489 -320716 -473260
9093 -473260 -168015 74692 26336 110467 -256378 -174788 -370584 182662 -192297 54307 -202888
$$ packed form
9174a95469g1391A9503a35239n8967c6004j38488K829N1597A4870g6735k36767
9163c13502o5444g0674p3239j27504p6078B24440l2136i6497j4407b547k10810
9152b13357C9152a71784b3620n9492G076k64b60845A40480M0107C6439b37940
9140A48047d533l87607a91391B51646b4607l35800J39510A19675E6202a46095
9129F8527c74320J05382a13187d9595b3787r8659C5909c06584f2468E6351b90676
9117F00154C7739E727L0426J4058b38721g4928I6927a16465A85366c4038B25665
9105C4200d28714f847p626E9881b12566J3951Q8465i935m742m0812k65227j52544
9093d73260a68015G4692B6336Q4131b56378Q1590j95796A82662a92297E4307b02888
$$ plain form
9081 -284891 -173755 3144 -309366 -92509 76890 -468629 -158592 -207572 -79544 79714 -57982
9069 45710 -179758 -129829 -113894 -89387 -199554 35809 -234772 62408 -440683 226826 162968
9058 162968 48007 32397 -143182 92528 -119608 -226118 -113159 -559669 55106 -76068 -84037
9047 -84037 -65335 61409 137889 -131253 -201740 -70467 -236221 -250623 465413 22196 -18436
9035 -113554 172476 -89549 -27621 -124104 42079 -192674 611 -357107 -98342 -199318 417949
9023 -48281 237722 -50364 64105 -49757 -30715 -103036 -83701 -175924 -69833 -2522 -239103 -493737
9011 -493737 16502 -49519 142694 237437 -36760 -132858 -203662 250996 -214633 -43487 178388
8999 -192379 58482 17609 -188508 242267 -55318 -84230 73128 62926 -160018 202963 -204491
$$ packed form
9081b84891J11136C144c09366i2509G6890d68629a58592m8980g9544G9714e7982
9069D5710a79758M9929J5935K4507j10167C5809b34772F2408d40683B26826o3858
9058A62968D8007j5610a43182I2528a19608j06510J12959m46510E5106g6068p969
9047h4037J8702F1409P6480a31253p0487g0467j65754j4402D65413B2196a8436
9035a13554A72476h9549b7621r6483D2079a92674F11c57107i8342j00976D17949
9023d8281B37722e0364F4105d9757J9042p2321J9335r2223f9833b522k36581k54634
9011d93737A6502d9519A42694R4743c6760r6098p0804B50996b14633d3487A78388
8999a92379E8482A7609a88508B42267e5318k8912G3128j0202a60018B02963b04491
$$ plain form
8987 -58836 -99085 -120204 -24129 -381663 -16523 88625 -39857 -161383 -237414 -17759 -243800
8976 -243800 -331769 -122000 -146483 -79171 110097 217431 -44361 -106223 -221519 74492 25018
8964 178528 180402 55392 18124 -296211 400111 -29384 -54849 65123 -158826 -179479 -353449
8953 -353449 8957 -318886 379311 -72254 19636 116715 -220892 -192157 4002 -142360 -274147
8942 -274147 98258 -192471 -129730 -113772 143406 144289 -258615 -52626 -90151 9994 7877 -92504
8929 38760 -103946 100732 246587 -251826 -206425 176175 188014 1843483 1503294 601434
8918 -151540 -262466 -7343 -82999 -115522 143371 -95289 -258721 -33398 -76131 -149652 6148
8906 90786 31191 108077 46601 375980 -190757 -54418 -28184 -79430 -59486 60278 97461
$$ packed form
8987e8836m0249k1119b4129l57534a6523H8625c9857j21526p6031a7759k26041
8976b43800q7969a22000k4483O7312A10097J07334d4361o1862j15296G4492B5018
8964A78528J874E5392A8124b96211D00111b9384k5465F5123a58826k0653j73970
8953c53449H957c18886C79311g2254A9636R7079b20892K8735D002a42360j31787
8942b74147I8258a92471O2741J5958A43406Q83b58615e2626l7525I994k117i2504
8929C8760a03946A00732J45855b51826M5401A76175J1839J655469l40189F01434
8918a51540j10926g343p5656l2523A43371i5289j63432c3398m2733p3521F148
8906I0786C1191P6886D6601L29379a90757e4418K6234n1246J9944F0278L7183
$$ plain form
8895 97461 -127582 183743 127659 107029 -78729 -59958 165 -438722 234250 5525 -233146
8883 -340550 228544 -164544 -150188 -196210 37729 -123063 -260370 182647 -141889 -71706
8873 -71706 65701 -108961 -278393 285635 -304737 -62806 159814 -189319 121568 104326
8863 104326 -68090 -259549 -344418 156524 -42900 -241691 -4989 15305 102539 -203151 -65670
$$ packed form
8895I7461a27582A83743n6084k0630g8729J8771A65d38722B34250E525b33146
8883c40550B28544a64544J4356m6022C7729a23063j37307A82647a41889P0183
8873g1706F5701a08961j69432B85635c04737f2806A59814a89319A21568j7242
8863A04326f8090j91459q4869A56524d2900j98791d989A5305Q7234b03151f5670
$$ [...]
##END NTUPLES=NMR SPECTRUM
##END=
