##TITLE=AC1458_PAST313264_7819537_9jyCbH7Ab4
##JCAMPDX= 6.0         $$ Bruker NMR JCAMP-DX V2.0
##DATA TYPE= NMR SPECTRUM
##DATA CLASS= NTUPLES
##ORIGIN= BRUKER
##OWNER= Administrator
$$ 1.72 TOPSPIN		Version 2.1
$$ 2013-04-30 21:03:23.192 -0700  Administrator@X
$$ Compression mode = diff/dup
##.OBSERVE FREQUENCY= 400.02188249412
##.OBSERVE NUCLEUS= ^1H
##.ACQUISITION MODE= SIMULTANEOUS (DQD)
##.ACQUISITION SCHEME= undefined
##.AVERAGES= 64
##.DIGITISER RES= 22
##SPECTROMETER/DATA SYSTEM= spect
##.PULSE SEQUENCE= noesygpps1d.comp
##.SOLVENT NAME= COFFEE_meoh
##.SHIFT REFERENCE= INTERNAL, COFFEE_meoh, 1, 14.96094
##AUDIT TRAIL= $$ (NUMBER, WHEN, WHO, WHERE, PROCESS, VERSION, WHAT)
$$ ##TITLE= Audit trail, TOPSPIN		Version 2.1
$$ ##JCAMPDX= 5.01
$$ ##ORIGIN= Bruker BioSpin GmbH
$$ ##OWNER= Administrator
$$ $$ E:\/data/COFFEE/nmr/AC1458_PAST313264_7819537_9jyCbH7Ab4/12/pdata/1/auditp.txt
$$ ##AUDIT TRAIL=  $$ (NUMBER, WHEN, WHO, WHERE, PROCESS, VERSION, WHAT)
(   1,<2013-04-30 21:03:18.192 -0700>,<Administrator>,<X>,<go>,<TOPSPIN 2.1>,
      <created by zg
	started at 2013-04-30 20:51:48.239 -0700,
	POWCHK enabled, PULCHK disabled,
       configuration hash MD5:
       F7 49 AB AC A2 8D 51 76 73 8D C1 9A A6 38 9F DE
       data hash MD5: 64K
       AC 06 36 4A D3 8E AE F4 06 15 D6 5A 42 41 7D B2>)
(   2,<2013-04-30 21:03:21.177 -0700>,<Administrator>,<X>,<proc1d>,<TOPSPIN 2.1>,
      <Start of raw data processing
       efp LB = 0.3 FT_mod = 6 PKNL = 1 PHC0 = 0 PHC1 = 0 SI = 128K 
       data hash MD5: 128K
       DA CC A5 2C DC 17 03 5D FD B6 C8 AB DC B6 EF 6C>)
(   3,<2013-04-30 21:03:22.177 -0700>,<Administrator>,<X>,<proc1d>,<TOPSPIN 2.1>,
      <pk PHC0 = -80.58472 PHC1 = 0 
       data hash MD5: 128K
       5C DA 38 D3 2C F1 E4 D3 19 05 8D C2 83 0A 67 19>)
(   4,<2013-04-30 21:03:22.614 -0700>,<Administrator>,<X>,<proc1d>,<TOPSPIN 2.1>,
      <abs ABSG = 1 
       data hash MD5: 128K
       B5 EA 90 F9 0E BB FC 5C 56 BD AD 8E 40 F3 10 E7>)
(   5,<2013-04-30 21:03:22.739 -0700>,<Administrator>,<X>,<proc1d>,<TOPSPIN 2.1>,
      <abs ABSG = 2 
       data hash MD5: 128K
       AA 5F 7B 64 49 C7 A9 DC B9 12 B5 F3 04 3E 03 5C>)
(   6,<2013-04-30 21:03:22.817 -0700>,<Administrator>,<X>,<proc1d>,<TOPSPIN 2.1>,
      <abs ABSG = 3 
       data hash MD5: 128K
       4F CB 51 FA 95 77 AF CA DB AC 31 FB 3E 99 F1 0C>)
(   7,<2013-04-30 21:03:22.911 -0700>,<Administrator>,<X>,<proc1d>,<TOPSPIN 2.1>,
      <abs ABSG = 4 
       data hash MD5: 128K
       78 A2 46 12 EE 48 F0 4F 33 87 5A 40 1D 8D 47 4A>)
(   8,<2013-04-30 21:03:23.005 -0700>,<Administrator>,<X>,<proc1d>,<TOPSPIN 2.1>,
      <abs ABSG = 5 
       data hash MD5: 128K
       AD 98 54 88 20 5E 31 07 8A 28 2C 89 38 E8 BB 97>)
$$ ##END=
$$ 
$$ $$ hash MD5
$$ $$ 82 BB 7E 95 9B AF 89 F4 7A 8E 20 2A 7B 21 90 0F
##$RELAX= 
##$RELAX= 
##$RELAX= 
##$RELAX= 
##$RELAX= 
##$RELAX= 
##$RELAX= 
##$RELAX= 
$$ Bruker specific parameters
$$ --------------------------
##$DU= <E:\>
##$EXPNO= 12
$$ [...]
##$TP07= 0
##$TPNAME0= <>
##$TPNAME1= <>
##$TPNAME2= <>
##$TPNAME3= <>
##$TPNAME4= <>
##$TPNAME5= <>
##$TPNAME6= <>
##$TPNAME7= <>
##$TPOAL= (0..7)
0.5 0.5 0.5 0.5 0.5 0.5 0.5 0.5
##$TPOFFS= (0..7)
0 0 0 0 0 0 0 0
##$TUNHIN= 0
##$TUNHOUT= 0
##$TUNXOUT= 0
##$USERA1= <user>
##$USERA2= <user>
##$USERA3= <user>
##$USERA4= <user>
##$USERA5= <user>
##$V9= 5
##$VALIST= <valist>
##$VCLIST= <CCCCCCCCCCCCCCC>
##$VD= 0
##$VDLIST= <DDDDDDDDDDDDDDD>
##$VPLIST= <PPPPPPPPPPPPPPP>
##$VTLIST= <TTTTTTTTTTTTTTT>
##$WBST= 1024
##$WBSW= 4
##$XGAIN= (0..3)
0 0 0 0
##$XL= 0
##$YL= 0
##$YMAX_a= 6264447
##$YMIN_a= -12911628
##$ZGOPTNS= <>
##$ZL1= 120
##$ZL2= 120
##$ZL3= 120
##$ZL4= 120
##$ABSF1= 14.96094
##$ABSF2= -5.597241
##$ABSG= 5
##$ABSL= 3
##$ALPHA= 0
##$AQORDER= 0
##$ASSFAC= 0
##$ASSFACI= 0
##$ASSFACX= 0
##$ASSWID= 0
##$AUNMP= <proc_prof1d_extract.lims>
##$AXLEFT= 0
##$AXNAME= <>
##$AXNUC= <1H>
##$AXRIGHT= 0
##$AXTYPE= 0
##$AXUNIT= <>
##$AZFE= 0.1
##$AZFW= 0.1
##$BCFW= 0
##$BC_mod= 0
##$BYTORDP= 0
##$COROFFS= 0
##$CY= 15
##$DATMOD= 1
##$DC= 0
##$DFILT= <>
##$DTYPP= 0
##$F1P= 0
##$F2P= 0
##$FCOR= 0.5
##$FTSIZE= 131072
##$FT_mod= 6
##$GAMMA= 0
##$GB= 0
##$INTBC= 1
##$INTSCL= 1
##$ISEN= 128
##$LB= 0.3
##$LEV0= 0
##$LPBIN= 0
##$MAXI= 10000
##$MC2= 0
##$MEAN= 0
##$ME_mod= 0
##$MI= 0
##$NCOEF= 0
##$NC_proc= -2
##$NLEV= 6
##$NOISF1= 0
##$NOISF2= 0
##$NSP= 0
##$NTH_PI= 0
##$NZP= 0
##$OFFSET= 14.96094
##$PC= 1
##$PHC0= -80.58472
##$PHC1= 0
##$PH_mod= 1
##$PKNL= yes
##$PPARMOD= 0
##$PPDIAG= 0
##$PPIPTYP= 0
##$PPMPNUM= 2147483647
##$PPRESOL= 1
##$PSCAL= 4
##$PSIGN= 0
##$PYNMP= <proc.py>
##$REVERSE= no
##$SF= 400.020009659772
##$SI= 131072
##$SIGF1= 0
##$SIGF2= 0
##$SINO= 400
##$SIOLD= 131072
##$SPECTYP= <>
##$SREGLST= <1H.CDCl3>
##$SSB= 0
##$STSI= 131072
##$STSR= 0
##$SW_p= 8223.68421052631
##$SYMM= 0
##$S_DEV= 0
##$TDeff= 65536
##$TDoff= 0
##$TI= <>
##$TILT= no
##$TM1= 0
##$TM2= 0
##$TOPLEV= 0
##$USERP1= <user>
##$USERP2= <user>
##$USERP3= <user>
##$USERP4= <user>
##$USERP5= <user>
##$WDW= 1
##$XDIM= 131072
##$YMAX_p= 410384149
##$YMIN_p= -12486
##$CURPLOT= <Network HP LaserJet P1505>
##$CURPRIN= <$Network HP LaserJet P1505>
##$DFORMAT= <normdp>
##$LAYOUT= <+/1D_H.xwp>
##$LFORMAT= <normlp>
##$PFORMAT= <normpl>
##$SURQMSG= 1
$$ End of Bruker specific parameters
$$ ---------------------------------
##NTUPLES= NMR SPECTRUM
##VAR_NAME=  FREQUENCY,     SPECTRUM/REAL,   SPECTRUM/IMAG
##SYMBOL=    X,             R,               I
##VAR_TYPE=  INDEPENDENT,   DEPENDENT,       DEPENDENT
##VAR_FORM=  AFFN,          ASDF,            ASDF
##VAR_DIM=   131072,        131072,          131072
##UNITS=     HZ,            ARBITRARY UNITS, ARBITRARY UNITS
##FACTOR=    0.0627417313425164, 1,          1
##FIRST=     8223.62146879497, 1625,         -57067
##LAST=      0,             3337,            -57690
##MIN=       0,             -12486,          0
##MAX=       8223.62146879497, 410384149,    0
$$ Real data points
##PAGE= N=1
##DATA TABLE= (X++(R..R)), XYDATA
$$ [...]
63844A007075k1636k4167k6755k9773l2368l3501l3228l2428l1651l0823k9863
63833F80882k8869k7739k6286k4759k3691k3015k1970k0133j8117j6773j6105
63822D33425j5396j4185j2656j1174r902q885q177p676p100o283n374m621m045
63809C17951l465k791k210k012k238k589k752k764k882l087k970k291j419r78
63795B83503j107j373j405j300j304j447j639j922k312k555k406k082k059k329
63781B58263k271j501n47k92q79j612j861j627j188o70j63P5p6l54m81n49p53
63764B43514r54q76n90l49o1N45J220J243L77o64r95m99K65Q34J085J010O56L08
63746B46069L73R46J672K133K204K028J773J540J489J870K801L982M782M792M242
$$ plain form
63844 1007075 985439 961272 934517 904744 872376 838875 805647 773219 741568 710745 680882
63833 680882 652013 624274 597988 573229 549538 526523 504553 484420 466303 449530 433425
63822 433425 418029 403844 391188 380014 370112 361227 353050 345374 338274 331991 326617 321996 317951
63809 317951 314486 311695 309485 307473 305235 302646 299894 297130 294248 291161 288191 285900 284481 283503
63795 283503 282396 281023 279618 278318 277014 275567 273928 272006 269694 267139 264733 262651 260592 258263
63781 258263 255992 254491 253944 253652 252773 251161 249300 247673 246485 245815 245652 245727 245651 245297 244816 244267 243514
63764 243514 242560 241684 241094 240745 240684 241229 242449 243692 244069 243405 242410 241911 242176 243010 244095 245105 245761 246069
63746 246069 246442 247388 249060 251193 253397 255425 257198 258738 260227 262097 264898 268880 273662 278454 282696
63731B82696L715L507L504L628M022M676N172N156M805M582M695N041N580O236
63717C47015O559O021M778L683L150K453O88j751l416l610l271l632m601n115
63703C48951m753m129l750l376k830k547k707k476r84J259K794L012K719K812
63689C33995L198L292K992K614K317K027J703J340Q43K45j44K2P75J867K926L553
63673C63565L523L083K761K751K763K665K863L592M229L829K345P78J9j11n39
63658C98116j822l586m988n598n773o087o620o950o834o448n944n141l959k791
63644C25575k030j429m17J068K421L146L355L433L519L543L624M107N184O509
63630C61608P372P335O747O511P184Q388R223R304R224R897J1452J3052J3918
$$ plain form
63731 282696 286411 289918 293422 297050 301072 305748 310920 316076 320881 325463 330158 335199 340779 347015
63717 347015 353574 359595 364373 368056 371206 373659 374347 372596 369180 365570 362299 358667 354066 348951
63703 348951 344198 340069 336319 332943 330113 327566 324859 322383 321399 322658 325452 328464 331183 333995
63689 333995 337193 340485 343477 346091 348408 350435 352138 353478 354321 354566 354422 354444 355219 357086 360012 363565
63673 363565 367088 370171 372932 375683 378446 381111 383974 387566 391795 395624 397969 398747 398766 398655 398116
63658 398116 396294 392708 387720 382122 376349 370262 363642 356692 349858 343410 337466 332325 328366 325575
63644 325575 323545 322116 321699 322767 325188 328334 331689 335122 338641 342184 345808 349915 355099 361608
63630 361608 368980 376315 383062 389573 396757 405145 414368 423672 432896 442793 454245 467297 481215
63617D81215J4410J5691J8274K1337K3728K5236K6441K7732K9131L0937L3501
63606G47633L6229L7630L6838L4497L1660K8313K3667J7517J0681M188j397n817
63594A001639q860j0487j1040j1148j1411j2127j3278j4883j7248k0549k4163
63583H46445k6878k7943k7669k6855k5985k5126k4101k2525k0053j6891j3674
63572E88745j0652p571m557k397j358m91J159L165M431M877N421O503P654Q583
63558F03512R697J1288J2906J4066J5069J6807J9931K4319K9165L3545L7154M0462
63546H67921M3910M7211M9729N1182N1240M8690M1911L0567J6465K577q552j5654
63534A227197j8852j9283j8269j6590j4609j2909j2299j3247j5673j9289k3700
$$ plain form
63617 481215 495625 511316 529590 550927 574655 599891 626332 654064 683195 714132 747633
63606 747633 783862 821492 858330 892827 924487 952800 976467 993984 1004665 1008853 1007456 1001639
63594 1001639 992779 982292 971252 960104 948693 936566 923288 908405 891157 870608 846445
63583 846445 819567 791624 763955 737100 711115 685989 661888 639363 619310 602419 588745
63572 588745 578093 570522 565965 563568 562210 561719 562878 566043 570474 575351 580772 587275 594929 603512
63558 603512 613209 624497 637403 651469 666538 683345 703276 727595 756760 790305 827459 867921
63546 867921 911831 959042 1008771 1059953 1111193 1159883 1201794 1232361 1248826 1251403 1242851 1227197
63534 1227197 1208345 1189062 1170793 1154203 1139594 1126685 1114386 1101139 1085466 1066177 1042477
63523A042477k8212l2106l5186l7677l9539m0329l9792l8156l5831l3135l0388
63512F52126k7868k5597k3419k1194j8750j5917j3049j1102j0563j0591r903q346
63500D55827o857o080n837n853o011n903n080l852k984k489j683n66l6l83o49
63485D01564J0J207K132K666L058L320L516M002M818N428N604N794O146N933M651
63470D59849K918J537L69j047k480l491m352n378n917n166l725l075l474l513
63456D23055k039L65K150K462J665P67O63J608L144M564N553O281P116Q400J0294
63441D76048J2594J4875J7009J9325K2037K4864K7546L0369L3795L7770M1520
63430G57752M3726M2688L7222K8065J7993R847M660K035J598L279O673J1153J6499
$$ plain form
63523 1042477 1014265 982159 946973 909296 869757 829428 789636 751480 715649 682514 652126
63512 652126 624258 598661 575242 554048 535298 519381 506332 495230 484667 474076 464173 455827
63500 455827 448970 442890 437053 431200 425189 419286 414206 410354 407370 404881 403198 402632 402596 402213 401564
63485 401564 401574 402781 404913 407579 410637 413957 417473 421475 426293 431721 437325 443119 449265 455198 459849
63470 459849 462767 464304 464673 463626 461146 457655 453303 447925 442008 436842 433117 430042 426568 423055
63456 423055 421016 421381 423531 425993 427658 428425 429088 430696 433840 438404 443957 450238 457354 465754 476048
63441 476048 488642 503517 520526 539851 561888 586752 614298 644667 678462 716232 757752
63430 757752 801478 844166 881388 909453 927446 937293 941953 943988 945586 948865 955538 966691 983190
63417I83190K2527K8336L2749L5465L6934L7151L5506L1804K6496J9812J1652
63406A301622K689n330j0940j4087j5585j6091j6082j6248j7251j9257k2145k5880
63394A125415l0309l4802l8510m0884m1791m1304l9706l7550l5326l3034l0338
63383G21861k7165k3956k1124j8460j5412j2017r122p344o011l803l93L112N613
63370E85779P235Q746J0381J1865J3229J4904J7128J9830K2990K6583L0253L3471
63358H02394L6135L8559M0964M3217M5031M6055M5855M4073M0548L5170K7991
63347A245992J9686J1487M205k195p694j1541j3270j3894j5058j7159j9283k0823
63335A160453k2312k4474k7366l0627l3862l6516l8006l8165l7113l4684l0744
$$ plain form
63417 983190 1005717 1034053 1066802 1102267 1139201 1176352 1211858 1243662 1270158 1289970 1301622
63406 1301622 1304311 1298981 1288041 1273954 1258369 1242278 1226196 1209948 1192697 1173440 1151295 1125415
63394 1125415 1095106 1060304 1021794 980910 939119 897815 858109 820559 785233 752199 721861
63383 721861 694696 670740 649616 631156 615744 603727 594605 587261 581250 577447 577054 580166 585779
63370 585779 593014 601760 612141 624006 637235 652139 669267 689097 712087 738670 768923 802394
63358 802394 838529 877088 918052 961269 1006300 1052355 1098210 1142283 1182831 1218001 1245992
63347 1245992 1265678 1277165 1281370 1279175 1271481 1259940 1246670 1232776 1217718 1200559 1181276 1160453
63335 1160453 1138141 1113667 1086301 1055674 1021812 985296 947290 909125 872012 837328 806584
63324H06584k5996k1653j8110j4725j1072p585m675k270q23j882o607j4002k1343
63311F55841k6305k8303k8067k6578k4443k1882j9039j6244j3877j2051j0607
63300D28445r396q278p020n607m532m255m426m213l467k860k759k763k569k555
63286C63745l009l491l547l517l908m339l898k431q45o9j74n61o88m64j65k5J5
63269C32629J34L01L70N15J151K246L068K924J999J167J045J455J802J885K224
63254C54915L425N205O403O241N238M515M481M817N406O442P683Q456Q646Q896
63240D40769R621J0540J1454J2696J4418J6157J7551J8827K0092K0874K0992K1234
63228F35225K2378K3957K4768K4361K3326K2293K1415K0766K0612K1133K2148
$$ plain form
63324 806584 780588 758935 740825 726100 715028 707443 702768 700498 699675 697793 691186 677184 655841
63311 655841 629536 601233 573166 546588 522145 500263 481224 464980 451103 439052 428445
63300 428445 419049 410771 403751 398144 393612 389357 384931 380718 377251 374391 371632 368869 366300 363745
63286 363745 360736 357245 353698 350181 346273 341934 338036 335605 334760 334691 334517 333956 333268 332804 332639 332614 332629
63269 332629 332763 333064 333434 333949 335100 337346 340414 343338 345337 346504 347549 349004 350806 352691 354915
63254 354915 358340 363545 369948 376189 381427 385942 390423 395240 400646 407088 414771 423227 431873 440769
63240 440769 450390 460930 472384 485080 499498 515655 533206 552033 572125 592999 613991 635225
63228 635225 657603 681560 706328 730689 754015 776308 797723 818489 839101 860234 882382
63217H82382K3172K3499K2479K0119J7310J5056J3459J1688Q839M691k42n179
63205A037273r756j4342j9377k4371k8099k9951l0583l0758l0234k8384k5447
63194G65971k2388j9644j6854j3762j0671p823m918j580J979N119P421R020J0358
63181G02228J1718J3049J4182J5047J5600J5727J5535J5477J5717J5595J4354
63170H64229J2433J1142J0890J0547R033O642M194J628j645n528r308j2738j6141
63157H85378j9533k2429k4535k6034k7139k7788k7820k7039k5308k2971k0891
63146F13891j9538j8307j6366j3868j1687j0106q680p273o377o182o106n530m413
63133D79458l018j580m81j17k85j68O92J788K325K178J861J821K118K633L238
$$ plain form
63217 882382 905554 929053 951532 971651 988961 1004017 1017476 1029164 1038003 1042694 1042452 1037273
63205 1037273 1027517 1013175 993798 969427 941328 911377 880794 850036 819802 791418 765971
63194 765971 743583 723939 707085 693323 682652 674829 669911 668331 670310 675429 682850 691870 702228
63181 702228 713946 726995 741177 756224 771824 787551 803086 818563 834280 849875 864229
63170 864229 876662 887804 898694 909241 918274 924916 929110 930738 929093 923565 914257 901519 885378
63157 885378 865845 843416 818881 792847 765708 737920 710100 683061 657753 634782 613891
63146 613891 594353 576046 559680 545812 534125 524019 515339 508066 501689 495507 489401 483871 479458
63133 479458 476440 474860 474379 474262 473977 473809 474501 476289 478614 480792 482653 484474 486592 489225 492463
63118D92463L794M133M089L576K695J803J323J444K046K784L202K967K287J890
63104E30496K269L046L366K862J918J084N71L86N12Q61J222J427J494J587J873
63089E54974K296K477K016J022Q3m37p55j145j377j089l38N70J502K355K815K815
63073E67784K924L686M794N584O113P037Q466R799J0741J1747J3215J4951J6753
63060F83594J8829K1272K3583K5384K7204L0019L3995L8118M1213M3189M5053
63049A031453M7705N0861N3391N4700N5338N6062N6770N6788N5902N4563N3270
63038A626803N2272N1761N1753N1836N1472N0554M9134M6797M2880L7329L0745
63027B143336K3503J5370O042m453j5897k7794l9067m8540n5932o1886o6808p0288
$$ plain form
63118 492463 496257 500390 504479 508055 510750 512553 513876 515320 517366 520150 523352 526319 528606 530496
63104 530496 532765 535811 539177 542039 543957 545041 545612 545998 546510 547371 548593 550020 551514 553101 554974
63089 554974 557270 559747 561763 562785 562868 562431 561676 560531 559154 558065 557727 558297 559799 562154 564969 567784
63073 567784 570708 574394 579188 584772 590885 597922 606388 616187 626928 638675 651890 666841 683594
63060 683594 702423 723695 747278 772662 799866 829885 863880 901998 943211 986400 1031453
63049 1031453 1079158 1130019 1183410 1238110 1293448 1349510 1406280 1463068 1518970 1573533 1626803
63038 1626803 1679075 1730836 1782589 1834425 1885897 1936451 1985585 2032382 2075262 2112591 2143336
63027 2143336 2166839 2182209 2188251 2183798 2167901 2140107 2101040 2052500 1996568 1934682 1867874 1797586
63015A797586p1833p1507o9528o5796o0338n3761m6792l9671l2354k5032j8063
63004A242911j1556n423K88N364R630J3059J5761J8005K0067K1967K3511K4584
62992A378168K5286K5739K5987K6067K5913K5292K4088K2500K0583J7795J3580
62981A630998Q265K747k775r017j6406k4227l1352l7231m1965m5804m8958n1464
62969A332811n2954n2881n1212m8638m5903m3304m0852l8454l5838l2809k9772
62958H60194k7461k5950k4543k2855k1325k0296j9365j8157j7120j6770j6637
62947F29715j5719j3866j2023j1160j1417j2166j2483j1684r877p972o858o599
62935D97891o629o504o161n692n198m809m544m257l902l670l646l541l050k314
$$ plain form
63015 1797586 1725753 1654246 1584718 1518922 1458584 1404823 1358031 1318360 1286006 1260974 1242911
63004 1242911 1231355 1225932 1226220 1231584 1241214 1254273 1270034 1288039 1308106 1330073 1353584 1378168
62992 1378168 1403454 1429193 1455180 1481247 1507160 1532452 1556540 1579040 1599623 1617418 1630998
62981 1630998 1639263 1642010 1639235 1630218 1613812 1589585 1558233 1521002 1479037 1433233 1384275 1332811
62969 1332811 1279857 1226976 1175764 1127126 1081223 1037919 997067 958613 922775 889966 860194
62958 860194 832733 806783 782240 759385 738060 717764 698399 680242 663122 646352 629715
62947 629715 613996 600130 588107 576947 565530 553364 540881 529197 519320 511348 504490 497891
62935 497891 491262 484758 478597 472905 467707 462898 458354 454097 450195 446525 442879 439338 436288 433974
62921D33974j789j748k026k128j602n15L80L01n90j316j204n25J35N42O58L84
62905D22931j67n56n64m23k91K9N41Q37P96Q80J248J286O08m7J66Q55R44K02o66
62886D28609j263j834k352k278j419l34L87P37R86J288J694K144K322J852P90
62871D31329l53j090j251r42n44n45j008j359j108n69l62m70l88m4J91L65R80
62854D22832J982K475J811N03l37j28Q77K012K690K703K321J977J746J386Q54
62839D45704N19O75J094J293J101Q52J033J677K165J852R04K14K85O73R00J330
62823D62271K494L903M440L804K806K184J937J889K093K374K242J675J340J692
62809D97144K363K890L459M383N295N578N346N396O253P676R135J0312J1119J1617
$$ plain form
62921 433974 432185 430437 428411 426283 424681 424166 424546 424847 424257 422941 421737 421212 421347 421889 422547 422931
62905 422931 422764 422208 421644 421221 420930 420959 421500 422337 423133 424013 425261 426547 427155 427108 427274 428129 429073 429275 428609
62886 428609 427346 425512 423160 420882 419463 419129 419516 420253 421239 422527 424221 426365 428687 430539 431329
62871 431329 430976 429886 428635 427693 427149 426604 425596 424237 423129 422560 422198 421728 421340 421296 421487 421852 422832
62854 422832 424814 427289 429100 429603 429266 429138 430015 432027 434717 437420 439741 441718 443464 444850 445704
62839 445704 446223 446898 447992 449285 450386 451238 452271 453948 456113 457965 458869 459083 459368 460041 460941 462271
62823 462271 464765 468668 473108 476912 479718 481902 483839 485728 487821 490195 492437 494112 495452 497144
62809 497144 499507 502397 505856 510239 515534 521112 526458 531854 538107 545783 554918 565230 576349 587966
62795E87966J2014J2581J3415J4426J5589J7105J9229K2026K5310K8878L2742
62784H01281L7038M1751M6639N1547N6612O2001O7648P3306P8681Q3251Q6294
62773A486049Q7469Q7150Q5732Q2828P7634P0023O0611M9778L7314K3245Q373
62762B156206o382k0654l4300m6771n7391o5988p2826p7992q1279q2641q2469
62751A527513q1278p9300p6434p2609o8128o3608n9435n5393n1005m6208m1454
62740H32661l7153l3337k9899k6889k4427k2421k0539j8379j5773j3071j0944
62729E79829r644q638p276n703m633m249l884k873j287L54J605K232K322K452
62715E40607L294M815O333P571R111J1421J4010J6109J7787J9823K2626K5875
$$ plain form
62795 587966 599980 612561 625976 640402 655991 673096 692325 714351 739661 768539 801281
62784 801281 838319 880070 926709 978256 1034868 1096869 1164517 1237823 1316504 1399755 1486049
62773 1486049 1573518 1660668 1746400 1829228 1906862 1976885 2037496 2087274 2124588 2147833 2156206
62762 2156206 2149824 2129170 2094870 2048099 1990708 1924720 1851894 1773902 1692623 1609982 1527513
62751 1527513 1446235 1366935 1290501 1217892 1149764 1086156 1026721 971328 920323 874115 832661
62740 832661 795508 762171 732272 705383 680956 658535 637996 619617 603844 590773 579829
62729 579829 570185 561547 554271 548568 543935 539686 535802 532929 531642 531996 533601 535833 538155 540607
62715 540607 543901 548716 555049 562620 571731 583152 597162 613271 631058 650881 673507 699382
62703F99382K9089L2101L4966L7898M1210M4942M8564N1405N3422N5225N7274
62692A185478N9292O0495O0139N7826N3597M7849M0982L3062K3911J3576K542
62681A638749q580j9370k9560l8797m6620n2743n7235o0334o2087o2314o1081
62670A140028n8967n6655n4220n1195m7358m3153l9180l5575l2130k8807k5812
62659F66976k3230k0929j8768j6765j5027j3634j2549j1568j0441r146q020p448
62647D99451p442p536p132n974m401l098k495k357k077j339l45N38J112J372J392
62632D59669J255R11J85q32j548j421p85n72j104j649j419n34L95J135J814K348
62616D57848K529K545K836L438L919M067M189M693N573O519P279P867Q567R781
$$ plain form
62703 699382 728471 760572 795538 833436 874646 919588 968152 1019557 1072979 1128204 1185478
62692 1185478 1244770 1305265 1365404 1423230 1476827 1524676 1565658 1598720 1622631 1636207 1638749
62681 1638749 1630169 1610799 1581239 1542442 1495822 1443079 1385844 1325510 1263423 1201109 1140028
62670 1140028 1081061 1024406 970186 918991 871633 828480 789300 753725 721595 692788 666976
62659 666976 643746 622817 604049 587284 572257 558623 546074 534506 524065 514919 506899 499451
62647 499451 492009 484473 477341 471367 466966 463868 461373 459016 456939 455600 455255 455793 456905 458277 459669
62632 459669 460924 461835 462020 461188 459640 458219 457434 456862 455758 454109 452690 452156 452551 453686 455500 457848
62616 457848 460377 462922 465758 469196 473115 477182 481371 486064 491637 498156 505435 513302 521869 531650
62602E31650J1664J3879J5905J7605J9356K1565K4289K7346L0598L3958L7179
62591G84994L9844M1624M2522M2765M2388M0984L7982L3204K7021J9965J2451
62580A165744M865k362r026j5303k1388k7011l1564l4705l6685l7988l8830l9009
62568H76738l8274l6762l4969l3241l1423k9178k6559k3947k1488j8997j6513
62557E65387j4481j3208j2408j1611j0724r886r039q003o846n819m976m149l208
62544D51029k151j017J9O38P25O72R50J454J611J165N21K17L10M27K82M2K38J287
62526D58419L063M987O655Q202R889J1612J3112J4582J6524J9006K1486K3522
62514F11059K5324K7376K9799L2306L4613L6558L7965L8634L8436L7190L4620
$$ plain form
62602 531650 543314 557193 573098 590703 610059 631624 655913 683259 713857 747815 784994
62591 784994 824838 866462 908984 951749 994137 1035121 1073103 1106307 1133328 1153293 1165744
62580 1165744 1170609 1168247 1159221 1143918 1122530 1095519 1063955 1029250 992565 954577 915747 876738
62568 876738 838464 801702 766733 733492 702069 672891 646332 622385 600897 581900 565387
62557 565387 550906 537698 525290 513679 502955 493069 484030 476027 469181 463362 458386 454237 451029
62544 451029 448878 447861 447880 448518 449243 449915 450865 452319 453930 455095 455616 455833 456143 456570 456852 456894 457132 458419
62526 458419 461482 466469 473124 481326 491215 502827 515939 530521 547045 566051 587537 611059
62514 611059 636383 663759 693558 725864 760477 797035 835000 873634 912070 949260 983880
62503I83880L0723K6134K1657J7318J2378O583R74l180n920q339j0678j1680j0255
62490A049595p068l646m66L140P515J2170J6773K1536K6358L0452L3427L5868
62478A225654L8282L9995L9796L7165L2240K5098J5963N945l351j1216j8405k6179
62466A400987l5056m4307n2350n7687n9937o0057n9425n8750n7880n6233n3166
62455H06139m8396m2609l7243l3123k9616k5653k1263j7369j4462j2339j0913
62444E13153j0205r564p956n387l172k355k595k927k887k446j642q12o20j257
62430D59328j988k063j645j319j226j245j605k503l374l373k527j682j294j019
62416D32465o09n30j236k322k907k640k023j756j979k197j858j017l82n43j226
$$ plain form
62503 983880 1014603 1040737 1062394 1079712 1092090 1098673 1099647 1096467 1090547 1082208 1071530 1059850 1049595
62490 1049595 1042527 1038881 1038415 1041555 1049070 1061240 1078013 1099549 1125907 1156359 1189786 1225654
62478 1225654 1263936 1303931 1343727 1380892 1413132 1438230 1454193 1460138 1456787 1445571 1427166 1400987
62466 1400987 1365931 1321624 1269274 1211587 1151650 1091593 1032168 973418 915538 859305 806139
62455 806139 757743 715134 677891 644768 615152 589499 568236 550867 536405 524066 513153
62444 513153 502948 493384 485428 480041 476869 474514 471919 468992 466105 463659 462017 461205 460585 459328
62430 459328 457340 455277 453632 452313 451087 449842 448237 445734 442360 438987 436460 434778 433484 432465
62416 432465 431856 431326 430090 427768 424861 422221 420198 418442 416463 414266 412408 411391 411009 410466 409240
62401D09240j537j001o5N63Q37J252J989K600K720K694L126L949M402L980L053
62386D37802K371K260K575L125L799M368M597M565M685N323O563Q176R673J0575
62372E10457J0936J1411J2483J3823J4838J5673J7010J9048K1350K3739K6606
62361F97374L0141L4012L8102M2848M8375N3918N8621O2343O5184O6792O6797
62350A264507O5363O2492N7282M8808L7668K5678J4158L330o706j5445k2725k9062
62338A505348l4822l9780m3829m7413n0720n3068n3717n2803n0909m8198m4698
62327I85391m1014l7931l5375l2566k9219k5957k3449k1692k0343j9225j8327
62316F80293j7616j7100j6739j6224j5205j3830j2638j1795j0922r883r072q564
$$ plain form
62401 409240 407703 406702 406637 407200 408037 409289 411278 413878 416598 419292 422418 426367 430769 434749 437802
62386 437802 440173 442433 445008 448133 451932 456300 460897 465462 470147 475470 482033 490209 499882 510457
62372 510457 521393 532804 545287 559110 573948 589621 606631 625679 647029 670768 697374
62361 697374 727515 761527 799629 842477 890852 944770 1003391 1065734 1130918 1197710 1264507
62350 1264507 1329870 1392362 1449644 1498452 1536120 1561798 1575956 1579286 1572580 1557135 1534410 1505348
62338 1505348 1470526 1430746 1386917 1339504 1288784 1235716 1181999 1129196 1078287 1030089 985391
62327 985391 944377 906446 871071 838505 809286 783329 759880 738188 717845 698620 680293
62316 680293 662677 645577 628838 612614 597409 583579 570941 559146 548224 538341 529269 520705
62304E20705p599n576l179j682j367j392j159r36j009j034o47m5M79J076J888
62289D98523K578K853L109L898M917N247M573L616L252L641M293M662M521M079
62275E53762L819M033M554N147N944P160Q541R611J0463J1737J3786J6363J9266
62262F74186K2758K7103L2137L7493M2894M8021N2558N6606O0561O4301O6982
62251A185600O7944O7299O5109O0586N2861M2315L0472J8648P298l427j3204k1862
62239A559639k9664l7008m3975n0241n5237n8504o0058o0310n9454n7228n3604
62228I94356m9255m4857m0247l5019k9624k4966k0997j6788j2264q728p051o248
62216F98312m701k282l12K71j32o62j047j560k393l346m041m400m890o015p382
$$ plain form
62304 520705 513106 507530 504351 502669 501302 499910 498751 497815 496806 495772 495125 495080 495559 496635 498523
62289 498523 501101 503954 507063 510961 515878 521125 525698 529314 532566 536207 540500 545162 549683 553762
62275 553762 557581 561614 566168 571315 577259 584419 592960 602571 613034 624771 638557 654920 674186
62262 674186 696944 724047 756184 793677 836571 884592 937150 993756 1054317 1118618 1185600
62251 1185600 1253544 1320843 1385952 1446538 1499399 1541714 1572186 1590834 1598132 1594705 1581501 1559639
62239 1559639 1529975 1492967 1448992 1398751 1343514 1285010 1224952 1164642 1105188 1047960 994356
62228 994356 945101 900244 859997 824978 795354 770388 749391 732603 720339 711611 704560 698312
62216 698312 693611 691329 691017 691288 691156 690494 689447 687887 685494 682148 678107 673707 668817 662802 655420
62201F55420p778o611m872m048m274m362l541k288j243j91J367L168M420M842
62187F30009M993N572O739Q102R146R679R939J0232J0443J0108R033P618O407
62174G38020N664N497O166P949J0911J4933J9807K5082L0151L4746L9131M3420
62162I81477M7057M9349N0205M9815M7868M3753L7441K9599K0805J1420K247n487
62150A365549j1357j6306k1572k7353l2955l7761m1551m4135m5324m5188m3958
62139I98089m1770l8838l5656l2601k9402k5509k1003j6716j3417j1109r215p157
62127G15696m738k183J29K163M237O424Q229R290J0129J1558J3455J4755J4826
62114H03970J4138J3374J2393J0574P762M424J126j698l634m459m437m183m147
$$ plain form
62201 655420 647642 641031 636159 632111 627837 623475 619934 617646 616403 616212 617579 620747 625167 630009
62187 630009 635002 640574 647313 655415 664561 674240 684179 694411 704854 714962 723995 731613 738020
62174 738020 743684 749181 755347 763296 774207 789140 808947 834029 864180 898926 938057 981477
62162 981477 1028534 1077883 1128088 1177903 1225771 1269524 1306965 1336564 1357369 1368789 1371036 1365549
62150 1365549 1354192 1337886 1316314 1288961 1256006 1218245 1176694 1132559 1087235 1042047 998089
62139 998089 956319 917481 881825 849224 819822 794313 773310 756594 743177 732068 722853 715696
62127 715696 710958 708775 708904 711067 715304 721728 729957 739247 749376 760934 774389 789144 803970
62114 803970 818108 831482 843875 854449 862211 866635 867761 866063 862429 857970 853533 849350 845203
62101H45203m381m776n301n931o394o122m652k164N51K810M599O203P617Q724
62087H35986R842J1369J2884J3414J2829J2225J2527J3438J4286J5276J7084J9608
62075A000768K1974K3671K4966K6180K7220K7814K7858K7478K7138K7534K8877
62064A291478L0425L1289L1535L1905L2436L2181L0339K6984K2475J6890J0403
62053A588340L611k933r100j4833j9888k4257k8363l2424l6132l9327m2486m5924
62041A296284m8908n0291m9844m8355m6601m4787m2926m1063l9010l6459l3491
62030H14549l0623k8083k5490k2476j9327j6761j5136j4139j3186j2010j0841
62019F06477j0025r603r379r292r445r652r425q632p759p115o229m568k559j148
$$ plain form
62101 845203 840822 836046 830745 824814 818420 812298 807646 805482 806033 808843 813442 819645 827262 835986
62087 835986 845828 857197 870081 883495 896324 908549 921076 934514 948800 964076 981160 1000768
62075 1000768 1022742 1046413 1071379 1097559 1124779 1152593 1180451 1207929 1235067 1262601 1291478
62064 1291478 1321903 1353192 1384727 1416632 1449068 1481249 1511588 1538572 1561047 1577937 1588340
62053 1588340 1591951 1589018 1579918 1565085 1545197 1520940 1492577 1460153 1424021 1384694 1342208 1296284
62041 1296284 1247376 1197085 1147241 1098886 1052285 1007498 964572 923509 884499 848040 814549
62030 814549 783926 755843 730353 707877 688550 671789 656653 642514 629328 617318 606477
62019 606477 596452 586849 577470 568178 558733 549081 539656 531024 523265 516150 509921 505353 502794 501646
62005E01646m56L37J746L434N023O640Q239R149Q919Q074P410O950O213N156M127
61990E82607L048J499m25j995k881l661m985o626p779q011p610p069o563n954
61976E23595n176m422l926l648l346k960k748k846k949k621j865j119p72q62j138
61961D83197j178o42L40J109J170Q27P36R70J076J014J413K668M294N581O486
61946E09061P496Q919J0651J2488J4289J5985J7687J9664K1967K4156K5678K6387
61934G14428K6540K6356K5820K4831K3384K1639J9860J8114J6009J3006R154N183
61922I44324J632j711n182q411j0651j1770j2265j2407j1871j0331p915m872j246
61909H47324K903P199J1113J4297J6578J7846J8053J7219J5350J2448Q609M112
$$ plain form
62005 501646 501190 501527 503273 506707 511730 518370 526609 535758 544677 552751 560161 567111 573324 578480 582607
61990 582607 585655 587154 586729 584734 581853 578192 573207 566581 558802 550791 543181 536112 529549 523595
61976 523595 518419 513997 510071 506423 503077 500117 497369 494523 491574 488953 487088 485969 485197 484335 483197
61961 483197 482019 481377 481717 482826 483996 484823 485559 486529 487605 488619 490032 492700 496994 502575 509061
61946 509061 516557 525476 536127 548615 562904 578889 596576 616240 638207 662363 688041 714428
61934 714428 740968 767324 793144 817975 841359 862998 882858 900972 916981 929987 939141 944324
61922 944324 945956 944245 939063 930652 920001 908231 895966 883559 871688 861357 853442 848570 847324
61909 847324 850227 857426 868539 882836 899414 917260 935313 952532 967882 980330 988939 993051
61897I93051o14n027q695j1639j4309j7001j9406k1026k1849k2254k2310k1713
61885H07208k0377j8693j7065j5649j4628j4297j4598j4905j4585j3565j2216
61874F36630j0911r846q987p992o452m449k554j085K73J823L260M170M893O310
61860F05083Q797J1795J4494J6600J8427K0548K3385K6865L0392L3398L5934L8454
61848H84172M0961M2762M3274M2698M1552L9741L6654L2229K7315K2591J7525
61837A271474J1080L430l751r011j2492j5132j6961j7063j5046j1700p965m006
61825A172857L23M649Q323J1165J3337J4580J4079J1215O173k88p442j4837k2051
61812A212083k8473l3561l7311m0205m2435m3448m2692m0656l8546l6852l4928
$$ plain form
61897 993051 992437 987410 978715 967076 952767 935766 916360 895334 873485 851231 828921 807208
61885 807208 786831 768138 751073 735424 720796 706499 691901 676996 662411 648846 636630
61874 636630 625719 615873 606886 598894 592442 587993 585439 584354 584627 586450 589710 593880 598773 605083
61860 605083 613880 625675 640169 656769 675196 695744 719129 745994 776386 809784 845718 884172
61848 884172 925133 967895 1011169 1053867 1095419 1135160 1171814 1204043 1231358 1253949 1271474
61837 1271474 1282554 1285984 1282233 1273222 1260730 1245598 1228637 1211574 1196528 1184828 1176863 1172857
61825 1172857 1173180 1177829 1186152 1197317 1210654 1225234 1239313 1250528 1256701 1256413 1248971 1234134 1212083
61812 1212083 1183610 1150049 1112738 1072533 1030098 986650 943958 903302 864756 827904 792976
61801G92976l2139k8810k5612k2659j9785j7272j5529j4356j3178j1880j0761
61790E80995r787q548p008n679m935m588m343m152l976l599k925k189j690j492
61776E16084j464j427j213q23n37o06q89r94p98m58RO98J375J557J239J057J466
61759E14276K082K204J687J008O60P71J239J868K353K386J800O52p68k016k706
61744E27496k797k522k104j670j420j542j853j793j072j21L01o2p44j052o76J71
61728E08540J077J880K764L843M723M687L463J650K54j06M43J306J905K031J864
61713E40324J690J571J322P92M7p42j483k185k900l611m138m225l883l506l449
61698E15624l552l389k925k590k679k991l153k999k484j645p24j30j4k17o95j654
$$ plain form
61801 792976 760837 732027 706415 683756 663971 646699 631170 616814 603636 591756 580995
61790 580995 571208 562660 555652 549973 545038 540450 536107 531955 527979 524380 521455 519266 517576 516084
61776 516084 514620 513193 511980 511157 510620 510014 509125 508131 507333 506875 506884 507582 508957 510514 511753 512810 514276
61759 514276 516358 518562 520249 521257 521917 522688 523927 525795 528148 530534 532334 532986 532218 530202 527496
61744 527496 524699 522177 520073 518403 516983 515441 513588 511795 510723 510602 510903 510841 510097 509045 508369 508540
61728 508540 509617 511497 514261 518104 522827 527514 530977 532627 532881 532775 533218 534524 536429 538460 540324
61713 540324 542014 543585 544907 545699 545746 545004 543521 541336 538436 534825 530687 526462 522579 519073 515624
61698 515624 512072 508683 505758 503168 500489 497498 494345 491346 488862 487217 486493 486363 486349 486132 485437 483783
61682D83783k954l761l321j972q89q45j485j943j833j472j285j259j052n62j36
61667D59014j93p40j469k157k760l121l005k443j748j116m81J73P07J103J475
61652D43239J658J286N61M13J375K702L173K651K178K568L468L953L589K736K064
61637D77614J947K164K095J342J48j015k064l226m352m823m296l255k565k595
61623D57119k962l041k662k303k570l411m010l688k691j813j386j179j185j857
61609D22361l263m666n352n498n721o011n824n057m314m054m050l919l753l811
61595C57068l930l726l285l127l435l687l339k554j965j869j980j952j778j616
61581C18825j487j398j494j825k025j608o29J42k7j058k135k531k207j646j264
$$ plain form
61682 483783 480829 477068 473747 471775 470886 470041 468556 466613 464780 463308 462023 460764 459712 459150 459014
61667 459014 458821 458081 456612 454455 451695 448574 445569 443126 441378 440262 439781 439954 440661 441764 443239
61652 443239 444897 446183 446744 447157 448532 451234 454407 457058 459236 461804 465272 469225 472814 475550 477614
61637 477614 479561 481725 483820 485162 485310 484295 482231 479005 474653 469830 465534 462279 459714 457119
61623 457119 454157 451116 448454 446151 443581 440170 436160 432472 429781 427968 426582 425403 424218 422361
61609 422361 419098 414432 409080 403582 397861 391850 386026 380969 376655 372601 368551 364632 360879 357068
61595 357068 353138 349412 346127 343000 339565 335878 332539 329985 328020 326151 324171 322219 320441 318825
61581 318825 317338 315940 314446 312621 310596 308988 308359 308501 308474 307416 305281 302750 300543 298897 297633
61566B97633j088r13n49J00R99J868K202J667N08m85n72K71J318J686J178M86
61550C06309M34R55J137M46m28m26M07J007Q15N25R44J820K343K353K356K561
61534C23558K606K238J683J243R47P16M54l2q21j525j633j265j102j399j612j275
61518C22781p55o78j005j190j047r22j038j120p71K1Q11J036N03k93n37m9M34
61501C16181J66o06j058r83r91j404j683j225k66M38N41L19K07M40J014J618J721
61484C14429J127L85L00J026J920K311K112J624J086O46N20Q43J380J560R52k16
61468C32005j065p51O21J891J915P45n20j006q45n69l41r6l2m09r55j050n15K44
61450C29267R18J625K344K528J775O06L4M38J281J968K454K843K873K323J662
$$ plain form
61566 297633 296545 295632 295083 295183 296182 298050 300252 301919 302427 301942 301370 301641 302959 304645 305823 306309
61550 306309 306743 307698 308835 309281 308853 308427 308834 309841 310656 311181 312125 313945 316288 318641 320997 323558
61534 323558 326164 328402 330085 331328 332275 332991 333445 333413 332592 331067 329434 328169 327067 325668 324056 322781
61518 322781 322026 321348 320343 319153 318106 317184 316146 315026 314255 314276 315087 316123 316626 316333 315796 315747 316181
61501 316181 316347 315741 314683 313700 312709 311305 309622 308397 308131 308569 309110 309429 309636 310076 311090 312708 314429
61484 314429 315556 315941 316241 317267 319187 321498 323610 325234 326320 326966 327486 328329 329709 331269 332221 332005
61468 332005 330940 330189 330810 332701 334616 335361 334841 333835 332990 332421 332080 331984 331952 331543 330588 329538 329023 329267
61450 329267 330185 331810 334154 336682 338457 339063 339097 339535 340816 342784 345238 348081 350954 353277 354939
61435C54939J736K725L860M324M082L518K720J593N05J46O75J529K174K657L159
61420C90342L526L614L703M054M293L826K760J877J651J751J621J093L24n27j310
61405D22598j872k223k535k865l075l209l576m257m759m514l639k856k604k532
61391C78082k002j017l42o17j472j859j341o01m38o42m05L89R74Q99O74J001J835
61374C73118K572K787K440J685Q72M52N67Q79J070J250J653K203K639K814K646
61359C99647K148J756K200L654N352O551P438Q529R618J0112J0147J0482J1285
61346D88919J1909J1951J1697J1287J0262Q414O445N179M623M261L886L590L203
61333E85626K362J068l10j547k723l818m584m882m992n338n993o502o275n221
$$ plain form
61435 354939 356675 359400 363260 367584 371666 375184 377904 379497 380002 380148 380823 382352 384526 387183 390342
61420 390342 393868 397482 401185 405239 409532 413358 416118 417995 419646 421397 423018 424111 424435 423908 422598
61405 422598 420726 418503 415968 413103 410028 406819 403243 398986 394227 389713 386074 383218 380614 378082
61391 378082 376080 375063 374721 374104 372632 370773 369432 368831 368393 367751 367346 367735 368709 369608 370282 371283 373118
61374 373118 375690 378477 380917 382602 383474 383926 384493 385372 386442 387692 389345 391548 394187 397001 399647
61359 399647 401795 403551 405751 409405 414757 421308 428746 437275 446893 457005 467152 477634 488919
61346 488919 500828 512779 524476 535763 546025 554439 560884 566063 570686 574947 578833 582423 585626
61333 585626 587988 589056 588746 587199 584476 580658 576074 571192 566200 560862 554869 548367 542092 536871
61319E36871l888k872k175j420n80q9j09j29M37J552K717L594M171M597N160O256
61303E54093P953R603J0289R656Q060N899L179j12l521o266p863q474q616q631
61289E65249q487q057p460o934o488n886n015m029l077k091j032r2N53J084J870
61274E10108L064M509N953P093P603P402O912O749P080P486P550P355P305P671
61260F03840Q489R768J1476J3321J4719J5210J4810J3825J2379J0372P955N686
61248G41850L959K503P85j181k876m104n299o751q012q422p976p294o874o695
61234F83613o500o192n888n754n773n661n099m110l003j937q61R4N79O17P22J058
61218F35905R86N7j010j150m87j03l13k35O41J457J236L34j67n5q1o34j105p55
$$ plain form
61319 536871 532983 530111 527936 526516 525936 525847 525738 525609 526046 527598 530315 533909 538080 542677 547837 554093
61303 554093 562046 571649 581938 591594 599654 605553 608732 608620 605099 598833 590970 582496 573880 565249
61289 565249 556762 548705 541245 534311 527823 521937 516922 512893 509816 507725 506693 506601 507154 508238 510108
61274 510108 513172 517681 523634 530727 538330 545732 552644 559393 566473 573959 581509 588864 596169 603840
61260 603840 612329 622097 633573 646894 661613 676823 691633 705458 717837 728209 736164 741850
61248 741850 745809 748312 749097 747916 745040 740936 735637 728886 720874 712452 704476 697182 690308 683613
61234 683613 677113 670921 665033 659279 653506 647845 642746 638636 635633 633696 632835 632929 633508 634125 634847 635905
61218 635905 636891 636948 635938 634788 634301 634198 633885 633650 634291 635748 636984 637318 637151 637096 637015 636381 635276 634521
61200F34521M64K119L916N836P946J0287J2839J5455J7911K0049K1749K2785K2851
61187G98728K1784J9680J6822J3661J0855R043Q367Q266P867O706N070L565K395
61174I32809J187l98k079l316m165n312p106r004j0341j1278j2453j3919j5026
61161H39599j5398j5434j5699j6175j6413j6087j5143j3647j1738r609p358n036
61149F81862k926j453o57J4J003J946K008P50j585m492p414r648j0568j0197r219
61134F29424q165o933n267l390j744k96J393L409N264O720Q339J0773J3650J5795
61120F68972J6729J7389J8946K1232K3013K3763K4350K5701K7414K8372K8283
61109I24164K7870K7631K7221K6212K4740K3090K1164J8821J6239J3501J0210
$$ plain form
61200 634521 634985 637104 641020 646856 654802 665089 677928 693383 711294 731343 753092 775877 798728
61187 798728 820512 840192 857014 870675 881530 890573 898940 907206 915073 921779 926849 930414 932809
61174 932809 933996 933598 931519 928203 924038 918726 911620 902616 892275 880997 868544 854625 839599
61161 839599 824201 808767 793068 776893 760480 744393 729250 715603 703865 694256 686898 681862
61149 681862 678936 677483 676826 676840 677843 679789 681797 682547 680962 676470 669056 659408 648840 638643 629424
61134 629424 621259 614326 609059 605669 603925 603629 605022 608431 613695 620415 628754 639527 653177 668972
61120 668972 685701 703090 722036 743268 766281 790044 814394 840095 867509 895881 924164
61109 924164 952034 979665 1006886 1033098 1057838 1080928 1102092 1120913 1137152 1150653 1160863
61098A160863O043J365l185p496j1735j5580j8495k0744k3209k5980k7945k8233
61086I85669k7417k6716k6544k6447k6043k5307k4105k2291k0230j8576j7417
61075G24576j6202j4609j2971j1631j0404q976p412n966m660l393k250j435j025
61062F23642q99p43n2J527L682N543O600P214Q027R112J0066J0730J1437J2548
61048G08434J4046J5613J6956J8074J9236K0618K2066K3375K4698K6322K8029
61037I37467K9329L0340L1786L3787L5456L6197L6679L7808L9384M0628M1549
61026A330410M2734M4154M5257M6032M6958M8050M9091N0783N4374O0074O6991
61015A884908P4819Q4308R5729J08323J21863J37765J58156J85028K20641K67311
$$ plain form
61098 1160863 1166906 1168271 1165086 1157590 1145855 1130275 1111780 1091036 1067827 1041847 1013902 985669
61086 985669 958252 931536 904992 878545 852502 827195 803090 780799 760569 741993 724576
61075 724576 708374 693765 680794 669163 658759 649783 642371 636405 631745 628352 626102 624667 623642
61062 623642 622743 622000 621948 623475 627157 632700 639300 646514 654541 663653 673719 684449 695886 708434
61048 708434 722480 738093 755049 773123 792359 812977 835043 858418 883116 909438 937467
61037 937467 966796 997136 1028922 1062709 1098165 1134362 1171041 1208849 1248233 1288861 1330410
61026 1330410 1373144 1417298 1462555 1508587 1555545 1603595 1652686 1703469 1757843 1817917 1884908
61015 1884908 1959727 2044035 2139764 2248087 2369950 2507715 2665871 2850899 3071540 3338851
61005C338851L26503M00041M92591O09664P50775R06442J064497J218102J366372
60996A0473838J510803J653158J787695J881403J863526J658194J252512P35958
60988B2817087K58292o3257j99825j88640q3421N4619J33551M2634k77583p72733
60978B1720724j295263j697036j908322j943292j854111j691481j494783j294101
60970H542335j108086r42780p97614o71917n65033m74210l96276l30315k76573
60961B979531k33744j99240j71181j48399j29286j12337r7338q4625p3586o3170
60951A666625n3265m4406l6633k9946k5238k3274k3005k2399k0828j9341j8677
60940A349613j8356j7904j7601j7639j7602j7200j6639j6000j4955j3400j1612
$$ plain form
61005 3338851 3665354 4065395 4557986 5167650 5918425 6824867 7889364 9107466 10473838
60996 10473838 11984641 13637799 15425494 17306897 19170423 20828617 22081129 22817087
60988 22817087 23075379 23012122 22812297 22623657 22540236 22594855 22728406 22771040 22493457 21720724
60978 21720724 20425461 18728425 16820103 14876811 13022700 11331219 9836436 8542335
60970 8542335 7434249 6491469 5693855 5021938 4456905 3982695 3586419 3256104 2979531
60961 2979531 2745787 2546547 2375366 2226967 2097681 1985344 1888006 1803381 1729795 1666625
60951 1666625 1613360 1568954 1532321 1502375 1477137 1453863 1430858 1408459 1387631 1368290 1349613
60940 1349613 1331257 1313353 1295752 1278113 1260511 1243311 1226672 1210672 1195717 1182317 1170705
60929A170705r623p171m495k392j141j0J835M435P308J0012J2191J3614J4440
60916A209708J5062J5545J5605J5295J5123J5307J5364J4669J3060J0743Q012
60905A363493N173K431l26l305o379r147j1486j3691j5993j8298k0264k1472k1728
60892A229008k1572k2122k3804k5608k6272k5914k5609k5633k5210k4009k2706
60881I60549k1852k1164k0366j9737j9380j8800j7710j6526j5555j4447j2958
60870G62054j1585j0773j0117r034p711o785o439o371o374o378o229n840n353
60857F63065m913m541m461n009o011o786p074p300p604p354o187m861m369m723
60843E81872n298n880o573p112p116o818o721o770o548o109n915n950n714n040
$$ plain form
60929 1170705 1161082 1153911 1149416 1147024 1145883 1145873 1147708 1152143 1159451 1169463 1181654 1195268 1209708
60916 1209708 1224770 1240315 1255920 1271215 1286338 1301645 1317009 1331678 1344738 1355481 1363493
60905 1363493 1368666 1371097 1370771 1367466 1361087 1351940 1340454 1326763 1310770 1292472 1272208 1250736 1229008
60892 1229008 1207436 1185314 1161510 1135902 1109630 1083716 1058107 1032474 1007264 983255 960549
60881 960549 938697 917533 897167 877430 858050 839250 821540 805014 789459 775012 762054
60870 762054 750469 739696 729579 720545 712834 706049 699610 693239 686865 680487 674258 668418 663065
60857 663065 658152 653611 649150 644141 638130 631344 624270 616970 609366 602012 595825 590964 586595 581872
60843 581872 576574 570694 564121 557009 549893 543075 536354 529584 523036 516927 511012 505062 499348 494308
60829D94308m292l664k888j860j011p85j008r80j78J161K195K296J778J463J641
60814D88176J853J816J869K221K397J981J361J110J080P47J43k14j15K08M74M99
60798E05606J50l41m64k45m88j612k784l000k501k246k399k387k217k513l294
60783D79265l792l684l536l857m499n192n842o140n679m668l850l453l058k618
60769D19397k721l421l699k680q01P52J328J166R25J211K110K938K922K274K030
60754D23731K535K945K543J860J750K110K262K191K516L424M364M791M643M084
60740D65749L195J976L93j487l301m504m966n128n371n547n503n559n950o205
60726D17792n715m777m282m476m658m212l349k633k294k266k455k631k405j694
$$ plain form
60829 494308 490016 486352 483464 481604 480593 479808 478800 477820 477642 478803 480998 483294 485072 486535 488176
60814 488176 490029 491845 493714 495935 498332 500313 501674 502784 503864 504611 504754 504540 504425 504633 505107 505606
60798 505606 505756 505415 504951 504706 504218 502606 499822 496822 494321 492075 489676 487289 485072 482559 479265
60783 479265 475473 471789 468253 464396 459897 454705 448863 442723 437044 432376 428526 425073 422015 419397
60769 419397 416676 413255 409556 406876 406075 406827 408155 409321 410246 411457 413567 416505 419427 421701 423731
60754 423731 426266 429211 431754 433614 435364 437474 439736 441927 444443 447867 452231 457022 461665 465749
60740 465749 468944 470920 471313 469826 466525 462021 457055 451927 446556 441009 435506 429947 423997 417792
60726 417792 412077 407300 403018 398542 393884 389672 386323 383690 381396 379130 376675 374044 371639 369945
60712C69945j018r46j366j650j479j130r03o70k97j00m49j038j114n39l7j15l18
60695C56776n3L29P4n83n32N84J732J886J397J313J953K790L449L981M318M158
60679C83572L631L458M093N078N571N343M884M720M864M962M713M050L144K290
60665D44373J682J200N09m53j312j770k068k586l132l160k743k627l029l088k064
60650D19732o10m7o15j298j281p91m02k69l41p27j463k306l047l715m296m602
60634C93922m567m365m084l607k983k412j854j080k52J04j00l16k29j94n15q45
60618C66623q01n31k31L18J139J555J045J46k49j30n3pM68J174J355R42P19R71
60600C74453R97L68j85K14J294K056K093J831J716J762J887K107K353K398K112
$$ plain form
60712 369945 368927 367981 366615 364965 363486 362356 361453 360783 360486 360386 359937 358899 357785 357246 357209 357094 356776
60695 356776 356723 357052 357126 356543 356011 356595 358327 360213 361610 362923 364876 367666 371115 375096 379414 383572
60679 383572 387203 390661 394754 399832 405403 410746 415630 420350 425214 430176 434889 438939 442083 444373
60665 444373 446055 447255 447764 447311 445999 444229 442161 439575 436443 433283 430540 427913 424884 421796 419732
60650 419732 419122 419075 418460 417162 415881 415090 414688 414419 414078 413351 411888 409582 406535 402820 398524 393922
60634 393922 389355 384990 380906 377299 374316 371904 370050 368970 368718 368822 368722 368406 368177 367983 367468 366623
60618 366623 365822 365291 365060 365378 366517 368072 369117 369263 369014 368884 368831 368824 369292 370466 371821 372763 373482 374453
60600 374453 375450 375818 375633 375847 377141 379197 381290 383121 384837 386599 388486 390593 392946 395344 397456
60585C97456J541P71j09q64j175r16k89M06J031J615K198K719L135L575M262N242
60569D20598O262P010P537Q163R054R970J0524J0593J0331R848Q983P424N088
60556E31385K326k71k317l779m722n054m702l921l115k318j126P00K776M447N497
60541E15806O320P384Q782J0296J1697J2823J3472J3462J2756J1484R840Q032
60529F42154O234M409K225n83l673o125p244p162o506n681m778m040l872m223
60515F01135m409l875k888k139j754j117K22J876L083L651M159N250P071R437
60501F19702J2260J5552J9215K3056K7025L1127L5165L8827M2035M4853M6954
60490I55771M7467M5675M1546L5483K7769J8594Q363k391j3213k3590l2749m0009
$$ plain form
60585 397456 398997 399768 399659 398795 397620 396704 396415 396821 397852 399467 401665 404384 407519 411094 415356 420598
60569 420598 426860 433870 441407 449570 458624 468594 479118 489711 500042 509890 518873 526297 531385
60556 531385 533711 533440 531123 527344 522622 517568 512866 508945 505830 503512 502386 503086 505862 510309 515806
60541 515806 522126 529510 538292 548588 560285 573108 586580 600042 612798 624282 634122 642154
60529 642154 648388 652797 655022 654439 650766 644641 637397 630235 623729 618048 613270 609230 605358 601135
60515 601135 596726 592851 589963 587824 586070 584953 585175 587051 590134 593785 597944 603194 610265 619702
60501 619702 631962 647514 666729 689785 716810 747937 783102 821929 863964 908817 955771
60490 955771 1003238 1048913 1090459 1125942 1153711 1172305 1180668 1178277 1165064 1141474 1108725 1068716
60478A068716m5243m8597m9923m8980m6146m2435l8659l4949l1198k7545k4227
60467F30814k1303j8756j6654j5019j3757j2822j2258j1923j1414j0441r115p791
60455D69561o696n813n005m193l480l050k893k760k589k645l029l282k965k371
60441D18790k094k035j559n52L93Q60R35N83l95j535j798r54j24k67r61j314j350
60424D06623j501j442n98N46Q70L70K39J068J979J993J302O77M07M25Q08J434
60408D15200J618Q86q7k07N54J128R50O52Q90J228R40L47M38J381K292K549K459
60391D33218K369K051J488J443K380L471L635L117K980L280L063K159J577J848
60377D68079K136J739J280J589K263K368J935J749K021K258K169J890J439Q19
$$ plain form
60478 1068716 1023473 974876 924953 875973 829827 787392 748733 713784 682586 655041 630814
60467 630814 609511 590755 574101 559082 545325 532503 520245 508322 496908 486467 477352 469561
60455 469561 462865 457052 452047 447854 444374 441324 438431 435671 433082 430437 427408 424126 421161 418790
60441 418790 416696 414661 413102 412550 412943 413803 414738 415321 414926 413391 411593 410639 410515 410248 409287 407973 406623
60424 406623 405122 403680 403082 403628 404498 404868 405107 406175 408154 410147 411449 412126 412533 412958 413766 415200
60408 415200 416818 417704 417617 417410 417964 419092 420042 420694 421584 422812 423752 424099 424537 425918 428210 430759 433218
60391 433218 435587 437638 439126 440569 442949 446420 450055 453172 456152 459432 462495 464654 466231 468079
60377 468079 470215 471954 473234 474823 477086 479454 481389 483138 485159 487417 489586 491476 492915 493734
60363D93734N09J022K020K648K688K716L064L453L702M068M679N285N882O930
60349E42400Q591J0219J0967J0643R659Q449P219N965M473K451p3k614m617n938
60335F07794o835p632q382q772q360p085n513m450m208m405m416l943l232k819
60321E27742k972l287l037k072j049n67l65J81J158K150L076M341O163Q268J0373
60306E50103J2530J4876J7372J9892K2234K3967K4585K3919K2094J9017J4301
60295G64890P892N26o663j2811j7522k0646k2143k2145k0967j9007j6642j4162
60283F00600j1820r832q255o931n708m788m513m818n160n139m839m377l617k656
60269E18147k170k682l749m397m249l734l286k902k476k046j605j029l49J60K38
$$ plain form
60363 493734 494243 495265 497285 499933 502621 505337 508401 511854 515556 519624 524303 529588 535470 542400
60349 542400 550991 561210 572177 582820 592479 600928 608147 614112 618585 621036 620963 618349 613732 607794
60335 607794 600959 593327 584945 576173 567813 560728 555215 550765 546557 542152 537736 533793 530561 527742
60321 527742 524770 521483 518446 516374 515325 514758 514393 514574 515732 517882 520958 525299 531462 539730 550103
60306 550103 562633 577509 594881 614773 637007 660974 685559 709478 731572 750589 764890
60295 764890 772782 773308 766645 753834 736312 715666 693523 671378 650411 631404 614762 600600
60283 600600 588780 578948 570693 563762 558054 553266 548753 543935 538775 533636 528797 524420 520803 518147
60269 518147 515977 513295 509546 505149 500900 497166 493880 490978 488502 486456 484851 483822 483473 483633 483871
60254D83871j42q00j408j651j531j365j342j319j220j261j441j274m57N48J087
60239D70295J176J208J178Q08K65P2M54J246K307L366L855L489K864K722K871
60224D98176K670K330K649L588M147L879L516L781M466N025N381N724O196O952
60210E58480P946Q510P942O675O005O388O866O602N995N799N962N975N693N103
60196F49941L938K255Q68N34J015J464J410R04J55n33r00j157j817k812l462l655
60180F48148m174n299n984n329m065l493l661l696l460l528l791l479k579k010
60166E93600k088k030j358p02o85q94o88k33mK40J036K075K380J709J015J238
60150E94611K093K506K036J361J359K124L132L992M684N244N716O392P587Q991
$$ plain form
60254 483871 483729 482929 481521 479870 478339 476974 475632 474313 473093 471832 470391 469117 468660 469208 470295
60239 470295 471471 472679 473857 474665 474930 475002 475456 476702 479009 482375 486230 489719 492583 495305 498176
60224 498176 500846 503176 505825 509413 513560 517439 520955 524736 529202 534227 539608 545332 551528 558480
60210 558480 566426 574936 582878 589553 595558 601946 608812 615414 621409 627208 633170 639145 644838 649941
60196 649941 653879 656134 657002 657536 658551 660015 661425 662329 662484 661951 661051 659894 658077 655265 651803 648148
60180 648148 643974 638675 632691 627362 623297 619804 616143 612447 608987 605459 601668 598189 595610 593600
60166 593600 591512 589482 588124 587422 586737 585843 585155 584922 584918 585158 586194 588269 590649 592358 593373 594611
60150 594611 596704 599210 601246 602607 603966 606090 609222 613214 617898 623142 628858 635250 642837 651828
60136F51828R771R607R207R420J0170J0679J0499R808Q821P425N513L289J126
60123G57163p17k145l158l754l807l193k074r58k85q3j25k37l38l26k35l52r83
60106G34393k126l440m449m761m328l581l029k685k128j288p22q64j365j492r19
60091F97216K77K004M000N503N797N158M778N427O532O861N980M678L958L845
60077G62014L540K558J217k06k149m987p927r650j0088j0549j1819j3044j3147
60064F85763j2451j2017j1922j1344j0127r137q861q640p767o632o135o276o025
60051E68429m631k602j114o28m04N66K388M225N345N811O157O653P042O939O317
60036F10493N694N669O163O247N046K733L21j445k566l296l746m173n041o484
$$ plain form
60136 651828 661599 671206 680413 689833 700003 710682 721181 730989 739810 747235 752748 756037 757163
60123 757163 756446 754301 751143 747389 743582 740389 738315 737357 737072 736989 736864 736627 736289 735963 735728 735376 734393
60106 734393 732267 728827 724378 719617 715289 711708 708679 705994 703866 702578 701856 700992 699627 698135 697216
60091 697216 697493 699497 703497 709000 714797 719955 724733 730160 736692 743553 749533 754211 758169 762014
60077 762014 765554 768112 769329 769123 766974 761987 754060 744410 734322 723773 711954 698910 685763
60064 685763 673312 661295 649373 638029 627902 618765 609904 601264 593497 586865 580730 574454 568429
60051 568429 563798 561196 560082 559454 559050 559616 562004 566229 571574 577385 583542 590195 597237 604176 610493
60036 610493 616187 621856 628019 634266 639312 642045 642366 640921 638355 635059 631313 627140 622099 615615
60022F15615q030r032r202q623p666o919o715o676o155n186m428m156l968l662
60008E25197l599l926m137l804l122k377j544p89n84q98r89m55K30O67J165J784
59992E02819J812J055P14J845L661M616M589M680N263N593N216M484L620K384
59978E52351Q69m06j292k130k991l617m083m638m882m077k410j010n17m56j53
59963E20558N40J621L104M523N113M839M548M777N064M717L643K089K38j595k890
59948E60889l436l513l351k896k223j597r88j75N36L98o64j747k134k114k268
59933E34717k559k580k207j464k27J413K839L461L416L342L738M654N730O285
59919E60558N815M681L929M177N027N841O576P403Q028P998P394O652N790M379
$$ plain form
60022 615615 607585 598553 589351 580728 573062 566143 559428 552752 546597 541411 536983 532827 528859 525197
60008 525197 521598 517672 513535 509731 506609 504232 502688 501899 501315 500417 499428 498973 499203 499870 501035 502819
59992 502819 504631 505686 506400 508245 511906 516522 521111 525791 531054 536647 541863 546347 549967 552351
59978 552351 553220 552814 551522 549392 546401 542784 538701 534063 529181 525104 522694 521684 521167 520711 520558
59963 520558 521098 522719 525823 530346 535459 540298 544846 549623 554687 559404 563047 565136 565374 563779 560889
59948 560889 557453 553940 550589 547693 545470 543873 542885 542710 543246 543644 542980 541233 539099 536985 534717
59933 534717 532158 529578 527371 525907 525680 527093 529932 533393 536809 540151 543889 548543 554273 560558
59919 560558 566373 571054 574983 579160 584187 590028 596604 604007 612035 620033 627427 634079 639869 644248
59905F44248K361M04p70j107j078j023q86o52o73j258k061k358j968j392q64N4
59889F30977J541K787L030K826L334M570N383N229M928N396O455P327P664P637
59875F99084P470P237O843O001M549K766J020p67k757m509n424n781o365p065
59861G02302p002o175n747o197o436n537m220l603l410k602j147J19R94K063L476
59846F56878M732N690O737P768P924O683M511K192J41j299j601o19R72K291K971
59831G05971K996K108P6k511m297m424l541l186m207o073p650q305q104p347o387
59816F45119n665n414n295m674l405k117j597k036k935l609l825l984m513n125
59802E90925n021m037l073k957l400l617l516l467l291k544j644j525k160k434
$$ plain form
59905 644248 646609 647013 646243 645136 644058 643035 642149 641497 640824 639566 637505 635147 633179 631787 630923 630977
59889 630977 632518 635305 638335 641161 644495 649065 654448 659677 664605 670001 676456 683783 691447 699084
59875 699084 706554 713791 720634 726635 731184 733950 734970 734203 731446 726937 721513 715732 709367 702302
59861 702302 695300 689125 683378 677181 670745 665208 660988 657385 653975 651373 650226 650345 651339 653402 656878
59846 656878 661610 667300 674037 681805 689729 696412 700923 703115 703256 701957 700356 699737 700709 703000 705971
59831 705971 708967 711075 711151 708640 704343 699919 696378 693192 688985 682912 675262 666957 658853 651506 645119
59816 645119 639454 634040 628745 624071 620666 618549 616952 614916 611981 608372 604547 600563 596050 590925
59802 590925 585904 581867 578794 575837 572437 568820 565304 561837 558546 556002 554358 552833 550673 548239
59788E48239j817j061q62q46m82q7j72m99n41k98j0M49J163J602J239M43P7L98
59770E46935R40J292J438J478J513J742K207K575K489K144K073K497L107L512
59756E75942L692L978M658N533O044O046O223P197Q478R004Q690Q547R054R404
59742F72490Q792P546O336N051L305J457K81n2k2j9k31q79j955k912l200k933
59726F93055k593k343k129k040k129k148k039k277l147m035m073l271k352j738
59712F56741j359j174j184j038l43O30J185J080P06M32L22M65R56J525J672J321
59696F61937R68J049J504J992K295K376K253J929J454J044R57J008N42o79j765
59681F78864j629n84p8o39j174q07l29j007k771m506n520n787n328m424l968m552
$$ plain form
59788 548239 546422 545361 544499 543653 543171 543084 542912 542413 541872 541574 541564 542013 543176 544778 546017 546460 546537 546935
59770 546935 547875 549167 550605 552083 553596 555338 557545 560120 562609 564753 566826 569323 572430 575942
59756 575942 579634 583612 588270 593803 599847 605893 612116 619313 627791 636795 645485 654032 663086 672490
59742 672490 681282 688828 695164 700215 703520 704977 705258 705206 705184 705165 704934 704055 702100 699188 695988 693055
59726 693055 690462 688119 685990 683950 681821 679673 677634 675357 672210 668175 664102 660831 658479 656741
59712 656741 655382 654208 653024 651986 651643 652273 653458 654538 655244 655676 655998 656463 657419 658944 660616 661937
59696 661937 662905 663954 665458 667450 669745 672121 674374 676303 677757 678801 679758 680766 681308 680629 678864
59681 678864 677235 676651 676573 675934 674760 673953 673624 672617 669846 665340 659820 654033 648705 644281 640313 635761
59665F35761n416n317m173k997k409k188k072k011j695q09K63P62O37N12O90R82
59649F10520J386K042K565K361J593R07K36j052k745l671l380k890l207l982m227
59634E96456l676k768j816q27O4N67N53J20o19j604k707l569l683k909k012k074
59618E69496l129l917l561k776k649k868k374j219l97NR11K357L054K462J867
59603E57262K547L917M495L850K695J622P61K72K14J41m66j390j839j398l87N97
59587E72893J146J183R03N46J43m54j238k063k951l959m735m722l947l110k726
59572E46909k701k824l048l083k412j164k79l97j040j385j302j126r05m72N3M47
59556E25271P73J110J225J015R25J352K022K500L035M088N277N726N468N658P023
$$ plain form
59665 635761 630345 625028 620855 617858 615449 613261 611189 609178 607483 606674 606937 607699 608336 608848 609538 610520
59649 610520 611906 613948 616513 618874 620467 621374 621610 620558 617813 614142 610762 607872 604665 600683 596456
59634 596456 592780 590012 588196 587369 587433 588000 588553 588673 588054 586450 583743 580174 576491 573582 571570 569496
59618 569496 566367 562450 558889 556113 553464 550596 548222 547003 546606 546611 547522 549879 552933 555395 557262
59603 557262 559809 563726 568221 572071 574766 576388 577149 577421 577635 577776 577310 575920 574081 572683 572296 572893
59587 572893 574039 575222 576125 576671 576814 576360 575122 573059 570108 566149 561414 556692 552745 549635 546909
59572 546909 544208 541384 538336 535253 532841 531677 531398 531001 529961 528576 527274 526148 525243 524771 524824 525271
59556 525271 526044 527154 528379 529394 530319 531671 533693 536193 539228 543316 548593 554319 559787 565445 572468
59541E72468Q911J0215J0739J1105J1799J2913J4475J6237J7064J5352J0559M120
59529G15957j491m577n020l736j779O9J439K397L153L711L930L855L620K978J436
59514G25942j042l843o431q743j0674j1738j1728j1232j0968j0924j0644j0004
59502F17971r128p898o218m553l544l221l095k867k490j841r21k00j7J18Q64J934
59486E74894K461K321K155K205K164K270L245M906N886N399M385M312N520P245
59472F29368Q558Q692P147M318J583J07k80n64j206j823j863j082L96K097L454
59457F58902M392N507P295R454J1272J2434J3094J3396J3311J2814J1953J0773
59445G84597R393P951O299L913L73m064q546j2141j4299j5031j4818j4196j3312
$$ plain form
59541 572468 581379 591594 602333 613438 625237 638150 652625 668862 685926 701278 711837 715957
59529 715957 714466 709889 704869 701133 699354 699423 700862 703259 706412 710123 714053 717908 721528 724506 725942
59514 725942 724900 721057 714626 705883 695209 683471 671743 660511 649543 638619 627975 617971
59502 617971 608843 600945 594727 590174 586630 583409 580314 577447 574957 573116 572195 571995 571978 572096 572960 574894
59486 574894 577355 579676 581831 584036 586200 588470 591715 596621 602507 607906 612291 616603 622123 629368
59472 629368 637926 646618 653765 658083 659666 659773 659493 658929 657723 655900 654037 652955 653351 655448 658902
59457 658902 663294 668801 676096 685550 696822 709256 722350 735746 749057 761871 773824 784597
59445 784597 793990 801941 808240 812153 812526 808462 799916 787775 773476 758445 743627 729431 716119
59432G16119j2026j0392q779p458o296n039l702k506j441l3K310N609R049J1829
59418F87244J4163J6922K0154K2710K3656K3388K2834K2369K2111K2253K1890
59407I19694J8522J0471l60r784j5305j7433j7273j4891j0575n742j520K132M762
59394H62698M295r08r504j7996k3729k6213k6173k4492k1975j9069j5803j2369
59382F68762r508p754o711n634m344l026j631j54R05J141J051J504K625L753M348
59367F45327M373M022L616L607M120M669M771M700N173O430Q015R315J0039J0325
59353G28502J0663J1495J2732J3957J5191J6871J8835K0058J9900J9026J8441
59342I05671J8150J7433J6066J4465J2837J0856Q111M430r5m922r120j2064j3979
$$ plain form
59432 716119 704093 693701 684922 677464 671168 666129 662427 659921 658480 658447 660757 666366 675415 687244
59418 687244 701407 718329 738483 761193 784849 808237 831071 853440 875551 897804 919694
59407 919694 938216 948687 948327 938543 923238 905805 888532 873641 863066 857324 855804 857936 862698
59394 862698 866993 866085 856581 838585 814856 788643 762470 737978 716003 696934 681131 668762
59382 668762 659254 651500 644789 639155 634811 631785 630154 630000 630905 632046 633097 634601 637226 640979 645327
59367 645327 649700 653722 657338 660945 665065 669734 674505 679205 684378 690808 698823 708138 718177 728502
59353 728502 739165 750660 763392 777349 792540 809411 828246 848304 868204 887230 905671
59342 905671 923821 941254 957320 971785 984622 995478 1003589 1008019 1007924 1003002 993882 981818 967839
59329I67839j5494j6877j8016j8812j9179j8984j8351j7707j7114j5974j3804
59318G77527j1024q520o690n372m396l712l128k342j258r0P45R34P92J334L176
59303G37976N476O755O886P228Q531R895J0357J0291J0166R018N499j19o133j1266
59289H10560j5211j7715j8393j7498j5866j3941j1588q865o313m335k820j413
59277F76602J43J931L755N304O633Q198J0138J2001J3429J4543J5264J4970J3423
59264G96334J1320R286O977L925N88k288m707o925q563r224r461j0030j0622j0451
59250G56159r640q889q084o576m559k978k043j139j29M63O83J324K644L975M949
59235G26160N996P284Q076P671O307M713L318K189J234J71j287l090m954o725
$$ plain form
59329 967839 952345 935468 917452 898640 879461 860477 842126 824419 807305 791331 777527
59318 777527 766503 757983 751293 745921 741525 737813 734685 732343 731085 730995 731740 732674 733466 734800 737976
59303 737976 743452 750207 757093 764321 772852 782747 793104 803395 813561 822579 828078 827959 821826 810560
59289 810560 795349 777634 759241 741743 725877 711936 700348 691483 685170 680835 678015 676602
59277 676602 676745 678676 682431 687735 694368 702566 712704 724705 738134 752677 767941 782911 796334
59264 796334 807654 816940 823917 827842 828430 826142 821435 814510 805947 796723 787262 777232 766610 756159
59250 756159 746519 737630 729546 722970 718411 715433 713390 712251 712122 712585 713268 714592 717236 721211 726160
59235 726160 732156 739440 747516 755187 761494 766207 769525 771714 772948 773119 771832 768742 763788 757063
59221G57063q190q793q228p124o434o233n861n105m377l815l143k483k338k634
59207F82305k635k103j694j887k268k270k002j891j977j971j764j572j718k259
59193F54294k670k164o08J070J863J742J387J178J075J131J360J406J062Q23J264
59178F64213K074K585K919L685M848N776O303O707O903O671O573P429Q935R979
59164G45600J0360J0932J1850J2035J0772Q783P018N370L156K07l031n892p710
59151H09450q305q481r364j0966j2112j1990j1111j0456j0390j0653j0799j0404
59139F84419r391q280p617p188o420n350m456l689k688j785j604j745j062N61
59125F23705J990K625L123L967M707N133N902P321Q619R266R919J1230J2646J3314
$$ plain form
59221 757063 748873 740080 731852 724728 718294 712061 706200 701095 696718 692903 689760 687277 684939 682305
59207 682305 679670 677567 675873 673986 671718 669448 667446 665555 663578 661607 659843 658271 656553 654294
59193 654294 651624 649460 648852 649922 651785 653527 654914 656092 657167 658298 659658 661064 662126 662949 664213
59178 664213 666287 668872 671791 675476 680324 686100 692403 699110 706013 712684 719257 726686 735621 745600
59164 745600 755960 766892 778742 790777 801549 810332 817350 822720 825876 826083 823052 817160 809450
59151 809450 801145 792664 783300 772334 760222 748232 737121 726665 716275 705622 694823 684419
59139 684419 675028 666748 659131 651943 645523 640173 635717 632028 629340 627555 625951 624206 623144 623705
59125 623705 625695 628320 631443 635410 640117 645250 651152 658473 667092 676358 686277 697507 710153 723467
59111G23467J3389J3536J3824J3910J3753J3391J2556J1231J0032R379Q781P623
59099H64872O112M816L753K613J441M46m44j317j934k220k614l360l937l796l327
59084H61104l392m137m989n660o599q292j0507j2314j2910j2408j1693j1309j0795
59071G46099r589q180p554p644p314o000m433l500l250l310l464l451k955k195
59057F73260j866k192k697l062l496m055m374m341m226l994l370k700k706l152
59043F27029k922j794q78q49r33k94P61J654K496L426M041M327N103O646P964
59028F55777Q420Q996J0863J3538J5734J7234J8722K0340K1619K2401K2698K2050
59016H58392K0028J7041J3772J0171N931J454k529n871q666j0481j0883j0281
$$ plain form
59111 723467 736856 750392 764216 778126 791879 805270 817826 829057 839089 848468 857249 864872
59099 864872 870984 875800 879553 882166 883607 884053 883609 882292 880358 878138 875524 872164 868227 864431 861104
59084 861104 857712 853575 848586 842926 836327 828035 817528 805214 792304 779896 768203 756894 746099
59071 746099 736510 728330 720776 713132 705818 699818 695385 691885 688635 685325 681861 678410 675455 673260
59057 673260 671394 669202 666505 663443 659947 655892 651518 647177 642951 638957 635587 632887 630181 627029
59043 627029 624107 622313 621435 620586 619653 619359 620120 621774 624270 627696 631737 636064 641167 647813 655777
59028 655777 664197 673193 684056 697594 713328 730562 749284 769624 791243 813644 836342 858392
59016 858392 878420 895461 909233 919404 925335 926789 924260 918389 909723 899242 888359 878078
59004H78078r273p624m908j773O24K199L923O160Q051Q606P714N986M166K748
58990I04677J612J86j786l838n473o772p943q798r232r659j0316j0668j0177r117
58976H12696p950o475m426k302p74L29J620L169M754O558Q707J0529J1232J1030
58962H48697J0733J0588J0347J0010R543Q282N681K396m07k623n084q079j0998
58949H89086j3419j5410j6768j6945j5941j4492j3196j2029j0834r633q385p031
58937G35003n746m729l847k930k194j798j304l30N99N75m13j489k135k614l232
58922G03416l832m185m308m352m444m604m505l661k151p70j4O09J687K908L691
58907F75485M307N445O922P874Q102Q347R146J0254J1315J2365J3461J4366J4869
$$ plain form
59004 878078 868805 861181 856273 854500 855124 857323 861246 867406 875457 884063 891777 897763 901929 904677
58990 904677 906289 906475 904689 900851 895378 888606 880663 871865 862633 852974 842658 831990 821813 812696
58976 812696 804746 798271 793845 791543 790769 791098 792718 795887 800641 807199 815906 826435 837667 848697
58962 848697 859430 870018 880365 890375 899918 908200 913881 916277 915870 913247 908163 900084 889086
58949 889086 875667 860257 843489 826544 810603 796111 782915 770886 760052 750419 742034 735003
58937 735003 729257 724528 720681 717751 715557 713759 712455 712125 712724 713299 712886 711397 709262 706648 703416
58922 703416 699584 695399 691091 686739 682295 677691 673186 669525 667374 666604 666590 667199 668886 671794 675485
58907 675485 679792 685237 692159 700033 708135 716482 725628 735882 747197 759562 773023 787389 802258
58894H02258J5044J5038J4916J4859J5321J6807J9382K2369K4696K5893K6525
58883A013108K7213K7450K6137K3127J9241J4854R644L955r81m717q270j2390
58871A138371j6303j8927k0264k0708k0113j8497j6701j5372j4124j2662j1630
58860I53070j1478j1509j1195j1301j2472j3842j4335j4292j4395j4012j2338
58849H11901j0208r018q480p322n678m950n636o852p830q412q431q026q133r223
58835G03702j0138r670q644q665r362q968p253n811n456n350m824m236l743l000
58821F08582k201j912j766q65M82J101J059J610K953L797L480K855K702K785K828
58806F27490K887K566J338j42o12k29l53j206j488o46K71M54L16J88k69q05m75
$$ plain form
58894 802258 817302 832340 847256 862115 877436 894243 913625 935994 960690 986583 1013108
58883 1013108 1040321 1067771 1093908 1117035 1136276 1151130 1160774 1164729 1163748 1159031 1150761 1138371
58871 1138371 1122068 1103141 1082877 1062169 1042056 1023559 1006858 991486 977362 964700 953070
58860 953070 941592 930083 918888 907587 895115 881273 866938 852646 838251 824239 811901
58849 811901 801693 792675 784195 776873 771195 766245 760609 753757 745927 737515 729084 721058 712925 703702
58835 703702 693564 683894 675250 666585 657223 648255 641002 635191 629735 624385 619561 615325 611582 608582
58821 608582 606381 604469 602703 601838 602320 603421 604480 606090 609043 612840 616320 619175 621877 624662 627490
58806 627490 630377 632943 634281 634139 633527 633298 632945 631739 630251 629605 629876 630330 630646 630834 630565 629760 629285
58789F29285O47J247Q71O64J422K531L476M693O257P266P342P228P286O909O094
58774F93218N866O342O074M267J982J78j763m350o461o971o554o411o324n448
58760F73645m072l148k734k180j364n93K26J436K962M397N391N592M832L628K775
58745F90793K325J879J820L046N260P046P859Q478R198R359R115R722J1280J2184
58731G89364J1869J2012J3723J5439J5358J4160J3467J3024J1581R470Q133P760
58719I35360P362O834P104Q382R784J0669J1093J1083J0490R440Q070O095L296
58706A045062L5l418p383j1801j5585j7912j9495k1544k4083k6303k7941k9160
58694H40472k9554k8476k6161k3528k1079j8703j6319j4013j1837r964q805q399
$$ plain form
58789 629285 629932 631179 632050 632714 634136 636667 640143 644836 651093 658359 665701 672929 680215 687124 693218
58774 693218 699084 705426 711500 715767 717749 717927 716164 711814 705353 698382 691828 685417 679093 673645
58760 673645 669573 666425 663691 661511 660147 659554 659780 661216 664178 668575 673966 679558 684390 688018 690793
58745 690793 693118 694997 696817 699863 705123 712169 720028 728506 737704 747063 756178 765900 777180 789364
58731 789364 801233 813245 826968 842407 857765 871925 885392 898416 909997 919467 927600 935360
58719 935360 942722 949556 956660 965042 974826 985495 996588 1007671 1018161 1027601 1035671 1041766 1045062
58706 1045062 1045097 1041679 1034296 1022495 1006910 988998 969503 947959 923876 897573 869632 840472
58694 840472 810918 782442 756281 732753 711674 692971 676652 662639 650802 640838 632033 623634
58682F23634q216p839p368o889o291n742n479m894l048m04J322J602J880L237
58668E75505M825N666O392P953R858J1234J2363J3733J4614J4086J2544J0719
58656F99492Q150M311L32k119l143m157n652o977p903q776r315q789p359o009
58642F42086n252m940n010n379n366m318k571q86O56K260L469L728L397L098K636
58627F27608J630O75N45P25J37j001j382m56J177L031N096O988Q004Q165Q265
58612F69207Q747R326R656R623R045P782O022L995J671p51k589l506m054m760
58598G19414n276n170m807m663m474l929l517l670l712k710p75J443L829O455
58584F88438Q815J0473J1851J3320J4192J3835J3020J2932J3314J3012J1885J0933
$$ plain form
58682 623634 615418 607579 600211 593322 587031 581289 575810 570916 567868 567464 568786 570388 572268 575505
58668 575505 580330 585996 592388 600341 610199 621433 633796 647529 662143 676229 688773 699492
58656 699492 707642 711953 712285 710166 707023 702866 697214 690237 682334 673558 664243 655454 648095 642086
58642 642086 636834 631894 626884 621505 616139 611821 609250 608364 609020 611280 614749 618477 621874 624972 627608
58627 627608 629238 629913 630458 631183 631320 630319 628937 628481 629658 632689 637785 644773 652777 660942 669207
58612 669207 677954 687280 696936 706559 715604 723386 729408 733403 735074 734323 731734 728228 724174 719414
58598 719414 714138 708968 704161 699498 695024 691095 687578 683908 680196 677486 676711 678154 681983 688438
58584 688438 697253 707726 719577 732897 747089 760924 773944 786876 800190 813202 825087 836020
58572H36020J0763J1191J2071J3439J5055J6780J9139K2553K6399K9715L2436
58561A045561L5010L7210L8339L8247L7254L5401L2526K8618K3490J6832R324
58550A377812K785j703n094q829j2848j6179j8563k0410k1894k3227k4997k7160
58538A199693k8604k8826k9002l0205l1540l1486l0011k7952k5254k1544j7523
58527H97746j4198j1386q585o421n626n265l853j593J06P73Q77M20p33j708j576
58512H38978j005j268k181k668k767l253l869l765l298l507m156m115l371k871
58498G96884k697k136j344j157j443j290o38j85Q4P70J815K830M241O561R083
58483H11378J0790J2070J3940J6217J8061J9626K1404K2669K2401K1058J9589
$$ plain form
58572 836020 846783 857974 870045 883484 898539 915319 934458 957011 983410 1013125 1045561
58561 1045561 1080571 1117781 1156120 1194367 1231621 1267022 1299548 1328166 1351656 1368488 1377812
58550 1377812 1380597 1378894 1373800 1364971 1352123 1335944 1317381 1296971 1275077 1251850 1226853 1199693
58538 1199693 1171089 1142263 1113261 1083056 1051516 1020030 990019 962067 936813 915269 897746
58527 897746 883548 872162 863577 857156 851530 846265 842412 840819 840925 841698 842575 842995 842262 840554 838978
58512 838978 837973 836705 834524 831856 829089 825836 821967 818202 814904 811397 807241 803126 799755 796884
58498 796884 794187 792051 790707 789550 788107 786817 786179 785994 786078 786848 788663 791493 795734 802295 811378
58483 811378 822168 834238 848178 864395 882456 902082 923486 946155 968556 989614 1009203
58472A009203J7443J3581Q664M110k91n523j0820j4378j6117j7277j7793j6484
58460I54318j3591j0665q104n101j766R82L364O209Q782R640R243R244R342P612
58446I79509L811k61l733p240j0485j2018j1761j1170j0572q825n962l596k265
58433H95432q30J153K864M347O783J0204J3239J5539J8123K1101K3273K4284K4816
58420A060328K4434K1674J6396R802K208o557j4634j9056j9623j9031j8883j8393
58408A018665j7311j6884j7201j6616j4741j3203j2605j1471r154p056o026n132
58396H71265l885l123k910k102p27j73l91K24J521J219j148l024k746j791j753
58381H50456j918j268l88K30J440L687O013P887R950J2108J3155J2971J2821J2921
$$ plain form
58472 1009203 1026646 1040227 1048891 1053001 1052710 1047187 1036367 1021989 1005872 988595 970802 954318
58460 954318 940727 930062 921958 916857 915091 916073 919437 925646 934428 944068 953311 962555 971897 979509
58446 979509 983320 983059 979326 972086 961601 949583 937822 926652 916080 907255 901293 897697 895432
58433 895432 894602 895755 898619 902966 909749 919953 933192 948731 966854 987955 1011228 1035512 1060328
58420 1060328 1084762 1106436 1122832 1132634 1134842 1128285 1113651 1094595 1074972 1055941 1037058 1018665
58408 1018665 1001354 984470 967269 950653 935912 922709 910104 898633 889479 882423 876397 871265
58396 871265 867380 864257 861347 859245 858518 858345 857954 858178 859699 860918 859770 856746 854000 852209 850456
58381 850456 848538 847270 846882 847112 848552 852239 858252 866139 876089 888197 901352 914323 927144 940065
58367I40065J2201J0990J1081J2495J3142J2444J2314J3679J5035J5408J5677
58356A084531J5967J4797J1971R340P630N414K356K93Om1n81k80J297K578K939
58341A158217L722N259O150O397P903J0806J2870J3508J4707J6879J7762J6744
58329A290924J6222J7099J7029J4823J2559J1474R790O630M080L342K700J302
58317A407974J037K621L835L740M565P273R369R395R439J0915J2019J1759J2233
58304A506174J4370J5695J4886J4317J5544J6553J6026J5866J6925J6875J5004
58293A678235J4294J5975J6990J5854J5800J8798K1732K2210K2875K5999K8849
58282A897611K8783K8085K9469L1338L1760L2533L5170L7335L7346L7647L9961
$$ plain form
58367 940065 952266 963256 974337 986832 999974 1012418 1024732 1038411 1053446 1068854 1084531
58356 1084531 1100498 1115295 1127266 1136606 1144236 1149650 1152006 1152299 1152305 1152264 1151683 1151403 1152700 1155278 1158217
58341 1158217 1161939 1167198 1173348 1179745 1187648 1198454 1211324 1224832 1239539 1256418 1274180 1290924
58329 1290924 1307146 1324245 1341274 1356097 1368656 1380130 1389920 1396550 1400630 1403972 1406672 1407974
58317 1407974 1409011 1411632 1415467 1419207 1423772 1431045 1440414 1449809 1459248 1470163 1482182 1493941 1506174
58304 1506174 1520544 1536239 1551125 1565442 1580986 1597539 1613565 1629431 1646356 1663231 1678235
58293 1678235 1692529 1708504 1725494 1741348 1757148 1775946 1797678 1819888 1842763 1868762 1897611
58282 1897611 1926394 1954479 1983948 2015286 2047046 2079579 2114749 2152084 2189430 2227077 2267038
58271B267038M1837M1825M2898M6790N0355N1665N3943N9169O3684O4915O6312
58260B850431P0593P4271P4229P3520P4995P5398P1674O7110O5309O4169O1750
58249C623449O1697O6595P2449P5895Q0212Q7956R4988R8549J03573J13711J23946
58238D603020J29767J35570J45871J56503J63316J71035J84229J98077K07882
58229F095270K19034K37184K57345K73563K90514L14245L40545L64243L90720
58220H782663M25958M64814N01832N43625N97273O57164P17281P85384Q70323
58211A4346317R67399J071760J193431J342599J514270J705459J932460K212447
58203B6286142K545471K935912L413382M010777M744823N644803O776851Q214005
$$ plain form
58271 2267038 2308875 2350700 2393598 2440388 2490743 2542408 2596351 2655520 2719204 2784119 2850431
58260 2850431 2921024 2995295 3069524 3143044 3218039 3293437 3365111 3432221 3497530 3561699 3623449
58249 3623449 3685146 3751741 3824190 3900085 3980297 4068253 4163241 4261790 4365363 4479074 4603020
58238 4603020 4732787 4868357 5014228 5170731 5334047 5505082 5689311 5887388 6095270
58229 6095270 6314304 6551488 6808833 7082396 7372910 7687155 8027700 8391943 8782663
58220 8782663 9208621 9673435 10175267 10718892 11316165 11973329 12690610 13475994 14346317
58211 14346317 15313716 16385476 17578907 18921506 20435776 22141235 24073695 26286142
58203 26286142 28831613 31767525 35180907 39191684 43936507 49581310 56358161 64572166
58195F4572166J0011976J2233620J4927290J8006034K1191785K4172199K6804312
58188A91919382K9103856L1075863L2611903L3393859L2633923K8981356K1206777
58181D00926919R457230m177482j6664364k5805774l1153792l3475182l3706100
58174B65401455l2469486l0202586k7325834k4207641k1102514j8175080j5526775
58167I6391539j3189992j1151088r397166p919818o687857n654854m791114m081130
58159C3518520l497833l007522k594328k254939j975046j733747j524895j352350
58151A5577860j209382j082477r69799q76668p97800p22043o49956n89547n38891
58142H141297m89169m40781m00742l67790l34918l03355k79911k63461k47265
$$ plain form
58195 64572166 74584142 86817762 101745052 119751086 140942871 165115070 191919382
58188 191919382 221023238 252099101 284711004 318104863 350738786 379720142 400926919
58181 400926919 410384149 406206667 389542303 363736529 332582737 299107555 265401455
58174 265401455 232931969 202729383 175403549 151195908 130093394 111918314 96391539
58167 96391539 83201547 72050459 62653293 54733475 48045618 42390764 37599650 33518520
58159 33518520 30020687 27013165 24418837 22163898 20188852 18455105 16930210 15577860
58151 15577860 14368478 13286001 12316202 11439534 10641734 9919691 9269735 8680188 8141297
58142 8141297 7652128 7211347 6810605 6442815 6107897 5804542 5524631 5261170 5013905
58133E013905k31568k21052k12901k00131j84213j72317j64364j54339j42093
58124C330927j32645j25791j17201j07905j02368r9031r2776q4788q0306p8535
58114B309581p4443o8580o5493o4237o0113n4334n2357n3697n2705m8628m5919
58103A669075m5242m2957l9198l7872l8666l7211l3337l1363l2018l1468k8624
58092A271119k6358k5241k2840j9410j7805j7681j6031j3211j2254j2610j1077
58081A076601q564r270j3188j6007j6611j8116k1096k2309k1049k0581k2118k3009
58069H64683k1941k0721j9938j7958j5037j3568j3474j2154r546q411r035q575
58057F94325o408n367o620p910p925q139r268r915r668r789j0175r203p179o259
$$ plain form
58133 5013905 4782337 4561285 4348384 4148253 3964040 3791723 3627359 3473020 3330927
58124 3330927 3198282 3072491 2955290 2847385 2745017 2645986 2553210 2468422 2388116 2309581
58114 2309581 2235138 2166558 2101065 2036828 1976715 1922381 1870024 1816327 1763622 1714994 1669075
58103 1669075 1623833 1580876 1541678 1503806 1465140 1427929 1394592 1363229 1331211 1299743 1271119
58092 1271119 1244761 1219520 1196680 1177270 1159465 1141784 1125753 1112542 1100288 1087678 1076601
58081 1076601 1068037 1058767 1045579 1029572 1012961 994845 973749 951440 930391 909810 887692 864683
58069 864683 842742 822021 802083 784125 769088 755520 742046 729892 720346 711935 702900 694325
58057 694325 687917 682550 675930 668020 660095 651956 642688 632773 623105 613316 603141 593938 586759 580500
58043E80500o614o317n200n060n891n842n056n604p310p705o422n709o122n835
58029D95813m665m734o392p418p076p145q110q172o959o475p275p307n720m406
58015D03959m514m594l571k546k406k217j272l89k05l10n79j274j634o61O76N35
57999C78998n74l19J748L811N047O390P961Q695Q673R041R533Q832P226O092N012
57984D66166K510n70j845j484k082m320o213o820p266p752p138n888n907o953
57970D04438o680m790l571l723l284j575n18r70j162m6J041J216J393J749J000
57955C84518o45j116j64k09k163l658k960j563j237j336p77J4P21K174M272N334
57939C81205M995N223P109R107R902J0504J1973J3455J4038J4320J4637J3917
$$ plain form
58043 580500 573886 567569 562369 557309 551418 545576 540520 534916 527606 519901 513479 507770 501648 495813
58029 495813 491148 486414 480022 472604 465528 458383 450273 442101 435142 428667 421392 414085 408365 403959
58015 403959 399445 394851 391280 388734 386328 384111 382839 382450 382245 381935 381356 380082 378448 377787 378463 378998
57999 378998 378424 378105 379853 383664 388711 395101 403062 411757 420430 429471 439004 447836 455062 461154 466166
57984 466166 468676 468106 466261 464777 462695 458375 452162 445342 438076 430324 423186 417298 411391 404438
57970 404438 397758 392968 389397 385674 382390 380815 380297 379327 378165 378119 379160 380376 381769 383518 384518
57955 384518 383873 382757 382593 382384 380221 376563 373603 372040 370803 369467 368690 368704 369425 371599 375871 381205
57939 381205 386200 391423 398532 407639 417541 428045 440018 453473 467511 481831 496468 510385
57927E10385J1635Q899O400L432k8k562l710m857o592p600p299p114p897q515
57913D84577q205p874p885p145n609n028n872o195n039m124m548m693l411k463
57899D06486l577n471o079n602n151m415k947j848j981k186j210K95J359K448
57885C70121L800M132K903J876K375L068K531J882K400K617O70k094k898j781
57871C91602j193k062k952k779j952r58K25J247J508J062M76R4K43J311K855L661
57855C92388L502L597M544N257M892M193L789K892J007p30j430j968l172m180
57841D14581m248m407n584o665o368n497n431n776n542n120n091m505k541o02
57827C47204m66j414j444m17L39O41J385K456K910K842L069L387K900J722O66
$$ plain form
57927 510385 522020 530919 537319 540751 540723 538161 534451 529594 523002 515402 508103 500989 493092 484577
57913 484577 476372 468498 460613 453468 447859 442831 436959 430764 425725 421601 417053 412360 408949 406486
57899 406486 402909 397438 391359 385757 380606 376191 373244 371396 369415 367229 366019 366314 367673 370121
57885 370121 373921 378053 380956 382832 385207 388275 390806 392688 395088 397705 398375 396281 393383 391602
57871 391602 390409 388347 385395 382616 380664 379706 379931 381178 382686 383748 384224 384318 384561 385872 388727 392388
57855 392388 395890 399487 404031 409288 414180 418373 422162 425054 426061 425331 423901 421933 418761 414581
57841 414581 410333 405926 400342 393677 387309 381812 376381 370605 365063 359943 354852 350347 347806 347204
57827 347204 346738 345324 343880 343463 343802 344443 345828 348284 351194 354036 357105 360492 363392 365114 365780
57812C65780k57j451k404k439k173k650l607m105m304m893n480n129m017l024
57798C19847k192j145k96j64o3R00K160K553K263K343K862L132L162L465L882
57783C42709L996M116M554M681M033L483L875M469M276L928M386M843L877J955
57769C99181O21j18j486l482m896n488o123o901p092o761o697o741o021m745m025
57754C29226l919l315j874m91K12N28P90J161K061L547M534M079L051L030L888
57739C46508M078L047J694N89n10j421j495r74q95j496k008k104k225k458k409
57724C37921k248k691l787m794n177m874l858k451j649j994k582k333j640j530
57710B96313j824j656j228j423k119k473k498k699k668j740o07m43p00J73J998
$$ plain form
57812 365780 365523 364072 361668 359229 357056 354406 350799 346694 342390 337497 332017 326888 322871 319847
57798 319847 317655 316510 316214 316050 315987 316887 319047 321600 323863 326206 329068 332200 335362 338827 342709
57783 342709 346705 350821 355375 360056 364089 367572 371447 375916 380192 384120 388506 393349 397226 399181
57769 399181 399802 399684 398198 394716 389820 384332 378209 371308 364216 357455 350758 344017 337996 333251 329226
57754 329226 325307 321992 320118 319627 319839 320367 321157 322318 324379 327926 332460 336539 339590 342620 346508
57739 346508 350586 353633 355327 355916 355406 353985 352490 351516 350621 349125 347117 345013 342788 340330 337921
57724 337921 335673 332982 329195 324401 319224 314350 310492 308041 306392 304398 301816 299483 297843 296313
57710 296313 294489 292833 291605 290182 288063 285590 283092 280393 277725 275985 275378 274935 274235 274408 276406
57695B76406K879K029O58j84q23j686k405k666k620k319j852j855k576k796j281
57680B58909J087K450K982M597P829J1296J4482J8599K4044K9249L3043L6215
57668D44782L9712M3047M5529M7325M7872M4495L4331J7348l199k2860l8117m7531
57656F52734n1680n1912m9104m3965l7972l2717k8405k4208k0050j6739j4348
57645B81634j1955r237o947n431m020k281o86L23Q54R02K66o45j044r57j112j568
57629B38096j629j143o36k14L89P61K91l86p5Q28P20n86j532j472j594k553l188
57612B26077k610j750j774k372k676k622k406j824j036q14j230j323q05p34j664
57597B00437k432j951r80r01j668k149j819j088m90l61q24j496j732j507j390
$$ plain form
57695 276406 279285 281314 281972 281788 280965 279279 276874 274208 271588 269269 267417 265562 262986 260190 258909
57680 258909 259996 262446 265428 270025 277854 289150 303632 322231 346275 375524 408567 444782
57668 444782 484494 527541 573070 620395 668267 712762 747093 764441 761242 738382 700265 652734
57656 652734 601054 549142 500038 456073 418101 385384 356979 332771 312721 295982 281634
57645 281634 269679 260442 253495 248064 244044 241763 241077 241400 242254 243156 243422 242777 241733 240776 239664 238096
57629 238096 236467 235324 234688 234474 234863 235624 235915 235529 235454 236282 237002 236416 234884 233412 231818 229265 226077
57612 226077 223467 221717 219943 217571 214895 212273 209867 208043 207007 206193 204963 203640 202835 202101 200437
57597 200437 198005 196054 195074 194173 192505 190356 188537 187449 186959 186598 185774 184278 182546 181039 179649
57582A79649j445j134n11m07j027j556j590j681k006j859j141j019k144l433l574
57567A55122k711j778j091n14j44J5K86N79K63o46j184q89m55l23J59J354K340
57550A50383K303J877K021K519K622K324K018J602R66N55O12N79J08j08N70J594
57534A72545K097K143K126J769P34l30m87J38N79K78n65j504k106k130j852j775
57518A71660j725j055ML07m17r39m04L87M92L98J006J974K307J894J287O27j30
57501A77673m86p7M84L80k19o75j042j746k502k620k068j448j100r49q82p54l82
57484A61587j2k58j135j799j745j463j422j232n91j27m77j321k070k768l390l173
57468A38604j702J9O42Q6o89r83n66O03J968K379J504N60P17J463J582R77L96
$$ plain form
57582 179649 178204 177070 176559 176152 175125 173569 171979 170298 168292 166433 165292 164273 162129 158696 155122
57567 155122 152411 150633 149542 149028 148884 148899 149185 149764 150027 149381 148197 147308 146853 146530 146689 148043 150383
57550 150383 152686 154563 156584 159103 161725 164049 166067 167669 168635 169190 169802 170381 170489 170381 170951 172545
57534 172545 174642 176785 178911 180680 181414 181084 180597 180735 181314 181592 181027 179523 177417 175287 173435 171660
57518 171660 169935 168880 168884 169191 168774 167835 167431 167818 168310 168708 169714 171688 173995 175889 177176 177803 177673
57501 177673 177187 177110 177594 177974 177755 177080 176038 174292 171790 169170 167102 165654 164554 163605 162723 161969 161587
57484 161587 161575 161317 160182 158383 156638 155175 153753 152521 151930 151803 151326 150005 147935 145167 141777 138604
57468 138604 136902 136921 137563 137649 136960 135977 135411 136014 137982 140361 141865 142425 143142 144605 146187 147164 147560
57451A47560nn41r23o03J02M12L56N85J134J336R64M88L07L68M51L16k05q06q68
57432A50428l85p8j85j1P46J240Q84M40O63Q91K47o41o40q1j49p41o57L25J064
57413A53360Q39J50l79o53n42K58J468K236K135J537R09L54r8l17k32J24N93P15
57395A62457J12o42l12J245K464K057Q61O62J788K992L357L129K837K649K557
57380A88213K437J989J184N69N63Q32Q45N83J89m32j159j503j470j808k695l091
57364A85246k157m53J052K139K715K273J056N39J473K571K548K161K618L228K668
57349B09677J543J452K162K083J102O93J204J347N76j26j34o7l01l50j33l38j009
57332B19381j204m65N91J416K018K063R61q22j819j362k84N12J014J366J303P20
$$ plain form
57451 147560 147555 147014 146091 145488 145590 146002 146358 146943 148077 149413 150377 150865 151172 151540 151991 152307 152102 151296 150428
57432 150428 150043 149965 149780 149769 150515 151755 152639 153079 153742 154633 154880 154239 153599 153518 153369 152628 151971 152296 153360
57413 153360 154199 154349 153970 153317 152775 153033 154501 156737 158872 160409 161318 161672 161574 161257 161025 161149 161742 162457
57395 162457 162569 161927 161615 162860 165324 167381 168242 168904 170692 173684 177041 180170 183007 185656 188213
57380 188213 190650 192639 193823 194392 194955 195787 196632 197215 197404 196972 195813 194310 192840 191032 188337 185246
57364 185246 183089 182636 183688 185827 188542 190815 191871 192410 193883 196454 199002 201163 203781 207009 209677
57349 209677 211220 212672 214834 216917 218019 218712 219916 221263 221839 221713 221579 221512 221211 220861 220728 220390 219381
57332 219381 218177 217712 218303 219719 221737 223800 224761 223939 222120 220758 220474 220986 222000 223366 224669 225389
57316B25389m5o94j040p02L54J195R14M3k09J62K11j12J26J081J856K022J972
57299B32523J747J057M31P46J529J428N04L02J283K115J922J506J622J800J683
57284B52198J978L100M232M655M829N375O054O494O858P191P181P060P590Q693
57270C33488R372R460R967J1095J1537J0578R394R130R108Q173O713N992O319
57257D50326P039P624P741O935N318M013M002M963N951O635P131P321P073O709
57243E38781O600O737P099P861Q823R370R328R232R325R182Q698Q508Q947R511
57229F58002R828J0225J0837J1149J1052J1301J2195J2811J2390J1633J1729J2755
57217G95907J3843J4345J4143J3447J2830J2909J3486J3692J3378J3504J4708
$$ plain form
57316 225389 225344 224650 223610 222908 223262 224457 225371 225414 225205 225367 225578 225466 225592 226673 228529 230551 232523
57299 232523 234270 235327 235758 236504 238033 239461 239965 240267 241550 243665 245587 247093 248715 250515 252198
57284 252198 254176 257276 261508 266163 270992 276367 282421 288915 295773 302964 310145 317205 324795 333488
57270 333488 342860 352320 362287 373382 384919 395497 404891 414021 423129 431302 438015 444007 450326
57257 450326 457365 464989 472730 479665 484983 488996 492998 497961 503912 510547 517678 524999 532072 538781
57243 538781 545381 552118 559217 567078 575901 585271 594599 603831 613156 622338 631036 639544 648491 658002
57229 658002 667830 678055 688892 700041 711093 722394 734589 747400 759790 771423 783152 795907
57217 795907 809750 824095 838238 851685 864515 877424 890910 904602 917980 931484 946192
57206I46192J6387J7777J9004K0425K1747K2597K3158K3666K3969K4114K4528
57195A183564K5090K4926K3677K2073K0756J9537J8355J7793J7976J8038J7487
57184A409272J7039J7284J7675J7848J8727K1132K4277K6816K8656L0451L2125
57173A661302L3090L3470L3899L4409L4464L3768L2385L0545K8898K8252K8472
57162B012954K8447K7802K7591K8496K9501K9512K9173K9731L0945L1561L1278
57151B336991L0765L0201K9224K8100K7617K7931K8477K8983K9671L0600L1572
57140B660132L2490L3135L2990L1889L0538K9801K9964L1076L3217L5756L7304
57129C018292L7268L6689L6630L6668L5982L5032L4952L6065L8056M0943M4641
$$ plain form
57206 946192 962579 980356 999360 1019785 1041532 1064129 1087287 1110953 1134922 1159036 1183564
57195 1183564 1208654 1233580 1257257 1279330 1300086 1319623 1337978 1355771 1373747 1391785 1409272
57184 1409272 1426311 1443595 1461270 1479118 1497845 1518977 1543254 1570070 1598726 1629177 1661302
57173 1661302 1694392 1727862 1761761 1796170 1830634 1864402 1896787 1927332 1956230 1984482 2012954
57162 2012954 2041401 2069203 2096794 2125290 2154791 2184303 2213476 2243207 2274152 2305713 2336991
57151 2336991 2367756 2397957 2427181 2455281 2482898 2510829 2539306 2568289 2597960 2628560 2660132
57140 2660132 2692622 2725757 2758747 2790636 2821174 2850975 2880939 2912015 2945232 2980988 3018292
57129 3018292 3055560 3092249 3128879 3165547 3201529 3236561 3271513 3307578 3345634 3386577 3431218
57118C431218M8460N2237N7250O4691P3982Q3894R4448J06224J18767J31514J45731
57107D408416J63509J85202K09787K37645K70992L11586L59994M17570M87520
57098G052221N73477O78367Q05070R56813J136455J346099J586923J857565K152335
57089A8145325K462219K777175L084986L367671L602555L770306L861993L876921
57081D4949151L813060L658447L389087K974099K388051J628202P28289k42124
57073F3286262j195773k053667k764169l306907l684798l913173m012081m002196
57065C8353498l902604l730214l500806l230252k934291k627375k322029k028708
57057A4077219j755459j507602j288033j097659r35513p99218o86006n93077n16932
$$ plain form
57118 3431218 3479678 3531915 3589165 3653856 3727838 3811732 3906180 4012404 4131171 4262685 4408416
57107 4408416 4571925 4757127 4966914 5204559 5475551 5787137 6147131 6564701 7052221
57098 7052221 7625698 8304065 9109135 10065948 11202403 12548502 14135425 15992990 18145325
57089 18145325 20607544 23384719 26469705 29837376 33439931 37210237 41072230 44949151
57081 44949151 48762211 52420658 55809745 58783844 61171895 62800097 63528386 63286262
57073 63286262 62090489 60036822 57272653 53965746 50280948 46367775 42355694 38353498
57065 38353498 34450894 30720680 27219874 23989622 21055331 18427956 16105927 14077219
57057 14077219 12321760 10814158 9526125 8428466 7492953 6693735 6007729 5414652 4897720
57048D897720m53367l98937l51901l11190k75264k42878k14147j89663j69006
57039B291367j51064j35347j21788j09707r8153q6969p6427o6063n5000m3322
57029A347527l1989k1652j2516m903J465Q210J6276K2747K1597Q964j2796l6788
57017A306142n6529o9167p5171p6282p3849o8564o1363n3892m7545m2324l7407
57006F44049l2653k8755k6017k3836k1567j9190j7004j5261j4162j3670j3319
56995D18615j2667j1778j0856r691q110o557n464m318k290M15K741M227N368O562
56981C66197P439P236N207Q88n164j1073j4911j6337j6382j5894j4930j3414j1437
56968B67425r025o349l962k130k35K352N257P838J0368J3358J6170J7648J7811
$$ plain form
57048 4897720 4444353 4045416 3693515 3382325 3107061 2864183 2650036 2460373 2291367
57039 2291367 2140303 2004956 1883168 1773461 1675308 1588339 1511912 1445849 1390849 1347527
57029 1347527 1315538 1293886 1281370 1276467 1277932 1286142 1302418 1325165 1346762 1355726 1342930 1306142
57017 1306142 1249613 1180446 1105275 1028993 955144 886580 825217 771325 723780 681456 644049
57006 644049 611396 582641 556624 532788 511221 492031 475027 459766 445604 431934 418615
56995 418615 405948 394170 383314 373623 365513 358956 353492 349174 346884 347299 350040 354267 359635 366197
56981 366197 373636 380872 386079 386967 381803 370730 355819 339482 323100 307206 292276 278862 267425
56968 267425 258400 252051 248089 245959 245724 248076 253333 261171 271539 284897 301067 318715 336526
56955C36526J7492J6446J3296P537L06o902j3176j7770k0113k0505j9783j8148
56943B75206j5330j1881q978o797m283p40L409P599J1692J5302J7868J9709K1853
56930C24629K4433K6133K5490K1798J4767M630o933j7146k4072k7632k8648k7913
56918C09536k6250k4369k2249j9504j6504j4163j2558j0915r054p643o884o207
56906A33236n458n115n054m501l539l289m115m903m636l497j944j5J972L306M120
56891I6568N528P968J0581J2826J5330J8439K1207K2632K2685K1355J7926J2313
56879B85358O005O41l540o886q929q946p242m792k093Q58L984P298J1209J5953
56865B88878K1132K6224L1089L5591L9313M2170M4591M6621M7201M4588L7107
$$ plain form
56955 336526 354018 370464 383760 391297 391603 384701 371525 353755 333642 313137 293354 275206
56943 275206 259876 247995 239017 232220 227937 227197 230606 238205 249897 265199 283067 302776 324629
56930 324629 349062 375195 400685 422483 437250 441880 434947 417801 393729 366097 337449 309536
56918 309536 283286 258917 236668 217164 200660 186497 173939 163024 153970 146327 139443 133236
56906 133236 127778 122663 117609 113108 109569 106280 102165 97262 92626 89129 87185 87170 89142 92448 96568
56891 96568 102096 110064 120645 133471 148801 167240 188447 211079 233764 255119 273045 285358
56879 285358 291363 292004 288464 281578 272649 263703 256461 251669 249576 250434 254418 261716 272925 288878
56865 288878 310010 336234 367323 402914 442227 484397 528988 575609 622810 667398 704505
56854G04505K3900O179j2176k6573l4913l8162l7911l4806k9487k3272j6954j0093
56842D70237k267O142J4941K4563L4741M4049N1630N8175O4406O9797P3403P4392
56830I84209P0670N8775L7058Q423k1227m6598o4610p4209p6387p3680o8135o0177
56818F74112n0110l9503k9737k0257r865J068J1152K0056K8440L6234M2564M7171
56806G11325N0431N1881M9752M2046K7704P423j5683l6823n2157o0751o3631o1881
56794F49636n6546m9419m2303l5703k9141k2452j5819r090k061M880J1170J6667
56782D19819K1162K4011K5088K5179K4433K1246J3976L130r139k0899l0642l6717
56770D80647l8398l7156l5309l3565l1164k7912k4557k1455j8372j5581j3688
$$ plain form
56854 704505 728405 734584 722408 695835 660922 622760 584849 550043 520556 497284 480330 470237
56842 470237 467970 474112 489053 513616 548357 592406 644036 702211 766617 836414 909817 984209
56830 984209 1054879 1113654 1150712 1159135 1137908 1091310 1026700 952491 876104 802424 734289 674112
56818 674112 624002 584499 554762 534505 524640 525708 536860 556916 585356 621590 664154 711325
56806 711325 761756 813637 863389 905435 933139 940562 924879 888056 835899 775148 711517 649636
56794 649636 593090 543671 501368 465665 436524 414072 398253 389163 387102 391982 403152 419819
56782 419819 440981 464992 490080 515259 539692 560938 574914 578044 568905 548006 517364 480647
56770 480647 442249 405093 369784 336219 305055 277143 252586 231131 212759 197178 183490
56759A83490j2376j0655q360o311m953m066l667l950m347l878k656j822j904k315
56745A12230k532k660k627j956p38J68K63J0o2o7k61m92n09l89l20l24l21k16
56727I9197P9N70J132J689K207K402J898R16K36J83K44R8K55J088K035K344K077
56710A18650J643J136P08Q30J402J455N41l61k50L74M31j02n04n42l15M08J588
56693A27092K332J998J221P94M04l21n52L96J366P77q67j714j331r16j049j075
56677A28555o91l46n5O29J332J165L47L7M43O25L05K99R24J451J509J678K240
56660A40447K620K444K070J799J531J388J619J845J500J010J281J977J727K32
56646A63490j226j701j651j682j542r89n05m70m85j27L63N84M83K04m9J20P71
$$ plain form
56759 183490 171114 160459 152099 145788 140835 136769 133102 129152 124805 120927 118271 116449 114545 112230
56745 112230 109698 107038 104411 102455 101717 101885 102148 102158 102096 102029 101768 101276 100767 100378 100058 99734 99413 99197
56727 99197 99276 99846 100978 102667 104874 107276 109174 110090 110326 110509 110753 110851 111106 112194 114229 116573 118650
56710 118650 120293 121429 122137 122967 124369 125824 126365 126004 125754 126128 126559 126457 125953 125411 125096 125504 127092
56693 127092 129424 131422 132643 133437 133841 133520 132968 133364 134730 135507 134640 132926 131595 130679 129630 128555
56677 128555 127864 127518 127463 128092 129424 130589 130936 130973 131416 132041 132346 132645 133569 135020 136529 138207 140447
56660 140447 143067 145511 147581 149380 150911 152299 153918 155763 157263 158273 159554 161531 163258 163490
56646 163490 162264 160563 158912 157230 155688 154699 154194 153724 153239 153112 153475 154059 154542 154746 154697 154817 155588
56629A55588J107L56r62j602j410j335j730j888j445r45p28m36QM1m58p59m10
56612A42992J14K55N3l15q03j079o58K12N95O7p67j136q24j7Q66J227R34P18J184
56593A43618J706J338M54K40P30P89O0n04k50M18J101J939K697K592J553O21O10
56576A59712J256J955K490K756K645K448K604K969L146L414M346N661O534O974
56562B08910P716Q821R717J0528J2038J4200J5925J6456J5751J3608R873N605
56550C49148K530J164O62N11Q25J061K45j297k212k344k917m183m857m430m109
56535C29797m672n251n160n209o071o912o815o250n993n841n389n003m997m865
56521B51369m244l704l750m018m123m314m647m599m170m166m788n096m585l972
$$ plain form
56629 155588 156695 157051 156089 154487 153077 151742 150012 148124 146679 145734 145006 144570 144578 144619 144161 143402 142992
56612 142992 143106 143361 143414 143099 142296 141217 140559 140771 141366 141433 140666 139530 138706 138689 139555 140782 141716 142434 143618
56593 143618 145324 146662 147116 147356 148086 148875 148935 148431 148181 148599 149700 151639 154336 156928 158481 159102 159712
56576 159712 160968 162923 165413 168169 170814 173262 175866 178835 181981 185395 189741 195402 201936 208910
56562 208910 216626 225447 235164 245692 257730 271930 287855 304311 320062 333670 343543 349148
56550 349148 351678 352842 353504 354015 354840 355901 356146 354849 352637 350293 347376 343193 338336 333906 329797
56535 329797 325125 319874 314714 309505 303434 296522 289707 283457 277464 271623 266234 261231 256234 251369
56521 251369 247125 243421 239671 235653 231530 227216 222569 217970 213800 209634 204846 199750 195165 191193
56507A91193l744l189j821n06k12o93j301j996k713k812k156j710k116k613k275
56492A61336j431r20q31q05q74j111j226j041p36k25Q01J893J988J017J84K12
56476A58231M86M42M42P28P92N15O26J395K035J996J583R25j49q54J30K293L260
56459A74876K062N05K61N51R4n70l95J29J0m72n84o05r01q04P5O41Oq12m78M66
56439A74055P59O11J017J723J739J147P61N62J02j91L10R96P96j5k44L83J100
56422A85611J506J859K236K419K323J826P45m10n37M18R78K16q32q91l96m37q55
56405A95779q97p89j130j534j303q10q56j238j252r06n15J94J350K156J981J499
56389A91729J513J596J109O68J189K299L057L477L986M162L436K301J546J009
$$ plain form
56507 191193 187449 184260 182439 181933 181721 181028 179727 177731 175018 172206 170050 168340 166224 163611 161336
56492 161336 159905 158985 158154 157349 156475 155364 154138 153097 152361 152136 152937 154830 156818 157835 158019 158231
56476 158231 158717 159159 159601 160329 161121 161636 162262 163657 165692 167688 169271 170196 170047 169193 169323 171616 174876
56459 174876 176938 177443 177704 178255 178349 177779 177384 177513 177523 177051 176467 175862 174961 174157 174232 174873 174879 174067 173589 174055
56439 174055 174814 175425 176442 178165 179904 181051 181812 182374 182476 182285 182595 183591 184387 184372 184128 184511 185611
56422 185611 187117 188976 191212 193631 195954 197780 198525 198115 197578 197996 198974 199190 198358 197467 197071 196634 195779
56405 195779 194882 194093 192963 191429 190126 189316 188460 187222 185970 185064 184549 184743 186093 188249 190230 191729
56389 191729 193242 194838 195947 196615 197804 200103 203160 206637 210623 214785 218221 220522 222068 223077
56375B23077K78k41j81k41r79j509q23M74J127J121J118R92L88o4L18Q69O19l
56357B26340M0O13Q91R01J108J229Q11L71N95J136J358J456J643J301K30l88L00
56340B39935J322J519J392J783K131J782J675K737L892L730K926K881L121K360
56326B73186J113Q33J331J398J169J556K028J413J99k48j38n22r09j16J056O85
56310B84034r76j748q75K96R03J433J979J935J566J791K394K461K389L371M956
56295C05909N334M098K647J842J276Q03Q56J099P07k0rP14J205J403J940K529
56279C32333K365J777J730K091K214K585L858M974M498L239L165M223M680M236
56265C77968M258N143N946O466P426Q732R758J1015J3288J5662J6770J7436J9388
$$ plain form
56375 223077 223355 223114 222933 222692 221713 220204 219381 219855 220982 222103 223221 224213 224601 224537 224855 225724 226343 226340
56357 226340 226380 226993 227884 228785 229893 231122 231933 232304 232899 234035 235393 236849 238492 239793 240023 239635 239935
56340 239935 241257 242776 244168 245951 248082 249864 251539 254276 258168 261898 264824 267705 270826 273186
56326 273186 274299 275132 276463 277861 279030 280586 282614 284027 284226 283978 283840 283318 282409 282293 283349 284034
56310 284034 283058 281310 280435 280731 281634 283067 285046 286981 288547 290338 292732 295193 297582 300953 305909
56295 305909 311243 315341 317988 319830 321106 321909 322765 323864 324571 324551 324542 325256 326461 327864 329804 332333
56279 332333 334698 336475 338205 340296 342510 345095 348953 353927 358425 361664 364829 369052 373732 377968
56265 377968 382226 387369 393315 399781 407207 415939 425697 436712 450000 465662 482432 499868 519256
56252E19256K2109K3772K4801K7320L1307L4572L6506L8643M1308M2965M3305
56241H85864M3785M4563M3854M1011L7422L3767K9084K3140J7028J0938L975l409
56229A211022r562j4592k0198k6147k9997l1114l1829l3649l5251l5318l4610
56218I08755l4013l3012l1337k9783k8515k6635k4178k2326k1100j9230j6780
56207F21846j5276j4844j3896j2137j1028j0684r418p124n966o638o992n621l901
56194D98321l117k410j080l12r75j890j750q40J87J250J875J337M18P09J787J616
56178D95126J26n04M25J155R36J240K675L777L885M207N055N102M404M884O726
56163E39219P633O914O894Q812J0732J1150J1356J2437J3223J3061J3622J5948
$$ plain form
56252 519256 541365 565137 589938 617258 648565 683137 719643 758286 799594 842559 885864
56241 885864 929649 974212 1018066 1059077 1096499 1130266 1159350 1182490 1199518 1210456 1214431 1211022
56229 1211022 1201460 1186868 1166670 1140523 1110526 1079412 1047583 1013934 978683 943365 908755
56218 908755 874742 841730 810393 780610 752095 725460 701282 678956 657856 638626 621846
56207 621846 606570 591726 577830 565693 554665 543981 534563 527439 521473 514835 507843 502222 498321
56194 498321 495204 492794 491714 491402 490427 488537 486787 485947 486134 487384 489259 490596 491014 491723 493510 495126
56178 495126 495252 494748 495173 496328 497264 498504 501179 504956 508841 513048 518103 523205 527609 532493 539219
56163 539219 546852 553766 560660 569472 580204 591354 602710 615147 628370 641431 655053 671001
56151F71001J8596K0520K3035K7068L1326L5036L9693M6382N4032O2061P1793
56140A100543Q3547R5122J05091J14754J25015J34008J39494J40978J37900J28785
56130B305237J14199R7871Q3144P0700O0749N4173M9882M4277L5205K3695J0717
56119B949849m294k0220l3503m2738n0751o0338p1398q3769r8742j15376j29027
56108B239693j36171j37578j34886j27793j16750j04536r2663p9763o5792n3862
56098A189899m5557l8384l0409k3510j9315j6051j2223r406q452o951l558q42
56086I75241p30j051K90J691J585J785L797N708N989O419Q109Q783P311O569Q404
56071A039900J0157R747R521J1360J2678J1478J0600J2520J4579J3970J2990J4459
$$ plain form
56151 671001 689597 710117 733152 760220 791546 826582 866275 912657 966689 1028750 1100543
56140 1100543 1184090 1279212 1384303 1499057 1624072 1758080 1897574 2038552 2176452 2305237
56130 2305237 2419436 2517307 2600451 2671151 2731900 2786073 2835955 2880232 2915437 2939132 2949849
56119 2949849 2945555 2925335 2891832 2849094 2798343 2738005 2666607 2582838 2484096 2368720 2239693
56108 2239693 2103522 1965944 1831058 1703265 1586515 1481979 1389316 1309553 1243761 1189899
56098 1189899 1144342 1105958 1075549 1052039 1032724 1016673 1004450 995044 986592 979641 976083 975241
56086 975241 974511 973460 973750 975441 977026 978811 982608 988316 994305 1000724 1008833 1017616 1024927 1031496 1039900
56071 1039900 1050057 1059804 1069325 1080685 1093363 1104841 1115441 1127961 1142540 1156510 1169500 1183959
56059A183959J6320J5723J4364J4801J5500J4372J3222J3849J3938J1654J0080
56048A337782J2051J4882J5312J5280J7496J9796J9416J8618K0400K2827K3140
56037A537000K3285K5779K8381K8540K8653L1315L3903L3674L3369L5875L8382
56026A878156L7976L7771M0969M4208M3727M2786M5777N0172N1728N2426N5686
56015B381382N8974N8986N8944O2811O7515O8869O9738P4247P9564Q1765Q3939
56004C146734Q9866R5881R7946J00328J07885J16463J20809J24964J34380J44918
55994D280174J50748J55904J66454J78592J86610J95136K10750K29041K43141
55985E996550K57354K78629L02690L23003L44959L76008M10718M41645M75725
$$ plain form
56059 1183959 1200279 1216002 1230366 1245167 1260667 1275039 1288261 1302110 1316048 1327702 1337782
56048 1337782 1349833 1364715 1380027 1395307 1412803 1432599 1452015 1470633 1491033 1513860 1537000
56037 1537000 1560285 1586064 1614445 1642985 1671638 1702953 1736856 1770530 1803899 1839774 1878156
56026 1878156 1916132 1953903 1994872 2039080 2082807 2125593 2171370 2221542 2273270 2325696 2381382
56015 2381382 2440356 2499342 2558286 2621097 2688612 2757481 2827219 2901466 2981030 3062795 3146734
56004 3146734 3236600 3332481 3430427 3530755 3638640 3755103 3875912 4000876 4135256 4280174
55994 4280174 4430922 4586826 4753280 4931872 5118482 5313618 5524368 5753409 5996550
55985 5996550 6253904 6532533 6835223 7158226 7503185 7879193 8289911 8731556 9207281
55976I207281N22797N77566O31129O90286P66109Q54073R46190J051775J184131
55967A6431337J338563J507335J704088J948502K241224K581904K997289L522408
55959C4272650M172577M967881N965684P233610Q816125J0762542J3131211J5879436
55951A05201716J8776803K1526806K3976665K6132682K7994830K9460720L0281222
55944B83351444K9834716K6931273K0288842R701719l192319j5562014k4990478
55937C26363183l0563010l2686582l2274564l0215133k7267553k4030390k0867714
55930A28458237j7936845j5307844j3017696j1049244r349817p889095o661299
55923D7246397n641481m785383m067675l481321l004193k601673k258276j975204
$$ plain form
55976 9207281 9730078 10307644 10938773 11629059 12395168 13249241 14195431 15247206 16431337
55967 16431337 17769900 19277235 20981323 22929825 25171049 27752953 30750242 34272650
55959 34272650 38445227 43413108 49378792 56612402 65428527 76191069 89322280 105201716
55951 105201716 123978519 145505325 169481990 195614672 223609502 253070222 283351444
55944 283351444 313186160 340117433 360406275 370107994 366915675 351353661 326363183
55937 326363183 295800173 263113591 230839027 200623894 173356341 149325951 128458237
55930 128458237 110521392 95213548 82195852 71146608 61796791 53907696 47246397
55923 47246397 41604916 36819533 32751858 29270537 26266344 23664671 21406395 19431191
55915A9431191j740916j533314j346983j190766j061328r44003q36603p48415
55907A0028863o77830o12833n51540n01806m62433m23915l85931l55944l32371
55898E724260l06344k78361k56764k41376k24341k05436j91305j81113j67788
55889C671432j52057j41037j34144j24251j11670j03460r9664r3315q3680p7008
55879B551146p4450p1176o7217o7580p1563p2960p0938p0224p0830o7973o2038
55868A784197n8458n7624n4729m9545m6744m6462m3973l8947l5995l5750l4200
55857A281770l0970k9741l0317k8734k5308k4273k5406k4229k0640j9107k0194
55846A002851k0067j8559j9432k2258k2266j9057j7400j8516j8427j6041j5087
$$ plain form
55915 19431191 17690275 16156961 14809978 13619212 12557884 11613881 10777278 10028863
55907 10028863 9351033 8738200 8186660 7684854 7222421 6798506 6412575 6056631 5724260
55898 5724260 5417916 5139555 4882791 4641415 4417074 4211638 4020333 3839220 3671432
55889 3671432 3519375 3378338 3244194 3119943 3008273 2904813 2805149 2711834 2628154 2551146
55879 2551146 2476696 2405520 2338303 2270723 2199160 2126200 2055262 1985038 1914208 1846235 1784197
55868 1784197 1725739 1668115 1613386 1563841 1517097 1470635 1426662 1387715 1351720 1315970 1281770
55857 1281770 1250800 1221059 1190742 1162008 1136700 1112427 1087021 1062792 1042152 1023045 1002851
55846 1002851 982784 964225 944793 922535 900269 881212 863812 845296 826869 810828 795741
55835G95741j6612j7039j5197j4222j4948j4248j1523j0207j1203j1205r142q043
55823F42152q929q982p468p441r767j1147r955q692q904q804p532o793o745n179
55809E25814k108m02o35q4K110L686M101N634Q491R885R249R448J1405J2376J0921
55794F09891Q929P326M471K60k811m181o364j0071j2673j2978j3133j4223j4403
55781E40040j3066j2563j3938j4967j4203j3120j2627j1162q024m946k793k34
55769D18397K974M871M730M057L048j49n380r556j1168j2032j3186j2899j0313
55756C63394p319n211k922j54J331J082J070J851J220j677m385n130n345o461
55742C31344p414p191o756o585n356k814j023j112j631j584k045l316l617k334
$$ plain form
55835 795741 779129 762090 746893 732671 717723 703475 691952 681745 670542 659337 650195 642152
55823 642152 633223 624241 616773 609332 599565 588418 578463 569771 560867 552063 544531 537738 530993 525814
55809 525814 523706 523304 522669 522585 524695 528381 532482 538116 546607 556492 565741 575189 586594 598970 609891
55794 609891 618820 626146 630617 630877 628066 623885 617521 607450 594777 581799 568666 554443 540040
55781 540040 526974 514411 500473 485506 471303 458183 445556 434394 426370 421424 418631 418397
55769 418397 421371 426242 430972 435029 438077 437928 432548 422992 411824 399792 386606 373707 363394
55756 363394 356075 350864 347942 347788 349119 350201 351271 353122 354342 352665 348280 343150 337805 331344
55742 331344 323930 316739 309983 303398 298042 295228 294205 293093 291462 289878 287833 284517 280900 278566
55728B78566j507k449l742m167m541n139m515k653k010l517m603l263j070q1L44
55713B35653J384K222K030K011L222M523M689M350M067K850M12j474j701j723
55699B62515k901m319m916n431o402o597n387m371m739n237m527l341k528j269
55685B00550P84J982J362O22J396K633K826K727L646M886N103M496L715K299L2
55670B39059j774k212k288k897l174k478j916k122j662L10J993J763J052J976
55656B25630L804M359L545K995L275L711M093M609M825M367L747L187J832o26
55642B73353k942m206n204o583p445p229p142q066q814q286p494p525p289n556
55628A79572l556l192l930l768k303o78N46J463J612O39n56r18p87r95j362j416
$$ plain form
55728 278566 277059 274610 270868 266701 262160 257021 252506 249853 247843 244326 239723 236460 235390 235309 235653
55713 235653 237037 239259 241289 243300 246522 251045 255734 260084 264151 267001 267413 265939 264238 262515
55699 262515 259614 255295 250379 244948 238546 231949 226562 222191 217452 212215 207688 204347 201819 200550
55685 200550 201334 203316 204678 205300 206696 209329 212155 214882 218528 223414 228517 233013 236728 239027 239059
55670 239059 237285 235073 232785 229888 226714 224236 222320 220198 218536 218846 220839 222602 223654 225630
55656 225630 229434 233793 237338 240333 243608 247319 251412 256021 260846 265213 268960 272147 273979 273353
55642 273353 270411 266205 261001 254418 246973 239744 232602 224536 215722 207436 199942 192417 185128 179572
55628 179572 176016 172824 168894 165126 162823 162145 162691 164154 165766 166405 165849 164931 164144 163149 161787 160371
55612A60371j500j851j823j252j268k332l045k377j516j811k486k236j576j584
55598A33714j711r25O0j53j315k088k037j468l13J147J613M68r20j090m79kQ24
55581A25325K514L885L728K895K794L064K790K675L795N337N880N900O734Q026
55567A85342Q434Q023P687P020N062K476P10m15k186m578o465p669q801r534r017
55552A76089p524n920m154k054p51j315k686l098k727k818l008k028m03R4n51
55537A37146p04L4L77j24m29j00J19rJ77O50N38k93j056j546k217k858k730k047
55519A24928j711j695j271o15n97j041r95n27n65j040r62l78m17j259j717j189
55503A08949m69l24n31n95l33L33J177J413O68j89k23J00j44o92p85p55j232j474
$$ plain form
55612 160371 158871 157020 155197 153945 152677 150345 147300 144923 143407 141596 139110 136874 135298 133714
55598 133714 132003 131078 131138 130985 129670 127582 125545 124077 123764 124911 126524 126992 126072 124982 124503 124501 125325
55581 125325 127839 131724 135452 138347 141141 144205 146995 149670 153465 158802 164682 170582 177316 185342
55567 185342 193776 201799 209486 216506 221568 224044 224754 224339 222153 217575 211110 203441 194640 185106 176089
55552 176089 168565 162645 158491 156437 155686 154371 151685 148587 145860 143042 140034 138006 137603 137697 137146
55537 137146 136442 136476 136853 136729 136300 136200 136319 136310 136487 137137 137675 137382 136326 134780 132563 129705 126975 124928
55519 124928 123217 121522 120251 119636 119039 117998 117003 116476 115911 114871 113909 113531 113114 111855 110138 108949
55503 108949 108480 108156 107625 107030 106697 107030 108207 109620 110288 110099 109876 109976 109832 109140 108355 107600 106368 104894
55485A04894m23J109J353L54j94K54N83K53L1K61L07l6k12j40k23k03M18R28J43
55466A09457j463k187j678j196j268j035k52N8n65j249j336j139p95R3J228J570
55450I8243R85N83J030J754K089J958J287N7r98j103p80j069j614j161J37Q02
55434A02200M33J35M04M50k4k61q8l26j087j374q58l77k50K26J139J544J213J094
55416A04193J487J506Q77N96J072J359Q89L65K35j29r97j610j657j833k253j949
55400A02151p04K63K67P4J42l31j548k127j178J74O12N14Q31J414J787K220K816
55383A07377K718J596O85J031J785J543L95o68j413k069k281j723j043r68j073
55368A05892o42n8k19j104j933k280k109j322j25P50R86J102J333R92j72j041
$$ plain form
55485 104894 104471 105580 106933 107287 107093 107347 107930 108183 108214 108475 108782 108746 108534 108394 108171 107968 108386 109314 109457
55466 109457 107994 105807 104129 102933 101665 100630 100378 100436 99871 98622 97286 96147 95352 95445 96673 98243
55450 98243 99228 99811 100841 102595 104684 106642 107929 107986 106988 105885 105105 104036 102422 101261 101398 102200
55434 102200 102633 102768 103172 103622 103598 103337 103249 102923 101836 100462 99604 99227 98977 99203 100342 101886 103099 104193
55416 104193 105680 107186 108063 108659 109731 111090 111979 112344 112579 112450 111453 109843 108186 106353 104100 102151
55400 102151 101447 101710 101977 102051 102193 101862 100314 98187 97009 97183 97795 98309 99140 100554 102341 104561 107377
55383 107377 110095 111691 112376 113407 115192 116735 117130 116462 115049 112980 110699 108976 107933 106965 105892
55368 105892 105250 105192 104973 103869 101936 99656 97547 96225 96100 96850 97836 98938 100271 101263 101091 100050
55352A00050o75K03L86L7Q8N24O50M27K19k76j459k543k327j074l18o94j216q47
55334I1155J70R50J099Q43N73N03O04O17L54j39o83j078j043m34M21J013J261
55317I6186J363J151L77l97k33O50Q90n0j020q91j10K48N8r8k6R5L29P60J145
55298A00427J348J541J604J006j73r04n94K8Q9j32N6N16O56M66K17k31r58j370
55280A03592r59k44k2k10k63k35m68p33o04l84o21j038r07k42K83M39N83Q29R75
55261I9771J094J408J621J204L30k63l78n83j218j814j779j130l07L54P34P11
55245I9755K16m62o06K56J512J767M97j000j114k0P10M91L03P25Q34j23j234j171
55227A01336r4P30O75J71k46l70k29j04l68q07o78J45P81O57M10P31J148Q82J64
$$ plain form
55352 100050 99375 99578 99964 100001 100089 100613 101263 101690 101909 101633 100174 97631 95304 94230 93912 93218 92002 91155
55334 91155 91325 92275 93374 94217 94790 95293 95897 96514 96868 96729 96046 94968 93925 93491 93912 94925 96186
55317 96186 97549 98700 99077 98680 98447 99097 99987 99937 98917 98026 97916 98164 98222 98124 98098 98193 98522 99282 100427
55298 100427 101775 103316 104920 105926 105753 104849 104255 104283 104372 104240 104296 104812 105468 105934 106151 105920 104962 103592
55280 103592 102633 102389 102367 102157 101894 101659 101191 100458 99854 99470 98849 97811 96904 96662 96945 97384 97967 98796 99771
55261 99771 100865 102273 103894 105098 105428 105165 104787 104204 102986 101172 99393 98263 97956 98310 99044 99755
55245 99755 99971 99509 98903 99159 100671 102438 102935 101935 100821 100801 101511 102002 102305 103030 103864 103741 102507 101336
55227 101336 101242 101972 102647 102818 102572 102202 101973 101869 101501 100694 100016 100161 100942 101599 102009 102740 103888 104770 104934
55208A04934k70l83m59j64Q78J942J821M80r32j523j261m23N88J148J013Q25J157
55191A09371J418O33q87j792j503p25j50K37M41J25o52j181j044p21q63j362j538
55174I9807r55J44J042J154N75q2l67k79J26P92J189N68p54j208P3J861K343J452
55156A07481N72L61K38j01j07M66J010J012O61J78n28j205j175m19N9l84j000
55139A07119o58N42J431J312O17J10K7J76M14O24N43Mo19o77q9L90J24m79n09
55120A10402K00R31J135R31N10j54q38r96n50j29j57l19k71k07k40K3O86J097
55102A12054Q11M17O06J088J175R14P30M54k72r76q11R2O92M52j33l97k08K13
55084A16901N58M97N5k39r5o6p42j628j685q36k2K39M06Q73J267J125O19J85j21
$$ plain form
55208 104934 104664 104281 103822 103658 104536 106478 108299 108779 107847 106324 105063 104640 105228 106376 107389 108214 109371
55191 109371 110789 111422 110535 108743 107240 106515 106365 106602 107043 107168 106516 105335 104291 103570 102707 101345 99807
55174 99807 98852 98996 100038 101192 101767 101685 101318 101039 101165 101957 103146 103714 102960 101752 101825 103686 106029 107481
55156 107481 108053 108414 108652 108551 108444 108910 109920 110932 111593 111771 111243 110038 108863 108444 108503 108119 107119
55139 107119 106461 107003 108434 109746 110363 110473 110500 110676 111090 111714 112257 112261 111642 110965 110876 111266 111390 110911 110402
55120 110402 110602 111533 112668 113599 114109 113955 113117 112121 111571 111442 111285 110966 110695 110488 110248 110271 110957 112054
55102 112054 112865 113282 113888 114976 116151 117065 117795 118249 117977 117001 116190 116282 116974 117426 117293 116896 116688 116901
55084 116901 117459 117956 118011 117772 117677 117611 116869 115241 113556 112720 112698 112937 113343 114216 115483 116608 117227 117412 117291
55065A17291n55j165j675j657r04K18Q98O42j69p67q55o43k68K67P74R42Q03O48
55047A13825O09N72M94M15K47r5m45n65m31j87L3Q1j27l28q6M91P16K26n44j107
55027A13794j501j718j308j93P69P86K37L1L15O37R38J472J979J851J054J88l37
55010A18994n12l62N2L43J51l68q02r66p75n2R70J562J476J404J806J992J296
54993A26209L94L85J128J640J685J662J416N37m26m54K97P13N27N01P60M71n68
54976A36877j324j058k87K50N73R02J044Q07L14l86j296j923j613o19O1J41L02
54959A32765P88Q61J50n41l90K64N79L34j68o92j018p93k7O89Q43N18N3l31l90
54940A33494R7Q11R95L48n86j140j127o69K6N86P72Q94J375J982K132J957K157
$$ plain form
55065 117291 116736 115571 113896 112239 111335 111553 112451 113093 112924 112157 111302 110659 110391 110658 111432 112374 113177 113825
55047 113825 114434 115006 115500 115915 116162 116067 115622 115057 114626 114439 114472 114553 114426 114098 114012 114503 115219 115445 114901 113794
55027 113794 112293 110575 109267 109074 109843 110629 110866 110897 111212 111849 112787 114259 116238 118089 119143 119331 118994
55010 118994 118482 118120 118172 118515 118666 118298 117496 116530 115755 115703 116673 118235 119711 121115 122921 124913 126209
54993 126209 126603 126988 128116 129756 131441 133103 134519 135056 134630 134176 134473 135186 135713 136214 136974 137445 136877
54976 136877 135553 134495 134208 134458 135031 135933 136977 137784 138098 137712 136416 134493 132880 132261 132322 132463 132765
54959 132765 133553 134414 134564 134023 133633 133897 134476 134810 134642 133950 132932 132139 132112 132801 133644 134162 134215 133884 133494
54940 133494 133591 134402 135397 135745 135159 134019 132892 132223 132249 132835 133607 134501 135876 137858 139990 141947 144104
54923A44104K800L258L475M153N401O234N988N208M578L881K710J378L56n81j889
54908A91054l390m550n229n598n628n277m794m381l819k849j682p57k77j87l99
54893A42237p53j055j277j421j242n46L08P45Q48J184J773K016J809J854K600
54878A49080L596M277M714N209N773O262O480N936M217J841p3j196k296l841n169
54863A84810n498m941m089l361l088l456l890l423k112j209j376j738j319m92
54849A44818j37l26o81j260k104k610k351j875j762j521n14O13O67k44q78o88
54833A29147l53m31n95m62k80l87o25o12k48K84P64J059J137J005O58K82L82J184
54815A31909J878J224p39k332k176q38J28K03O2K32M92N17K68j96o80p31j65M44
$$ plain form
54923 144104 146904 150162 153637 157790 163191 169425 175413 180621 185199 189080 191790 193168 193524 192943 191054
54908 191054 187664 183114 177885 172287 166659 161382 156588 152207 148388 145539 143857 143100 142823 142636 142237
54893 142237 141484 140429 139152 137731 136489 135943 136251 136996 137844 139028 140801 142817 144626 146480 149080
54878 149080 152676 156953 161667 166876 172649 178911 185391 191327 195544 197385 197312 196116 193820 189979 184810
54863 184810 179312 174371 170282 166921 163833 160377 156487 153064 150952 149743 148367 146629 145310 144818
54849 144818 144681 144355 143674 142414 140310 137700 135349 133474 131712 130191 129677 130290 130957 130713 129835 129147
54833 129147 128794 128363 127768 127306 127026 126639 126014 125402 125154 125438 126202 127261 128398 129403 130061 130343 130725 131909
54815 131909 133787 135011 134272 131940 129764 128926 129054 129257 129319 129551 130043 130560 130828 130632 129952 129221 129056 129500
54797A29500M28N0J72R29J440J021R0m02j38L19K69l08p77o29n2N42J171J985
54779A35610K509K065R82N02J114J901K013J919K464L502M331M835N257N399N023
54764A79426M641M892N333M972L789K768K283J591J16j642k907l634m252m831
54750A92545n041m766m374m330m590m535l647k259j296j179j362j172o68l22k63
54735A52741l09m09o15p62n80kQ72J861K590K746K666L102M093M668M168L215
54719A80045K796K955L103L034K823K153P05j087k526l687n073o433o804n804
54705A66200m123k646j711j234r93p39n13p21j458j993j559m69K25M6n65j109
54689A46638j482j622j458j234j239j271r47n16n52r24q41r9N05K84m75r91q84
$$ plain form
54797 129500 129928 129978 130150 131079 132519 133540 133630 133228 133090 133409 133678 133370 132593 131964 131912 132454 133625 135610
54779 135610 138119 140184 141166 141668 142782 144683 146696 148615 151079 154581 158912 163747 169004 174403 179426
54764 179426 184067 188959 194292 199264 203053 205821 208104 209695 209811 208169 205262 201628 197376 192545
54750 192545 187504 182738 178364 174034 169444 164909 161262 159003 157707 156528 155166 153994 153326 153004 152741
54735 152741 152432 152023 151408 150646 150066 150064 150936 152797 155387 158133 160799 163901 167994 172662 176830 180045
54719 180045 182841 185796 188899 191933 194756 196909 197614 196527 194001 190314 185241 178808 172004 166200
54705 166200 162077 159431 157720 156486 155493 154754 154241 153520 152062 150069 148510 148041 148266 148312 147747 146638
54689 146638 145156 143534 142076 140842 139603 138332 137385 136869 136317 135393 134552 134453 134958 135242 134767 133776 132892
54672A32892k67N30J034Q13o9j005j402j150n62o5P2q9j73P1N04Q36R57Q01K74
54653A34002l81n42L9P86J019Q00N01Q4n35q48l39N19P82M02J73L86N07K91K05
54634A37851N00O48K19l65l92J91P48N70n10j869k399j521R7J217J383J116Q98
54617A38382N73q7q66j303j125l87M36P24L82J42N83J227J264R22J096J733J707
54600A45403O10m97n47J81P55Q97Q99Q25N21J13j29k65n74j024j283j092n42J7
54582A44268K13o4n38r11j196j488j483p58N21J609J976J708J104L66k58n18m69
54565A44082l35n2N98J380J668J249N57K4k88l30J0M41L16m74j147r36QQ93J099
54546A48763N41l94j014p29L84J581K202K180J859J569J446J322P87k55j171j176
$$ plain form
54672 132892 132625 133155 134189 135002 134933 133928 132526 131376 130814 130749 130821 130732 130559 130630 131134 131970 132927 133728 134002
54653 134002 133621 133079 133118 133904 134923 135723 136224 136308 135773 134925 134586 135105 135887 136289 136462 136848 137355 137646 137851
54634 137851 138351 138999 139218 138853 138461 138652 139400 139970 139460 137591 135192 133671 133768 134985 136368 137484 138382
54617 138382 138955 138868 138002 136699 135574 135187 135623 136347 136729 136871 137454 138681 139945 140867 141963 143696 145403
54600 145403 146013 145516 144969 145150 145905 146802 147701 148526 149047 149160 149031 148766 148192 147168 145885 144793 144251 144268
54582 144268 144481 144417 143879 142968 141772 140284 138801 138043 138564 140173 142149 143857 144961 145327 145069 144551 144082
54565 144082 143747 143695 144293 145673 147341 148590 149147 149171 148883 148553 148563 149004 149320 148846 147699 146763 146771 147664 148763
54546 148763 149304 148910 147896 147167 147551 149132 151334 153514 155373 156942 158388 159710 160497 160242 159071 157895
54530A57895l51M33O18M27J89j42n66p52n27k26k01l29k90j8L01M45K51k19n80
54511A56358n55m59p38j147r92l05M9l65q54n98K70J030J312J178O91o3o88p74
54493A53350l86k2j06o46j209j188l76O79J139Q15L18K49N58Q39R44J024J250
54476A57232J549J610J243Q33J127K195K993K500J040j69n18l56r4J16j10j104
54460A70087k241k288r45P38J770K158K210J794Q17k92j070j478j532j143o15
54445A67970n58j006j297j109q76q77q00n39n15p09l80O42J348J018L63K87M32
54428A63394m7q87j084m42L38Q62J295J612J525J147R44R16N68k30r02q68k10
54411A67931M50O24M53N08R22J004K39n85k48R63J348K02j113j166k76M96J022
$$ plain form
54530 157895 157544 157977 158595 159022 159211 159069 158503 157751 157224 156998 156797 156468 156178 156160 156461 156906 157157 156938 156358
54511 156358 155803 155344 154606 153459 152467 152162 152211 151846 150992 150394 150664 151694 153006 154184 154875 154812 154124 153350
54493 153350 152964 152942 152836 152190 150981 149793 149417 150096 151235 152050 152368 152617 153175 154014 154958 155982 157232
54476 157232 158781 160391 161634 162467 163594 165789 168782 171282 172322 172153 171635 171279 171185 171301 171191 170087
54460 170087 167846 165558 164613 165351 167121 169279 171489 173283 174100 173808 172738 171260 169728 168585 167970
54445 167970 167412 166406 165109 164000 163124 162247 161447 160908 160393 159684 159304 159946 161294 162312 162675 162962 163394
54428 163394 163347 162460 161376 160934 161272 162134 163429 165041 166566 167713 168657 169573 170141 169911 169009 168141 167931
54411 167931 168381 169005 169458 169966 170888 171892 172131 171546 171298 172261 173609 173811 172698 171532 171256 171752 172774
54394A72774J602J821J269O77R45J564J449P91O36R22N09p99j832j789j145n36
54378A78858LM16K70n07j312j616j375o39M31J188J011L34K79J090J919K158K036
54361A84544J684Q07l68q70l24M26N40K55J51J99J97L75Q51J063N40k63o33o63
54343A88511q98j251j139n66k84p67j565j830j188J0J003J193N41m66j262j558
54327A78484j405j088r53j075j125p93k58J08L44P09R83N86m32j198j128o45m28
54310A70686m76l75q9P3K2j3J34L72M75K07m05q49n45K77O19l4r73j207p85m74
54290A66640n19m25L4L92K60q0j19K09N99Q74J051J134J064Q36N10J83K5J87N16
54271A73371N23j03r47j196n93J70K43l73q90p30q9N06Q05Q67Q00P51Q87J129
$$ plain form
54394 172774 174376 176197 177466 178143 179088 180652 182101 182892 183528 184450 184959 184160 182328 180539 179394 178858
54378 178858 178861 179277 179547 179040 177728 176112 174737 174098 174529 175717 176728 177062 177341 178431 180350 182508 184544
54361 184544 186228 187035 186667 185797 185473 185899 186439 186694 186845 187044 187241 187616 188467 189530 190070 189807 189174 188511
54343 188511 187613 186362 185223 184657 184373 183606 182041 180211 179023 179033 180036 181229 181770 181304 180042 178484
54327 178484 177079 175991 175038 173963 172838 172045 171787 171895 172239 172948 173931 174517 174085 172887 171759 171114 170686
54310 170686 170210 169835 169746 169819 169841 169828 169962 170334 170809 171016 170611 169762 169217 169494 170113 170079 169106 167899 167114 166640
54290 166640 166121 165696 165730 166122 166382 166302 166183 166392 166991 167865 168916 170050 171114 171950 172460 172643 172668 172855 173371
54271 173371 173894 173791 172844 171648 171055 171225 171468 171095 170205 169475 169386 169892 170697 171564 172364 173115 174002 175131
54253A75131J120P45M47O72J191J391J142R39J122J381J147K13j102k140k281
54238A81118j456l08L60L36n3n85j260j881k050j755j397j121o02K20Q01P05K44
54221A71316o5k47n61p59l28O69J528J731J392Q94N35M82O61O34P9o03o58n9L36
54202A76977j1n94o99m74n32q66r11n68l83n80o34q7P49J268J349J192P99J41
54184A76136m56n95m23m51q06j099j047q06n78l11J09O34J080J234R21K44l27
54167A73459m11k13j58k13n8J53j41r36j448j161n02j18%K07N29P01O43M53K16
54148A71002J10L80Q43Q21%j026j494j357r82m24L55R25Q25M04M29R47J228Q77
54130A73863L63K52M90O62N35J59k05k26J62N89P04P03R90J389J238L51o09q76
$$ plain form
54253 175131 176251 176996 177443 178115 179306 180697 181839 182778 183900 185281 186428 186641 185539 183399 181118
54238 181118 179662 179354 179714 180050 179997 179412 178152 176271 174221 172466 171069 169948 169346 169566 170367 171072 171316
54221 171316 171251 171004 170443 169684 169356 170025 171553 173284 174676 175570 176105 176587 177248 177882 177961 177358 176700 176641 176977
54202 176977 176966 176372 175673 175199 174667 173801 172890 172322 171939 171359 170725 170638 171387 172655 174004 175196 175995 176136
54184 176136 175680 175085 174662 174211 173405 172306 171259 170453 169875 169564 169673 170307 171387 172621 173542 173786 173459
54167 173459 173048 172835 172677 172464 172406 172559 172418 171482 170034 168873 168371 168253 168253 168460 168989 169690 170333 170786 171002
54148 171002 171112 171492 172335 173156 173156 172130 170636 169279 168297 167873 168228 169153 169978 170382 170811 171758 172986 173863
54130 173863 174226 174478 174968 175630 176165 176324 176119 175893 176055 176644 177348 178051 179041 180430 181668 182019 181410 180534
54112A80534l12O32J351J430R59N38O03P70L28o70j394j329q11l12J64O50Q13
54095A83944M23j49l87k90j83j77k29m73j001j416j070K34K006L492M138L745
54079A92607K592J420R73J380K137K711L031L395M044M960N880O399O293N844
54065B43666N699O088O267N187K717j49k464m225n777o810o708n629m528l988
54051B29346l716l271k599j704n10O44J064P22N34J145K105K761L269L958M403
54036B38151M172M017N046O885P796O833M919L516L084L179L359L466L425L216
54022C01064K837K234J497J074J291J719J538N22p74j822k549l022l320l806m777
54007B93706n752n789m814l900l836m067l550k198q75k75k89l27J01J037K078
$$ plain form
54112 180534 180222 180854 182205 183635 184594 185132 185735 186505 186833 186163 184769 183440 182629 182317 182481 183131 183944
54095 183944 184367 184218 183831 183541 183358 183181 182952 182479 181478 180062 178992 179226 181232 184724 188862 192607
54079 192607 195199 196619 197592 198972 201109 203820 206851 210246 214290 219250 225130 231529 237822 243666
54065 243666 249365 255453 261720 266907 269624 269475 267011 262786 257009 250199 243491 237862 233334 229346
54051 229346 225630 222359 219760 218056 217546 218190 219254 219976 220510 221655 223760 226521 229790 233748 238151
54036 238151 242323 246340 251386 258271 266067 272900 277819 281335 284419 287598 290957 294423 297848 301064
54022 301064 303901 306135 307632 308706 309997 311716 313254 313776 313002 311180 308631 305609 302289 298483 293706
54007 293706 287954 282165 277351 273451 269615 265548 261998 259800 258925 258650 258361 258034 258135 259172 261250
53992B61250K776L114L370L528L212K261J071J12n51j107j687k374l242m149m720
53977B62864m688m184l606l353l546l835l549k418j003j11P4q5m18r81j483j368
53961B28310n78L38R39J230J268J086J017J435K058K142J547R42Q61J168J588
53946B45351K060K323K027J475J494K265K995L226L555M488N371N204M064K986
53932B88884K762L370M237M652M226L413L207M067N516O944Q233R420J0475J1770
53918C71176J3813J6123J7324J6958J6218J5897J4722J1020N333l0l702o072p623
53905D81157q059p352o396n999o057o112o061n935n633n233n057n204n382n412
53891C97265n474n705o012o417p090p878q235p838o893n793m811m218m207m531
$$ plain form
53992 261250 264026 267140 270510 274038 277250 279511 280582 280694 280143 279036 277349 274975 271733 267584 262864
53977 262864 258176 253992 250386 247033 243487 239652 236103 233685 232682 232571 232645 232560 232142 231161 229678 228310
53961 228310 227732 228070 229009 230239 231507 232593 233610 235045 237103 239245 240792 241734 242595 243763 245351
53946 245351 247411 249734 251761 253236 254730 256995 259990 263216 266771 271259 276630 281834 285898 288884
53932 288884 291646 295016 299253 303905 308131 311544 314751 318818 324334 331278 339511 348931 359406 371176
53918 371176 384989 401112 418436 435394 451612 467509 482231 493251 498584 498554 494852 488780 481157
53905 481157 473098 465746 459350 453351 447294 441182 435121 429186 423553 418320 413263 408059 402677 397265
53891 397265 391791 386086 380074 373657 366567 358689 350454 342616 335723 329930 325119 320901 316694 312163
53877C12163m582m156l761l952m592n024m824m160l488l123l070l186l381l513
53863B57351l293k538j619j240j571k008k016j821j838j924j724j455j617k093
53849B30594k280k043j819j686j155j19O84N85r9n04k68K54N67M77J16j60k3M70
53831B23591P87M64l53j002r72l08N62J191J347J089P08N21N67N93L90J56K65
53814B29596P71J332J723K089K485K602K264J962K317L232M066M573N035N536
53800B69583N810N854O009O226O008N277M653M448M159L384K566K250K254K143
53786C30624J962J809J253rj357j938j836j793k059k347k646l217l897m313m640
53771C05596n259n752n172l556k179k001k550k871k864l111l785m344m242l514
$$ plain form
53877 312163 307581 303425 299664 295712 291120 286096 281272 277112 273624 270501 267431 264245 260864 257351
53863 257351 254058 251520 249901 248661 247090 245082 243066 241245 239407 237483 235759 234304 232687 230594
53849 230594 228314 226271 224452 222766 221611 221492 222176 222761 222662 222158 221890 222144 222711 223188 223304 223144 223121 223591
53831 223591 224378 224842 224489 223487 222515 222207 222769 223960 225307 226396 227104 227625 228192 228785 229175 229331 229596
53814 229596 230367 231699 233422 235511 237996 240598 242862 244824 247141 250373 254439 259012 264047 269583
53800 269583 275393 281247 287256 293482 299490 304767 309420 313868 318027 321411 323977 326227 328481 330624
53786 330624 332586 334395 335648 335639 334282 332344 330508 328715 326656 324309 321663 318446 314549 310236 305596
53771 305596 300337 294585 289413 285857 283678 281677 279127 276256 273392 270281 266496 262152 257910 254396
53757B54396k599j860j389j132j037r56o47j65j05r93k347k970k337j155k80K08
53741B34632M84K99m04q85m96K82N66M42N97R21O34l09j006q93k72N33J522K357
53723B39004K390J725J357J810K431K486K153J908J623J024N23Q09J823K758L093
53708B66917L115L382L936M215L731K685J806J519J598J820K476L768N053N411
53694C11432M863M303M218M132L465K351J336O98K76k58j058j795j920j474j259
53679C29310j720k137j643o42k49o18q64o20m43n89n96l28m00j050j583j420p77
53662C13631J0R77J821J745N99o55j269j615k156k421j865r92n85m70K7P80J047
53645C08609O66K33K07N50J064J535J715J597J501J482J176O70Q46K156L594L811
$$ plain form
53757 254396 251797 249937 248548 247416 246379 245423 244776 244611 244506 243513 241166 238196 235859 234704 234424 234632
53741 234632 235116 235415 235011 234126 233630 233912 234478 234920 235517 236438 237072 236763 235757 234864 234592 235125 236647 239004
53723 239004 241394 243119 244476 246286 248717 251203 253356 255264 256887 257911 258434 259243 261066 263824 266917
53708 266917 270032 273414 277350 281565 285296 287981 289787 291306 292904 294724 297200 300968 306021 311432
53694 311432 316295 320598 324816 328948 332413 334764 336100 336798 337074 336816 335758 333963 332043 330569 329310
53679 329310 327590 325453 323810 323168 322919 322301 321437 320817 320374 319785 319189 318861 318461 317411 315828 314408 313631
53662 313631 313641 314618 316439 318184 318783 318128 316859 315244 313088 310667 308802 307810 307225 306755 306782 307562 308609
53645 308609 309275 309508 309715 310265 311329 312864 314579 316176 317677 319159 320335 321005 321851 324007 327601 331412
53629C31412K842J833J409J324J504K262L396M025L643K723K015J881K354L269
53615C65892M088M222L778L545M033M915N562N760N684N564N547N664N752N610
53601D35616N274M939M677M434M309M467M745M683M019K914J649L96o85j408j847
53586D78182k431l499m813n650n519m721m106m205m719m979m693m028l181k311
53572D19327j762j823k129j963j288q47r63r62l06L98K27o17j039n07M48J117
53556D07311J379J477J580J673J582J119M38P7L38Q84J256J587K231K953L154
53541D29039K860K795L337M032M378M607N312O597P918Q725R000R157R519R994
53527E17270J0320J0532J0942J1685J2526J3268J3989J4788J5624J6557J7728
$$ plain form
53629 331412 334254 336087 337496 338820 340324 342586 345982 350007 353650 356373 358388 360269 362623 365892
53615 365892 369980 374202 377980 381525 385558 390473 396035 401795 407479 413043 418590 424254 430006 435616
53601 435616 440890 445829 450506 454940 459249 463716 468461 473144 477163 480077 481726 482122 481437 480029 478182
53586 478182 475751 472252 467439 461789 456270 451549 447443 443238 438519 433540 428847 424819 421638 419327
53572 419327 417565 415742 413613 411650 410362 409515 408552 407590 407284 407682 407909 407292 406253 405746 406194 407311
53556 407311 408690 410167 411747 413420 415002 416121 416559 416636 416974 417858 419114 420701 422932 425885 429039
53541 429039 431899 434694 438031 442063 446441 451048 456360 462957 470875 479600 488600 497757 507276 517270
53527 517270 527590 538122 549064 560749 573275 586543 600532 615320 630944 647501 665229
53516F65229J8880J9422J9297J9369K0466K2440K4606K6615K8290K9117K8747
53505I22478K7791K7233K7220K7127K6714K6358K6130K5585K4674K4041K4043
53494A209394K4107K3471K2190K1000K0532K0873K1610K2092K1918K1293K0691
53483A449171K0211J9628J8927J8341J7850J7168J6240J5259J4104J2424J0328
53472A629651Q362O574M302J272j782m096o013q504j1821j5163j7549j8654j8872
53459A547707j8906j9210j9719k0194k0768k1833k3276k4408k4875k5121k5614
53448A303783k6026k5720k4658k3297k1880k0377j9023j8152j7514j6325j4160
53437A076651j1434q860o734m950l376j980p34M57J734L208M848O463P932R391
$$ plain form
53516 665229 684109 703531 722828 742197 762663 785103 809709 836324 864614 893731 922478
53505 922478 950269 977502 1004722 1031849 1058563 1084921 1111051 1136636 1161310 1185351 1209394
53494 1209394 1233501 1256972 1279162 1300162 1320694 1341567 1363177 1385269 1407187 1428480 1449171
53483 1449171 1469382 1489010 1507937 1526278 1544128 1561296 1577536 1592795 1606899 1619323 1629651
53472 1629651 1638013 1644587 1648889 1650161 1648379 1644283 1638270 1629766 1617945 1602782 1585233 1566579 1547707
53459 1547707 1528801 1509591 1489872 1469678 1448910 1427077 1403801 1379393 1354518 1329397 1303783
53448 1303783 1277757 1252037 1227379 1204082 1182202 1161825 1142802 1124650 1107136 1090811 1076651
53437 1076651 1065217 1056357 1049623 1044673 1041297 1039317 1038583 1039040 1040774 1043982 1048830 1055293 1063225 1072616
53423A072616J0984J2577J3926J5081J6399J8054J9835K1455K2855K4161K5528
53412A273471K7149K9152L1413L3588L5506L7326L9192M0998M2661M4371M6297
53401A681124M8247M9986N1691N3695N5865N7753N9364O1142O3036O4228O4296
53390B310427O4025O4414O5229O5332O4248O2524O0514N7746N3905M9684M6013
53379B964061M2895L9625L5882L1962K8026K3752J8906J3752Q695L685j723p842
53367C201676j4526k1502k8816l6762m5146n2920n8922o2942o5629o7401o8011
53356B679099o7348o6077o4981o4098o2989o1510n9875n8128n6214n4365n2918
53345B010596n1797n0664m9528m8691m8020m6879m4928m2502l9957l7091l3602
$$ plain form
53423 1072616 1083600 1096177 1110103 1125184 1141583 1159637 1179472 1200927 1223782 1247943 1273471
53412 1273471 1300620 1329772 1361185 1394773 1430279 1467605 1506797 1547795 1590456 1634827 1681124
53401 1681124 1729371 1779357 1831048 1884743 1940608 1998361 2057725 2118867 2181903 2246131 2310427
53390 2310427 2374452 2438866 2504095 2569427 2633675 2696199 2756713 2814459 2868364 2918048 2964061
53379 2964061 3006956 3046581 3082463 3114425 3142451 3166203 3185109 3198861 3207556 3211241 3209518 3201676
53367 3201676 3187150 3165648 3136832 3100070 3054924 3002004 2943082 2880140 2814511 2747110 2679099
53356 2679099 2611751 2545674 2480693 2416595 2353606 2292096 2232221 2174093 2117879 2063514 2010596
53345 2010596 1958799 1908135 1858607 1809916 1761896 1715017 1670089 1627587 1587630 1550539 1516937
53334A516937k9870k6766k4678k3035k0953j8193j5350j3150j1814j1118j0942
53323A311068j1375j2317j3185j3226j2091j0057p855o246n537n363n044m107
53311A204665k440j06K463M383N045N044N718P531R646J1332J2981J5151J7415
53298A298828J9063K0353K2106K4392K6547K8283K9825L1031L1402L1078L0938
53287A593846L1410L1865L1435K9857K7338K4248K1192J8746J6741J4306J0944
53276A851928P161L712O62k431n768r116j2168j4801j7150j9532k2197k5021k7615
53263A707664k9691l1197l2202l3047l4332l6297l8217l9013l8496l7498l6744
53252A320930l6226l5734l5315l4805l3651l1669k9618k8510k8514k8936k9051
$$ plain form
53334 1516937 1487067 1460301 1435623 1412588 1391635 1373442 1358092 1344942 1333128 1322010 1311068
53323 1311068 1299693 1287376 1274191 1260965 1248874 1238817 1230962 1224716 1219179 1213816 1208772 1204665
53311 1204665 1202225 1202119 1204582 1208965 1214010 1219054 1224772 1232303 1241949 1253281 1266262 1281413 1298828
53298 1298828 1317891 1338244 1360350 1384742 1411289 1439572 1469397 1500428 1531830 1562908 1593846
53287 1593846 1625256 1657121 1688556 1718413 1745751 1769999 1791191 1809937 1826678 1840984 1851928
53276 1851928 1859089 1862801 1863463 1861032 1855264 1846148 1833980 1819179 1802029 1782497 1760300 1735279 1707664
53263 1707664 1677973 1646776 1614574 1581527 1547195 1510898 1472681 1433668 1395172 1357674 1320930
53252 1320930 1284704 1248970 1213655 1178850 1145199 1113530 1083912 1055402 1026888 997952 968901
53241I68901k8637k7898k7082k6268k5315k4080k2523k0559j8056j5371j3446
53230G19666j2784j2519j1361r373p909p689p997q082q259q967r724r928j0149
53217E94925j1413j3558j5208j5360j4299j2916j1744j0843j0051r153q082p052
53205D55246o381o194o399o803p143p185o966o744o579o305o041o272p079p699
53191C61456p318o019m565l530l048l087l399l410k735j686q85m53j01J94J29
53176C21543k94o77p98q45r72j046r67r71j321j906k309k218j810j605j915k378
53160B99511k348j798j411j585j816j490q56o29q83j041r15r55j390j747j554
53145B79093j065q70j055j128o86P3N57M45L9r0J71L62J38j74n5M31Q12J026J495
$$ plain form
53241 968901 940264 912366 885284 859016 833701 809621 787098 766539 748483 733112 719666
53230 719666 706882 694363 683002 673629 665720 658031 650034 641952 633693 624726 615002 605074 594925
53217 594925 583512 569954 554746 539386 525087 512171 500427 489584 479533 470380 462298 455246
53205 455246 448865 442671 436272 429469 422326 415141 408175 401431 394852 388547 382506 376234 369155 361456
53191 361456 354138 348119 343554 340024 336976 333889 330490 327080 324345 322659 321774 321321 321220 321414 321543
53176 321543 321249 320572 319774 318929 317957 316911 315944 314973 313652 311746 309437 307219 305409 303804 301889 299511
53160 299511 297163 295365 293954 292369 290553 289063 288207 287578 286695 285654 284739 283784 282394 280647 279093
53145 279093 278028 277158 276103 274975 274289 274362 274919 275364 275403 275313 275484 275846 275984 275810 275755 276186 276998 278024 279519
53126B79519K246K524J705L10l95K25J541K418K364J732J062N73K69K02L74N49
53110B97218M49Op55j873l121l758l198j946j240j588k216k209j569p63J26J154
53094B74717J888J803J100M67J32j99n72o60m30k92m12m67k62q8j63k13K4L15
53076B76688K88L6j06j71n21j190j638j345m10N42R52P06J17l59m28j96j61o91
53058B72113j499j811j227k23M88P36Q00P69O24O36J022J245M91r74j817j361
53042B70012n24m73j073j382j062m59K07Q27R20J47q32r80l50k1n08j109j072
53025B62268n63j55MQ9K47N92J129J430R41j28p72l94M54Q98P92N28L11J15P7
53006B67863L40O91Q29Q49J040J333J344R46M10j0l50p33j097j261j106o41K7
$$ plain form
53126 279519 281765 284289 285994 286304 285909 286134 287675 290093 292457 294189 295251 295824 296093 296295 296669 297218
53110 297218 297667 297673 296918 295045 291924 288166 284968 283022 281782 280194 277978 275769 274200 273437 273563 274717
53094 274717 276605 278408 279508 279975 280107 279908 279336 278676 278246 277954 277542 277075 276813 276725 276562 276349 276373 276688
53076 276688 276976 277012 276906 276735 276214 275024 273386 272041 271631 272173 273125 273831 273948 273589 273161 272965 272804 272113
53058 272113 270614 268803 267576 267353 267841 268577 269377 270146 270770 271406 272428 273673 274164 273190 271373 270012
53042 270012 269488 269015 267942 266560 265498 265039 265246 266073 266993 267140 266308 265328 264978 264957 264449 263340 262268
53025 262268 261705 261550 261554 261643 261890 262482 263611 265041 265982 265854 265082 264688 265142 266040 266832 267360 267671 267786 267863
53006 267863 268203 268894 269723 270572 271612 272945 274289 275235 275645 275635 275285 274552 273455 272194 271088 270447 270474
52989B70474P34J218J164M95l38o01m9P86J318J683K261K777K608J923J635K000
52973B90088K188J689J331K063L432M097L583K568J641P24k00p13o22l60l72o08
52957C10529q71j191j509j497j102r08j452k390k871k586j980j491j127q58j003
52942B87693j756k678k931k161q91k9j4n28j008j266j429j440r80j60J74o58k021
52925B67917k411j283J84O44L70P06J922K620J664j67j088n31L69M28j92n78m46
52908B70128l90q15j276j118l89K15K44r4m37p30r93r49l02P77J764K266K144
52891B70045J392L28l26j25M15M15j16l41j1N3p04j579j569p90j20J30M01Q98
52873B68396J265J228R83Q26R03J323K030K612K693K459K368K361J974J137L32
$$ plain form
52989 270474 271208 272426 273590 274085 273747 273146 273097 273883 275201 276884 279145 281922 284530 286453 288088 290088
52973 290088 292276 293965 295296 297359 300791 304888 308471 311039 312680 313404 313204 312491 311869 311509 311137 310529
52957 310529 309658 308467 306958 305461 304359 303451 301999 299609 296738 294152 292172 290681 289554 288696 287693
52942 287693 285937 283259 280328 278167 277276 277247 277233 276705 275697 274431 273002 271562 270582 270422 270596 269938 267917
52925 267917 265506 264223 264407 265051 265421 266127 268049 270669 272333 272166 271078 270547 270916 271344 271152 270574 270128
52908 270128 269738 268923 267647 266529 266140 266355 266599 266505 266068 265338 264345 263396 263094 263871 265635 267901 270045
52891 270045 271437 271765 271439 271314 271729 272144 272028 271687 271676 271729 271025 269446 267877 267087 266967 267097 267498 268396
52873 268396 269661 270889 271872 272698 273601 274924 276954 279566 282259 284718 287086 289447 291421 292558 292890
52858B92890j04l19m72m97m34m84o00n62n68j102k028k537k283j995k407l139
52842B73359l274k685k102k011k140k024j599j135q83q92r62p78l06J03J91K40
52826B53102P05J440J721J123O3p56j150j396j534j203k77O45Q73N59N52J231
52810B55698J953J932J239N27R2k19m27l16O7L52L50J15m00j208j802j555p06
52793B55692k62o36j102j031q35j111j480j093L8J115J615J612J184L76l20k38
52777B53524N58J269J410J175P63Qr76j549j370r50q80j002p82k36K09M09N47
52760B52127O06L78j4j76k2J78L31O29R87R50M38K3J81O13Q09Q20R61J101Q97
52741B61817O47J049K018K530J986J043O08O23N03L27O62J384J597R63K46J30
$$ plain form
52858 292890 292786 292467 291995 291498 291064 290580 289980 289418 288850 287748 285720 283183 280900 278905 276498 273359
52842 273359 270085 267400 265298 263287 261147 259123 257524 256389 255506 254614 253652 252874 252568 252671 252862 253102
52826 253102 253807 255247 256968 258091 258154 257398 256248 254852 253318 252115 251838 252483 253356 253915 254467 255698
52810 255698 257651 259583 260822 261349 261441 261222 260795 260479 260546 260898 261248 261363 260963 259755 257953 256398 255692
52793 255692 255430 254794 253692 252661 251826 250715 249235 248142 248180 249295 250910 252522 253706 254082 253762 253524
52777 253524 254082 255351 256761 257936 258699 258707 257731 256182 254812 253862 252982 251980 251198 250962 251171 251580 252127
52760 252127 252733 253111 253097 252921 252899 253077 253408 254037 255024 255974 256412 256435 256616 257229 258038 258858 259819 260920 261817
52741 261817 262464 263513 265531 268061 270047 271090 271698 272321 272824 273151 273813 275197 276794 277757 278003 278133
52725B78133K10j75o72l72N88Q95j40j477j675q12k16n43j062j101j091j633k240
52708B66617k007j132o92r61j077n12J15K31K40O07Q39L97m8N60J824K141Q93
52691B68035o66j046k05Q20J285J222J043J093J372J439Q75m6n29k62K17L52K49
52674B75248K04Q3l60r13j163j058p93l43L66J003J055N29k1j61N1M41J004J661
52656B76833K021J741J102R35J777L133L790L001J261k45q84j011j222j578j743
52641B88911j593j362j219j040o91l16k04l66m40j47L27O60R58J598K453K798
52625B90327K254J344P16L05k48p71r41j092j758k548k429j251p4K20j83p68j371
52608B81732j713j213N3R31N52m59q42l52L07P02R70J107Q52L97L39Q20J266J201
$$ plain form
52725 278133 278343 278168 277496 277124 277712 278607 278467 276990 275315 274503 274287 273744 272682 271581 270490 268857 266617
52708 266617 264610 263478 262786 261825 260748 260236 260351 260582 260822 261429 262268 262665 262617 263177 265001 267142 268035
52691 268035 267369 266323 266118 266938 268223 269445 270488 271581 272953 274392 275267 275221 274692 274430 274647 274999 275248
52674 275248 275452 275535 275175 274262 273099 272041 271248 270905 271271 272274 273329 273858 273837 273676 273727 274168 275172 276833
52656 276833 278854 280595 281697 282632 284409 287542 291332 294333 295594 295349 294465 293454 292232 290654 288911
52641 288911 287318 285956 284737 283697 283006 282690 282486 282120 281680 281533 281860 282520 283478 285076 287529 290327
52625 290327 292581 293925 294641 294946 294698 293927 292986 291894 290136 287588 285159 283908 283834 284054 283871 283103 281732
52608 281732 280019 278806 278859 279790 280342 279883 279041 278689 278996 279698 280668 281775 282627 283024 283363 284183 285449 286650
52590B86650Q44O64P84R95J094J017Q15O56P17R81J208J125N92k45r04q68j74
52573B95951N02M89j40p40q29m98j84k18n69r26j007q41o12l84j24Q2J35K01M85
52554B90773P72O48J85j36k33m93r60j158j020j167j801k062j202K57J203J332
52538B84938J126Q79N42J90k7l03p87j057n94L42R72R05L06n18j078o82P09J981
52520B87844K069J371J054J211R73L25M66J936L608M157L691L222L163L079K587
52505C20756J837J208Q44M77l13j499k438k639k482k660l098l141k693k285k028
52490B99846j439n39j27n29r21m63N87J411J693J562J107M93J21J47K04J02K33
52473C03488Q41J435J513J373J534J820J772J613J912K548K807K483K126K094
$$ plain form
52590 286650 287494 288158 288942 289937 291031 292048 292863 293519 294236 295217 296425 297550 298142 297897 296993 296125 295951
52573 295951 296453 296942 296802 296062 295233 294735 294551 294333 293764 292838 291831 290990 290378 289994 289870 289952 290087 290288 290773
52554 290773 291545 292193 292378 292242 292009 291516 290556 289398 288378 287211 285410 283348 282146 282403 283606 284938
52538 284938 286064 286943 287485 287675 287648 287345 286558 285501 284907 285249 286221 287126 287432 286914 285836 285154 285863 287844
52520 287844 289913 291284 292338 293549 294522 294847 295313 297249 300857 305014 308705 311927 315090 318169 320756
52505 320756 322593 323801 324645 325122 324809 323310 320872 318233 315751 313091 309993 306852 304159 301874 299846
52490 299846 298407 297868 297741 297212 296291 295828 296415 297826 299519 301081 302188 302681 302802 302949 303153 303255 303488
52473 303488 304329 305764 307277 308650 310184 312004 313776 315389 317301 319849 322656 325139 327265 329359
52459C29359K127J957J696J368O12p63k237l030k966k707l022l931m631m361l267
52444C06204k235j845j840j758j582j505j378r62m82m66r82j503j531r86o4R40
52428B88025J575J434O64K1J26P86J268J205R58R92J183J091P92R37J789K741
52412C05587L194L456M192N265N997O450P442R191J0850J1741J2057J1791J0033
52399D07246O204J360k796n753q043r697j0016q917p366o253n590n072m651m297
52385C36359l829l273k833k357j387K5J184J716K055K617L181L528M078N197O301
52370C52562O438N570M590M087L765L147K265J446P85J74m37j013j574k085k385
52355C77335k327j992j574j079k97Q23J850K170J691J078J098J762K403K537K414
$$ plain form
52459 329359 331486 333443 335139 336507 337119 336356 334119 331089 328123 325416 322394 318463 313832 309471 306204
52444 306204 303969 302124 300284 298526 296944 295439 294061 293099 292617 292151 291169 289666 288135 287149 287085 288025
52428 288025 289600 291034 291698 291719 291845 292631 293899 295104 296062 297054 298237 299328 300120 301057 302846 305587
52412 305587 308781 312237 316429 321694 327691 334141 341583 350774 361624 373365 385422 397213 407246
52399 407246 413450 414810 412014 406261 398218 388521 378505 369588 362222 355969 350379 345307 340656 336359
52385 336359 332530 329257 326424 324067 322680 322705 323889 325605 327660 330277 333458 336986 341064 346261 352562
52370 352562 359000 364570 369160 373247 377012 380159 382424 383870 384655 384829 384392 383379 381805 379720 377335
52355 377335 375008 373016 371442 370363 370066 370889 372739 374909 376600 377678 378776 380538 382941 385478 387892
52340C87892K538K946L234L157K906K809L050L723M931O636Q534J0213J1522J2621
52326D66712J3686J4613J5126J5201J5247J5682J6413J6931J6962J6777J6760
52315F40110J6879J6788J6302J5555J4851J4569J5056J6296J7694J8535J8657
52304H21292J8360J7782J6797J5636J4912J4745J4364J3120J1421J0072Q910O991
52292I84402M070J082j103k715m479o455q037q780q766q331p832p533p377o951
52278I11195o007m843l793k584p06J650L573M519M949N702P055Q706J0283J1519
52264I51218J2091J1821J1112J0793J1277J2097J2553J2680J3104J3980J4611
52253A087337J4404J3693J3135J2658J1650J0004Q166O180L553L13k693m964o983
$$ plain form
52340 387892 390430 393376 396610 399767 402673 405482 408532 412255 417186 423822 432356 442569 454091 466712
52326 466712 480398 495011 510137 525338 540585 556267 572680 589611 606573 623350 640110
52315 640110 656989 673777 690079 705634 720485 735054 750110 766406 784100 802635 821292
52304 821292 839652 857434 874231 889867 904779 919524 933888 947008 958429 968501 977411 984402
52292 984402 988472 989554 988451 985736 981257 974802 966765 957985 949219 940888 933056 925523 918146 911195
52278 911195 905188 900345 896552 893968 893262 894912 898485 903004 907953 913655 920710 929416 939699 951218
52264 951218 963309 975130 986242 997035 1008312 1020409 1032962 1045642 1058746 1072726 1087337
52253 1087337 1101741 1115434 1128569 1141227 1152877 1162881 1171047 1177227 1180780 1181093 1178400 1173436 1166453
52240A166453r122j0686j0831r953r298r464j0112j0876j1700j2381j2590j2359
52228A037081j1894j1078r787q527p911p655p004o030n456n212m386k890j947
52215I47304k274k826k168k97J673L053L888M298M325M332M690N212N319M758
52201I81287L770K763K161K317L196M337N350O242P056P606P761P555O815N305
52187A053521L439K122J468N56j012k274k508k692m169o494q069q488q724r085
52173A007591q671p216n903n582n406m212k348j096p48m03N54J719K466K800L097
52158I76642L434L530L201K639K165J804J267M24l49n37j04M69P49P75Q82J318
52142I98309J987K445K261J540R29Q59J035R27O14O71J410K708M482O752R175
$$ plain form
52240 1166453 1157331 1146645 1135814 1125861 1116563 1107099 1096987 1086111 1074411 1062030 1049440 1037081
52228 1037081 1025187 1014109 1004322 995795 987884 980229 973225 967195 961739 956527 952141 949251 947304
52215 947304 945030 942204 940036 939739 941412 944465 948353 952651 956976 961308 965998 971210 976529 981287
52201 981287 985057 987820 989981 992298 995494 999831 1005181 1011423 1018479 1026085 1033846 1041401 1048216 1053521
52187 1053521 1056960 1059082 1060550 1061106 1060094 1057820 1055312 1052620 1048451 1041957 1033888 1025400 1016676 1007591
52173 1007591 998920 991704 985801 980219 974813 970601 968253 967157 966409 966006 966560 968279 970745 973545 976642
52158 976642 980076 983606 986807 989446 991611 993415 994682 995106 994757 994220 994116 994585 995334 996109 996991 998309
52142 998309 1000296 1002741 1005002 1006542 1007471 1008330 1009365 1010292 1010906 1011577 1012987 1015695 1020177 1026929 1036104
52127A036104J1099J2359J3662J5890J9162K2652K5195K6159K5995K5811K6234
52116A260322K6821K6869K6345K5536K4251K2313K0545K0002K0120J8918J5564
52105A507606J1713R408Q694Q247P566P242P376P150O099M709L373J626j010m141
52091A585658p069r802j2838j6135j8888k0396k0700k0257j9344j8009j6356j4582
52079A391282j2740j0712q433o035l748j793l37P17J866L678O096Q424J0152J1537
$$ plain form
52127 1036104 1047203 1059562 1073224 1089114 1108276 1130928 1156123 1182282 1208277 1234088 1260322
52116 1260322 1287143 1314012 1340357 1365893 1390144 1412457 1433002 1453004 1473124 1492042 1507606
52105 1507606 1519319 1528727 1537421 1545668 1553234 1560476 1567852 1575002 1581101 1585810 1589183 1590809 1589799 1585658
52091 1585658 1578589 1568787 1555949 1539814 1520926 1500530 1479830 1459573 1440229 1422220 1405864 1391282
52079 1391282 1378542 1367830 1359397 1353362 1349614 1347821 1347484 1348201 1350067 1353745 1359841 1368265 1378417 1389954
$$ [...]
##END NTUPLES=NMR SPECTRUM
##END=
