##TITLE=AC1459_PAST813265_8026446_rbvUE5tfaM
##JCAMPDX= 6.0         $$ Bruker NMR JCAMP-DX V2.0
##DATA TYPE= NMR SPECTRUM
##DATA CLASS= NTUPLES
##ORIGIN= BRUKER
##OWNER= Administrator
$$ 1.72 TOPSPIN		Version 2.1
$$ 2013-07-11 16:39:08.903 -0700  Administrator@X
$$ Compression mode = diff/dup
##.OBSERVE FREQUENCY= 400.02188249412
##.OBSERVE NUCLEUS= ^1H
##.ACQUISITION MODE= SIMULTANEOUS (DQD)
##.ACQUISITION SCHEME= undefined
##.AVERAGES= 8
##.DIGITISER RES= 22
##SPECTROMETER/DATA SYSTEM= spect
##.PULSE SEQUENCE= zg30
##.SOLVENT NAME= COFFEE_meoh
##.SHIFT REFERENCE= INTERNAL, COFFEE_meoh, 1, 14.98509
##AUDIT TRAIL= $$ (NUMBER, WHEN, WHO, WHERE, PROCESS, VERSION, WHAT)
$$ ##TITLE= Audit trail, TOPSPIN		Version 2.1
$$ ##JCAMPDX= 5.01
$$ ##ORIGIN= Bruker BioSpin GmbH
$$ ##OWNER= Administrator
$$ $$ E:\/data/COFFEE/nmr/AC1459_PAST813265_8026446_rbvUE5tfaM/10/pdata/1/auditp.txt
$$ ##AUDIT TRAIL=  $$ (NUMBER, WHEN, WHO, WHERE, PROCESS, VERSION, WHAT)
(   1,<2013-07-11 16:39:02.184 -0700>,<Administrator>,<X>,<go>,<TOPSPIN 2.1>,
      <created by zg
	started at 2013-07-11 16:37:56.372 -0700,
	POWCHK enabled, PULCHK disabled,
       configuration hash MD5:
       C8 4E 4E 5D D3 5C D8 9E 9F 52 82 E0 59 8A DE 15
       data hash MD5: 64K
       26 15 5F 9F 9C BD 59 72 4C 24 8C AC 7B 89 72 F4>)
(   2,<2013-07-11 16:39:05.012 -0700>,<Administrator>,<X>,<proc1d>,<TOPSPIN 2.1>,
      <Start of raw data processing
       efp LB = 0 FT_mod = 6 PKNL = 1 PHC0 = 0 PHC1 = 0 SI = 32K 
       data hash MD5: 32K
       51 86 5E 51 E1 42 7F F6 28 81 4D 97 72 00 1F AF>)
(   3,<2013-07-11 16:39:05.325 -0700>,<Administrator>,<X>,<proc1d>,<TOPSPIN 2.1>,
      <pk PHC0 = 98.72864 PHC1 = 0 
       data hash MD5: 32K
       7A F5 04 A4 CC 32 8A 67 6E 87 1C 2E 6F AE 9A C1>)
(   4,<2013-07-11 16:39:05.434 -0700>,<Administrator>,<X>,<proc1d>,<TOPSPIN 2.1>,
      <abs ABSG = 1 
       data hash MD5: 32K
       00 5B C6 93 1E 93 88 FD E3 F5 2F 0F 60 3F D0 6E>)
(   5,<2013-07-11 16:39:05.559 -0700>,<Administrator>,<X>,<proc1d>,<TOPSPIN 2.1>,
      <abs ABSG = 2 
       data hash MD5: 32K
       EE E5 50 36 34 53 85 A3 23 BA 61 B1 EE 2E 82 92>)
(   6,<2013-07-11 16:39:05.606 -0700>,<Administrator>,<X>,<proc1d>,<TOPSPIN 2.1>,
      <abs ABSG = 3 
       data hash MD5: 32K
       B1 D4 1B FC FA 5C 7E 4D AF 6A 0B BE D2 DC D6 99>)
(   7,<2013-07-11 16:39:05.700 -0700>,<Administrator>,<X>,<proc1d>,<TOPSPIN 2.1>,
      <abs ABSG = 4 
       data hash MD5: 32K
       B9 7D 75 B6 3D 41 95 67 85 BF 02 83 FF 6F 0C 7E>)
(   8,<2013-07-11 16:39:05.762 -0700>,<Administrator>,<X>,<proc1d>,<TOPSPIN 2.1>,
      <abs ABSG = 5 
       data hash MD5: 32K
       28 A0 BF 85 04 81 26 5E 3C F5 25 88 84 95 C6 F1>)
$$ ##END=
$$ 
$$ $$ hash MD5
$$ $$ EF 49 21 38 F7 7A 3C 4E 59 B0 D8 F4 35 3E CF 57
##$RELAX= 
##$RELAX= 
##$RELAX= 
##$RELAX= 
##$RELAX= 
##$RELAX= 
##$RELAX= 
$$ Bruker specific parameters
$$ --------------------------
##$DU= <E:\>
##$EXPNO= 10
##$NAME= <AC1459_PAST813265_8026446_rbvUE5tfaM>
$$ [...]
##$TP= (0..7)
150 150 150 150 150 150 150 150
##$TP07= 0
##$TPNAME0= <>
##$TPNAME1= <>
##$TPNAME2= <>
##$TPNAME3= <>
##$TPNAME4= <>
##$TPNAME5= <>
##$TPNAME6= <>
##$TPNAME7= <>
##$TPOAL= (0..7)
0.5 0.5 0.5 0.5 0.5 0.5 0.5 0.5
##$TPOFFS= (0..7)
0 0 0 0 0 0 0 0
##$TUNHIN= 0
##$TUNHOUT= 0
##$TUNXOUT= 0
##$USERA1= <user>
##$USERA2= <user>
##$USERA3= <user>
##$USERA4= <user>
##$USERA5= <user>
##$V9= 5
##$VALIST= <valist>
##$VCLIST= <CCCCCCCCCCCCCCC>
##$VD= 0
##$VDLIST= <DDDDDDDDDDDDDDD>
##$VPLIST= <PPPPPPPPPPPPPPP>
##$VTLIST= <TTTTTTTTTTTTTTT>
##$WBST= 1024
##$WBSW= 4
##$XGAIN= (0..3)
0 0 0 0
##$XL= 0
##$YL= 0
##$YMAX_a= 647553
##$YMIN_a= -551136
##$ZGOPTNS= <>
##$ZL1= 120
##$ZL2= 120
##$ZL3= 120
##$ZL4= 120
##$ABSF1= 14.98509
##$ABSF2= -5.573092
##$ABSG= 5
##$ABSL= 3
##$ALPHA= 0
##$AQORDER= 0
##$ASSFAC= 0
##$ASSFACI= 0
##$ASSFACX= 0
##$ASSWID= 0
##$AUNMP= <proc_prof1d_extract_pilot.lims>
##$AXLEFT= 0
##$AXNAME= <>
##$AXNUC= <1H>
##$AXRIGHT= 0
##$AXTYPE= 0
##$AXUNIT= <>
##$AZFE= 0.1
##$AZFW= 0.1
##$BCFW= 0
##$BC_mod= 0
##$BYTORDP= 0
##$COROFFS= 0
##$CY= 15
##$DATMOD= 1
##$DC= 0
##$DFILT= <>
##$DTYPP= 0
##$F1P= 0
##$F2P= 0
##$FCOR= 0.5
##$FTSIZE= 32768
##$FT_mod= 6
##$GAMMA= 0
##$GB= 0
##$INTBC= 1
##$INTSCL= 1
##$ISEN= 128
##$LB= 0
##$LEV0= 0
##$LPBIN= 0
##$MAXI= 10000
##$MC2= 0
##$MEAN= 0
##$ME_mod= 0
##$MI= 0
##$NCOEF= 0
##$NC_proc= -8
##$NLEV= 6
##$NOISF1= 0
##$NOISF2= 0
##$NSP= 0
##$NTH_PI= 0
##$NZP= 0
##$OFFSET= 14.98509
##$PC= 1
##$PHC0= 98.72864
##$PHC1= 0
##$PH_mod= 1
##$PKNL= yes
##$PPARMOD= 0
##$PPDIAG= 0
##$PPIPTYP= 0
##$PPMPNUM= 2147483647
##$PPRESOL= 1
##$PSCAL= 4
##$PSIGN= 0
##$PYNMP= <proc.py>
##$REVERSE= no
##$SF= 400.02
##$SI= 32768
##$SIGF1= 0
##$SIGF2= 0
##$SINO= 400
##$SIOLD= 32768
##$SPECTYP= <>
##$SREGLST= <1H.CDCl3>
##$SSB= 0
##$STSI= 32768
##$STSR= 0
##$SW_p= 8223.68421052631
##$SYMM= 0
##$S_DEV= 0
##$TDeff= 65536
##$TDoff= 0
##$TI= <>
##$TILT= no
##$TM1= 0
##$TM2= 0
##$TOPLEV= 0
##$USERP1= <user>
##$USERP2= <user>
##$USERP3= <user>
##$USERP4= <user>
##$USERP5= <user>
##$WDW= 1
##$XDIM= 32768
##$YMAX_p= 439286163
##$YMIN_p= -691286
##$CURPLOT= <Network HP LaserJet P1505>
##$CURPRIN= <$Network HP LaserJet P1505>
##$DFORMAT= <normdp>
##$LAYOUT= <+/1D_H.xwp>
##$LFORMAT= <normlp>
##$PFORMAT= <normpl>
##$SURQMSG= 1
$$ End of Bruker specific parameters
$$ ---------------------------------
##NTUPLES= NMR SPECTRUM
##VAR_NAME=  FREQUENCY,     SPECTRUM/REAL,   SPECTRUM/IMAG
##SYMBOL=    X,             R,               I
##VAR_TYPE=  INDEPENDENT,   DEPENDENT,       DEPENDENT
##VAR_FORM=  AFFN,          ASDF,            ASDF
##VAR_DIM=   32768,         32768,           32768
##UNITS=     HZ,            ARBITRARY UNITS, ARBITRARY UNITS
##FACTOR=    0.250966925370066, 1,           1
##FIRST=     8223.43324360094, -260680,      -53183
##LAST=      0,             172143,          162166
##MIN=       0,             -691286,         0
##MAX=       8223.43324360094, 439286163,    0
$$ Real data points
##PAGE= N=1
##DATA TABLE= (X++(R..R)), XYDATA
$$ [...]
$$ plain form
19546 64616 80197 -154830 58265 209373 -45140 -187801 -31981 -110747 -346655 -263517 -102488
19534 -240837 87207 -224033 -151407 -187074 126125 -94901 -88838 -224594 -22108 202238 -55343
19522 -273560 4865 -78219 -145859 111921 -393417 994 -78221 -123012 -128034 -359989 -120111
19510 -15471 -253579 62713 -246987 115413 -160610 -124190 -115549 556982 108592 95726 76854
19499 76854 95446 -13380 -134436 -313749 -320012 -36044 1942 -167472 -52042 -264303 -104107
19487 178279 -64789 -193228 -84386 -140410 -165475 -547899 -30218 -105091 15377 -177397 -267816
19476 -267816 68365 -12441 -42263 -106515 62013 -259143 -28011 -73693 -101826 13950 -121908
19464 -35880 -239765 -50980 72591 -691286 65174 -40018 -38400 153313 -142361 213663 -615
$$ packed form
19546F4616J5581a54830E8265J51108d5140j42661c1981p8766k35908Q3138a02488
19534b40837H7207b24033P2626l5667A26125i4901O063j35756b2108B02238e5343
19522b73560D865g8219o7640A11921c93417I94g8221m4791n022k31955a20111
19510a5471k38108F2713b46987A15413a60610L6420Q641E56982A08592j2866j8872
19499G6854J8592a3380j21056j79313o263c6044A942a67472e2042k12261a04107
19487A78279f4789j28439h4386n6024k5065l82424c0218p4873A5377a77397r0419
19476b67816F8365a2441k9822o4252F2013b59143b8011m5682k8133A3950a21908
19464c5880k03885e0980G2591f91286F5174d0018J618A53313a42361B13663f15
$$ plain form
19452 -3257 -275976 -168271 31468 -110324 -348881 88590 -365319 25240 194968 -159635
19441 -69077 -292277 44981 -61560 -28145 146447 -51848 -106071 -43994 -94327 -209305 42497
19429 -258777 -203790 10160 -200806 15740 -160442 -130868 174107 -41361 -14680 8723 -112088
19417 144066 202569 402389 -44811 -324410 325625 -199585 -266162 -57464 -197292 51170
19406 -29222 -115480 3880 -125465 98261 -42086 -21578 -169636 139901 105785 -162926 226140
19394 -197711 -446929 13959 88472 -133322 20891 8746 -95979 13316 53491 25620 188887
19383 188887 -120529 265346 353138 -101863 -133228 -132433 -129425 261955 -143563 -200360 -184031
19372 -184031 -253291 -148018 -115884 -166442 109361 156043 -132295 -308982 230145 95957
$$ packed form
19452c257k72719J07705C1468a10324k38557H8590c65319B5240J69728a59635
19441f9077k23200D4981f1560b8145A46447e1848n4223d3994n0333j14978D2497
19429b58777N4987A0160b00806A5740a60442K9574A74107d1361a4680H723a12088
19417A44066N8503J99820d4811k79599C25625a99585o6577e7464j39828E1170
19406b9222q6258C880a25465I8261d2086K0508j48058A39901l4116a62926B26140
19394a97711k49218A3959P4513a33322B0891H746i5979A3316M0175B5620J63267
19383A88887a20529B65346Q7792a01863l1365P95L008B61955a43563n6797J6329
19372a84031o9260J05273L2134n0558A09361M6682a32295j76687B30145I5957
$$ plain form
19361 -355793 -266518 -171301 30136 -330837 -490 -68299 281242 -122363 -5844 -368260 -52746
19349 -65129 -17530 -282651 -60648 9401 -166758 -28690 -142546 -341143 -183214 -59028 -290335
19338 -290335 363196 -214265 54791 -35755 -30769 -165922 85726 60955 -72384 -268404 -370909
19327 -370909 -13860 -195921 -31015 446 135479 -121265 -286090 -366970 41491 -272522 -159697
19316 -159697 -65931 219684 -297966 -110101 -199496 17420 -154773 -160570 131207 36396 -94281
19304 115550 -219790 -160143 -150537 -10508 -100165 269731 144753 -265827 -122801 129730
19293 16626 121573 24182 -135675 -69647 28838 425138 -177401 -180146 340215 -254297 -225326
19282 -225326 -14643 -203446 138094 124200 200396 -267148 -127484 -46176 -107253 -534921
$$ packed form
19361c55793Q9275R5217C0136c30837d90o7809B81242a22363e844l62416e2746
19349f5129a7530k65121f0648I401a66758b8690j13856j98597J57929e9028k31307
19338b90335C63196b14265E4791c5755M986j35153H5726k4771g2384j96020j02505
19327c70909a3860j82061c1015D46J35033a21265j64825q0880D1491b72522J12825
19316a59697f5931B19684b97966a10101q9395A7420a54773n797A31207C6396i4281
19304A15550b19790N9647R606a0508q9657B69731j24978b65827a22801A29730
19293A6626J04947B4182a35675O6028B8838L96300a77401k745C40215b54297K8971
19282b25326a4643j88803A38094j3894P6196b67148a27484d6176o1077m27668
$$ plain form
19272 -534921 -265070 259560 -250125 -168864 -229541 -121011 59597 101325 -251634 -62719
19261 -177363 -103096 37622 164363 220289 -259957 -147863 -40516 -77032 135499 -226964
19250 -86597 -274947 -341306 -170889 -28839 -82110 -282778 -295298 15125 -322742 116072 47343
19238 -266503 38492 -72794 -131872 95868 102948 -45597 -145987 -117102 -99127 -133779 306163
19226 240025 -92922 66629 14305 -7436 -8140 -197033 58709 -235955 154831 22104 -79086
19214 -31214 -139932 -480939 143573 -61744 66904 40341 50481 85023 -165575 -191004 135421
19202 316408 -141996 -276438 -312666 -9391 78356 -141935 242470 -122767 -73042 -99485 39710
19190 -212543 -142091 -248619 262621 -486726 -87495 -25095 -108012 -44914 153835 80049 -33358
$$ packed form
19272e34921b65070B59560b50125Q1261o0677J08530E9597M1728b51634f2719
19261a77363P4267C7622J26741N5926b59957J12094d0516l6516A35499b26964
19250h6597j88350o6359J70417b8839n3271k00668j2520A5125c22742A16072D7343
19238b66503C8492g2794n9078I5868P080d5597j00390K8885J7975l4652C06163
19226B40025i2922F6629A4305g436p04j88893E8709b35955A54831B2104g9086
19214c1214j08718l41007A43573f1744F6904k6563J0140L4542a65575k5429A35421
19202C16408a41996j34442l6228i391G8356a41935B42470a22767M9725k6443C9710
19190b12543P0452j06528B62621d86726h7495b5095q2917d4914A53835p3786c3358
$$ plain form
19178 -280131 -75513 -317467 -11272 -59575 177589 362251 9889 -78436 -45959 -184663 49753
19166 -155012 -423919 -133200 -162619 1378 -11190 129665 -130610 -114660 4442 -199385 -162241
19155 -162241 -289834 197952 -164200 -327506 -165150 -212535 226069 -53512 125008 38358
19144 -271498 -105095 -210941 -112926 -164035 -292170 -5971 57706 -65984 -263912 -20987 -181573
19133 -181573 106251 62567 -313600 116866 -154787 -68472 -20360 32176 100949 -185201
19122 39796 48269 173793 -170371 -144349 232612 -85335 -173732 -205629 4986 66321 -239360
19110 -37327 -251853 240562 -78214 -243437 1455 -405033 -366128 113718 166177 -113864 65719
19098 193393 142019 -104609 -156711 -65059 37930 -192257 -320340 -147347 -185667 -132807 -134701
$$ packed form
19178b80131g5513k41954a1272m8303A77589J84662I889g8436L2477j38704D9753
19166a55012k68907a33200k9419A378a1190A29665a30610J5950D442a99385L7144
19155a62241j27593A97952a64200j63306J62356m7385B26069e3512A25008C8358
19144b71498a05095j05846R8015n1109j28135e971E7706f5984j97928b0987j60586
19133a81573A06251m3684c13600A16866a54787f8472b0360C2176O8773a85201
19122C9796Q473J25524a70371K6022B32612h5335q8397l1897D986O1335b39360
19110c7327k14526B40562g8214j65223A455d05033L8905A13718N2459a13864F5719
19098A93393n1374a04609n2102f5059C7930a92257j28083a47347l8320N2860j894
$$ plain form
19087 -134701 -304806 189021 -84116 -159631 -102377 373168 -109039 -173304 -156424 -266040
19077 -266040 -313811 -134068 60652 269311 108188 -316366 58392 20532 9786 -249003 -115599
19065 -143162 4152 -165253 -402456 -268194 -180351 55304 -43069 -295463 -342927 -183184 -209871
19054 -209871 -86489 -214108 -98233 -41133 -145813 -305426 -309444 -217863 -56388 -316133 92986
19042 -162631 -76497 -1477 242173 226226 116249 -915 -278426 22032 26734 -11764 121191
19030 -23261 250962 44319 125888 -135480 222941 70409 240949 102603 -104316 -112519 111769
19018 9080 -37136 -221656 16997 -212484 173575 -109593 141933 144578 2099 113412 -219078
19006 51450 70927 70304 63591 55785 154505 109452 18109 -46893 -120368 -58132 44847 380003
$$ packed form
19087a34701j70105A89021h4116p5515N7254C73168a09039o4265J6880j09616
19077b66040m7771a34068F0652K08659A08188c16366E8392B0532I786b49003a15599
19065a43162D152a65253k37203J34262Q7843E5304d3069k52394m7464J59743k6687
19054b09871h6489j27619i8233d1133j04680j59613m018R1581e6388k59745I2986
19042a62631g6497a477B42173j5947j09977i15k77511B2032M702a1764A21191
19030b3261B50962D4319Q1569a35480B22941G0409J70540A02603a04316q203A11769
19018I080c7136j84520A6997b12484A73575a09593A41933K645B099J11313b19078
19006E1450J9477o23o713p806R8720m5053A8109d6893p3475e8132D4847L35156
$$ plain form
18994 380003 -3152 -131489 -187987 -291275 43326 -139188 -166866 -73966 93191 119726 -44384
18982 -109276 -30119 -61220 124220 -17721 192058 98386 38988 254774 45540 -132962 -114058
18971 -114058 -298807 -230911 -12676 -2387 -227274 118275 -242620 198539 261927 -55139 -66592
18960 -66592 -263877 107337 -75051 24770 205438 -55031 82869 60456 -269186 -165815 173931
18948 -154026 -203829 -319411 148667 153135 -331536 31441 -43401 -17116 259934 191246 36432
18936 41197 225184 -102872 107956 -89899 154937 113731 70651 14984 145946 -115810
18925 -103883 -431095 -10737 -234960 108370 -60660 -346330 199586 -96039 15033 -12838
18914 -15503 -393139 -110504 -173109 -102602 254668 -255638 171428 292534 9968 187918
$$ packed form
18994C80003c152j28337n6498j03288D3326a39188k7678g3966I3191K6535d4384
18982a09276c0119l1101A24220a7721A92058r3672C8988K15786D5540a32962J8904
18971a14058j84749O7896a2676b387k24887A18275b42620A98539O3388e5139j1453
18960f6592j97285A07337g5051B4770J80668e5031H2869k2413b69186J03371A73931
18948a54026m9803j15582A48667M468c31536C1441d3401a7116B59934o8688C6432
18936D1197J83987a02872A07956h9899A54937m1206m3080A4984J30962a15810
18925a03883l27212a0737k24223A08370f0660k85670A99586i6039A5033a2838
18914a5503l77636a10504o2605P0507B54668b55638A71428J21106I968J77950
$$ plain form
18904 187918 -206337 -192704 340571 -281923 122138 243296 37857 45166 71163 88410 -322360
18892 185147 -188502 -396857 -153485 19646 97634 -362269 62617 154893 -49118 217984
18881 -79864 -415922 302071 98600 -144452 86525 159773 72028 -187066 -158906 -473089 -151683
18869 -188095 -110932 113522 59468 -98443 8818 -174763 47633 -30919 42128 319322 -133368
18857 -4983 305520 311234 -71562 109558 -92078 -494295 -212285 263746 21087 1722 -179429
18845 -80892 -70635 -173946 132771 80765 -18280 -317282 -347098 54604 243547 77128 156370
18834 156370 -319217 -153504 -21358 -221219 -325868 19135 -80253 -75056 -273735 86731 238159
18823 238159 -106493 125128 -227171 -111172 278600 -10486 -89327 124098 -9167 366811
$$ packed form
18904A87918b06337J3633C40571b81923A22138J21158C7857P309K5997J7247c22360
18892A85147a88502k08355a53485A9646P7988c62269F2617R2276d9118B17984
18881g9864l36058C02071I8600a44452H6525P3248G2028a87066K8160l14183a51683
18869a88095P7163A13522n4054i8443H818a74763D7633c0919D2128K77194a33368
18857d983C05520N714g1562A09558i2078m02217b12285B63746B1087A722a79429
18845h0892J0257j03311A32771n2006a8280k99002k9816E4604J88943G7128P9242
18834A56370c19217a53504b1358j99861j04649A9135h0253N197j98679H6731J51428
18823B38159a06493A25128b27171a11172B78600a0486p8841A24098i167C66811
$$ plain form
18812 78731 -146520 -42564 209729 -182014 33949 120123 80232 116063 -357863 263227 -67882
18800 99672 -252618 -38304 22638 -62989 -190324 105172 -4216 249828 -47841 -109337 2738
18788 192652 58034 -157453 -147779 -85827 -173295 -293021 -277360 42620 -79547 -192904 -202098
18777 -202098 -88088 25819 -101191 -206180 21643 -38780 -221764 49287 -185091 -31395 -273479
18766 -273479 -166875 12271 -391444 -409541 -88477 128604 -151302 -56083 -34984 -28965 -128102
18755 -128102 -241605 -30882 -11353 49787 203118 15954 21610 24850 249054 -189664 13295
18743 -119129 -108227 -65463 -339319 -153445 -161720 -135671 -321068 -205472 111333 3889 19963
18732 19963 -17556 221173 -59231 -140621 92332 -191503 -97585 -89354 -221169 136107 23709
$$ packed form
18812G8731a46520d2564B09729a82014C3949Q6174l9891L5831c57863B63227f7882
18800I9672b52618c8304B2638f2989j27335A05172d216B49828d7841o1496B738
18788A92652E8034a57453R674O1952q7468j19726J5661D2620g9547j13357r194
18777b02098h8088B5819a01191j04989B1643c8780j82984D9287a85091c1395k42084
18766b73479J06604A2271c91444j8097h8477A28604a51302e6083K1099O019r9137
18755a28102j13503c0882a1353D9787J53331A5954N656L240K24204a89664A3295
18743a19129J0902M2764k73856a53445q275K6049j85397J15596A11333C889J6074
18732A9963a7556B21173e9231q1390I2332a91503R3918Q231j31815A36107B3709
$$ plain form
18720 214845 -202763 3116 -175457 -415042 160900 311108 43052 305958 -46483 -50498 228746
18708 -182772 -324660 10123 90589 -135240 119398 -258167 354 -152056 -138470 -239459 -311646
18697 -311646 232700 -242566 -58667 -73454 1687 49959 30913 -189506 -164523 160224 -174304
18685 -176595 156199 162255 -66129 7683 -435933 9993 -174332 -60502 -31247 -283833 -88247
18673 176092 183743 23278 106392 -25979 -1719 -84899 -189581 167585 -304609 -321692 -26389
18661 -267512 114190 57209 269831 282438 -63623 71575 -254006 236439 33302 -56780 -282741
18650 -282741 8988 -23062 538 -315844 -57752 -225524 -40435 19136 290468 45918 21749
18638 -277972 -82639 -68801 268469 -38986 92052 32715 77560 -69026 -28760 -126749 23313
$$ packed form
18720B14845b02763C116a75457k39585A60900J50208D3052K62906d6483m015B28746
18708a82772j41888A0123Q0466a35240A19398b58167C54a52056J3586j00989p2187
18697c11646B32700b42566e8667j4787A687M8272j9046a89506K4983A60224a74304
18685a76595A56199O056f6129G683d35933I993a74332f0502K9255k52586h8247
18673A76092P651B3278Q3114b5979a719q3180j04682A67585c04609j7083b6389
18661b67512A14190n6981K12622J2607f3623G1575b54006B36439C3302e6780k25961
18650b82741H988b3062E38c15844e7752j67772d0435A9136K71332D5918B1749
18638b77972h2639J3838B68469c8986I2052C2715M4845f9026b8760r7989B3313
$$ plain form
18626 -50622 49784 -104718 -126174 -202398 -93218 610736 -108972 -190361 281861 267737 -77176
18614 24913 -62141 88428 -64797 -176484 -321910 -189298 -142049 93948 -78069 -277673 -76229
18602 -73663 -198651 311361 24638 -373625 3063 72377 13491 -196580 -168390 -232183 -153615
18591 -153615 -21613 -258018 -10978 53086 264251 -88481 111840 -17770 -419510 -74250 -68465
18580 -68465 -80641 101296 -249332 -241108 197014 -133330 34978 28005 183496 -53808 33412
18568 -216235 18228 380278 97101 -221256 139856 -4357 -21310 14672 -402060 113537 -39957
18556 -107157 -276316 -90583 -240179 -244207 67664 -239049 110093 -134415 -50600 144353
18545 -132085 -66226 -337890 133941 54951 76633 151914 32972 -104288 211317 -47482 -86458
$$ packed form
18626e0622D9784a04718k1456p6224i3218F10736a08972q1389B81861j4124g7176
18614B4913f2141H8428f4797j11687j45426J32612M7249I3948g8069j99604g6229
18602g3663j24988C11361B4638c73625C063O9314A3491a96580K8190o3793P8568
18591a53615b1613k36405a0978E3086K11165h8481A11840a7770m01740g4250N785
18580f8465j2176A01296b49332Q224A97014a33330C4978o973J55491e3808C3412
18568b16235A8228L62050I7101b21256A39856d357j6953A4672d02060A13537c9957
18556a07157j69159i0583j49596m028F7664b39049A10093a34415e0600A44353
18545a32085O5859k71664A33941E4951K1682P5281C2972a04288B11317d7482l8976
$$ plain form
18534 -86458 -225642 -10050 -102613 -78880 -95659 180927 56477 -211150 72209 -161640 -204112
18523 -204112 138217 68600 -36567 61428 -202676 121439 -154656 232539 -91038 -6879 -51350
18512 -51350 87855 -137160 -82945 -105404 -271871 -101396 -233487 -155839 77469 135262 31111
18500 -268265 88438 -18693 147683 179862 -262851 -160117 12797 -359019 231565 35459
18489 -506934 -286499 -41924 97150 -110136 -79460 -10156 39578 -299777 -239477 -230270 -311176
18478 -311176 -100368 88669 -154312 -312161 -204218 246649 411348 127364 -123919 -77946
18468 -77946 106383 -75625 -285471 -1493 -98013 -66608 210076 -11389 -154271 -54677 -120720
18457 -120720 3861 -118539 124267 64964 -132467 98519 -40061 -320902 28450 -85497 41161
$$ packed form
18534h6458j39184a0050r2563K3733j6779A80927E6477b11150G2209a61640m2472
18523b04112A38217F8600c6567F1428b02676A21439a54656B32539i1038f879m4471
18512e1350H7855a37160N4215k2459j66467a01396j32091P7648G7469N7793C1111
18500b68265H8438a8693A47683L2179b62851J02734A2797c59019B31565C5459
18489e06934K20435d1924I7150a10136L0676a0156C9578b99777O0300R207q0906
18478c11176a00368H8669a54312j57849J07943B46649J64699A27364a23919M5973
18468g7946A06383g5625k09846a493r6520L1405B10076a1389j42882e4677o6043
18457a20720C861a18539A24267n9303a32467I8519d0061k80841B8450h5497D1161
$$ plain form
18445 -128570 -95944 -340187 -211074 19244 63531 40155 280630 -356540 -19275 -154440
18435 -154440 -60054 -128156 -140969 -65780 -97021 484016 359964 309423 -6664 -179650 -294890
18424 -294890 -134191 97790 -74238 103128 -66813 -245839 -185348 9306 17317 -61088 -64027
18413 -64027 205279 373676 -57340 -82519 141006 25805 273048 -36214 153274 -110650
18402 194205 293426 -360762 201596 -301081 -77493 58334 -126598 178797 199657 169688
18392 169688 -24012 191561 -439048 150966 53917 -52884 -82239 -10953 288730 -127807
18381 -195093 -229947 -311223 43622 -85568 -143763 126587 -82404 -230239 -34367 -13585 164909
18369 -26997 -107252 -93912 184180 69914 139319 -14452 112780 -338831 94172 -197636 -70353
$$ packed form
18445a28570L2626k44243J29113A9244M4287k3376K40475c56540a9275j35165
18435a54440f0054o8102j2813f5780l1241D84016j24052n0541f664j72986j15240
18424b94890a34191I7790g4238A03128f6813j79026O0491I306Q011f1088k939
18413f4027B05279J68397e7340k5179A41006B5805K47243c6214A53274a10650
18402A94205R9221c60762B01596c01081g7493E8334a26598A78797K0860k9969
18392A69688b4012A91561d39048A50966E3917e2884k9355a0953B88730a27807
18381a95093l4854q1276D3622h5568n8195A26587h2404j47835c4367a3585A64909
18369b6997q0255J3340A84180F9914O9405a4452A12780c38831I4172a97636g0353
$$ plain form
18357 -96297 -77378 -98214 -302928 -101735 -119803 42905 191798 -31253 -91768 -94584 -71310
18346 -71310 -72475 -447923 -115303 -4338 127079 -209639 -254499 9319 -104819 87591 37353
18334 -203350 -35133 201990 -5385 -158055 -232800 -17257 -150262 124697 -66020 -239270 -163880
18323 -163880 10684 -195223 101529 64912 18775 -154245 98925 -69442 136719 -312045
18312 -142383 -84775 -21470 -24087 -386041 -387457 -99817 15406 -95347 368628 -402646 77108
18300 -184659 154404 -245968 -3061 51512 -33664 -227710 -166973 -86321 -23645 -68250 -142534
18289 -142534 108588 -278673 -200693 79126 104526 -212719 81793 -108444 2265 -92956 -212033
18278 -212033 145788 136716 261496 122704 141805 -154703 13480 -44222 -34036 -617562 -43468
$$ packed form
18357i6297J8919k0836k04714a01735j8068D2905J48893c1253o0515k816K3274
18346g1310j165l75448a15303d338A27079b09639m4860I319a04819H7591C7353
18334b03350c5133B01990e385j52670p4745a7257j33005A24697f6020j73250P5390
18323a63880A0684a95223A01529l6617A8775a54245I8925f9442A36719c12045
18312a42383N7608b1470k617l61954j416i9817A5406i5347C68628d02646G7108
18300a84659A54404b45968c061E1512c3664j94046O0737Q0652b3645m4605p4284
18289a42534A08588b78673P7980G9126K5400b12719H1793a08444B265i2956j19077
18278b12033A45788r072J24780A22704J9101a54703A3480d4222J0186n83526d3468
$$ plain form
18266 26867 194615 45530 14255 30135 -328694 112434 146419 70964 -189032 76318 -174281
18254 -326342 -157133 246255 -307321 111319 -52275 171314 -231246 -4531 -267242 31654
18243 -296266 170957 -144958 101076 -20939 18237 -170822 -210816 183220 102669 143295
18233 143295 115131 -195315 3775 149315 105143 220553 -149341 -159627 -208126 203141 144269
18222 144269 294955 -191057 15099 165975 108148 -170860 18321 -65812 175104 -114364
18211 -193234 -238960 238303 -184024 -32938 -221797 -36827 25288 141910 -274862 -130982
18200 -35511 206406 -2554 85483 -239594 158508 17386 -99184 102562 -294297 -62177 -44658
18189 -44658 243108 -277052 -110472 -248371 149684 238524 -169655 -195669 -102618 -96081 -58627
$$ packed form
18266B6867J67748D5530A4255J5880c28694A12434L3985G0964a89032G6318a74281
18254c26342a57133B46255c07321A11319e2275A71314b31246d531k62711C1654
18243b96266A70957a44958A01076b0939A8237a70822l9994A83220q0551M0626
18233A43295k8164a95315C775J45540m4172J15410a49341j0286m8499B03141n8872
18222A44269J50686a91057A5099J50876n7827a70860A8321f5812A75104a14364
18211a93234m5726B38303a84024c2938j88859c6827B5288J16622b74862a30982
18200c5511B06406b554H5483b39594A58508A7386i9184A02562b94297f2177J7519
18189d4658B43108b77052a10472j37899A49684Q8840a69655k6014R3051O537L7454
$$ plain form
18178 -58627 206912 147885 -16260 -80558 -50757 -345166 -212606 -128162 -76808 -61742 77212
18166 -50557 -191605 -92238 -16806 82005 41285 -166947 292183 -203769 90801 -114977 -334605
18155 -334605 25944 138995 -55456 19675 -412 65223 -37672 -182162 -490287 -52902 -103547
18144 -103547 149003 144169 83079 1087 -191168 -65079 -30692 135522 -192110 -575254 80181
18132 -208694 -12862 -83985 -280198 120913 178356 30913 186208 -109140 -357708 200 -148263
18120 55147 -324481 -75981 130184 -8032 -149722 -18057 -129206 117051 147271 203358 -130253
18108 -283635 106268 -96785 48189 -59692 88660 196559 190286 -249047 14601 -189453 18914
18096 20491 22749 -287454 -62781 34542 -210220 -247241 153004 8568 -268399 13521 -179559
$$ packed form
18178e8627B06912n9027a6260o4298K9801k94409J32560Q4444N1354J5066G7212
18166e0557j41048i2238a6806H2005m0720a66947B92183b03769I0801a14977k19628
18155c34605B5944J13051e5456A9675d12F5223c7672j44490l08125e2902n0645
18144a03547A49003m834o1090A087a91168f5079c0692A35522a92110l83144H0181
18132b08694a2862p1123j96213A20913N7443C0913J55295a09140k48568B00a48263
18120E5147c24481g5981A30184h032j41690a8057j11149A17051L0220N6087a30253
18108b83635A06268i6785D8189e9692H8660J07899o273b49047A4601a89453A8914
18096B0491K258b87454f2781C4542b10220l7021A53004H568b68399A3521a79559
$$ plain form
18084 -255 108677 136721 -30033 154639 -169245 -237540 -153469 223066 71365 65240 194266
18073 194266 -106774 -29987 -49728 -507484 92564 233086 145217 -293751 18469 -156542
18062 207058 -102022 183926 225683 -126817 88957 56068 297508 -160658 170766 -378 39568
18050 -383943 -134341 161722 -195939 48856 154727 -24129 218519 -222608 117385 -211054
18039 -62432 -117925 70744 -289006 -270887 -1754 -203241 -248124 -145656 -158420 19552 -85780
18027 -45034 -150502 -157794 81519 -117223 -211813 30180 -497841 96283 93730 115667 -54449
18015 -179643 193030 -26651 120871 -221788 106596 243969 -52401 -408236 627 -61129 149808
18003 -206491 -81041 -249937 88469 185069 399897 -4651 -224446 -65230 -112243 21983 -337374
$$ packed form
18084b55A08677K8044c0033A54639a69245o8295Q4071B23066G1365o125J29026
18073A94266a06774b9987j9741m57756I2564J40522q7869b93751A8469a56542
18062B07058a02022A83926M1757a26817H8957l2889K41440a60658A70766c78C9568
18050c83943a34341A61722a95939D8856J05871b4129B18519b22608A17385b11054
18039f2432n5493G0744b89006J8119a754k01487m4883J02468j2764A9552h5780
18027d5034j05468p292H1519a17223r4590C0180d97841I6283k553K1937e4449
18015a79643A93030b6651A20871b21788A06596J37373e2401l55835F27f1129A49808
18003b06491h1041j68896H8469R6600K14828d651k19795f5230m7013B1983c37374
$$ plain form
17991 -16997 172604 -61909 196563 18237 -128461 -16129 -102304 -42212 -59856 153742 295383
17980 295383 -101063 -153328 -44548 -39311 -50521 -35752 57315 -116018 -66423 -346 -328354
17969 -328354 43118 -47707 -163182 -187871 93472 -8553 -191343 173872 256729 -257744 5341
17957 -221086 69529 -497534 -257739 248647 -306154 -262556 -216078 193443 317565 261528
17947 261528 122247 112342 25627 -182062 -155678 -81426 54058 42036 28129 -72690 102351
17935 99196 -115108 48001 233123 -44676 -40484 -148953 54875 64584 242878 -222365 35829
17923 326846 -164407 127084 69835 81397 -192720 253988 -13824 89437 -62386 -7765 -78225
17912 -78225 87577 157761 224512 -53834 481104 110364 -96855 -70197 265320 -380991 17394
$$ packed form
17991a6997A72604f1909A96563A8237a28461a6129q6175d2212j7644A53742J41641
17980B95383a01063n2265d4548N237j1210J4769E7315a16018M9595c46l28008
17969c28354D3118d7707j15475k4689I3472h553j82790A73872Q2857b57744E341
17957b21086F9529d97534K39795B48647c06154M3598M6478A93443J24122n6037
17947B61528A22247r905B5627a82062K6384P4252E4058j2022j3907g2690A02351
17935I9196a15108D8001J85122d4676M192j08469E4875R709J78294b22365C5829
17923C26846a64407A27084n7249J1562a92720B53988a3824H9437f2386g765p0460
17912g8225H7577P0184O6751e3834D81104A10364i6855K6658B65320c80991A7394
$$ plain form
17900 -60542 -231093 11776 -255761 -95033 299475 149133 284380 -272714 118998 -95592
17889 50272 -93367 235410 -100492 -89336 26837 60963 -129545 -73750 39404 -15268 -159764
17878 -159764 159842 152983 63481 -142718 -124631 -16794 -188433 35893 -145108 263162 40988
17866 -115718 142456 -129312 2451 -46011 -40513 318615 -354034 -99522 129794 -68399 -69123
17855 -69123 368422 175538 33990 -186150 -280509 83187 -172433 172560 -34066 -113201 -59219
17844 -59219 -154347 41788 -110638 137686 15276 316851 72609 -71516 -35054 -247401 368131
17832 -47476 -195651 -102170 -232292 -42362 312010 -138592 69743 -116676 -103787 -69720 24146
17820 277403 -45867 62156 34529 -13917 -98766 -148494 -67948 -155622 97040 -124212 374159
$$ packed form
17900f0542j70551A1776b55761i5033B99475A49133J35247b72714A18998i5592
17889E0272i3367B35410a00492J1156B6837L4126a29545N5795C9404a5268j44496
17878a59764A59842o859F3481a42718J8087a6794j71639C5893a45108B63162D0988
17866a15718A42456a29312B451d6011N498C18615c54034i9522A29794f8399p24
17855f9123C68422A75538C3990a86150r4359H3187a72433A72560c4066p9135N3982
17844e9219r5128D1788a10638A37686A5276L01575G2609g1516c5054k12347C68131
17832d7476j48175R3481j30122d2362C12010a38592F9743a16676J2889L4067B4146
17820B77403d5867F2156k7627a3917q4849m9728f7948q7674I7040a24212C74159
$$ plain form
17808 311832 146189 -107642 -47281 357089 -106052 148991 187954 -182081 -172852 146610
17797 62424 60146 329781 175127 115368 -321214 127131 -175168 -434462 55814 -76085 188725
17785 -25411 -240539 -163910 98115 -80919 45304 -145015 -232150 -264132 34027 -172922 -136804
17774 -136804 248130 112581 -389083 31174 -73552 -70862 -77542 -97999 -137364 198318 258286
17763 258286 -13797 211770 -32910 -271878 -117193 -68537 -178409 213148 27994 -189898
17752 170163 258487 -68404 -95204 -175600 -129939 -195424 95528 172265 -18194 215936 179021
17741 179021 -211897 355731 -140722 -141873 -169907 92858 68708 -250620 41598 72103 -283216
17729 35378 -67355 96114 -77278 -103942 262853 239746 -176736 -189891 291234 -143754 -230988
$$ packed form
17808C11832A46189a07642d7281C57089a06052A48991L8963a82081R229A46610
17797F2424k278K69635j54654n9759c21214A27131a75168k59294E5814g6085A88725
17785b5411k15128P6629I8115h0919D5304a45015q7135l1982C4027a72922L6118
17774a36804B48130A12581c89083C1174g3552K690o680k0457l9365A98318N9968
17763B58286a3797B11770c2910k38968a17193M8656j09872B13148B7994a89898
17752A70163Q8324f8404k6800q0396M5661o5485I5528P6737a8194B15936l6915
17741A79021b11897C55731a40722j151k8034I2858k4150b50620D1598L0505b83216
17729C5378f7355I6114g7278k6664B62853k3107a76736j3155B91234a43754q7234
$$ plain form
17718 -230988 48365 112430 -107272 -84755 -364515 -344606 -232427 -40195 28709 -266847 -388721
17707 -388721 -884 -65270 112664 111170 -242653 286831 -149081 22617 233876 251638 64661
17695 4830 385773 117983 197344 -100068 73733 -97197 -151672 -223464 -202136 187263 3770
17683 -11904 -82602 80969 -38929 129062 39737 -33135 277118 38633 -33548 141698 55832
17671 399563 -137724 -10786 -127 202891 -210421 174806 159696 -94459 -140758 103632 30968
17659 -390008 8315 436145 -223539 138321 137983 -393101 66925 2996 29530 57861 52695 -144695
17646 -198737 13070 13860 -304886 -25736 -261618 -55687 15699 -193886 167040 -53133 -104986
17635 -104986 -394998 -9090 50630 -40381 23717 20019 96308 122517 98319 -116240 421449
$$ packed form
17718b30988D8365O4065a07272K2517k79760J9909J12179d0195B8709b66847j21874
17707c88721h84o4386A12664j494b42653B86831a49081B2617K11259J7762F4661
17695D830L80943A17983P9361a00068G3733i7197n4475p1792K1328A87263C770
17683a1904p0698H0969c8929A29062C9737c3135B77118C8633c3548A41698E5832
17671C99563a37724a0786a27B02891b10421A74806j5110i4459m6299A03632C0968
17659c90008H315M27830b23539A38321l38c93101F6925B996K6534K8331n166a44695
17646a98737A3070P90c04886b5736k35882e5687A5699a93886A67040e3133n1853
17635a04986k90012i090E0630d0381B3717l698P6289K6209k4198a16240D21449
$$ plain form
17623 66170 -327541 -26476 248188 90732 61020 33163 165505 -39326 59127 560509 -195535
17611 155074 79678 5586 84727 -87887 72058 -92890 66834 156481 -167512 -288113 -14050
17599 228134 -249090 382126 128077 -172208 -52943 196468 -49285 87135 238689 105340
17588 -84132 192344 171161 -287799 -28180 1635 15546 -221617 -163385 -89524 173715 183678
17577 183678 289340 -97033 248788 126387 273203 123523 -18973 181001 124814 136684
17567 136684 309966 79313 184640 -131419 203795 19811 -83962 31520 -88867 -72314 -429028
17556 -429028 86155 348864 386390 294447 73068 -52073 225213 81624 10917 104603 -45705
17544 -255164 62609 71710 300714 97878 -168558 137450 -202312 144367 -67224 80669 -34448
$$ packed form
17623F6170c27541b6476B48188I0732k9712k7857J32342c9326E9127N01382a95535
17611A55074p5396E586P9141h7887G2058i2890F6834Q9647a67512j20601a4050
17599B28134b49090C82126A28077a72208e2943A96468d9285H7135J51554A05340
17588h4132A92344k1183b87799b8180A635J3911b21617N8232P3861A73715R963
17577A83678J05662i7033B48788j22401J46816A23523a8973A81001n6187J1870
17567A36684J73282G9313J05327a31419B03795A9811h3962C1520h8867J6553l56714
17556d29028H6155K62709L7526r1943G3068e2073B25213H1624A0917R3686d5705
17544b55164F2609R101K29004I7878a68558A37450b02312A44367f7224H0669c4448
$$ plain form
17532 48614 -373898 187476 -43627 105235 31635 97514 8203 216911 43773 27095 -213535
17520 5270 230386 199404 -104286 -42513 164883 107460 -46040 467090 367697 -84419 171323
17508 -221756 146119 72174 166003 -222561 -85348 69868 147425 -83965 265626 91957 96900
17497 96900 304888 -9117 68135 -144374 377987 16790 39870 48131 -264296 73702 295088
17486 295088 148232 248219 -63706 10981 -155068 -98113 287276 316241 134727 298036
17476 298036 281367 -51744 540460 -85428 282169 188295 240555 -178239 -118458 -166260 206691
17464 200718 -85332 131402 425457 -43761 -22755 239366 120299 47152 45563 29990 180220
17453 180220 546510 490689 324887 336447 484139 329756 557185 335595 149289 -168387
$$ packed form
17532D8614c73898A87476d3627A05235C1635O5879H203K08708D3773j6678b13535
17520E270K25116l0982a04286d2513A64883n7423d6040D67090r9393h4419A71323
17508b21756A46119G2174R3829b22561h5348F9868P7557h3965B65626I1957M943
17497I6900K07988i117F8135a44374C77987A6790K3080Q261b64296G3702K21386
17486B95088j46856R9987f3706A0981a55068N6955B87276K8965A34727J63309
17476B98036j6669e1744E40460h5428B82169r3874N2260a78239N9781m7802B06691
17464B00718h5332A31402K94055d3761K1006B39366j19067D7152j589j5573J50230
17453A80220L66290n5821j65802J1560J47692j54383K27429k21590A49289a68387
$$ plain form
17442 12115 271016 91872 328836 30653 200345 45531 126716 64970 -8386 53404 56535
17431 56535 236836 484398 272071 148608 454349 146494 570893 -52654 252491 206132
17421 206132 -41591 313824 372257 223548 317198 42925 154051 -39823 612430 258145
17410 225420 100570 162807 109358 279838 -64003 202604 243171 121112 110044 496468
17400 496468 114194 169438 -86177 250472 84022 392034 155429 141439 -185171 218340
17389 18169 71391 55222 330039 95570 24272 4975 338611 322037 284049 423479 -195060
17377 6405 -46603 224743 297878 85055 -79311 125162 346544 -303195 128600 -78040 263298
17365 179803 -62152 8586 -44216 267543 228970 -128818 190562 317842 97308 275192 49593
$$ packed form
17442A2115K58901I1872K36964C0653J69692D5531Q1185o1746h386E3404L131
17431E6535J80301K47562k12327j23463L05741A46494M24399e2654B52491m6359
17421B06132d1591C13824N8433j48709R3650D2925J11126c9823F12430B58145
17410B25420A00570O2237n3449J70480f4003B02604M0567A21112j1068L86424
17400D96468A14194N5244h6177B50472H4022L08012A55429j3990a85171B18340
17389A8169N3222j6169K74817I5570B4272D975L33636j6574l7988J39430a95060
17377F405d6603B24743P3135H5055g9311A25162K21382c03195A28600g8040B63298
17365A79803f2152H586d4216B67543l8573a28818A90562J27280I7308J77884D9593
$$ plain form
17353 177017 60241 67550 -31175 -147678 177064 263418 584813 -68593 -197889 213048 354878
17342 354878 222120 442938 -137347 526946 30416 302215 523426 125139 -38042 -56510
17332 -56510 97356 232484 365390 117991 192769 167798 -96363 377539 152327 145900 237186
17321 237186 64620 -69274 287074 123874 -9088 -92596 30730 413831 436555 244939 235478
17310 235478 105213 6865 -228250 147905 20947 453942 278571 255669 221318 198813 563363
17299 563363 388209 305360 35317 370574 302352 189742 70397 -180177 345243 18673
17288 319453 147182 -89517 66207 26452 180411 220373 67759 223752 181196 211803 245212
17277 245212 46456 170140 137420 190010 203849 289448 310249 -57998 403360 220884 364375
$$ packed form
17353A77017F0241P309c1175j16503A77064Q6354L21395f8593j29296B13048J41830
17342C54878j32758K20818a37347E26946C0416K71799K21211A25139c8042j8468
17332e6510I7356J35128J32906A17991P4778k4971i6363C77539A52327o427R1286
17321B37186F4620f9274B87074A23874i088q3508C0730L83101K2724j91616r461
17310B35478A05213F865b28250A47905B0947M32995j75371k2902l4351k2505L64550
17299E63363j75154q2849C5317L35257o8222j12610G0397a80177C45243A8673
17288C19453A47182h9517F6207B6452J53959L9962F7759J55993m2556L0607L3409
17277B45212D6456J23684l2720N2590J3839Q5599K0801e7998D03360j82476J43491
$$ plain form
17266 364375 137702 411028 82195 -52022 433688 228502 -25653 -38475 326784 188926
17256 188926 176860 174449 143909 -33810 269848 146243 1019 323727 468387 189242 262967
17245 262967 -92110 205029 169220 3999 100473 293920 235986 255708 319091 295745 -18060
17233 37226 -36390 385833 113948 104208 182379 173583 161441 380512 -186310 -169444 287472
17221 -293057 376304 145674 143850 186162 54898 353085 185039 -81697 512977 -59555 144701
17209 290936 461579 473898 428481 -112974 490841 179426 90551 369430 34620 334642
17199 334642 257194 149021 82011 372439 83242 579265 249102 395017 405916 207090
17189 207090 232468 230694 157119 356863 182481 138661 501542 121289 466544 498826 502878
$$ packed form
17266C64375A37702K73326H2195e2022D33688k05186b5653j2822C26784j37858
17256A88926j2066k411l0540c3810B69848j23605A019L22708J44660A89242P3725
17245B62967i2110B05029l5809C999R6474J93447n7934J9722O3383k3346a8060
17233C7226c6390C85833A13948r740P8171q796j2142K19071a86310J6866B87472
17221b93057C76304A45674j824M2312E4898K98187j68046h1697E12977e9555A44701
17209B90936J70643J2319m5417a12974D90841A79426q8875K78879C4620L00022
17199C34642p7448j08173o7010K90428H3242M96023B49102J45915J0899j98826
17189B07090K5378j774p3575J99744j74382m3820L62881A21289L45255L2282M052
$$ plain form
17178 502878 41261 611419 321147 344931 447789 168022 283565 412411 468346 82202
17167 398224 238465 435252 362499 323522 325215 465284 453034 715702 171578 165263 182508
17156 182508 471630 375508 323213 475772 115309 -86982 167976 227083 216192 102505
17145 235612 517564 398001 365743 168582 539328 -17035 12578 357062 41744 154127
17135 154127 149091 309841 348821 100451 289505 205770 90274 371957 362945 304168 579393
17124 579393 332092 709934 387358 -6699 -11395 193985 563500 381197 302602 574109
17114 574109 56669 165036 248584 682003 516919 606828 192325 124190 457935 229626
17104 229626 317846 274040 557096 404416 182529 649591 46829 456370 421876 374127
$$ packed form
17178E02878D1261N70158k90272K3784J02858A68022J15543J28846N5935H2202
17167C98224j59759J96787p2753l8977J693J40069j2250K62668A71578o315J7245
17156A82508K89122r6122n2295J52559A15309h6982A67976N9107j0891A02505
17145B35612K81952j19563l2258A68582L70746a7035A2578L44484D1744J12383
17135A54127n036J60750L8980A00451J89054q3735I0274K81683r012n8777K75225
17124E79393k47301L77842l22576f699m696A93985L69515j82303p8595K71507
17114E74109E6669J08367Q3548M33419j65084Q9909A92325o8135L33745k28309
17104B29626Q8220m3806K83056j52680A82529M67062D6829M09541l4494m7749
$$ plain form
17094 374127 627432 180264 205030 417082 537511 646182 482040 443968 457425 332072
17084 332072 463568 587252 457997 444309 235271 339934 367906 443452 321662 560107
17074 560107 722488 757333 588894 502421 401847 848149 298898 101827 390714 359838
17064 359838 557764 500685 747980 714761 614496 510653 676206 314611 509690 640205
17054 640205 461370 496996 837246 573801 694935 542742 711185 614753 281287 894108
17044 894108 322504 126868 547043 613694 405370 731927 557831 621866 572951 508882
17034 508882 536262 622065 379678 586318 485002 652916 839310 536440 592293 574095
17024 574095 616305 516745 535569 792251 702195 657706 843371 668202 732853 728226 758383
$$ packed form
17094C74127K53305A80264K4766K12052J20429J08671j64142l8072J3457j25353
17084C32072J31496J23684j29255j3688k09038J04663K7972P5546j21790K38445
17074E60107J62381L4845j68439q6473j00574M46302B98898A01827K88887l0876
17064C59838J97926n7079K47295l3219j00265j03843J65553C14611J95079J30515
17054F40205j78835L5626L40250k63445J21134j52193J68443r6432B81287O12821
17044H94108C22504A26868M20175O6651k08324L26557j74096O4035m8915o4069
17034E08882K7380Q5803k42387K06640j01316J67914J86394l02870N5853j8198
17024E74095M2210r9560J8824K56682r0056m4489J85665j75169O4651m627L0157
$$ plain form
17013 758383 942339 905379 708936 558524 771698 907478 953644 766783 977150 507216
17003 507216 724098 728206 650429 652013 614491 777078 665246 966956 601503 806607 721839
16992 721839 773740 797448 856937 1090576 926381 941790 1059013 816422 836642 663704
16982 663704 902583 1000466 819753 1070714 1127275 972641 890729 708724 810091 1010474
16972 1010474 812219 823345 762822 1129366 814908 798998 970812 836865 917882 1149952
16962 1149952 672014 698087 1344912 952678 1431169 1124123 681563 1012962 1087411 975613
16952 975613 1196736 953840 1133294 1351594 1167411 1030445 1001814 1298776 746599 1110526
16942 1110526 1447426 1294034 1418768 1485977 1455196 1206778 1483597 1197797 1529759 1585840
$$ packed form
17013G58383J83956l6960j96443j50412K13174J35780M6166j86861K10367m69934
17003E07216K16882M108p7777J584l7522J62587j11832L01710l65453K05104q4768
16992G21839N1901K3708N9489K33639j64195J5409J17223k42591K0220j72938
16982F63704K38879R7883j80713K50961N6561j54634q1912j82005J01367K00383
16972A010474j98255J1126o0523L66544l14458j5910J71814j33947Q1017K32070
16962A149952m77938K6073O46825l92234M78491l07046m42560L31399P4449j11798
16952I75613K21123k42896J79454K18300j84183j36966k8631K96962n52177L63927
16942A110526L36900j53392J24734O7209l0781k48418K76819k85800L31962N6081
$$ plain form
16932 1585840 1403264 1651322 1397571 1299936 1341387 1433748 1513944 1250677 1527599 1532403
16922 1532403 1433908 1468605 1322993 1525531 1412883 1734027 1633322 1953837 1400569 1498395
16912 1498395 1722826 1394260 1506774 1653668 1310856 1803939 1769373 1647561 1676893 2002144
16902 2002144 2025650 1763314 1642740 1720012 2255072 1788023 2043174 1880931 2029078 1876636
16892 1876636 2067676 1926105 2150533 2180653 1681915 1941478 2254503 2356924 2340027 2336723
16882 2336723 2129461 2190910 2211283 2493077 2461472 2387875 2102087 2488518 2477520 2483018 2654858
16871 2654858 2566206 2571722 2807801 2556592 2569827 2951071 2630949 2868783 2754786 2719214
16861 2719214 2495784 3220019 3124414 2920099 3167990 3199431 3118069 3300166 3349215 3466556
$$ packed form
16932A585840j82576K48058k53751r7635M1451R2361Q0196k63267K76922M804
16922A532403r8495L4697j45612K02538j12648L21144j00705L20515n53268R7826
16912A498395K24431l28566J12514J46894l42812M93083l4566j21812K9332L25251
16902B002144K3506k62336j20574P7272N35060m67049K55151j62243J48147j52442
16892A876636J91040j41571K24428L0120m98738K59563L13025J02421j6897l304
16882B336723k07262O1449K0373K81794l1605p3597k85788L86431j0998N498J71840
16871B654858q8652N516K36079k51209J3235L81244l20122K37834j13997l5572
16861B719214k23430P24235r5605k04315K47891L1441q1362J82097M9049J17341
$$ plain form
16851 3466556 3366541 3200330 3315987 3426526 3635209 3556833 3889849 3602013 3826048 3568336
16841 3568336 3679620 4140333 4034605 4014170 4419094 4454437 4322266 4424861 4317441 4575130
16831 4575130 4750111 4597171 4993402 4932712 4939997 5153987 5203198 5056201 5613712 5767085
16821 5767085 5565375 5771066 5504824 5888711 6141600 6040859 6271895 6286276 6549170 6655539
16811 6655539 7121599 7258048 7075583 7038938 7233974 7705110 7770831 7904204 7717468 8354075
16801 8354075 8683223 9037402 9047579 9239915 9118739 9537376 9555602 10163809 10489517 10223104
16791 10223104 11038539 11151507 11475453 11632091 11818376 12549658 13256610 13048489 13492382
16782 13492382 13575325 14301529 14778983 14866169 15517573 16191532 16435482 16958903 17838680 18076926
$$ packed form
16851C466556j00015j66211J15657J10539K08683p8376L33016k87836K24035k57712
16841C568336J11284M60713j05728k0435M04924L5343j32171J02595j07420K57689
16831D575130J74981j52940L96231o0690P285K13990M9211j46997N57511J53373
16821E767085k01710K05691k66242L83887K52889j00741K31036J4381K62894J06369
16811F655539M66060J36449j82465l6645J95036M71136O5721J33373j86736O36607
16801H354075L29148L54179J0177J92336j21176M18637J8226O08207L25708k66413
16791A0223104Q15435J12968L23946J56638J86285P31282P06952k08121M43893
16782A3492382Q2943P26204M77454Q7186O51404O73959K43950N23421Q79777K38246
$$ plain form
16772 18076926 18736650 19490872 19846304 20963414 21734986 22523459 22995020 23999059 25151106
16763 25151106 26060940 26788931 27988833 29361328 30194055 31927529 33126403 34636433
16755 34636433 35993974 37369509 39374255 41104578 43202063 44912380 47148657 49815904
16747 49815904 52317328 54629111 57905621 60784455 63984088 67362952 70943770 74909792
16739 74909792 79253490 83479008 87926084 93015983 98493868 103617962 109512017 115401684
16731 115401684 121078432 127392515 133782673 140099101 146066786 152244434 157876239 162799141
16723 162799141 167462491 171499019 174696194 176922040 178008695 178639271 177763158 176090641
16715 176090641 173533003 169966980 165792211 160692650 155734073 149765256 143804070 137423149
$$ packed form
16772A8076926O59724P54222L55432J117110P71572P88473M71561J004039J152047
16763B5151106R09834P27991J199902J372495Q32727J733474J198874J510030
16755C4636433J357541J375535K004746J730323K097485J710317K236277K667247
16747D9815904K501424K311783L276510K878834L199633L378864L580818L966022
16739G4909792M343698M225518M447076N089899N477885N124094N894055N889667
16731A15401684N676748O314083O390158O316428N967685O177648N631805M922902
16723A62799141M663350M036528L197175K225846J086655O30576q76113j672517
16715A76090641k557638l566023m174769n099561m958577n968817n961186o380921
$$ plain form
16707 137423149 131246677 124742117 118633112 112498340 106742206 101030196 95419097 90212762
16699 90212762 85078186 80667164 76568606 72472378 68311899 64982456 61704314 58238000
16691 58238000 55733683 52385118 50178689 47606156 45710704 43073130 41407347 39544547
16683 39544547 37728693 35932370 34387946 33031873 31356920 30028851 29196733 27832593
16675 27832593 26672202 25809163 24625146 23624516 22863421 22076969 21490140 20084619 19776203
16666 19776203 19223361 18695590 18037785 17067264 16430465 16146440 15668613 15022567 14772070
16657 14772070 13951600 13433280 13183708 12955064 12585445 12160191 11569086 11588741 11312407
16648 11312407 10915739 10784353 10178290 10305871 9846544 9517596 9325728 8784538 8729983
$$ packed form
16707A37423149o176472o504560o109005o134772n756134n712010n611099n206335
16699I0212762n134576m411022m098558m096228m160479l329443l278142l466314
16691E8238000k504317l348565k206429k572533j895452k637574j665783j862800
16683C9544547j815854j796323j544424j356073j674953j328069q32118j364140
16675B7832593j160391q63039j184017j000630p61095p86452n86829j405521l08416
16666A9776203n52842n27771o57805r70521o36799k84025m77827o46046k50497
16657A4772070q20470n18320k49572k28644l69619m25254n91105J9655k76334
16648A1312407l96668j31386o06063J27581m59327l28948j91868n41190n4555
$$ plain form
16639 8729983 8940001 8375731 8114519 7731758 7773730 7307964 7192739 7622929 6897220 6824300
16629 6824300 6699363 6510013 6452919 6315505 6183102 5890742 6030758 5843277 5561121 5905481
16619 5905481 5586264 5527474 5249226 5055924 4900085 4830812 4718064 4919979 4856333 4505421
16609 4505421 4587447 4355909 4063281 4084243 4525952 4269815 4180524 4153577 4033018 3634290
16599 3634290 3808665 3876680 3491322 3542432 3825591 3514231 3113572 3378088 3568556 3822108
16589 3822108 3455977 3000608 3093746 3099578 3201324 2881465 3007815 3113853 2430024 3081480
16579 3081480 3002031 2722822 2747690 2629306 2905051 2490711 2566157 2253299 2174137 2399676
16569 2399676 2268707 2350888 2439909 2474820 2467419 1999624 2121130 2352414 2031584 1963991
$$ packed form
16639H729983K10018n64270k61212l82761M1972m65766j15225M30190p25709p2920
16629F824300j24937j89350n7094j37414j32403k92360J40016j87481k82156L44360
16619E905481l19217n8790k78248j93302j55839o9273j12748K01915o3646l50912
16609D505421Q2026k31538k92628K0962M41709k56137q9291k6947j20559l98728
16599C634290J74375O8015l85358N1110K83159l11360m00659K64516J90468K53552
16589C822108l66131m55369R3138N832J01746l19859J26350J06038o83829O51456
16579C081480p9449k79209K4868j18384K75745m14340P5446l12858p9162K25539
16569B399676j30969Q2181Q9021L4911p401m67795J21506K31284l20830o7593
$$ plain form
16559 1963991 2187346 1825395 2116581 2252509 2095339 2142063 1892907 1875377 1811836 1805486
16549 1805486 1872621 1773309 1722847 1689483 1707511 1739731 1713502 1863130 1637162 1521934 1650018
16538 1650018 1479688 1776621 1715537 1556213 1657141 1462556 1670988 1433993 1414420 1303358
16528 1303358 1117588 1077413 1274296 1358751 1709037 1440232 1401863 1644624 1382275 1183295
16518 1183295 1335802 1223275 1221541 1327151 1558886 1147051 1035650 1043011 1197668 1186893
16508 1186893 965255 1072119 1062127 1588673 1294399 1062054 1065718 1101367 1369126 1044181
16498 1044181 850384 1194571 987906 1124870 898537 946797 990404 839816 851533 1048346
16488 1048346 788865 976112 1148088 727030 1172761 823783 486417 1172856 827828
$$ packed form
16559A963991K23355l61951K91186J35928j57170M6724k49156j7530o3541o350
16549A805486O7135r9312n0462l3364J8028L2220k6229J49628k25968j15228J28084
16538A650018j70330K96933o1084j59324J00928j94585K08432k36995j9573j11062
16528A303358j85770m0175J96883Q4455L50286k68805l8369K42761k62349j98980
16518A183295J52507j12527j734J05610K31735m11835j11401P361J54657j0775
16508A186893k21638J06864r992N26546k94274k32345L664L5649K67759l24945
16498A044181j93797L44187k06665J36964k26333M8260M3607j50588J1717J96813
16488A048346k59481J87247J71976m21058M45731l48978l37366O86439l45028
$$ plain form
16479 827828 705559 765918 1000328 887458 1018341 928405 1068210 680536 879316 610451
16469 610451 937569 453207 722586 814056 766293 566735 848451 295443 668940 716795
16459 716795 751655 835463 1036883 428345 534095 629131 831845 539431 1065569 455867
16448 770081 425698 661917 797970 829445 724044 549773 779436 693170 768944 405272
16438 405272 484153 648269 612070 485109 770761 392514 427061 540598 838395 615773
16428 615773 685069 443951 526904 551872 457121 351905 682284 503187 613191 302938
16417 324041 550752 465201 448206 480995 291054 518352 352744 533808 802156 768922
16407 768922 596751 517835 532171 505884 547752 411042 526516 302234 145446 711067
$$ packed form
16479H27828j22269O0359K34410j12870J30883q9936J39805l87674J98780k68865
16469F10451L27118D53207K69379R1470m7763j99558K81716B95443L73497M7855
16459G16795L4860Q3808K01420D28345J05750R5036K02714k92414N26138D55867
16448G70081l44383K36219J36053L1475j05401j74271K29663q6266P5774l63672
16438D05272P8881J64116l6199j26961K85652l78247L4547J13537K97797k22622
16428F15773O9296k41118Q2953K4968r4751j05216L30379j79097J10004C02938
16417C24041K26711q5551j6995L2789j89941K27298j65608J81064K68348l3234
16407G68922j72171p8916J4336k6287M1868j36710J15474k24282A45446N65621
$$ plain form
16397 711067 470497 338342 348436 551334 572042 407257 384825 290951 603497 682988
16387 682988 297719 241651 313418 285492 192972 418995 162690 617340 292864 215269
16377 215269 561051 659783 481717 534577 409520 606991 421192 624414 269251 144812
16367 144812 482101 315042 412369 171110 329855 339963 166416 356239 472394 667810
16357 667810 262549 521366 465884 341682 370176 213650 555232 404773 52829 392537
16347 392537 193252 307935 388078 442480 330610 613458 761259 -118643 136222 152232
16337 152232 174766 122462 274337 328976 561988 269530 362966 472451 458719 105665
16326 296512 154153 476083 567909 446266 394458 225381 441441 277393 302919 230075
$$ packed form
16397G11067k40570j32155J0094K02898K0708j64785k2432r3874L12546P9491
16387F82988B97719n6068P1767k7926r2520K26023A62690M54650B92864p7595
16377B15269L45782R8732j78066N2860j25057J97471j85799K03222B69251j24439
16367A44812L37289j67059R7327A71110J58745J0108A66416J89823J16155J95416
16357F67810B62549K58817n5482j24202K8494j56526L41582j50459E2829L39708
16347C92537A93252J14683Q0143N4402j11870K82848J47801a18643A36222J6010
16337A52232K2534n2304J51875N4639K33012B69530R3436J09485j3732A05665
16326B96512j42359L21930R1826j21643n1808j69077K16060j64048K5526p2844
$$ plain form
16316 230075 60032 525479 74398 404259 297043 388660 250634 64161 12133 310536
16306 310536 -40748 52507 -20729 233 170960 227393 9488 218229 43176 264781 168667
16295 168667 62030 -148144 70501 439343 50928 319769 -70683 5066 100609 452276 209853
16283 416843 226070 232159 -58916 410349 -73606 336248 -213662 156141 97226 126532 133436
16272 133436 142457 487250 86259 133465 406918 -39170 31025 65722 -3985 25474 125041
16261 125041 41586 33852 -37168 116985 213190 12852 218757 3108 216546 -168139 276024
16249 201856 166503 302656 131174 28941 78041 10249 138841 249861 -141260 102053
16238 54309 255378 -168057 -41536 84743 289712 276026 123330 -330054 281437 -45792
$$ packed form
16316B30075F0032M65447G4398L29861j07216R1617j38026F4161A2133K98403
16306C10536d0748E2507b0729B33J70727N6433I488K08741D3176K21605r6114
16295A68667F2030a48144G0501L68842E0928K68841g0683E066R5543L51667B09853
16283D16843j90773O089e8916D10349g3606C36248b13662A56141n8915K9306O904
16272A33436R021L44793H6259M7206K73453c9170C1025L4697c985B5474R9567
16261A25041D1586p734c7168A16985R6205A2852K05905C108K13438a68139B76024
16249B01856l5353J36153A31174B8941M9100A0249J28592J11020a41260A02053
16238E4309K01069a68057d1536H4743K04969j3686A23330c30054B81437d5792
$$ plain form
16227 207948 92782 193639 376497 105 249420 98022 197372 76257 131562 -196967 506276
16215 82500 57881 74029 163620 -83119 59982 -3003 -13466 -104589 109625 178025 351349
16204 351349 255015 370353 125674 178277 44430 30051 480183 44504 245680 -153985
16193 124884 184680 153201 41444 -136811 21009 25966 -78179 -130149 58710 -88678 38385
16181 47645 105805 400017 -126699 360798 159395 360903 -71504 102607 125288 241168
16171 241168 229455 144546 101441 170264 9292 146772 33093 24499 214586 224976 248368
16160 248368 138898 157252 205086 167275 -151063 -220477 333193 33439 -180958 67594 -22264
16148 -431884 210253 8624 87820 187229 -38558 144507 -67864 145141 86807 236789 35516
$$ packed form
16227B07948I2782J00857J82858A05K49315I8022R9350G6257N5305a96967E06276
16215H2500k4619J6148Q9591h3119E9982c003j0463r1123A09625O8400J73324
16204C51349r6334J15338A25674N2603D4430j4379M50132D4504K01176a53985
16193A24884N9796l1479D1444a36811B1009M957g8179n1970E8710h8678C8385
16181D7645N8160K94212a26699C60798A59395K01508g1504A02607K2681J15880
16171B41168j1713q4909m3105O8823I292J37480C3093q594J90087J0390K3392
16160B48368j09470J8354M7834l7811a51063o9414C33193C3439a80958F7594b2264
16148d31884B10253H624P9196R9409c8558A44507f7864A45141n8334J49982C5516
$$ plain form
16136 10145 -59859 457469 -18604 246109 404667 -233440 -131776 -373532 19905 319271
16126 319271 -33243 148727 94412 -255142 87409 -597 151871 158828 -202383 -56606 19912
16114 160409 -38402 -246665 -121104 -49513 -47089 130655 -289229 185782 17741 76356 186996
16103 186996 -41290 220154 163389 -6650 -146199 -64190 60372 124770 79879 182203 -46562
16091 540387 -286186 142053 -86390 258185 -107188 122452 385853 -139741 172399 13251
16080 -200396 180098 -134005 -125986 -248992 -35629 272979 95785 182658 -52419 -159630 384202
16068 -52483 -108545 -400629 -35746 -140737 298935 273398 31186 -192666 75525 27885 -225040
16056 -193525 -237925 -284131 -267043 -163799 -125146 91929 135969 53969 -27843 35314 21880
$$ packed form
16136A0145e9859D57469a8604B46109J58558b33440J01664k41756A9905K99366
16126C19271c3243A48727n4315b55142H7409e97A51871O957b02383e6606A9912
16114A60409c8402k08263a21104d9513K424A30655b89229A85782A7741N8615J10640
16103A86996d1290B20154n6765f650j39549f4190F0372O4398m4891J02324d6562
16091E40387b86186A42053h6390B58185a07188A22452K63401a39741A72399A3251
16080b00396A80098a34005Q019j23006c5629B72979I5785Q6873e2419j07211C84202
16068e2483n6062k92084c5746j04991B98935k5537C1186a92666G5525B7885b25040
16056a93525m4400m6206J7088J03244L8653I1929M4040E3969b7843C5314j3434
$$ plain form
16045 21880 -13544 -43081 48328 316795 271252 66649 -49978 -431879 81259 26791 -56395
16033 -99403 20407 -86129 235277 -219557 65666 75077 -140117 -65529 146949 117104 1027
16021 -191512 -124216 85820 -53147 -46569 -186679 -237076 -152911 -101255 136168 95239 -342580
16009 -200963 -92853 -73565 -307166 -85131 -267355 183875 -133161 489100 187662 -165166
15998 36850 -78334 -288660 170711 349823 -121900 -227510 -160476 163524 121118 -24804
15987 13317 219753 -59879 -253635 291161 174671 150698 202919 230196 -160134 318708
15976 340038 -4303 -24370 6108 -122189 99944 19651 -335210 -34577 -97247 -170019 -218629
15965 -218629 90296 67349 303094 103207 99842 52019 -183827 247271 -235530 -49805 -240412
$$ packed form
16045B1880a3544k9537D8328K68467m5543F6649d9978l81901H1259B6791e6395
16033i9403B0407h6129B35277b19557F5666R411a40117f5529A46949k9845A027
16021a91512O7296H5820e3147O578j40110n0397Q4165N1656A36168m0929c42580
16009b00963i2853J9288k33601h5131j82224A83875a33161D89100A87662a65166
15998C6850g8334k10326A70711J79112a21900j05610O7034A63524m2406b4804
15987A3317K06436e9879j93756B91161j16490k3973N2221K7277a60134C18708
15976C40038d303k0067F108a22189I9944A9651c35210c4577o2670p2772m8610
15965b18629I0296k2947K35745A03207l365m7823a83827B47271b35530d9805j90607
$$ plain form
15954 -240412 -279994 -11387 -308319 -122888 -123524 280397 -64991 21871 -107816 113272 24729
15942 -108454 -359950 -143959 151298 -303807 -107350 103767 -40421 -69357 -272554 -136825
15932 -136825 199448 61293 223521 -143831 -494002 42742 2975 -136027 -160338 -69994 -91147
15921 -91147 106295 239459 78203 -42944 -80183 -14355 45903 -89857 -86515 249500 -291405
15909 -249709 -52573 81086 347664 -73426 19712 467847 41521 62831 -122566 102328 -238548
15897 -6977 -161962 -36057 171591 -177149 94896 41870 -19289 -254286 28747 143254 270279
15886 270279 113325 124310 284704 47037 125155 -131194 -17833 -145133 -227870 -59132 133023
15874 111844 107545 51116 -38372 -112058 54439 -51421 -106740 -399026 93216 -42958 -11070
$$ packed form
15954b40412l9582a1387k96932a22888o36B80397f4991B1871a07816A13272B4729
15942a08454k51496a43959A51298c03807a07350A03767d0421k8936k03197J35729
15932a36825A99448F1293J62228a43831l50171D2742B975a36027k4311f9994k1153
15921i1147A06295J33164G8203d2944l7239a4355D5903h9857L342B49500b91405
15909b49709e2573H1086K66578g3426A9712M48135D1521K1310a22566A02328b38548
15897f977j54985c6057A71591a77149I4896D1870a9289k34997B8747J14507J27025
15886B70279A13325J0985J60394D7037P8118a31194a7833j27300q2737e9132A33023
15874A11844m299E1116c8372p3686E4439e1421n5319k92286I3216d2958a1070
$$ plain form
15862 47750 -320624 -245562 145373 226481 160001 -115584 94167 -229288 271194 -254181
15851 -278649 -71541 283762 -30932 -361389 -54546 125870 -30402 21096 -223393 -17956 131533
15839 -15895 -22188 37895 -152553 209144 -4776 27125 29707 -84869 203676 154836 59114 -38694
15826 -93599 -93799 97388 202328 -65248 -239651 47967 257602 129316 -32983 77657 133975
15815 133975 -58919 166331 -20329 -212638 -73308 14481 44674 185027 -97015 -82057 -159937
15804 -159937 -102327 -115833 282855 -49043 31397 199749 -126884 345469 230824 -163027
15793 286977 -381121 -356234 280837 275499 -289699 -199695 43422 -89358 -112596 -127332 -35609
15781 126236 -370324 134700 105168 -127013 265730 21250 -23750 -56667 91755 423528
$$ packed form
15862D7750c20624P5062A45373Q1108o6480a15584I4167b29288B71194b54181
15851b78649g1541B83762c0932l30457e4546A25870c0402B1096b23393a7956A31533
15839a5895o293C7895a52553B09144d776B7125K582h4869B03676m8840E9114c8694
15826i3599k00I7388J04940f5248j74403D7967K09635j28286c2983G7657N6318
15815A33975e8919A66331b0329j92309g3308A4481L0193J40353i7015J4958p7880
15804a59937N7610j3506B82855d9043C1397J68352a26884C45469j14645a63027
15793B86977c81121K4887B80837n338b89699R0004D3422h9358k3238j4736c5609
15781A26236c70324A34700k9532a27013B65730B1250b3750l2917I1755L31773
$$ plain form
15771 423528 -64384 -190920 -23726 -481095 136596 -124331 -241653 -172060 144535 337200
15761 337200 159544 -179926 50979 57991 -123041 -107334 -197232 -53240 -176603 51966 -124458
15749 -31073 -73728 -63983 237636 -249000 -14884 301653 -398163 74667 25333 2242 -22514
15737 -14068 116535 186235 85396 -41776 -174289 -235046 -106078 -122321 -41628 256879 40280
15725 110196 -177870 38812 -149218 143123 192670 -204180 -208024 -279860 -207922 38348 208410
15714 208410 72429 -98012 173730 -280307 256466 104180 -214573 -266885 -9276 -31783 5581
15702 -135306 85275 -237240 -17418 -314705 130976 -37184 -156214 112952 116342 -109251
15691 -290610 102089 43457 -57748 207035 -229881 29086 -30459 -103013 -88300 -382849 94260
$$ packed form
15771D23528f4384j26536b3726m57369A36596a24331j17322O9593A44535J92665
15761C37200A59544a79926E0979P012a23041J5707q9898e3240j23363E1966a24458
15749c1073m2655R745B37636b49000a4884C01653c98163G4667B5333B242b2514
15737a4068A16535O9700H5396d1776j32513o0757a06078j6243d1628B56879D0280
15725A10196a77870C8812a49218A43123M9547b04180l844p1836P1938C8348J70062
15714B08410G2429i8012A73730b80307B56466A04180b14573n2312i276k2507E581
15702a35306H5275b37240a7418k97287A30976c7184j19030A12952L390a09251
15691b90610A02089D3457e7748B07035b29881B9086c0459p2554J4713k94549I4260
$$ plain form
15679 -14992 -145203 -182723 -148458 1081 -108723 -84216 37045 296771 -64256 -92099 -2841
15667 -263054 -555447 -211594 -41067 -401879 -49638 318850 -105979 91576 192510 159340
15657 159340 -21902 -197193 -120405 226878 -32786 -84028 -56221 -285767 -298392 -117717 -141507
15646 -141507 -40862 -118764 -18857 205782 -84982 -98463 -61845 -270184 66174 38851 418237
15635 418237 -243610 289232 18759 -21997 -31386 82288 -41388 77520 208133 -126636 -74784
15624 -74784 86727 -202012 12619 -72162 297958 -261233 128605 -29771 -251320 -44682 42851
15612 271468 -146880 -282658 149224 29180 -328514 78534 -52407 -152221 -32637 -113855 -103636
15601 -103636 -98614 -17684 -340056 -12706 277553 113721 -41639 12741 113012 304031 -206258
$$ packed form
15679a4992j30211l7520L4265A081a08723K4507C7045K59726f4256k7843b841
15667b63054k92393b11594d1067l60812d9638C18850a05979I1576J00934l3170
15657A59340b1902j75291P6788B26878c2786n1242K7807k29546j2625a17717k3790
15646a41507d0862p7902a8857B05782h4982j3481L6618k08339F6174k7323L79386
15635D18237b43610B89232A8759b1997r389H2288d1388G7520J30613a26636N1852
15624g4784H6727b02012A2619g2162B97958b61233A28605b9771k21549d4682D2851
15612B71468a46880j35778A49224B9180c28514G8534e2407r9814c2637q1218J0219
15601a03636N022a7684l22372a2706B77553A13721d1639A2741J00271J91019b06258
$$ plain form
15589 -140288 40991 90409 199251 224782 -19036 58056 77970 192686 172368 171789 -293993
15577 96275 26130 -60659 -71371 40097 37042 -202924 -116656 594 -17821 -32098 -70300 -79293
15565 -79293 94988 230355 75667 -299257 96372 204926 -92904 -354428 370739 140011
15554 -207815 -83705 57393 -65941 55520 -160857 -322571 86182 -302271 351318 94173 -160858
15542 -96380 83183 88723 209826 -174683 172299 58200 38326 95590 21495 -62421 -115907
15531 -115907 -44637 16798 85762 3049 188299 10280 123549 -169660 120717 -61544 -41729
15520 -41729 -350367 -202538 6000 156506 -135131 -291391 -71653 185314 122726 311101
15510 311101 -71987 241933 -146189 -149520 -1710 342479 -145029 -554269 111732 -20326 -61388
$$ packed form
15589a40288D0991M9418J08842K5531a9036E8056J9914J14716k0318n79b93993
15577I6275B6130f0659j0712D0097l055b02924Q6268E94a7821j4277l8202q993
15565g9293I4988J35367G5667b99257I6372J08554i2904k61524C70739A40011
15554b07815h3705E7393f5941E5520a60857j61714H6182c02271C51318I4173a60858
15542i6380H3183N540J21103a74683A72299E8200j9874N7264B1495f2421n3486
15531a15907d4637A6798O8964C049J85250A0280J13269a69660A20717f1544J9815
15520d1729l08638J47829F000J50506a35131j56260g1653A85314o2588J88375
15510C11101g1987B41933a46189l331a710C42479a45029m09240A11732b0326m1062
$$ plain form
15499 -61388 -285114 -53836 -100188 346442 -344600 29229 136103 174867 -188318 96846 -292643
15487 242293 -23498 243545 -201403 137490 5104 -66473 230340 -121031 311464 133502
15476 14526 -225576 -159849 239214 54267 -133254 -633809 -96190 -96248 -122013 65424 -76355
15464 -61613 207390 163196 -80337 -18826 108714 148161 -276233 159245 15724 -225376 80514
15452 -56082 -183930 -88605 14442 178679 305875 150202 -25235 29663 318038 721 -213754
15440 147999 -4678 -159705 -128331 24624 -177094 -134836 -44413 47418 42499 44244 -549886
15428 -281468 -16586 11489 -61916 -1611 55316 -63627 -242421 -8134 -132725 245419 43876
15416 -113305 -144853 198020 -49973 -18859 13968 -202822 101626 -97874 -198627 -182765 -108633
$$ packed form
15499f1388k23726e3836m6352C46442c44600B9229J06874L8764a88318I6846b92643
15487B42293b3498B43545b01403A37490E104f6473B30340a21031C11464A33502
15476A4526b25576O5727B39214E4267a33254n00555i6190n8k5765F5424g6355
15464f1613B07390m4194h0337a8826A08714L9447b76233A59245A5724b25376H0514
15452e6082j27848h8605A4442J64237J27196A50202b5235B9663K88375G21b13754
15440A47999d678j55027L1374B4624a77094M2258d4413D7418m919J745e49886
15428b81468a6586A1489f1916a611E5316f3627j78794h134j24591B45419D3876
15416a13305l1548A98020d9973a8859A3968b02822A01626i7874j00753J5862P4132
$$ plain form
15405 -108633 61542 -284538 -209333 -60797 179322 14808 95318 -208290 102765 -163654
15394 318111 289622 -23710 -95547 -295637 -289127 -153845 -152256 -124523 55879 46503 -116515
15382 180313 86220 -8330 -57053 66143 288200 20185 211246 213271 -160896 -195900 2986
15370 105944 -275129 -354434 55145 123793 76287 4652 187673 99605 176327 -64925 -15411
15358 -46065 -26394 187691 85231 -290462 -28661 183390 211095 138262 193695 -295670 33515
15346 239710 737 -151225 -284867 -94637 445072 -41748 243079 165297 143387 -320266 152700
15334 -62371 11564 49706 312931 128219 202830 35545 178885 25046 -119494 -122283 280385
15322 149277 -73499 159438 -251713 -15893 249493 -398867 -132132 231123 89119 -31489
$$ packed form
15405a08633F1542b84538P5205f0797A79322A4808Q0510b08290A02765a63654
15394C18111k8489b3710p1837k00090O510J35282J589K7733E5879r376a16515
15382A80313H6220h330m8723F6143K22057B0185J91061K025a60896l5004B986
15370A05944b75129p9305E5145O8648m7506D652J83021q8068P6722f4925a5411
15358d6065J9671A87691H5231b90462b8661A83390K7705p2833N5433b95670C3515
15346B39710G37a51225j33642i4637D45072d1748B43079p7782k1910c20266A52700
15334f2371A1564L8142K63225A28219P4611C5545J43340B5046a19494k789B80385
15322A49277g3499A59438b51713a5893B49493c98867a32132B31123H9119c1489
$$ plain form
15311 138164 181242 117967 -310004 58265 370440 -25171 220161 149730 -77874 62749 -115373
15299 209353 -72201 183981 -189711 -127390 -26167 -20413 152391 -62401 -22528 239759 -143317
15287 50233 -56749 60769 -197896 -188887 -363465 178781 -248916 202416 190685 103238 268503
15276 268503 -65981 -139294 109988 -29333 142895 -155083 137461 111321 157824 -70004 -76043
15265 -76043 119330 27942 101463 -139129 -57702 141012 2484 33002 187034 203012 15237
15253 329864 72080 335189 339761 478827 1160767 1322682 1001397 1299301 520852 235229
15242 -67344 177116 58723 339983 122783 305786 223769 161327 338928 332321 148719 92755
15231 92755 32836 -7452 -140315 -8606 69537 -60904 66402 80287 46775 306313 -85645 -119257
$$ packed form
15311A38164M3078o3275c10004E8265L12175b5171B20161p0431g7874F2749a15373
15299B09353g2201A83981a89711O2321b6167N754A52391f2401b2528B39759a43317
15287E0233e6749F0769a97896R009j74578A78781b48916B02416j1731q7447J65265
15276B68503f5981p3313A09988b9333A42895a55083A37461k6140M6503g0004o039
15265g6043A19330B7942P3521a39129e7702A41012B484L0518J54032J5978A5237
15253C29864G2080K63109M572J39066O81940J61915l21285K97904E20852B35229
15242f7344A77116E8723K81260A22783J83003q2017o2442J77601o607A48719n5964
15231I2755C2836g452j32863h606F9537f0904F6402J3885l3512K59538h5645l3612
$$ plain form
15219 -119257 471475 168624 118635 56085 93939 180697 -152999 156668 442892 240510
15209 240510 316926 434925 198175 71477 285634 356179 -165064 53862 388672 54170
15198 -242750 145580 33009 80407 30033 212804 22577 -125493 -405078 -39208 148527
15187 -189991 -88398 -147469 -134993 229839 75525 73110 36868 -35480 286817 -24229 -49007
15176 -49007 8192 -522084 271904 191240 147920 -208041 182859 -111130 31078 40718 -62774
15164 108175 -72772 84736 2827 -149432 132937 -111265 129879 59318 51768 4536 104479
15153 104479 63986 -111941 109114 219144 134060 81885 -214605 392185 -36117 258220
15142 -38435 158002 57192 164753 506975 27028 -126899 -125359 -117677 44754 -99895 82969
$$ packed form
15219a19257D71475A68624m9989E6085L7854Q6758a52999A56668K86224k02382
15209B40510P6416J17999A98175G1477K14157P0545a65064E3862L34810E4170
15198b42750A45580C3009M7398C0033J82771B2577a25493k79585c9208A48527
15187a89991h8398n9071J2476B29839G5525k415l6242c5480B86817b4229k4778
15176d9007H192e22084B71904q0664m3320b08041A82859a11130C1078R640f2774
15164A08175g2772H4736B827a49432A32937a11265A29879E9318p550D536R9943
15153A04479m0493a11941A09114J10030q5084n2175b14605C92185c6117B58220
15142c8435A58002E7192J07561L42222B7028a26899J540P682D4754i9895H2969
$$ plain form
15130 -55346 133261 -193099 352331 422234 347833 -13190 430527 265229 -251890 43565
15119 42243 93830 -4538 326902 166628 296136 41578 293796 99567 140394 -196098 -192648
15108 -192648 238362 -67222 66045 447687 74322 39820 411960 149605 550506 38962
15097 -176631 392903 65597 30425 78873 50382 205937 171630 -210446 100470 321908
15087 321908 11210 146374 107257 -107902 113260 -31482 96815 334106 193755 13437
15076 27744 97119 7740 472081 7021 93445 209282 322281 191393 39591 175526 137014
15065 137014 220785 -197821 -127112 142116 223564 507348 129437 455275 239337 339736
15055 339736 432003 328971 162842 204293 437692 122785 273196 122152 277273 67242
$$ packed form
15130e5346A33261a93099C52331O9903p4401a3190D30527j65298b51890D3565
15119D2243N1587d538C26902j60274J29508D1578K52218I9567M0827a96098L450
15108a92648B38362f7222F6045L81642G4322l4502L72140A49605M00901C8962
15097a76631C92903F5597C0425M8448k8491J55555l4307b10446A00470K21438
15087C21908A1210J35164l9117a07902A13260c1482I6815K37291j40351A3437
15076B7744O9375G740M64341G021Q6424J15837J12999j30888C9591J35935l8512
15065A37014Q3771a97821P0709A42116Q1448K83784A29437L25838k15938J00399
15055C39736R2267j03032A62842M1451K33399A22785J50411A22152J55121F7242
$$ plain form
15044 -281382 88768 15450 161919 -94210 194480 123812 30004 220051 52324 34909 -142453
15032 123977 192512 186149 406050 -81707 303521 87321 257145 15646 70169 185340 303361
15021 303361 177252 172720 217141 137405 107493 66108 131421 94131 7019 347250 163635
15009 230122 170209 208249 351664 272013 -70502 72088 81576 246659 386458 239723 289723
14998 289723 421183 69391 387991 93024 10182 376285 361994 159973 468627 -244269
14987 10751 216643 351099 -9037 24250 97852 136061 170541 264383 282000 322069 156075
14975 277312 100616 6032 301524 197969 193500 355735 162566 377750 217153 -283252
14964 156477 330651 343986 450903 256157 240822 188064 222948 208298 216952 173196 142027
$$ packed form
15044b81382H8768A5450J46469i4210A94480p0668C0004J90047E2324j7415a42453
15032A23977O8535o363K19901h1707C03521H7321J69824A5646N4523J15171J18021
15021C03361j26109m532M4421p9736k9912m1385O5313l7290G019L40231A63635
15009B30122n9913L8040J43415p9651g0502G2088R488J65083J39799j46735N0000
14998B89723J31460F9391L18600I3024A0182L66103j4291A59973L08654b44269
14987A0751K05892J34456i037B4250P3602L8209L4480R3842J7617M0069A56075
14975B77312A00616F032K95492j03555m469J62235A62566K15184j60597b83252
14964A56477J74174J3335J06917j94746j5335n2758L4884j4650Q654m3756l1169
$$ plain form
14953 142027 510376 -24656 111404 118722 477115 375398 114765 85941 260976 421335
14943 421335 246146 287457 339603 111170 273072 290181 245644 220362 635199 401558
14933 401558 276866 430719 375947 344350 305217 392191 157751 368430 386430 465097 424663
14922 424663 -5889 168286 308685 334180 -18834 272889 108273 484710 357255 72024
14911 322461 264990 231903 266065 193448 -116995 385496 171405 344698 107190 278040
14901 278040 429358 318745 327048 307245 33338 525053 312444 64891 430892 40868 283171
14890 283171 340719 518297 107971 464106 291018 426605 617423 349586 301552 284637
14880 284637 210640 330721 456991 717884 249749 434997 316879 359271 292772 438830
$$ packed form
14953A42027L68349b4656A11404P318L58393j01717A14765k8824J75035J60359
14943D21335j75189M1311N2146A11170J61902J7109m4537k5282M14837k33641
14933D01558j24692J53853n4772l1597l9133Q6974A57751K10679J8000P8667m0434
14922D24663e889A68286J40399K5495a8834B72889A08273L76437j27455G2024
14911C22461n7471l3087L4162p2617a16995C85496A71405J73293A07190J70850
14901B78040J51318j10613Q303j9803C3338M91715k12609F4891L66001D0868K42303
14890B83171N7548J77578A07971L56135j73088J35587J90818k67837m8034j6915
14880B84637p3997J20081J26270K60893B49749J85248j18118M2392o6499J46058
$$ plain form
14870 438830 59442 198833 358706 579335 514106 256327 283056 601462 22819 404939
14860 404939 109172 407077 556555 540228 581222 345351 264859 344132 381691 564404
14850 564404 452047 290333 190497 323209 372176 461990 335483 682487 603529 353483
14840 353483 490188 169729 389242 493999 551151 499588 484067 550703 367620 570814
14830 570814 284950 271984 585224 763181 362813 252357 537681 141652 496505 245023
14819 453075 407188 192847 327926 381199 340496 540281 700744 645102 430528 554814
14809 554814 389925 640109 605724 487085 616594 641303 501242 531595 583998 565510
14799 565510 731251 274682 606438 774919 662924 325350 444049 381229 682869 506961
$$ packed form
14870D38830E9442J39391J59873K20629o5229B56327K6729L18406B2819L82120
14860D04939A09172K97905J49478j6327M0994k35871q0492P9273L7559J82713
14850E64404j12357j61714r9836J32712M8967Q9814j26507L47004p8958k50046
14840C53483J36705A69729K19513J04757N7152n1563j5521O6636j83083K03194
14830E70814B84950j2966L13240J77957C62813j10456K85324A41652L54853B45023
14819D53075m5887A92847J35079N3273m0703J99785J60463n5642k14574J24286
14809E54814j64889K50184l4385j18639J29509K4709j40061L0353N2403j8488
14799E65510J65741B74682L31756J68481j11995C25350J18699o2820L01640j75908
$$ plain form
14789 506961 596623 307367 617444 699802 641811 503897 607630 347124 442798 767108
14779 767108 759589 458065 1006197 521336 537531 194874 554754 724531 438406 417488
14769 417488 689484 881974 627288 706751 277248 678584 607899 390694 778932 539508
14759 539508 885634 462594 866161 814560 593966 755484 320083 602796 931369 673988
14749 673988 673553 530322 689498 594882 868188 658801 656792 533370 658674 568336 574442
14738 574442 924620 367200 999620 669774 835817 744875 650894 818249 593739 578831
14728 578831 580988 929518 666142 578188 529711 878813 1068758 702638 650181 845804
14718 845804 685282 1112833 767796 711741 1031530 901480 544552 672450 820716 316124
$$ packed form
14789E06961Q9662k89256L10077Q2358n7991j37914J03733k60506R5674L24310
14779G67108p519l01524N48132m84861J6195A94874L59880J69777k86125k0918
14769D17488K71996J92490k54686P9463B77248M01336p0685k17205L88238k39424
14759E39508L46126m23040M03567n1601k20594J61518C20083K82713L28573k57381
14749F73988m35j43231J59176r4616K73306k09387k009j23422J25304r0338O106
14738E74442L50178C67200O32420l29846J66043r0942r3981J67355k24510j4908
14728E78831K157L48530k63376q7954m8477L49102J89945l66120n2457J95623
14718H45804j60522M27551l45037n6055L19789j30050l56928J27898J48266C16124
$$ plain form
14707 937157 917145 718100 924115 917946 880212 1005356 864832 1274685 1198725 980705
14697 980705 959461 906331 877314 873467 944451 1022740 997627 730793 712329 974408 928484
14686 928484 999609 765494 931127 928608 1133343 1013464 1067045 1076437 899311 847590 1087347
14675 1087347 819982 728159 1031144 1225139 935238 929932 1138556 900948 961898 879358
14665 879358 1004148 1246081 1093612 935035 895322 1097444 689578 1209952 1165794 1038507
14655 1038507 1053925 955839 1328833 1476837 1243582 1084128 1241473 1362995 894798 1271440
14645 1271440 1134244 1409301 1267232 1277824 1288611 1040483 1674173 1179722 1265939 1256024
14635 1256024 1203423 1656533 1610417 1651624 1175648 1303792 1205532 1308923 1607874 1286664
$$ packed form
14707I37157k0012j99045K06015o169l7734J25144j40524M09853p5960k18020
14697I80705k1244n3130k9017l847P0984P8289k5113k66834j8464K62079m5924
14686I28484P1125k34115J65633k519K04735j19879N3581R392j77126n1721K39757
14675A087347k67365r1823L02985J93995k89901n306K08624k37608O0950q2540
14665H79358J24790K41933j52469j58577l9713K02122m07866N20374m4158j27287
14655A038507J5418r8086L72994J48004k33255j59454J57345J21522m68197L76642
14645A271440j37196K75057j42069J0592J0787k48128O33690m94451Q6217r915
14635A256024n2601M53110m6116M1207m75976J28144r8260J03391K98951l21210
$$ plain form
14625 1286664 1423973 1269333 1315180 1639981 1215430 1548557 1626244 1561010 1480632 1682198
14615 1682198 1371609 1352277 1434204 1535455 1624431 1711070 1496455 1426718 1434353 1463474 1571876
14604 1571876 1648087 1813081 1682131 1708625 1765007 1759913 1868459 1467796 1626132 1929698
14594 1929698 1903707 1858815 1704254 1768125 1818923 1817149 1867113 1779581 1662406 1984641 1965511
14583 1965511 1779831 2201465 2098915 2280767 2144472 2096140 2359338 1811283 2183955 2026136
14573 2026136 1881937 2610032 2053474 2261393 2022311 2463585 2296299 2434213 2828089
14564 2828089 2435010 2409331 2612500 2590242 2783880 2911607 3002702 3018226 3284905 3445799
14554 3445799 3352231 3873485 4128879 5063639 6247617 8662545 13247278 22569591 37662978
$$ packed form
14625A286664J37309j54640M5847L24801m24551L33127P7687o5234q0378K01566
14615A682198l10589j9332Q1927J01251Q8976Q6639k14615o9737P635K9121J08402
14604A571876P6211J64994j30950K6494N6382n094J08546m00663J58336L03566
14594A929698k5991m4892j54561O3871N0798j774M9964q7532j17175L22235j9130
14583A965511j85680M21634j02550J81852j36295m8332K63198n48055L72672j57819
14573B026136j44199P28095n56558K07919k39082M41274j67286J37914L93876
14564B828089l93079k5679K03169k2258J93638J27727R1095J5524K66679J60894
14554C445799r3568N21254K55394R34760J183978K414928M584733R322313J5093387
$$ plain form
14545 37662978 38987975 23062444 10396242 5281129 2917123 2193639 2350736 1951133
14537 1951133 2029971 2285105 2405356 2054337 2054981 2055660 2281065 2045107 2153046 2392829 2068338
14526 2068338 2064041 2180265 2581571 2569159 2466884 2614952 2339035 2617020 2713515 2846338
14516 2846338 2906495 2766885 2687390 2658951 2907446 2668668 2940113 2621020 2880955 2780628
14506 2780628 2884758 3029187 3122412 2650809 3000274 3371265 3370694 3200967 3291059 3172867
14496 3172867 3475949 3454958 3273116 3504845 3434503 3414676 3239069 3538644 3466087 3490856
14486 3490856 3855459 3613580 3474280 3669049 3664069 3959481 4123552 3875277 4177324 4009927
14476 4009927 4109649 3765306 4216397 4329695 4370956 4362335 4086848 4247201 4317929 4445641
$$ packed form
14545C7662978J324997j5925531A0396242n115113k364006p23484J57097l99603
14537A951133P8838K55134J20251l51019O44O79K25405k35958J07939K39783l24491
14526B068338m297J16224M01306j2412j02275J48068k75917K77985R6495J32823
14516B846338O0157j39610p9495k8439K48495k38778K71445l19093K59935j00327
14506B780628J04130J44429R3225m71603L49465L70991n71j69727R0092j18192
14496C172867L03082k0991j81842K31729p0342j9827j75607K99575p2557K4769
14486C490856L64603k41879j39300J94769m980K95412J64071k48275L02047j67397
14476D009927R9722l44343M51091J13298M1261q621k75487J60353P0728J27712
$$ plain form
14466 4445641 4551058 4263584 4724240 4925797 4715572 4775224 4910222 4742198 5453980 4752700
14456 4752700 5215319 5073403 5120964 5030014 5351730 5404459 5295586 5565317 5512686 5536663
14446 5536663 5872173 5818611 5815773 6056550 6046910 6111828 6473229 6025206 6316972 6214512
14436 6214512 6665082 6262813 6610939 6463518 6885156 6814545 7054452 7236463 7320867 7263805
14426 7263805 7183375 7437329 7421035 7704829 7455970 7585789 7659979 8322787 8308711 8507424
14416 8507424 8642200 8701973 8788455 8637399 8964265 8912018 9245846 9275427 9522411 9871627
14406 9871627 9692496 9769417 10109782 9951319 10027092 10309058 10950231 10776823 11265510 11210606
14396 11210606 11375702 11553051 11629872 11702637 12016890 12278501 12557387 12766914 13109960 13144010
$$ packed form
14466D445641J05417k87474M60656K01557k10225N9652J34998j68024P11782p01280
14456D752700M62619j41916M7561r0950L21716N2729j08873K69731n2631K3977
14446E536663L35510n3562k838K40777r640O4918L61401m48023K91766j02460
14436F214512M50570m02269L48126j47421M21638p0611K39907J82011Q4404n7062
14426G263805q0430K53954j6294K83794k48859J29819P4190O62808j4076J98713
14416H507424J34776N9773Q6482j51056L26866n2247L33828K9581K46984L49216
14406I871627j79131P6921L40365j58463P5773K81966O41173j73408M88687n4904
14396A1210606J65096J77349P6821P2765L14253K61611K78886K09527L43046L4050
$$ plain form
14386 13144010 13405773 13715064 13971943 14034798 14600607 14688741 14922627 15486091 15428790 15982019
14376 15982019 16076661 16844874 16707158 17107459 17101616 17941795 17650745 17975254 18672745 19345331
14366 19345331 19465112 19904464 20217451 21107475 21043822 21577850 22298407 22877959 23349415
14357 23349415 23367793 24305764 24605011 25463175 26005254 26603861 27115547 27465546 28624938
14348 28624938 29227638 29917999 30612308 31238853 31979156 32966861 34049054 34932130 35697373
14339 35697373 36710714 38044934 38691920 40187202 40678749 42234807 43174986 44583140
14331 44583140 46006637 47364629 48783639 50043447 52061036 53510335 55445075 57120538
14323 57120538 58849334 61042390 62925170 64904523 67725356 70155295 72651878 75160874
$$ packed form
14386A3144010K61763L09291K56879O2855N65809Q8134K33886N63464n7301N53229
14376A5982019R4642P68213j37716M00301n843Q40179k91050L24509O97491O72586
14366A9345331J19781M39352L12987Q90024o3653N34028P20557N79552M71456
14357B3349415J8378R37971K99247Q58164N42079N98607N11686L49999J159392
14348B8624938O02700O90361O94309O26545P40303R87705J082193Q83076P65243
14339C5697373J013341J334220O46986J495282M91547J556058R40179J408154
14331D4583140J423497J357992J419010J259808K017589J449299J934740J675463
14323E7120538J728796K193056J882780J979353K820833K429939K496583K508996
$$ plain form
14315 75160874 77830394 80864881 84294346 87054978 90778633 94569916 98272331 102825686
14307 102825686 106983592 111564051 115974599 120978742 126675749 132445377 138496043 144924141
14299 144924141 151798892 158584584 166281014 174210807 183238967 191980155 201289555 211133060
14291 211133060 221724770 232721460 243981617 256116319 268532841 281823715 294955559
14284 294955559 308642028 322652937 336746352 350918279 364913758 378682546 391984466
14277 391984466 404470155 416135469 425892046 433299571 437368970 439061711 439032518 438450786
14269 438450786 438928522 439286163 436907633 433998753 428655472 420275158 410013848 398704167
14261 398704167 386008278 372628607 358601631 343650569 329166501 314959747 301232753
$$ packed form
14315G5160874K669520L034487L429465K760632L723655L791283L702415M553355
14307A02825686M157906M580459M410548N004143N697007N769628O050666O428098
14299A44924141O874751O785692P696430P929793R028160Q741188R309400R843505
14291B11133060J0591710J0996690J1260157J2134702J2416522J3290874J3131844
14284B94955559J3686469J4010909J4093415J4171927J3995479J3768788J3301920
14277C91984466J2485689J1665314R756577P407525M069399J692741k9193n81732
14269D38450786M77736L57641k378530k908880n343281q380314j0261310j1309681
14261C98704167j2695889j3379671j4026976j4951062j4484068j4206754j3726994
$$ plain form
14254 301232753 287370097 274106534 260922051 248797592 236509308 225569680 214713325
14247 214713325 204169716 194641739 185339404 177107290 168825481 161233264 153733997 146941586
14239 146941586 140329448 134330681 128824101 122975278 117848496 112817719 108282706 104138397
14231 104138397 99986138 96001102 92349476 88707019 85649624 82213560 79040563 76223862
14223 76223862 73360395 71119819 68817733 66415029 64056717 61930730 59668193 57939782
14215 57939782 55956161 54635945 52815495 51292404 49561812 48149561 46819983 44983228
14207 44983228 44557569 43463294 41706915 40523034 39511174 38212903 37392420 36295087
14199 36295087 35732858 34837014 33441981 32871356 32150239 31444807 30568026 30108651 28985363
$$ packed form
14254C01232753j3862656j3263563j3184483j2124459j2288284j0939628j0856355
14247B14713325j0543609r527977r302335q232114q281809p592217p499267o792411
14239A46941586o612138n998767n506580n848823n126782n030777m535013m144309
14231A04138397m152259l985036l651626l642457l057395l436064l172997k816701
14223G6223862k863467k240576k302086k402704k358312k125987k262537j728411
14215E7939782j983621j320216j820450j523091j730592j412251j329578j836755
14207D4983228m25659j094275j756379j183881j011860j298271q20483j097333
14199C6295087n62229q95844j395033n70625p21117p05432q76781m59375j123288
$$ plain form
14190 28985363 27949394 27552899 27089035 26792854 25993812 25231091 24404184 24025231 23528887
14181 23528887 23043386 22281066 22265271 21374863 21278742 20836017 20129678 19929886 19579487 19242564
14171 19242564 18607544 18267613 17723820 17575734 17426791 17270643 16672129 16169378 16298053
14162 16298053 15568158 15498600 15473365 14916817 14381124 14492352 14634143 13979678 13810783 13514373
14152 13514373 13051938 13319927 13295154 12444396 12559432 12348938 11881508 11719202 11436222
14143 11436222 11460275 11625365 11458656 10922933 10687498 10970391 10692933 10647579 10324785 10053462
14133 10053462 10204067 9789956 9815584 9591350 9391906 9099874 9092102 8844799 9096030 8816095
14123 8816095 8807542 8424328 8292482 8674778 8224832 7986849 7973146 7605737 7590468 7662225
$$ packed form
14190B8985363j035969l96495m63864k96181p99042p62721q26907l78953m96344
14181B3528887m85501p62320j5795q90408r6121m42725p06339j99792l50399l36923
14171A9242564o35020l39931n43793j48086j48943j56148n98514n02751J28675
14162A6298053p29895o9558k5235n56548n35693J11228J41791o54465j68895k96410
14152A3514373m62435K67989k4773q50758J15036k10494m67430j62306k82980
14143A1436222K4053J65090j66709n35723k35435K82893k77458m5354l22794k71323
14133A0053462J50605m14111K5628k24234j99444k92032p772k47303K51231k79935
14123H816095q553l83214j31846L82296m49946k37983j3703l67409j5269P1757
$$ plain form
14113 7662225 7481440 7512375 7389324 7325303 7137646 6996837 7131741 7028857 6980773 6840430
14103 6840430 6457139 6833955 6519851 6326705 6326823 6426846 6324614 6655704 5922579 5983280
14093 5983280 5677641 5812343 5637334 5758660 5882215 5786720 6001443 5770694 5549368 5535259
14083 5535259 5223060 5261386 5185676 5545781 5129589 5413462 4690579 4650152 4569062 4603090
14073 4603090 4832230 4447408 4561847 4824720 4843973 4803465 4473320 4494629 4441110 4263805
14063 4263805 4483407 3984741 4283605 4175840 4075006 4102070 4273175 3836684 4105925 3697871
14053 3697871 3916557 3895540 3859657 3901304 3728448 3566678 3541863 4060993 3925882 3567096
14043 3567096 3458702 3319012 3440824 3466805 3377639 3449397 3172377 3219404 3356584 3189714
$$ packed form
14113G662225j80785L0935j23051o4021j87657j40809J34904j02884m8084j40343
14103F840430l83291L76816l14104j93146J18J00023j02232L31090p33125O0701
14093E983280l05639J34702j75009J21326J23555r5495K14723k30749k21326j4109
14083E535259l12199L8326p5710L60105m16192K83873p22883m0427q1090L4028
14073D603090K29140l84822J14439K62873J9253m0508l30145K1309n3519j77305
14063D263805K19602m98666K98864j07765j00834K7064J71105m36491K69241m08054
14053C697871K18686k1017l5883M1647j72856j61770k4815N19130j35111l58786
14043C567096j08394j39690J21812K5981q9166P1758k77020M7027J37180j66870
$$ plain form
14033 3189714 3187557 3201517 2985043 3114750 3319389 3341152 3013114 2967595 2762154 2922335
14023 2922335 2905864 2832088 2973535 2873071 2744324 2936820 2960750 2394224 2477661 2634321
14013 2634321 2187587 2799951 2531925 2765319 2586575 2499943 2325859 2423469 2289914 2165303
14003 2165303 2545093 2409601 2129168 2208200 2463564 2323886 2078895 1885830 1948509 2262706
13993 2262706 2127064 2467621 2242684 3061832 4589026 7857390 15594996 31427580 38927581
13984 38927581 27551889 15808120 9812629 6529236 5022663 3872385 3690318 3453958
13976 3453958 3602736 3280829 2968650 2591613 2362056 2843449 2500932 2797421 2445910
13967 2445910 2459593 2179839 2189267 2214701 2198316 2504104 2338741 2050266 2343525 2423442
$$ packed form
14033C189714k157J3960k16474J29707K04639K1763l28038m5519k05441J60181
14023B922335j6471p3776J41447j00464j28747J92496K3930n66526Q3437J56660
14013B634321m46734O12364k68026K33394j78744q6632j74084R7610j33555j24611
14003B165303L79790j35492k80433P9032K55364j39678k44991j93065O2679L14197
13993B262706j35642L40557k24937Q19148J527194L268364P737606J5832584P500001
13984C8927581j1375692j1743769n995491l283393j506573j150278j82067k36360
13976C453958J48778l21907l12179l77037k29557M81393l42517K96489l51511
13967B445910J3683k79754R428K5434j6385L05788j65363k88475K93259P9917
$$ plain form
13957 2423442 2261470 2287891 2157596 1714704 2078953 2086742 2189891 2233927 1602625 1845545
13947 1845545 1709147 2100227 1885887 1720787 1761649 1975094 1966288 1990572 2086556 1904511
13937 1904511 1735562 2146462 1582158 1640246 1723466 2005473 1677915 1653218 1688065 1909594
13927 1909594 1497070 1764692 1804360 1813400 1420590 1615810 1831635 1604895 1845667 1678842
13917 1678842 1496165 1651831 1427811 1439048 1733933 1552408 1411345 1419265 1238039 1399464
13907 1399464 1842159 1694714 1361176 1693859 1526687 1331520 1416603 1414232 1323721 1475308
13897 1475308 1533472 1461770 1309979 1461412 1252253 1390914 1502071 1406906 1221791 1322184
13887 1322184 1435474 1314866 1429495 1299000 1440820 1184035 1420342 1187133 1432601
$$ packed form
13957B423442j61972K6421j30295m42892L64249P789J03149M4036o31302K42920
13947A845545j36398L91080k14340j65100M0862K13445q806K4284R5984j82045
13937A904511j68949M10900n64304N8088Q3220K82007l27558k4697L4847K21529
13927A909594m12524K67622L9668R040l92810J95220K15825k26740K40772j66825
13917A678842j82677J55666k24020J1237K94885j81525j41063P920j81226J61425
13907A399464M42695j47445l33538L32683j67172j95167Q5083k371r0511J51587
13897A475308N8164p1702j51791J51433k09159J38661J11157r5165j85115J00393
13887A322184J13290j20608J14629j30495J41820k56785K36307k33209K45468
$$ plain form
13878 1432601 1398298 1214175 1341996 1104977 1323431 1534080 1364675 1580493 1353550 1414863
13868 1414863 955395 900917 897331 921327 1248111 1267448 1137066 1287467 1197329 1328337
13858 1328337 1333226 1367829 1065952 942766 1317954 1152838 1450067 1119169 987757 1183994
13848 1183994 939646 1019603 1373619 935810 756632 1286664 1107059 1191897 1096891 1235370
13838 1235370 985797 1151023 966480 1262757 931712 1047658 936316 889685 1031551 1204480
13828 1204480 774282 697705 1168722 1090504 1123403 938788 1081604 981754 1134451 1191501
13818 1191501 750804 823840 907618 1027012 1145116 824032 854940 846118 713709 1202549
13808 1202549 927161 804701 894428 725595 1150240 740369 857730 1089960 926895 576380
$$ packed form
13878A432601l4303j84123J27821k37019K18454K10649j69405K15818k26943O1313
13868A414863m59468n4478l586K3996L26784J9337j30382J50401r0138J31008
13858A328337M889L4603l01877j23186L75188j65116K97229l30898j31412J96237
13848A183994k44348P9957L54016m37809j79178N30032j79605Q4838r5006J38479
13838A235370k49573J65226j84543K96277l31045J15946j11342m6631J41866J72929
13828A204480m30198p6577M71017p8218L2899j84615J42816r9850J52697N7050
13818A191501m40697P3036Q3778J19394J18104l21084L0908q822j32409M88840
13808A202549k75388j22460Q9727j68833M24645m09871J17361K32230j63065l50515
$$ plain form
13798 576380 1003160 926224 924591 877946 787543 849448 665589 655623 930672 659918 710515
13787 710515 753414 805650 839419 764666 993467 623362 999567 731448 618485 989131
13777 989131 765104 867790 757162 693975 552751 927053 792080 760226 635749 688425
13767 688425 1006033 768686 918044 814701 685769 1005083 796596 519195 560631 748811
13757 748811 658818 706289 369041 740325 825882 998266 701815 917392 756064 606194
13747 606194 770507 694722 734743 710457 986729 962958 701833 472412 502434 483731 551208
13736 551208 422022 507179 729663 949041 602401 576199 495477 459486 660308 705430
13726 705430 706900 747634 332778 548902 772087 619019 690859 654532 473189 785446
$$ packed form
13798E76380M26780p6936j633m6645r0403O1905j83859r966K75049k70754N0597
13787G10515M2899N2236L3769p4753K28801l70105L76205k68119j12963L70646
13777I89131k24027J02686j10628o3187j41224L74302j34973l1854j24477N2676
13767F88425L17608k37347J49358j03343j28932L19314k08487k77401M1436J88180
13757G48811q9993M7471l37248L71284Q5557J72384k96451K15577j61328j49870
13747F06194J64313p5785M0021k4286K76272k3771k61125k29421L0022j8703O7477
13736E51208j29186Q5157K22484K19378l46640k6202q0722l5991K00822M5122
13726G05430J470M0734C32778K16124K23185j53068P1840l6327j81343L12257
$$ plain form
13716 785446 667066 640130 574306 678956 712904 119183 321647 453747 629375 521721
13706 521721 169307 719177 584506 571110 699832 470316 502847 380616 312515 640566
13696 640566 407153 471248 470055 685512 716254 709120 187243 660122 534513 439785 645958
13685 645958 476940 716749 706358 545596 664101 649881 400865 659636 539679 174351
13674 592310 494568 547051 625031 489072 508357 872559 393534 273877 327049 223285
13664 223285 456999 298417 400757 470311 321785 460060 618787 479186 512372 625399
13654 625399 322210 613657 454527 143308 518760 668002 499595 552271 510979 271215
13644 271215 628931 79122 354445 354810 795177 558685 501034 578517 224212 556890 271792
$$ packed form
13716G85446j18380k6936o5824J04650L3948A19183K02464J32100J75628j07654
13706E21721A69307N49870j34671j3396J28722k29516L2531j22231o8101L28051
13696F40566k33413O4095j193K15457L0742p134A87243M72879j25609r4728K06173
13685F45958j69018K39809j0391j60762J18505j4220k49016K58771j19957A74351
13674E92310r7742N2483P7980j35959J9285L64202C93534j19657N3172j03764
13664B23285K33714j58582J02340O9554j48526J38275J58727j39601L3186J13027
13654F25399l03189K91447j59130A43308L75452J49242j68407N2676m1292k39764
13644B71215L57716G9122K75323L65M40367k36492n7651P7483B24212L32678B71792
$$ plain form
13632 412139 417036 207356 224743 599747 171381 130680 808093 108676 323172 440340
13622 440340 439875 580009 344873 543994 741126 607658 309139 591204 523172 741333
13612 741333 448822 391431 523349 454775 299719 430368 135339 304707 423552 463893
13602 463893 539174 193432 394047 432508 249145 474073 385527 565413 313343 200928
13592 200928 423878 677686 255251 453297 417462 600129 592395 568239 313878 631556
13582 631556 503203 316915 501441 589755 553064 182742 438016 800854 479821 399066
13572 399066 454616 362169 604678 421428 328610 268631 489303 491808 772601 118653 296084
13561 296084 433039 174699 530732 401277 274217 185180 483579 488454 412329 517789
$$ packed form
13632D12139M897B07356J7387L75004A71381m0701O77413A08676K14496J17168
13622D40340m65J40134k35136J99121J97132j33468k98519K82065o8032K18161
13612G41333k92511n7391J31918o8574j55056J30649A35339J69368J18845M0341
13602D63893P5281A93432K00615L8461j83363K24928q8546J79886k52070j12415
13592B00928K22950K53808B55251J98046l5835J82667p734k4156k54361L17678
13582F31556j28353j86288J84526Q8314l6691A82742K55274L62838l21033q0755
13572C99066N5550r2447K42509j83250r2818n9979K20672K505K80793A18653J77431
13561B96084J36955A74699L56033j29455j27060q9037K98399M875p6125J05460
$$ plain form
13551 517789 356274 10018 317582 356900 225243 413535 132564 397063 61841 505879
13541 505879 -31000 226624 344616 470210 260488 398751 454327 326741 300500 339356
13531 339356 290108 187504 536893 215175 453511 32544 467051 354977 266213 427607
13521 427607 276240 228668 362005 311553 -49735 654014 217294 203882 371812 207484
13511 207484 423749 418953 568132 182039 574513 694818 400062 231197 458027 324042
13501 324042 332105 309741 517535 478111 411548 184457 580097 280927 203292 474808 481035
13490 481035 119627 351034 137996 243804 174523 330789 139867 373861 45232 125174
13480 125174 259651 157917 377637 331339 91796 193606 255841 259698 332347 282468 262537
$$ packed form
13551E17789j61515A0018L07564L9318j31657J88292A32564K64499F1841M44038
13541E05879c1000B26624J17992J25594k09722J38263N5576j27586k6241L8856
13531C39356m9248j02604L49389B15175K38336C2544M34507j12074q8764J61394
13521D27607j51367m7572J33337n0452d9735F54014B17294j3412J67930j64328
13511B07484K16265m796J49179A82039L92474J20305k94756j68865K26830j33985
13501C24042Q063k2364K07794l9424o6563A84457L95640B80927p7635K71516O227
13490D81035A19627K31407A37996J05808o9281J56266A39867K33994D5232P9942
13480A25174J34477j01734K19720m6298I1796J01810O2235L857P2649m9879j9931
$$ plain form
13469 262537 244230 140863 376296 44320 291118 458883 -22033 294419 251522 448362
13459 448362 113434 -133265 -6616 280423 520675 74862 391815 480298 119873 249419
13449 249419 260128 106395 273181 554350 515505 325740 116452 382200 305386 347377
13439 347377 59567 462477 230373 146411 243646 337096 495974 485842 420771 143474 290738
13428 290738 118533 515381 -241111 153141 -23301 514183 104901 153763 66597 222499
13418 222499 468827 270531 488179 120556 179670 207962 124252 332803 523710 209649
13407 -13071 -70904 372279 71774 -140308 208593 22086 -17586 153448 -19912 60797 58115
13396 58115 103617 210590 134872 150586 163047 377936 -141835 -42143 228606 309981 251550
$$ packed form
13469B62537j8307j03367K35433D4320K46798J67765b2033B94419m2897J96840
13459D48362A13434a33265f616B80423K40252G4862L16953Q8483A19873J29546
13449B49419J0709A06395J66786K81169l8845j89765A16452K65748p6814M1991
13439C47377E9567M02910B30373q3962R7235R3450J58878j0132o5071A43474J47264
13428B90738A18533L96848b41111A53141b3301E14183A04901M8862F6597J55902
13418B22499K46328j98296K17648A20556N9114K8292q3710K08551J90907B09649
13407a3071n7833C72279G1774a40308B08593B2086a7586A53448a9912F0797k682
13396E8115M5502J06973p5718J5714J2461K14889a41835d2143B28606Q1375n8431
$$ plain form
13385 251550 441567 34507 199995 64608 47683 335985 223304 -66586 120194 33048
13374 242466 293046 343623 160452 249631 147012 278685 553295 -42593 330808 301262
13364 301262 66179 242255 359243 296841 -298676 442417 -253020 352297 447093 42337
13353 672102 285663 268513 123634 266026 210479 359582 360775 467030 376735 303699 325913
13342 325913 429460 151530 421066 415227 392341 407642 399397 261456 108123 67354 263534
13331 263534 121546 442216 87888 165284 118898 154001 317814 439919 346279 347014 428530
13320 428530 432166 246762 355409 397839 213748 637814 21391 202218 142325 132478 399717
13309 399717 237758 494742 162416 -198573 318043 336841 453772 177388 245027 387228
$$ packed form
13385B51550J90017C4507J65488F4608j6925K88302j12681f6586A20194C3048
13374B42466N0580N0577A60452Q9179j02619J31673K74610d2593C30808k9546
13364C01262F6179J76076J16988o2402b98676D42417b53020C52297R4796D2337
13353F72102B85663j7150A23634J42392n5547J49103J193J06255r0295p3036K2214
13342C25913J03547A51530K69536n839k2886J5301q245j37941A08123m0769J96180
13331B63534A21546L20670H7888P7396m6386L5103J63813J22105r3640P35Q1516
13320D28530L636j85404J08647M2430j84091M24066B1391J80827n9893r847K67239
13309C99717j61959K56984A62416a98573C18043J8798J16931A77388O7639J42201
$$ plain form
13299 387228 -251020 373070 513159 -128806 31200 266216 -90867 54358 51154 309621
13289 309621 30406 86526 187201 186131 218895 453421 113707 193609 174466 190060 73873
13277 308856 -113499 248115 250617 344479 410643 164687 204906 -52718 241630 86488 189006
13266 189006 -31432 207739 364380 113390 -102626 74873 78333 60329 -132617 248345
13255 -37572 -230995 -92005 54923 -302383 -89851 127504 -50264 354740 212564 200431 314497
13244 314497 175470 324894 415624 97726 266194 208300 -33484 37627 79152 115925 319465
13233 319465 318380 -14177 483563 -24256 -199608 171740 243021 268294 217501 32861 20779
13222 20779 96457 -484934 123773 310387 6080 59320 116507 472313 466553 -97687 -227772
$$ packed form
13299C87228b51020C73070J40089a28806C1200K35016i0867E4358l204K58467
13289C09621C0406N6120J00675j070L2764K34526A13707P9902j9143J5594G3873
13277C08856a13499B48115K502R3862O6164A64687M0219e2718B41630H6488J02518
13266A89006c1432B07739J56641A13390a02626G4873L460j8004a32617B48345
13255c7572j93423i2005E4923c02383h9851A27504e0264C54740j42176j2133J14066
13244C14497j39027J49424R0730I7726J68468n7894c3484C7627M1525L6773K03540
13233C19465j085a4177D83563b4256j75352A71740P1281K5273n0793C2861j2082
13222B0779P5678d84934A23773J86614F080N3240N7187L55806n760i7687j30085
$$ plain form
13211 -227772 190072 420170 195989 -82536 125442 300480 304859 109956 36899 -7106 193473
13199 -78362 -75787 -134101 314545 -33166 172166 183323 111452 148576 -25752 321624 337794
13188 337794 -51318 101885 104663 221505 137294 306727 16069 235282 383506 216408
13178 216408 -116054 24334 282989 83208 83939 -199612 -43441 -125952 35457 -159438 -25020
13166 -55348 271288 148714 437689 959 33557 125426 410050 279557 236743 149078 26156
13154 356279 76151 155783 137637 12544 259852 123628 161601 409366 -2531 343432 102312
13142 132883 126673 112927 80590 121904 70076 251032 239319 -68934 -5189 -11391 55201 387971
13130 387971 81326 243136 175716 104392 -175679 10461 19654 259275 242133 272297 -20315
$$ packed form
13211b27772A90072K30098A95989h2536A25442J75038M379A09956C6899g106A93473
13199g8362K575n8314C14545c3166A72166J1157p1871L7124b5752C21624J6170
13188C37794e1318A01885K778J16842q4211J69433A6069K19213J48224j67098
13178B16408a16054B4334K58655H3208P31a99612d3441q2511C5457a59438b5020
13166e5348B71288j22574K88975I59L2598R1869K84624j30493m2814q7665B6156
13154C56279G6151P9632j8146A2544K47308A23628L7973K47765b531C43432A02312
13142A32883o210j3746l2337M1314n1828J80956j1713f8934e189o202E5201L32770
13130C87971H1326J61810o7420p1324a75679A0461R193K39621j7142L0164b0315
$$ plain form
13118 253090 17947 185019 -206788 275641 -99059 232289 11699 16689 153736 101363 65801
13107 65801 120773 379859 298949 127444 81086 369805 187069 96097 -3518 -51176 -55872
13096 -55872 593634 39173 267068 306173 -291689 129386 214891 77290 466894 -202521
13085 163245 266472 546455 -175702 239404 24200 -95979 273282 274801 -11312 259676
13074 144333 240311 39924 212988 24469 183590 469339 226511 150676 54296 274821
13064 274821 256164 442986 78057 293400 -67463 107118 194913 27461 443560 81664 148492
13053 148492 342855 -127461 -34168 89277 108506 -140821 170603 29899 53315 383365
13043 383365 179485 118931 229814 -146913 149673 206018 36437 221608 233903 78777
$$ packed form
13118B53090A7947J67072b06788B75641i9059B32289A1699M990J37047n2373l5562
13107F5801N4972K59086q0910A27444m6358K88719j82736r0972c518m7658m696
13096e5872E93634C9173K27895L9105b91689A29386Q5505G7290L89604b02521
13085A63245J03227K79983a75702B39404B4200i5979B73282J519a1312B59676
13074A44333R5978C9924J73064B4469J59121K85749B26511p5835E4296K20525
13064B74821j8657J86822G8057K15343f7463A07118Q7795B7461M16099H1664O6828
13053A48492J94363a27461c4168H9277J9229a40821A70603B9899K3416L30050
13043C83365A79485o0554J10883a46913A49673N6345C6437J85171J2295G8777
$$ plain form
13032 420624 296419 -74472 -73039 297745 435479 -20571 350705 57504 438921 93990 -77875
13020 -143986 221683 252235 -9016 -197294 151629 66156 272435 199127 135954 2581 135721
13009 135721 327789 169712 -145389 -136072 377315 73292 -313735 -22864 166833 16465
12998 133085 42837 341475 156925 -33794 229548 203812 141896 201604 -77873 -94730 36486
12986 174552 179913 3382 -100802 -143263 16982 10544 82760 94169 -88548 4238 180980 107252
12974 107252 106889 -171870 -17340 253275 -4479 31454 109601 -24227 183907 145371 32605
12962 111594 21558 -62902 112131 117719 -104479 -100360 196841 257367 -17063 174686 50834
12950 96176 61217 236992 88360 270317 -128962 182177 -109517 54045 71422 -18534 90357
$$ packed form
13032D20624j24205g4472J433B97745J37734b0571C50705E7504L81417I3990g7875
13020a43986B21683L0552i016j88278A51629F6156K06279p3308o3173B581J33140
13009A35721J92068j58077a45389R317C77315G3292c13735b2864A66833A6465
12998A33085D2837K98638A56925c3794B29548k5736o1916N9708g7873j6857C6486
12986A74552N361C382a00802m2461A6982o438P2216J1409h8548D238J76742p3728
12974A07252l63a71870a7340B53275d479C1454P8147b4227A83907l8536C2605
12962A11594B1558f2902A12131N588a04479M119A96841O0526a7063A74686E0834
12950I6176l4959J75775H8360J81957a28962A82177a09517E4045J7377a8534I0357
$$ plain form
12938 -362546 325808 -42570 -340578 18439 -41604 -57482 22343 60114 525570 -293703 -31080
12926 -10945 64346 17248 237544 220328 -128604 -366245 96907 8721 -145452 233683 127882
12915 127882 412456 91215 340179 -29562 -196227 -92979 -158380 67806 86972 165968 7300
12903 19122 349157 427718 -82343 -54479 56291 124014 15442 -146301 -48655 -229855 247133
12891 -67635 -220066 392918 23689 502435 -96699 91905 191184 -209373 -143 281095 -42658
12879 87095 35323 171001 43033 16450 143172 113653 202728 -141210 259881 300664 -7845
12867 -21058 92127 -32569 38403 -1964 92631 108388 27343 -62084 -248672 208203 171985
12856 171985 302121 160568 -109835 109348 -146838 214890 -141479 -239154 102798 -27057
$$ packed form
12938c62546C25808d2570k98008A8439d1604j5878B2343L7771M65456b93703c1080
12926a0945F4346A7248K20296j7216a28604k37641I6907H721a45452B33683j05801
12915A27882K84574I1215K48964b9562j66665i2979o5401F7806J9166P8996G300
12903A9122L30035P8561h2343K7864E6291O7723A5442a46301d8655j81200B47133
12891f7635j52431C92918B3689M78746i6699I1905R9279b09373a43B81095d2658
12879H7095C5323J35678D3033A6450J26722k9519Q9075a41210B59881M0783g845
12867b1058I2127c2569C8403a964I2631J5757B7343f2084j86588B08203l6218
12856A71985J30136j41553a09835A09348a46838B14890a41479r7675A02798b7057
$$ plain form
12845 371587 74520 10345 -164871 -219832 -339761 53391 9779 -54127 235752 63139 -31947
12833 -84546 227083 77038 29855 -45392 -78255 206069 48938 73189 -110128 85216 -74721
12821 -148915 172843 -53279 -4860 221407 100722 -64385 -13456 -26535 -106081 65636 -195243
12809 159459 192247 -16807 83429 50299 111639 -256736 18302 217280 -102949 -130226 122927
12797 -301498 -165376 -126866 -107268 216069 -119733 131474 185255 -119497 28629 102434
12787 102434 87123 37449 -62731 -75593 206936 -156363 38515 -95224 158507 -340331 -106019
12775 -77962 194566 -41930 22190 67833 -67741 -131522 170661 144924 269787 -3911 -10210
12764 -10210 -45686 98038 336054 140385 41108 268513 20956 -108222 -300746 -1197 16187
$$ packed form
12845C71587G4520A0345a64871n4961j19929E3391I779e4127B35752F3139c1947
12833h4546B27083G7038B9855d5392l2863B06069D8938K4251a10128H5216g4721
12821a48915A72843e3279d860B21407A00722f4385a3456j3079p9546F5636a95243
12809A59459L2788a6807H3429l3130O1340b56736A8302J98978a02949k7277A22927
12797c01498J36122L8510J9598B16069a19733A31474N3781a19497B8629P3805
12787A02434j5311C7449f2731j2862B06936a56363C8515i5224A58507c40331a06019
12775g7962A94566d1930B2190M5643f7741o3781A70661k5737J24863c911o299
12764a0210l5476I8038K38016A40385D1108K27405B0956a08222j92524a197A6187
$$ plain form
12752 91717 129102 -33831 -227267 -299724 -125024 40764 -201124 18418 -23288 -29557 -210898
12741 -210898 -119448 -424885 -9971 195601 78434 13509 324345 314636 -5265 -198601 -34525
12729 -18181 -46904 207603 15517 417700 60857 -88043 -278706 -115372 -203026 -165818 386964
12717 4738 209224 27162 200174 221028 -159023 -169065 261530 394949 -14237 176630 269072
12706 269072 198958 58854 443699 230896 247805 227006 39425 219944 139507 109987 -49566
12694 163798 196816 182195 -24263 441920 103769 -24150 52312 271625 144073 77603 184824
12683 184824 68131 -65327 -4122 605121 -65860 5482 -66455 213410 40382 334638 -308336
12671 106094 -157569 510661 311415 98898 9567 -168029 104590 -97351 -199295 -20819
$$ packed form
12752I1717L7385c3831j93436p2457a25024D0764b01124A8418b3288o269j81341
12741b10898R1450l05437i971A95601G8434A3509L10836r709e265j93336c4525
12729a8181k8723B07603A5517M02183F0857h8043j90663a15372q7654L7208C86964
12717D738K04486B7162J73012K0854a59023j0042B61530J33419a4237A76630R2442
12706B69072p0114E8854L84845k12803J6909k0799C9425J80519q0437k9520d9566
12694A63798L3018j4621b4263D41920A03769b4150E2312K19313j27552o6470J07221
12683A84824F8131f5327d122F05121f5860E482f6455B13410D0382K94256c08336
12671A06094a57569E10661j99246I8898I567a68029A04590i7351j01944b0819
$$ plain form
12660 146961 357129 -56862 212662 377742 223288 174065 112955 100426 -56437 -136044 203606
12648 35547 71997 340209 31953 174059 -157129 -30808 67729 -103396 -318718 66373 142954
12637 142954 -258142 181496 90882 222362 311801 -36635 291447 279691 -85386 85687 167315
12626 167315 145542 54363 53880 154244 61571 -6571 366184 371579 295851 65234 43200 -41247
12613 90753 -271482 -50063 55188 -530230 -370504 -151181 -107144 93733 96046 38839 -96661
12601 -382435 341368 328746 11782 -218836 -17603 -182606 65688 167608 435914 283707
12591 283707 -91344 16350 132947 -20145 -154139 -103565 119098 35772 137797 3104 16953
12580 16953 -311078 70135 -497726 112004 101188 3089 14388 -225145 173382 269474 -87547
$$ packed form
12660A46961K10168e6862B12662J65080j54454m9223o1110j2529e6437p9607B03606
12648C5547L6450K68212C1953J42106a57129c0808F7729a03396k15322F6373P6581
12637A42954b58142A81496r0614J31480Q9439c6635B91447j1756h5386H5687Q1628
12626A67315k1773E4363m83J00364F1571f571C66184N395p5728F5234k2034d1247
12613I0753b71482e0063E5188e30230J59726a51181M4037I3733K313C8839i6661
12601c82435C41368j2622A1782b18836a7603j65003F5688J01920K68306j52207
12591B83707i1344A6350J16597b0145j33994N0574A19098C5772J02025C104J3849
12580A6953c11078G0135d97726A12004j0816C089J1299b25145A73382R6092h7547
$$ plain form
12568 -200647 64233 -10117 48895 90786 -104590 -67666 2910 1654 80584 -56122 -143978 -59509
12555 -219132 105238 249285 -138491 -331661 214887 62439 -31783 209084 12356 214937
12545 214937 -9651 226387 -163685 90960 -101521 154964 -66694 -141708 -273738 -195937 85909
12533 128204 101083 -140139 100798 72118 46641 211483 -107360 10187 -81188 42361 117622
12522 117622 59056 -87191 -82972 -99031 120276 167585 -322445 -38833 161818 144558 70085
12510 306567 -187257 247433 303616 -23787 15712 59758 305833 138591 -81914 -5994 -22954
12499 -22954 -113980 48643 81224 99254 -57832 -195457 155291 -38086 57240 21937 27003
12488 27003 121984 -370414 151638 -51906 126107 -86690 -17757 -25844 -384280 51923 162231
$$ packed form
12568b00647F4233a0117D8895M1891a04590L6924B910j256P8930e6122q7856e9509
12555b19132A05238J44047a38491j93170B14887F2439c1783B09084A2356K02581
12545B14937i651B26387a63685I0960a01521A54964f6694p5014j32030P7801H5909
12533A28204k7121a40139A00798k8680k5477J64842a07360A0187h1188D2361P5261
12522A17622n8566h7191M219j6059A20276M7309c22445c8833A61818j7260G0085
12510C06567a87257B47433N6183b3787A5712M4046K46075A38591h1914e994j6960
12499b2954r1026D8643L2581J8030e7832j37625A55291c8086E7240B1937N066
12488B7003R4981c70414A51638e1906A26107h6690a7757q087l58436E1923J10308
$$ plain form
12477 162231 -116889 190521 125836 4640 -127159 -242435 237175 92821 451633 -123716
12466 -324576 180795 -76935 -200696 -208665 -10382 110498 72716 -209055 -181408 -156132 -146572
12455 -146572 -272344 38671 -6843 102347 219635 152655 -366300 19194 198006 105705 -49389
12443 -43786 192388 26479 -337558 -99492 153962 218476 58613 -233099 37131 -161077 -16941
12431 24960 241643 194713 -66857 -163948 -101559 -140116 -85547 -32583 -41571 -243605 210434
12419 68321 -216723 229722 65845 -86795 18141 127128 -93395 -246348 -119724 -5266 -205438
12408 -205438 -116988 112926 -324587 96371 123347 -315342 -42011 106373 48345 142823 -12061
12396 455422 -140234 -267611 -99095 245584 64128 41423 -344852 108807 -64605 194306
$$ packed form
12477A62231a16889A90521o4685D640a27159j15276B37175I2821L58812a23716
12466c24576A80795g6935j23761p969a0382A10498l7782b09055K7647K5276R560
12455a46572j25772C8671f843A02347J17288o6980c66300A9194J78812r2301d9389
12443d3786A92388B6479c37558i9492A53962O4514E8613b33099C7131a61077a6941
12431B4960K16683m6930f6857r7091O2389l8557N4569c2583q988k02034B10434
12419F8321b16723B29722F5845h6795A8141J08987i3395j52953a19724e266k00172
12408b05438Q8450A12926c24587I6371K6976c15342d2011A06373D8345R4478a2061
12396D55422a40234j27377i9095B45584F4128k2705c44852A08807f4605A94306
$$ plain form
12385 291773 -91454 39766 64857 170804 -221427 49602 230746 107286 220260 27069
12374 107647 -66704 -55991 5448 59318 238037 -171411 63357 116893 31514 -100003 44054
12362 -216894 161756 16001 80931 -208538 109999 -237177 331514 -62742 247110 85385
12351 -306285 78966 224871 -212552 -140751 184759 -17755 -8733 -77815 -40289 73648 244548
12340 244548 228398 258902 -102485 131509 -309513 302930 -169148 -47152 3222 125415
12330 125415 -199314 -71938 -6056 5441 16148 -67553 -51983 71004 21776 100353 -18402 47083
12317 88047 -15290 117066 218487 -184519 43217 35067 -403696 -75997 -45403 175456 -191197
12305 -47494 111505 -232106 -63599 191293 -110565 175308 233610 129701 56649 -206140
$$ packed form
12385B91773i1454C9766K5091J05947b21427D9602J81144A07286J12974B7069
12374A07647f6704J0713E448N3870J78719a71411F3357N3536C1514a00003D4054
12362b16894A61756A6001O4930b08538A09999b37177C31514f2742B47110H5385
12351c06285G8966J45905b12552P1801A84759a7755h733o9082L7526G3648J70900
12340B44548j6150L0504a02485A31509c09513C02930a69148d7152C222J22193
12330A25415a99314g1938f056E441J0707f7553J5570G1004B1776P8577a8402D7083
12317H8047a5290A17066J01421a84519D3217q150d03696g5997L0594A75456a91197
12305d7494A11505b32106f3599A91293a10565A75308N8302j03909E6649b06140
$$ plain form
12294 319733 -33380 -152284 -28172 246485 199243 -289911 18792 85352 -159036 -194250 -168485
12283 -168485 -86770 44956 -80343 24171 120283 94738 22701 185081 97097 41491 255900
12272 255900 -39705 -33265 60235 228039 108977 122665 -73863 371191 166916 -205373 -3377
12260 4181 -47764 -110343 -330292 145152 -16233 209239 111570 -285172 95807 -495350 223167
12248 93889 437030 -29981 13076 -32734 155946 56315 295613 249875 110427 298224 121759
12236 -119228 -126705 227326 -149965 127411 332339 -31434 227354 134338 417333 119826
12225 12409 -26164 193154 492096 88409 -15438 139828 -223971 519008 -72579 367222
12214 519456 -11119 186534 157844 12138 150262 442393 104415 43486 -98079 307101
$$ packed form
12294C19733c3380j18904b8172B46485m7242b89911A8792O6560a59036l5214K5765
12283a68485Q1715D4956h0343B4171R6112k5545B2701J62380q7984D1491K14409
12272B55900c9705O440F0235J67804A08977J3688g3863C71191A66916b05373c377
12260D181d7764o2579k19949A45152a6233B09239r7669b85172I5807d95350B23167
12248I3889L43141b9981A3076c2734A55946E6315K39298m5738A10427J87797A21759
12236a19228p477B27326a49965A27411K04928c1434B27354r3016K82995A19826
12225A2409b6164A93154K98942H8409a5438A39828b23971E19008g2579C67222
12214E19456a1119A86534k8690A2138J38124K92131A04415D3486i8079C07101
$$ plain form
12203 120774 272715 43044 -140926 240427 20646 209868 256221 369504 305639 303203 85103
12191 -38904 -13858 28407 37864 29670 -239570 -120549 207363 -42893 270739 352808 -21456
12179 262104 -110470 326669 -27299 83555 1358 -324 122095 236957 28746 -5330 278545
12167 63932 40787 65007 53929 -186151 270201 266694 -85802 94777 -128087 -72055 263941
12155 22593 363636 189048 268612 336758 -40622 66967 43763 107723 -22051 -59633 -35559
12144 -35559 139810 59308 30182 195420 -118511 277458 414395 198438 -199675 64534
12133 -86416 -208278 -163338 90607 -44275 -64814 245729 454737 -230564 -156083 -75440 57602
12121 104234 92591 453903 -97589 -124737 -124564 95709 107899 112298 96131 -59258 249891 -325307
$$ packed form
12203A20774J51941D3044a40926B40427B0646J89222M6353J13283o3865k436H5103
12191c8904a3858B8407R457q194b39570J19021B07363d2893B70739Q2069b1456
12179B62104a10470C26669b7299H3555A358c24A22095J14862B8746e330B78545
12167F3932k3145K4220j1078a86151B70201l507h5802I4777a28087N6032B63941
12155B2593L41043j74588P9564O8146d0622F6967k3204O3960b2051l7582K4074
12144c5559A39810E9308k9126J65238a18511B77458J36937A98438a99675F4534
12133h6416j21862M4940I0607d4275k0539B45729K09008b30564P4481g5440E7602
12121A04234j1643L61312i7589k7148J73I5709J2190M399j6167e9258B49891c25307
$$ plain form
12108 114619 -104116 6653 -92947 -374812 40383 -26310 99822 77659 -124589 71301 -94479
12096 -94732 -180199 382652 -31267 168920 82796 141381 -29067 270867 99358 228192 220014
12085 220014 168648 219701 343102 -21181 181942 -13387 -433669 251655 -190374 -90265
12074 635406 646823 1574737 1108572 226565 69388 380114 53471 -254204 235130 -142886
12063 201123 499 85477 -184593 -50908 -242722 334352 71503 62332 122475 208199 -272441
12051 -240363 -19212 -44770 -75270 -105584 16161 213355 -91269 -227712 -69214 154607 -3820
12039 -208928 356485 -38876 42293 133824 -137010 262056 -85805 -153426 218546 -129571
12028 42069 2496 -30020 -184154 78992 -115116 -183389 42737 -59528 106537 438308 -58653
$$ packed form
12108A14619a04116F653i2947k81865D0383b6310I9822k2163a24589G1301i4479
12096i4732q5467C82652c1267A68920H2796N8585b9067B70867I9358J28834q178
12085B20014n1366N1053J23401b1181A81942a3387m20282B51655a90374i0265
12074F35406J1417R27914m66165B26565F9388L10726E3471b54204B35130a42886
12063B01123D99Q4978a84593e0908j91814C34352G1503r171O0143Q5724b72441
12051b40363a9212k5558l0500l0314A6161J97194i1269j36443f9214A54607c820
12039b08928C56485c8876D2293R1531a37010B62056h5805o7621B18546a29571
12028D2069B496c0020j54134G8992a15116o8273D2737e9528A06537L31771e8653
$$ plain form
12016 49705 -36599 195348 95986 55630 152104 132772 30856 220603 -88503 88968 -64291
12004 -202667 -61180 -163130 -40150 332256 8764 -106344 170337 -215778 -21744 -238975
11994 -238975 -124872 -173138 29565 -96785 -133359 -69670 9903 -265966 -128043 -93158 -70284
11983 -70284 171924 -35978 -316756 -78733 73757 -181616 328199 -200528 73306 -185416
11972 120436 10114 -385007 -118010 36312 -104169 18216 -77946 63007 477135 123608
11961 -113920 -205945 -197481 196960 -302058 -31398 -39948 -310911 85243 328248 181850 110007
11950 110007 134889 -28804 -165971 174909 260779 -134039 27191 94123 -127280 207148
11939 -65528 166447 144978 177982 59425 -41644 -69798 151938 -142831 37200 46963 -41970
$$ packed form
12016D9705c6599A95348I5986m0356R6474j9332C0856J89747h8503H8968f4291
12004b02667f1180j01950d0150C32256H764a06344A70337b15778b1744k17231
11994b38975J14103m8266B9565i6785l6574O3689I903b65966a28043L4885K2874
11983g0284A71924c5978k80778g8733G3757a81616C28199b00528G3306a85416
11972A20436A0114c85007a18010C6312a04169A8216g7946F3007M14128A23608
11961a13920r2025Q464A96960c02058c1398q550k70963H5243K43005j46398p1843
11950A10007K4882b8804j37167A74909Q5870a34039B7191O6932a27280B07148
11939f5528A66447k1469L3004E9425d1644k8154A51938a42831C7200R763d1970
$$ plain form
11927 -446234 -68590 34229 84790 -133499 -297332 179422 -187957 -56819 -62151 -6958 289968
11915 71819 -72386 39174 -61505 43167 -106474 -97054 1963 18253 181530 160691 -113701
11903 -27315 -186216 -89729 28011 -360792 -131313 87682 263935 -60477 -262209 114986
11892 65696 -94079 -156673 5815 23744 83597 -34917 -102724 -76894 96493 -95557 -51608 -192022
11880 -192022 282878 -20191 -125379 -128731 75628 -36844 -286292 -49865 284515 -50309 -207031
11869 -207031 275720 -33479 -2006 -101688 -15541 -77077 -203459 308349 -92337 -95506 105896
11857 -190185 -54790 -72801 229049 340103 -485800 56388 -144711 -39200 -5662 139899 138108
11846 138108 81076 -147787 -152989 46505 -228857 225612 86747 -256218 90221 -7847 100438
$$ packed form
11927d46234f8590C4229N0561a33499j63833A79422a87957e6819n332f958B89968
11915G1819g2386C9174f1505D3167a06474R420A963J6290J63277k0839a13701
11903b7315j58901h9729B8011c60792a31313H7682J76253f0477k01732A14986
11892F5696i4079o2594E815J7929N9853c4917o7807K5830I6493i5557M3949j40414
11880a92022B82878b0191j05188l352G5628c6844k49448d9865B84515e0309j56722
11869b07031B75720c3479b006r9682a5541o1536j26382C08349i2337l169A05896
11857a90185e4790j8011B29049J11054d85800E6388a44711c9200e662A39899j791
11846A38108n7032a47787n202D6505b28857B25612H6747b56218I0221g847A00438
$$ plain form
11834 -17934 -134370 -252407 -203690 201401 168416 -81423 -179026 -171409 -132305 72209 -73679
11822 -295250 -11001 46276 -428181 -118700 94589 48707 -15322 -67384 -273064 -172453 -100698
11811 -100698 -116632 37460 114501 -119713 -20456 -456652 103766 -261744 -123369 51046
11800 -66894 -76931 317399 241125 -134831 -242807 21091 -69068 210227 -25007 -12924 -182740
11789 -182740 26101 28213 51461 -75894 -184287 8873 405308 139442 -193887 101437 -207269
11777 -69075 362989 281234 -238106 -58713 -190575 -64679 -8716 -200346 5416 -130243 -378003
11766 -378003 142460 263994 -55233 26124 103573 3717 -740 -92267 -144497 -124637 -45755 160873
11753 58502 78416 172731 53131 33294 262648 130458 -137177 157029 -327431 -178008
$$ packed form
11834a7934j16436j18037M8717B01401l2985h1423r7603P617L9104G2209g3679
11822b95250a1001D6276d28181a18700I4589m5882a5322n2062k05680J00611P1755
11811a00698j5934C7460P7041a19713b0456m36196A03766b61744a23369E1046
11800f6894j0037C17399p6274a34831j07976B1091f9068B10227b5007J2083j69816
11789a82740B6101K112K3248g5894j08393H873L96435A39442a93887A01437b07269
11777f9075C62989q1755b38106e8713j31862f4679h716j91630E416a30243k47760
11766c78003A42460J21534e5233B6124P7449C717g40r1527n2230J9860d5755A60873
11753E8502J9914R4315E3131j9837K29354A30458a37177A57029c27431J49423
$$ plain form
11743 -178008 40119 297453 304785 181197 124398 -342578 -276533 68564 -103281 -291902 103399
11731 -35403 108440 143090 108438 82702 -219380 -38459 8314 -53905 81994 152051 350274
11720 350274 146239 34474 -81395 -165086 55961 69728 -262993 58380 55892 51887 58288 167965
11708 167965 257659 89202 -33638 137697 83012 249262 -183095 75775 -52432 319013 111591
11696 399678 220754 286211 111638 -172084 62780 -95573 131734 273788 -174933 247221
11685 -243515 212859 123025 -29712 63955 341129 -156731 -27243 -101670 308263 19563 -48023
11673 68228 65716 -5960 28845 53535 -79925 144905 280767 234570 -153250 273663 7385
11661 71057 82614 137358 179551 332463 182060 -165742 359045 -73617 237903 53405 171045
$$ packed form
11743a78008D0119K57334P332j23588n6799c42578O6045F8564a03281j88621A03399
11731c5403A08440L4650l4652k5736b19380c8459H314e3905H1994P0057J98223
11720C50274A46239C4474h1395q3691E5961J3767b62993E8380k488m005O401J09677
11708A67965Q9694H9202c3638A37697n4685J66250a83095G5775e2432C19013A11591
11696C99678j78924O5457A11638a72084F2780i5573A31734J42054a74933B47221
11685b43515B12859q9834b9712F3955K77174a56731b7243p4427C08263A9563d8023
11673F8228k512e960B8845K4690g9925A44905J35862m6197a53250B73663G385
11661G1057J1557N4744M2193J52912j50403a65742C59045g3617B37903E3405J17640
$$ plain form
11650 171045 301900 115863 68143 93957 249357 -171548 130245 132522 99961 62816 -214555
11638 -317582 48619 -217387 77667 -80982 -121214 343752 447106 61510 -336677 -256751 -47335
11626 83982 248391 71402 -87693 105522 -162624 120927 -54716 104255 -177189 53267
11615 -344508 269568 -255043 13888 38037 124286 160019 191391 124812 181225 -119646 -140301
11604 -140301 69381 128894 -58228 -45898 265469 125434 139955 207982 -344012 20131 160034
11593 160034 152617 -98948 35573 -65221 51596 53643 153429 362182 231329 47951 4313 -46036
11580 122058 290985 283197 -381531 50840 19962 262136 26639 207935 48706 -141349 237256
11568 55970 -12922 155762 304911 50300 -81978 432634 23548 -224493 29247 83175 -265727
$$ packed form
11650A71045J30855A15863m7720K5814J55400a71548A30245K277l2561l7145b14555
11638c17582D8619b17387G7667h0982m0232C43752J03354F1510c36677P9926d7335
11626H3982J64409G1402h7693A05522a62624A20927e4716A04255a77189E3267
11615c44508B69568b55043A3888K4149Q6249L5733L1372o6579N6413a19646k0655
11604a40301F9381N9513e8228J2330B65469A25434J4521O8027c44012B0131J39903
11593A60034p417i8948C5573f5221E1596K047R9786K08753j30853D7951D313d6036
11580A22058J68927p788c81531E0840A9962K42174B6639J81296D8706a41349B37256
11568E5970a2922A55762J49149E0300h1978D32634B3548b24493B9247N3928b65727
$$ plain form
11556 238714 299068 248389 8136 -49095 203244 147802 -9328 -137060 37150 -184366 -131851
11545 -131851 -88114 -261568 10101 -190283 -68010 -84706 -141240 53513 82376 -211118 -7496
11533 211504 82472 -112095 145190 -43557 -90488 -23949 65073 89204 -85891 76044 149588
11522 149588 12287 162398 -96004 49800 181986 233244 414512 74510 -17480 72331 128327
11511 128327 20525 65557 167306 -7719 46214 313620 -268625 -83453 317049 333669 123364
11499 169017 119887 86857 276862 -153540 -81188 35907 146825 199383 234621 284380 86148
11487 114436 -169912 307178 -28237 -105383 258826 160417 -100135 141525 472445 44477
11476 -86335 -140016 93797 100473 23280 268092 291991 53644 -1058 295007 220386 130704 420220
$$ packed form
11556B38714O0354n0679H136d9095B03244n5442i328j27732C7150a84366N2515
11545a31851M3737j73454A0101a90283f8010j6696n6534E3513K8863b11118g496
11533B11504H2472a12095A45190d3557m6931b3949F5073K4131h5891G6044P3544
11522A49588A2287J50111i6004D9800J32186N1258J81268G4510a7480G2331N5996
11511A28327B0525M5032J01749g719D6214K67406b68625h3453C17049J6620A23364
11499A69017m9130l3030J90005a53540P2352C5907J10918N2558L5238M9759H6148
11487A14436a69912C07178b8237p7146B58826r8409a00135A41525L30920D4477
11476h6335n3681I3797O676B3280K44812K3899E3644a058B95007p4621q9682K89516
$$ plain form
11464 420220 189814 425843 272149 298346 47464 262983 140669 153399 305778 -58857
11453 168583 -110043 445779 25553 12800 162145 -88224 380082 244143 -109537 384511
11442 -55589 -161146 55561 -37069 115131 -190000 371492 -141169 99093 -41583 -154636
11432 -154636 -6535 -246828 -177442 65559 323700 142470 -14888 286757 17191 225386 -40979
11420 -807 165373 185580 -41939 227398 69509 -164291 -354157 290983 -213979 -213667 -130176
11409 -130176 60681 -65020 -269546 -118472 -77999 -82711 320868 -235108 64506 53062 -252391
11397 -87510 64867 -93801 -54516 49652 -190589 -104695 -49404 -164906 98816 19165 -386220
11385 -233881 -22989 -115245 169932 112459 73406 -186773 -168476 28612 128326 52585 -36886
$$ packed form
11464D20220A89814K36029j53694K6197D7464K15519j22314J2730J52379e8857
11453A68583a10043D45779B5553j2753J49345h8224C80082j35939a09537C84511
11442e5589j05557E5561c7069A15131a90000C71492a41169I9093d1583j13053
11432a54636f535k40293O9386F5559K58141A42470a4888B86757A7191K08195d0979
11420h07A65373K0207d1939B27398F9509a64291j89866B90983b13979L12Q3491
11409a30176F0681f5020k04526a18472M0473m712C20868b35108F4506j1444b52391
11397h7510F4867i3801L9285D9652a90589Q5894d9404j15502I8816A9165c86220
11385b33881b2989r2256A69932n7473l9053a86773J8297B8612R9714E2585c6886
$$ plain form
11373 238036 234825 -152330 -69621 172264 -237825 -229808 -287520 -80031 32718 -201951 -217556
11362 -217556 151911 47862 130853 56153 54332 233374 -74952 2094 -101091 263080 289329
11351 289329 -366986 -246530 -49022 -234078 -45501 43006 -199585 -2880 -142512 -205638 -221066
11340 -221066 -64141 425698 192199 542950 60353 389641 78375 -152233 148307 108268
11330 108268 157906 153254 -293784 213078 280608 15070 169271 -43885 129799 -56886 10343
11318 275791 84676 -71665 -131877 172670 234790 249001 213590 140873 226319 -82671 -112463
11307 -112463 127373 39665 -69958 -409233 -125125 -67922 11153 -23393 -4276 144385 -201564
11295 -99019 -387541 -237832 -44084 -77507 211497 87118 -538826 -129082 -49317 -97246 -130827
$$ packed form
11373B38036l211a52330f9621A72264b37825Q017n7712h0031C2718b01951j5605
11362b17556A51911D7862Q2991E6153j821J79042g4952B094a01091B63080K6249
11351B89329c66986J20456d9022j85056d5501D3006a99585b880j39632o3126j5428
11340b21066f4141D25698A92199L50751F0353L29288G8375a52233A48307m0039
11330A08268M9638m652b93784B13078O7530A5070J54201d3885A29799e6886A0343
11318B75791H4676g1665o0212A72670O2120J4211l5411p2717Q5446h2671k9792
11307a12463A27373C9665f9958l39275a25125N7203A1153b3393d276A44385b01564
11295i9019k88522J49709d4084l3423B11497H7118e38826a29082d9317m7929l3581
$$ plain form
11284 -130827 192902 86253 177916 -140129 -49258 -178791 44376 -379502 98431 124244 165872
11273 165872 -29157 257926 -326340 -85861 163357 -7977 -206445 -324461 -154790 -2573 127201
11261 261380 80718 -162386 3346 -431484 -2123 2573 -98475 -421911 98361 253011 21345
11249 -284165 -77866 167551 175317 -251187 -62247 -221901 26084 31076 -333215 -278432 139990
11237 111271 -71625 -116488 -260915 -9950 -10572 63087 60484 141280 -374555 -141008 -113978 -2653
11224 -165446 -95526 250502 -98493 -45309 -91474 -119077 -132121 -65384 -58105 62537 -85397
11212 291890 -40140 -49288 -212483 -113912 -106031 94224 -47444 51966 9957 -18562 -181893 -245595
11200 -245595 -209928 283403 23580 -147782 55036 107462 -119773 -142223 51702 -212812 -130471
$$ packed form
11284a30827A92902H6253R1663a40129d9258j29533D4376c79502I8431K5813M1628
11273A65872b9157B57926c26340h5861A63357g977j98468j18016a54790b573A27201
11261B61380H0718a62386C346d31484b123B573i8475l23436I8361J54650B1345
11249b84165g7866A67551P766b51187f2247j59654B6084M992c33215N4783A39990
11237A11271g1625m4863j44427i950o22F3087k603Q0796c74555a41008K7030b653
11224a65446O9920B50502i8493d5309m6165k7603j3044f5384P279F2537h5397
11212B91890d0140r148j63195R8571P881I4224d7444E1966I957a8562j63331o3702
11200b45595L5667B83403B3580a47782E5036N2426a19773k2450E1702b12812Q2341
$$ plain form
11189 -130471 122527 74236 144883 -35943 -184888 54515 -109550 -102569 8042 204815 77946
11177 -42686 386234 -65662 73546 -149550 271873 -326175 113267 -174460 -274017 -111166
11166 46773 -24720 -224771 -151493 143189 194007 18491 -172983 91140 -90410 -282406 165267
11154 -375054 87888 -40337 293972 -76676 28911 -147594 43768 -86617 -22583 -270367 -96928
11142 -280274 97250 31385 150860 -3531 213509 -265983 81796 8047 -161371 315809 -7863
11130 -111392 -199721 -65448 127650 49755 335697 154309 178325 18025 -194686 51247 221936
11119 221936 7234 52629 -106430 217223 -217610 101625 45819 -62604 -67737 98802 115043
11108 115043 -115587 429323 -182131 375054 34181 209514 -9384 209872 -25754 201058
$$ packed form
11189a30471A22527m8291P0647c5943j48945E4515a09550O981H042J96773G7946
11177d2686C86234f5662G3546a49550B71873c26175A13267a74460r9557a11166
11166D6773b4720k00051P3278A43189N0818A8491a72983I1140i0410j91996A65267
11154c75054H7888d0337B93972g6676B8911a47594D3768h6617b2583k47784i6928
11142b80274I7250C1385J19475c531B13509b65983H1796H047a61371C15809g863
11130a11392q8329f5448A27650D9755K85942A54309K4016A8025a94686E1247J70689
11119B21936G234M5395a06430B17223b17610A01625D5819f2604n133I8802J6241
11108A15043a15587D29323a82131C75054C4181J75333i384B09872b5754B01058
$$ plain form
11097 31814 430914 131129 159383 82977 323161 243226 -6235 85024 138802 276749 154967
11086 154967 373373 312929 567097 368171 183934 398848 131548 116101 509196 377963
11076 377963 30864 316626 265125 145589 298981 254004 310857 243942 469631 113372
11065 469185 315820 426764 314275 454690 294312 697200 662884 763090 611717 863435
11055 863435 420546 909282 719100 428562 356806 635965 688883 701620 880753 847712
11045 847712 439348 760189 382412 708746 1003645 798795 857989 470136 540494 677130
11035 677130 278252 878377 634300 562252 687716 652425 652893 714097 651571 887681 426616
11023 648767 731923 995109 1054759 798256 707009 462236 600946 600988 709662 782287 459257
$$ packed form
11097C1814L99100A31129K8254p6406K40184p9935f235H5024N3778J37947j21782
11086A54967K18406o0444K54168j98926A83934K14914A31548j5447L93095j31233
11076C77963C0864K85762n1501j19536J53392m4977N6853o6915K25689A13372
11065D69185j53365J10944j12489J40415j60378M02888l4316J00206j51373K51718
11055H63435D20546M88736j90182k90538p1756K79159N2918J2737J79133l3041
11045H47712m08364L20841l77777L26334K94899k04850N9194l87853P0358J36636
11035F77130B78252O00125k44077p2048J25464l5291M68O1204o2526K36110D26616
11023F48767Q3156K63186N9650k56503r1247k44773J38710M2J08674P2625l23030
$$ plain form
11012 459257 618106 440996 301576 352954 608943 331675 627769 642363 384836 645129
11002 645129 688464 220227 594219 730925 1027605 930052 570529 533136 780448 746596
10992 746596 594800 740572 747091 804821 768731 775397 613941 538087 921622 824937 1129723
10981 1129723 1192526 1133998 1110842 1084134 1723366 2237589 1978271 2472784 2345517 2896979
10971 2896979 2818088 2828661 2512570 2541360 2269992 2139077 1779885 1864126 1893975 1739158
10961 1739158 1587588 1406772 1620762 1464193 1417995 1613662 1579674 1567362 1388706 1131330
10951 1131330 1213616 651067 482607 424900 450381 287116 311708 -83360 240027 175220
10941 175220 298973 88503 147817 198721 433361 181074 -265872 63949 246399 -186379
$$ packed form
11012D59257J58849j77110j39420N1378K55989k77268K96094J4594k57527K60293
11002F45129M3335B20227L73992J36706K96680r7553l59523l7393K47312l3852
10992G46596j51796J45772O519N7730l6090O666j61456p5854L83535r6685L04786
10981A129723O2803n8528k3156k6708O39232N14223k59318M94513j27267N51462
10971B896979p8891J0573l16091K8790k71368j30915l59192Q4241K9849j54817
10961A739158j51570j80816K13990j56569m6198J95667l3988j2312j78656k57376
10951A131330Q2286n62549j68460n7707K5481j63265K4592h3360B40027o4807
10941A75220J23753H8503N9314N0904K34640A81074b65872F3949J82450a86379
$$ plain form
10930 66358 22643 -51573 -102274 294999 -166822 -52493 -88224 -221638 416637 124552 -36734
10918 -81838 -70054 408462 -99904 277477 -6613 191878 134676 -85650 34801 251941 -79777
10906 -194733 -389899 285051 394069 -38471 148589 -376975 15411 195110 206955 95494
10895 104398 106877 191343 -161722 -142860 -28688 -206114 -177300 -24794 116908 -28816 -106213
10884 -106213 -46325 146588 -93279 198090 -462510 -80751 238718 50791 -157634 -10479
10873 22051 5746 -211677 49904 -18370 -21739 -117011 60028 47015 182243 18586 -144113
10861 49744 -61386 -88231 -147800 -42806 30648 114767 -67724 -227165 37646 -69658 38826
10849 -65602 -57891 134428 267917 -204177 135215 -127802 -259175 209534 -237824 234720
$$ packed form
10930F6358B2643e1573n0701B94999a66822e2493l5731j33414D16637A24552c6734
10918h1838J1784D08462i9904B77477f613A91878n7202h5650C4801K17140g9777
10906a94733j95166B85051J09018c8471A48589c76975A5411J79699J1845I5494
10895A04398K479Q4466a61722J8862b8688j77426K8814b4794A16908b8816p7397
10884a06213d6325A46588i3279A98090d62510h0751B38718E0791a57634a0479
10873B2051E746b11677D9904a8370l369r5272F0028j3013J35228A8586a44113
10861D9744f1386k6845n9569d2806C0648Q4119f7724j59441C7646f9658C8826
10849f5602P711A34428J33489b04177A35215a27802j31373B09534b37824B34720
$$ plain form
10838 301054 9565 -141430 58226 -82179 -109100 -107497 113493 -82412 -202520 160315 -210196
10826 13454 271130 -119084 -21253 100501 -351683 -101595 -79817 88067 -39666 -158166
10816 -158166 299880 -37704 -95922 238231 -315765 155270 -315583 41075 -383609 285822
10805 12759 273625 84194 132697 104081 30333 -25756 132522 -263948 -144662 -28149 242378
10793 -107956 -126709 39457 195483 -135993 -8006 184573 -291084 273913 -69225 68867 34477
10782 34477 -173808 -125296 -183414 -199332 13243 -146852 -16696 250041 115048 -283814 48493
10770 308617 89731 -115369 16666 122709 -127321 124730 117720 -219365 -151999 -18759 -176572
10759 -176572 -442715 193416 108985 -142857 -142813 -315340 -108862 102170 34245 35586 27663
$$ packed form
10838C01054I565a41430E8226h2179k6921J603A13493h2412j20108A60315b10196
10826A3454K57676a19084b1253A00501c51683a01595K1778H8067c9666j18500
10816a58166B99880c7704n8218B38231c15765A55270c15583D1075c83609B85822
10805A2759K60866H4194M8503k8616C0333b5756A32522b63948J19286b8149B42378
10793a07956j8753C9457J56026a35993h006A84573b91084B73913f9225F8867l4390
10782C4477a73808M8512n8118j5918A3243a46852a6696B50041A15048b83814D8493
10770C08617H9731a15369A6666J06043a27321A24730p010b19365O7366a8759j57813
10759a76572k66143A93416q4431a42857M4j72527a08862A02170C4245J341p923
$$ plain form
10748 27663 64707 103446 9549 151673 -44169 -24734 -215918 -98064 -256409 160718 -97889
10736 -87360 96880 -98426 -163988 -50791 168461 24051 -17098 -88228 -71917 -129596 117783
10724 -141330 -95732 292077 -158158 -222089 183182 -8375 127229 -158412 338082 151727
10713 -102237 -124792 71916 -66982 -136445 75981 202747 -185150 59248 63815 28712 260452
10702 260452 -154612 4146 -172228 101558 -174443 128698 -130477 31677 -86782 -10560
10691 43873 -103859 -18918 -318285 -44883 -84529 -295237 126 -58507 -27238 -198358 -138687
10680 -138687 40049 -372 -60896 284702 51165 -209817 -303870 216173 50268 -152622 -102226
10669 -102226 67437 -26882 5081 -143925 -38822 288934 -182662 -95317 -205625 -72077 -13745
$$ packed form
10748B7663L7044L8739I549J42124d4169J9435j91184i8064j58345A60718i7889
10736h7360I6880i8426o5562e0791A68461B4051a7098p1130J6311n7679A17783
10724a41330M5598B92077a58158o3931A83182h375A27229a58412C38082A51727
10713a02237k2555G1916f6982o9463G5981J26766a85150E9248M567B8712K31740
10702B60452a54612D146a72228A01558a74443A28698a30477C1677h6782a0560
10691D3873a03859a8918k99367d4883l9646k10708A26e8507b7238j71120N9671
10680a38687D0049c72o0524B84702E1165b09817r4053B16173E0268a52622N0396
10669a02226F7437b6882E081a43925c8822B88934a82662Q7345j10308g2077a3745
$$ plain form
10657 52793 27772 -186941 -94776 74144 -292987 -8529 -193426 107002 -345119 219465 -3174
10645 -72506 56598 -218963 -283171 -41524 85881 -18774 156198 136275 25431 100895 -295438
10633 -16023 34275 -104463 -222951 89040 179111 -289077 182305 78499 114278 138879 -18399
10621 128097 -47443 301140 85601 88400 133356 -55709 -44749 -8441 -81449 67966 241533
10610 241533 -232490 190161 -243997 176413 51572 322548 46339 72602 114571 -20731
10599 -199720 45538 -182620 -80520 -56591 -231933 -149434 75882 -30265 -2507 438419 106458
10587 26998 -76149 84995 -37190 12303 -100713 158310 -99083 -116751 -302593 17929 -184973
10575 -31176 -52349 -224394 -201597 99035 -149031 -117526 -234090 -18413 -100097 116812 146556
$$ packed form
10657E2793k5021a86941R2165G4144b92987h529j84897A07002c45119B19465c174
10645g2506E6598b18963o4208d1524H5881a8774A56198j9923B5431P5464b95438
10633a6023C4275a04463j18488H9040R0071b89077A82305G8499L5779K4601a8399
10621A28097d7443C01140H5601K799M4956e5709J0960h441p3008F7966J73567
10610B41533b32490A90161b43997A76413E1572K70976D6339K6263M1969b0731
10599a99720D5538a82620h0520K3929j75342Q2499G5882c0265b507D38419A06458
10587B6998g6149H4995c7190A2303a00713A58310i9083j7668j85842A7929a84973
10575c1176k1173j72045K2797I9035a49031L1505j16564a8413q1684A16812K9744
$$ plain form
10564 146556 -128152 -145924 -83054 -6778 -30074 -109626 -219919 182127 -206792 -16688 -291094
10553 -291094 41768 -287444 -42266 -219518 101400 123082 -98258 9770 -140519 45719 -242090
10541 57602 6141 140066 -351043 -21006 -446196 -21289 -83478 -441528 71336 126040 -175071
10529 -288132 48090 -105652 -269123 -88574 -205746 -65085 190575 1217 -293390 256550
10518 -186238 -188603 -225775 -1318 -161793 52479 147283 138684 292255 -13281 -29767 123683
10506 147854 -62851 122512 168789 -266476 233429 -143606 -177893 -323960 91786 -127170
10495 -122642 441075 -120015 -98468 159917 -103444 -183970 -41836 133237 5297 -79196 227491
10483 21105 251142 156347 465055 580818 217711 154896 260707 114935 281020 103423
$$ packed form
10564A46556a28152j7772O2870f778k3296p9552j10293A82127b06792a6688k74406
10553b91094D1768b87444d2266j77252A01400K1682i8258I770a40519D5719b42090
10541E7602F141J33925c51043b1006m25190b1289o2189l58050G1336N4704a75071
10529b88132D8090a05652j63471h8574j17172f5085A90575A217b93390B56550
10518a86238k365l7172a318j60475E2479R4804q599J53571a3281j6486A23683
10506A47854f2851A22512M6277b66476B33429a43606l4287j46067I1786a27170
10495a22642D41075a20015K1547A59917a03444q0526d1836A33237E297g9196B27491
10483B1105K30037r4795L08708J15763B17711o2815J05811A14935J66085A03423
$$ plain form
10472 -14878 -198399 -1068 12605 138246 -169071 -330739 47358 -23086 -21311 119166 48236
10460 76031 -69227 -173663 -53218 124678 -17288 158527 42990 152770 17926 184584 -46484
10448 -264480 74138 -115304 -224860 -262053 -218608 -300862 -104506 12052 -148892 -45781 -110025
10437 -110025 141737 -18148 166596 -109391 132770 -67759 131773 -82669 -250481 -125465
10427 -125465 94074 -119728 -65152 190758 -251417 90590 180159 -324801 -6303 -223496 10012
10415 84513 55354 224612 -326336 -282264 43324 176500 216547 -248320 358776 43790 -127979
10403 15798 -69007 214110 -402697 9185 190126 4674 226322 -147670 121669 -4101 125120
10391 182002 214686 264896 -7879 -44492 2568 215239 153606 433906 -377440 163369 336998
$$ packed form
10472a4878j83521a068A2605J25641a69071j61668D7358b3086J775A19166D8236
10460G6031f9227j04436e3218A24678a7288A58527D2990J09780A7926J66658d6484
10448b64480G4138a15304j09556l7193M3445q2254a04506A2052a48892d5781o4244
10437a10025A41737a8148A66596a09391A32770f7759A31773h2669j67812J25016
10427a25465I4074a19728N4576A90758b51417I0590Q9569c24801f303k17193A0012
10415H4513k9159J69258c26336M4072D3324J33176M0047b48320C58776D3790a27979
10403A5798f9007B14110d02697I185J80941D674K21648a47670A21669d101A25120
10391A82002L2684N0210g879l6613B568K12671o1633K80300c77440A63369J73629
$$ plain form
10380 336998 291259 191367 153144 -6791 177053 -19341 203970 273678 448803 351969 541290
10369 541290 40659 345639 424872 441396 652394 127639 499567 189081 515564 264977
10359 264977 77770 335737 583658 106096 265973 36398 203359 270887 719854 465739
10349 465739 489894 167867 168325 234921 80888 245663 586138 284819 -50549 184814 416137
10338 416137 107888 149706 117631 -85827 119811 2850 49354 174665 -39220 179014 -146089
10326 129059 201977 266491 157320 190900 86041 211634 136634 444112 292649 167498
10316 167498 308200 -112255 202022 -27488 90091 56027 275965 -198790 12408 169400
10306 169400 -246813 1113 70834 -320600 -339356 -62364 294235 -240562 -74820 286764 -174547
$$ packed form
10380C36998m5739r9892l8223f791A77053a9341B03970O9708J75125r6834J89321
10369E41290D0659L04980P9233J6524K10998A27639L71928A89081L26483k50587
10359B64977G7770K57967K47921A06096J59877C6398J66961O7528M48967k54115
10349D65739K4155A67867M58O6596H0888J64775L40475B84819e0549A84814K31323
10338D16137A07888M1818l2075h5827A19811B850M6504J25311c9220A79014a46089
10326A29059P2918O4514j09171L3580H6041J25593p5000L07478j51463j25151
10316A67498J40702a12255B02022b7488I0091l4064K19938a98790A2408J56992
10306A69400b46813A113O9721c20600j8756f2364B94235b40562g4820B86764a74547
$$ plain form
10294 90365 -73900 124467 67874 -251691 -151095 -6682 -84808 105927 -317405 80077 233952
10283 233952 -164189 -138624 -141203 55236 13311 47151 -144926 92103 -279922 18149 -280
10271 223353 70185 9118 58318 -96043 1824 190133 -91561 74245 -199768 273990 -156693
10259 77079 411980 145542 98971 41884 -56859 18936 -199623 48192 -10931 226770 -90145
10247 -190996 171684 -16239 -63964 -260325 -195173 250142 7860 -101242 -325248 -154553
10236 205784 -100922 -31356 26415 -189656 35615 -6626 -36029 104054 156522 -121812 -90823
10225 -90823 -242284 70115 350 454210 -84032 84974 34306 -16557 102207 -351840 -187882
10214 -187882 -61310 243704 52653 28331 -127855 -61905 10546 69846 -19196 -9731 123636
$$ packed form
10294I0365g3900A24467n6593b51691J00596f682p8126A05927c17405H0077J53875
10283B33952a64189K5565k579E5236A3311L3840a44926I2103b79922A8149b80
10271B23353G0185I118M9200i6043A824J88309i1561G4245a99768B73990a56693
10259G7079L34901A45542m6571D1884e6859A8936a99623D8192a0931B26770i0145
10247a90996A71684a6239m7725j96361O5152B50142G860a01242k24006a54553
10236B05784a00922c1356B6415a89656C5615f626k9403A04054N2468a21812L0989
10225i0823j51461G0115C50M53860h4032H4974C4306a6557A02207c51840J63958
10214a87882f1310B43704E2653k4322a27855f1905A0546N9300a9196R465A23636
$$ plain form
10202 70371 43048 -190922 -150875 -37438 -157745 -68664 107191 134126 -59670 -8044 270 -58685
10189 177398 -33719 -77535 84753 -252460 99549 -187104 -95130 -89858 51610 8842 11854 -111270
10176 -290871 33987 129436 -50817 163145 -265255 -107895 -429755 -46843 -89122 233728
10165 -231069 185999 -178196 60917 12091 -231173 -229895 -84014 -211156 148872 -170320
10154 68708 -106467 -104540 112778 -229767 -91030 -4819 272621 -421238 -52862 118940 -304151
10142 108523 -34986 236925 19824 258534 -381940 -116458 -191647 -161408 -354935 -288309
10132 -288309 34790 11888 -201559 -214456 147913 234868 -291133 -150077 -74589 -196032
10122 -196032 127059 -275548 131074 -90488 216308 13241 5587 403900 -20030 -393966
$$ packed form
10202G0371k7323a90922M0047c7438j20307f8664A07191K6935e9670h044B70e8685
10189A77398c3719m3816H4753b52460I9549a87104R1974N272E1610H842L012a11270
10176b90871C3987R5449e0817A63145b65255a07895l21860d6843m2279B33728
10165b31069A85999a78196F0917A2091b31173J278h4014j27142A48872a70320
10154F8708a06467J927A12778b29767i1030d819B72621d21238e2862A18940c04151
10142A08523c4986B36925A9824K38710c81940a16458p5189L0239j93527O6626
10132b88309C4790A1888b01559j2897A47913Q6955b91133J41056g4589j21443
10122a96032A27059b75548A31074i0488B16308A3241E587L98313b0030l73936
$$ plain form
10112 -393966 107687 90450 7326 185621 -335167 -261503 -195992 396016 126402 -227853
10101 -19915 -224120 106335 -131631 -295447 248 -155732 53237 33823 -348933 -80007 6274
10089 -356718 -311938 -162545 -227049 26330 -130777 -311729 131619 112564 50510 -377539
10078 -44148 64392 -32375 199968 -212311 -140770 154728 -320288 -23027 -97865 -216542 14421
10066 -18183 -94612 -102108 26108 -317085 82462 116705 -90305 -244266 9009 -98635 -242442
10055 -242442 -259706 -97866 30365 -346963 -306532 21762 -252386 105505 -140051 3087 -199086
10043 -39287 297529 198625 -107963 -121475 20799 62569 -13071 75848 266503 152981 -34330
10031 -198766 44040 73266 -111124 -27356 58191 -104071 -275240 -35134 -72259 106436 109423
$$ packed form
10112c93966A07687j7237G326J78295c35167P3664O5511C96016A26402b27853
10101a9915k04205A06335a31631j63816B48a55732E3237j9414c48933h0007F274
10089c56718M4780J49393o4504B6330a30777j80952A31619j9055E0510c77539
10078d4148F4392c2375A99968b12311P1541A54728c20288b3027p4838j18677A4421
10066a8183p6429p496B6108c17085H2462L4243i0305j53961I009i8635j43807
10055b42442j7264i7866C0365c46963M0431B1762b52386A05505a40051C087a99086
10043c9287B97529r8904a07963j3512B0799M1770a3071G5848J90655j13522c4330
10031a98766D4040K9226a11124b7356E8191a04071j71169c5134l7125A06436K987
$$ plain form
10020 109423 -243360 228867 -120464 -49590 -189615 133682 269724 -18378 89927 -96089
10009 167633 -169303 -89980 76942 31794 -70129 8449 -207568 274116 -56361 36550 -143826
9997 -364024 14527 -66524 24564 -270136 132909 -147634 -92099 97836 -64668 69119 -188565
9985 311432 -4082 -37357 -120703 -192333 352893 -70557 -47298 -113200 72260 -80452 -135553 -3675
9972 101991 69072 -190691 45965 -78365 -68147 58964 -62030 -94964 259021 -136577 -180496
9961 -180496 160539 -192839 60473 32266 335676 -15529 276146 -171344 712338 -79246
9950 -209290 -473852 144203 -21382 -307801 -2925 -155568 101024 71747 -252593 -158338 261610
9938 -234592 126102 -82493 104607 -231722 135250 -39394 -79003 49025 7595 176284 -165784
$$ packed form
10020A09423b43360B28867a20464d9590j40025A33682J36042a8378H9927i6089
10009A67633a69303P9323G6942C1794g0129H449b07568B74116e6361C6550a43826
9997c64024A4527f6524B4564b70136A32909a47634N5535I7836f4668F9119a88565
9985C11432d082l3275q3346p1630C52893g0557K3259o5902G2260h0452n5101c675
9972A01991l2919a90691D5965g8365J0218E8964f2030l2934B59021a36577m3919
9961a80496A60539a92839F0473k8207L03410a5529B76146a71344G12338g9246
9950b09290k64562A44203b1382k86419b925j52643A01024k9277b52593R4255B61610
9938b34592A26102h2493A04607b31722A35250c9394l9609D9025G595J68689a65784
$$ plain form
9926 -81421 -51874 -22391 88281 -257088 -77992 32106 84118 -114129 41462 84015 -282855
9914 -55668 -53795 -468682 148061 133169 -311631 -382630 -298276 -53800 -180774 -172185 207633
9902 159579 73754 -80574 -254291 -79320 -22789 -184323 241536 -445296 38448 -198184 223553
9890 42998 -234269 -72056 -46616 86098 -136210 89953 -83250 -95098 3869 -84754 -79529 -72630
9878 -72630 48237 -192897 -39574 -243209 69633 -226824 23131 88351 325875 -51317 -79112
9867 -79112 -225886 -308220 115039 -206818 -9526 -231075 99134 217893 -154203 98871 52605
9856 52605 -184717 83081 -234118 -99240 -288559 -100499 55495 -271583 -2443 -44878 -49340
9845 -49340 -125770 130522 31708 84841 -58776 -202785 -69085 45761 144643 -267495 144734
$$ packed form
9926h1421K9547b2391H8281b57088g7992C2106N2012a14129D1462M2553b82855
9914e5668J873m14887A48061j4892c11631p0999Q4354e3800j26974Q589B07633
9902A59579G3754h0574j73717g9320b2789j61534B41536d45296C8448a98184B23553
9890D2998b34269g2056K5440H6098a36210H9953h3250j1848C869h4754N225O899
9878g2630D8237a92897c9574k03635F9633b26824B3131O5220K37524e1317k7795
9867g9112j46774q2334A15039b06818i526k21549I9134J18759a54203I8871m6266
9856E2605a84717H3081b34118i9240j89319a00499E5495b71583b443m2435m462
9845d9340p6430A30522C1708N3133e8776j44009f9085D5761R8882b67495A44734
$$ plain form
9833 -47412 -276642 -14992 162074 -227658 235858 -225962 -122429 -240172 -210073 46968
9822 -267881 -266004 43299 -315458 194419 107918 -245009 -42783 140040 -83664 29604 -17875
9810 -225746 98499 -89398 304680 -162261 -81350 -67011 96852 -327382 140743 -185103 112036
9798 123380 -249871 -116231 160995 376231 -269338 -102109 -90524 26665 -251907 530831
9787 -8219 -346833 -180704 -163765 33812 -50313 -81823 -41927 -275041 -218529 81499 -268185
9775 -18339 -293789 262787 2952 -174989 -125133 -22193 -250939 171226 -17933 -13410 117992
9763 -323569 -115120 106271 -302438 32337 -120799 -229051 -218774 -213681 -70197 101914 232513
9752 232513 -328611 -198318 -7723 -285810 -16185 -62580 -58475 34914 51132 -26239 185406
$$ packed form
9833d7412k29230a4992A62074b27658B35858b25962J03533j17743L0099D6968
9822b67881J877D3299c15458A94419q6501b45009d2783A40040h3664B9604a7875
9810b25746I8499h9398C04680a62261Q0911J4339I6852c27382A40743a85103A12036
9798A23380b49871a16231A60995K15236b69338a02109J1585B6665b51907E30831
9787h219l38614J66129J6939C3812e0313l1510L9896k33114N6512H1499b68185
9775a8339k75450B62787B952a74989M9856b2193k28746A71226a7933M523A17992
9763c23569a15120A06271c02438C2337a20799j08252J0277N093g0197A01914J30599
9752B32513c28611J30293g723k78087a6185m6395M105C4914J6218b6239A85406
$$ plain form
9740 -154888 212143 157405 -472184 -130721 52941 -137604 2227 -335380 153376 -265864
9729 -28820 -139347 120219 11952 222132 178697 77282 -126743 114266 -85037 -95698 -419054
9718 -419054 -282652 228155 -258431 -30437 30343 4748 152468 100726 -82914 27164 -26386
9706 -111205 -167017 209488 564843 -132224 -147754 -250411 -138935 363827 -180105 -193859
9696 -193859 138887 -177442 -96004 -332610 -160395 -223631 -199871 23363 -26348 -214388 54792
9684 -349393 -430499 -185494 51458 -240300 -272105 -11942 82204 -105280 115046 273809 -148517
9672 -121741 -116093 -188988 94752 -48921 -83661 -136725 -149482 -136951 -227077 413264 14272 -28738
9659 34199 19115 265885 203597 -72570 -126954 -1266 -7216 -125844 -369129 -142117 -140134 249831
$$ packed form
9740a54888B12143n4738d72184a30721E2941a37604B227c35380A53376b65864
9729b8820j10527A20219A1952K10180m3435G7282a26743A14266h5037j0661l23356
9718d19054J36402B28155b58431c0437C0343D748J47720n1742h2914B7164b6386
9706a11205n5812B09488L55355a32224j5530j02657J11476C63827a80105j3754
9696a93859A38887a77442Q1438k36606a60395o3236K3760B3363b6348j88040E4792
9684c49393q1106a85494E1458b40300l1805a1942H2204a05280A15046J58763a48517
9672a21741N648p2895I4752d8921l4740n3064j2757J2531r0126D13264A4272b8738
9659C4199j5084K46770o2288g2570n4384a266n950j18628k43285a42117J983B49831
$$ plain form
9646 26628 -233249 229430 -486621 -101324 84907 -262361 -183837 19824 39362 -289128 -62096
9634 -13725 -82469 -57802 -6252 -26192 69433 46671 67881 -319559 -168189 106922 -12693
9622 -184053 41674 84884 -80261 42410 -180298 69266 118493 -163673 -224751 149538 -400397
9610 210583 -89317 -155365 -137099 -212482 263862 -266886 -149898 151330 -123733 -235282
9600 -235282 -185876 -60236 -105112 60210 18349 -27937 -378619 -576452 -139480 144525 -96665
9588 -90215 20517 -144472 137260 71464 -45007 24387 -54704 146687 -86254 -62438 43962
9576 127484 -196900 -232685 59670 -182422 -5930 -179152 -175082 -372016 -94438 -35674 -37194
9565 -37194 -6665 -4918 -89181 -151763 -143124 -221575 -279845 -168439 240636 43863 47300 -294214
$$ packed form
9646B6628b33249B29430d86621a01324H4907b62361P8524A9824J9538b89128f2096
9634a3725o8744K4667f252j9940F9433k2762K1210c19559J51370A06922a2693
9622a84053D1674M3210h0261D2410a80298F9266M9227a63673o1078A49538d00397
9610B10583h9317o6048J8266p5383B63862b66886J16988A51330a23733j11549
9600b35282M9406f0236m4876F0210A8349b7937l50682j97833a39480A44525i6665
9588i0215B0517a44472A37260o5796d5007B4387e4704A46687h6254K3816D3962
9576A27484a96900l5785E9670a82422e930j73222M070j96934i4438c5674j520
9565c7194f665J747q4263o2582Q639p8451n8270J11406B40636D3863L437b94214
$$ plain form
9552 -61270 143584 -148128 -124250 -39012 -434540 -150002 64449 -171618 51455 -288536 -141182
9540 230262 325582 -90392 -1099 28177 -74487 -51788 -170338 -8145 -64324 81331 7317 -204062
9527 10384 -156894 140145 -251088 125286 -72261 97408 -191551 -52858 -39940 42684 -216778
9515 -19380 -100916 -278846 -66070 218441 44468 -348280 -90450 -152127 100740 -170995 61738
9503 127140 118856 377190 4536 -172236 -31158 39868 261926 50320 -386904 -103889 19968
9491 -46395 -370135 -5457 -145653 -2210 53064 -100498 34337 -31922 -259728 16926 34058
9480 34058 -899 -95632 -144665 -130490 -36774 61216 -103182 127161 92538 -182148 -16061 19009
9467 79829 -187472 -221869 -120111 -353295 99101 -158649 10244 -426320 -246543 313804
$$ packed form
9552f1270A43584a48128K3878c9012l95528a50002F4449a71618E1455b88536a41182
9540B30262R5320i0392a099B8177g4487K2699j18550h145n6179H1331G317b04062
9527A0384a56894A40145b51088A25286g2261I7408a91551e2858J2918D2684b16778
9515a9380q1536j77930f6070B18441D4468c48280i0450o1677A00740a70995F1738
9503A27140q284K58334D536a72236c1158C9868K22058E0320c86904a03889A9968
9491d6395l23740e457j40196b210E3064a00498C4337c1922k27806A6926J7132
9480C4058h99r4733m9033J4175c6774F1216a03182A27161l4623a82148a6061A9009
9467G9829a87472l4397J01758k33184I9101a58649A0244d26320J79777C13804
$$ plain form
9456 -36757 -19282 -33650 -133629 -420411 99891 -147138 75210 194629 -52317 -88804 -41373
9444 -53559 -13654 21215 156911 -105891 -73238 -228373 -80348 143511 -243089 -174553 89963
9432 240577 8563 -31054 -66558 -91754 -459955 -362974 -197152 -22635 54884 -188604 -72291
9420 -392445 90985 -237276 -279792 -92006 -271051 -13809 7566 -111827 167177 -40641 292664
9408 80274 -121100 -10355 65967 45763 116143 -266184 267995 109271 78856 68916 172738
9397 172738 -40280 -26159 267760 -17009 -326391 39346 -167959 -93816 124925 144200 -339049
9385 -118598 34833 119489 -224935 -112467 -93506 -254493 -128308 -194594 -84749 -348881 271177
9373 -196544 85216 -302254 24742 -144820 60136 200978 -106827 -273855 -189877 -111124 -87438
$$ packed form
9456c6757J7475j4368r9979k86782I9891a47138G5210J19419e2317l6487d1373
9444e3559a3654B1215J35696a05891L2653j55135h0348A43511b43089O8536H9963
9432B40577H563c1054l5504k5196l68201R6981J65822b2635E4884a88604g2291
9420c92445I0985b37276m2516i2006j79045a3809G566a11827A67177d0641B92664
9408H0274a21100a0355F5967k0204P0380b66184B67995A09271l0415r940J03822
9397A72738d0280J4121B67760a7009l09382C9346a67959P4143A24925J9275c39049
9385a18598C4833Q4656b24935a12467J8961j60987J26185o6286h4749k64132B71177
9373a96544H5216c02254B4742a44820F0136J40842a06827j67028Q3978P8753K3686
$$ plain form
9362 -87438 180253 -230090 98211 106274 56421 -322451 20502 -11108 26818 -50157 -98502
9351 -98502 109158 -13711 162955 147408 147472 -361383 -365885 -66274 117146 63076 -139975 143416
9338 -72118 -115 -72291 -318877 113944 -77288 -45000 -263345 56057 120852 -247622 31954
9326 163090 282127 7882 -93371 -78126 -94083 13713 -228839 25855 65826 144033 57149
9314 2566 -66133 -336017 8965 12638 70191 65538 -83530 -71004 378703 -155748 158677 -197549
9301 59887 31089 36431 -139265 -188945 299410 179506 -63496 -405469 43222 -402525 36408
9289 -119160 -2424 -6904 -25994 -88176 -203769 -204482 454147 57829 55287 75405 -77200 193170
9276 -236959 -268368 -191540 49703 -14064 147264 -102199 -219319 -37109 -184315 -195991 -63590
$$ packed form
9362h7438A80253b30090I8211Q063m9853c22451B0502a1108B6818e0157m8345
9351i8502A09158a3711A62955j5547O4c61383m502f6274A17146n4070a39975A43416
9338g2118a15p2176k46586A13944g7288L2288k18345E6057O4795b47622C1954
9326A63090J19037G882i3371J5245j5957A3713b28839B5855L9971P8207E7149
9314B566f6133k69884H965L673N7553m653h3530J2526C78703a55748A58677a97549
9301E9887k8798N342a39265m9680B99410j19904f3496l41973D3222d02525C6408
9289a19160b424m480j9090o2182j15593p13D54147E7829k542K0118g7200A93170
9276b36959l1409P6828D9703a4064A47264a02199j17120c7109j47206j1676f3590
$$ plain form
9264 43298 -134081 -146090 219431 -156054 -125015 -241311 -248555 -138587 -178919 -111239 -139171
9253 -139171 -52159 -69234 -493375 159123 -17946 -228221 -34231 53340 -238565 -228069 -211359
9242 -211359 -83711 -125748 169228 303896 -42364 -241745 345575 -19551 11585 -291130 15999
9230 -166108 -14851 125932 -264862 178160 -204494 148705 237216 49742 -97766 14603 -110147
9218 -86098 228018 2351 668 32323 197216 197094 -284815 102512 -230967 317088 191817
9207 191817 61592 15998 -436582 213001 38170 -330609 7511 28118 62197 73705 201079
9196 201079 -107293 -47945 -68342 -272556 159267 -27108 129129 63997 138444 40440 367559
9185 367559 -165382 -191882 -269338 86793 -166328 -130926 -67342 -125793 -232913 263745 201612
$$ packed form
9264D3298a34081j2009B19431a56054L1039j16296p244J09968m0332O7680k7932
9253a39171e2159j7075m24141A59123a7946k10275c4231E3340b38565J0496J6710
9242b11359h3711m2037A69228J34668d2364j99381C45575a9551A1585b91130A5999
9230a66108a4851A25932b64862A78160b04494A48705Q8511D9742i7766A4603a10147
9218h6098B28018B351F68L1655J64893j22b84815A02512b30967C17088j25271
9207A91817F1592A5998d36582B13001C8170c30609G511K0607L4079J1508J27374
9196B01079a07293d7945k0397k04214A59267b7108A29129F3997P4447D0440L27119
9185C67559a65382k6500p7456H6793a66328L5402O3584n8451j07120B63745o2133
$$ plain form
9174 201612 -261036 -96146 -300565 -139245 -2711 12288 149151 -156761 117209 19636 -301492
9162 -205438 -31539 -38933 84203 137171 51540 68042 26955 199811 -86916 -233335 81327
9150 -315406 140569 -362059 -25633 19761 -159939 77857 -22023 61829 -81507 -233124 -21644
9138 -328208 -150978 -370682 72526 105572 -86711 16094 -251869 -10054 5092 73626 269083
9127 269083 271431 161497 392959 -237104 245777 -70352 73246 -118901 237177 -100007
9116 -195343 -18598 -29582 -31008 72319 7763 -20083 -94613 -413230 -35578 -34765 313828 156172
9103 -42926 64010 -73158 -222137 6472 402208 243339 236119 228566 -35328 -40876 278565 175449
9091 175449 -236723 -255279 -169907 -179461 129510 -79270 -132290 45328 248193 -23412 -258347
$$ packed form
9174B01612b61036i6146k04419a39245b711A2288J36863a56761A17209A9636c01492
9162b05438c1539p394H4203N2968E1540J6502B6955J72856h6916j46419H1327
9150c15406A40569c62059b5633A9761a59939G7857b2023F1829h1507j51617b1644
9138c28208a50978k19704G2526L3046h6711A6094b51869a0054E092O8534J95457
9127B69083K348j09934K31462b37104B45777g0352G3246a18901B37177a00007
9116a95343a8598j0984j426G2319G763b0083p4530l18617c5578Q13C13828A56172
9103d2926F4010g3158j48979F472L95736j58869p220p553c5328n548B78565j03116
9091A75449b36723j8556Q5372r554A29510g9270n3020D5328K02865b3412k34935
$$ plain form
9080 -258347 21041 -37007 -101256 -245574 117457 -39964 -64980 -10479 -117005 39244 4367
9068 54188 -126945 -60142 34635 27483 58007 -44338 73112 -202898 -97631 41944 14133 155837
9056 155837 -54295 -150828 112650 -205428 43125 137227 -141773 -48055 -148977 -91796 -367467
9045 -367467 -412063 14189 95296 -107905 -59487 -231100 -402193 -243509 -243784 10474 116909
9034 116909 166032 -64270 -114087 -312233 98986 185196 171920 -442628 -342686 -24318 31345
9022 9804 100445 -177791 -220180 117631 -81907 -65702 114745 -119191 39867 130397 49117
9010 -204894 -165941 176476 2950 19686 146507 -338132 146753 -340952 -46438 110122 107201
8999 107201 98111 -221654 155013 147899 30731 -146285 137454 -119711 -161019 181265 -209342
$$ packed form
9080b58347B1041c7007o4249j44318A17457c9964k5016a0479j06526C9244D367
9068E4188a26945f0142C4635p152L0524d4338G3112b02898i7631D1944A4133J41704
9056A55837e4295r6533A12650b05428D3125R4102a41773d8055j00922N7181k75671
9045c67467m4596A4189Q1107a07905M8418j71613j71093J58684k75A0474J06435
9034A16909M9123f4270m9817j98146I8986Q6210j3276d42628R9942b4318C1345
9022I804R0641a77791m2389A17631h1907J6205A14745a19191C9867R0530D9117
9010b04894L8953A76476B950J6736J26821c38132A46753c40952d6438A10122k921
8999A07201r090b21654A55013p114C0731a46285A37454a19711m1308A81265b09342
$$ plain form
8987 -204984 156072 -15378 -350659 -90939 -218410 -324502 -132962 -299896 263744 -373773
8976 -53001 164690 33627 -87618 187988 21496 -307163 -61774 -136485 -243047 -197477 -159936
8965 -159936 -73787 -263705 53610 241835 -175566 -118157 23731 -221516 -114936 -58716 -5766
8953 -79323 -175647 83189 -137367 -243456 -125033 -88626 -8818 59363 795 -68563 121093 110720
8941 110720 -163780 152626 38538 -102732 -113526 267421 -145610 211312 -47090 -56359 229778
8929 167118 -278076 -67853 -203218 -19422 59274 195798 374613 767744 806135 184427
8918 26295 -456778 -213153 87469 -70757 -60001 -110543 -71525 -218389 -131662 256531 -86504
8906 -109014 -237083 -241909 -31592 -130622 -132274 -82846 260577 -14963 73968 -332805 64910
$$ packed form
8987b04984A56072a5378l35281i0939j27471j06092a32962j66934B63744c73773
8976e3001A64690C3627h7618A87988B1496c07163f1774p4711j06562M5570L7541
8965a59936g3787j89918E3610J88225a75566N7409B3731b21516J06580N6220e766
8953g9323r6324H3189a37367j06089J18423L6407h818E9363G95f8563A21093j0373
8941A10720a63780A52626C8538a02732j0794B67421a45610B11312d7090r269B29778
8929A67118b78076f7853j35365a9422E9274J36524J78815L93131L8391A84427
8918B6295d56778b13153H7469g0757J0756n0542L9018j46864Q6727B56531h6504
8906a09014j28069m826c1592r9030j652M9428B60577a4963G3968c32805F4910
$$ plain form
8894 -87912 -68491 -62932 79491 -329050 69067 -66766 -100710 -124085 115928 -265011 53528
8882 -3626 7106 343467 -55142 -176296 -59293 -334807 12789 -288268 93591 61799 -86983
8870 57847 -170255 -106717 -15243 186749 147204 -49493 233263 94579 -184706 100114 101252
8859 101252 -110726 428677 29954 -38242 -247971 -48624 111593 -140063 -25319 136851
8848 -321817 -125962 -252054 -76144 -9402 -183341 -193690 6351 -69874 -262354 137973 -187715
$$ packed form
8894h7912J9421N559G9491c29050F9067f6766l3944k3375A15928b65011E3528
8882c626G106L36361e5142j21154e9293k75514A2789b88268I3591l1792h6983
8870E7847a70255O3538a5243A86749l9545d9493B33263I4579a84706A00114J138
8859A01252a10726D28677B9954c8242k09729d8624A11593a40063b5319A36851
8848c21817a25962j26092g6144i402j73939j0349F351f9874j92480A37973a87715
$$ [...]
##END NTUPLES=NMR SPECTRUM
##END=
