##TITLE=AC1459_PAST813265_8026446_rbvUE5tfaM
##JCAMPDX= 6.0         $$ Bruker NMR JCAMP-DX V2.0
##DATA TYPE= NMR SPECTRUM
##DATA CLASS= NTUPLES
##ORIGIN= BRUKER
##OWNER= Administrator
$$ 1.72 TOPSPIN		Version 2.1
$$ 2013-07-11 16:52:08.716 -0700  Administrator@X
$$ Compression mode = diff/dup
##.OBSERVE FREQUENCY= 400.02188249412
##.OBSERVE NUCLEUS= ^1H
##.ACQUISITION MODE= SIMULTANEOUS (DQD)
##.ACQUISITION SCHEME= undefined
##.AVERAGES= 64
##.DIGITISER RES= 22
##SPECTROMETER/DATA SYSTEM= spect
##.PULSE SEQUENCE= noesygpps1d.comp
##.SOLVENT NAME= COFFEE_meoh
##.SHIFT REFERENCE= INTERNAL, COFFEE_meoh, 1, 14.96093
##AUDIT TRAIL= $$ (NUMBER, WHEN, WHO, WHERE, PROCESS, VERSION, WHAT)
$$ ##TITLE= Audit trail, TOPSPIN		Version 2.1
$$ ##JCAMPDX= 5.01
$$ ##ORIGIN= Bruker BioSpin GmbH
$$ ##OWNER= Administrator
$$ $$ E:\/data/COFFEE/nmr/AC1459_PAST813265_8026446_rbvUE5tfaM/12/pdata/1/auditp.txt
$$ ##AUDIT TRAIL=  $$ (NUMBER, WHEN, WHO, WHERE, PROCESS, VERSION, WHAT)
(   1,<2013-07-11 16:52:03.684 -0700>,<Administrator>,<X>,<go>,<TOPSPIN 2.1>,
      <created by zg
	started at 2013-07-11 16:40:33.747 -0700,
	POWCHK enabled, PULCHK disabled,
       configuration hash MD5:
       C8 4E 4E 5D D3 5C D8 9E 9F 52 82 E0 59 8A DE 15
       data hash MD5: 64K
       26 2F 6B 34 07 CE 39 F7 48 9D EF 8F 89 AB D9 0D>)
(   2,<2013-07-11 16:52:06.622 -0700>,<Administrator>,<X>,<proc1d>,<TOPSPIN 2.1>,
      <Start of raw data processing
       efp LB = 0.3 FT_mod = 6 PKNL = 1 PHC0 = 0 PHC1 = 0 SI = 128K 
       data hash MD5: 128K
       DD 88 38 26 91 E9 32 D1 FE 1A 0F 2D B0 9F 30 37>)
(   3,<2013-07-11 16:52:07.575 -0700>,<Administrator>,<X>,<proc1d>,<TOPSPIN 2.1>,
      <pk PHC0 = -79.29382 PHC1 = 0 
       data hash MD5: 128K
       2A F8 66 30 7F 88 93 F6 02 06 4E 6C 71 F5 FB EE>)
(   4,<2013-07-11 16:52:08.012 -0700>,<Administrator>,<X>,<proc1d>,<TOPSPIN 2.1>,
      <abs ABSG = 1 
       data hash MD5: 128K
       6A 4D 83 38 D9 DD 02 C4 3A D7 BC 53 42 E4 28 C1>)
(   5,<2013-07-11 16:52:08.137 -0700>,<Administrator>,<X>,<proc1d>,<TOPSPIN 2.1>,
      <abs ABSG = 2 
       data hash MD5: 128K
       EF CB 30 8C 7C F9 98 DF 8F 26 49 E6 34 90 0F A5>)
(   6,<2013-07-11 16:52:08.247 -0700>,<Administrator>,<X>,<proc1d>,<TOPSPIN 2.1>,
      <abs ABSG = 3 
       data hash MD5: 128K
       80 5F 64 7F CD 01 C6 E0 D1 DF F3 EF 3A D9 FC AD>)
(   7,<2013-07-11 16:52:08.387 -0700>,<Administrator>,<X>,<proc1d>,<TOPSPIN 2.1>,
      <abs ABSG = 4 
       data hash MD5: 128K
       2C 9E B2 1B F6 11 E5 0D EA 11 2C E4 8A 7F E0 3E>)
(   8,<2013-07-11 16:52:08.481 -0700>,<Administrator>,<X>,<proc1d>,<TOPSPIN 2.1>,
      <abs ABSG = 5 
       data hash MD5: 128K
       67 7B 2D 37 5B BC 92 A0 01 FD 52 4C 3D 0A 0B 5A>)
$$ ##END=
$$ 
$$ $$ hash MD5
$$ $$ 8E 87 CD B1 3A 67 55 36 3B A6 3B EB 51 5B 0C 28
##$RELAX= 
##$RELAX= 
##$RELAX= 
##$RELAX= 
##$RELAX= 
##$RELAX= 
##$RELAX= 
##$RELAX= 
$$ Bruker specific parameters
$$ --------------------------
##$DU= <E:\>
##$EXPNO= 12
$$ [...]
##$TP07= 0
##$TPNAME0= <>
##$TPNAME1= <>
##$TPNAME2= <>
##$TPNAME3= <>
##$TPNAME4= <>
##$TPNAME5= <>
##$TPNAME6= <>
##$TPNAME7= <>
##$TPOAL= (0..7)
0.5 0.5 0.5 0.5 0.5 0.5 0.5 0.5
##$TPOFFS= (0..7)
0 0 0 0 0 0 0 0
##$TUNHIN= 0
##$TUNHOUT= 0
##$TUNXOUT= 0
##$USERA1= <user>
##$USERA2= <user>
##$USERA3= <user>
##$USERA4= <user>
##$USERA5= <user>
##$V9= 5
##$VALIST= <valist>
##$VCLIST= <CCCCCCCCCCCCCCC>
##$VD= 0
##$VDLIST= <DDDDDDDDDDDDDDD>
##$VPLIST= <PPPPPPPPPPPPPPP>
##$VTLIST= <TTTTTTTTTTTTTTT>
##$WBST= 1024
##$WBSW= 4
##$XGAIN= (0..3)
0 0 0 0
##$XL= 0
##$YL= 0
##$YMAX_a= 6203965
##$YMIN_a= -12252886
##$ZGOPTNS= <>
##$ZL1= 120
##$ZL2= 120
##$ZL3= 120
##$ZL4= 120
##$ABSF1= 14.96093
##$ABSF2= -5.597252
##$ABSG= 5
##$ABSL= 3
##$ALPHA= 0
##$AQORDER= 0
##$ASSFAC= 0
##$ASSFACI= 0
##$ASSFACX= 0
##$ASSWID= 0
##$AUNMP= <proc_prof1d_extract.lims>
##$AXLEFT= 0
##$AXNAME= <>
##$AXNUC= <1H>
##$AXRIGHT= 0
##$AXTYPE= 0
##$AXUNIT= <>
##$AZFE= 0.1
##$AZFW= 0.1
##$BCFW= 0
##$BC_mod= 0
##$BYTORDP= 0
##$COROFFS= 0
##$CY= 15
##$DATMOD= 1
##$DC= 0
##$DFILT= <>
##$DTYPP= 0
##$F1P= 0
##$F2P= 0
##$FCOR= 0.5
##$FTSIZE= 131072
##$FT_mod= 6
##$GAMMA= 0
##$GB= 0
##$INTBC= 1
##$INTSCL= 1
##$ISEN= 128
##$LB= 0.3
##$LEV0= 0
##$LPBIN= 0
##$MAXI= 10000
##$MC2= 0
##$MEAN= 0
##$ME_mod= 0
##$MI= 0
##$NCOEF= 0
##$NC_proc= -2
##$NLEV= 6
##$NOISF1= 0
##$NOISF2= 0
##$NSP= 0
##$NTH_PI= 0
##$NZP= 0
##$OFFSET= 14.96093
##$PC= 1
##$PHC0= -79.29382
##$PHC1= 0
##$PH_mod= 1
##$PKNL= yes
##$PPARMOD= 0
##$PPDIAG= 0
##$PPIPTYP= 0
##$PPMPNUM= 2147483647
##$PPRESOL= 1
##$PSCAL= 4
##$PSIGN= 0
##$PYNMP= <proc.py>
##$REVERSE= no
##$SF= 400.020009663203
##$SI= 131072
##$SIGF1= 0
##$SIGF2= 0
##$SINO= 400
##$SIOLD= 131072
##$SPECTYP= <>
##$SREGLST= <1H.CDCl3>
##$SSB= 0
##$STSI= 131072
##$STSR= 0
##$SW_p= 8223.68421052631
##$SYMM= 0
##$S_DEV= 0
##$TDeff= 65536
##$TDoff= 0
##$TI= <>
##$TILT= no
##$TM1= 0
##$TM2= 0
##$TOPLEV= 0
##$USERP1= <user>
##$USERP2= <user>
##$USERP3= <user>
##$USERP4= <user>
##$USERP5= <user>
##$WDW= 1
##$XDIM= 131072
##$YMAX_p= 408812374
##$YMIN_p= -10902
##$CURPLOT= <Network HP LaserJet P1505>
##$CURPRIN= <$Network HP LaserJet P1505>
##$DFORMAT= <normdp>
##$LAYOUT= <+/1D_H.xwp>
##$LFORMAT= <normlp>
##$PFORMAT= <normpl>
##$SURQMSG= 1
$$ End of Bruker specific parameters
$$ ---------------------------------
##NTUPLES= NMR SPECTRUM
##VAR_NAME=  FREQUENCY,     SPECTRUM/REAL,   SPECTRUM/IMAG
##SYMBOL=    X,             R,               I
##VAR_TYPE=  INDEPENDENT,   DEPENDENT,       DEPENDENT
##VAR_FORM=  AFFN,          ASDF,            ASDF
##VAR_DIM=   131072,        131072,          131072
##UNITS=     HZ,            ARBITRARY UNITS, ARBITRARY UNITS
##FACTOR=    0.0627417313425164, 1,          1
##FIRST=     8223.62146879497, -716,         -54979
##LAST=      0,             1583,            -55526
##MIN=       0,             -10902,          0
##MAX=       8223.62146879497, 408812374,    0
$$ Real data points
##PAGE= N=1
##DATA TABLE= (X++(R..R)), XYDATA
$$ [...]
61725D18848K227J358J008J832L019L446L049K542K234J868J428J341J823K523
61711D48546K915K755K052R27m02j641k606l301l772l971l777l193k553k457l166
61696D26356m098m255l379k306j920k117k188j899j640j667j804j841j761j568
61682C93913j356j497k202k880k649j625q99r86j114o12j75p97j999k356j582
61667C71184r09j173j644j302m00M2k60o88p94p23o39m04M2M64P20R50J270J554
61649C67290J741K030K566L143L508L748M140M597M636L946K906K322K560L071
61635D12204K902J679o7j593k671l441l872l818l550l614m072m317l928l284k975
61620C75583k954k797k478k325k242j664n01M39L07p59j827k226k129k190k844
$$ y = [418848, 421075, 422433, 423441, 425273, 428292, 431738, 434787, 437329, 439563, 441431, 442859, 444200, 446023, 448546, 451461, 454216, 456268, 457195, 456793, 455152, 452546, 449245, 445473, 441502, 437725, 434532, 431979, 429522, 426356, 422258, 418003, 414624, 412318, 410398, 408281, 406093, 404194, 402554, 400887, 399083, 397242, 395481, 393913, 392557, 391060, 388858, 385978, 383329, 381704, 380805, 379819, 378705, 378093, 377918, 377121, 375122, 372766, 371184, 370275, 369102, 367458, 366156, 365756, 365798, 365538, 364850, 364056, 363333, 362694, 362290, 362332, 362796, 363516, 364466, 365736, 367290, 369031, 371061, 373627, 376770, 380278, 384026, 388166, 392763, 397399, 401345, 404251, 406573, 409133, 412204, 415106, 416785, 416718, 415125, 412454, 409013, 405141, 401323, 397773, 394159, 390087, 385770, 381842, 378558, 375583, 372629, 369832, 367354, 365029, 362787, 361123, 360622, 361061, 361368, 360609, 358782, 356556, 354427, 352237, 349393]
61605C49393l941m881n178m978m869n096n190m651l771l323l523l761l506l004
61591B89721k812k982l083k875k532k212j831j308q10n54n42o45q50j224j690
61576B63771j964j811j360j073j274j696j628p26M31Q14O5j062j472q45J33N80
61560B50883K90j17J03J037J971K128J445N70J47K71O74J129J520J706J574J240
61544B66571J042J275J895K482K539K020J469J426J693J534P17r2j73L71R60J369
61528B87098J739J996J848J290O04j33j043j890k154j801j412j312j152o90m48
61513B82540r89j876k050j171LN91M94J43j42l15m24n58q43j226j370j030m57
61496B71320k50o65j275j412q42P2Q25J205J286J205J036P93M66J53J59P55J691
$$ y = [349393, 345452, 340571, 335393, 330415, 325546, 320450, 315260, 310609, 306838, 303515, 299992, 296231, 292725, 289721, 286909, 283927, 280844, 277969, 275437, 273225, 271394, 270086, 269276, 268722, 268180, 267535, 266685, 265461, 263771, 261807, 259996, 258636, 257563, 256289, 254593, 252965, 252239, 252670, 253484, 253549, 252487, 251015, 250170, 250303, 250883, 251173, 251056, 251159, 252196, 254167, 256295, 257740, 258310, 258457, 258728, 259402, 260531, 262051, 263757, 265331, 266571, 267613, 268888, 270783, 273265, 275804, 277824, 279293, 280719, 282412, 283946, 284663, 284571, 284398, 284769, 285729, 287098, 288837, 290833, 292681, 293971, 294575, 294442, 293399, 291509, 289355, 287554, 286142, 284830, 283678, 282988, 282540, 281551, 279675, 277625, 276454, 276457, 277048, 277542, 277685, 277543, 277228, 276804, 276246, 275403, 274177, 272807, 271777, 271320, 271070, 270405, 269130, 267718, 266876, 266948, 267773, 268978, 270264, 271469, 272505, 273298, 273764, 273917, 274076, 274831, 276522]
61479B76522K207J818R55N70J120K146K793K530J463K61l12q9K73P5n49q82o35
61462B90266j80J79N47Q47O20k21r30p64P1P43Q21N71M25O23J172J750J836J294
61444B99670P02P09J313K053K673L162L342L084K792L078L889M475M296L498K510
61429C41246J609J002Q35R95J252J618K186K666K606K135J878K004J993J633J455
61414C67113J777J946J258J30m56l90n00j222k049k443k577k817l047k964k681
61399C51078k560k615k582k471k619l089l457l331k764k011j160k98J76q2p95
61384C21420j258j182q96n99K1J065J850J679R43P22J337K010K125K068K415K873
61368C36593K691J862J218J320J868K275K399K504K794L269L790M107M022L723
$$ y = [276522, 278729, 280547, 281502, 282072, 283192, 285338, 288131, 290661, 292124, 292385, 292073, 291984, 292257, 292332, 291783, 290901, 290266, 290086, 290265, 290812, 291659, 292279, 292058, 291128, 290364, 290435, 291178, 291999, 292570, 292995, 293618, 294790, 296540, 298376, 299670, 300372, 301081, 302394, 304447, 307120, 310282, 313624, 316708, 319500, 322578, 326467, 330942, 335238, 338736, 341246, 342855, 343857, 344692, 345687, 346939, 348557, 350743, 353409, 356015, 358150, 360028, 362032, 364025, 365658, 367113, 368890, 370836, 372094, 372224, 371768, 371378, 370878, 369656, 367607, 365164, 362587, 359770, 356723, 353759, 351078, 348518, 345903, 343321, 340850, 338231, 335142, 331685, 328354, 325590, 323579, 322419, 322121, 322297, 322215, 321420, 320162, 318980, 318084, 317485, 317506, 318571, 320421, 322100, 323043, 323765, 325102, 327112, 329237, 331305, 333720, 336593, 339284, 341146, 342364, 343684, 345552, 347827, 350226, 352730, 355524, 358793, 362583, 366690, 370712, 374435]
61354C74435L758M501N757P115Q455R751J0574J0395R436Q670Q639Q762Q191O995
61340D85434N913N252M661L973L481L283K963K240J428R26N92j9j124k646m351
61325E12006n786o467o396o112n914n481m589l695l325l277l027k497j874j063
61311D52503k0P04O35L89J108K904M707N713O152O417O296N415L801J676p55l025
61295D94620m490m998n021m960m787m503m331m206l759l039k601k542k140r31
61281D42312M85J226J235J094J226J791K860M224N314N810N955N977N748N402
61267D90659N548O363P077P066O870P353Q440R522J0553J1755J2600J2223J0763
61254F06792R248Q221P273N987M377K495M45j187j832j952k683m306n977p096
$$ y = [374435, 378193, 382694, 388451, 395566, 404021, 413772, 424346, 434741, 444177, 452847, 461486, 470248, 478439, 485434, 491347, 496599, 501260, 505233, 508714, 511997, 514960, 517200, 518628, 519554, 520146, 520127, 519003, 516357, 512006, 506220, 499753, 493357, 487245, 481331, 475850, 471261, 467566, 464241, 460964, 457937, 455440, 453566, 452503, 452483, 453187, 453822, 454211, 455319, 458223, 462930, 468643, 474795, 481212, 487508, 492923, 496724, 498400, 497645, 494620, 490130, 485132, 480111, 475151, 470364, 465861, 461530, 457324, 453565, 450526, 447925, 445383, 443243, 442312, 442797, 444023, 445258, 446352, 447578, 449369, 452229, 456453, 461767, 467577, 473532, 479509, 485257, 490659, 496207, 502570, 509647, 516713, 523583, 530936, 539376, 548898, 559451, 571206, 583806, 596029, 606792, 616040, 624261, 631534, 637521, 641898, 644393, 644838, 643651, 641819, 639867, 637184, 632878, 626901, 619805]
61240F19805p956q759r035q517p781p331o830n863m881m610m935n038m427l289
61226E30553k050j101p69j037j391j287p72l28k54m58p11q41p32l73R3N17Q26
61209E19885R35P53L34j23m83o87n29K38J568L107M628O195P824R402J0945J2611
61193E76603J4334J5729J6455J6347J5254J3204J0787Q839P606O687N914N642
61181G13401N949O209N834M953L947K836J562L89n13j465k751m062m948n482n967
61166G19892o349o490o718p492q674r690j0249j0467j0477j0408j0478j0579j0033
61153F01788q352o058m135k839j670l53P93J372J050o33l708p053r105r590r644
61138E41863j0022j0083r076p423n984m721l082j308l02j73J25J443L414N173
$$ y = [619805, 611849, 603090, 594055, 585538, 577757, 570426, 563596, 557733, 552852, 548242, 543307, 538269, 533842, 530553, 528503, 527402, 526633, 525596, 524205, 522918, 522146, 521818, 521564, 521106, 520395, 519554, 518822, 518449, 518542, 519059, 519885, 520820, 521573, 521907, 521784, 521301, 520614, 520085, 520323, 521891, 524998, 529626, 535821, 543645, 553047, 563992, 576603, 590937, 606666, 623121, 639468, 654722, 667926, 678713, 687552, 695158, 701845, 707759, 713401, 719350, 725559, 731393, 736346, 740293, 743129, 744691, 745080, 744567, 743102, 740351, 736289, 731341, 725859, 719892, 713543, 707053, 700335, 692843, 684169, 674479, 664230, 653763, 643286, 632878, 622400, 611821, 601788, 593436, 587378, 583243, 580404, 578734, 578381, 579174, 580546, 581596, 580963, 577255, 570202, 561097, 551507, 541863, 531841, 521758, 512682, 505259, 499275, 494554, 491472, 490164, 489862, 489689, 489814, 491257, 494671, 499844]
61124D99844O533P961R669J1297J2495J3439J4549J5961J7410J8566J9320J9794
61112F66838K0219K0755K1296K1532K1224K0422J9337J8117J6873J5735J4580
61101H76928J2860J0076O454K765n35l594o581r326j1750j4071j6314j8002j8783
61088H10127j8981j9077j8990j8388j7443j6716j6413j6207j5739j4867j3559
61077F23747j2013j0768j0180r824q866p131n281l937l053k268j476p88k16L82
61063E48328J068J682J956J925K130L167M882O412P264P902Q992J0451J1743J2762
61049F30664J3795J4907J6009J7303J9028K0860K2239K3218K4346K5839K7406
61038H55614K8891L0487L2354L4561L7279M0471M3505M5649M6860M7520M7710
$$ y = [499844, 506377, 514338, 524007, 535304, 547799, 561238, 575787, 591748, 609158, 627724, 647044, 666838, 687057, 707812, 729108, 750640, 771864, 792286, 811623, 829740, 846613, 862348, 876928, 889788, 899864, 906318, 909083, 908548, 904954, 898373, 889047, 877297, 863226, 846912, 828910, 810127, 791146, 772069, 753079, 734691, 717248, 700532, 684119, 667912, 652173, 637306, 623747, 611734, 600966, 590786, 580962, 572096, 564965, 559684, 555747, 552694, 550426, 548950, 548162, 547946, 548328, 549396, 551078, 553034, 554959, 557089, 560256, 565138, 571550, 578814, 586716, 595708, 606159, 617902, 630664, 644459, 659366, 675375, 692678, 711706, 732566, 754805, 778023, 802369, 828208, 855614, 884505, 914992, 947346, 981907, 1019186, 1059657, 1103162, 1148811, 1195671, 1243191, 1290901]
61027A290901M7514M7708M9191N1933N5345N9548O5250P2541Q0989R0775J02550
61016B014245J16344J32082J51218J76154K07874K45757K90040L42646M05428
61007D081788M80055N70299O81706Q17550R77516J160862J364504J570475J735744
60998A3440499J802004J722579J485163J117483O82188K67367l4249j61565j18558
60989B0202911K3217J58624J94168P6273k01687o00731j042060j427593j677483
60980A5705639j763285j710670j571716j393641j206779j028737q69294p31093
60972E430424o11807n08928m21642l48667k87370k35990j94550j62503j37409
60963B521558j16849j00018q6490p5095o5109n7097n1343m6629m1776l7265l4171
$$ y = [1290901, 1338415, 1386123, 1435314, 1487247, 1542592, 1602140, 1667390, 1739931, 1820920, 1911695, 2014245, 2130589, 2262671, 2413889, 2590043, 2797917, 3043674, 3333714, 3676360, 4081788, 4561843, 5132142, 5813848, 6631398, 7608914, 8769776, 10134280, 11704755, 13440499, 15242503, 16965082, 18450245, 19567728, 20249916, 20517283, 20483034, 20321469, 20202911, 20226128, 20384752, 20578920, 20655193, 20453506, 19852775, 18810715, 17383122, 15705639, 13942354, 12231684, 10659968, 9266327, 8059548, 7030811, 6161517, 5430424, 4818617, 4309689, 3888047, 3539380, 3252010, 3016020, 2821470, 2658967, 2521558, 2404709, 2304691, 2218201, 2143106, 2077997, 2020900, 1969557, 1922928, 1881152, 1843887, 1809716]
60952A809716l2560l2032l2811l4989l7532l9331m0547m1774m2636m2479m1749
60941A391276m1232m0586l9106l7483l7207l8276l9079l8670l7692l6838l5717
60930I69390l3834l1667l0041k9071k8222k6992k5236k3148k1131j9383j7651
60919F83014j5695j3859j2745j2386j2225j1700j0466q338n692l634k952l032
60907E70290k636j574o99l06L51J701L084L770L917L974L808L065J862O68k63
60892E91012r15j344j783k585l676m479m623m487m694n383o248o979p434p575
60878E28807p505p381p136o620o026n858o219o570o426n870n219m561l999l807
60864D45610l981l918l081j775p86m56m99o16q89j437k093k480k319j661q65l05
$$ y = [1809716, 1777156, 1745124, 1712313, 1677324, 1639792, 1600461, 1559914, 1518140, 1475504, 1433025, 1391276, 1350044, 1309458, 1270352, 1232869, 1195662, 1157386, 1118307, 1079637, 1041945, 1005107, 969390, 935556, 903889, 873848, 844777, 816555, 789563, 764327, 741179, 720048, 700665, 683014, 667319, 653460, 640715, 628329, 616104, 604404, 593938, 585600, 579908, 576274, 573322, 570290, 567654, 566080, 565381, 565075, 565426, 567127, 570211, 573981, 577898, 581872, 585680, 588745, 590607, 591275, 591012, 590097, 588753, 586970, 584385, 580709, 576230, 571607, 567120, 562426, 557043, 550795, 543816, 536382, 528807, 521302, 513921, 506785, 500165, 494139, 488281, 482062, 475492, 469066, 463196, 457977, 453416, 449417, 445610, 441629, 437711, 434630, 432855, 432069, 431613, 431114, 430498, 429609, 428172, 426079, 423599, 421280, 419619, 418754, 418449]
60848D18449J9L34N70K86o72j752k294k264k057j793j326p57m49m96o39p76j083
60831D03300j452j320m05O92J095P26K92K60L28R7j63J27R52J612J576R77K30
60814D08924m73j061j399j513j696k038k149j782j473j949k957l366k636j536
60800C82896j089j317j514j398j383j844k622l376l998m503m758m570l967l242
60786C43315k698k375k127j886j765j861k079k234k251k087j625p95K22J110J679
60771C22543J830J408N42j2O23K375M073M684M295L688L281K958K631K443K456
60756C59818K547K669K840K848K342J371M60J9p3q3J52R15J855K010Q37j057k570
60739C76900l358m055n162o234o514o116n961o470o846o057m262k760k492l009
$$ y = [418449, 418468, 418802, 419372, 419658, 418986, 417234, 414940, 412676, 410619, 408826, 407500, 406743, 406294, 405798, 405159, 404383, 403300, 401848, 400528, 400123, 400815, 401910, 402636, 402928, 403188, 403516, 403613, 403450, 403577, 404529, 406141, 407717, 408694, 408924, 408451, 407390, 405991, 404478, 402782, 400744, 398595, 396813, 395340, 393391, 390434, 387068, 384432, 382896, 381807, 380490, 378976, 377578, 376195, 374351, 371729, 368353, 364355, 359852, 355094, 350524, 346557, 343315, 340617, 338242, 336115, 334229, 332464, 330603, 328524, 326290, 324039, 321952, 320327, 319532, 319754, 320864, 322543, 324373, 325781, 326323, 326311, 326934, 329309, 333382, 338066, 342361, 346049, 349330, 352288, 354919, 357362, 359818, 362365, 365034, 367874, 370722, 373064, 374435, 374895, 374914, 374841, 374758, 374910, 375825, 377680, 379690, 380527, 379470, 376900, 373542, 369487, 364325, 358091, 351577, 345461, 339500, 333030, 326184, 320127, 315865, 313105, 310613, 307604]
60725C07604l166k537j784j632j931j956j407p30m19l53o0N40R47O84p6o33m79
60708B92612J54N61L68j02l07j20J52K66K26J01j0J75Q98J849K367K286K155K358
60690C05989K492K060J358J135J544K014K114K078K392L199M161M707M443L547
60676C43233K715K471K644K650K118J021m17j681k135j684j083j120j741k358
60662C44633k745l076l316l232k903k681k651k603k409k020j294l72J63Q3J09
60647C15686Q78J768J790J213J065J182L80j308k231j599p89j237k370k801k526
60632C09101k498k768k514j611q32n89n28l80k71j37K68P29O51k1o09n63l5N21
60614B97914P91O73K57q2P1O82J247J236N04n86j311j155l98J70L17O27J426K099
$$ y = [307604, 304438, 301901, 300117, 298485, 296554, 294598, 293191, 292461, 292042, 291689, 291629, 292169, 293116, 293800, 293724, 293091, 292612, 292766, 293327, 293695, 293593, 293286, 293166, 293318, 293584, 293810, 293911, 293901, 294076, 294974, 296823, 299190, 301476, 303631, 305989, 308481, 310541, 311899, 313034, 314578, 316592, 318706, 320784, 323176, 326375, 330536, 335243, 339686, 343233, 345948, 348419, 351063, 353713, 355831, 356852, 356435, 354754, 352619, 350935, 349852, 348732, 346991, 344633, 341888, 338812, 335496, 332264, 329361, 326680, 324029, 321426, 319017, 316997, 315703, 315331, 315494, 315577, 315686, 316564, 318332, 320122, 321335, 322400, 323582, 323962, 322654, 320423, 318824, 318035, 316798, 314428, 311627, 309101, 306603, 303835, 301321, 299710, 298878, 298289, 297761, 297381, 297110, 296973, 297241, 297970, 298621, 298600, 297991, 297428, 297393, 297914, 298705, 299378, 299635, 299553, 299624, 300306, 301553, 302789, 303293, 302707, 301396, 300241, 299843, 300013, 300330, 300957, 302383, 304482]
60596C04482K011J534J454J822K131K249K321K048R96m28j253j222r68q66n60
60581C15751J92R46J257J306J513J980K605L338M013M313M235M298N045O456Q046
60566C65294R363J0215J0586J0427R631Q151O212M214K392P35p70k064l296m654
60552D26436n775n834m560k707j091K95J739L018L859M661N908P297Q319R348
60538D50913J1048J2972J3886J3512J2674J1656R660O341K784K34j309k581l824
60525E37966m705n029m880m386l832l641l860l908l266k171j290r51r21p48o1
60510D94317J200K682L895M727N486O497P958J0114J3082J6458J9599K2480K5697
60497F34192K9448L3064L5808L7683L9038L9820L9512L7609L3795K7911K0080
$$ y = [304482, 306493, 308027, 309481, 311303, 313434, 315683, 318004, 320052, 321048, 320620, 319367, 318145, 317177, 316311, 315751, 315943, 316889, 318146, 319452, 320965, 322945, 325550, 328888, 332901, 337214, 341449, 345747, 350792, 357248, 365294, 374657, 384872, 395458, 405885, 415516, 423667, 429879, 434093, 436485, 437220, 436450, 434386, 431090, 426436, 420661, 414827, 410267, 407560, 406469, 406764, 408503, 411521, 415380, 420041, 425949, 433246, 441565, 450913, 461961, 474933, 488819, 502331, 515005, 526661, 536321, 542662, 545446, 545680, 544371, 541790, 537966, 533261, 528232, 523352, 518966, 515134, 511493, 507633, 503725, 500459, 498288, 496998, 496047, 495126, 494378, 494317, 495517, 498199, 502094, 506821, 512307, 518804, 526762, 536876, 549958, 566416, 586015, 608495, 634192, 663640, 696704, 732512, 770195, 809233, 849053, 888565, 926174, 959969, 987880, 1007960]
60486A007960J0766N60r987k0216k9280l6342m0882m2979m3352m2863m1689l9348
60474F72348l5819l2149k9279k6819k3839k0553j8053j6574j5178j3359j1670
60463D29056j0460r206p585o159n395m906m336m043m213m149l260k050j370j328
60449C60596j658k385l243l267j990m84j02o02p15j47J76k28p79r82j075j278
60433C41837j351j224j260j449j061L18J875K263J110n67j434j134m72l71q63
60418C36217j245j113p54m73n8P05J512J906J874J688J458J278J340J518J265
60403C47118M41k13p4M11M65K76O36J558K241K337K301K448K548K525K625K742
60387C70385K362J572J231J728K331K315K071K370K979K946K070J330J605K618
$$ y = [1007960, 1018726, 1019286, 1009299, 989083, 959803, 923461, 882579, 839600, 796248, 753385, 711696, 672348, 636529, 604380, 575101, 548282, 524443, 503890, 485837, 469263, 454085, 440726, 429056, 418596, 409390, 401805, 395646, 390251, 385345, 381009, 376966, 372753, 368604, 365344, 363294, 361924, 360596, 358938, 356553, 353310, 350043, 348053, 347569, 347467, 346865, 346150, 346003, 346179, 345951, 345172, 344190, 343115, 341837, 340486, 339262, 338002, 336553, 335492, 335810, 337685, 339948, 341058, 340491, 339057, 337923, 337451, 337080, 336217, 334972, 333859, 333105, 332632, 332574, 333279, 334791, 336697, 338571, 340259, 341717, 342995, 344335, 345853, 347118, 347559, 347346, 347272, 347683, 348148, 348424, 349060, 350618, 352859, 355196, 357497, 359945, 362493, 365018, 367643, 370385, 372747, 374319, 375550, 377278, 379609, 381924, 383995, 386365, 389344, 392290, 394360, 395690, 397295, 399913]
60373C99913L423L497L053K469J895J379R94P07M12K80P38J804K709K740K236
60358D28249K220L051M177N216O426P815Q696Q692Q421Q519Q566P811O403M993
60344E19255L449J138j691l871m844n303o019o795o998o573o001n614n318m886
60330D59929m289l770l585l584l255k387j502j240j551j881j972j931j662q58
60316D26462M43J800K969M058N134O152P352R118J1328J3316J4658J5608J6522
60303E34920J7244J7261J6215J4106J1253P966M212l41n577j0502j4023j6077
60291E76657j7326j7926j7303j5307j2784j0638q884p115n476m584m608m894m555
60278D45257l377k067j655k508l903m668m232l007j913j609k027k421k148j512
$$ y = [399913, 403336, 406833, 409886, 412355, 414250, 415629, 416623, 417330, 417742, 418022, 418760, 420564, 423273, 426013, 428249, 430469, 433520, 437697, 442913, 449339, 457154, 465850, 474542, 482963, 491482, 500048, 507859, 514262, 519255, 522704, 523842, 522151, 518280, 513436, 508133, 502114, 495319, 488321, 481748, 475747, 470133, 464815, 459929, 455640, 451870, 448285, 444701, 441446, 439059, 437557, 436317, 434766, 432885, 430913, 428982, 427320, 426462, 426905, 428705, 431674, 435732, 440866, 447018, 454370, 463488, 474816, 488132, 502790, 518398, 534920, 552164, 569425, 585640, 599746, 610999, 618965, 623177, 622836, 617259, 606757, 592734, 576657, 559331, 541405, 524102, 508795, 496011, 485373, 476489, 469374, 463898, 459314, 454706, 449812, 445257, 441880, 439813, 438158, 435650, 431747, 427079, 422847, 419840, 417927, 416318, 414291, 411870, 409722, 408210]
60264D08210j481k301k968k566j588j111j189j027n58n91j265j553q19R2N9p27
60248C88617j128p01j16r3m73n54k4O24P23L54L69J177J982J768Q04L46R20J745
60230C96340J998J805J581J278Q34P43J413K380K817K687K703L272L995M318M271
60215D32435M380M980N794O205N953N419N097N048N063N152N398N512N094M327
60201E05857L830L818L901L839L842L922L610K617J362M87K08L53O09N07l14j587
60185E36861k455k433j979j894k437l293m025m371m317m139m123m139l780k957
60171D90519k004j200o64o27j212j882j837j146p92j289j909j714p20M07J278
60156D75208J896K219K164J763J143N39L78Q36J288R97M14Q41K481L862L886L410
$$ y = [408210, 406729, 404428, 401460, 398894, 397306, 396195, 395006, 393979, 393421, 392830, 391565, 390012, 389193, 389285, 389344, 388617, 387489, 386788, 386672, 386579, 386106, 385552, 385528, 386152, 386875, 387229, 387598, 388775, 390757, 392525, 393329, 393675, 394595, 396340, 398338, 400143, 401724, 403002, 403836, 404579, 405992, 408372, 411189, 413876, 416579, 419851, 423846, 428164, 432435, 436815, 441795, 447589, 453794, 459747, 465166, 470263, 475311, 480374, 485526, 490924, 496436, 501530, 505857, 509687, 513505, 517406, 521245, 525087, 529009, 532619, 535236, 536598, 537085, 537293, 537646, 538255, 538762, 538448, 536861, 534406, 531973, 529994, 528100, 525663, 522370, 518345, 513974, 509657, 505518, 501395, 497256, 493476, 490519, 488515, 487315, 486651, 486024, 484812, 482930, 481093, 479947, 479155, 477866, 475957, 474243, 473523, 473930, 475208, 477104, 479323, 481487, 483250, 484393, 484932, 485310, 486146, 487434, 488431, 488845, 489686, 492167, 496029, 499915, 503325]
60140E03325L898N347O606P126P284P315P129P008P364P859P629O472M992L554
60126E92908J951J98j123j644j685j701j714j520j109n95m0M67O96M23m13j568
60110E83531k489k671k200j783k015k801l673m310m512m089l203k492k382k481
60096E42430k076j019L17J631K831L771M347M682M859M710M236L911M128M631
60082E83389M903M816M404L489K088Q52L24L7r14k583m211n364o344p486q760
60067E68640j0007j0919j0926r817q367p594p447p016o042n276n202n339n156
60054D69532m856m761m583l821k473r05N59J601J909J735K013L400N324O458O129
60039D77261M963M150M267M883N143M611L541K355J167p3j243k130k717l161l604
$$ y = [503325, 507223, 512570, 519176, 526302, 533586, 540901, 548030, 555038, 562402, 570261, 577890, 584362, 589354, 592908, 594859, 595057, 593934, 592290, 590605, 588904, 587190, 585670, 584561, 583966, 583926, 584393, 585089, 585512, 585099, 583531, 581042, 578371, 576171, 574388, 572373, 569572, 565899, 561589, 557077, 552988, 549785, 547293, 544911, 542430, 540354, 539335, 539652, 541283, 544114, 547885, 552232, 556914, 561773, 566483, 570719, 574630, 578758, 583389, 588292, 593108, 597512, 601001, 603089, 603941, 604265, 604302, 603388, 600805, 596594, 591230, 584886, 577400, 568640, 558633, 547714, 536788, 526971, 518604, 511010, 503563, 496547, 490505, 485229, 480027, 474688, 469532, 464676, 459915, 455332, 451511, 449038, 448133, 448692, 450293, 452202, 453937, 455950, 459350, 464674, 471132, 477261, 482224, 486374, 490641, 495524, 500667, 505278, 508819, 511174, 512341, 512268, 511025, 508895, 506178, 503017, 499413]
60024D99413m174n001n922o428o255n770n442n191m765m464m830n661o004n231
60010D24275l731k433j998k467l269l599l125k321j809j533j009j37O95J255J580
59995D00374J591J137N10L07O99J280J684J962K335K888L519L901L682L053K725
59980D31647K912K788J600j31j366k075k936l841l941l111k126j335l58O61Q86
59965D19274K49j69K39Q38J124J621K593L136K607J892J996K357J850P10ll43
59949D39971j244k551k964k132j341j615k299k260j574j175j438j871k042k087
59935D13378k247k375k094j369o52l71l54n6O31J196J349J563K357L453M230M744
59919D23383N540O596P230P182P003P086O979O124M762L556K683J930J421J554
$$ y = [499413, 495239, 490238, 484316, 477888, 471633, 465863, 460421, 455230, 450465, 446001, 441171, 435510, 429506, 424275, 420544, 418111, 416113, 413646, 410377, 406778, 403653, 401332, 399523, 397990, 396981, 396844, 397539, 398794, 400374, 401965, 403102, 403612, 403919, 404618, 405898, 407582, 409544, 411879, 414767, 418286, 422187, 425869, 428922, 431647, 434559, 437347, 438947, 438816, 437450, 435375, 432439, 428598, 424657, 421546, 419420, 418085, 417727, 418388, 419274, 419523, 419354, 419593, 420431, 421555, 423176, 425769, 428905, 431512, 433404, 435400, 437757, 439607, 440317, 440314, 439971, 438727, 436176, 433212, 431080, 429739, 428124, 425825, 423565, 421991, 420816, 419378, 417507, 415465, 413378, 411131, 408756, 406662, 405293, 404641, 404270, 403916, 403860, 404491, 405687, 407036, 408599, 410956, 414409, 418639, 423383, 428923, 435519, 442749, 449931, 456934, 464020, 470999, 477123, 481885, 485441, 488124, 490054, 491475, 493029]
59905D93029K221K718K640K337K261K307K193K048K086J946J057l32j202j028
59891E14281m10q8KL02P74J140J535K182K718K645K318K562L341L701L273K842
59875E43118L063L390K948J843Q86L84n4p21j456j975k134j878j288o59k37O7
59859E45297M67R80J527K137K807L342L642L994M683N465N803N518M903M199L328
59844E98092K163P98m58j269j474j311j381k158l523m921n969o748p562q496r181
59829E46602q980p556n386l560k854l072l428l436l228l091l017k751k168j486
59815D92589j076j103j368j562j651j835k181k493k566k419k160j804j294o42
59801D68435pK97K3o79j283j456j430j561j717j553j200j129j337j291q44n24
$$ y = [493029, 495250, 497968, 500608, 502945, 505206, 507513, 509706, 511754, 513840, 515786, 516843, 516511, 515309, 514281, 513871, 513783, 513785, 514087, 514861, 516001, 517536, 519718, 522436, 525081, 527399, 529961, 533302, 537003, 540276, 543118, 546181, 549571, 552519, 554362, 555248, 555632, 555578, 554857, 553401, 551426, 549292, 547414, 546126, 545467, 545230, 545297, 545764, 546744, 548271, 550408, 553215, 556557, 560199, 564193, 568876, 574341, 580144, 585662, 590565, 594764, 598092, 600255, 601053, 600595, 599326, 597852, 596541, 595160, 593002, 589479, 584558, 578589, 571841, 564279, 555783, 546602, 537622, 530066, 524680, 521120, 518266, 515194, 511766, 508330, 505102, 502011, 498994, 496243, 494075, 492589, 491513, 490410, 489042, 487480, 485829, 483994, 481813, 479320, 476754, 474335, 472175, 470371, 469077, 468435, 468428, 468725, 468748, 468069, 466786, 465330, 463900, 462339, 460622, 459069, 457869, 456740, 455403, 454112, 453268, 452744]
59785D52744p03j018j023r07j067j375j428j250j214j375j403j097n94p1M76J051
59769D39746J531J727J541J085P42R84J921L143M120M613M665M416M094M022M354
59754D82704M924N495O068O810P674Q271Q137P214O042N351N363N627N654N440
59740E70774N160M707L963L215K764K290J274q2j027j313j358j395j278j226j838
59725E84630l057l884l581k536j636j405j977l215m391m588l845l191l146l024
59711E41154k281j558j533j664j101j67K62L43R59K019K387J572M77K16R32K031
59695E44048K914L234K904K116J111J6r94j599j786j951k184j942r85j54l77j302
59679E43069j800j602j462j838k371k709l001l443l977m528m923m620l310j714
$$ y = [452744, 452041, 451023, 450000, 449093, 448026, 446651, 445223, 443973, 442759, 441384, 439981, 438884, 438290, 438219, 438695, 439746, 441277, 443004, 444545, 445630, 446372, 447356, 449277, 452420, 456540, 461153, 465818, 470234, 474328, 478350, 482704, 487628, 493123, 499191, 506001, 513675, 521946, 530083, 537297, 543339, 548690, 554053, 559680, 565334, 570774, 575934, 580641, 584604, 587819, 590583, 592873, 594147, 594065, 593038, 591725, 590367, 588972, 587694, 586468, 584630, 581573, 577689, 574108, 571572, 569936, 568531, 566554, 563339, 558948, 554360, 550515, 547324, 544178, 541154, 538873, 537315, 535782, 534118, 533017, 532850, 533112, 533455, 534414, 536433, 538820, 540392, 540869, 541085, 542017, 544048, 546962, 550196, 553100, 555216, 556327, 556343, 555349, 553750, 551964, 550013, 547829, 545887, 544902, 544748, 544371, 543069, 541269, 539667, 538205, 536367, 533996, 531287, 528286, 524843, 520866, 516338, 511415, 506795, 503485, 501771]
59665E01771r78j266j694j743j799k139k288j749o88M44J387J919J887J609J696
59650D96369K166K384K018J448R94M67k43q41j230j819k780l559l621l164k673
59635D85916k233j731j271r79p45n68p28j281j801k005k183k568k800k531k176
59620D60316k405l132l631l527l155k960l023l194l283l058k319j111K71J408
59606D27197J937J741J148O98O48Q57J191J688K238K470K259K007K062K152J749
59591D52042R00L08N82J578K471K472J582N69P8j43p53j692k224k128k127k743
59575D50772l408l337k749k492k739k832k353j659j254j204j282j304j152q02
59561D22205m70m09n13l78J35O81Q69P39O55R32J568K257K653K769L084M011N273
$$ y = [501771, 500793, 499527, 497833, 496090, 494291, 492152, 489864, 488115, 487427, 487871, 489258, 491177, 493064, 494673, 496369, 498535, 500919, 502937, 504385, 505379, 505846, 505603, 504762, 503532, 501713, 498933, 495374, 491753, 488589, 485916, 483683, 481952, 480681, 479702, 478957, 478389, 477661, 476380, 474579, 472574, 470391, 467823, 465023, 462492, 460316, 457911, 454779, 451148, 447621, 444466, 441506, 438483, 435289, 432006, 428948, 426629, 425518, 425789, 427197, 429134, 430875, 432023, 432721, 433369, 434226, 435417, 437105, 439343, 441813, 444072, 446079, 448141, 450293, 452042, 452942, 453250, 453832, 455410, 457881, 460353, 461935, 462504, 462582, 462439, 461686, 459994, 457770, 455642, 453515, 450772, 447364, 444027, 441278, 438786, 436047, 433215, 430862, 429203, 427949, 426745, 425463, 424159, 423007, 422205, 421735, 421326, 420813, 420435, 420570, 421251, 422120, 422859, 423514, 424446, 426014, 428271, 430924, 433693, 436777, 440788, 446061]
59544D46061O145O333O366O982Q399J0388J2750J5286J7407J8123J6645J2897
59532E83782P520J594l609p032q322p916o519m568k299j38J422K311K937L557
59518E62720L841L257J688m26k438l898m779n478o419p512q190q154p816p766
59504E08630p947p721o694n227m050l623l743l678k824j406l96n12j409k103k034
59489D55263j411o69KN73J035J420J769J981J882J469J025R90J769L373N082N817
59473D81370N162L869K929K445J795O92m95j322j621j290m00N00Q44R19J634L186
59457E00217M605N027M873N271O631Q286R352R535R139Q602Q045P174N741M088
59443E96586K871K063O18k324o062q680q985p700o518o243o284n847n001m309
$$ y = [446061, 452206, 458539, 464905, 471887, 480286, 490674, 503424, 518710, 536117, 554240, 570885, 583782, 591302, 592896, 589287, 582255, 573933, 566017, 559498, 554930, 552631, 552493, 553915, 556226, 559163, 562720, 566561, 569818, 571506, 571080, 568642, 564744, 559965, 554487, 548068, 540556, 532366, 524212, 516396, 508630, 500683, 492962, 486268, 481041, 476991, 473368, 469625, 465947, 463123, 461717, 461321, 460809, 459400, 457297, 455263, 453852, 453183, 453185, 453758, 454793, 456213, 457982, 459963, 461845, 463314, 464339, 465329, 467098, 470471, 475553, 481370, 486532, 490401, 493330, 495775, 497570, 498262, 497767, 496445, 494824, 493534, 493134, 493634, 494478, 495397, 497031, 500217, 504822, 509849, 514722, 519993, 526624, 534910, 544262, 553797, 562936, 571538, 579583, 586757, 592498, 596586, 599457, 601520, 602138, 599814, 593752, 585072, 576087, 568387, 561869, 555626, 549342, 543495, 538494, 534185]
59429E34185l842l179k192j215m13M76J663L103M956P571J0711J3432J5231J6744
59415E97231J8760K1075K3034K4644K6082K6387K3718J7194P978j552r171j3644
59403G61736j5012j4199j1848p704j725M438Q082P594L318l480j1377j8445k2599
59390F78779k3109k1206j8625j6144j3844j1948j0631r463p832n765l836k432
59378E33944j433n20M33J186J317Q38M96J078K379L383L478L041K812L192M156
59363E59780N234N535M548K989K227K741L831M787N496N836N586N246N875P640
59349F27351R466J0584J1435J2535J3508J3959J4298J4795J4738J3500J1662J0063
59337G77894Q484O322L840J608p34l821p091r325j0455j1508j2779j3382j2878
$$ y = [534185, 530343, 527164, 524972, 523757, 523344, 523820, 525483, 528586, 533542, 541113, 551824, 565256, 580487, 597231, 615991, 637066, 660100, 684744, 710826, 737213, 760931, 778125, 786103, 784551, 775380, 761736, 746724, 732525, 720677, 712973, 711248, 715686, 723768, 731362, 734680, 731200, 719823, 701378, 678779, 655670, 634464, 615839, 599695, 585851, 573903, 563272, 553809, 545977, 540212, 536376, 533944, 532511, 531991, 532424, 533610, 534927, 535765, 536261, 537339, 539718, 543101, 546579, 549620, 552432, 555624, 559780, 565014, 570549, 575097, 578086, 580313, 583054, 586885, 591672, 597168, 603004, 608590, 613836, 619711, 627351, 636817, 647401, 658836, 671371, 684879, 698838, 713136, 727931, 742669, 756169, 767831, 777894, 786378, 792700, 796540, 798148, 797414, 793593, 786502, 777177, 766722, 755214, 742435, 729053, 716175]
59324G16175j2088j1817j1696j0882r361p909p141o863o322m943k993j406p95
59311F21959q00o67j04P94K060L690N296O566P819R328J0426R984P687M043o11
59296F87470o117j1543j5387j7019j7150j6554j5173j2901j0376q359o853n519
59284E44519m439l828l307k230o70N91J177J656K712M167N281N841O462P644Q970
59269E74546R602R384Q919Q654Q427Q061P742P418O372M007Q19j975l599m191
59255F44186m295m432n047o155p082p012n992m893m270l650k335n38P14Q24M09
59240E90432N70J552K537K833K835L351M320M899M748M440M391M161L241J913
59226F36223P60k11j300k368l021l345l816m566n257n680n960o156o090n629m921
$$ y = [716175, 704087, 692270, 680574, 669692, 660331, 652422, 645281, 638418, 632096, 627153, 624160, 622754, 621959, 621159, 620492, 620388, 621182, 623242, 626932, 632228, 638794, 646613, 655941, 666367, 676351, 684038, 688081, 687470, 681353, 669810, 654423, 637404, 620254, 603700, 588527, 575626, 565250, 556891, 550038, 544519, 540080, 536252, 532945, 530715, 530045, 530636, 531813, 533469, 536181, 540348, 545629, 551470, 557932, 565576, 574546, 584148, 593532, 602451, 611105, 619532, 627593, 635335, 642753, 649125, 653132, 653951, 651976, 648377, 644186, 639891, 635459, 630412, 624257, 617175, 610163, 604171, 599278, 595008, 591358, 589023, 588485, 589199, 590023, 590432, 591002, 592554, 595091, 597924, 600759, 604110, 608430, 613329, 618077, 622517, 626908, 631069, 634310, 636223, 636983, 636772, 635472, 633104, 630083, 626738, 622922, 618356, 613099, 607419, 601459, 595303, 589213, 583584, 578663]
59211E78663m267l964m102m413m383l799k989k441k319k464k623k527k075j537
59197E34760j241j047n79l6r3p66j152o89N7L65M26Q00J425J893K201K517K645
59180E41486K479K523L154L767L498K558J946K171K991M216N780P179P776P709
59166E99233P734Q088Q257P920P409P082O833O319N269L568J419o29k287l933
59152F62282n957p930r020r105q808q587q381q075p758p522p487p802q232q067
59138E49551p059o086o187p151p778p317n993m366k919j976j365l60J254K515
59124D94763K536K019K467M116N834O931P798Q726R304R325R232R386R659J0009
59110E92105J0593J1146J1100J0500J0032R981R967R770R535R041P745N794M060
$$ y = [578663, 574396, 570432, 566330, 561917, 557534, 553735, 550746, 548305, 545986, 543522, 540899, 538372, 536297, 534760, 533519, 532472, 531893, 531857, 531764, 530998, 529846, 529157, 529214, 529579, 530005, 530805, 532230, 534123, 536324, 538841, 541486, 543965, 546488, 549642, 553409, 556907, 559465, 561411, 563582, 566573, 570789, 576569, 583748, 591524, 599233, 606967, 615055, 623312, 631232, 638641, 645723, 652556, 658875, 664144, 667712, 669131, 668502, 666215, 662282, 656325, 648395, 639375, 630270, 621462, 612875, 604494, 596419, 588661, 581139, 573652, 565850, 557618, 549551, 542492, 536406, 530219, 523068, 515290, 507973, 501980, 497614, 494695, 492719, 491354, 490994, 492248, 494763, 497299, 499318, 501785, 505901, 511735, 518666, 526464, 535190, 544494, 553819, 563051, 572437, 582096, 592105, 602698, 613844, 624944, 635444, 645476, 655457, 665424, 675194, 684729, 693770, 701515, 707309, 711369]
59097G11369K944J979Q36j71q48j417j868j879j647j830k412k615k263k216k980
59082F94982l919m429m969o193p863r269j0079j0233r646q557p611p104o685o186
59068E92239o010o259o251n493m471l884l736l712l885m385m865m866m409l754
59054E26259l058k514k355k398k117j553j476k222l041l048k284j323m25M00J048
59039D99893J557K221L040L515L451L436M076N155N998O221N845N161M835N562
59025E59966P275R213J0975J2866J4892J6318J6729J6729J6977J7147J6465J4652
59013G30204J1772P823L216r47l763n375o413p054p147o680n597l680j262O14
58999G05711J364J670K378L145K954J593j44j454k044j976j660j832k918m535
$$ y = [711369, 714313, 716292, 717128, 716957, 716109, 714692, 712824, 710945, 709298, 707468, 705056, 702441, 700178, 697962, 694982, 691063, 686634, 681665, 675472, 667609, 658340, 648261, 638028, 628382, 619825, 612214, 605110, 598425, 592239, 586229, 579970, 573719, 568226, 563755, 559871, 556135, 552423, 548538, 544153, 539288, 534422, 530013, 526259, 523201, 520687, 518332, 515934, 513817, 512264, 510788, 508566, 505525, 502477, 500193, 498870, 498445, 498845, 499893, 501450, 503671, 506711, 510226, 513677, 517113, 521189, 526344, 532342, 538563, 544408, 549569, 554404, 559966, 567241, 576454, 587429, 600295, 615187, 631505, 648234, 664963, 681940, 699087, 715552, 730204, 741976, 749799, 753015, 752068, 748305, 742930, 736517, 729463, 722316, 715636, 710039, 706359, 705097, 705711, 707075, 708745, 711123, 714268, 717222, 718815, 718671, 717217, 715173, 713197, 711537, 709705, 706787, 702252]
58985G02252o026p145p933q355q433q381q148p356o006m714l706k302l1K335L621
58970F29672L665L262L095L378M099M950N370N287N405O194O993O838N704M304
58956F98216L040J860P61k87j658l572n658p515r311j1124j2247j1980j0751r579
58942F20195q628p314n606m243l631l346k961k592k415k239j831j348j171j409
58928E71461j647j231m4R89O72r96k627l047k594k400k863l394l355k757k104
58913E44063j932k247k289j249O08K127K778L286M458O058P389Q294R054R806
58899E90204J0529J1075J0954R711P896O783O808P168P406Q238J0117J2211J3709
58886G12809J5010J6558J7606J7378J6455J5650J4396J1812Q585O129M371K064
$$ y = [702252, 696226, 689081, 681148, 672793, 664360, 655979, 647831, 640475, 634469, 629755, 626049, 623747, 623716, 626051, 629672, 633337, 636599, 639694, 643072, 647171, 652121, 657491, 662778, 668183, 674377, 681370, 688208, 693912, 698216, 701256, 703116, 703877, 703590, 701932, 698360, 692702, 685187, 675876, 664752, 652505, 640525, 629774, 620195, 611567, 604253, 598647, 594404, 590773, 587427, 584466, 581874, 579459, 577220, 575389, 574041, 572870, 571461, 569814, 568583, 568539, 569528, 570200, 569204, 566577, 563530, 560936, 558536, 555673, 552279, 548924, 546167, 544063, 542131, 539884, 537595, 536346, 536954, 539081, 541859, 545145, 549603, 555661, 563050, 571344, 580398, 590204, 600733, 611808, 622762, 632473, 640369, 647152, 653960, 661128, 668534, 676772, 686889, 699100, 712809, 727819, 744377, 761983, 779361, 795816, 811466, 825862, 837674, 846259, 852388, 856759, 858823]
58874H58823j052m051o577r090j1380j2506j2410j2074j1860j1047r336p501o122
58861G43817m893l690l186l828n092o323p521q823r932j0518j0646j0344r400
58848F49621p896o473n639n179m629m053m031m968o510p704p936p646p772q366
58834E60819q465p614o679o523o665o121m975m072l564k880j827q01m0M24L17
58819E01334n20j498j856j606j131k56J298K849L292K597J739J305J091R42R86
58804E10566J088J025J023J292J305N48k99j61P65J278R60M26n8p96j497j330
58788E16135m02J75j6j14M76J238J685K257L435M837N772O041N836N420N136N099
58772E63010M730L273Q66j541l329m526n091m875m247l839l596l003k233k041
$$ y = [858823, 857771, 853720, 847143, 838053, 826673, 814167, 801757, 789683, 777823, 766776, 757440, 749939, 743817, 738924, 735234, 732048, 728220, 723128, 716805, 709284, 700461, 690529, 680011, 669365, 659021, 649621, 641725, 635252, 629613, 624434, 619805, 615752, 611721, 606753, 600243, 592539, 584603, 576957, 569185, 560819, 552354, 544740, 538061, 531538, 524873, 518752, 513777, 509705, 506141, 503261, 501434, 500633, 500593, 501017, 501334, 500814, 499316, 497460, 495854, 494723, 494467, 495765, 498614, 501906, 504503, 506242, 507547, 508638, 509580, 510566, 511654, 512679, 513702, 514994, 516299, 516847, 516548, 516387, 517152, 518430, 519390, 519816, 519758, 518962, 517465, 516135, 515733, 515908, 515892, 515778, 516254, 517492, 519177, 521434, 524869, 529706, 535478, 541519, 547355, 552775, 557911, 563010, 567740, 571013, 571879, 570338, 567009, 562483, 557392, 552517, 548270, 544431, 540835, 537832, 535599, 533558]
58758E33558k445k571j957r84Q8J432K830L647L928M390N049M931L659K213J576
58743E59344J529J450J546K475M163N659O116N742N777P253R624J1149J1052J0546
58729F43425J0927J1605J1328J0548J0724J1550J0951Q167N029L512L483L695
58717G44944L771M227N275O488P283P369O988O662O380N344L180Q66n93j853m287
58702H02044p788j0962j3258j5313j7319j8753j9767k1090k2389k2385k0833j8760
58690E93427j6581j3785j0744q893q584q552q038p647p558o900n623m978n206
58677D80338m721k752q43m26o08Q7J401K339L149M549O111P012P550Q505R678
58662E21369J0416J0753J0854J0041P713M557J772l33k009l082l379l409l662
$$ y = [533558, 531113, 528542, 526585, 525601, 525689, 527121, 529951, 533598, 537526, 541916, 546965, 551896, 555555, 557768, 559344, 560873, 562323, 563869, 566344, 570507, 576166, 582282, 588024, 593801, 601054, 610678, 621827, 632879, 643425, 654352, 665957, 677285, 687833, 698557, 710107, 721058, 729225, 734254, 737766, 741249, 744944, 748715, 752942, 758217, 764705, 771988, 779357, 786345, 793007, 799387, 804731, 807911, 808777, 808184, 806331, 802044, 794256, 783294, 770036, 754723, 737404, 718651, 698884, 677794, 655405, 633020, 612187, 593427, 576846, 563061, 552317, 543424, 534840, 526288, 518250, 510603, 503045, 496145, 490522, 485544, 480338, 475617, 472865, 472022, 471596, 470988, 471075, 472476, 474815, 477964, 482513, 488624, 495636, 503186, 511691, 521369, 531785, 542538, 553392, 563433, 571146, 575703, 577475, 577142, 575133, 572051, 568672, 565263, 561601]
58649E61601l837l602l422l722m030l830l533l662l844l551l119l092l144k566
58635E12647j328N6J177J751J631J294J483K033J973J131M64L92K22j75K25J701
58619E26677K814K486J637J589K199K785L568M774N587N398N027N253N238L892
58605E78924J785K29o11j233j401q11l08p90j658j891j867k503l284k975j774
58590E59832r83p90p3J658L554M752N296N667O356P719R490J0733J0927J0619
58576F34757J0401J0036R299Q817R025R278R028R029J0173J1980J3504J5020J7458
58563G77805K0780K4092K6882K9035L0303L0685L0699L0356K8710K5369K1394
58552A076110J7671J3613Q697M046Q30j715n026q868j2010j4352j6642j8767k0156
$$ y = [561601, 557764, 554162, 550740, 547018, 542988, 539158, 535625, 531963, 528119, 524568, 521449, 518357, 515213, 512647, 511319, 511375, 512552, 514303, 515934, 517228, 518711, 520744, 522717, 523848, 524312, 524704, 524926, 524751, 524976, 526677, 529491, 531977, 533614, 535203, 537402, 540187, 543755, 548529, 554116, 559514, 564541, 569794, 575032, 578924, 580709, 580938, 580327, 579094, 577693, 576882, 576574, 575784, 574126, 572235, 570368, 567865, 564581, 561606, 559832, 558849, 558059, 557986, 559644, 563198, 567950, 573246, 578913, 585269, 592988, 602478, 613211, 624138, 634757, 645158, 655194, 664493, 673310, 682335, 691613, 700641, 709670, 719843, 731823, 745327, 760347, 777805, 798585, 822677, 849559, 878594, 908897, 939582, 970281, 1000637, 1029347, 1054716, 1076110, 1093781, 1107394, 1116091, 1120137, 1120967, 1119252, 1114226, 1105358, 1093348, 1078996, 1062354, 1043587, 1023431]
58539A023431k1261k2921k4704k5471k5199k4699k4064k2830k1133j9275j6796
58528G75078j3426j0204q230p039n709m550m062l349j575K7j81j425j741j283
58514G12331j831l377l949k915j917k082k670k928l272l885m033l434k889k860
58500F70289k754k044j047k18K85K59l37q61o40K1M28P38J551K731L829N059O680
58483F83969Q022Q551R185J1032J3524J5370J6659J8200J9489J9287J7691J5706
58471H56685J3264R631N287J433k001n716r067j0845j1619j2834j3925j2900r752
58458G97641o756n131l820j834M86K942N866Q587R624Q945Q050P379N684K472
58444H40135r52l452n240o554o931o383n725n198m257k948j901q20J284M199O594
$$ y = [1023431, 1002170, 979249, 954545, 929074, 903875, 879176, 855112, 832282, 811149, 791874, 775078, 761652, 751448, 743218, 736179, 730470, 725920, 721858, 718509, 716934, 716961, 716780, 715355, 713614, 712331, 710500, 707123, 703174, 700259, 698342, 696260, 693590, 690662, 687390, 683505, 679472, 676038, 673149, 670289, 667535, 665491, 664444, 664226, 664511, 664770, 664433, 663572, 662932, 662953, 663381, 664119, 665670, 668401, 672230, 677289, 683969, 691991, 700542, 709727, 720759, 734283, 749653, 766312, 784512, 804001, 823288, 840979, 856685, 869949, 879580, 884867, 886300, 884299, 878583, 869516, 858671, 847052, 834218, 820293, 807393, 797641, 790885, 785754, 781934, 780100, 780586, 783528, 789394, 797981, 807605, 816550, 824600, 831979, 837663, 840135, 839183, 835731, 830491, 823937, 817006, 810623, 804898, 799700, 795443, 792495, 790594, 789774, 791058, 795257, 801851]
58429H01851Q201J0127J2807J5343J7070J7989J7548J4901J0609O299K502j347
58417I33900m893o958p742q788j0437j1483j1533j1570j1801j1261r968r252r372
58404H08842q980p526o101n246m051k175p10k42Q4Q28J401J596K185L346M078
58389G87329L797K984J938N79m04M4J536K676L398M910P267R150J0148J1004J1412
58374H57768J0010O978M287K858J707L42l09J14P78J505L043N053O112O217O982
58359I13445Q838J0369J0846J1060J1187J0282Q384O798N735M117K062J139J699
58346A005961K490L257N022P449Q729Q660Q995J0265J1065J1091J1841J3649J4919
58333A123393J5106J5485J6325J6190J4855J3921J3832J3177J1624J0497R846
$$ y = [801851, 810052, 820179, 832986, 848329, 865399, 883388, 900936, 915837, 926446, 932745, 935247, 933900, 929007, 922049, 914307, 905519, 895082, 883599, 872066, 860496, 848695, 837434, 827466, 818214, 808842, 799862, 792336, 786235, 780989, 776938, 774763, 774053, 773811, 773895, 774723, 776124, 777720, 779905, 783251, 787329, 791126, 794110, 796048, 796627, 796223, 796267, 797803, 800479, 803877, 808787, 816054, 825204, 835352, 846356, 857768, 867778, 874756, 879043, 881901, 883608, 883950, 883641, 883755, 884533, 886038, 889081, 894134, 900246, 906463, 913445, 922283, 932652, 943498, 954558, 965745, 976027, 984411, 991209, 996944, 1001061, 1003123, 1004262, 1005961, 1008451, 1011708, 1016730, 1024179, 1032908, 1041568, 1050563, 1060828, 1071893, 1082984, 1094825, 1108474, 1123393, 1138499, 1153984, 1170309, 1186499, 1201354, 1215275, 1229107, 1242284, 1253908, 1264405, 1274251]
58322A274251Q175N686M480M834M697L561L312M441N085M750N334P420R251J0353
58308A355630J2324J5055J6104J5039J4434J5355J5880J5291J5468J6837J7238
58297A524655J6263J6280J7718J7916J6320J6038J8361K0447K0584K0926K2817
58286A728325K4169K3864K4115K6002K7310K7206K8235L1254L3247L2803L2750
58275B039280L4781L6601L7178L9303M3864M7059M6808M6574M9204N2318N3528
58264B526498N4914N8388O1804O3598O6156P0641P3732P3426P2820P4177P4709
58253C270863P2342P0105P0548P1474P1363P3138P8254Q3116Q5757Q9780R7272
58242D134012J04502J09280J15580J25815J35839J42872J50927J62810J74587
$$ y = [1274251, 1282426, 1288112, 1292592, 1297426, 1302123, 1305684, 1308996, 1313437, 1318522, 1323272, 1328606, 1336026, 1345277, 1355630, 1367954, 1383009, 1399113, 1414152, 1428586, 1443941, 1459821, 1475112, 1490580, 1507417, 1524655, 1540918, 1557198, 1574916, 1592832, 1609152, 1625190, 1643551, 1663998, 1684582, 1705508, 1728325, 1752494, 1776358, 1800473, 1826475, 1853785, 1880991, 1909226, 1940480, 1973727, 2006530, 2039280, 2074061, 2110662, 2147840, 2187143, 2231007, 2278066, 2324874, 2371448, 2420652, 2472970, 2526498, 2581412, 2639800, 2701604, 2765202, 2831358, 2901999, 2975731, 3049157, 3121977, 3196154, 3270863, 3343205, 3413310, 3483858, 3555332, 3626695, 3699833, 3778087, 3861203, 3946960, 4036740, 4134012, 4238514, 4347794, 4463374, 4589189, 4725028, 4867900, 5018827, 5181637, 5356224]
58233E356224J83782J94980K11060K27324K40838K56746K78340L00221L18894
58224G568409L40433L69545M00979M30539M64166N06762N52915N98854O52351
58215A1884953P19761P94974Q73038R62716J073084J200454J342194J510127J715834
58206B2077135J957314K236391K574287K992732L496243M091600M805119N657374
58198D9888195O641195P752764R027637J0522001J2284745J4378989J6894899
58191A27390425J9887923K3320195K7084219L0984565L4538995L6788657L6478193
58184C36473172L2602826K4889236J3906368R40772j2184741k3474993l1401315
58177C41751325l5460247l6173140l4562206l1614714k8077877k4469811k1094100
$$ y = [5356224, 5540006, 5734986, 5946046, 6173370, 6414208, 6670954, 6949294, 7249515, 7568409, 7908842, 8278387, 8679366, 9109905, 9574071, 10080833, 10633748, 11232602, 11884953, 12604714, 13399688, 14272726, 15235442, 16308526, 17508980, 18851174, 20361301, 22077135, 24034449, 26270840, 28845127, 31837859, 35334102, 39425702, 44230821, 49888195, 56529390, 64282154, 73309791, 83831792, 96116537, 110495526, 127390425, 147278348, 170598543, 197682762, 228667327, 263206322, 299994979, 336473172, 369075998, 393965234, 407871602, 408812374, 396627633, 373152640, 341751325, 306291078, 270117938, 235555732, 203941018, 175863141, 151393330, 130299230]
58170A30299230j8059909j5372534j3025866j1012197r297487p838270o610459
58163D9082508n595582m756949m054955l471202k995999k606565k277701k000984
58155B1322571j774450j584693j416136j267296j141714j032330r29515q35251
58147A1341186p55095o84492o16195n53203n01664m58440m17494l81431l55035
58138F618137l34087l11677k89387k71862k56439k38491k21056k09054j99356
58129D286728j86314j71983j61456j53047j42401j31548j24748j19642j11578
58120B984011j02658r7700r4886q9098q1345p6432p4143p0697o6432o4460o3858
58109B102302o1358n7624n5348n3412m9335m5095m4147m4973m3701m0863l9541
$$ y = [130299230, 112239321, 96866787, 83840921, 72828724, 63531237, 55692967, 49082508, 43486926, 38729977, 34675022, 31203820, 28207821, 25601256, 23323555, 21322571, 19548121, 17963428, 16547292, 15279996, 14138282, 13105952, 12176437, 11341186, 10586091, 9901599, 9285404, 8732201, 8230537, 7772097, 7354603, 6973172, 6618137, 6284050, 5972373, 5682986, 5411124, 5154685, 4916194, 4695138, 4486084, 4286728, 4100414, 3928431, 3766975, 3613928, 3471527, 3339979, 3215231, 3095589, 2984011, 2881353, 2783653, 2688767, 2599669, 2518324, 2441892, 2367749, 2297052, 2230620, 2166160, 2102302, 2040944, 1983320, 1927972, 1874560, 1825225, 1780130, 1735983, 1691010, 1647309, 1606446, 1566905]
58098A566905l9169l7193l4646l4092l4098l1554k7626k5666k5146k3227k0445
58087A234043j9339j9107j7150j4369j3691j4714j4855j4360j5261j6829j6933
58076A057435j6431j7537j9305j9394j8757j9758k1238k0323j7736j6506j6619
58065H53831j5740j4041j3625j4039j2998j0742r437r055q074p206q248j0182
58053G20444j0631j0153j0963j2359j1807r669q536q562p720o062n604o336o400
58040F05642n764n951o601o106n088n464o654o468n242n248o524p130p029p825
58026E18548r017q488o564n710o279o261n224m756m988m337k923k682l787m285
58012D43247l558l014l109k810k143k264k897k666j837j769j886l84K117L063
$$ y = [1566905, 1527736, 1490543, 1455897, 1421805, 1387707, 1356153, 1328527, 1302861, 1277715, 1254488, 1234043, 1214704, 1195597, 1178447, 1164078, 1150387, 1135673, 1120818, 1106458, 1091197, 1074368, 1057435, 1041004, 1023467, 1004162, 984768, 966011, 946253, 925015, 904692, 886956, 870450, 853831, 838091, 824050, 810425, 796386, 783388, 772646, 763209, 754154, 746080, 738874, 730626, 720444, 709813, 699660, 688697, 676338, 664531, 654862, 646326, 637764, 630044, 623982, 618378, 612042, 605642, 599878, 593927, 587326, 581220, 576132, 570668, 564014, 557546, 552304, 547056, 540532, 533402, 526373, 518548, 509531, 501043, 494479, 488769, 482490, 476229, 471005, 466249, 461261, 456924, 454001, 451319, 447532, 443247, 439689, 436675, 433566, 430756, 428613, 426349, 423452, 420786, 418949, 417180, 415294, 414910, 417027, 420090]
57998D20090K130J566K171K318J319M76K09p26k436l283k703j975j667r61k9l67
57982D16132k172l876m725n419n903n162l617l076l806m177l623l430m040m122
57968C58984l096k203k254k427j937j111l23M13O35k1n65J33J176Q14n74j114
57952C46530p38j095k261k476j369n80p31m99O76J588J636J847K839L994N171
57937C54532O964Q880R510Q959Q795R222Q803P249N962N211L475L69k352l638
57923D31941m626o303p931q696q902q670p475n783n057n436n421m455l684l478
57909C46024k611p46N45L61n3M64J271J464J289J066M23m62o24q5p0p60p31N77
57891C47342J769J767J288J183J041M43j79o31j329j983j743j095j587l157l992
$$ y = [420090, 422220, 423786, 425957, 428275, 429594, 430070, 430279, 429553, 427117, 423834, 421131, 419156, 417489, 416528, 416499, 416132, 413960, 410084, 405359, 399940, 394037, 388875, 385258, 382182, 378376, 374199, 370576, 367146, 363106, 358984, 355888, 353685, 351431, 349004, 347067, 345956, 345633, 346046, 346681, 346660, 346095, 346228, 347404, 348218, 347644, 346530, 345792, 344697, 342436, 339960, 338591, 338011, 337280, 336781, 337457, 339045, 340681, 342528, 345367, 349361, 354532, 361496, 370376, 379886, 388845, 397640, 406862, 415665, 422914, 428876, 434087, 437562, 437931, 435579, 431941, 427315, 421012, 413081, 404385, 395483, 386813, 379338, 373555, 368498, 363062, 357641, 353186, 349502, 346024, 343413, 342667, 343212, 343573, 343520, 343984, 345255, 346719, 348008, 349074, 349497, 349035, 348411, 348326, 348256, 347496, 346765, 347342, 349111, 350878, 352166, 353349, 354390, 354833, 354654, 354023, 352694, 350711, 348968, 347873, 346286, 343129, 339137]
57876C39137l605l665m855n548m748l879m197m714m273l525l231k573q34J023
57862B90513K065K972M360N306N143N001N878O838O847O783P739Q782Q396O939
57848C73562N738M771L142J040n59j543k498l485m303n275o579p468p305o617
57834C42621o134n611m670l837l647l581l001k277j904j373p2J486K399K636K642
57819C15677K454K094J963J999J263p31l093m733n653o377o977p373p657p556
57805B75300o632n428n161n701n350l424j468r65j351j424j230j267j170n55K9
57790B34203K58R41K500L824L954L754M428N471N733N492N913P053P985Q309Q326
57775C08144Q129P692P364P294O873N571L690J695m03k394l575l904m346n429
$$ y = [339137, 335532, 331867, 327012, 321464, 316716, 312837, 308640, 303926, 299653, 296128, 292897, 290324, 289490, 290513, 292578, 295550, 299910, 305216, 310359, 315360, 321238, 328076, 334923, 341706, 349445, 358227, 366623, 373562, 379300, 384071, 387213, 388253, 387694, 386151, 383653, 380168, 375865, 370590, 364011, 356543, 349238, 342621, 336487, 330876, 326206, 322369, 318722, 315141, 312140, 309863, 307959, 306586, 306514, 308000, 310399, 313035, 315677, 318131, 320225, 322188, 324187, 325450, 324719, 321626, 316893, 311240, 304863, 297886, 290513, 282856, 275300, 268668, 263240, 258079, 252378, 247028, 243604, 242136, 241171, 239820, 238396, 237166, 235899, 234729, 234174, 234203, 234461, 235402, 237902, 241726, 245680, 249434, 253862, 259333, 265066, 270558, 276471, 283524, 291509, 299818, 308144, 316273, 323965, 331329, 338623, 345496, 351067, 354757, 356452, 356049, 353655, 350080, 346176, 341830, 336401]
57761C36401o553p282p996q505p809o072n126n764o330n413m049l610l304j863
57747B56725j10L75J4L57J449K212K643L426M085L687K781K631K944K453J284
57732B86956P28R52R93P31R33J443J235L14k25k8K32L80Q67J401J092L0p40r27
57714B96367j223j851k353k733l423m064l830l004k825l583m192l922l205k620
57700B53539k164j791j588j283n73J09N6n31r04j070j640k558l194l508l909m090
57684B24901l347j973j026o41J15J656L383M941O645Q506J0044J1423J3620J7134
57670B95381K1448K6075L1106L6451M1245M4342M4590M0671L1558J7620Q58j5915
57658F15430k9863l8766m2076m1370l8905l5696l1613k6896k2430j8719j5580
$$ y = [336401, 329848, 322566, 314570, 306065, 298256, 292184, 287058, 281294, 274964, 269551, 265502, 261892, 258588, 256725, 256615, 256990, 257004, 257361, 258810, 261022, 263665, 267091, 271176, 274863, 277644, 280275, 283219, 285672, 286956, 287684, 288636, 289629, 290360, 291293, 292736, 293971, 294285, 294060, 294032, 294264, 294644, 295511, 296912, 298004, 298034, 297294, 296367, 295144, 293293, 290940, 288207, 284784, 280720, 276890, 273886, 271061, 267478, 263286, 259364, 256159, 253539, 251375, 249584, 247996, 246713, 246140, 246249, 246305, 245774, 244870, 243800, 242160, 239602, 236408, 232900, 228991, 224901, 221554, 219581, 218555, 217914, 218029, 219685, 223068, 228009, 234654, 243160, 253204, 264627, 278247, 295381, 316829, 342904, 374010, 410461, 451706, 496048, 540638, 581309, 612867, 630487, 631345, 615430, 585567, 546801, 504725, 463355, 424450, 388754, 357141, 330245, 307815, 289096, 273516]
57647B73516j2896j0753q906o970n144l925l242k612j903j247m80M30Q71M29j81
57632B16987o9M20L74m6k2L17P3p60j325j472j936k803l237k832k116j538j079
57615A98936r42j498k447l038l115k972k415j172L5K32j31K81J440J900J128K65
57599A86487J81K43l48j314j944j986j394k61P14P08Kl77l96j082k564l496l028
57582A70145k080j836k128k083j534r63p28r21j445j820j591j140j301k054k475
57567A46046k250k103k379k315j352j48L89L12K27L63O07Q70R95Q03N39O92J215
57550A42511J562J624J793J997J618N67m40r33j122j107o52J2K43Q0K28O72N21
57533A49174l65q61l57K17q3p00n64K40P94O93K48j53k04L48J228J636J226N95
$$ y = [273516, 260620, 249867, 240961, 233991, 228847, 224922, 221680, 219068, 217165, 215918, 215438, 215868, 216739, 217168, 216987, 216918, 217338, 217712, 217666, 217644, 217961, 218034, 217274, 215949, 214477, 212541, 209738, 206501, 203669, 201553, 200015, 198936, 197994, 196496, 194049, 191011, 187896, 184924, 182509, 181337, 181372, 181604, 181473, 181754, 183194, 185094, 186222, 186487, 186668, 186911, 186563, 185249, 183305, 181319, 179925, 179664, 180378, 181086, 181088, 180711, 180315, 179233, 176669, 173173, 170145, 168065, 166229, 164101, 162018, 160484, 159521, 158793, 157872, 156427, 154607, 153016, 151876, 150575, 148521, 146046, 143796, 141693, 139314, 136999, 135647, 135499, 135888, 136200, 136427, 136790, 137397, 138267, 139262, 140065, 140604, 141296, 142511, 144073, 145697, 147490, 149487, 151105, 151672, 151232, 150299, 149177, 148070, 147418, 147430, 147673, 147753, 147981, 148653, 149174, 148809, 147948, 147591, 147808, 147725, 147025, 146461, 146701, 147495, 148188, 148436, 148283, 148079, 148427, 149655, 151291, 152517, 153112]
57515A53112L97N06N35N43P68J127J452J638J377L35r69j301k72R45J013J3r43
57498A60276j159q69p20j186k142k822k568j736j287j427j420r01m85o85j109
57483A39760j198j061j069j195j199r43k56Q66J721J341k09j653j995j514j004
57468A30392p82p64p81m47N01J560J819J221O20M02O2o15j030q56n74m86j92L87
57450A30437N65M5m10j57M85J067J684K188J813M33q03q92k03M23Q20R78M85o13
57432A38345j292r94o58j210j912j491k00N97M32R0J63M13M69K70j27n50o90n53
57414A31102n26o19k64O53J322J247J090J450J702J063P6j76J82J68m07q30p96
57397A36437p24p98p37m80k84j73M1K99M89Q11J404J895J953J832J718J150r3
$$ y = [153112, 153509, 154015, 154550, 155093, 155861, 156988, 158440, 160078, 161455, 161790, 160821, 159520, 159248, 160193, 161206, 161219, 160276, 159117, 158248, 157528, 156342, 154200, 151378, 148810, 147074, 145787, 144360, 142940, 142039, 141554, 140869, 139760, 138562, 137501, 136432, 135237, 134038, 133095, 132839, 133705, 135426, 136767, 136558, 134905, 132910, 131396, 130392, 129610, 128846, 128065, 127618, 128119, 129679, 131498, 132719, 133339, 133741, 133803, 133188, 132158, 131302, 130728, 130242, 130050, 130437, 131002, 131047, 130637, 130480, 130965, 132032, 133716, 135904, 137717, 138150, 137347, 136455, 136252, 136675, 137495, 138473, 138958, 138345, 137053, 136059, 135401, 134191, 132279, 130788, 130588, 131185, 131617, 131707, 131870, 132283, 132752, 133022, 132895, 132345, 131655, 131102, 130576, 129957, 129693, 130346, 131668, 132915, 134005, 135455, 137157, 138220, 138296, 138120, 138302, 138470, 138063, 137233, 136437, 135713, 134915, 134178, 133698, 133414, 133241, 133282, 133581, 134070, 134881, 136285, 138180, 140133, 141965, 143683, 144833, 144740]
57380A44740j062o78O38J464J242O73L70K07J3j9K16N45Q62J141J183Q83N61M93
57362A53472M20K9l82m34m46r50j743k194k187j987j523o31K26M33J94K41O81
57345A43219R66Q41M62k01j173j850j511m22N11J093J827K611K586J555N31L70
57329A51415O94O65J57l49n34m14r3L01N75O84P13O00J28o36j148p91M83K015
57311A54465K916K819K233J950K108K215K090K216K856L475L454K913K275J586
57297A89571Q66P09J662L215M235M345M245M592N211N535N434N336N658O262O555
57282B53431O235N792N857O272O360O052N885N815N046L344J461j40j946m112
57268C05352n647n784n173m661l887k282o88m09j195j585j048m05k25j06K83O17
$$ y = [144740, 143678, 143000, 143638, 145102, 146344, 147017, 147387, 147594, 147607, 147588, 147804, 148349, 149211, 150352, 151535, 152418, 152979, 153472, 153892, 153921, 153539, 153105, 152659, 151709, 149966, 147772, 145585, 143598, 142075, 141444, 141670, 142103, 142297, 142538, 143219, 144185, 145026, 145488, 145287, 144114, 142264, 140753, 140331, 140842, 141935, 143762, 146373, 148959, 150514, 151045, 151415, 152109, 152774, 152931, 152582, 152048, 151634, 151541, 151842, 152417, 153101, 153814, 154414, 154542, 153906, 152758, 151967, 152450, 154465, 157381, 160200, 162433, 164383, 166491, 168706, 170796, 173012, 175868, 179343, 182797, 185710, 187985, 189571, 190437, 191146, 192808, 196023, 200258, 204603, 208848, 213440, 218651, 224186, 229620, 234956, 240614, 246876, 253431, 259666, 265458, 271315, 277587, 283947, 289999, 295884, 301699, 306745, 310089, 311550, 311410, 309464, 305352, 299705, 293921, 288748, 284087, 280200, 277918, 277230, 276821, 275626, 274041, 272993, 272588, 272363, 272257, 272540, 273157]
57252B73157O45O40R08J459K226L087L735L996M159M509M916N383O345P783Q727
57237C31675Q516P979Q234Q945R000Q444Q310Q830R260R415R922J0822J1279J0981
57223D61612J0629J0693J0740J0340R739R264Q911Q754R064R754J0385J0845J1318
57210E92048J1669J1654J1746J2769J4598J6117J6609J6411J6075J5778J5742
57199G51216J6331J7393J8241J8527J8541J8565J8560J8578J8801J9093J9154
57188I53000J9151J9513K0173K0694K1104K1844K2903K3832K4542K5360K6265
57177A198381K6845K6980K6873K6551K6087K6071K6908K7903K8011K7323K6734
57166A494667K6367K5609K4633K4448K5278K6144K6394K6397K6559K6706K6853
$$ y = [273157, 273802, 274442, 275350, 276809, 279035, 282122, 285857, 289853, 294012, 298521, 303437, 308820, 315165, 322948, 331675, 340191, 348170, 356404, 365349, 374349, 382793, 391103, 399933, 409193, 418608, 428530, 439352, 450631, 461612, 472241, 482934, 493674, 504014, 513753, 523017, 531928, 540682, 549746, 559500, 569885, 580730, 592048, 603717, 615371, 627117, 639886, 654484, 670601, 687210, 703621, 719696, 735474, 751216, 767547, 784940, 803181, 821708, 840249, 858814, 877374, 895952, 914753, 933846, 953000, 972151, 991664, 1011837, 1032531, 1053635, 1075479, 1098382, 1122214, 1146756, 1172116, 1198381, 1225226, 1252206, 1279079, 1305630, 1331717, 1357788, 1384696, 1412599, 1440610, 1467933, 1494667, 1521034, 1546643, 1571276, 1595724, 1621002, 1647146, 1673540, 1699937, 1726496, 1753202, 1780055]
57155A780055K7332K7823K7456K6245K5316K5284K5494K5385K5457K6202K7130
57144B069179K7550K7533K7449K7308K7135K7308K7977K8797K9641L0888L2667
57133B383432L4515L6213L8131M0355M2224M3272M3923M4744M5612M6170M6576
57122B845167M7320M8712N0887N3995N8152O3531P0534P9412Q9800J01101J13211
57111C621822J26292J40118J54552J70492J89607K13175K42043K77470L21092
57102E456663L74167M37824N13736O03513P07511Q25336R57310J104646J268632
57093A2249338J450857J653499J877375K118954K369282K614731K838450L023556
57085C0196042L156773L226323L214208L096816K863110K533377K150921J748714
$$ y = [1780055, 1807387, 1835210, 1862666, 1888911, 1914227, 1939511, 1965005, 1990390, 2015847, 2042049, 2069179, 2096729, 2124262, 2151711, 2179019, 2206154, 2233462, 2261439, 2290236, 2319877, 2350765, 2383432, 2417947, 2454160, 2492291, 2532646, 2574870, 2618142, 2662065, 2706809, 2752421, 2798591, 2845167, 2892487, 2941199, 2992086, 3046081, 3104233, 3167764, 3238298, 3317710, 3407510, 3508611, 3621822, 3748114, 3888232, 4042784, 4213276, 4402883, 4616058, 4858101, 5135571, 5456663, 5830830, 6268654, 6782390, 7385903, 8093414, 8918750, 9876060, 10980706, 12249338, 13700195, 15353694, 17231069, 19350023, 21719305, 24334036, 27172486, 30196042, 33352815, 36579138, 39793346, 42890162, 45753272, 48286649, 50437570, 52186284]
57077E2186284J326664Q64142L50343k01124p61092j299009j789264k212676k557929
57068D5906339k821321l004026l110177l146247l119125l033966k895514k711773
57060B2064190k494822k258081k014129j774440j548600j342724j159568j000100
57052H471726q63951p49046o52588n72478n06616m51653m04217l62977l27700
57043C580500k96774k67697k39766k13998j90459j67761j45435j24580j05618
57034A828412q7474o9496n2147l5052j6706K315J7465K3174J7033L30k3795n1052
57022A553007p5841r2908j00108r9112r3377q5699p7376o8842o0539n3112m6855
57011F99238m1430l6453l2061k8530k5637k3039k0875j9290j7742j5651j3517
$$ y = [52186284, 53512948, 54377090, 54727433, 54526309, 53765217, 52466208, 50676944, 48464268, 45906339, 43085018, 40080992, 36970815, 33824568, 30705443, 27671477, 24775963, 22064190, 19569368, 17311287, 15297158, 13522718, 11974118, 10631394, 9471826, 8471726, 7607775, 6858729, 6206141, 5633663, 5127047, 4675394, 4271177, 3908200, 3580500, 3283726, 3016029, 2776263, 2562265, 2371806, 2204045, 2058610, 1934030, 1828412, 1740938, 1671442, 1619295, 1584243, 1567537, 1569852, 1587317, 1610491, 1627524, 1627854, 1604059, 1553007, 1477166, 1384258, 1284150, 1185038, 1091661, 1005962, 928586, 859744, 799205, 746093, 699238, 657808, 621355, 589294, 560764, 535127, 512088, 491213, 471923, 454181, 438530, 425013]
57000D25013j2281j1773j0890r371q160p770p439o353m774l311j829K60L052N967
56986C50341Q326R892J1054J2363J3552J3271J0423N496l7n331j0285j4401j6754
56973C87910j7220j6654j5604j3826j1319q737o355l664m84K386M329O014Q555
56960C15331J2112J5900J9172K1471K2257K0927J7328J1852N052k570j0358j7246
56948D31228k1906k3505k2475k0198j7709j4948j1554p867m523j465J890N623
56936B92591R239J2591J6150K0250K4576K8330L0425K9713K5658J8811J0155L10
56924E18799j0056j9429k6132k9710l0887l0297k8144k4981k1753j8902j6320
56913B62188j4124j2627j1461r871p958o605n975n204l867k624j926j240j30Q78
$$ y = [425013, 412732, 400959, 390069, 380698, 372538, 364768, 357329, 350976, 346202, 342891, 341062, 341322, 344374, 350341, 358667, 368559, 379613, 391976, 405528, 418799, 429222, 434718, 434681, 429350, 419065, 404664, 387910, 370690, 354036, 338432, 324606, 313287, 304550, 298195, 294531, 294047, 296433, 300762, 306776, 315331, 327443, 343343, 362515, 383986, 406243, 427170, 444498, 456350, 461402, 458832, 448474, 431228, 409322, 385817, 363342, 343144, 325435, 310487, 298933, 291066, 286543, 285078, 286968, 292591, 301830, 314421, 330571, 350821, 375397, 403727, 434152, 463865, 489523, 508334, 518489, 518799, 508743, 489314, 463182, 433472, 402585, 372288, 344144, 319163, 297410, 278508, 262188, 248064, 235437, 223976, 214105, 206147, 199542, 193567, 188363, 184496, 181872, 179946, 178706, 178576, 179454]
56899A79454J280J535K270L280M098M849N779O573O970P626R394J2058J4606J6508
56885B76280J7934J8740J8119J5364J0594M563j724p164j0868j2630j2918j2262
56873C04028j0772q377n264j875J553N209R352J3937J8791K4032K9917L6278M2456
56860D59265M7798N1705N3044N0225M2354L0024J4749j719j7209k9229l6305l8926
56848F25776l8409l5243k9373k1599j3480n840J683R590J7891K6567L5769M5413
56836F18745N5255O5339P5506Q4267Q8858Q6605P5885N6254K8916k569l3043n7925
56824A142093p4646q2528q2381p6447o7597n7856m7899l7856k7912j8044q065
56813E60862J756J0827J9278K8192L8320M8975N8206O3589O2854N4661L9304J8540
$$ y = [179454, 180734, 182269, 184539, 187819, 191917, 196766, 202545, 209118, 216088, 223714, 233108, 245166, 259772, 276280, 294214, 312954, 331073, 346437, 357031, 361594, 359870, 352706, 341838, 329208, 316290, 304028, 293256, 284879, 279615, 277740, 279293, 284502, 293854, 307791, 326582, 350614, 380531, 416809, 459265, 507063, 558768, 611812, 662037, 704391, 734415, 749164, 747445, 730236, 701007, 664702, 625776, 587367, 552124, 522751, 501152, 487672, 481832, 483515, 493105, 510996, 537563, 573332, 618745, 674000, 739339, 814845, 899112, 987970, 1074575, 1150460, 1206714, 1235630, 1233061, 1200018, 1142093, 1067447, 984919, 902538, 826091, 758494, 700638, 652739, 614883, 586971, 568927, 560862, 562618, 573445, 592723, 620915, 659235, 708210, 766416, 830005, 892859, 947520, 986824, 1005364]
56801A005364n149k8796m8956o2775o9449p0145o6574o0223n2602m4931l7323
56790D58441k9262k1018j3630p321j071N807J2784J9199K5081L0293L3774L4305
56778E47382L1335K4523J3573o57j5561k8235l7211m2355m3888m2320l8880l5004
56766C32702l1395k8015k4716k1520j8448j5569j3002j0773q829p323o473o157
56754A40482n991n856n847n730n123m172l335k538j357q0L83j10n72k59M30P70
56738A01095N74o7j093k085k395k076j913k173k176j526q09n13k09N66J395J758
56722H8353J948K437K896K632J627N41o5l9M62J002J203J242J534J874J576O57
56706A09880K5J89O49R54J381K054K328J742Q24L09J35j58o47j195j791k237k143
$$ y = [1005364, 1000215, 971419, 922463, 859688, 790239, 720094, 653520, 593297, 540695, 495764, 458441, 429179, 408161, 394531, 387210, 386139, 391946, 404730, 423929, 449010, 479303, 513077, 547382, 578717, 603240, 616813, 616156, 600595, 572360, 535149, 492794, 448906, 406586, 367706, 332702, 301307, 273292, 248576, 227056, 208608, 193039, 180037, 169264, 160435, 153112, 146639, 140482, 134491, 128635, 122788, 117058, 111935, 107763, 104428, 101890, 100533, 100453, 100836, 100726, 100154, 99895, 100325, 101095, 101669, 101602, 100509, 98424, 96029, 93953, 92040, 89867, 87691, 86165, 85356, 84843, 84634, 85200, 86595, 88353, 90301, 92738, 95634, 98266, 99893, 100434, 100369, 100330, 100792, 101794, 102997, 104239, 105773, 107647, 109223, 109880, 109905, 110094, 110743, 111697, 113078, 115132, 117460, 119202, 120026, 120335, 120470, 120312, 119665, 118470, 116679, 114442, 112299]
56689A12299j580j148j047q71n05l40l12J97J053J187L22l27J05P44L89p08j481
56672A07977j557j104k3J595K880L104K679K389K314K219K205K154J387j22j112
56657A26985o28N06R49Q14J062J685J819J305Q02N72L13mn5J68M16O66Q98Q43
56639A39116N63O80J315J482M11j213k198k363k182j689p88l3O4j31j54l08p80
56622A31792p76J66R15K79r82j288p45p40j457j683r62j84P2J60K41o6o07o69
56604A23466k08P0MJ35N19N86L23L72P26N88k39q98p11N8R05J571J706J001r6
56585A29878p03o41m12o9Q04J880K032R43k09k03Q02J690J713J099P03J265K660
56568A43232L919M295M049L863L957M319N205O646Q001Q885R975J1872J3682J3887
$$ y = [112299, 110719, 109571, 108524, 107653, 107148, 106808, 106496, 106693, 107746, 108933, 109255, 108928, 109033, 109777, 110166, 109458, 107977, 106420, 105316, 105293, 106888, 109768, 112872, 115551, 117940, 120254, 122473, 124678, 126832, 128219, 128097, 126985, 126357, 126863, 127812, 128626, 129688, 131373, 133192, 134497, 135299, 135871, 136184, 136180, 136125, 136293, 136709, 137375, 138273, 139116, 139679, 140359, 141674, 143156, 143567, 142354, 140156, 137793, 135611, 133922, 133134, 133101, 133165, 133034, 132880, 132572, 131792, 131016, 131182, 132097, 132376, 131394, 130106, 129361, 128621, 127164, 125481, 124519, 124335, 124407, 124567, 124808, 124742, 124135, 123466, 123258, 123328, 123332, 123467, 123986, 124572, 124895, 125267, 125993, 126581, 126342, 125444, 124733, 124791, 125696, 127267, 128973, 129974, 129878, 129175, 128534, 128122, 128053, 128857, 130737, 132769, 133712, 133503, 133300, 134102, 135792, 137505, 138604, 139307, 140572, 143232, 147151, 151446, 155495, 159358, 163315, 167634, 172839, 179485, 187486, 196371, 206346, 218218, 231900, 245787]
56554B45787J2260R788P177M652K868K452K791K599J726J078R04M23p04j897k709
56539B89195l218l351k972k685l347m744n862o375o624o359n025l361l024m309
56525B27939n671n895n373m820m166l350k964l337l929m152m010l590k825k074
56511A71783j960k383k541k122j531r16o2O70M84n57j468j768j812j683j055l05
56495A52774l50j050j169k48P88J243J408J406P64k97o40nM39L9k31M98J450J464
56477A58283O50j62p08j050r43l18L15O37J010J574J767J262O22L78L03J50K12
56460A63982N67O36J04n00o51m64o3P37J673J943J326N50J15k13m56j35N22M49
56442A70122n88j362r48Q6Q81J411J687J178ro75k29L14J07k1Q82J997J912Q82
$$ y = [245787, 258047, 267835, 275012, 279664, 282532, 284984, 287775, 290374, 292100, 293178, 294082, 294505, 293801, 291904, 289195, 285977, 282626, 279654, 276969, 273622, 268878, 263016, 256641, 250017, 243658, 238633, 235272, 232248, 227939, 222268, 216373, 211000, 206180, 202014, 198664, 195700, 192363, 188434, 184282, 180272, 176682, 173857, 171783, 169823, 167440, 164899, 162777, 161246, 160330, 160268, 160938, 161422, 160865, 159397, 157629, 155817, 154134, 153079, 152774, 152424, 151374, 150205, 149957, 150745, 151988, 153396, 154802, 155566, 155269, 154629, 154624, 155063, 155102, 154871, 155369, 156819, 158283, 158933, 158771, 158063, 157013, 156070, 155752, 156067, 156704, 157714, 159288, 161055, 162317, 162939, 163317, 163620, 163770, 163982, 164549, 165185, 165289, 164789, 164138, 163674, 163611, 164348, 166021, 167964, 169290, 169840, 169955, 169742, 169286, 169151, 169673, 170122, 169534, 168172, 167224, 167310, 168191, 169602, 171289, 172467, 172458, 171783, 171554, 171868, 171975, 171954, 172836, 174833, 176745, 177627]
56424A77627L71Q18J246R06Q6n72p36m11Q1K72P9q9NK10N27J124J640J443Q16
56405A85443P60J217Q55p80k221k101r86k64k18k76j76J29Q94J904K196J319J93
56388A87888j70Q8M63J137K240L069L010K456J929J221L01JP09J427J265Q84J189
56371B09107J622J145J36k10J95N01M97O39Q63O38L3l65l68j32M11J269J930K018
56353B19929J924K011J867J116L48K68O21Q36R68J055N28o71j243k03J372J702
56337B32428Q50L41P36J116Q68N11N65Q20Q87P38M95L36N28J084J598J852K150
56320B47903K655K967K773K311J711O94n94j361j365j367j702j499j51J536K581
56305B57092L061L270K876K052K061L417M643M360L429L409L949L521J994O52
$$ y = [177627, 177998, 178816, 180062, 180968, 181054, 180482, 179746, 179335, 179416, 179688, 179767, 179678, 179683, 179893, 180420, 181544, 183184, 184627, 185443, 186203, 187420, 188275, 187495, 185274, 183173, 182187, 181923, 181705, 181429, 181253, 181382, 182276, 184180, 186376, 187695, 187888, 187718, 187806, 188269, 189406, 191646, 194715, 197725, 200181, 202110, 203331, 203632, 203633, 204342, 205769, 207034, 207918, 209107, 210729, 211874, 212010, 211800, 211995, 212496, 212993, 213632, 214495, 215133, 215166, 214801, 214433, 214301, 214712, 215981, 217911, 219929, 221853, 223864, 225731, 226847, 227195, 227463, 228084, 228920, 229888, 230943, 231471, 230800, 229557, 229354, 230726, 232428, 233278, 233619, 234355, 235471, 236339, 236850, 237415, 238235, 239122, 239860, 240355, 240691, 241219, 242303, 243901, 245753, 247903, 250558, 253525, 256298, 258609, 260320, 261014, 260420, 259059, 257694, 256327, 254625, 253126, 252975, 254511, 257092, 260153, 263423, 266299, 268351, 270412, 273829, 278472, 282832, 286261, 289670, 293619, 297140, 299134, 299786]
56291B99786K05L70R42J738J973J198L92P19J738K201K083K290K958L565M188
56276C26346N164N917N622M648M008L864L886M414N734O868O733N960N971O814
56262D01949P556Q227R546J1118J1886J2096J3002J4777J6530J8330K1231K5219
56250E71467K8863L1364L3465L5937L8513M0651M2287M3515M4293M4582M4151
56239I99088M2515L9646L6229L2512K7772K1703J5331R440L265l966j1298j7396
56227A194841k2464k7174l0848l2646l3546l5022l6532l6544l5329l4463l4080
56216H36193l2883l0596k8221k6136k3974k2054k0973k0018j8035j5504j3844
56205E83955j3034j1985j0743j0151r737q339o453n651n902n784n058m648m336
$$ y = [299786, 299991, 300361, 301303, 303041, 305014, 306212, 306604, 307323, 309061, 311262, 313345, 315635, 318593, 322158, 326346, 331510, 337427, 343049, 347697, 351705, 355569, 359455, 363869, 369603, 376471, 383204, 389164, 395135, 401949, 409505, 417732, 427278, 438396, 450282, 462378, 475380, 490157, 506687, 525017, 546248, 571467, 600330, 631694, 665159, 701096, 739609, 780260, 822547, 866062, 910355, 954937, 999088, 1041603, 1081249, 1117478, 1149990, 1177762, 1199465, 1214796, 1224236, 1227501, 1223535, 1212237, 1194841, 1172377, 1145203, 1114355, 1081709, 1048163, 1013141, 976609, 940065, 904736, 870273, 836193, 803310, 772714, 744493, 718357, 694383, 672329, 651356, 631338, 613303, 597799, 583955, 570921, 558936, 548193, 538042, 528305, 519966, 513513, 507862, 501960, 496176, 491118, 486470, 482134]
56192D82134l061j391j031j815j795m94N03M63M23Q77J006O61Q00J495J730J516
56176D82021J964L008L351K958L195M170M409L611L292M170N265O079P235Q462
56162E43190Q477P502P453Q929J0363J0862J1541J3173J4910J6197J7795K0098
56150F90490K2459K4926K8539L3260L7799M2157M8117N6560O6387P6664Q7653
56139A215011R9068J09487J18046J24547J27474J24433J15239J02437Q8370P4165
56129B298277O1691N3325M8749M4641L8486L0434K0922R583k600j3060k0968k8262
56117B541218l6484m5314n5120o7805q3450r8767j10546j18297j22283j21518
56107A681634j15450j05512r3599q0766o8229n7438m8237l9205l0487k3889j9713
$$ y = [482134, 479073, 477682, 476651, 474836, 473041, 472547, 473050, 473513, 473936, 474813, 475819, 476480, 477280, 478775, 480505, 482021, 483985, 486993, 490344, 493302, 496497, 500667, 505076, 508687, 511979, 516149, 521414, 527493, 534728, 543190, 551667, 559169, 566622, 575551, 585914, 596776, 608317, 621490, 636400, 652597, 670392, 690490, 712949, 737875, 766414, 799674, 837473, 879630, 927747, 984307, 1050694, 1127358, 1215011, 1314079, 1423566, 1541612, 1666159, 1793633, 1918066, 2033305, 2135742, 2224112, 2298277, 2359968, 2413293, 2462042, 2506683, 2545169, 2575603, 2596525, 2606108, 2603508, 2590448, 2569480, 2541218, 2504734, 2459420, 2404300, 2336495, 2253045, 2154278, 2043732, 1925435, 1803152, 1681634, 1566184, 1460672, 1367073, 1286307, 1218078, 1160640, 1112403, 1073198, 1042711, 1018822, 999109]
56096I99109j6224j2831j0776r921q168n022k548j658o48J412L130L840M905O661
56082I51261P358O535O129O916P262O692P060Q762R576Q905R234J1549J3286J2926
56068A073451J2610J3874J4764J3763J2850J3846J5234J5325J5279J6315J7159
56057A234470J6832J6738J7640J7860J6785J6591J8157J8975J7601J6350J7069
56046A425068J8129J8228J9144K1877K4094K4324K4726K6768K8345K8159K8584
56035A687446L1051L2970L2587L2421L4512L6739L7346L8406M1199M2999M2344
56024B090020M2443M5356M7937M7796M8020N1302N4812N5903N7409O1949O6288
56013B669235O7207O7819P1999P7497Q0652Q3113Q7713R2478R4969R7853J03944
$$ y = [999109, 982885, 970054, 959278, 949357, 941189, 936167, 933619, 931961, 931313, 932725, 935855, 939695, 944600, 951261, 958619, 965154, 971283, 978199, 985461, 992153, 999213, 1007975, 1017551, 1026456, 1035690, 1047239, 1060525, 1073451, 1086061, 1099935, 1114699, 1128462, 1141312, 1155158, 1170392, 1185717, 1200996, 1217311, 1234470, 1251302, 1268040, 1285680, 1303540, 1320325, 1336916, 1355073, 1374048, 1391649, 1407999, 1425068, 1443197, 1461425, 1480569, 1502446, 1526540, 1550864, 1575590, 1602358, 1630703, 1658862, 1687446, 1718497, 1751467, 1784054, 1816475, 1850987, 1887726, 1925072, 1963478, 2004677, 2047676, 2090020, 2132463, 2177819, 2225756, 2273552, 2321572, 2372874, 2427686, 2483589, 2540998, 2602947, 2669235, 2736442, 2804261, 2876260, 2953757, 3034409, 3117522, 3205235, 3297713, 3392682, 3490535, 3594479]
56002C594479J10511J14689J19406J27675J36360J42244J48596J58831J69525
55993D822316J77066J85185J98224K13059K25768K39812K59190K80061K98197
55984F898878L17953L44430L73726M00995M30808M68924N11355N53030N99597
55975A0899696O58456P25990P96656Q76714R75326J090540J218821J369789J556210
55966B0168198J778986K038942K353504K743520L214387L769767M430825N218351
55958D5716480O129360P159417Q338051R717186J1343223J3273161J5592727J8365004
55950A35634609K1567699K5110986K8844471L2393830L4944045L5317300L2439512
55943C46252452K5850628J5913253L749238q935848k0200947k8467534l3080581
$$ y = [3594479, 3704990, 3819679, 3939085, 4066760, 4203120, 4345364, 4493960, 4652791, 4822316, 4999382, 5184567, 5382791, 5595850, 5821618, 6061430, 6320620, 6600681, 6898878, 7216831, 7561261, 7934987, 8335982, 8766790, 9235714, 9747069, 10300099, 10899696, 11558152, 12284142, 13080798, 13957512, 14932838, 16023378, 17242199, 18611988, 20168198, 21947184, 23986126, 26339630, 29083150, 32297537, 36067304, 40498129, 45716480, 51845840, 59005257, 67343308, 77060494, 88403717, 101676878, 117269605, 135634609, 157202308, 182313294, 211157765, 243551595, 278495640, 313812940, 346252452, 372103080, 388016333, 391765571, 382829723, 362628776, 334161242, 301080661]
55936C01080661l4386318l3293320l0752645k7514985k4113101k0873477j7931809
55929A12215006j5310396j3008286j1021599r323309p874502o651467n637204
55922D3388243m798551m096585l510218l028744k631139k292994k005239j767147
55914A9257626j567999j392693j238303j108745r98803q98434q07265p30528o65376
55905I849480o04375n47958n00936m60856m21601l84561l54977l30738l05582
55896E937896k80036k59164k42455k25589k09189j96678j86199j73446j59762
55887D005378j49307j40984j31221j21790j16847j14905j11565j07474j05915
55878B905370j05105j00678r3598q8193q4438p9324p3759p0880o9487o6115o1842
$$ y = [301080661, 266694343, 233401023, 202648378, 175133393, 151020292, 130146815, 112215006, 96904610, 83896324, 72874725, 63551416, 55676914, 49025447, 43388243, 38589692, 34493107, 30982889, 27954145, 25323006, 23030012, 21024773, 19257626, 17689627, 16296934, 15058631, 13949886, 12951083, 12052649, 11245384, 10514856, 9849480, 9245105, 8697147, 8196211, 7735355, 7313754, 6929193, 6574216, 6243478, 5937896, 5657860, 5398696, 5156241, 4930652, 4721463, 4524785, 4338586, 4165140, 4005378, 3856071, 3715087, 3583866, 3462076, 3345229, 3230324, 3118759, 3011285, 2905370, 2800265, 2699587, 2605989, 2517796, 2433358, 2354034, 2280275, 2209395, 2139908, 2073793, 2011951]
55867B011951o0125n9680n6459n1092m7540m5811m2771l8975l7846l8862l8125
55856A494665l5207l3267l2847l1491k9175k8394k9045k8574k6946k6362k6563
55845A166794k5464k3893k4447k6115k5303k1973j9677j9531j9156j7663j6856
55834I26716j7140j6772j5530j4985j5014j3960j2244j1824j2251j1286r322r035
55822G67353j0699j1799j1481j1434j2184j2246j1283j0608j0404r670q846r185
55810F37514r755q481n892m378m056k874n42J225K211L812N792O505O305P194
55796F34580R003R442Q025O517N450L619J096o39j682l497n728o520o081o519
55782F47066q156r392j0181j2005j4245j4341j1898r114o696l014K046O022P447
$$ y = [2011951, 1951826, 1892146, 1835687, 1784595, 1737055, 1691244, 1648473, 1609498, 1571652, 1532790, 1494665, 1459458, 1426191, 1393344, 1361853, 1332678, 1304284, 1275239, 1246665, 1219719, 1193357, 1166794, 1141330, 1117437, 1092990, 1066875, 1041572, 1019599, 999922, 980391, 961235, 943572, 926716, 909576, 892804, 877274, 862289, 847275, 833315, 821071, 809247, 796996, 785710, 776388, 767353, 756654, 744855, 733374, 721940, 709756, 697510, 686227, 675619, 665215, 655545, 646699, 637514, 627759, 619278, 613386, 609008, 604952, 602078, 601536, 602761, 604972, 608784, 614576, 621081, 627386, 634580, 643583, 653025, 661050, 667567, 673017, 676636, 677732, 677093, 675411, 671914, 666186, 659666, 653585, 647066, 638910, 629518, 619337, 607332, 593087, 578746, 566848, 557734, 551038, 548024, 550070, 556092, 563539]
55769E63539P194N604J612m404j0143j4476j8026k0195j9097j5229j1814j0419
55757D54146r417p747o751p074p127o149n785p056q510q909r060r550r289p763
55743C43959o292n590m506k559j254j419j659r95o88j856l409m034m173m480m315
55728B96730l317k686l238l938l745l340l633m117m008l566l009j723L50J996
55714B58756K524K843L748M640M840M689M375L338J683O00M34oj385k824l779
55699B84476n023o737p549o764n781n937o548o374n541m778m112l516l439l674
55685B08703l097j555m08k67J42J732L391L931L975M439M682L777K312J337O22
55670B33716m91j552j776j401j030n26K13M04l87j181r70k99j66k74L22J547K554
$$ y = [563539, 570733, 576337, 577949, 573545, 563402, 548926, 530900, 510705, 491608, 476379, 464565, 454146, 444729, 436982, 430231, 423157, 416030, 409881, 404096, 397040, 388530, 379621, 370561, 361011, 351722, 343959, 337667, 332077, 327571, 325012, 323758, 322339, 320680, 319685, 318997, 317141, 313732, 309698, 305525, 301045, 296730, 293413, 290727, 287489, 283551, 279806, 276466, 272833, 268716, 264708, 261142, 258133, 256410, 256760, 258756, 261280, 264123, 267871, 272511, 277351, 282040, 286415, 289753, 291436, 292036, 292470, 292464, 291079, 288255, 284476, 279453, 272716, 265167, 258403, 252622, 246685, 240137, 233763, 228222, 223444, 219332, 215816, 212377, 208703, 205606, 204051, 203643, 203376, 203518, 205250, 208641, 212572, 216547, 220986, 225668, 229445, 231757, 233094, 233716, 233225, 231673, 229897, 228496, 227466, 226940, 227153, 227557, 227170, 225989, 225019, 224720, 224554, 224280, 224602, 226149, 228703]
55653B28703L059L347L443L293L255L570L816L518K818K049J287O99M92J78j202
55638B62325l688o137p683q446q691q487q385q940r325q062n488l692l458l280
55624A68563k167j317j805k607k371j502j014p43k32k3o15j284j358j359j720
55609A48446j672q11k99r84j723j219k66l45j140j348r82r41j110p54k11l94j074
55592A33173j336j262j580j980j474j37R59J371J550J769J955K297K865K996K199
55577A43365J288J495K810M209N096N480N362N006N302O619P800P428N574L274
55563B10108R05j560l446m025l958m588n997p045p152o780o235n309m162l437
55549A47319l381l628l815l760l263k438j901j922j871j158k25K57N04J000J369
$$ y = [228703, 231762, 235109, 238552, 241845, 245100, 248670, 252486, 256004, 258822, 260871, 262158, 262857, 263349, 263527, 262325, 258637, 252500, 244817, 236371, 227680, 219193, 210808, 201868, 192543, 184481, 178993, 175301, 171843, 168563, 166396, 165079, 163274, 160667, 158296, 156794, 155780, 155037, 154805, 154782, 154167, 152883, 151525, 150166, 148446, 146774, 145963, 145664, 144680, 142957, 141738, 141472, 141127, 139987, 138639, 137657, 136716, 135606, 134852, 134641, 134247, 133173, 131837, 130575, 128995, 127015, 125541, 125404, 126363, 127734, 129284, 131053, 133008, 135305, 138170, 141166, 143365, 144653, 146148, 148958, 153167, 158263, 163743, 169105, 174111, 179413, 186032, 193832, 201260, 206834, 210108, 211013, 209453, 206007, 201982, 198024, 193436, 187439, 180394, 173242, 166462, 160227, 154918, 150756, 147319, 143938, 140310, 136495, 132735, 129472, 127034, 125133, 123211, 121340, 120182, 119957, 120214, 120718, 121718, 123087]
55534A23087R52O7m18l28p0K83Q36J186R39M27O7m07j173j533j050o90j504k774
55516A17897k966k050j325j297j256r07q64j332j679j491j119r35r52j158j447
55501I7119j376p79l69q26j549j358k22P84J056R66R21Q89Q40P65L98l59r11p05
55483I5284j13J66J48J97J42k07k74M23J140Q51o6m15l2K73K90M81O86K52o43
55464I8583j168j220j348j358n05R42J725J397P59L85K3l80l71K1J65o7k26l58
55446I6999r38j562j142K82J259R37J33j32J1l5k55l54l17j72K23P53J009R17
55428I7616Q01P31M99K02R3k0l40k75P89K071K090Q75K7L75R91R22N14L38J23
55409A08422m34r34j075j268j725j871j391r96j292j713j364m12K23M9o58j368
$$ y = [123087, 124039, 124106, 123688, 123360, 123290, 123573, 124409, 125595, 126534, 126961, 127028, 126621, 125448, 123915, 122865, 122175, 120671, 117897, 114931, 112881, 111556, 110259, 109003, 108096, 107232, 105900, 104221, 102730, 101611, 100676, 99724, 98566, 97119, 95743, 94964, 94595, 93769, 92220, 90862, 90640, 91424, 92480, 93446, 94367, 95256, 96096, 96861, 97259, 96900, 95989, 95284, 95171, 95337, 95485, 95682, 95824, 95617, 95343, 95766, 96906, 97757, 97691, 97276, 97244, 97517, 97807, 98288, 98974, 99226, 98583, 97415, 96195, 94847, 93489, 92984, 93926, 95651, 97048, 97807, 98192, 98215, 97835, 97464, 97485, 97650, 97583, 97357, 96999, 96061, 94499, 93357, 93639, 94898, 95835, 95968, 95836, 95847, 95812, 95557, 95203, 94886, 94714, 94937, 95690, 96699, 97616, 98417, 99148, 99647, 99849, 99942, 99922, 99582, 99307, 100096, 102167, 104257, 105132, 105159, 105534, 106525, 107447, 107961, 108299, 108422, 107988, 107054, 105979, 104711, 102986, 101115, 99724, 98728, 97436, 95723, 94359, 93947, 94170, 94219, 93561, 92193]
55393I2193j585j048q1O17P36O11N69O32Q84J464J953J564K40j113j709j574j016
55376I3337k49K57p3r97j522j181n65k43j1L70N78L53P2J59M84P01O65K98l15
55357I2118n78P9J129J337M49m66n87k94j48r6j04n17j130j030r5M74j06r28q50
55338H8657j69J91K64N70Q01L37m31n20O2M34K52k3j84m69p28m46K15M23p6m81
55318H8679j05O28Q02J79o74j121r99n11P0N27P33O91O19P56R61O90k86j381j822
55299H8436j644j491j471r48K96J497J779J191M18p2k58j96R7N65J031J147N12
55282I0889p21j610j314k29M42L05J61O88J495J863J661J162N40Jj80o6p0l07
55264I4710m67m90o49q77p29k83j39k89J7Q56J164M03l92j24O83Q00J43m02n16
$$ y = [92193, 90608, 89560, 89479, 90096, 90832, 91443, 92012, 92644, 93528, 94992, 96945, 98509, 98749, 97636, 95927, 94353, 93337, 93088, 93345, 93272, 92275, 90753, 89572, 89007, 88764, 88753, 89123, 89701, 90054, 90126, 90285, 90769, 91470, 92135, 92433, 92118, 91540, 91619, 92748, 94085, 94534, 94068, 93481, 93187, 93039, 92943, 92839, 92322, 91192, 90162, 90067, 90541, 90435, 89507, 88657, 88488, 88679, 88943, 89513, 90314, 90651, 90220, 89700, 89762, 90196, 90448, 90425, 90241, 89772, 89044, 88598, 88813, 89236, 89160, 88679, 88574, 89202, 90004, 90183, 89509, 88388, 87389, 86878, 86948, 87475, 88208, 88899, 89518, 90274, 91235, 91925, 91639, 90258, 88436, 86792, 85301, 83830, 82882, 83178, 84675, 86454, 87645, 88063, 87991, 87733, 87537, 87634, 88199, 89230, 90377, 90889, 90168, 88558, 87244, 87015, 87457, 87762, 87923, 88611, 90106, 91969, 93630, 94792, 95332, 95333, 95153, 95087, 95017, 94710, 94243, 93753, 93104, 92227, 91498, 91215, 91076, 90787, 90804, 91660, 92824, 93227, 92835, 92711, 93394, 94194, 94337, 93935, 93419]
55245I3419n76n97j28P14J130O69k39q82r04m21J26K69J8j33O5K39R3j1L38Q26
55225I4015Q57M80J47p6m77r93j148p17n6K48j64j063j635j186o5O22M45J72M65
55206H9871Q07M31l49n66L2Q43J332J392R68R1q35j337j351j026l61M63Q51M80
55188I1736o8j03J57M9l43l53J28M70L48J37K14L99L12j72q75j388j271m84M71
55169H9364J086J306J226P76J07j44M25J331J717J344N45l29r17p86k6N23L45
55152I7893J19O54J466J392L80m63n27l29m36p33r46j068r93m85K22M77R0l92
55134I6321n36n23o12o92n75l30n9K26M27M06L28M81P86Q37N09O6k90n17n33l78
55114I5342m83j114j588r01P67J991J793P81J62K63N02M19J76J45M09O65N41L5
$$ y = [93419, 92843, 92246, 92118, 92832, 93962, 94631, 94392, 93510, 92606, 92185, 92311, 92580, 92598, 92465, 92530, 92769, 92862, 92851, 93189, 94015, 94872, 95352, 95499, 95423, 94946, 93953, 92805, 92088, 92032, 92280, 92116, 91053, 89418, 88232, 88167, 88789, 89234, 89406, 89871, 90678, 91109, 90760, 90194, 90226, 91069, 92401, 93793, 94761, 94852, 94017, 92680, 91329, 90303, 89942, 90405, 91256, 91736, 91668, 91565, 91722, 91771, 91428, 91075, 91203, 91673, 92021, 92158, 92372, 92771, 93083, 92911, 92036, 90648, 89377, 88893, 89364, 90450, 91756, 92982, 93758, 93865, 93721, 94146, 95477, 97194, 98538, 99083, 98754, 97837, 97051, 97025, 97548, 97893, 98012, 98666, 100132, 101524, 101904, 101441, 100914, 100585, 100149, 99416, 98470, 97402, 96409, 95924, 96146, 96623, 96713, 96321, 95785, 95262, 94650, 93958, 93383, 93053, 92994, 93220, 93647, 94053, 94381, 94862, 95648, 96485, 96994, 97060, 96770, 96253, 95720, 95342, 94859, 93745, 92157, 91256, 92023, 94014, 95807, 96588, 96750, 97013, 97515, 97934, 98110, 98255, 98664, 99329, 99870, 99905]
55096I9905l79k27M11J036J293J130N90k53j101j602j611j156k82P17J205Q05
55080A00481n5o64q30p61m38K34Q79R48N32J76L9j15k05P1M79M38L6n7J63j67
55060A01184j390k591k738j859o46M79J324J600J238O86L65J59j07j45L67J138
55044I9064J516J229N15k41o82n95j67Q3q5l06j69K38O24R22J059P02k22j015
55026A02470q37K49J297J550J082M08q5k64j85q6j89m30m87j55M79J181J712J798
55008A09508J273L73k97l20J14M94N97O08O91P43N92K80q6m62p31o81l61j86l72
54989A11777m71pN90L90p13j710j747j033k80J61K40q5n17m02M43J283J409J067
54971A10395Q96R14P86O23P17P44J88o43q92l82K23M70N34N09J97k42k16M08R89
$$ y = [99905, 99526, 99299, 99710, 100746, 102039, 103169, 103759, 103506, 102405, 100803, 99192, 98036, 97754, 98471, 99676, 100481, 100426, 99762, 98932, 98171, 97733, 97967, 98846, 99794, 100326, 100502, 100541, 100426, 100221, 100292, 100771, 101209, 101245, 101188, 101351, 101184, 99794, 97203, 94465, 92606, 91960, 92439, 93763, 95363, 96601, 97287, 97652, 97811, 97704, 97559, 97926, 99064, 100580, 101809, 102324, 102083, 101401, 100806, 100639, 100722, 100637, 100331, 100162, 100400, 101024, 101946, 103005, 103707, 103485, 102470, 101633, 101882, 103179, 104729, 105811, 106219, 106134, 105870, 105685, 105599, 105410, 104980, 104493, 104338, 104817, 105998, 107710, 109508, 110781, 111154, 110857, 110537, 110651, 111145, 111742, 112350, 113041, 113784, 114376, 114656, 114570, 114108, 113377, 112696, 112335, 112149, 111777, 111306, 111299, 111889, 112279, 111566, 109856, 108109, 107076, 106796, 106957, 107197, 107112, 106595, 106193, 106636, 107919, 109328, 110395, 111291, 112205, 112991, 113614, 114331, 115075, 115263, 114620, 113728, 113346, 113569, 114039, 114573, 115082, 115279, 115037, 114821, 115229, 116218]
54952A16218R80N66J63j83n84r19j008r02p84q11j088j500j630j153l46K57N50
54935A07826P80R13P12M09N75J244J801J942K030K353K598K423K041J878K082
54920A31607K570L219L778L966L811L590L336K793J939J115N68K10j62p25j646
54905A59969k824l762m196m555n194n489m584k900j733j449j194n90l74q67j096
54890A19162k85P90Q51j27j071j190m48Q16K039K580K435K407L075L959M301M133
54874A43427L996M023L954L738L455K955K145J316O60k03j652l329m521m964m798
54859A50202m165l342k851k788k511j676j061j550k635k942k119j201j108j608
54845A18645j966j846j350p36l33l30m71l15R2K09k46r01j219j073p41n41n28
$$ y = [116218, 117198, 117764, 117927, 117744, 117160, 116241, 115233, 114331, 113547, 112736, 111648, 110148, 108518, 107365, 107019, 107276, 107826, 108606, 109519, 110231, 110640, 111215, 112459, 114260, 116202, 118232, 120585, 123183, 125606, 127647, 129525, 131607, 134177, 137396, 141174, 145140, 148951, 152541, 155877, 158670, 160609, 161724, 162292, 162502, 162340, 161615, 159969, 157145, 153383, 149187, 144632, 139438, 133949, 129365, 126465, 124732, 123283, 122089, 121499, 121125, 120258, 119162, 118877, 119667, 120518, 120391, 119320, 118130, 117682, 118498, 120537, 123117, 125552, 127959, 131034, 134993, 139294, 143427, 147423, 151446, 155400, 159138, 162593, 165548, 167693, 169009, 169669, 169466, 167814, 164485, 159964, 155000, 150202, 146037, 142695, 139844, 137056, 134545, 132869, 131808, 130258, 127623, 124681, 122562, 121361, 120253, 118645, 116679, 114833, 113483, 112747, 112414, 112084, 111613, 111298, 111390, 111599, 111353, 110452, 109233, 108160, 107419, 106878, 106350]
54828A06350m60q2M86Q19P07L98J82L9p0l3Q4Kj77Q3P70R72J65p23m74O28J225
54807A10891Q72M34N00N44K9o20p45l97k7K52N23N84K71o4P7N98R04O92K36j30
54787A15424l92n75m25L20J392K076J960J385R01N09j16p41m86R87K710L304K585
54770A30818J770K097L486M763N005M470M160M580N225N384N028M473L557J954
54756A86770J33r32j250k037l951n946o598n900m987m554m321l819k900j670n38
54741A37500q4l87p12m97k16o29j523j966j610q87k01L19M61K07K34J181K523
54724A33713L090K679K207K189K242K228K757L998N004M838L663K126M25j382
54710A69777k786l314l290l405l780l986l776l323k893k643k605k569k175j381
$$ y = [106350, 105890, 105808, 106294, 107113, 107820, 108218, 108400, 108439, 108369, 108336, 108420, 108422, 108245, 108328, 109098, 110070, 110235, 109512, 109038, 109666, 110891, 111763, 112197, 112697, 113241, 113270, 112650, 111905, 111508, 111481, 111733, 112256, 112840, 113111, 113047, 113124, 113722, 114626, 115318, 115554, 115424, 115032, 114457, 114032, 114352, 115744, 117820, 119780, 121165, 122066, 122575, 122459, 121718, 121232, 122219, 124929, 128233, 130818, 132588, 134685, 138171, 142934, 147939, 152409, 156569, 161149, 166374, 171758, 176786, 181259, 184816, 186770, 186903, 185971, 184721, 182684, 178733, 172787, 166189, 160289, 155302, 150748, 146427, 142608, 139708, 138038, 137500, 137416, 137029, 136317, 135820, 135604, 134975, 133452, 131486, 129876, 128989, 128788, 129107, 129568, 129775, 130009, 131190, 133713, 136803, 139482, 141689, 143878, 146120, 148348, 151105, 155103, 160107, 164945, 168608, 170734, 171159, 169777, 166991, 163677, 160387, 156982, 153202, 149216, 145440, 142117, 139224, 136581, 133976, 131407, 129232, 127851]
54696A27851n80p8J92K67r5q50j315r32j25K23l1j72K60Q53R69N80J79O5P7p3
54676A27265l67o01p41r77j322j430r99k26L98O19N44L66K04J70K23M9n52j213
54658A21410j359r74n19j77K96Q63J007N44P6K06P20R11N10j27m93l53J06L23
54640A22970j47j026j456j084n60o18r74p74J07Q18O70j6m16k38L0k07r09j409
54622A14761j147l18L52M10R3j11LL56Q56J352J582J402J007O61L52n2m31n48
54604A20580n17p26j218j456r62K8Q26J063J010J072J219J098N36k35q20j007
54588A20491q21m94l52n39p29m08M18J068R94N04L46O95J035R64O65M05O8n64
54570A23746j270j515j062k66K80L50K43L73P78J108J120Q86M98j04p88j077p21
$$ y = [127851, 127271, 127193, 127385, 127652, 127557, 126707, 125392, 124460, 124335, 124558, 124527, 124355, 124615, 125468, 126437, 127017, 127196, 127261, 127338, 127265, 126898, 126297, 125556, 124579, 123257, 121827, 120828, 120602, 121000, 121619, 122163, 122529, 122733, 122903, 123126, 123175, 122623, 121410, 120051, 119077, 118558, 118381, 118677, 119540, 120547, 121091, 121167, 121373, 122093, 123004, 123514, 123387, 122894, 122541, 122647, 122970, 122823, 121797, 120341, 119257, 118697, 118079, 117105, 116331, 116438, 117256, 117926, 117910, 117494, 117256, 117286, 117079, 116170, 114761, 113614, 113296, 113648, 114058, 114151, 114040, 114043, 114399, 115255, 116607, 118189, 119591, 120598, 121259, 121611, 121559, 121128, 120580, 120063, 119337, 118119, 116663, 115701, 115729, 116555, 117618, 118628, 119700, 120919, 122017, 122553, 122318, 121498, 120491, 119670, 119176, 118824, 118285, 117556, 117148, 117566, 118634, 119628, 120132, 120478, 121173, 122208, 123172, 123837, 124242, 124310, 123746, 122476, 120961, 119899, 119633, 119913, 120263, 120506, 120879, 121657, 122765, 123885, 124771, 125269, 125165, 124377, 123300, 122579]
54553A22579j53N6P3N69J659K605K747K215J550J002M79l9l08p7N54J005P03j85
54535A37034p60m46J68P4p97j479j234l18N73J013R04L56k87o34o46n60m33k03
54517A32325r5m05q68r37o69o28q12n84J33N28K02j12K67Q72R90Q21R07R61L66
54498A33262n63q40k16O10J055J139R05K93l73n27j95l0l27o30n12j58O5J51K71
54479A33380M58P22J141J617J775J396P16K60M10J105J801J899J406J013J108
54464A50207J131M10n89o92L27J320J259L51n94j180j367j081n42l81q14j096
54448A46669n41L07L40m42r50o70l35n83q76m94Q8k26j418k192j717o52n0P9M48
54429A36785J152J511J207P73P19Q12O56M75P09J197J301P91K9o45j165j338q81
$$ y = [122579, 122426, 122482, 122555, 123124, 124783, 127388, 130135, 132350, 133900, 134902, 135381, 135342, 135034, 134957, 135511, 136516, 137219, 137034, 136274, 135828, 135996, 136070, 135273, 133794, 132560, 132242, 132815, 133828, 134732, 135088, 134801, 134167, 133521, 132961, 132528, 132325, 132230, 131825, 130957, 130020, 129351, 128723, 127911, 127327, 127460, 127988, 128190, 128078, 128345, 129217, 130207, 131028, 131935, 132896, 133262, 132699, 131859, 131643, 132253, 133308, 134447, 135352, 135645, 135272, 134745, 134550, 134520, 134193, 133563, 133051, 132893, 132958, 133109, 133380, 133838, 134560, 135701, 137318, 139093, 140489, 141205, 141465, 141875, 142980, 144781, 146680, 148086, 149099, 150207, 151338, 151748, 151159, 150467, 150794, 152114, 153373, 153724, 153130, 151950, 150583, 149502, 148960, 148579, 147765, 146669, 146128, 146435, 146775, 146333, 145383, 144713, 144378, 143795, 142919, 142425, 142513, 142287, 140869, 138677, 136960, 136308, 136258, 136337, 136785, 137937, 139448, 140655, 141428, 142147, 142959, 143615, 144090, 144799, 145996, 147297, 148088, 148117, 147472, 146307, 144969, 144088]
54412A44088k5M58K05k09o5N01Q47P76O13M54J01k21J68J356K322K048P96k22
54394A53991l16Q6K92J53p6k42l06j90O5J54j54o10o71p5Q89J616J628R32O1l81
54374A56846l30k22k94k49J21M61M22L03N75J001R48M67K55M97N64J46p7N62J671
54355A63667K272J951J034j5r04j422j577j666j846j876j609j377j421j288m84
54340A53439M90N76l95j431j710j476j338j314j005l59L13Q01J080J081P20J62
54324A49634k44l30k51k18k57k37l7K83M62K61k45o28m63J98P99P50l2r83j347
54305A47115q34R8O75N32J2k50rM15O00N35N73Q69J133J018N49l8o77j398j952
54286A48966j954j439r15p14o14k57L54R93J460J549J082K69k15M7O89J052R55
$$ y = [144088, 144063, 144521, 144726, 144517, 144452, 144953, 145800, 146576, 147189, 147643, 147744, 147523, 147691, 149047, 151369, 153417, 154213, 153991, 153675, 153761, 154053, 154206, 154130, 153888, 153582, 153392, 153457, 153611, 153457, 152847, 152176, 152101, 152990, 154606, 156234, 157166, 157227, 156846, 156516, 156294, 156000, 155751, 155872, 156333, 156755, 157058, 157633, 158634, 159582, 160049, 160304, 160801, 161365, 161511, 161434, 161996, 163667, 165939, 167890, 168924, 168909, 168005, 166583, 165006, 163340, 161494, 159618, 158009, 156632, 155211, 153923, 153439, 153929, 154505, 154110, 152679, 150969, 149493, 148155, 146841, 145836, 145477, 145790, 146591, 147671, 148752, 149472, 149634, 149390, 149060, 148809, 148591, 148334, 148097, 148060, 148343, 148805, 149066, 148821, 148193, 147730, 147928, 148727, 149477, 149445, 148462, 147115, 146281, 146379, 147054, 147586, 147598, 147348, 147339, 147754, 148354, 148889, 149462, 150331, 151464, 152482, 153031, 152993, 152316, 150918, 148966, 147012, 145573, 144658, 143944, 143330, 143073, 143427, 144420, 145880, 147429, 148511, 148780, 148565, 148612, 149301, 150353, 151308]
54269A51308O45K30l02o61m67Q8L76K12J37N71J159J271Q30K96L0k9p1p3J55O40
54249A56345J015P94Mn91l03M75N23o97k178k456j355r8K57l0l8M91R42P99K39
54230A54138k69n82q04q77o46j82K79O17Q37Q15M29n7j62J66M09J31m80r11q66
54211A51985m09J65M16mr21j658j683j107m58k31o81j591k124j410L21J729J907
54194A44246J452J426J748J470L78o19p23j23N08P60M46m42j505k050j754r46
54178A44272j49L34L67Kl37j64L83O16K30k90m04k23j53k55l29k85j30J62M45
54159A44092M13R7L9N65J154J036K27m99o19l66j82j07O7L08L54J71J00L31M41
54140A47622j46j119j311j42J325J535M08o07m96K46P35R49J266J503J273Q37
$$ y = [151308, 151953, 152183, 151881, 151220, 150753, 150841, 151217, 151429, 151566, 152137, 153296, 154567, 155397, 155693, 155723, 155694, 155623, 155550, 155705, 156345, 157360, 158154, 158158, 157567, 157264, 157739, 158262, 157565, 155387, 152931, 151576, 151478, 151735, 151705, 151667, 152158, 153100, 153899, 154138, 153869, 153287, 152483, 151606, 150960, 150778, 151057, 151674, 152511, 153326, 153755, 153698, 153536, 153702, 154111, 154242, 153762, 152851, 151985, 151576, 151741, 152157, 152153, 151232, 149574, 147891, 146784, 146326, 146095, 145414, 143823, 141699, 140289, 140610, 142339, 144246, 145698, 147124, 148872, 150342, 150720, 150101, 149378, 149255, 149763, 150523, 150969, 150527, 149022, 146972, 145218, 144272, 144123, 144457, 144824, 144826, 144489, 144325, 144708, 145324, 145554, 145264, 144860, 144637, 144484, 144229, 143900, 143615, 143485, 143647, 144092, 144505, 144602, 144641, 145206, 146360, 147396, 147623, 147124, 146505, 146139, 145957, 145850, 145917, 146225, 146579, 146750, 146850, 147181, 147622, 147476, 146357, 145046, 144904, 146229, 147764, 148172, 147565, 147069, 147315, 148050, 148999, 150265, 151768, 153041, 153878]
54124A53878P36Q45O33J77Q5M12M89M3l49k00J16L5l10l24J16M73K72l05n80m7
54104A56195J061J881J773J077P39J131J568J243K87m95o74n06k11N00J847L252
54088A70668L684K808J458Q12J235K185L047L676M103M239M093L893L586K519
54074B12006K31k595m562n049m709m368m040l375k480j728j134n12o7j99p71j149
54058A75499j026o48k02M58J229J503R57K33K69J175K192K707K846L023L379L806
54042A97400M237M652N001N246N422N507N437N358N665O511P335P300O324N384
54028B76779N409O047O008M707L003J976J506O61p63j975k474k765l462m342m868
54013B85447n024n006m612l709k984l298m362m968m633m156m307m801m983m804
$$ y = [153878, 154614, 155459, 156092, 156269, 156354, 156766, 157255, 157298, 156949, 156749, 156865, 156900, 156590, 156266, 156382, 156855, 157127, 156822, 156242, 156195, 157256, 159137, 160910, 161987, 162726, 163857, 165425, 166668, 166955, 166460, 165786, 165280, 165069, 165569, 167416, 170668, 174352, 177160, 178618, 179430, 180665, 182850, 185897, 189573, 193676, 197915, 202008, 205901, 209487, 212006, 212237, 209642, 205080, 200031, 195322, 190954, 186914, 183539, 181059, 179331, 178197, 177685, 177618, 177419, 176648, 175499, 174473, 173825, 173623, 174081, 175310, 176813, 177770, 178003, 178272, 179447, 181639, 184346, 187192, 190215, 193594, 197400, 201637, 206289, 211290, 216536, 221958, 227465, 232902, 238260, 243925, 250436, 257771, 265071, 271395, 276779, 282188, 288235, 294243, 298950, 301953, 303929, 305435, 306096, 305333, 303358, 300884, 298119, 294657, 290315, 285447, 280423, 275417, 270805, 267096, 264112, 260814, 256452, 251484, 246851, 242695, 238388, 233587, 228604, 223800]
53999B23800m550m121l258k197j511j416j656j874j799j337q41r93j925k716k311
53984A91295q41M81P67K39l83p36q47p68n19k25jK28O79J369J930J845J043R9
53966A95655l02j26N5j34m54n11k65J36O51J212J561J593J615J977K639L304L749
53949B12355L849L587L258L334L872M514N250O562Q454J0067J0857J1392J2114
53936B99465J2089J0135O722L432Q11j773m230n292m475l041k249j814r20K54
53922C09114J027J539K390L468M106M147M064M139M330M760N576O282O072M867
53908C65881L452K443J643O59m38j293j795k031k020j769j549j724k366l179l936
53893C51978m758n767o630o828o420o087o219o380o044n478n328n596n699n439
$$ y = [223800, 219250, 215129, 211871, 209674, 208163, 206747, 205091, 203217, 201418, 200081, 199240, 198247, 196322, 193606, 191295, 190454, 190935, 191702, 191941, 191558, 190822, 189975, 189207, 188688, 188463, 188462, 188690, 189369, 190738, 192668, 194513, 195556, 195655, 195353, 195227, 195282, 195148, 194694, 194183, 193918, 194054, 194705, 195917, 197478, 199071, 200686, 202663, 205302, 208606, 212355, 216204, 219791, 223049, 226383, 230255, 234769, 240019, 246581, 255035, 265102, 275959, 287351, 299465, 311554, 321689, 328411, 331843, 332654, 330881, 326651, 321359, 316884, 313843, 311594, 309780, 308860, 309114, 310141, 311680, 314070, 317538, 321644, 325791, 329855, 333994, 338324, 343084, 348660, 354942, 361014, 365881, 369333, 371776, 373419, 374078, 373640, 372347, 370552, 368521, 366501, 364732, 363183, 361459, 359093, 355914, 351978, 347220, 341453, 334823, 327995, 321575, 315488, 309269, 302889, 296845, 291367, 286039, 280443, 274744, 269305]
53879B69305n171n033m696l986l131k271j417j000j575k742l200k371j255j080
53865B30377j795k543k920k980k607j783j161j413k118k192j354m61l03p13j009
53850B05025q20l44r9m47j180j674j655j505j522j304m60N06P37K28k36k54j16
53833A94880q0l5K7q8k87k55p3j38l41q0P43J410J360Q80N45N52Q88J511K057
53814B03476J974J412J353K318L476L647K833K027J893K271K867L614M366M781
53800B42308M754M541M362M249M269M556M967N102M726L941K891J620M04k59k15
53785B92216L9n7m10n74n77j011k172l528m289m294m057m077m367m635m660m443
53769B49104m103l734l304k766k291k266k822l485l544k850j949j406j246j162
$$ y = [269305, 264134, 259101, 254405, 250419, 247288, 245017, 243600, 242600, 241025, 238283, 235083, 232712, 231457, 230377, 228582, 226039, 223119, 220139, 217532, 215749, 214588, 213175, 211057, 208865, 207511, 207050, 206747, 206034, 205025, 204205, 203861, 203762, 203315, 202135, 200461, 198806, 197301, 195779, 194475, 194015, 194521, 195258, 195486, 195250, 194996, 194880, 194800, 194765, 194792, 194704, 194417, 194162, 194089, 193951, 193610, 193530, 194273, 195683, 197043, 197923, 198468, 199020, 199908, 201419, 203476, 205450, 206862, 208215, 210533, 214009, 217656, 220489, 222516, 224409, 226680, 229547, 233161, 237527, 242308, 247062, 251603, 255965, 260214, 264483, 269039, 274006, 279108, 283834, 287775, 290666, 292286, 292690, 292431, 292216, 292255, 292198, 291788, 291214, 290637, 289626, 287454, 283926, 279637, 275343, 271286, 267209, 262842, 258207, 253547, 249104, 245001, 241267, 237963, 235197, 232906, 230640, 227818, 224333, 220789, 217939, 215990, 214584, 213338, 212176]
53755B12176j002q34o96n40l97m30p58j253j558j411j013q92j179j272n91N24
53739A98874J170J107R55J144J306J066O62M01J20k70l03K84Q24O59L59R85K343
53722B11686L072K570J747J519J547J132N32N46J220J787J837J839K367L354M222
53707B40977M532M258L622K863K180J765J769K143K604K836K769K597K572K814
53693B80301L221L458L182K477J841J579J318N71m25r07p01o21j366k441k660
53678B88827j667m62k15q68j320q89j34K4m02o20l02N3P1M3J72K9o05j025n47
53659B80163K37J40q85j647j374n49P0L50L51o3o72o55M15J782K369K060J542
53642B83634J223R58P02P69J269J870K169K037J543Q73M96R50K266L627L966K985
$$ y = [212176, 211174, 210340, 209644, 209104, 208707, 208277, 207519, 206266, 204708, 203297, 202284, 201392, 200213, 198941, 198350, 198874, 200044, 201151, 202106, 203250, 204556, 205622, 206284, 206685, 206805, 206535, 206232, 206516, 207340, 207999, 208358, 209343, 211686, 214758, 217328, 219075, 220594, 222141, 223273, 223805, 224351, 225571, 227358, 229195, 231034, 233401, 236755, 240977, 245509, 249767, 253389, 256252, 258432, 260197, 261966, 264109, 266713, 269549, 272318, 274915, 277487, 280301, 283522, 286980, 290162, 292639, 294480, 296059, 297377, 297948, 297523, 296616, 295915, 295294, 293928, 291487, 288827, 287160, 286698, 286483, 285615, 284295, 283406, 283272, 283296, 282894, 282274, 281972, 282025, 282096, 282139, 282311, 282340, 281735, 280710, 280163, 280400, 280540, 279655, 278008, 276634, 276085, 276155, 276505, 276856, 276793, 276121, 275466, 275881, 277663, 280032, 282092, 283634, 284857, 285815, 286517, 287286, 288555, 290425, 292594, 294631, 296174, 297047, 297543, 298493, 300759, 304386, 308352, 311337]
53626C11337J558R45J597K791L543L640L607L842M217M565N057N840O598O799
53612C65936O285N439M779M462M137L313K012R86J023J988K858K863K291J960
53598D10332K153K340J849O11p33j362r77r3M23J33p02j573k200k499k404j918
53582D03380j301r72j156j609j802j463r25p99j253j914k464k950l268k880j622
53567C77002l29Pm29n65L9P37Q36L68l12q88r18j21Q91J056L92K22J368K915L491
53548C85762L056K558K388K155J711J445J580J926K323K806L366L987M759N522
53534D25344N746N316N108O012P644Q852R370R990J1154J2300J2890J3171J3522
53521E46419J3818J3902J4126J4790J5587J6134J6741J8006J9858K1561K2657
$$ y = [311337, 312895, 313840, 315437, 318228, 321771, 325411, 329018, 332860, 337077, 341642, 346699, 352539, 359137, 365936, 372221, 377660, 382439, 386901, 391038, 394351, 396363, 397349, 398372, 400360, 403218, 406081, 408372, 410332, 412485, 414825, 416674, 417285, 416552, 415190, 414213, 414120, 414543, 414676, 413974, 412401, 410201, 407702, 405298, 403380, 402079, 401107, 399951, 398342, 396540, 395077, 394152, 393353, 392100, 390186, 387722, 384772, 381504, 378624, 377002, 376673, 376680, 376251, 375686, 375725, 376462, 377298, 377666, 377354, 376466, 375548, 375427, 376318, 377374, 377766, 377988, 379356, 382271, 385762, 388818, 391376, 393764, 395919, 397630, 399075, 400655, 402581, 404904, 407710, 411076, 415063, 419822, 425344, 431090, 436406, 441514, 447526, 455170, 464022, 473392, 483382, 494536, 506836, 519726, 532897, 546419, 560237, 574139, 588265, 603055, 618642, 634776, 651517, 669523, 689381, 710942, 733599]
53510G33599K3399K4178K4939K5353K5376K5351K5539K5769K5692K5324K5061
53499A009580K5113K5142K4699K3771K2715K1835K1244K0932K0662K0043J9099
53488A254835J8430J8396J8408J7768J6904J6867J7615J7862J6930J5732J5354
53477A445101J5522J5189J3959J2078R663O862M382K770J382r39m191p211r422
53464A505145j1438j3732j5777j7045j7912j8833j9438j9348j9224j9968k1223
53453A311207k1780k1367k1005k1460k2281k2689k2540k2050k1252k0262j9425
53442A075096j8733j7539j5445j3055j1143r567p606n288l455k598k215j558l45
53429I66549J353L414N551P308Q532R599J0875J2236J3336J4230J5390J7130J9201
$$ y = [733599, 756998, 781176, 806115, 831468, 856844, 882195, 907734, 933503, 959195, 984519, 1009580, 1034693, 1059835, 1084534, 1108305, 1131020, 1152855, 1174099, 1195031, 1215693, 1235736, 1254835, 1273265, 1291661, 1310069, 1327837, 1344741, 1361608, 1379223, 1397085, 1414015, 1429747, 1445101, 1460623, 1475812, 1489771, 1501849, 1511512, 1518374, 1522756, 1525526, 1526908, 1525969, 1521778, 1514567, 1505145, 1493707, 1479975, 1464198, 1447153, 1429241, 1410408, 1390970, 1371622, 1352398, 1332430, 1311207, 1289427, 1268060, 1247055, 1225595, 1203314, 1180625, 1158085, 1136035, 1114783, 1094521, 1075096, 1056363, 1038824, 1023379, 1010324, 999181, 989614, 982008, 976720, 973265, 970667, 968452, 966894, 966549, 967902, 971316, 976867, 984175, 992707, 1002306, 1013181, 1025417, 1038753, 1052983, 1068373, 1085503, 1104704]
53416A104704K1009K2261K3351K4967K7205K9288L0424L0782L1252L2376L4052
53405A411671L6135L8686M1398M3523M4765M5832M7550M9857N2161N4295N6536
53394A922409N8730O0185O0519O0161N9801N9685N9647N9445N8837N7437N4951
53383B571807N1567M7958M4753M2023L9314L6167L2556K8801K5185K1725J8170
53372B960026J4138R289L565k813r675j7103k5045l2904l9901m5812n0987n5551
53360B707227n9111o1382o2652o3280o3187o2222o0737n9291n7928n6241n4105
53349B047091n1964n0276m8984m7727m6369m5223m4677m4634m4360m3071m0706
53338A539100l7951l5400l2960l0215k7116k4034k1287j8893j6771j4904j3338
$$ y = [1104704, 1125713, 1147974, 1171325, 1196292, 1223497, 1252785, 1283209, 1313991, 1345243, 1377619, 1411671, 1447806, 1486492, 1527890, 1571413, 1616178, 1662010, 1709560, 1759417, 1811578, 1865873, 1922409, 1981139, 2041324, 2101843, 2162004, 2221805, 2281490, 2341137, 2400582, 2459419, 2516856, 2571807, 2623374, 2671332, 2716085, 2758108, 2797422, 2833589, 2866145, 2894946, 2920131, 2941856, 2960026, 2974164, 2983453, 2987018, 2984205, 2974530, 2957427, 2932382, 2899478, 2859577, 2813765, 2762778, 2707227, 2648116, 2586734, 2524082, 2460802, 2397615, 2335393, 2274656, 2215365, 2157437, 2101196, 2047091, 1995127, 1944851, 1895867, 1848140, 1801771, 1756548, 1711871, 1667237, 1622877, 1579806, 1539100, 1501149, 1465749, 1432789, 1402574, 1375458, 1351424, 1330137, 1311244, 1294473, 1279569, 1266231]
53327A266231j2144j1324j0718j0111r569r443r848j0330j0299r684q870q061
53315A145830p053n662m085k661j423q5J582L426N083O360P372Q281R088R860
53301A175913J0940J2712J5142J7801K0258K2259K3633K4395K4910K5609K6548
53290A400120K7498K8330K8932K8846K7655K5744K4044K2893K1687J9851J7500
53279A673100J4962J2281R539O992M458J240k829o871j0006j2362j4580j6888
53267A659036j9332k2198k5393k7899k8902k9114l0025l1954l3821l4716l4819
53256A340863l4686l4550l4472l4456l4222l3421l2208l1110l0288k9514k8787
53245I83149k8333k7995k7342k6396k5534k4694k3465k2061k1265k1108k0552
$$ y = [1266231, 1254087, 1242763, 1232045, 1221934, 1212365, 1202922, 1193074, 1182744, 1172445, 1162761, 1153891, 1145830, 1138777, 1133115, 1129030, 1126369, 1124946, 1124861, 1126443, 1129869, 1134952, 1141312, 1148684, 1156965, 1166053, 1175913, 1186853, 1199565, 1214707, 1232508, 1252766, 1275025, 1298658, 1323053, 1347963, 1373572, 1400120, 1427618, 1455948, 1484880, 1513726, 1541381, 1567125, 1591169, 1614062, 1635749, 1655600, 1673100, 1688062, 1700343, 1709882, 1716874, 1721332, 1722572, 1719743, 1712872, 1702866, 1690504, 1675924, 1659036, 1639704, 1617506, 1592113, 1564214, 1535312, 1506198, 1476173, 1444219, 1410398, 1375682, 1340863, 1306177, 1271627, 1237155, 1202699, 1168477, 1135056, 1102848, 1071738, 1041450, 1011936, 983149, 954816, 926821, 899479, 873083, 847549, 822855, 799390, 777329, 756064, 734956, 714404]
53234G14404j8873j6664j4929j3828j2863j1741j0493r159p930p277p423p943
53222E75281q282q378q460q637r087j0197j1945j3472j3837j3070j1970j1035
53210D46911j0128r111q170p460o835o184n661n432n449n607n952o543p249p818
53196C49312q047p811p017n766m543l978m219m659m518l699k798k341k270k332
53182B85314k473k664k651k312j998k106k488k704k692k670k575k145j537j262
53168B53037j335j148m12K64J88m30p94o65o44j219k016k230j694j053q69r32
53152B38048p87n94q71j471j547p22L76J035J231J091L94p40j323o22O33J073
53136B35204M57k69m15r7M75J200J599J181L98L26J183J994J946J211L01n29r80
$$ y = [714404, 695531, 678867, 663938, 650110, 637247, 625506, 615013, 605854, 597924, 590647, 583224, 575281, 566999, 558621, 550161, 541524, 532437, 522240, 510295, 496823, 482986, 469916, 457946, 446911, 436783, 427672, 419502, 412042, 405207, 399023, 393362, 387930, 382481, 376874, 370922, 364379, 357130, 349312, 341265, 333454, 326437, 320671, 316128, 312150, 307931, 303272, 298754, 295055, 292257, 289916, 287646, 285314, 282841, 280177, 277526, 275214, 273216, 271110, 268622, 265918, 263226, 260556, 257981, 255836, 254299, 253037, 251702, 250554, 250142, 250406, 250594, 250164, 249370, 248705, 248061, 246842, 244826, 242596, 240902, 239849, 238980, 238048, 237261, 236667, 235796, 234325, 232778, 232056, 232432, 233467, 234698, 235789, 236183, 235443, 234120, 233498, 234131, 235204, 235661, 235392, 234977, 234880, 235355, 236555, 238154, 239335, 239733, 240059, 241242, 243236, 245182, 246393, 246694, 246165, 245185]
53119B45185p37q3K82K94N46J065J099N09K45Q18J284O05p91j646j495q74l64
53102B45942k20n17j055j367j307j199j143p98k72l67j287j929j296%O49M29J50
53085B34413K01K54J10r4m17r46j253r14l41k50m26k8Q86J254N42m94r91j029
53067B30477j104j201j004o19m95q06j272j537j543j470j452j326q50j00N46Q90
53051B17134J078J168R74O07O37J228J614J049n2o53n57n51j115j793j947j531
53035B17290q77k62J12J62J57N67J457K247K276J438K14p53j079q21l03K13O83
53018B22721J099J357J405J301J091Q38P32Q14N93m12j642j792n28Q55J076M56
53002B29964R9K01J47j60j96J20K82J63K17O18R63J016J018J094R88N63O9k90
$$ y = [245185, 244448, 244365, 244647, 244941, 245487, 246552, 247651, 248160, 248405, 249223, 250507, 251112, 250321, 248675, 247180, 246306, 245942, 245722, 245205, 244150, 242783, 241476, 240277, 239134, 238336, 238064, 237697, 236410, 234481, 233185, 233185, 233834, 234263, 234413, 234614, 234868, 234978, 234884, 234467, 233521, 232268, 231354, 231013, 230763, 230337, 230309, 231195, 232449, 232991, 232497, 231506, 230477, 229373, 228172, 227168, 226549, 226054, 225248, 223976, 222439, 220896, 219426, 217974, 216648, 215798, 215698, 216244, 217134, 218212, 219380, 220354, 220961, 221598, 222826, 224440, 225489, 225437, 224784, 224227, 223676, 222561, 220768, 218821, 217290, 216413, 216151, 216263, 216425, 216582, 217149, 218606, 220853, 223129, 224567, 224781, 224028, 222949, 222128, 221825, 222038, 222721, 223820, 225177, 226582, 227883, 228974, 229812, 230544, 231358, 231951, 231539, 229897, 228105, 227577, 228432, 229508, 229964, 230063, 230264, 230411, 230251, 230055, 230175, 230457, 230620, 230837, 231455, 232418, 233434, 234452, 235546, 236534, 237097, 237166, 236876]
52984B36876n78q04p74l79K87J043J588J488O69k21m80j94P2K76R20K117L242
52967B45148L590K959J627K50l84p4M64M96K51L52N69N2j283k523k927k560j759
52950B44248q85o11j396k549k732j738q10q58j274j070l25J78J55k4k4J59L76
52933B30820N01N59P13Q88N88l67j141p69L45P62j5r72j210j059j079j041n70
52916B26953M6M16O79R23P15j25r30j119r91r33n58M56J332J077po59k98N73J365
52897B28915J880J950J448O54l9p23j609k250j941q42O2K13K6P9L64N19L26j50
52879B28882o08o52k42J16qk49R1R38J431J150P42R84J734K217K122J920K075
52862B42643K381K267J641R56M88n6q41j323j010n10q48j804j964q72L6o43k296
$$ y = [236876, 236298, 235494, 234720, 234341, 234628, 235671, 237259, 238747, 239416, 239195, 238715, 238521, 238593, 238869, 239789, 241906, 245148, 248738, 251697, 253324, 253574, 253190, 253116, 253580, 254076, 254327, 254679, 255248, 255300, 254017, 251494, 248567, 246007, 244248, 243363, 242752, 241356, 238807, 236075, 234337, 233527, 232669, 231395, 230325, 230000, 230178, 230333, 230309, 230285, 230444, 230820, 231321, 231880, 232593, 233481, 234069, 233702, 232561, 231792, 232137, 232899, 232884, 231912, 230702, 229643, 228564, 227523, 226953, 226999, 227415, 228094, 229017, 229732, 229607, 228677, 227558, 226567, 225634, 225076, 225532, 226864, 227941, 227934, 227275, 226977, 227550, 228915, 230795, 232745, 234193, 234847, 234808, 234085, 232476, 230226, 228285, 227443, 227505, 227718, 227744, 227823, 228187, 228706, 229032, 228882, 228274, 227622, 227380, 227496, 227488, 227239, 227330, 228268, 229699, 230849, 231591, 232575, 234309, 236526, 238648, 240568, 242643, 245024, 247291, 248932, 249888, 250376, 250320, 249479, 248156, 247146, 246636, 245788, 243984, 242020, 241148, 241184, 240541, 238245]
52845B38245l255l135k937l154l052k031o75O9P8r0j04j55n05j027j268r35k75
52828B15794J87L00L41L77O1o04r27m95J9k36r34r56k5R70J292J186J197J378
52810B18925J559J752J928J769J058N4p28r99q54o60q08j299j645j442r87r45
52794B16678j406j788j680j330j132j122j148j155j024n15M19J457K167K317J867
52779B12605R65jo91j146j534j584p91P14K016K351J839J072M41J09J67L79J93
52762B17104n59j179r12lN69L70k5L1M26O35N55N67Q69J145R86M29j10l16j82
52743B20400K10P80J292J367R52N58P18J311J732J743J744K081K449K228J281
52728B40846J57n11n98n20o78r89j037o58l09n81j452k198k169j466p55m75m47
$$ y = [238245, 234990, 231855, 228918, 225764, 222712, 220681, 220006, 220075, 220153, 220063, 219959, 219804, 219299, 218272, 217004, 216069, 215794, 215981, 216281, 216622, 216999, 217060, 216456, 215529, 215034, 215053, 214817, 213883, 212927, 212902, 213872, 215164, 216350, 217547, 218925, 220484, 222236, 224164, 225933, 226991, 227045, 226317, 225318, 224464, 223804, 222996, 221697, 220052, 218610, 217623, 216678, 215272, 213484, 211804, 210474, 209342, 208220, 207072, 205917, 204893, 204378, 204797, 206254, 208421, 210738, 212605, 213570, 213569, 212878, 211732, 210198, 208614, 207823, 208537, 210553, 212904, 214743, 215815, 216256, 216365, 216532, 216911, 217104, 216545, 215366, 214454, 214451, 215020, 215390, 215365, 215396, 215822, 216457, 217012, 217579, 218448, 219593, 220579, 221008, 220898, 220582, 220400, 220610, 221390, 222682, 224049, 225001, 225559, 226277, 227588, 229320, 231063, 232807, 234888, 237337, 239565, 240846, 241003, 240492, 239894, 239374, 238696, 237707, 236670, 236012, 235703, 235122, 233670, 231472, 229303, 227837, 227082, 226607, 226160]
52711B26160k38K12M81J77n33j077j061o05J0O54J292J715J635R99Q0o96r78p29
52693B27498l33l22p07q62l15N35R44Q88J062J701K030J357K32j18N29R61O3j642
52675B33501k531j836m82J50j47m38J7R59J653J718J307Q03M94L43Qo83j254r78
52657B32604J48J286J807K015K448K913K767J907R06J89m15j186j997k401k074
52642B40917j120q0L88M4o91j170j161r01o86n57l42J67J024J921K388K299K037
52625B44477J906J642Q37l62j328j621j270n37K37O09K76n34j229j370q39K65
52609B41159J508K026J192m39j403q73L88R54L62n91j000q16n43l56J9P03J321
52592B43611J447J123O96L66J75K23N03O39K63l51m97O2Q53J420J693J603R58
$$ y = [226160, 225922, 226134, 226615, 226792, 226259, 225182, 224121, 223516, 223526, 224180, 225472, 227187, 228822, 229821, 229901, 229205, 228227, 227498, 227165, 226843, 226136, 225274, 224959, 225494, 226438, 227326, 228388, 230089, 232119, 233476, 233708, 233590, 234119, 235080, 235143, 233501, 230970, 229134, 228652, 228802, 228655, 228217, 228234, 229193, 230846, 232564, 233871, 234674, 235168, 235511, 235519, 234836, 233582, 232604, 232752, 234038, 235845, 237860, 240308, 243221, 245988, 247895, 248801, 248990, 248575, 247389, 245392, 242991, 240917, 239797, 239717, 240105, 240149, 239458, 238288, 237127, 236226, 235540, 234983, 234641, 234808, 235832, 237753, 240141, 242440, 244477, 246383, 248025, 248862, 248500, 247172, 245551, 244281, 243744, 243981, 244590, 244866, 244332, 243103, 241733, 240894, 241159, 242667, 244693, 245885, 245446, 244043, 243170, 243558, 244512, 244874, 244283, 243283, 242467, 241924, 241568, 241587, 242290, 243611, 245058, 246181, 246877, 247243, 247418, 247641, 248144, 248783, 249046, 248695, 248198, 248260, 249113, 250533, 252226, 253829, 254787]
52575B54787n0q15j100j260j378r55J01R41Q66L21N9k6m29r45j013p51o58n47
52557B47148P3Q02O86k54r29q28o80j116j626j399n25K27M04J83m6j23k17n65
52539B41215r47p59O8O29J96n40l28P46J344Q76L04N73J291J481Q85j6o53o50
52521B45715j2O12M98m4O1J013J645J120K43L20J400K475K928K874K506J955J579
52504B66888J620J610Q42n59j652j843j520j401j639j815j634j359j454j843j875
52489B52366j243n95p45j444j644r24O6O62R50J254J532J699J903K153K114J592
52473B59696P56k46j281j751r60P79K205K653K683K803K599J782J067J167J660
52458B75612J790J574J258M42j174k796l478l563l983m579m366l224k033j251
$$ y = [254787, 254737, 253922, 252822, 251562, 250184, 249229, 249330, 250271, 251137, 251458, 251517, 251491, 251062, 250117, 249104, 248353, 247695, 247148, 247221, 248023, 248709, 248455, 247526, 246698, 246018, 244902, 243276, 241877, 241352, 241579, 241983, 242166, 242120, 241997, 241780, 241215, 240268, 239509, 239577, 240206, 240402, 239862, 239534, 240280, 241624, 242500, 242804, 243377, 244668, 246149, 247034, 247018, 246365, 245715, 245703, 246315, 246813, 246769, 246830, 247843, 249488, 250608, 250851, 251171, 252571, 255046, 257974, 260848, 263354, 265309, 266888, 268508, 270118, 270960, 270401, 268749, 266906, 265386, 263985, 262346, 260531, 258897, 257538, 256084, 254241, 252366, 251123, 250528, 249783, 248339, 246695, 245771, 245837, 246499, 247449, 248703, 250235, 251934, 253837, 255990, 258104, 259696, 260452, 260206, 258925, 257174, 256214, 256993, 259198, 261851, 264534, 267337, 269936, 271718, 272785, 273952, 275612, 277402, 278976, 280234, 280676, 279502, 276706, 273228, 269665, 265682, 261103, 256737, 253513, 251480, 250229]
52444B50229n72j8j34q54j310j015l96J07N35Q32N81k22r17r94o08n0N85J056
52426B46835R82M68J20K02L67M48Q26J616K228K150J681J438J592J993K686L814
52410B69446N271O784Q180R285R854R764R101P873N873L041k46l345n651o810
52396C28420o904o510o207n968n332m190k988k112j554j268j384j806k013j570
52382B78614o46K36P65J020J234J600K137K648K914K923K850K829K882L007L151
52367C08164L242L317L464L393K560R92l29n16J01M88K82k5q0k5P3L76P55Q62
52349C27094Q10J078J619J850J671J707K261K806K989L308M317N653O534O729
52335C70426O611O545O687P102P720Q433R361J0695J2157J3159J3698J4468J5757
$$ y = [250229, 249657, 249639, 249505, 248651, 247341, 246326, 245930, 246037, 246572, 247404, 247985, 247763, 246846, 245852, 245244, 245194, 245779, 246835, 247817, 248285, 248405, 248607, 248974, 249422, 250248, 251864, 254092, 256242, 257923, 259361, 260953, 262946, 265632, 269446, 274717, 281501, 289681, 298966, 308820, 318584, 327685, 335558, 341431, 344472, 344226, 340881, 335230, 328420, 321516, 315006, 308799, 302831, 297499, 293309, 290321, 288209, 286655, 285387, 284003, 282197, 280184, 278614, 277968, 278204, 278969, 279989, 281223, 282823, 284960, 287608, 290522, 293445, 296295, 299124, 302006, 305013, 308164, 311406, 314723, 318187, 321580, 324140, 325132, 324803, 324287, 324388, 324876, 325158, 325133, 325053, 325028, 325101, 325477, 326232, 327094, 327904, 328982, 330601, 332451, 334122, 335829, 338090, 340896, 343885, 347193, 351510, 357163, 363697, 370426, 377037, 383582, 390269, 397371, 405091, 413524, 422885, 433580, 445737, 458896, 472594, 487062, 502819]
52322E02819J6908J7278J7158J7205J7472J7608J7552J7459J7298J7077J7095
52311F92929J7439J7520J6727J5273J3911J3043J2632J2569J2640J2368J1469
52300H48520J0279R237Q254P083N952N056L843J627j213l472m653n410o374p312
52286H71417p723p612p241o617n631m445l370k546j883j233l97Q00K343M053N810
52271H35725P563R171J0389J1092J1346J1329J1252J1247J1208J0950J0673J0969
52259I62914J1965J2855J2779J1904J1094J0634J0044R093Q152P326O015L853
52247A078628J442l50j526k820m713p056r454j1494j2704j2816j2235j1821j2070
52234I81011j2682j3121j3228j3107j2652j1616j0109q690p722o979o092n179
$$ y = [502819, 519727, 537005, 554163, 571368, 588840, 606448, 624000, 641459, 658757, 675834, 692929, 710368, 727888, 744615, 759888, 773799, 786842, 799474, 812043, 824683, 837051, 848520, 858799, 868036, 876290, 883373, 889325, 894381, 898224, 899851, 898638, 895166, 890513, 885103, 878729, 871417, 863694, 856082, 848841, 842224, 836593, 832148, 828778, 826232, 824349, 823116, 822719, 823519, 825862, 829915, 835725, 843288, 852459, 862848, 873940, 885286, 896615, 907867, 919114, 930322, 941272, 951945, 962914, 974879, 987734, 1000513, 1012417, 1023511, 1034145, 1044189, 1053282, 1061434, 1068760, 1074775, 1078628, 1080070, 1079720, 1078194, 1075374, 1070661, 1063605, 1054151, 1042657, 1029953, 1017137, 1004902, 993081, 981011, 968329, 955208, 941980, 928873, 916221, 904605, 894496, 885806, 878084, 871105, 865013, 859834]
52222H59834m621m289l591k347j158n27r4Q05K087L052L400L595M091M732N088
52207H70057M957M360L418K452J961K178K777L190L158K916K905L388M138M548
52193I16403M265L628L292L361L320K839K171J614J022J38r65k191l754n742p586
52178I21815q514q446p899p165o155n059m465m574m794m460l516k297j054l1M43
52163H53829M42O91J735L079L720L474L115L200L394L172K596K017J515J026O59
52148H87664M24lp48j258q30M51J821K774L342L564L294K708K417K747L363L869
52132I15599M403N289O466P760R426J1910J5055J8038K0227K1780K3255K4860
52120A084068K6299K7195K7445K7233K6792K6271K5651K4734K3240K1117J8716
$$ y = [859834, 855213, 850924, 847333, 844986, 843828, 843301, 843207, 844012, 846099, 849151, 852551, 856146, 860237, 864969, 870057, 875014, 879374, 882792, 885244, 887205, 889383, 892160, 895350, 898508, 901424, 904329, 907717, 911855, 916403, 920668, 924296, 927588, 930949, 934269, 937108, 939279, 940893, 941915, 942053, 941088, 938897, 935143, 929401, 921815, 913301, 904855, 896956, 889791, 883636, 878577, 874112, 869538, 864744, 860284, 856768, 854471, 853417, 853386, 853829, 854271, 854962, 856697, 859776, 863496, 866970, 870085, 873285, 876679, 879851, 882447, 884464, 885979, 887005, 887664, 888088, 888085, 887337, 886079, 885249, 885700, 887521, 890295, 893637, 897201, 900495, 903203, 905620, 908367, 911730, 915599, 920002, 925291, 931757, 939517, 948943, 960853, 975908, 993946, 1014173, 1035953, 1059208, 1084068, 1110367, 1137562, 1165007, 1192240, 1219032, 1245303, 1270954, 1295688, 1318928, 1340045, 1358761]
52109A358761J6541J4740J3015J1107R112P159N100K882R45k29q61j627k727l798
52095A430120m821o357q628j0995j2818j4313j5947j7472j8236j8232j8025j7718
52083A266558j6701j4620j1952r373o994m526j922M87K399L856N176O677Q434
52070A227499J0247J1816J2919J3388J3191J2649J2407J2831J3504J3596J2737
52059A366784J1319R998R129Q630Q152P286N879M172K510Q65j105l605o440r188
52045A414386j1441j3033j4230j5636j7552j9498k0685k0849k0307j9315j7917
52034A223923j6395j5224j4381j3299j1793j0574j0372j0948j1509j1736j1902
52023A085790j2148j2265j2182j2131j2152j1861j0902r413p893o791o316o436
$$ y = [1358761, 1375302, 1390042, 1403057, 1414164, 1423276, 1430435, 1435535, 1438417, 1439362, 1439133, 1438272, 1436645, 1433918, 1430120, 1425299, 1418942, 1410314, 1399319, 1386501, 1372188, 1356241, 1338769, 1320533, 1302301, 1284276, 1266558, 1249857, 1235237, 1223285, 1213912, 1206918, 1202392, 1200470, 1200957, 1203356, 1207212, 1212388, 1219065, 1227499, 1237746, 1249562, 1262481, 1275869, 1289060, 1301709, 1314116, 1326947, 1340451, 1354047, 1366784, 1378103, 1388101, 1397230, 1405860, 1414012, 1421298, 1427177, 1431349, 1433859, 1434724, 1433619, 1430014, 1423574, 1414386, 1402945, 1389912, 1375682, 1360046, 1342494, 1322996, 1302311, 1281462, 1261155, 1241840, 1223923, 1207528, 1192304, 1177923, 1164624, 1152831, 1142257, 1131885, 1120937, 1109428, 1097692, 1085790, 1073642, 1061377, 1049195, 1037064, 1024912, 1013051, 1002149, 992736, 984843, 978052, 971736, 965300]
52011I65300o923p536q263r198j0174j0792j0947j1097j1741j2784j3683j4178
51999H37984j4482j4708j4461j3322j1528r817q644p876p360p392q286r609j0300
51986G00199r729q438p666q138r485j0852j1883j2844j3877j4455j3971j2622
51974E66239j1305j0469r604q056n991m094k576j057O68K348L808N209O518P215
51960E38853O847N581L902K090L37r73j625k064l017m559n973o608o432n737m673
51945E15949l322j828k04J784M232O752Q825J0395J1785J3050J3727J3356J2042
51932F06543J0344Q721P214N580L643J439q09k823m327n043m825l819k440j074
51918F18324J60J195J617P14j851n552r314j2303j4353j5618j6053j5356j3420
$$ y = [965300, 958377, 950841, 942578, 933380, 923206, 912414, 901467, 890370, 878629, 865845, 852162, 837984, 823502, 808794, 794333, 781011, 769483, 759666, 751022, 743146, 735786, 728394, 720108, 710499, 700199, 690470, 682032, 674366, 666228, 656743, 645891, 634008, 621164, 607287, 592832, 578861, 566239, 554934, 544465, 534861, 526805, 520814, 516720, 514144, 513087, 513755, 516103, 519911, 525120, 531638, 538853, 545700, 551281, 555183, 557273, 557610, 556637, 555012, 552948, 549931, 545372, 539399, 532791, 526359, 520622, 515949, 512627, 510799, 510595, 512379, 516611, 523363, 532188, 542583, 554368, 567418, 581145, 594501, 606543, 616887, 625608, 632822, 638402, 642045, 643484, 642675, 639852, 635525, 630482, 625657, 621838, 619398, 618324, 618484, 619679, 621296, 622010, 620159, 614607, 605293, 592990, 578637, 563019, 546966, 531610, 518190]
51905E18190j0668p856n478l516j771l06O29R94R98P18j30j795m079o435q384
51890D71111r682j0189r807q642p088n715m944m666m121k448M07L459N619O692
51876D19986P270P801Q166Q102P628O958O253N483M390K632K77j995l500m351
51862D75100n159n961o048n041l565k474j825j030K42J716K853L178K485J060
51848D55531m31j557k446l345m119m570m870n278n629n575n165m715m235l461
51834D00135k427j495q39l54j2Q8Q8K84O05O39K70j91o24j303k242k837k521j502
51816C85762n06N8L50P73J544K449K872K288R25l03p27n63n09r52j755k493k642
51799C86571j869n20M12K12p58j546j728j615j534j418j186j013j005r61o97l18
$$ y = [518190, 507522, 499666, 494188, 490672, 488901, 488595, 489224, 490218, 491216, 491934, 491804, 490009, 485930, 479495, 471111, 461429, 451240, 441433, 432791, 425703, 419988, 415044, 410378, 406257, 403809, 404216, 407675, 413294, 419986, 427256, 435057, 443223, 451325, 458953, 465911, 472164, 477647, 482037, 484669, 484946, 482951, 479451, 475100, 469941, 463980, 457932, 452891, 449326, 446852, 445027, 443997, 444239, 445955, 448808, 451986, 454471, 455531, 455100, 453543, 451097, 447752, 443633, 439063, 434193, 428915, 423286, 417711, 412546, 407831, 403596, 400135, 397708, 396213, 395374, 395020, 395008, 395096, 395184, 395468, 396073, 396712, 396982, 396791, 396167, 394864, 392622, 389785, 387264, 385762, 385256, 385314, 385664, 386437, 387981, 390430, 393302, 395590, 396515, 396212, 395485, 394922, 394413, 393461, 391706, 389213, 386571, 384702, 384182, 384594, 384806, 384048, 382502, 380774, 379159, 377625, 376207, 375021, 374008, 373003, 372042, 371345, 371027]
51783C71027LK90N76O95N24K76K62N05Q52J327K070K930L508L772M236N346O927
51766D05126Q404R433R967R939R219P803N723K878o14l956o114o996p645q885
51752D34282j0163j0282r028p453o495n948n051l652k345j600j149k92J353L489
51738C75666N460O840P637Q044Q089P636O595N033L233J656P30N20O94R20J124
51723D39877J255J016J30j281k799m053m724m475l281j819j005j100j525j639
51709D14577j315p41jQ69J759K624L530M361M609L744J793m85k011k090q35R66
51693D31354K500L365L450K682J199n06k005l404m924o184o446n660m696m244
51679D06481m012l322k034n54P97J923K683K944K875K881L196L766M430N049N500
$$ y = [371027, 371030, 371320, 371896, 372591, 373115, 373391, 373653, 374158, 375010, 376337, 378407, 381337, 384845, 388617, 392853, 398199, 405126, 413530, 422963, 432930, 442869, 452088, 459891, 465614, 468492, 467878, 463922, 457808, 450812, 443167, 434282, 424119, 413837, 404809, 397356, 390861, 384913, 379862, 376210, 373865, 372265, 371116, 370824, 372177, 375666, 381126, 387966, 395603, 403647, 411736, 419372, 425967, 431000, 434233, 435889, 436619, 437139, 437833, 438753, 439877, 441132, 442148, 442278, 440997, 438198, 434145, 429421, 424946, 421665, 419846, 418841, 417741, 416216, 414577, 413262, 412521, 412520, 413389, 415148, 417772, 421302, 425663, 430272, 434016, 435809, 435324, 433313, 431223, 430388, 431354, 433854, 437219, 440669, 443351, 444550, 444044, 442039, 438635, 433711, 427527, 421081, 415421, 410725, 406481, 402469, 399147, 397113, 396559, 397356, 399279, 401962, 404906, 407781, 410662, 413858, 417624, 422054, 427103, 432603]
51664D32603N646N349M458K947J125m51j436j930k139j922q90J065L475N547O696
51649D60143O838O127M436J424k718o866r767j1121j1534j1447j0763r470q024
51636C97258o784n563m090k546j277l44L21O08M52J64J88O25J228J674J638Q80
51620C84432m07j519j852j549j321j746k744l642l666k710j595j238j512j456
51606C57475o57K12N33O53J176K011K802L762N267O928P948Q169Q053P687O557
51591D18576M360J506j292l479m783n334n500n227l822j010K192M445N769P321
51577D13722R603J1868J3465J4667J5798J6505J6438J6002J5731J5396J4349J2398
51565E85942R953P700O548P418J0492J4913J9630K4350K9171L3618L6509L6801
$$ y = [432603, 438249, 443598, 448056, 451003, 452128, 451677, 450241, 448311, 446172, 444250, 443360, 444425, 447900, 453447, 460143, 466981, 473108, 477544, 478968, 476250, 469384, 459617, 448496, 436962, 425515, 414752, 405282, 397258, 390474, 384911, 380821, 378275, 376998, 376654, 376975, 377583, 378035, 378199, 378387, 379012, 380240, 381914, 383552, 384432, 384025, 382506, 380654, 379105, 377784, 376038, 373294, 369652, 365986, 363276, 361681, 360443, 358931, 357475, 356818, 357030, 357563, 358216, 359392, 361403, 364205, 367967, 373234, 380162, 388110, 396279, 404332, 412019, 418576, 422936, 424442, 423150, 419671, 414888, 409554, 404054, 398827, 395005, 393995, 396187, 400632, 406401, 413722, 423325, 435193, 448658, 463325, 479123, 495628, 512066, 528068, 543799, 559195, 573544, 585942, 595895, 603595, 610143, 617561, 628053, 642966, 662596, 686946, 716117, 749735, 786244, 823045]
51553H23045L4216K9287K3057J6647J0646M864j171p626j4255k0617k6192l0503
51541H41398l3484l5461l6570l6438l4776l2018k9038k6301k3687k1007j8340
51530E14278j5875j3682j1738r940q133o242m385k799j606p20P2R07J559J491
51516D43187M47j030k128k761l582m839n784n619m548l509l174l603m498n272
51502C93287n195m147l025k736k887k262o14P67O17p17j766j647q11k12j38l4
51486C68480O61J641J890Q05j015k339k619k383k345k522k451k011j669j898k563
51471C49662l010k754k011j446j391j535j451j178r60o85k5Q66J349J143P89R66
51455C38329J625K154K259K239K495L071L843M863O312Q160J0105J1841J3267
$$ y = [823045, 857261, 886548, 909605, 926252, 936898, 941762, 940591, 932965, 918710, 898093, 871901, 841398, 807914, 772453, 735883, 699445, 664669, 632651, 603613, 577312, 553625, 532618, 514278, 498403, 484721, 472983, 463043, 454910, 448668, 444283, 441484, 439878, 439158, 439230, 440137, 441696, 443187, 443634, 442604, 440476, 437715, 434133, 429294, 423510, 417891, 413343, 409834, 406660, 403057, 398559, 393287, 388092, 383945, 380920, 378184, 375297, 373035, 372421, 373188, 373805, 373088, 371322, 369675, 368864, 368652, 368514, 368480, 369141, 370782, 372672, 373477, 372462, 370123, 367504, 365121, 362776, 360254, 357803, 355792, 354123, 352225, 349662, 346652, 343898, 341887, 340441, 339050, 337515, 336064, 334886, 333926, 333241, 333216, 334082, 335431, 336574, 337363, 338329, 339954, 342108, 344367, 346606, 349101, 352172, 356015, 360878, 367190, 375350, 385455, 397296, 410563]
51442D10563J4333J4754J4001J1680Q000L917P24q15j064j163j885l017m042n120
51428D60866o840r086j0799j1105j0137q520o600m592k991k087j391k70J056J779
51414C89283J724J604J900K157J693N51n84j137j084q48q76j105r79k24N32N10
51398C93117J6J91J394K654L085L087L586M679N785O652P540Q649J0081J2166
51384D62682J5164J8707K2153K5426K8948L2848L6777M0507M4021M6974M8616
51373H22823M8383M6101M1662L5176K7473J9753J2404M815l391j1605j9129k6143
51361I98322l3091l9510m4217m6540m6772m5563m3380m0631l7667l4513l0869
51350E55569k6658k2402j8890j6537j5076j3831j2341j0709r369q498p859p166
$$ y = [410563, 424896, 439650, 453651, 465331, 473331, 477248, 477972, 477157, 476093, 474930, 473045, 470028, 465986, 460866, 454026, 444940, 434141, 423036, 412899, 404379, 397779, 393187, 390196, 388109, 386718, 386448, 387504, 389283, 391007, 392611, 394511, 396668, 398361, 398912, 398328, 397191, 396107, 395259, 394383, 393278, 392299, 392075, 392607, 393117, 393133, 393324, 394718, 397372, 400457, 403544, 407130, 411809, 417594, 424246, 431786, 440435, 450516, 462682, 477846, 496553, 518706, 544132, 573080, 605928, 642705, 683212, 727233, 774207, 822823, 871206, 917307, 958969, 994145, 1021618, 1041371, 1053775, 1058590, 1055199, 1043594, 1024465, 998322, 965231, 925721, 881504, 834964, 788192, 742629, 699249, 658618, 620951, 586438, 555569, 528911, 506509, 487619, 471082, 456006, 442175, 429834, 419125, 409756, 401258, 393399, 386233]
51338C86233o274n043l387j755j045j639k802l460l399l172l068k766k023j116
51324C45284m04J10N98J116J635K124K435K430K274K355K712K835K239J021k76
51309C68488j200j572j400r07n38p00j452k453l195l279k655j736j138j136j426
51294C43701j473j077n10k01l15o30q16q00p23m76M15K158M070N100M994M509
51278C57926M347M280L603K171O65n9K86J235J953J963J567J469J911K424K476
51263C88217K075J565J064M25m61j456k265k638k592k464k490k399j778q67n20
51248C73416j141k080k487k321k139k153k115j915j770j757j670j388j111j057
51234C48312j182j241j046o17j85N4J82M60Q50R81O77K57O3J9n1N2O27J520K296
$$ y = [386233, 379959, 374916, 371529, 369774, 368729, 367090, 364288, 360828, 357429, 354257, 351189, 348423, 346400, 345284, 344880, 344990, 345588, 346704, 348339, 350463, 352898, 355328, 357602, 359957, 362669, 365504, 367743, 368764, 368488, 367288, 365716, 364316, 363409, 362871, 362171, 360719, 358266, 355071, 351792, 349137, 347401, 346263, 345127, 343701, 342228, 341151, 340641, 340440, 340125, 339495, 338679, 337879, 337156, 336680, 337095, 339253, 343323, 348423, 353417, 357926, 362273, 366553, 370156, 372327, 372992, 372933, 373219, 374454, 376407, 378370, 379937, 381406, 383317, 385741, 388217, 390292, 391857, 392921, 393346, 392885, 391429, 389164, 386526, 383934, 381470, 378980, 376581, 374803, 373936, 373416, 372275, 370195, 367708, 365387, 363248, 361095, 358980, 357065, 355295, 353538, 351868, 350480, 349369, 348312, 347130, 345889, 344843, 344226, 344041, 344095, 344277, 344737, 345587, 346568, 347245, 347502, 347565, 347584, 347533, 347585, 348212, 349732, 352028]
51215C52028K811L214L501L449L023K477K055J868J892J892J451M93m15n87K0
51200C79172Q47J323J128K06r97j614j265p06r71k000k739k525j692q35j89J85
51184C67328K83L42O73J160J437J490J488J178K11q78j012j10O61N28R0J88O05
51167C75662O22K24k2K00Q50J874L005L628L416K800K320J841R76j78j209k011
51151C93998k633k910k806k793l202l538l190k445k103k260k367k287k388k595
51137C56481k295j370m96j35J6L05N69P29J213K269L321L638L322L034K982K788
51121C76371K338K131K595L419L970M053L968L841L395K433J269L32l64r61j155
51106D07635m60Q86J905J995J579J338J280J033N71J20l73r84j258n95Q15J942
$$ y = [352028, 354839, 358053, 361554, 365003, 368026, 370503, 372558, 374426, 376318, 378210, 379661, 380154, 379739, 379152, 379172, 380019, 381342, 382470, 382676, 381679, 380065, 378800, 378094, 377123, 375123, 372384, 369859, 368167, 367332, 367143, 367328, 367611, 367953, 368626, 369786, 371223, 372713, 374201, 375379, 375590, 374712, 373700, 373590, 374251, 374779, 374869, 375057, 375662, 376284, 376508, 376486, 376686, 377536, 379410, 382415, 386043, 389459, 392259, 394579, 396420, 397396, 397218, 396009, 393998, 391365, 388455, 385649, 382856, 379654, 376116, 372926, 370481, 368378, 366118, 363751, 361464, 359076, 356481, 354186, 352816, 352320, 352185, 352201, 352506, 353075, 353804, 355017, 357286, 360607, 364245, 367567, 370601, 373583, 376371, 378709, 380840, 383435, 386854, 390824, 394877, 398845, 402686, 406081, 408514, 409783, 410115, 409751, 408790, 407635, 407175, 408061, 409966, 411961, 413540, 414878, 416158, 417191, 417762, 417882, 417509, 416525, 415267, 414672, 415487, 417429]
51090D17429K081J546J103J011Q51J98p26j155o67J15J40o95j338j004k02K19
51074D18906M34J204K407L009K530J725J611K506M165O158P922R086J0050J1712
51060D83425J4290J6832J8176J7969J6549J4400J2110J0540J0391J1658J3633
51049F39973J5413J6308J5974J4412J1809Q380M409L06l586p064r800j1291j1482
51036F83761j1120j1022j1216j1420j1972j3376j5075j5743j4962j3598j2345
51025E41912j0934r095p262n663l766j378N56J244J385K181L487M160L958L914
51011E24699M774O072O979P322P474P796Q473R440J0358J0916J1241J1671J2111
50998F39326J2079J1313J0084Q837P851P162O488N402L912K705K362K555K527
$$ y = [417429, 419510, 421056, 422159, 423170, 424021, 424219, 423493, 422338, 421671, 421786, 421926, 421231, 419893, 418889, 418687, 418906, 419340, 420544, 422951, 425960, 428490, 430215, 431826, 434332, 438497, 444655, 452577, 461663, 471713, 483425, 497715, 514547, 532723, 550692, 567241, 581641, 593751, 604291, 614682, 626340, 639973, 655386, 671694, 687668, 702080, 713889, 722269, 726678, 726984, 723398, 716334, 706534, 695243, 683761, 672641, 661619, 650403, 638983, 627011, 613635, 598560, 582817, 567855, 554257, 541912, 530978, 521883, 514621, 508958, 505192, 503814, 504370, 505614, 506999, 509180, 512667, 516827, 520785, 524699, 529473, 535545, 542524, 549846, 557320, 565116, 573589, 583029, 593387, 604303, 615544, 627215, 639326, 651405, 662718, 672802, 681639, 689490, 696652, 703140, 708542, 712454, 715159, 717521, 720076, 722603]
50985G22603K250K378L164M130M972O048P613R202J0217J0753J1405J2557J4292
50972H21584J6789K0357K4982L0072L4752L8504M1567M4658M8143N1674N4785
50961A227867N7617O0434O2621O2928O0978N7886N4928N2095M8394M3254L7015
50950A826017L0302K3592J7329J1893P281L251j44k523l907n078o932r646j2724
50937A878711j5676j8298k0451k2002k3050k3932k4816k5559k6174k7197k9255
50926A622301l2289l5489l8095m0007m1509m2676m3331m3424m3132m2489m1167
50915A178693l8874l5887l2965l0656k8764k6643k3950k0914j7939j5282j3199
50904H93620j2020j1767j1871j1661j0991j0047q792p086n274m001l431l147k914
$$ y = [722603, 724853, 727231, 730395, 734525, 739497, 745545, 753158, 762360, 772577, 783330, 794735, 807292, 821584, 838373, 858730, 883712, 913784, 948536, 987040, 1028607, 1073265, 1121408, 1173082, 1227867, 1285484, 1345918, 1408539, 1471467, 1532445, 1590331, 1645259, 1697354, 1745748, 1789002, 1826017, 1856319, 1879911, 1897240, 1909133, 1916414, 1919665, 1919521, 1916998, 1913091, 1908013, 1901081, 1891435, 1878711, 1863035, 1844737, 1824286, 1802284, 1779234, 1755302, 1730486, 1704927, 1678753, 1651556, 1622301, 1590012, 1554523, 1516428, 1476421, 1434912, 1392236, 1348905, 1305481, 1262349, 1219860, 1178693, 1139819, 1103932, 1070967, 1040311, 1011547, 984904, 960954, 940040, 922101, 906819, 893620, 881600, 869833, 857962, 846301, 835310, 825263, 816471, 809385, 804111, 800110, 796679, 793532, 790618]
50891G90618k860k814k244j145k33K05Q62K159L241L138K364K331L444M874O028
50876H09968P102Q105Q542Q420Q616R701J1185J2444J3662J5314J7247J9011K0731
50863I70048K2988K6023K9517L3043L6369L9617M3350M8260N4388O0968O7372
50852A431943P3865Q1002Q8629R6091J03177J10261J17449J24183J29782J33996
50842B490378J36852J38154J37311J33595J26597J16484J03648Q8222P0297N0766
50832C592304L1323J3222l512j9083l2632m2700m8786n1574n1678m9137m4296
50821C293451l8352l2452k6975k2143j8782j7856j9670k4072l1054m0388n0974
50810B970733o1323p0822p9841q8511r6028j01395j04340j05141j03951j00730
$$ y = [790618, 787758, 784944, 782700, 781555, 781322, 781527, 782389, 784548, 787789, 790927, 793291, 795622, 799066, 803940, 809968, 817070, 825175, 833717, 842137, 850753, 860454, 871639, 884083, 897745, 913059, 930306, 949317, 970048, 993036, 1019059, 1048576, 1081619, 1117988, 1157605, 1200955, 1249215, 1303603, 1364571, 1431943, 1505808, 1586810, 1675439, 1771530, 1874707, 1984968, 2102417, 2226600, 2356382, 2490378, 2627230, 2765384, 2902695, 3036290, 3162887, 3279371, 3383019, 3471241, 3541538, 3592304, 3623627, 3636849, 3633337, 3614254, 3581622, 3538922, 3490136, 3438562, 3386884, 3337747, 3293451, 3255099, 3222647, 3195672, 3173529, 3154747, 3136891, 3117221, 3093149, 3062095, 3021707, 2970733, 2909410, 2838588, 2758747, 2670236, 2574208, 2472813, 2368473, 2263332, 2159381, 2058651]
50800B058651r5626q9053q1457p3210o4602n5741m6732l8033l0298k3484j6623
50789A443792r147k135K658N000O443Q131R331Q869P124N457M137K042j372m979
50775A485351p333q389r273j0813j2911j5130j7365j9822k2607k5398k7506k8462
50763A280342k8534k8437k8488k8357k7659k6362k4496k1960j8931j5984j3452
50752A017682j1038q424n902l838j912N67L735P149J0517J3939J7490K1129K4984
50739A086078K9256L3807L8312M2778M7446N2185N6485O0157O3527O6863O9969
50728A646863P2483P4086P4469P3574P1911P0093O7857O4171N8403N0777M1453
50717B366140L0023J6449J970j1632k3293l2711l9601m3632m4864m3649m0243
$$ y = [2058651, 1963025, 1873972, 1792515, 1719305, 1654703, 1598962, 1552230, 1514197, 1483899, 1460415, 1443792, 1434645, 1432510, 1435168, 1440168, 1446611, 1454742, 1464073, 1472942, 1480066, 1485523, 1489660, 1491702, 1490330, 1485351, 1478018, 1469629, 1460356, 1449543, 1436632, 1421502, 1404137, 1384315, 1361708, 1336310, 1308804, 1280342, 1251808, 1223371, 1194883, 1166526, 1138867, 1112505, 1088009, 1066049, 1047118, 1031134, 1017682, 1006644, 998220, 992318, 988480, 986568, 987135, 990870, 998019, 1008536, 1022475, 1039965, 1061094, 1086078, 1115334, 1149141, 1187453, 1230231, 1277677, 1329862, 1386347, 1446504, 1510031, 1576894, 1646863, 1719346, 1793432, 1867901, 1941475, 2013386, 2083479, 2151336, 2215507, 2273910, 2324687, 2366140, 2396163, 2412612, 2414582, 2402950, 2379657, 2346946, 2307345, 2263713, 2218849, 2175200, 2134957]
50706B134957l5071k9112k3386j8119j3027q389n184m100m997p507j1636j7479
50694A956950k4705l2560m0104m6380n0712n3059n3827n3213n1047m7361m2653
50683A461329l7324l1193k4009j6143q352r29O487J4179K1790K8722L4838M0514
50671A489909M5948N0648N3779N4874N4074N1660M7728M2449L6467L0739K5972
50660A984247K2284J9366J6806J4399J2257J0559R152P642N997M754M321M447
50648B116231M737N457P285J0335J4080J8125K2529K7211L1599L5114L7619L9207
50636B369529L9958L9991L9399L7926L5228L1683K8505K6690K5989K5075K2277
50625B722250J6101N636q883k6019m3739n9823p1720p7080p5248o7932n7739m6313
$$ y = [2134957, 2099886, 2070774, 2047388, 2029269, 2016242, 2007853, 2002669, 1998569, 1993572, 1986065, 1974429, 1956950, 1932245, 1899685, 1859581, 1813201, 1762489, 1709430, 1655603, 1602390, 1551343, 1503982, 1461329, 1424005, 1392812, 1368803, 1352660, 1344308, 1343379, 1349866, 1364045, 1385835, 1414557, 1449395, 1489909, 1535857, 1586505, 1640284, 1695158, 1749232, 1800892, 1848620, 1891069, 1927536, 1958275, 1984247, 2006531, 2025897, 2042703, 2057102, 2069359, 2079918, 2089070, 2096712, 2102709, 2107463, 2111784, 2116231, 2120968, 2126425, 2133710, 2144045, 2158125, 2176250, 2198779, 2225990, 2257589, 2292703, 2330322, 2369529, 2409487, 2449478, 2488877, 2526803, 2562031, 2593714, 2622219, 2648909, 2674898, 2699973, 2722250, 2738351, 2743987, 2735104, 2709085, 2665346, 2605523, 2533803, 2456723, 2381475, 2313543, 2255804, 2209491]
50613B209491l4304k2515j2029l346L712R064J2166J2849J1581Q603L362m681
50601B193953j5076k6465l7389m6842n4432o0332o4873o7976o9153o8192o5574
50590A617649o2158n8587n5150n1785m8140m3966l9611l5813l2769k9863k6622
50579A133185k3535k1332j9727j7501j4004r976o650m354k420j96K262M553O526
50566A026831Q286R909J1567J3747J6854K0576K4053K6903K9619L2761L6168L9343
50554A296617M2191M4832M7058M8438M8840M8358M6949M4758M2523M1030M0261
50543A791855L9757L9692M0756M3016M5805M8880N2768N7683O2940O7956P3033
50532B364141P8550Q4224Q9798R5807J02824J10350J17227J22818J27082J29792
$$ y = [2209491, 2175187, 2152672, 2140643, 2137297, 2141009, 2150073, 2162239, 2175088, 2186669, 2195272, 2198634, 2193953, 2178877, 2152412, 2115023, 2068181, 2013749, 1953417, 1888544, 1820568, 1751415, 1683223, 1617649, 1555491, 1496904, 1441754, 1389969, 1341829, 1297863, 1258252, 1222439, 1189670, 1159807, 1133185, 1109650, 1088318, 1068591, 1051090, 1037086, 1027110, 1020460, 1016106, 1013686, 1013490, 1015752, 1020305, 1026831, 1035117, 1045026, 1056593, 1070340, 1087194, 1107770, 1131823, 1158726, 1188345, 1221106, 1257274, 1296617, 1338808, 1383640, 1430698, 1479136, 1527976, 1576334, 1623283, 1668041, 1710564, 1751594, 1791855, 1831612, 1871304, 1912060, 1955076, 2000881, 2049761, 2102529, 2160212, 2223152, 2291108, 2364141, 2442691, 2526915, 2616713, 2712520, 2815344, 2925694, 3042921, 3165739, 3292821, 3422613]
50522C422613J30448J28798J24804J18223J08764R6562Q1900O4724M5017K3518
50512D345371J453k0393m1792o2452q1840r9412j14383j25408j31272j31883j28067
50501C409922j20416j09058r4435p7535n9224m0014k0510j382J7011L4069M8000
50490B986428N6482N8549N4959M6332L2117J2072j2070l7394o1656q3661j02391
50479B949767j16860j26734j32339j34106j32436j27916j21210j12870j03659
50470A841637r4555q5994p7587o9165o1565n5514n0260m4444l8199l3121l0062
50459A201171k8098k6090k4074k2460k0759j8149j4860j2020j0199q761o820m334
50447A004547k050n91K64J342L092M929N859N801N797O699Q092Q949R045R209
$$ y = [3422613, 3553061, 3681859, 3806663, 3924886, 4033650, 4130212, 4212112, 4276836, 4321853, 4345371, 4346824, 4326431, 4284639, 4222187, 4140347, 4040935, 3926552, 3801144, 3669872, 3537989, 3409922, 3289506, 3180448, 3086013, 3008478, 2949254, 2909240, 2888730, 2887348, 2904359, 2938428, 2986428, 3042910, 3101459, 3156418, 3202750, 3234867, 3246939, 3234869, 3197475, 3135819, 3052158, 2949767, 2832907, 2706173, 2573834, 2439728, 2307292, 2179376, 2058166, 1945296, 1841637, 1747082, 1661088, 1583501, 1514336, 1452771, 1397257, 1346997, 1302553, 1264354, 1231233, 1201171, 1173073, 1146983, 1122909, 1100449, 1079690, 1061541, 1046681, 1034661, 1024462, 1015701, 1008881, 1004547, 1002497, 1001906, 1002170, 1003512, 1006604, 1011533, 1017392, 1023193, 1028990, 1035689, 1043781, 1052730, 1061775, 1070984]
50433A070984J0285J2306J4672J6725J8179J9317K0843K3090K5425K6774K6900
50422A285500K6802K7648K9643L2145L4630L7195M0301M4320M9257N4654N9782
50411A721877O4178O7890P1069P3358P4127P3265P1412O9158O6247O1848N5563
50400B469992M7823L9277L0009J9560P591n662j9612l3715m7447n9923o9959p6724
50388B301210q0313q1407q0409p7095p1178o2950n3184m2599l1692k0939j0832
50377A688612j568P051J5035K1584K5343K5419K2104J6372Q817o11j1760k3550
50365A792848l4477m3664n1043n6550n9733o0386n9211n7382n5615n3799n1467
50354A209521m8362m4641m0834l7400l4141l0213k5111j9500j4565j0622o895
$$ y = [1070984, 1081269, 1093575, 1108247, 1124972, 1143151, 1162468, 1183311, 1206401, 1231826, 1258600, 1285500, 1312302, 1339950, 1369593, 1401738, 1436368, 1473563, 1513864, 1558184, 1607441, 1662095, 1721877, 1786055, 1853945, 1925014, 1998372, 2072499, 2145764, 2217176, 2286334, 2352581, 2414429, 2469992, 2517815, 2557092, 2587101, 2606661, 2614252, 2608590, 2588978, 2555263, 2507816, 2447893, 2377934, 2301210, 2220897, 2139490, 2059081, 1981986, 1910808, 1847858, 1794674, 1752075, 1720383, 1699444, 1688612, 1687044, 1694095, 1709130, 1730714, 1756057, 1781476, 1803580, 1819952, 1828769, 1828158, 1816398, 1792848, 1758371, 1714707, 1663664, 1607114, 1547381, 1486995, 1427784, 1370402, 1314787, 1260988, 1209521, 1161159, 1116518, 1075684, 1038284, 1004143, 973930, 948819, 929319, 914754, 904132, 897237]
50343H97237k801J168M029N279M792K323k163p740j2728j5944j7388j7695j7252
50330H21117j6085j4258j2043r814p871o249m624k604l73J287J851J814K147L085
50316G57380L960M217M109M175M549N176O274P905R405R948R671R505R789R731
50302H55794Q604O828N386M735M786N479O626P507P467O870O709P264P855Q026
50288I49936Q180Q807R782J0889J2338J4138J5254J4237J0595N271k15m695p633
50275A046884r012r116q234o561m462k635j683j581j773j729j187q1J407K819
50261A003056L908N130P262J0389J3759J6780J9788K3456K7743L1882L5322L8324
50249A236799M1392M4400M6435M6568M4689M1652L8617L6202L4200L2044K9535
$$ y = [897237, 894436, 895604, 899633, 904912, 909704, 912027, 909864, 902124, 889396, 873452, 856064, 838369, 821117, 805032, 790774, 778731, 768917, 761046, 754797, 750173, 747569, 747196, 748483, 750334, 752148, 754295, 757380, 761340, 765557, 769666, 773841, 778390, 783566, 789840, 797745, 807150, 817098, 826769, 836274, 846063, 855794, 864398, 871226, 876612, 881347, 886133, 891612, 898238, 905745, 913212, 920082, 926791, 934055, 941910, 949936, 958116, 966923, 976705, 987594, 999932, 1014070, 1029324, 1043561, 1054156, 1059427, 1059212, 1054517, 1046884, 1037872, 1028756, 1020522, 1013961, 1009499, 1006864, 1005181, 1003600, 1001827, 1000098, 998911, 998830, 1000237, 1003056, 1006964, 1012094, 1019356, 1029745, 1043504, 1060284, 1080072, 1103528, 1131271, 1163153, 1198475, 1236799, 1278191, 1322591, 1369026, 1415594, 1460283, 1501935, 1540552, 1576754, 1610954, 1642998, 1672533]
50238A672533K6994K4618K1726J6974R495k38j0931k1690l2364m2614n1212n6696
50226A556595n8597n7621n4746n0520m5361m0031l5441l2167l0404l0232l1603
50215A089872l3964l6207l7209l6468l4237l1133k7724k4374k1256j8450j5956
50204G72894j3684j1448r180p194o040n865o060n838n171m719m796m868m352l468
50190F80211k874k743k778k889l244l701l820l575l448l596l517k832j911j343
50176F37940j156r72o04p4O64J605K463L005L417L990M606M995N328O039P079
50161F78325P917Q327Q745R695J1177J2805J4290J5554J6557J7134J7085J6469
50149H34080J5819J5808J6461J7028J6966J6785J7447J9134K1334K4069K8246
$$ y = [1672533, 1699527, 1724145, 1745871, 1762845, 1772340, 1772102, 1761171, 1739481, 1707117, 1664503, 1613291, 1556595, 1497998, 1440377, 1385631, 1335111, 1289750, 1249719, 1214278, 1182111, 1151707, 1121475, 1089872, 1055908, 1019701, 982492, 946024, 911787, 880654, 852930, 828556, 807300, 788850, 772894, 759210, 747762, 738582, 731388, 725348, 719483, 713423, 707585, 702414, 697695, 692899, 688031, 683679, 680211, 677337, 674594, 671816, 668927, 665683, 661982, 658162, 654587, 651139, 647543, 644026, 641194, 639283, 637940, 636784, 635812, 635208, 635134, 635798, 637403, 639866, 642871, 646288, 650278, 654884, 659879, 665207, 671246, 678325, 686242, 694569, 703314, 713009, 724186, 736991, 751281, 766835, 783392, 800526, 817611, 834080, 849899, 865707, 882168, 899196, 916162, 932947, 950394, 969528, 990862, 1014931, 1043177]
50138A043177L4449M2068N0100N8279O6805P5298Q2636Q7779R0293R0114Q7400
50127A808398Q2827P7629P2998O9497O7032O5154O3105N9690N3475M3466K9709
50116B492980J3183m932k3786m2570n9993p4589q5685r3753r9437j02517j02284
50105A816617r8805r3318q7125q0538p3242o5378n7789n1231m5757m1111l7293
50094A085030l4389l1979k9139k5236k0564j6073j2519r885p587n192k964j558
50082H87945j167j148p51n6J55n77j843k945l636m086m389m422m083l519l204
50067H52274l733n197o696o983n861m530m195m709n087m910m586m380l990l132
50053G84285k011j027l61J16P94K104L935N420N895N925O745Q648J0560J1386
$$ y = [1043177, 1077626, 1119694, 1169794, 1228073, 1294878, 1370176, 1452812, 1540591, 1630884, 1720998, 1808398, 1891225, 1968854, 2041852, 2111349, 2178381, 2243535, 2306640, 2366330, 2419805, 2463271, 2492980, 2506163, 2501231, 2477445, 2434875, 2374882, 2300293, 2214608, 2120855, 2021418, 1918901, 1816617, 1717812, 1624494, 1537369, 1456831, 1383589, 1318211, 1260422, 1209191, 1163434, 1122323, 1085030, 1050641, 1018662, 989523, 964287, 943723, 927650, 915131, 905246, 897659, 892467, 889503, 887945, 886778, 885630, 884879, 884823, 884978, 884401, 882558, 879613, 875977, 871891, 867502, 863080, 858997, 855478, 852274, 848541, 843344, 836648, 829665, 823804, 819274, 815079, 810370, 805283, 800373, 795787, 791407, 787417, 784285, 782274, 781247, 780886, 781002, 781796, 783900, 787835, 793255, 799150, 805075, 811820, 820468, 831028, 842414]
50039H42414J1065J0231R517R499J0492J2009J3060J3381J3688J4290J4347J3235
50027I87228J1800J1275J1506J1426J0936J1075J2359J4165J5964J8104K0971
50016A136809K4342K8024L2277L7008M1190M3796M4782M4628M3397M0937L7646
50005A554836L4239L1038K8122K5997K5252K5432K4917K2144J6494P977l310j6933
49993A776205l1735m6083n8450o7647p2896p4126p2168o8404o4100n9906n5859
49982A104831n1690m7343m3147l9438l6030l2435k8550k4817k1629j8933j6596
49971G44223j4658j2968j1109r101p716p493p804p518o397n046l708k128n72J07
49957F48112j24N9J752M343O408P533Q421R490J0255J0142R199P843O502N573
$$ y = [842414, 853479, 863710, 873227, 882726, 893218, 905227, 918287, 931668, 945356, 959646, 973993, 987228, 999028, 1010303, 1021809, 1033235, 1044171, 1055246, 1067605, 1081770, 1097734, 1115838, 1136809, 1161151, 1189175, 1221452, 1258460, 1299650, 1343446, 1388228, 1432856, 1476253, 1517190, 1554836, 1589075, 1620113, 1648235, 1674232, 1699484, 1724916, 1749833, 1771977, 1788471, 1796448, 1793138, 1776205, 1744470, 1698387, 1639937, 1572290, 1499394, 1425268, 1353100, 1284696, 1220596, 1160690, 1104831, 1053141, 1005798, 962651, 923213, 887183, 854748, 826198, 801381, 779752, 760819, 744223, 729565, 716597, 705488, 696387, 688671, 681178, 673374, 665856, 659459, 654413, 650705, 648577, 648005, 648112, 647988, 648047, 649799, 654142, 660550, 668083, 676504, 685994, 696249, 706391, 715590, 723433, 729935, 735508]
49943G35508N197M960M166K534L99j738l548m930o160p955j0769j3979j6318j7171
49929F70196j6953j6217j4992j3252j1384r759q258o567m579k325J12K272L409
49916E71703L365K945L019L589M171M694N408O214O752P094P653Q440Q987R188
49902F53222R635J0827J2418J3492J3402J2156J0181P891N480K969M78j711l369
49889G47071m589n639o719p927r313j0727j1785j2259j2399j2583j2747j2517
49877F27867j1816j0998j0295r499q309o759n255m301m124m322l975k497l46J495
49863E46866K740M000N654P127P715P712Q126R453J1162J2418J2903J2790J2240
$$ y = [735508, 740705, 745665, 749831, 752365, 752764, 751026, 747478, 742548, 736388, 728433, 717664, 703685, 687367, 670196, 653243, 637026, 622034, 608782, 597398, 587639, 579381, 572814, 568235, 565910, 566022, 568294, 571703, 575068, 578013, 581032, 584621, 588792, 593486, 598894, 605108, 611860, 618954, 626607, 635047, 644034, 653222, 662857, 673684, 686102, 699594, 712996, 725152, 735333, 743224, 748704, 751673, 752151, 750440, 747071, 742482, 736843, 730124, 722197, 712884, 702157, 690372, 678113, 665714, 653131, 640384, 627867, 616051, 605053, 594758, 585259, 576950, 570191, 564936, 560635, 556511, 552189, 548214, 545717, 545371, 546866, 549606, 553606, 559260, 566387, 574102, 581814, 589940, 599393, 610555, 622973, 635876, 648666, 660906]
$$ [...]
##END NTUPLES=NMR SPECTRUM
##END=
