##TITLE=AC1459_PAST813265_7819218_GKhFzjxwCK
##JCAMPDX= 6.0         $$ Bruker NMR JCAMP-DX V2.0
##DATA TYPE= NMR SPECTRUM
##DATA CLASS= NTUPLES
##ORIGIN= BRUKER
##OWNER= Administrator
$$ 1.72 TOPSPIN		Version 2.1
$$ 2013-04-30 21:22:39.130 -0700  Administrator@X
$$ Compression mode = diff/dup
##.OBSERVE FREQUENCY= 400.02188249412
##.OBSERVE NUCLEUS= ^1H
##.ACQUISITION MODE= SIMULTANEOUS (DQD)
##.ACQUISITION SCHEME= undefined
##.AVERAGES= 8
##.DIGITISER RES= 22
##SPECTROMETER/DATA SYSTEM= spect
##.PULSE SEQUENCE= zg30
##.SOLVENT NAME= COFFEE_meoh
##.SHIFT REFERENCE= INTERNAL, COFFEE_meoh, 1, 14.98509
##AUDIT TRAIL= $$ (NUMBER, WHEN, WHO, WHERE, PROCESS, VERSION, WHAT)
$$ ##TITLE= Audit trail, TOPSPIN		Version 2.1
$$ ##JCAMPDX= 5.01
$$ ##ORIGIN= Bruker BioSpin GmbH
$$ ##OWNER= Administrator
$$ $$ E:\/data/COFFEE/nmr/AC1459_PAST813265_7819218_GKhFzjxwCK/10/pdata/1/auditp.txt
$$ ##AUDIT TRAIL=  $$ (NUMBER, WHEN, WHO, WHERE, PROCESS, VERSION, WHAT)
(   1,<2013-04-30 21:22:32.348 -0700>,<Administrator>,<X>,<go>,<TOPSPIN 2.1>,
      <created by zg
	started at 2013-04-30 21:21:26.645 -0700,
	POWCHK enabled, PULCHK disabled,
       configuration hash MD5:
       F7 49 AB AC A2 8D 51 76 73 8D C1 9A A6 38 9F DE
       data hash MD5: 64K
       C6 67 A7 58 05 B5 73 A3 0B FB AA D6 E9 83 D4 8F>)
(   2,<2013-04-30 21:22:35.270 -0700>,<Administrator>,<X>,<proc1d>,<TOPSPIN 2.1>,
      <Start of raw data processing
       efp LB = 0 FT_mod = 6 PKNL = 1 PHC0 = 0 PHC1 = 0 SI = 32K 
       data hash MD5: 32K
       2C 2D 49 B5 8C 00 F3 93 52 4D BA 4C 7A 2F 95 46>)
(   3,<2013-04-30 21:22:35.567 -0700>,<Administrator>,<X>,<proc1d>,<TOPSPIN 2.1>,
      <pk PHC0 = 98.88245 PHC1 = 0 
       data hash MD5: 32K
       E6 D0 3E 01 EC AB A5 7F D4 A4 DD 4D 4C 5D 55 01>)
(   4,<2013-04-30 21:22:35.692 -0700>,<Administrator>,<X>,<proc1d>,<TOPSPIN 2.1>,
      <abs ABSG = 1 
       data hash MD5: 32K
       EE 40 75 63 02 17 72 0D 2A 1F 5E C8 1F 68 81 F3>)
(   5,<2013-04-30 21:22:35.770 -0700>,<Administrator>,<X>,<proc1d>,<TOPSPIN 2.1>,
      <abs ABSG = 2 
       data hash MD5: 32K
       5B 29 91 8F 3A A1 E3 EA 35 21 8E BB 58 84 77 CF>)
(   6,<2013-04-30 21:22:35.864 -0700>,<Administrator>,<X>,<proc1d>,<TOPSPIN 2.1>,
      <abs ABSG = 3 
       data hash MD5: 32K
       26 75 08 D8 34 83 3B D0 52 71 A2 D9 58 C3 9F D1>)
(   7,<2013-04-30 21:22:35.927 -0700>,<Administrator>,<X>,<proc1d>,<TOPSPIN 2.1>,
      <abs ABSG = 4 
       data hash MD5: 32K
       B5 35 48 C7 06 41 F3 A9 6E BD AF 32 E0 A5 AA 95>)
(   8,<2013-04-30 21:22:35.973 -0700>,<Administrator>,<X>,<proc1d>,<TOPSPIN 2.1>,
      <abs ABSG = 5 
       data hash MD5: 32K
       B9 CE AC 9B FF B7 C5 41 5C D0 43 E5 FC A4 5C DF>)
$$ ##END=
$$ 
$$ $$ hash MD5
$$ $$ EF C2 0C 3A 8F F5 FB 4B D5 52 B7 B9 13 CF 27 4F
##$RELAX= 
##$RELAX= 
##$RELAX= 
##$RELAX= 
##$RELAX= 
##$RELAX= 
##$RELAX= 
$$ Bruker specific parameters
$$ --------------------------
##$DU= <E:\>
##$EXPNO= 10
##$NAME= <AC1459_PAST813265_7819218_GKhFzjxwCK>
$$ [...]
##$TP= (0..7)
150 150 150 150 150 150 150 150
##$TP07= 0
##$TPNAME0= <>
##$TPNAME1= <>
##$TPNAME2= <>
##$TPNAME3= <>
##$TPNAME4= <>
##$TPNAME5= <>
##$TPNAME6= <>
##$TPNAME7= <>
##$TPOAL= (0..7)
0.5 0.5 0.5 0.5 0.5 0.5 0.5 0.5
##$TPOFFS= (0..7)
0 0 0 0 0 0 0 0
##$TUNHIN= 0
##$TUNHOUT= 0
##$TUNXOUT= 0
##$USERA1= <user>
##$USERA2= <user>
##$USERA3= <user>
##$USERA4= <user>
##$USERA5= <user>
##$V9= 5
##$VALIST= <valist>
##$VCLIST= <CCCCCCCCCCCCCCC>
##$VD= 0
##$VDLIST= <DDDDDDDDDDDDDDD>
##$VPLIST= <PPPPPPPPPPPPPPP>
##$VTLIST= <TTTTTTTTTTTTTTT>
##$WBST= 1024
##$WBSW= 4
##$XGAIN= (0..3)
0 0 0 0
##$XL= 0
##$YL= 0
##$YMAX_a= 650551
##$YMIN_a= -554276
##$ZGOPTNS= <>
##$ZL1= 120
##$ZL2= 120
##$ZL3= 120
##$ZL4= 120
##$ABSF1= 14.98509
##$ABSF2= -5.573092
##$ABSG= 5
##$ABSL= 3
##$ALPHA= 0
##$AQORDER= 0
##$ASSFAC= 0
##$ASSFACI= 0
##$ASSFACX= 0
##$ASSWID= 0
##$AUNMP= <proc_prof1d_extract_pilot.lims>
##$AXLEFT= 0
##$AXNAME= <>
##$AXNUC= <1H>
##$AXRIGHT= 0
##$AXTYPE= 0
##$AXUNIT= <>
##$AZFE= 0.1
##$AZFW= 0.1
##$BCFW= 0
##$BC_mod= 0
##$BYTORDP= 0
##$COROFFS= 0
##$CY= 15
##$DATMOD= 1
##$DC= 0
##$DFILT= <>
##$DTYPP= 0
##$F1P= 0
##$F2P= 0
##$FCOR= 0.5
##$FTSIZE= 32768
##$FT_mod= 6
##$GAMMA= 0
##$GB= 0
##$INTBC= 1
##$INTSCL= 1
##$ISEN= 128
##$LB= 0
##$LEV0= 0
##$LPBIN= 0
##$MAXI= 10000
##$MC2= 0
##$MEAN= 0
##$ME_mod= 0
##$MI= 0
##$NCOEF= 0
##$NC_proc= -8
##$NLEV= 6
##$NOISF1= 0
##$NOISF2= 0
##$NSP= 0
##$NTH_PI= 0
##$NZP= 0
##$OFFSET= 14.98509
##$PC= 1
##$PHC0= 98.88245
##$PHC1= 0
##$PH_mod= 1
##$PKNL= yes
##$PPARMOD= 0
##$PPDIAG= 0
##$PPIPTYP= 0
##$PPMPNUM= 2147483647
##$PPRESOL= 1
##$PSCAL= 4
##$PSIGN= 0
##$PYNMP= <proc.py>
##$REVERSE= no
##$SF= 400.02
##$SI= 32768
##$SIGF1= 0
##$SIGF2= 0
##$SINO= 400
##$SIOLD= 32768
##$SPECTYP= <>
##$SREGLST= <1H.CDCl3>
##$SSB= 0
##$STSI= 32768
##$STSR= 0
##$SW_p= 8223.68421052631
##$SYMM= 0
##$S_DEV= 0
##$TDeff= 65536
##$TDoff= 0
##$TI= <>
##$TILT= no
##$TM1= 0
##$TM2= 0
##$TOPLEV= 0
##$USERP1= <user>
##$USERP2= <user>
##$USERP3= <user>
##$USERP4= <user>
##$USERP5= <user>
##$WDW= 1
##$XDIM= 32768
##$YMAX_p= 461981870
##$YMIN_p= -724981
##$CURPLOT= <Network HP LaserJet P1505>
##$CURPRIN= <$Network HP LaserJet P1505>
##$DFORMAT= <normdp>
##$LAYOUT= <+/1D_H.xwp>
##$LFORMAT= <normlp>
##$PFORMAT= <normpl>
##$SURQMSG= 1
$$ End of Bruker specific parameters
$$ ---------------------------------
##NTUPLES= NMR SPECTRUM
##VAR_NAME=  FREQUENCY,     SPECTRUM/REAL,   SPECTRUM/IMAG
##SYMBOL=    X,             R,               I
##VAR_TYPE=  INDEPENDENT,   DEPENDENT,       DEPENDENT
##VAR_FORM=  AFFN,          ASDF,            ASDF
##VAR_DIM=   32768,         32768,           32768
##UNITS=     HZ,            ARBITRARY UNITS, ARBITRARY UNITS
##FACTOR=    0.250966925370066, 1,           1
##FIRST=     8223.43324360094, 9257,         -6565
##LAST=      0,             -16874,          -74223
##MIN=       0,             -724981,         0
##MAX=       8223.43324360094, 461981870,    0
$$ Real data points
##PAGE= N=1
##DATA TABLE= (X++(R..R)), XYDATA
$$ [...]
19563a27617K3948H504A996a47314q9935j07619d4195j70785B97861A38963a7976
$$ -127617 -103669 8504 1996 -147314 -237249 -344868 -44195 -214980 297861 138963 -17976
19551B62703Q229i2463B5354b57821A03585f6888l109A29247C938a16209p7685
$$ 262703 270932 -92463 25354 -257821 103585 -66888 -69997 129247 3938 -116209 -193894
19540a93894n8410J09593b8643j14144N4989F3685c2397p6163D5787d7682C6855
$$ -193894 -252304 -142711 -28643 -142787 -87798 63685 -32397 -108560 45787 -47682 36855
19528i4118F8656c00622H6164b05472A56135b28369j20101B16444b40625b0355
$$ -94118 68656 -300622 86164 -205472 156135 -228369 -348470 216444 -240625 -20355
19517g7104A1547b18741A4937J00393b96450P3975G9837K2544d2862l84006a38628
$$ -77104 11547 -218741 14937 115330 -296450 -222475 79837 102381 -42862 -426868 -138628
19505A8730Q4005a3905p5619r2027O6152I7245a83776A10787a0272A83118g7383
$$ 18730 102735 -13905 -89524 -181551 -115399 97245 -183776 110787 -10272 183118 -77383
19493E6127c1021j73564P6631A15571B5943b75185D5180i2345B8657d07840g0706
$$ 56127 -31021 -204585 -127954 115571 25943 -275185 45180 -92345 28657 -407840 -70706
19481g417B3872Q265a32002C03545A21473a66780B62774c74152J69416h3006j67417
$$ -7417 23872 32137 -132002 303545 121473 -166780 262774 -374152 -204736 -83006 -250423
19470b50423d846F03M98276e8709p5874A07292b92877m32104K14508A53497C987
$$ -250423 -4846 603 498879 -58709 -134583 107292 -292877 -724981 -510473 153497 3987
19458B45298b60588L0991N8867J5805l97G3531Q961b86230G9322O6203N337j9678
$$ 245298 -260588 -229597 -170730 -154925 -155322 73531 82492 -286230 79322 145525 150862 131184
19446A31184b58014a15662A6679d1338m0528H9529K38946F95J49816b07873C25617
$$ 131184 -258014 -115662 16679 -41338 -81866 89529 328475 695 150511 -207873 325617
19434c3807k97514a09004F4433a41301k36667a46333b8908A54991b06387E98865
$$ -33807 -331321 -109004 64433 -141301 -377968 -146333 -28908 154991 -206387 598865
19423a09933j73908B90489A22386d9012C47402A451Q7939a08220K9476D1361b11750
$$ -109933 -283841 290489 122386 -49012 347402 1451 89390 -108220 -78744 41361 -211750
19411A40102C6987a07256A12001c17962o4188B98861c34006I8812K3015A0797
$$ 140102 36987 -107256 112001 -317962 -382150 298861 -334006 98812 121827 10797
19400D5902L0976M1091J94968H3425b02114A54748b85192j1450B96709a60289
$$ 45902 76878 117969 312937 83425 -202114 154748 -285192 -296642 296709 -160289
19389f9482B39022d2018j88509H9425i9491m1834q1524o1590R4604r8288J14504
$$ -69482 239022 -42018 -230527 89425 -99491 -141325 -222849 -284439 -189835 -288123 -173619
19378a73619b3059A95446k3966b09477A67731b90623D3868L3620h3916B0793b24911
$$ -173619 -23059 195446 171480 -209477 167731 -290623 43868 77488 -83916 20793 -224911
19366b32370A0058h8433l11911a8875p1095j42094a14692N715H1055e3410C1707
$$ -232370 10058 -88433 -400344 -18875 -89970 -232064 -114692 -108977 81055 -53410 31707
19354F2595G34b4382D4901B289a03004E71155e3894j24325I1842O8657d0546H2681
$$ 62595 734 -24382 44901 2289 -103004 571155 -53894 -178219 91842 160499 -40546 82681
19341a79312a5607j17775m159r4864a15520E746b93183a2375m64464J50839D5714
$$ -179312 -15607 -133382 -137541 -232405 -115520 5746 -293183 -12375 -476839 -326000 45714
19329B77224A23127E8363a90389k6959R9193k11697J07904g117k50220N1083A03750
$$ 277224 123127 58363 -190389 -217348 -118155 -329852 -221948 -7117 -257337 -206254 103750
19317a01060p5630Q2183p4039m5682a9960r1555p5627D0292N2228j0619a26816
$$ -101060 -176690 -94507 -168546 -214228 -19960 -111515 -187142 40292 92520 81901 -126816
19305c4513k87384a04150k37300f7817J5246a9434k24239A0151B985J53849i3669
$$ -34513 -321897 -104150 -341450 -67817 -52571 -19434 -243673 10151 2985 156834 -93669
19293c29527c9931j26352E3995K83739a51287k365l74508b22684e9615B84427
$$ -329527 -39931 -166283 53995 337734 -151287 -153652 -528160 -222684 -59615 284427
19282B48154I8514J1368b22790F1485d23412i8064G7790K4222c38216a06533J807
$$ 248154 98514 109882 -222790 61485 -423412 -98064 77790 102012 -338216 -106533 -104726
19271a04726r9638A03420l905J58841p621c15221J26164A11417J4739a55917M3519
$$ -104726 -204364 103420 99515 258356 250735 -315221 -189057 111417 126156 -155917 -112398
19260a12398d0971A78237a18569k79642c5881j95740a09564k75043B61856D0723
$$ -112398 -40971 178237 -118569 -398211 -35881 -231621 -109564 -384607 261856 40723
19249a90138L3960j11924h387j71314n7581j12077A7691J85665f8775m2187k18434
$$ -190138 -156178 -268102 -8387 -179701 -237282 -349359 17691 203356 -68775 -110962 -329396
19238c29396J55270k6942K3520A40321o9894a11782k9411k02088J48908B55011
$$ -329396 -174126 -201068 -177548 140321 70427 -111782 -141193 -343281 -194373 255011
19227A29560a32706M3076I209P9722a41997A28293b8684C5624J36572b62765F4467
$$ 129560 -132706 -89630 9209 88931 -141997 128293 -28684 35624 172196 -262765 64467
19215A70376d8295J7147j24069o4839A15251b89149h0912A41274C3057g0767c3930
$$ 170376 -48295 -31148 -155217 -220056 115251 -289149 -80912 141274 33057 -70767 -33930
19203c9299k08902F4214n886d7531j5758n2528j61077R7328j45861K0726f9629
$$ -39299 -248201 64214 58328 -47531 -63289 -115817 -276894 -179566 -325427 -304701 -69629
19191g4294B13150a89585k29933F3830b32849E0006J2749O7093c7493e679B76556
$$ -74294 213150 -189585 -419518 63830 -232849 50006 62755 129848 -37493 -5679 276556
19179B61731a76575I396L22978b06659j8603h0164j4040l8663M8687D5754b31839
$$ 261731 -176575 9396 332374 -206659 -225262 -80164 -94204 -132867 -84180 45754 -231839
19167d87067a65233C3309r16K3963k0782a96758F6527d8577A00085G596L9951
$$ -487067 -165233 33309 32393 56356 35574 -196758 66527 -48577 100085 7596 47547
19156D7547f358C6573e92360a33629L3655M3657B29832i2195A84861C5407h243
$$ 47547 -6358 36573 -592360 -133629 -99974 -56317 229832 -92195 184861 35407 -8243
19144f9703A08323b26434C001a67197C1630K20362a63665j25935H0988b0751A80711
$$ -69703 108323 -226434 3001 -167197 31630 251992 -163665 -289600 80988 -20751 180711
19132b16055A31481g3977C5796b46972F1694b2927j12580B4948a35324A38332
$$ -216055 131481 -73977 35796 -246972 61694 -22927 -135507 24948 -135324 138332
19121e7955C21492d5887A57777a0527l42942D5677a03268B62103c07601L4875
$$ -57955 321492 -45887 157777 -10527 -353469 45677 -103268 262103 -307601 -272726
19111b72726o558a06785k95654d5456G4488P5987c67690F8264a79522k34569h7670
$$ -272726 -279284 -106785 -402439 -45456 74488 150475 -367690 68264 -179522 -414091 -87670
19099b70983j33899a93320A51200o9937a06448a5783B44254B4857d04737a57678
$$ -270983 -404882 -193320 151200 81263 -106448 -15783 244254 24857 -404737 -157678
19088b35524e3113B38001a37022k2297A31192g8252A8041i5275C03873d5019j07073
$$ -235524 -53113 238001 -137022 -159319 131192 -78252 18041 -95275 303873 -45019 -152092
19077a52092h977D602b76681a00525k03076F7943P8993a2555j95708B55912a34559
$$ -152092 -8977 4602 -276681 -100525 -303601 67943 146936 -12555 -208263 255912 -134559
19065E8979a71548c4905A22328a83661F1524P0548N9359E0042e385H2372J07587
$$ 58979 -171548 -34905 122328 -183661 61524 132072 191431 50042 -5385 82372 189959
19054A89959h8590A56633a39121l7662E9771b13274f1969F859K17260a40439A26042
$$ 189959 -88590 156633 -139121 -176783 59771 -213274 -61969 6859 224119 -140439 126042
19042f7071r6164B60758a50489N76B00491Q351r8745b45413i87j08328B22264
$$ -67071 -163235 260758 -150489 -149913 200491 208842 110097 -245413 -987 -109315 222264
19030i6358I6757b778B544c1083A77034k3390K67532A6250J40614L4400c15880
$$ -96358 96757 -2778 2544 -31083 177034 153644 421176 16250 156864 191264 -315880
19018D08669a89129M7674q3251a707k02462f009j08240A11399b07566k51788a26343
$$ 408669 -189129 -141455 -224706 -1707 -204169 -6009 -114249 111399 -207566 -459354 -126343
19006b0019l8963A49311K23630G6143a58040A90031i2329k25817h2584B6269I663
$$ -20019 -58982 149311 372941 76143 -158040 190031 -92329 -318146 -82584 26269 9663
18994d40484A84468o1847a96912G3358q530i224A8150b42087e616j17684F5330
$$ -440484 184468 122621 -196912 73358 64828 -9224 18150 -242087 -5616 -123300 65330
18982G5278d6198b3053k82502A911K91364n4696a2639k66483p5797A10769a23432
$$ 75278 -46198 -23053 -305555 1911 293275 238579 -12639 -279122 -354919 110769 -123432
18970b37785P2212M9704j09438k53457i6474F8864e6575i778C852J92435a258
$$ -237785 -165573 -115869 -225307 -478764 -96474 68864 -56575 -9778 3852 196287 -1258
18958B59973q3324d02756J34648i3192n4815M4293B26760H0719c88617a55204
$$ 259973 176649 -402756 -268108 -93192 -148007 -103714 226760 80719 -388617 -155204
18947h5494k02348H8545b20088A29939b81074D9699a58894d5422k97212c0651
$$ -85494 -287842 88545 -220088 129939 -281074 49699 -158894 -45422 -342634 -30651
18936B67867p9058f7193B20376a67770I7790a59657n8472B18573M8257f863j36537
$$ 267867 188809 -67193 220376 -167770 97790 -159657 -218129 218573 266830 -6863 -143400
18925a43400A31514j1655m3985c3932o9816p6909e6435I5438b7212j34615G83
$$ -143400 131514 119859 75874 -33932 -103748 -180657 -56435 95438 -27212 -161827 783
18913B84688d8130l04531B4285L0885b0190l5834m04k84759f417m176d223B5565
$$ 284688 -48130 -352661 24285 55170 -20190 -56024 -56428 -341187 -6417 -10593 -4223 25565
18900H5069R9804f453j447A64636E1622Q9695b14369h2575m1848A49809C7969
$$ 85069 184873 -6453 -7900 164636 51622 141317 -214369 -82575 -124423 149809 37969
18888c4250k05546b5527k96950G9373b26379m6482B5175P2126e3858l711p696
$$ -34250 -239796 -25527 -322477 79373 -226379 -272861 25175 97301 -53858 -57569 -65265
18877f5265A82718C2973K14314a46457c5915j10067j16581a14807A28600a07489
$$ -65265 182718 32973 247287 -146457 -35915 -145982 -262563 -114807 128600 -107489
18866a43838j03903G2802d7546F0346a46313J0586f6700B02298P7802j20030b82468
$$ -143838 -247741 72802 -47546 60346 -146313 -135727 -66700 202298 280100 160070 -282468
18854b02201A34618b35327A64539B1183J70806a04705J6429A07386D1112h1028
$$ -202201 134618 -235327 164539 21183 191989 -104705 -88276 107386 41112 -81028
18843a13810A40420e5338o0423j77898B2171J19168a13726B59566d1505j08682
$$ -113810 140420 -55338 -115761 -293659 22171 141339 -113726 259566 -41505 -150187
18833a50187K4649a8282A70917j836a18126D6765c8008l40442J55021B04601a50666
$$ -150187 -125538 -18282 170917 169081 -118126 46765 -38008 -378450 -223429 204601 -150666
18821f4399r8290O8620j65613D8133R661a17038M8672J9935G2809J39568q6643
$$ -64399 -162689 -94069 -259682 48133 57794 -117038 -68366 -48431 72809 212377 125734
18810A25734l3681J44648G7287J85885H2438A4741J65807G9472a65562j15420
$$ 125734 92053 236701 77287 263172 82438 14741 180548 79472 -165562 -280982
18800b80982B50229I4843c6096E5950b26231P8223g3757k13516J18865P5603B8197
$$ -280982 250229 94843 -36096 55950 -226231 -148008 -73757 -287273 -168408 -92805 28197
18788a22798m257n4938e0287o1948d7880A65548b18386K3733F3763a06619G3611
$$ -122798 -127055 -181993 -50287 -112235 -47880 165548 -218386 -194653 63763 -106619 73611
18776a80453j53576J26615j62510A98885B3449J2884g7749j6276B78157a92089
$$ -180453 -334029 -207414 -369924 198885 23449 36333 -77749 -94025 278157 -192089
18765I9715C1527a71856k1052H701b36703A00178m8328e8166B45949b49457A83702
$$ 99715 31527 -171856 -192908 8701 -236703 100178 51850 -58166 245949 -249457 183702
18753c8151f232C58464a62882H2575k6594e69607q9610A56372A0017a87448f9948
$$ -38151 -6232 358464 -162882 82575 55981 -569607 -659217 156372 10017 -187448 -69948
18741B32065c22737B49683k035L9410C6714f9113F9363c86632a62385j7893g990
$$ 232065 -322737 249683 247648 287058 36714 -69113 69363 -386632 -162385 -180278 -7990
18729a74915a778k37979H5835M6239K4024b8947B95999g9381m8024C14244a96223
$$ -174915 -1778 -239757 85835 132074 156098 -28947 295999 -79381 -127405 314244 -196223
18717a71453j20645J34878o2528f1338l40085a11977A07406b07401e4615B9376
$$ -171453 -292098 -157220 -219748 -61338 -401423 -111977 107406 -207401 -54615 29376
18706D2496a31918K1526l3577j63A4549i2774K7192m7433B15309j3167h3103F6754
$$ 42496 -131918 -110392 -143969 -144132 14549 -92774 -65582 -113015 215309 202142 -83103 66754
18693c39944a28352j44411C43086a44447A95183a11153q4902O1038r3920o5686
$$ -339944 -128352 -272763 343086 -144447 195183 -111153 -196055 -135017 -228937 -294623
18683b94623O7792A41795d8835A4472c052A39809K71704g1542C24268a46177b2957
$$ -294623 -226831 141795 -48835 14472 -3052 139809 411513 -71542 324268 -146177 -22957
18671a7601j43026K4308A17572h9712m2441A4742b2640n8893K3968j29046j55575
$$ -17601 -160627 -136319 117572 -89712 -132153 14742 -22640 -81533 -57565 -186611 -342186
18660c42186B5598L99535G7293f2180r8494E9298a84154A3485N5928j8373a99594
$$ -342186 25598 425133 77293 -62180 -160674 59298 -184154 13485 69413 51040 -199594
18648a90978k46691H0927f5956m29143A30478a16466j55585B09876M0624c8338
$$ -190978 -437669 80927 -65956 -495099 130478 -116466 -272051 209876 250500 -38338
18637b54431a15845j11314a12016H129d5761k23395B72355i1125K1065j5306o366
$$ -254431 -115845 -227159 -112016 8129 -45761 -269156 272355 -91125 -70060 -85366 -91732
18626i1732C2557f0555J2461p1675m0173k9651B64695k5737A11857D7568a61214
$$ -91732 32557 -60555 -48094 -119769 -159942 -189593 264695 238958 111857 47568 -161214
18614C8109K1267I860J36577a85407f4796G568J85400b27138l0078h0233A58333
$$ 38109 59376 9860 146437 -185407 -64796 7568 192968 -227138 -257216 -80233 158333
18602c01184B6557J8289a52875A95369J6867d23928a56179P5101k47966g5078
$$ -301184 26557 44846 -152875 195369 212236 -423928 -156179 -81078 -329044 -75078
18591e8856B3276J55581a24308B32540l3511Q8882d16483E372a42795o5005b0010
$$ -58856 23276 178857 -124308 232540 199029 287911 -416483 5372 -142795 -207800 -20010
18579a40612l0960j1631N4579p216d5375B72689K7067a2442j55582e9551j25078
$$ -140612 -171572 -183203 -128624 -135840 -45375 272689 299756 -12442 -168024 -59551 -184629
18568a84629k99211d2121k449B3485b0198F202Q4641a9793B42896b95029d0887
$$ -184629 -483840 -42121 -44570 23485 -20198 6202 90843 -19793 242896 -295029 -40887
18556b41957A20973d7639K147n9979m9516c7818A3925b2542o131A78034a00987
$$ -241957 120973 -47639 -45492 -105471 -154987 -37818 13925 -22542 -28673 178034 -100987
18544I4191a76600B53380K355a55254I1247J08053d15048a72690J9999A37984
$$ 94191 -176600 253380 255735 -155254 91247 199300 -415048 -172690 -152691 137984
18533a40996b911B25216n980i9254j67391A1563g833k58510c5567E0937K64875
$$ -140996 -2911 225216 219236 -99254 -266645 11563 -7833 -266343 -35567 50937 315812
18522C15812G961h9184k47056A33981C6137L30900a29940C5829e8455r1081A0254
$$ 315812 7961 -89184 -336240 133981 36137 367037 -129940 35829 -58455 -149536 10254
18510H9848a09978M5539j24637B17003F2753b98973a26043k0224C03039G8429
$$ 89848 -109978 -64439 -189076 217003 62753 -298973 -126043 -146267 303039 78429
18499a38559A43863a62503B69706f6728k01632J29553A69854a02428A22293c14761
$$ -138559 143863 -162503 269706 -66728 -268360 -138807 169854 -102428 122293 -314761
18488a9751j45985b5619B35118a62177C33850g961o4918N105C41030i46A41297
$$ -19751 -165736 -25619 235118 -162177 333850 -7961 -72879 -67774 341030 -946 141297
18476b1491j00819J759I4087a7055A89276a08611k22317E6838g3032L2304p4482
$$ -21491 -122310 -120551 94087 -17055 189276 -108611 -330928 56838 -73032 -40728 -115210
18465a15210h961A99237a33031l6248D7005a96713f8113k18696A86938F7779a32824
$$ -115210 -8961 199237 -133031 -169279 47005 -196713 -68113 -286809 186938 67779 -132824
18453a73863O9222K2067l6643j00264d8171j40010H3135N8710a47205n936A13199
$$ -173863 -104641 -82574 -119217 -219481 -48171 -188181 83135 141845 -147205 -153141 113199
18441a23626j32005i6786d053A19311G393R6661b86686A40579l5037J8349K54053
$$ -123626 -255631 -96786 -4053 119311 7393 104054 -286686 140579 105542 123891 377944
18430C77944E9429a14278i499A83556e6633F907i6845l5679l714k43891H8097
$$ 377944 59429 -114278 -9499 183556 -56633 6907 -96845 -132524 -136238 -380129 88097
18418b6373q4907n7611N434A43760f6340I8309a29318j82243J36260A38802F7093
$$ -26373 -111280 -168891 -163457 143760 -66340 98309 -129318 -311561 -175301 138802 67093
18406b10515q7092B65139b05138A73935c18833D4938K1120a29566j3731B18998
$$ -210515 -297607 265139 -205138 173935 -318833 44938 66058 -129566 -143297 218998
18395c76594b9883j87680J08472G6014a57321a3876j16149J1272A30435b26396
$$ -376594 -29883 -217563 -109091 76014 -157321 -13876 -130025 -118753 130435 -226396
18384b48391B36745i284l0012j86802b3792O030p7482A13703d2853k37683H6097
$$ -248391 236745 -9284 -39296 -226098 -23792 -17762 -95244 113703 -42853 -280536 86097
18372C50884a91485G2175d4879A03331a40632G783K53796q4283J6836J75454e508
$$ 350884 -191485 72175 -44879 103331 -140632 7783 261579 177296 194132 369586 -5508
18360f3787a045D0515a00988A16301M7668d58940a24140A42896D8682a21304j61525
$$ -63787 -1045 40515 -100988 116301 163969 -458940 -124140 142896 48682 -121304 -282829
18349b82829c8272j78110R7384j37790a26503B07579b0010B76375a4124I214h4565
$$ -282829 -38272 -216382 -118998 -256788 -126503 207579 -20010 276375 -14124 9214 -84565
18337A84134C2536K8412k0356a28296f3627k6774l23547C66968E6179a48895D4270
$$ 184134 32536 60948 40592 -128296 -63627 -90401 -413948 366968 56179 -148895 44270
18325a13119l53591A980f0898a0390j75016m6334B00118r7235B3985a9133B79272
$$ -113119 -466710 1980 -60898 -10390 -185406 -231740 200118 102883 23985 -19133 279272
18313a27984a8341j07098j37946d2912a1160l176k97132b8119B88785j01126c40526
$$ -127984 -18341 -125439 -263385 -42912 -11160 -14336 -311468 -28119 288785 187659 -340526
18301I8182h1543l5130D8676K9531b6325C9360J64025F9621a97051j86761J52907
$$ 98182 -81543 -116673 48676 78207 -26325 39360 203385 69621 -197051 -383812 -230905
18290b30905I8846a83418h7458N570J0562J4664k65966a42633K5707B43099g982
$$ -230905 98846 -183418 -87458 -81888 -71326 -56662 -322628 -142633 -116926 243099 -7982
18278A51915E4154P9643J19682A14683b40455a05728C79121c08525A94668a22167
$$ 151915 54154 133797 253479 114683 -240455 -105728 379121 -308525 194668 -122167
18267b5053m9936G1899k648P9731f0955c872j97822E7804a96052K8802A41201
$$ -25053 -74989 71899 69251 148982 -60955 -3872 -201694 57804 -196052 -167250 141201
18255b25605g7691C3228a3673A32483K2667b57429e801A23126b49151A7557b39058
$$ -225605 -77691 33228 -13673 132483 155150 -257429 -5801 123126 -249151 17557 -239058
18243c35381b627j69127e8005a6725B6989a6100j49111B20172c8758j18152K2116
$$ -335381 -2627 -171754 -58005 -16725 26989 -16100 -165211 220172 -38758 -156910 -134794
18232a34794m0790f2376j42759G9081K4634c343C5303J4130b11493f3805A36846
$$ -134794 -175584 -62376 -205135 79081 103715 -3343 35303 49433 -211493 -63805 136846
18220b30806D40748j64804d83896A02724i4224k1428B7045a80800B68150a52430
$$ -230806 440748 275944 -483896 102724 -94224 -115652 27045 -180800 268150 -152430
18209a27422G7041a81283K3450A07116c58174C3326J48709E2613E040h3182A10438
$$ -127422 77041 -181283 -157833 107116 -358174 33326 182035 52613 5040 -83182 110438
18197e8338D0762a20494A20620K8509d97334K21764A85166a5875j21006d8560
$$ -58338 40762 -120494 120620 149129 -497334 -275570 185166 -15875 -136881 -48560
18186A49144k5960b62744A42670a08472A22218E3924K16602b17603A03175a21606
$$ 149144 123184 -262744 142670 -108472 122218 53924 270526 -217603 103175 -121606
18175A60165F0255J3676j5661b02602B34752B8961a32757A68726d07435D759K7429
$$ 160165 60255 73931 58270 -202602 234752 28961 -132757 168726 -407435 4759 32188
18164C2188K05109q8670k9737i3299c7580G7992J48370I5427b67431M7476l35350
$$ 32188 237297 148627 118890 -93299 -37580 77992 226362 95427 -267431 -219955 -555305
18153e55305A36102h7138A9071N5954j1655a61043f7305B18070b21271h2904q6051
$$ -555305 136102 -87138 19071 75025 63370 -161043 -67305 218070 -221271 -82904 -168955
18142a68955B3957a64112A30758e06003H8999b53790I5737Q2415e2859F4041a29455
$$ -168955 23957 -164112 130758 -506003 88999 -253790 95737 178152 -52859 64041 -129455
18130E0501h7618f294C2161a85367j39312E762K86081A40409a98699P554e3312
$$ 50501 -87618 -6294 32161 -185367 -324679 5762 291843 140409 -198699 -191145 -53312
18118b84385j03285D44354d920j56476b9111D36017i0484q2541A08226d5335p6624
$$ -284385 -387670 444354 -4920 -161396 -29111 436017 -90484 -173025 108226 -45335 -121959
18107a21959e2573m1233F0388O8291c28166A9390f7496A32585l8589l6334b50556
$$ -121959 -52573 -93806 60388 128679 -328166 19390 -67496 132585 93996 57662 -250556
18095a93435e1673D1683R0745O0088b48676J12695I2394g265k97487A11300j1906
$$ -193435 -51673 41683 132428 192516 -248676 -135981 92394 -7265 -304752 111300 99394
18084I9394b08517a7104C07084b69584g3789n2018g61j33416J6213o309c580k92808
$$ 99394 -208517 -17104 307084 -269584 -73789 -125807 -761 -134177 -117964 -124273 -3580 -296388
18072b96388J16086N7769A08958A1972Q9817a82478N7920a9654P291A99816E5745
$$ -296388 -180302 -122533 108958 11972 101789 -182478 -124558 -19654 -12363 199816 55745
18060b01539J4273A16813c7179j81492B03140d1605J2510B4928P9442J45474A7657
$$ -201539 -187266 116813 -37179 -218671 203140 -41605 -29095 24928 104370 249844 17657
18048B86048A04771L597i7671F4562c48113G882K6606a51300j71316P4820A03810
$$ 286048 104771 108368 -97671 64562 -348113 7882 34488 -151300 -322616 -247796 103810
18036a4286A3553c03355A27653h1650A12133e2718e785p641k28291j85633a33268
$$ -14286 13553 -303355 127653 -81650 112133 -52718 -5785 -13426 -241717 -427350 -133268
18024a5596q1399C6394K3216c9143a7351l19803D467c0581C6369c8785j11805
$$ -15596 -96995 36394 59610 -39143 -17351 -337154 4467 -30581 36369 -38785 -150590
18013a50590f7681A41709a90609h7191C08633a28495f990k55564A85128D6226
$$ -150590 -67681 141709 -190609 -87191 308633 -128495 -6990 -262554 185128 46226
18002B51648j01155a06049r5152e357j2016j17506o1167C728R2222B102Q3308
$$ 251648 150493 -106049 -201201 -5357 -17373 -134879 -196046 3728 95950 2102 85410
17991H5410L10457f5258j32231A06192a20009B71336d6294A51150b22791J07881
$$ 85410 395867 -65258 -197489 106192 -120009 271336 -46294 151150 -222791 -114910
17981a14910N1224j45660b244o9428A66148a20506j2330A01221j5758N1602c10816
$$ -114910 -63686 -209346 -2244 -71672 166148 -120506 -132836 101221 85463 137065 -310816
17969a16907o5579g2556j18086j36128a1489B16833b45805e3863A34430E9803
$$ -116907 -182486 -72556 -190642 -326770 -11489 216833 -245805 -53863 134430 59803
17958I6325a20596C05285a08182d679j08596j64588F4842a79617a7542A86658
$$ 96325 -120596 305285 -108182 -4679 -113275 -277863 64842 -179617 -17542 186658
17947a06190E4284c42643c5816g440D1162b32425A29447g1074J8648A08796K24018
$$ -106190 54284 -342643 -35816 -7440 41162 -232425 129447 -71074 -52426 108796 332814
17936C32814A40838g1773p0059F5792a99674C6540a34520J920C6710J1361P3787
$$ 332814 140838 -71773 -141832 65792 -199674 36540 -134520 -132600 36710 48071 121858
17925A21858c76492h121p7798j25905g2296k8135j79392H3501J82870b36874A60440
$$ 121858 -376492 -8121 -85919 -211824 -72296 -100431 -279823 83501 266371 -236874 160440
17913B66921a9625A3359a66585B44346q1047E978a60236F8075j9253f0718C07920
$$ 266921 -19625 13359 -166585 244346 163299 5978 -160236 68075 48822 -60718 307920
17901b87305B28487e30549a08407H2108c0461A79625a15601N245j51229a5886
$$ -287305 228487 -530549 -108407 82108 -30461 179625 -115601 -110356 -261585 -15886
17890B11484q9334E7656a34211A17372M270J49602i1664j11100A9332e8307A39337
$$ 211484 122150 57656 -134211 117372 121642 271244 -91664 -202764 19332 -58307 139337
17878A1061K14954F0900K91844I3691c1790l16166a34587f4994H8221R1215o4292
$$ 11061 226015 60900 352744 93691 -31790 -347956 -134587 -64994 88221 179436 115144
17867A15144m5715R1882b66700J06322E3972B1251J30017e691A3206R1809N8727
$$ 115144 69429 161311 -266700 -160378 53972 21251 151268 -5691 13206 105015 163742
17856A63742d2775f554k59131G6224g5398B04765J55925A27081D9684O5365i26
$$ 163742 -42775 -6554 -265685 76224 -75398 204765 360690 127081 49684 115049 -926
17844H8959L22075A400i6899a7801k48774f3422G4624K88289a1059F5272K8116
$$ 88959 411034 1400 -96899 -17801 -266575 -63422 74624 362913 -11059 65272 93388
17833I3388P3015i9431d5908G5046J8247C4525L90932c46012a52601D4664K31045
$$ 93388 166403 -99431 -45908 75046 93293 34525 425457 -346012 -152601 44664 275709
17822B75709F2165a30027D1384a86287C81673j75905G5684j2647a37167d0332
$$ 275709 62165 -130027 41384 -186287 381673 205768 75684 63037 -137167 -40332
17811B02007A9592J52991a11333k04568F3385J21038L8254j4106e4860A05116
$$ 202007 19592 172583 -111333 -315901 63385 184423 222677 208571 -54860 105116
17800C3721a95240A95516J53699b36908e9767A74062d8407n5054C1342J1953O777
$$ 33721 -195240 195516 349215 -236908 -59767 174062 -48407 -103461 31342 43295 50072
17789E0072a30278B18142A7339O8258a13914E6826a13284m39342a44119I7754
$$ 50072 -130278 218142 17339 85597 -113914 56826 -113284 -552626 -144119 97754
17778e275K610n2027C3198b39793d549q7091J4683j2752j22122h5314B3855i7416
$$ -5275 -2665 -54692 33198 -239793 -4549 -91640 -76957 -89709 -211831 -85314 23855 -97416
17765b7718l41566a29730A11984C8061c18223A12515i2210D9844K59962f7611
$$ -27718 -369284 -129730 111984 38061 -318223 112515 -92210 49844 309806 -67611
17754B69789I193d7898D50620a64950J3844n2597e0428j54016q5325A65879b18600
$$ 269789 9193 -47898 450620 -164950 -151106 -203703 -50428 -204444 -289769 165879 -218600
17742C8841b21416A9995K121J41468k8343b21957A7114J65681d0328B08123F1510
$$ 38841 -221416 19995 22116 163584 135241 -221957 17114 182795 -40328 208123 61510
17730C10103a57819L677I9969c25586F9800b79514I2892L83767B519K17204D7862
$$ 310103 -157819 -154142 99969 -325586 69800 -279514 92892 476659 2519 219723 47862
17718F4126K57568a40204O8138C0808j3542M6378a80646G9590f2076j48313B37031
$$ 64126 321694 -140204 -72066 30808 17266 63644 -180646 79590 -62076 -210389 237031
17706A79867J82917a94553j14338k559J37437H7105a30627j13308J8173G3047
$$ 179867 362784 -194553 -308891 -311450 -174013 87105 -130627 -243935 -225762 73047
17695F6109g7283K9975B84101D4747J59800g3161m7014k8529B12929F0137a02050
$$ 66109 -77283 -47308 284101 44747 204547 -73161 -120175 -148704 212929 60137 -102050
17683a16720A91441O1324a61825d1792C4873b01982b2819p9182A81371b16138
$$ -116720 191441 252765 -161825 -41792 34873 -201982 -22819 -102001 181371 -216138
17672a70100j8973B15478a6859j68950D1109J07192J29419k5778l0190r3298a01404
$$ -170100 -189073 215478 -16859 -185809 41109 148301 277720 251942 221752 128454 -101404
17660a50435j16443A18387Q436a30049A69772l2660J01455h602A89617q5173D817
$$ -150435 -266878 118387 126823 -130049 169772 137112 238567 -8602 189617 104444 4817
17648A17950b4980E3665O3055R100a95425G6595L2113D8212P1921M990A8907b31361
$$ 117950 -24980 53665 116720 125820 -195425 76595 108708 48212 120133 125123 18907 -231361
17635a17798L5147A85003F714K49243H27P4834O7978b84963G4531J17126h1261
$$ -117798 -82651 185003 6714 255957 827 75661 143639 -284963 74531 191657 -81261
17623B84284b27280N8284b194k6068E1083L8606K6240D1845a94397B98424J38623
$$ 284284 -227280 -168996 -2194 -28262 51083 89689 115929 41845 -194397 298424 437047
17612D37047j83563r7154B8885e6120E9330d33514b878A12699R1313c2499o4095
$$ 437047 253484 156330 28885 -56120 59330 -433514 -2878 112699 204012 -32499 -96594
17601i6594B53645F8044b78889J06368j27356j2402A69149e3683F5518g8558j60640
$$ -96594 253645 68044 -278889 -172521 -299877 -312279 169149 -53683 65518 -78558 -239198
17590b39198I953q60O2837g9982n2723C04089A14733m3876M3159J11477I764K18791
$$ -239198 9953 9093 71930 -79982 -132705 304089 114733 70857 114016 225493 9764 228555
17578B28555b5018B05184H675K02685E087J28605a20334C41280a35089m7026A15916
$$ 228555 -25018 205184 8675 211360 5087 133692 -120334 341280 -135089 -182115 115916
17566B22502D8022N9470g2960b1040A86543A053K87442b02560A23392J3867F6755
$$ 222502 48022 107492 -72960 -21040 186543 1053 288495 -202560 123392 137259 66755
17554H2980a38819A40061Q6627a13815j37240J8885B23182a34264C58731A768
$$ 82980 -138819 140061 226688 -113815 -251055 -232170 223182 -134264 358731 1768
17543a40883A32120E3208K78944H4306J45703j10800i1889E3089a17979J4280
$$ -140883 132120 53208 332152 84306 230009 119209 -91889 53089 -117979 -103699
17533a03699A00814J07900m6792C7803e9812A32721J48689A06829a00204j07173
$$ -103699 100814 208714 161922 37803 -59812 132721 281410 106829 -100204 -207377
17523b07377R2320A05031K45613j29253i04r0817A17087E2116D122J78450P6739
$$ -207377 -115057 105031 350644 221391 -904 -91721 117087 52116 4122 182572 259311
17512B59311A7328a74853C3353c2026I6907J20983I528M69308f8864A40241J20512
$$ 259311 17328 -174853 33353 -32026 96907 217890 9528 478836 -68864 140241 260753
17501B60753O2744a3570j14533B17720b6066A71793a23563G8853B7702c46C28084
$$ 260753 323497 -13570 -128103 217720 -26066 171793 -123563 78853 27702 -346 328084
17489b72661A51944J77022r7787c9246j40580J2523F1774O6257j4139E6380K76692
$$ -272661 151944 328966 231179 -39246 -179826 -167303 61774 128031 113892 56380 333072
17478C33072i3650B50803l7083a01276A32327j9552K13841G1531B740h2329J4035
$$ 333072 -93650 250803 213720 -101276 132327 112775 326616 71531 2740 -82329 -68294
17467f8294B08609m3834j8493l7795C8873K6361J39024L1017G5485K20756j22204
$$ -68294 208609 164775 146282 108487 38873 65234 204258 235275 75485 296241 174037
17456A74037d8512E4363P622K73057j63833J48412O0656K14948b39974F08540
$$ 174037 -48512 54363 61985 335042 171209 319621 380277 595225 -239974 608540
17445B16668L02390k33002P5933M1677q7387j29395R4133c4150C51039A5089a06742
$$ 216668 519058 286056 361989 403666 316279 186884 281017 -34150 351039 15089 -106742
17433H3416Q6096J29250H6285k0555K24154G5135l5104K89090H9451f8025B21463
$$ 83416 169512 298762 86285 65730 289884 75135 40031 329121 89451 -68025 221463
17421B57741G6705f4959C56901C5557K43327J96103j5152A84248J49078j61807
$$ 257741 76705 -64959 356901 35557 278884 474987 459835 184248 333326 171519
17411A71519m9751N5074E7688K15101j32571O8837C6961K12398I0723J1502J16307
$$ 171519 121768 176842 57688 272789 140218 209055 36961 249359 90723 102225 218532
17400B18532l8919R0049r9999D8979K21618J8338E6655O2446J16771b3201B05422
$$ 218532 179613 269662 169663 48979 270597 288935 56655 119101 235872 -23201 205422
17388A13423j3460J15516N9489l8370n4605A2035K56001l5730C9950J22296J99536
$$ 113423 99963 215479 274968 236598 181993 12035 268036 232306 39950 162246 361782
17377C61782a69152D17056e5413A79256i5278B62021a36306B62800r0264a8166
$$ 361782 -169152 417056 -55413 179256 -95278 262021 -136306 262800 172536 -18166
17366C44538A22784d14987h7748J656A88976F3658R8952R3121a74180A06777e12146
$$ 344538 122784 -414987 -87748 -86092 188976 63658 162610 255731 -174180 106777 -512146
17354A3189M5823K61869a56617g3414C15088J7922r3243P769a49970C69031L1360
$$ 13189 59012 320881 -156617 -73414 315088 333010 239767 247536 -149970 369031 400391
17343D00391B2760h0068A20691N04e3127A02731a649B01168g2928b2969H5728
$$ 400391 22760 -80068 120691 121195 -53127 102731 -1649 201168 -72928 -22969 85728
17331C06037F2717K67629B0538M6322K22583A1978M94047b8630N957k62086I3908
$$ 306037 62717 330346 20538 66860 289443 11978 506025 -28630 -22673 -284759 93908
17319C60482H8110e8962D53178F3346d6194r802C12738j9951H1840j8656J70447
$$ 360482 88110 -58962 453178 63346 -46194 -55996 312738 292787 81840 63184 233631
17308B33631j04556o4121h3096A94541G7650a37772E7797J87096N5327j11672
$$ 233631 129075 64954 -83096 194541 77650 -137772 57797 244893 300220 188548
17298A88548J95247A05209A0939K12993J03066b62050E9362J65248K6196J54060
$$ 188548 383795 105209 10939 223932 326998 -262050 59362 224610 250806 404866
17288D04866J6710j43944J23219e5072E79129A69639M08733a76602A71089K5171
$$ 404866 421576 277632 400851 -55072 579129 169639 578372 -176602 171089 196260
17278A96260D8469M09242j91285q2925o0875R0970G008N03771A91948K32869b50591
$$ 196260 48469 457711 266426 183501 122626 213596 7008 510779 191948 424817 -250591
17266c0207I15e2517I9097J92341G6944L07803a64213D86288A64048N6692o2192
$$ -30207 915 -52517 99097 291438 76944 384747 -164213 486288 164048 220740 158548
17255A58548F6202a75395A68237O3990c5143k0372D11232j30973G8071L24821
$$ 158548 66202 -175395 168237 232227 -35143 -55515 411232 280259 78071 402892
17245D02892E5633L00907A71355P3659L90146B23997a08328E00398a24432B05101
$$ 402892 55633 356540 171355 245014 635160 223997 -108328 500398 -124432 205101
17234H022N22019h3927C24682o1813J22428j41553J57775H4068K63M79855P9233
$$ 8022 530041 -83927 324682 262869 385297 243744 401519 84068 84331 564186 643419
17223F43419B33581m2512o0692o4337J75494a24537C73063G6271J61517K300P3399
$$ 643419 233581 191069 130377 66040 241534 -124537 373063 76271 237788 240088 313487
17212C13487A02346L2870K85887D9938M9192f4079C560N31645j87966L6828Q4200
$$ 313487 102346 135216 421103 49938 99130 -64079 3560 535205 347239 384067 468267
17201D68267B21629p2474B9973J18398L38878k37549J75861a99344C28841G8008
$$ 468267 221629 149155 29973 148371 487249 249700 425561 -199344 328841 78008
17190D65300A24339L12155j86184l8646e2611E63593D1589P4654K62465L8456
$$ 465300 124339 436494 250310 211664 -52611 563593 41589 116243 378708 417164
17180D17164A65484K45226j86743O2237N6648e2272m2806D09659A85619J56510
$$ 417164 165484 410710 223967 286204 342852 -52272 -95078 409659 185619 342129
17170C42129O9600A37214J54345j37937a49692B99482o5924Q7517J51683A55871
$$ 342129 411729 137214 291559 153622 -149692 299482 233558 321075 472758 155871
17159B90844Q8220K72149B77547A16938K44329J01759j74902j41940B1582L53398
$$ 290844 379064 651213 277547 116938 361267 463026 288124 146184 21582 374980
17149C74980b260B19959j3319M3437L01210E2243K15946K58705C1378O16146k57796
$$ 374980 -2260 219959 206640 250077 551287 52243 268189 526894 31378 647524 389728
17138C89728A48927p4274M16320B30623G2327J81828Q9566j6272O3503j77922
$$ 389728 148927 74653 490973 230623 72327 254155 343721 327449 390952 213030
17128B13030K92418A86516j8727L16915A94520K78860m3941k9064L3555M5636
$$ 213030 505448 186516 167789 484704 194520 473380 429439 400375 433930 479566
17118D79566A86690l2147J79402K19762J06618B48310Q2032J66856l125j10021
$$ 479566 186690 154543 333945 553707 660325 248310 330342 497198 494073 384052
17108C84052L5586o132A27892K37579j22895Q9844A57045J83845K10597j2120
$$ 384052 419638 413506 127892 365471 242576 332420 157045 340890 551487 539367
17098E39367B09726J89477j23213J16567e3436C16414k9720J87967j92104K92833
$$ 539367 209726 399203 275990 392557 -53436 316414 286694 474661 282557 575390
17088E75390A88786K78611j78896j01567L75373j02826j42060J37955R0636j59861
$$ 575390 188786 467397 288501 186934 562307 459481 317421 455376 546012 386151
17078C86151P9316j40601L6944J21362M3928k23193J53732M9452F4829M40948
$$ 386151 465467 324866 361810 483172 527100 303907 457639 507091 64829 505777
17068E05777r6917A85820K1908N0778R4859L3095q6843J73589B19030k765J23792
$$ 505777 408860 185820 207728 258506 353365 386460 299617 473206 219030 216265 340057
17057C40057K58341l8298L0820k45926o3606K89059j70978L63175M082k08967
$$ 340057 598398 560100 590920 344994 281388 570447 399469 762644 766726 557759
17047E57759r9076j02953J40612O8626B69525M08645o6834l8190J38602k68194
$$ 557759 458683 355730 496342 564968 269525 678170 611336 573146 711748 443554
17037D43554K9613q0895J33559r9443R5236J84373C36112J03870L66890l19760
$$ 443554 473167 392272 525831 426388 521624 705997 336112 439982 806872 487112
17027D87112J02996K60717l81650J32696J79281j9302l08977j48606r2212L84886
$$ 487112 590108 850825 469175 601871 781152 761850 452873 304267 212055 596941
17017E96941K32503l70386M26269l79039Q0196r6642J53310K21914l00219l3844
$$ 596941 829444 459058 885327 506288 586484 489842 643152 865066 564847 531003
17007E31003L1895M22338k52220J21437j89853K27032l71550K36565m6997j92801
$$ 531003 562898 985236 733016 854453 664600 891632 520082 756647 709650 516849
16997E16849L61279j92523L61976j75184l61103M88942k85943C46821L19797m2719
$$ 516849 878128 685605 1047581 872397 511294 1000236 714293 346821 666618 623899
16987F23899K3597L11649l12933J44042P1405K14904j41051k89940O5329q1089
$$ 623899 647496 959145 646212 790254 861659 1076563 935512 645572 710901 629812
16977F29812K01617J05969j65399j67779J25081K69513k17329P454J27066j31319
$$ 629812 831429 937398 771999 604220 729301 998814 781485 788939 916005 784686
16967G84686K86147k55140L6052K60067L1079m12941K67831m31638M08819o183
$$ 784686 1070833 815693 851745 1111812 1142891 729950 997781 566143 974962 968779
16957I68779l35893J42451K62388K49361m19570q1974K46922R2834K1738j57148
$$ 968779 632886 775337 1037725 1287086 867516 785542 1032464 1125298 1147036 989888
16947I89888j71692K46053L73646n55145R3783K94762j36508r6524k46115M97920
$$ 989888 818196 1064249 1437895 882750 976533 1271295 1134787 1038263 792148 1290068
16937A290068j84690r2750L952K813j86598N12317N8420n5882j44008J08039K9217
$$ 1290068 1105378 1012628 1016580 1019393 832795 1345112 1403532 1347650 1203642 1311681 1340898
16926A340898j56427m3970n993q776L06446m3244M91358m70553j95191R4488P2997
$$ 1340898 1184471 1140501 1134508 1125732 1432178 1388934 1880292 1409739 1214548 1309036 1382033
16915A382033J51081J8591j95706L327J53161O1117j4248j40391K08051K1033
$$ 1382033 1533114 1551705 1355999 1359326 1512487 1573604 1559356 1418965 1627016 1648049
16905A648049J9371Q8522m01523N29687m97594N02058j35574l0660J00579m0390
$$ 1648049 1667420 1755942 1354419 1884106 1386512 1888570 1752996 1722336 1822915 1782525
16895A782525j39943K12077k99797J86730j06751J29641j983O6829j17318K35702
$$ 1782525 1642582 1854659 1554862 1741592 1634841 1764482 1762499 1829328 1712010 1947712
16885A947712J74282j16393o3211K36683k7412k8895l84011K08480j40371M76392
$$ 1947712 2121994 2005601 1942390 2179073 2151661 2122766 1738755 1947235 1806864 2283256
16875B283256j20698J28535p5863J54418r9151N9915J65301j72512J96187k4876
$$ 2283256 2162558 2291093 2215230 2369648 2270497 2330412 2495713 2323201 2519388 2494512
16865B494512j40941j19573j41801O91843q4237J79671k78483J53838Q1842l3359
$$ 2494512 2353571 2233998 2092197 2784040 2699803 2879474 2600991 2754829 2836671 2803312
16855B803312J38369K1764k37047K80062P1187j21835K73083M0125Q369K32575
$$ 2803312 2941681 2963445 2726398 3006460 3077647 2955812 3228895 3269020 3277389 3509964
16845C509964n5633m13435N84786K11627m03756n5531K61179J8326M2307N9736
$$ 3509964 3454331 3040896 3625682 3837309 3433553 3378022 3639201 3657527 3699834 3759570
16835C759570K49414m3579J80790j0585N0565j38331J90914L67255p7564j1460
$$ 3759570 4008984 3965405 4146195 4135610 4186175 4047844 4238758 4606013 4528449 4516989
16825D516989J79921J51387l36798K18106j47610N00344P588N44232n3160j62502
$$ 4516989 4696910 4848297 4511499 4729605 4581995 5082339 5089927 5634159 5580999 5418497
16815E418497l78917O01444j93023L03484P6920M47580j27325J56243J52764K5785
$$ 5418497 5039580 5641024 5448001 5751485 5828405 6275985 6148660 6304903 6457667 6483452
16805F483452N66155j87759k9905K06384K28501J75623j76754L63893N42521P0987
$$ 6483452 7049607 6861848 6831943 7038327 7266828 7442451 7265697 7629590 8172111 8243098
16795H243098L2949K41909L99248k5093o7089P32248K6186R5163L58472N52224
$$ 8243098 8276047 8517956 8917204 8892111 8825022 9557270 9583456 9678619 10037091 10589315
16785A0589315k20721N29103M45972J53030J04328O51821l2071P16323M11302
$$ 10589315 10368594 10897697 11343669 11496699 11601027 12252848 12220777 12937100 13348402
16776A3348402J96626P05475M90481N57451L58225K27523Q85552O34346M01352
$$ 13348402 13545028 14250503 14740984 15298435 15656660 15884183 16769735 17404081 17805433
16767A7805433Q71966L38972M74669Q47130J068967N27673N74937J493900P26064
$$ 17805433 18677399 19016371 19491040 20338170 21407137 21934810 22509747 24003647 24729711
16758B4729711J007087J017433J285628J251316J162057J115906J553718J427825
$$ 24729711 25736798 26754231 28039859 29291175 30453232 31569138 33122856 34550681
16750C4550681J962408J703302J999885J761879K254303J908016K707473K433612
$$ 34550681 36513089 38216391 40216276 41978155 44232458 46140474 48847947 51281559
16742E1281559L079701L070577L076252L519249L429249L926012M468328M877754
$$ 51281559 54361260 57431837 60508089 64027338 67456587 71382599 75850927 80728681
16734H0728681M773473N383675N404368N879345O520016O378998O982063P519727
$$ 80728681 85502154 90885829 96290197 102169542 108689558 115068556 122050619 129570346
16726A29570346P463627P899039P693184P818372P611707P315765O561381N875298
$$ 129570346 137033973 144933012 152626196 160444568 168056275 175372040 181933421 187808719
16718A87808719N016486L111426K802669J150173n53501j747546l640945m093908
$$ 187808719 192825205 195936631 198739300 199889473 199335972 197588426 193947481 189853573
16710A89853573n641119o249094o672939q078791p584293p972214p756674q284542
$$ 189853573 184212454 177963360 171290421 163211630 155627337 147655123 139898449 131613907
16702A31613907p743185p082781p068850o194550o342748o223974n248598n342700
$$ 131613907 123870722 116787941 109719091 103524541 97181793 90957819 85709221 80366521
16694H0366521m497647m650896m009168l809351l975739l224775k996064k918606
$$ 80366521 75868874 71217978 67208810 63399459 59423720 56198945 53202881 50284275
16686E0284275k778780k317344k458332j783055k391541j574476j649444j857360
$$ 50284275 47505495 45188151 42729819 40946764 38555223 36980747 35331303 33473943
16678C3473943j213252j832430j510677r40867j248562j208696o98993j396216
$$ 33473943 32260691 30428261 28917584 27976717 26728155 25519459 24820466 23424250
16670B3424250q95306r06450q00258j016833n85819m40747o49990r23493n63782
$$ 23424250 22528944 21622494 20822236 19805403 19219584 18778837 18128847 17205354 16641572
16661A6641572m63579p26373k55033p76998l40729p15723j60935l98523m48000
$$ 16641572 16177993 15451620 15196587 14419589 14078860 13363137 13202202 12803679 12355679
16652A2355679k41234o85741p6335n94266k33744n81305J53239k82997M3324j81795
$$ 12355679 12114445 11428704 11352369 10758103 10524359 9943054 10096293 9813296 9856620 9674825
16642I674825o47436j31525j50377m35452k55325n87160k53250O50785o21369
$$ 9674825 9027389 8895864 8745487 8310035 8054710 7467550 7214300 7865085 7243716
16633G243716q6788k77011l38523K77785k47216n37799o6238o5014R9983l20537
$$ 7243716 7156928 6879917 6541394 6819179 6571963 6034164 5967926 5902912 6002895 5682358
16623E682358N2985k05087j68649l31717J56999k80619K6890j44362j31297r7397
$$ 5682358 5735343 5530256 5361607 5029890 5186889 4906270 4933160 4788798 4657501 4560104
16613D560104n5045L8771m9424p1972j00430r4194j26569o2970k66679Q6873l39932
$$ 4560104 4505059 4543830 4494406 4422434 4322004 4227810 4101241 4038271 3771592 3858465 3518533
16602C518533L67145J9420k83156n6258j52981k85705J43705k19289M3978J47462
$$ 3518533 3885678 3905098 3621942 3565684 3412703 3126998 3270703 3051414 3095392 3242854
16592C242854L4568m04576p1799p689J47828l12723k23340K59332K52853m04369
$$ 3242854 3277422 2872846 2801047 2793358 2941186 2628463 2405123 2664455 2917308 2512939
16582B512939J43728k68241P310j80100J41298J19474m12500L27848m03464J75355
$$ 2512939 2656667 2388426 2395736 2215636 2356934 2476408 2063908 2391756 1988292 2163647
16572B163647J84581j11071r0174J56831n69572L61204P4489K03354k63438j65192
$$ 2163647 2348228 2237157 2146983 2303814 1734242 2095446 2169935 2373289 2109851 1944659
16562A944659J35794k8849k41000k3481J78832n3282l41666P1086J87117R1928
$$ 1944659 2080453 2051604 1810604 1787123 1965955 1912673 1571007 1642093 1829210 1921138
16552A921138l18078j9358l05555L04270l2817J87769k28989R4370l6084l3794
$$ 1921138 1603060 1583702 1278147 1582417 1549600 1737369 1508380 1602750 1566666 1532872
16542A532872j83548J28028j0120q9773j55678P3933r249q7960R6994L6500l11320
$$ 1532872 1349324 1477352 1467232 1377459 1221781 1295714 1286465 1198505 1295499 1331999 1020679
16531A020679J96127K16311k47310j10975L36372l14332J23593r31k09689K34448
$$ 1020679 1216806 1433117 1185807 1074832 1411204 1096872 1220465 1219534 1009845 1244293
16521A244293o8810j40008k3110q8616M0220M18591j21637j76680k87097N09571
$$ 1244293 1175483 1035475 1012365 923749 963969 1382560 1260923 1084243 797146 1306717
16511A306717k83827j34372J18677j70003K40876k79632K74071k04139j93335
$$ 1306717 1022890 888518 1007195 837192 1078068 798436 1072507 868368 675033
16502F75033K92263l12906J26205j87480L71695j53949J54000j26030k2134j33936
$$ 675033 967296 654390 780595 593115 964810 810861 964861 838831 816697 682761
16492F82761M14944m52625J96874r4185j77524L39865j96370K69195k70763L42344
$$ 682761 1097705 645080 841954 747769 570245 910110 713740 982935 712172 1054516
16482A054516D68173L37581q2298K53573k39898J28071r2218Q1759k26271j93547
$$ 1054516 468173 805754 723456 977029 737131 865202 772984 854743 628472 434925
16472D34925K9944N8463J76368n9759J38522L9265j25655q7409k14606q1234j09181
$$ 434925 464869 523332 699700 639941 778463 817728 692073 604664 390058 308824 199643
16461A99643M58622l116J16277l01184J35653P973J69100r1776k61620L94470
$$ 199643 658265 655149 771426 470242 605895 613868 782968 691192 429572 824042
16451H24042l41215K95768l50847K78916O636l28997L60761N6814C97124L135
$$ 824042 482827 778595 427748 706664 713300 384303 745064 801878 397124 400259
16441D00259J599K26725j82581r2406J09430n5836J00757o6364Q6617B17415L51585
$$ 400259 401858 628583 446002 353596 463026 407190 507947 441583 528200 217415 569000
16430E69000j68450m7862L23072l4376B18085L19999k16585K50767l5649k01814
$$ 569000 400550 352688 675760 641384 218085 538084 321499 572266 536617 334803
16420C34803L09560H0850K41406J11324A32274M22470j66002K11907B29531O8176
$$ 334803 644363 80850 322256 433580 132274 554744 388742 600649 229531 297707
16410B97707L35333A37358K83506P9349k8235j74509J20541l9957j52899K61580
$$ 297707 633040 137358 420864 500213 471978 297469 418010 378053 225154 486734
16400D86734n1516J16240K2308R3313C05905K35447A34312R9262L63497k69773
$$ 486734 435218 551458 573766 667079 305905 541352 134312 233574 597071 327298
16390C27298p3968p7382J84877o6037J21982G1865j5985a73707A99851P668J61355
$$ 327298 253330 175948 360825 294788 416770 71865 55880 -173707 199851 207519 368874
16379C68874J92427A81844j6582O7681J30401k5772r4914K42793e1674F29039
$$ 368874 561301 181844 165262 232943 363344 337572 242658 485451 -51674 629039
16368A12039d8756F4394A6155a51F3366L96594A99325R0854M2935J73766B51125
$$ 112039 -48756 64394 16155 -151 63366 459960 199325 290179 333114 506880 251125
16356A21408J32403r2579B487M25697M5368k15506e4655D21163j51981q4468j6463
$$ 121408 253811 161232 2487 428184 473552 258046 -54655 421163 269182 184714 168251
16345A68251H0836K01205A14018J42483D5980i0786G04860H6940K63090b39029
$$ 168251 80836 282041 114018 256501 45980 -90786 704860 86940 350030 -239029
16334B66862r1211D65J3333M4593K06668J18491j28993L3756L21327B755K83883
$$ 266862 175651 465 13798 58391 265059 383550 254557 288313 609640 2755 286638
16323B86638i3917B94889L964A37369J65121h168C08457a6338A08591g5440A19485
$$ 286638 -93917 294889 298853 137369 302490 -8168 308457 -16338 108591 -75440 119485
16311B00386k0970l8079Q96a19949A38611N3615o3121K07836j64024k2811C087
$$ 200386 179416 141337 142233 -119949 138611 192226 129105 336941 172917 150106 3087
16299B89644J93290A20882J38080C6219a3794D7981J43490A2327J04943J03952
$$ 289644 482934 120882 258962 36219 -13794 47981 191471 12327 117270 221222
16289B21222k2363j0241R7766Q9375b99335G744Q5274K3514C2928O277a09052
$$ 221222 198859 188618 286384 375759 -299335 7744 93018 116532 32928 39205 -109052
16277A35376K53872A78097o7556M3276L32215G0426J03133R7418E5341a09510
$$ 135376 389248 178097 110541 153817 486032 70426 173559 270977 55341 -109510
16266F4157c0236B41488c9523n6886A8619J28081G22L57004F6633c8053A64150
$$ 64157 -30236 241488 -39523 -96409 18619 146700 722 357726 66633 -38053 164150
16254i3709k6028m9602A10786J51807a14638C8517N6059L57087j91685p5723F5490
$$ -93709 -119737 -169339 110786 262593 -114638 38517 94576 451663 259978 184255 65490
16242A42261j875h6461a7382B81561E9987J68617n8994c6565l3867j84920B0729
$$ 142261 140386 -86461 -17382 281561 59987 228604 169610 -36565 -70432 -255352 20729
16230A9048J76341J42917a19654A4122a23791L0158a4988I2463L8614C8479N7380
$$ 19048 195389 338306 -119654 14122 -123791 -93633 -14988 92463 131077 38479 95859
16219I5859B2442g111B25591b14415d3262a7892A75959F671a5342D83453j65245
$$ 95859 22442 -7111 225591 -214415 -43262 -17892 175959 6671 -15342 483453 318208
16208C18208j19679j6793K2966p1362n3206f2661k066p0887A65247i7101C41664
$$ 318208 198529 181736 204702 133340 80134 -62661 -64727 -135614 165247 -97101 341664
16196a27088A88944K4001F1117J85163E9823c24282A43099b28002O1341A98387
$$ -127088 188944 212945 61117 246280 59823 -324282 143099 -228002 -166661 198387
16185A82589A0245K69493E3003L3927c52865a15175C43464G8669C7347L86913
$$ 182589 10245 279738 53003 86930 -352865 -115175 343464 78669 37347 424260
16175D24260b99460a25615a187I1049b39057A08739i6617D93920d0365B24011
$$ 424260 -299460 -125615 -1187 91049 -239057 108739 -96617 493920 -40365 224011
16164B8467c96354b7708j79278A48839e3664B43279k952f2345j72448J2811I1524
$$ 28467 -396354 -27708 -206986 148839 -53664 243279 240327 -62345 -234793 -221982 91524
16152A55094D9627J9855A6209a19572B16548d6213o2670j16230F6375a2765p5811
$$ 155094 49627 69482 16209 -119572 216548 -46213 -108883 -225113 66375 -12765 -88576
16141h8576C54195i6468m3700A38456k9222a18912E9578a8786m9842B49994c67452
$$ -88576 354195 -96468 -140168 138456 109234 -118912 59578 -18786 -68628 249994 -367452
16129g7231A83788c48054a52860A42215a98877f7844k33309J5505c452H4293K2810
$$ -77231 183788 -348054 -152860 142215 -198877 -67844 -301153 -285648 -3452 84293 107103
16118A07103f9599B50812c6729o6288f309H8445b73356A37235K5359f955m6801
$$ 107103 -69599 250812 -36729 -103017 -6309 88445 -273356 137235 162594 -6955 -53756
16107e3756I1803a48058f6613K6809H9146c0693J3745B36875a70970I0024a23983
$$ -53756 91803 -148058 -66613 -39804 89146 -30693 -16948 236875 -170970 90024 -123983
16095G9517k8906K61056A01282a8266k870D8306e3783j7603k3019l5114M1744
$$ 79517 50611 311667 101282 -18266 -21136 48306 -53783 -71386 -94405 -129519 -87775
16084h7775j35328R3617c7566B37051c5111l8720G1066a27595n791A44530e8429
$$ -87775 -223103 -129486 -37566 237051 -35111 -73831 71066 -127595 -133386 144530 -58429
16072b25208D87659F5213R6182l6491f073p6661j23419e1522o1433M6903A41421
$$ -225208 487659 65213 161395 124904 -6073 -82734 -206153 -51522 -112955 -66052 141421
16060A1171b3827n2687A93477E6750K2016O3082e67268H8885J44113J0465J9560
$$ 11171 -23827 -76514 193477 56750 78766 141848 -567268 88885 232998 243463 263023
16049B63023B8882J11186a52219L0106j41513B68681A4871f6094F5107J0698i2158
$$ 263023 28882 140068 -152219 -122113 -263626 268681 14871 -66094 65107 75805 -92158
16037F521b98709a3559B34022g1535B59237c40221J37493C44850k1390a28144
$$ 6521 -298709 -13559 234022 -71535 259237 -340221 -202728 344850 323460 -128144
16026F7216g7199A21873a268B73843g1025q6285l8338D292c0595A39658b83204
$$ 67216 -77199 121873 -1268 273843 -71025 -157310 -195648 4292 -30595 139658 -283204
16014A47809J16865a24651K2872B6291N9289Q3930c25089I6296q215a89145A07771
$$ 147809 264674 -124651 -101779 26291 85580 169510 -325089 96296 88081 -189145 107771
16002B14971d3674K049A61771J8912J60458b30533A50992O7902b74270k16749
$$ 214971 -43674 -41625 161771 180683 341141 -230533 150992 218894 -274270 -491019
15992d91019c135j6269H8777M1620g3070A65526D4565C86K26365J9505l6063n7823
$$ -491019 -3135 -19404 88777 130397 -73070 165526 44565 386 226751 246256 210193 152370
15980A52370N3291q1488J18234m2627i4855J3875A92529h7647o3142A016K22082
$$ 152370 205661 124173 242407 199780 -94855 -80980 192529 -87647 -150789 1016 223098
15969B23098J7537N934D1980R1564b38473p5697A48018a28303k42924A09366a98817
$$ 223098 240635 246569 41980 133544 -238473 -314170 148018 -128303 -371227 109366 -198817
15957B67497C2845b96908J06340D4405a29403N6251k0555A9015N9515a88984a0715
$$ 267497 32845 -296908 -190568 44405 -129403 -73152 -93707 19015 78530 -188984 -10715
15945E5162O4267M85122e4144p0713p7261B64095a45462P910k4162G711d9282
$$ 55162 119429 604551 -54144 -124857 -202118 264095 -145462 -137552 -161714 7711 -49282
15933B6552b18682D1760a55415j32829a43666e9787C36590e0729l47748J45357
$$ 26552 -218682 41760 -155415 -288244 -143666 -59787 336590 -50729 -398477 -253120
15923b53120e9292l05651a09970n3930M571N2443j13441L7324j48502G2215f044
$$ -253120 -59292 -364943 -109970 -163900 -159329 -106886 -220327 -183003 -331505 72215 -6044
15911g7272I8202c04759H408P8499b36162f5444b4184A58082G9013a86144e49
$$ -77272 98202 -304759 8408 86907 -236162 -65444 -24184 158082 79013 -186144 -549
15899a33042A84192b15528A96234b52268J07301m6382r988i6939M4225l21461
$$ -133042 184192 -215528 196234 -252268 -144967 -191349 -201337 -96939 -52714 -374175
15889c74175c6329H4636K4159O0799E1889b05118A49633p1059b46148A70669n6267
$$ -374175 -36329 84636 108795 169594 51889 -205118 149633 78574 -246148 170669 114402
15878A14402a48955N0521K2331A23048h6973d1575q837m9413C0285i1879k42471
$$ 114402 -148955 -98434 -76103 123048 -86973 -41575 -50412 -99825 30285 -91879 -334350
15867c34350a21619L5982B02501H3863M4428a89999A64771F196a2054d662j27302
$$ -334350 -121619 -85637 202501 83863 128291 -189999 164771 6196 -12054 -4662 -131964
15856a31964q2266A41596m013A3451K864c09176a2748j31182L3889B59092G4961
$$ -131964 -214230 141596 137583 13451 16315 -309176 -12748 -143930 -110041 259092 74961
15844a15858p7089j2656G9607f1928A36401a55455m952l3027g4009b009j7676
$$ -115858 -192947 -205603 79607 -61928 136401 -155455 -160407 -193434 -74009 -2009 -19685
15833a9685A08483b24125I4428a23945q4357j5473q1158H0853b53782A31789b59822
$$ -19685 108483 -224125 94428 -123945 -208302 -223775 -304933 80853 -253782 131789 -259822
15821A8737c13883M3221J01233J5732m6909b3594H3046C8617a31449A15279b0857
$$ 18737 -313883 -270662 -169429 -153697 -200606 -23594 83046 38617 -131449 115279 -20857
15809C23724c4264j95373G7229a57906A12333I988b32918E1458J03876l8321a8165
$$ 323724 -34264 -229637 77229 -157906 112333 9988 -232918 51458 155334 117013 -18165
15797a00208A75349a12846F4386M3555c74000i6834A81431a77991h8952l49147
$$ -100208 175349 -112846 64386 107941 -374000 -96834 181431 -177991 -88952 -438099
15787d38099D4387a21588O0588A13702L2615a58985K8106B2329J77694a14970
$$ -438099 44387 -121588 -61000 113702 146317 -158985 -130879 22329 200023 -114970
15776a52783N9200q7709e5892j21303g8946q7808l4804K9998f5507A38758k7352
$$ -152783 -93583 -181292 -55892 -177195 -78946 -166754 -201558 -171560 -65507 138758 111406
15765A11406a1247B9654b2562j4724B93236B9899j1004c4556J3776A00977A7490
$$ 111406 -11247 29654 -22562 -37286 293236 29899 18895 -34556 -20780 100977 17490
15753B2761r493M0233J88825J96630j44641A05452K07861g3933q0023B13907r8395
$$ 22761 13268 53501 242326 438956 294315 105452 313313 -73933 -153956 213907 115512
15742A15512B2993J93720C8365K09070a12936B86410h5481n2948D7888i7128A12362
$$ 115512 22993 216713 38365 247435 -112936 286410 -85481 -138429 47888 -97128 112362
15730A54992e8034A36081d5754A1168b8400H5325A1993a34677M7044j74551P6319
$$ 154992 -58034 136081 -45754 11168 -28400 85325 11993 -134677 -87633 -262184 -185865
15719a85865A97338A1907a19024L0086n1780j06755E1852N687a29881M7966j12099
$$ -185865 197338 11907 -119024 -88938 -140718 -247473 51852 57539 -129881 -81915 -194014
15708a94014a4240B57501J8097P7738A4058b55886n9643d6092r3382d325l17592
$$ -194014 -14240 257501 275598 353336 14058 -255886 -315529 -46092 -139474 -4325 -321917
15697c21917F4306e4692H4845h0894C60450j23447J17835c229p9348k10903N7941
$$ -321917 64306 -54692 84845 -80894 360450 237003 354838 -3229 -82577 -293480 -235539
15686b35539j8887o2918a33186n7704h820B2794J02472M2416a57548H0398K7229
$$ -235539 -254426 -317344 -133186 -190890 -8820 22794 125266 167682 -157548 80398 107627
15675A07627h0267A99139n1892o4501J63358d2393k56j38409A12813J7379c18260
$$ 107627 -80267 199139 147247 82746 246104 -42393 -42649 -181058 112813 130192 -318260
15663c97641B40552E9426c12583O9379J04895e1778k09988I5995D0194N609M3963
$$ -397641 240552 59426 -312583 -243204 -138309 -51778 -261766 95995 40194 45803 89766
15652H9766c57955J77684B73388c9547H3056C6515J24998B7886a32558G6133K07645
$$ 89766 -357955 -180271 273388 -39547 83056 36515 161513 27886 -132558 76133 283778
15641B83778a49347D39854I3637L5977n1326a32375o9483A7626J141b47863P6488
$$ 283778 -149347 439854 93637 129614 78288 -132375 -201858 17626 18767 -247863 -171375
15630a71375l816q5466n3090Q9135a8398n1771j96102L3281A732a80975G317K8882
$$ -171375 -175191 -260657 -313747 -224612 -18398 -70169 -266271 -232990 1732 -180975 7317 36199
15618C6199a52543N2661j7483j61951M1969l863A18753b1428r1908J3037A2243
$$ 36199 -152543 -99882 -117365 -279316 -237347 -241210 118753 -21428 -113336 -100299 12243
15606A37520c77672I0949d1028j63095c8700J0459B8075a01419d6832j48391A17198
$$ 137520 -377672 90949 -41028 -204123 -38700 -28241 28075 -101419 -46832 -195223 117198
15594a09041j24273l9953E4267d6749q4883i294k61570b2854G0854b97445O554
$$ -109041 -233314 -273267 54267 -46749 -131632 -9294 -270864 -22854 70854 -297445 -290891
15583b90891I5749L4773b02012j35320A55949a92719F6045Q113a45007j15947
$$ -290891 95749 130522 -202012 -337332 155949 -192719 66045 74158 -145007 -260954
15573b60954q0374f793Q95k7403B27725g5037F6862d7485j46162h2003q4305B15700
$$ -260954 -341328 -6793 -5898 -33301 227725 -75037 66862 -47485 -193647 -82003 -166308 215700
15560a25720j59587A61414R8850f6794B53279q8087E7150a29227F1281i7864B93054
$$ -125720 -285307 161414 260264 -66794 253279 165192 57150 -129227 61281 -97864 293054
15548c80901h5953A26315b343o1744A92064b58009O1924m4435A95934A9783d3272
$$ -380901 -85953 126315 -2343 -64087 192064 -258009 -196085 -240520 195934 19783 -43272
15536C816L74679N8963a04125j72769H6468K04058g699q2950a37B18795a79509
$$ 3816 378495 437458 -104125 -276894 86468 290526 -7699 -90649 -137 218795 -179509
15524B81889b00535C5692F269J77399a35360A4139J60049a5952g357E3382R1589
$$ 281889 -200535 35692 6269 183668 -135360 14139 174188 -15952 -7357 53382 144971
15513A44971D5082d46187a62763L2527a8481A08004e0464l7629A32935b2629j11855
$$ 144971 45082 -446187 -162763 -130236 -18481 108004 -50464 -88093 132935 -22629 -134484
15502a34484c9311G9778M0877A582b34287G0817A2348J46261a68901A21858f344
$$ -134484 -39311 79778 120655 1582 -234287 70817 12348 158609 -168901 121858 -6344
15490D2763g4753C43908a53309b2379A15813K51442i5617A39366d5835A842a56007
$$ 42763 -74753 343908 -153309 -22379 115813 367255 -95617 139366 -45835 1842 -156007
15478f1821A01057K37283A21890c98840d5480J8938l916B93325a91326g9853D8564
$$ -61821 101057 338340 121890 -398840 -45480 -26542 -30458 293325 -191326 -79853 48564
15466a43143J7474q198A17658d6650A81137H3896L9423L0181g6355I3567a21279
$$ -143143 -125669 -133867 117658 -46650 181137 83896 123319 153500 -76355 93567 -121279
15454A80431J06782a65490c8900A75505P6798a53366D0504J9101d5697D04994
$$ 180431 287213 -165490 -38900 175505 252303 -153366 40504 59605 -45697 404994
15443b51190B55828B4700a41698I7224e2024a6859B10562o918a41761k95732g138
$$ -251190 255828 24700 -141698 97224 -52024 -16859 210562 203644 -141761 -437493 -7138
15431A85644e32590a481H883P9656f8218j71695B08783d9192j08302C38757b85277
$$ 185644 -532590 -1481 8883 88539 -68218 -239913 208783 -49192 -157494 338757 -285277
15419c04395A33886O2888B5664J61248E07K698f750j08378B06139a15355a2985
$$ -304395 133886 196774 25664 186912 507 3205 -6750 -115128 206139 -115355 -12985
15407i234p8640j92324p9723J33107B45986a74226D11968A57889l3520a01067
$$ -9234 -87874 -280198 -359921 -226814 245986 -174226 411968 157889 124369 -101067
15396a8800l02923a38331A7K0762Q2241N3228H206k382L9726a94972g268E3046
$$ -18800 -321723 -138331 17 20779 103020 156248 8206 5824 45550 -194972 -7268 53046
15383a96799H5668a6351A99881m2983b28547c1611j56438B95517K808p9349p0167
$$ -196799 85668 -16351 199881 156898 -228547 -31611 -188049 295517 298325 218976 148809
15372A48809a97764C15744b40493a0688k21524H933b18897B83472q389I1810b79588
$$ 148809 -197764 315744 -240493 -10688 -232212 8933 -218897 283472 275083 91810 -279588
15360A36240Q669a35340C1816c65422a15655A15986c63089b5608e284G7025P7845
$$ 136240 144909 -135340 31816 -365422 -115655 115986 -363089 -25608 -5284 77025 154870
15349A54870E5505j8581c71771E9004b13146C7751J74907l8734b60224B48057
$$ 154870 55505 36924 -371771 59004 -213146 37751 212658 173924 -260224 248057
15338h4559a7498P688m22630A67648i9076A37500b4814k3410B94230A26185l2594
$$ -84559 -17498 -9810 -432440 167648 -99076 137500 -24814 -48224 294230 126185 93591
15327I3591D6706c04848G077k560J5407R3269b2006F3473a26547E555c5799M250
$$ 93591 46706 -304848 7077 4517 19924 113193 -22006 63473 -126547 5555 -35799 -31549
15315c1549A23237b49736j70395B92564a47164k925D6100P0665M7526m4796a88223
$$ -31549 123237 -249736 -420131 292564 -147164 -150089 46100 116765 164291 119495 -188223
15303a06797j84729c4194j80878b8223J3447G2364b1920k13942a490B5377J69329
$$ -106797 -291526 -34194 -215072 -28223 -14776 72364 -21920 -235862 -1490 25377 194706
15292A94706L9534E3824M9341C7070j565a7177j79699j09517a26566j52621o3087
$$ 194706 234240 53824 103165 37070 35505 -17177 -196876 -306393 -126566 -279187 -342274
15281c42274A90808p1736O86L64546k25955K27075A27867J20019j11526P2241
$$ -342274 190808 119072 119758 484304 258349 485424 127867 247886 136360 208601
15271B08601a72305e7726k91566i0415I3728i4020D97013B0625a36449r0378A77024
$$ 208601 -172305 -57726 -349292 -90415 93728 -94020 497013 20625 -136449 -226827 177024
15259b70995J12807e0426E87228k36877l7720o176j29471K8363J0832M8111K47902
$$ -270995 -158188 -50426 587228 350351 312631 306455 176984 205347 216179 264290 512192
15248E12192J091546k99416N6626L84310D59833A76845Q3284A485K82173H3674
$$ 512192 1603738 1304322 1360948 1745258 459833 176845 260129 1485 283658 83674
15237i2983D18686e7240F4181J61817H7526b7027E667J83622d710a838F0539A2900
$$ -92983 418686 -57240 64181 225998 87526 -27027 5667 189289 -4710 -1838 60539 12900
15224B07713A8598J70440j2991J1962d5307E5214P6947a82441j08967h7788G1903
$$ 207713 18598 189038 176047 188009 -45307 55214 132161 -182441 -291408 -87788 71903
15212D7395J62038A3053J8415Q0062M18655d6506A35807k8285o392a33396I1146
$$ 47395 209433 13053 31468 111530 530185 -46506 135807 107522 101130 -133396 91146
15200b2980D15584b6702j84720H5774P6131b76376k9154B29103k4107G5094a42159
$$ -22980 415584 -26702 -211422 85774 161905 -276376 -305530 229103 204996 75094 -142159
15188a70425F9217g788j64235D3619K51368a21058A24237M4813F0494J56754C8059
$$ -170425 69217 -7788 -172023 43619 294987 -121058 124237 169050 60494 217248 38059
15176e8386F2572K21160d2421E5960e27638A76544a5648B08351G3733J56152A03789
$$ -58386 62572 283732 -42421 55960 -527638 176544 -15648 208351 73733 229885 103789
15164a13525A47856m9615h2383B15465b48953A09962L8931G2286R6151c8555A87511
$$ -113525 147856 98241 -82383 215465 -248953 109962 148893 72286 168437 -38555 187511
15152g6391k69256J19482A9131g8548A09726E1365O1523A4966g5067G5633Q0293
$$ -76391 -345647 -226165 19131 -78548 109726 51365 112888 14966 -75067 75633 155926
15141A55926k9855K0291K25008A48123f6853A23325J9832L04496A95254D02K19917
$$ 155926 126071 146362 371370 148123 -66853 123325 143157 447653 195254 402 220319
15130B20319h748D30815b98642F9891A6339L65311i4123C18897l3530p8567j6897
$$ 220319 -8748 430815 -298642 69891 16339 381650 -94123 318897 285367 206800 189903
15119A89903b2434m1108B12649l5001p2131b6303A62537c8926O930D90726e539
$$ 189903 -22434 -63542 212649 177648 105517 -26303 162537 -38926 -31996 490726 -5539
15107A39794R8016k0361D1538N0831K04477I5185O8607J33002J25088a53391B15884
$$ 139794 237810 217449 41538 92369 296846 95185 163792 296794 421882 -153391 215884
15095f2983A04255c4103D31488j41596A12181J7901I23J25000L02933j59579p4007
$$ -62983 104255 -34103 431488 289892 112181 130082 923 125923 428856 269277 195270
15084A95270G1884M8091K34739I3659K42021H1930J97454L8867E4632N6362B5606
$$ 195270 71884 119975 354714 93659 335680 81930 279384 318251 54632 110994 25606
15072A98364H7880J60916A00431J60291m8271B4595M24885A20631K9115a41845
$$ 198364 87880 248796 100431 260722 212451 24595 449480 120631 149746 -141845
15061A76709p7484j046g4191B19948j2132J21240I2461O7082F399N8026R4370
$$ 176709 99225 98179 -74191 219948 207816 329056 92461 159543 6399 64425 158795
15050A58795C1368J29437i9423B26612C3834J32725b4697A91666f2492j09557
$$ 158795 31368 160805 -99423 226612 33834 166559 -24697 191666 -62492 -172049
15040a72049P603A31548c7231J3010C49005j05548m3699P8239j8126p1026K7963
$$ -172049 -164446 131548 -37231 -24221 349005 243457 199758 277997 259871 188845 216808
15029B16808P4875D871L38290a20061C06028j07953E8306O331L04666A38350J84807
$$ 216808 291683 4871 343161 -120061 306028 198075 58306 64637 369303 138350 323157
15018C23157j10860Q0958P3008A25580k3928J03817K7757B2666K52457l4269J37958
$$ 323157 212297 293255 366263 125580 101652 205469 233226 22666 275123 240854 378812
15007C78812m0866q7557a31382A26254Q2637K64034A03838R4788H0956b0971C46027
$$ 378812 337946 250389 -131382 126254 208891 472925 103838 198626 80956 -20971 346027
14995D20d7407B61053G0462L02462j66041L09782A85268K12202r9534A17564g27
$$ 420 -47407 261053 70462 372924 206883 516665 185268 397470 297936 117564 -727
14983B50099K6036P923j02502p0123N12138A6345N76679k82609p2539k6452f0005
$$ 250099 276135 284058 181556 111433 623571 16345 593024 310415 237876 211424 -60005
14971a28042A88055J90146o3134A23980K95126j62595D4217J57890O0903l078
$$ -128042 188055 378201 315067 123980 419106 256511 44217 202107 263010 259932
14961B59932g3980C9545Q155e3112A15497f0998F10642A92481k9399G9821K20710
$$ 259932 -73980 39545 47700 -53112 115497 -60998 610642 192481 163082 79821 300531
14950C00531m6687K47446j01774I4421J40574J52079p7019B5276J83738b5636
$$ 300531 253844 501290 399516 94421 234995 387074 310055 25276 209014 -25636
14939A29358K47446j54285R3127K0513j9744j47184L39985F4712M07890A07741
$$ 129358 376804 222519 315646 336159 316415 169231 509216 64712 472602 107741
14928E02104B20328L6041L11796p3111n6686B00110O5898D3969Q1331L23783H1657
$$ 502104 220328 256369 568165 495054 438368 200110 266008 43969 125300 449083 81657
14916D88217k43038H5136R0028m4656b7730C50369f7517B63239L3357M4712L21639
$$ 488217 245179 85136 175164 130508 -27730 350369 -67517 263239 296596 341308 662947
14905F62947C11769J01393k288A80059n1875J75707j41942K18001p5399A26412
$$ 662947 311769 413162 410874 180059 128184 303891 161949 379950 304551 126412
14894B73826J74337N1901K596j39090j47562K52255j14926L16440A72133L52964
$$ 273826 448163 500064 502660 363570 216008 468263 353337 669777 172133 525097
14884E25097J9444j94218A64286K95751j97234K85561o5855A75323M05242j37715
$$ 525097 544541 350323 164286 460037 262803 548364 482509 175323 580565 442850
14874D42850J45800M4032B45661n7075K66287k20611L24167B41191k6861K45190
$$ 442850 588650 632682 245661 188586 454873 234262 558429 241191 214330 459520
14864D59520A75332K81643p7938N27397D29927m7432Q43J84940k08291A08130
$$ 459520 175332 456975 379037 906434 429927 382495 383338 568278 359987 108130
14853C00063J25964l5092m7190j37407J42937A73695N91548B36878r875p8804
$$ 300063 426027 390935 343745 206338 349275 173695 765243 236878 227003 148199
14843A48199K39616K32989N1792k98398K46121k00470A87097K30050O5117K82357
$$ 148199 387815 620804 672596 374198 620319 419849 187097 417147 482264 764621
14833G64621k75460J65002j88203B25200L73283F0915J99831N06072o1825j39211
$$ 764621 489161 654163 465960 225200 598483 60915 260746 766818 704993 565782
14823E65782j34537O5822j38870J4594r342K33436q3709K2043k64441J62481J27930
$$ 565782 431245 497067 358197 372791 363449 596885 513176 535219 270778 433259 561189
14812E61189j52095M59599B76616J46256J69669j15668P8508k36464K36781j60220
$$ 561189 409094 868693 276616 422872 592541 476873 555381 318917 555698 395478
14802C95478j58075J31121Q4424N734O8486L33366m16996o8997L29889k03466
$$ 395478 237403 368524 452948 458682 527168 860534 443538 374541 704430 500964
14792E00964j8920L29476k41311J87683l12314j46014K13553J06228J16951J15223
$$ 500964 482044 811520 570209 757892 445578 299564 513117 619345 736296 851519
14782H51519j46390p3899O8248M0232k3580l12802K27268J06840j6884m6266C31146
$$ 851519 705129 631230 699478 739710 716130 403328 630596 737436 720552 674286 331146
14770G03458k79238Q8028L6952r9442n5692L00504j73304J13974r0455J54321
$$ 703458 424220 512248 549200 449758 394066 694570 521266 635240 544785 699106
14760F99106k21349n2014K90809r784O785l29376M75999k76031K67370m04423
$$ 699106 477757 425743 716552 706768 713553 384177 860176 584145 851515 447092
14750D47092K61826k63320L93169l16829J69177J71718m223j49217J33394J46905
$$ 447092 708918 445598 838767 521938 691115 862833 858610 709393 842787 989692
14740I89692m00384j9702K93711C67194M09626l45101N53157m66101L95360k17842
$$ 989692 589308 569606 863317 367194 776820 431719 984876 518775 914135 696293
14730F96293j06327L00336k40733k69630O76395D93158M47747L5021j62164j69193
$$ 696293 589966 890302 649569 379939 1056334 493158 940905 975926 813762 644569
14720F44569J79919k15832j6955n3456K94191J20527k15565m6329P0040J70747
$$ 644569 824488 608656 591701 538245 832436 952963 737398 691069 761109 931856
14710I31856L83315m70835K22884K7501k47943K05033D62002L25188K14926j1527
$$ 931856 1315171 844336 1067220 1094721 846778 1051811 462002 787190 1002116 990589
14700I90589m94037K88238J03571k7927J26076J54400J95667m34061o3696r3839
$$ 990589 496552 784790 888361 860434 986510 1140910 1336577 902516 838820 744981
14690G44981p3891K66717k66463P7940O1554k43474L05283J10369Q6833j87131
$$ 744981 671090 937807 671344 749284 810838 567364 872647 983016 1069849 882718
14680H82718K71283l00937j15298K69134j96361L76218k52294N4090k00321L04709
$$ 882718 1154001 853064 737766 1006900 810539 1186757 934463 988553 788232 1092941
14670A092941K86258n32038N98775j69799k63399J74202N571K18180l63959L00992
$$ 1092941 1379199 847161 1445936 1276137 1012738 1186940 1192511 1410691 1046732 1347724
14660A347724j57645Q0442j67190N820J61746l24557O02166m47564J46430q261
$$ 1347724 1190079 1270521 1103331 1109151 1270897 946340 1548506 1100942 1247372 1239111
14650A239111K2883j52307r6518M02306p4402l48528J99496r7903K17139j1357
$$ 1239111 1261994 1109687 1013169 1415475 1341073 992545 1192041 1094138 1311277 1299920
14640A299920Q3555K111j44694L5956j38786k75609O56823r7652k08092J10245
$$ 1299920 1383475 1385586 1240892 1276848 1138062 862453 1519276 1421624 1213532 1323777
14630A323777K5913O4704q5053K65534k66240K85846k03819J80034p8447p2572
$$ 1323777 1349690 1414394 1329341 1594875 1328635 1614481 1410662 1590696 1512249 1439677
14620A439677l67614K67370j84831N09959k98794J84626K40864l44885k32962
$$ 1439677 1072063 1339433 1154602 1664561 1365767 1550393 1791257 1446372 1213410
14611A213410M24384J87870l43754Q3295m9896j33038M45039j13477P1355j14098
$$ 1213410 1637794 1825664 1481910 1565205 1515309 1382271 1827310 1713833 1785188 1671090
14601A671090n5901j32012R5856O50p7817L42222j78264k56650N08771j33422
$$ 1671090 1615189 1483177 1579033 1579683 1501866 1844088 1665824 1409174 1917945 1784523
14591A784523k76038J24644J36801L54144j15014l22551L39256j35339j00670
$$ 1784523 1508485 1633129 1769930 2124074 2009060 1686509 2025765 1890426 1789756
14582A789756K94592o4176l63989L52373j19648k33121J18624K44799J35727r2470
$$ 1789756 2084348 2020172 1656183 2008556 1888908 1655787 1774411 2019210 2154937 2062467
14572B062467n752Q1121j55904J87050Q5831K06625J16226l56551J62074j20990
$$ 2062467 2056715 2137836 1981932 2168982 2254813 2461438 2577664 2221113 2383187 2262197
14562B262197J06610N2391J57610M09516j03962M85879k18273M6701L90766r7588
$$ 2262197 2368807 2421198 2578808 2988324 2884362 3370241 3151968 3198669 3589435 3491847
14552C491847O69593J20500J149787J446412L664339Q917941K1164785J0093977
$$ 3491847 4161440 4281940 5431727 6878139 10542478 19460419 40625204 50719181
14544E0719181B2335890H700959D292799j456123m04032l16755l28616K16844
$$ 50719181 22335890 8700959 4292799 2836676 2432644 2115889 1787273 2004117
14536B004117K28945k09902j30369J04881q6537J86940j02735K5364L0182L69631
$$ 2004117 2233062 2023160 1892791 1997672 1911135 2098075 1995340 2020704 2050886 2420517
14526B420517j27313J97063r3253j05101J56429J75876R4129l28914j95469K23447
$$ 2420517 2293204 2490267 2397014 2291913 2448342 2624218 2718347 2389433 2193964 2417411
14516B417411L35535j53227p0100K55070L80168m58201k1329L6915K65813J8109
$$ 2417411 2752946 2599719 2529619 2784689 3164857 2706656 2685327 2722242 2988055 3006164
14506C006164j73103J52601K44246j32740N5422q5463j72954J4521K67470l7015
$$ 3006164 2833061 2985662 3229908 3097168 3152590 3067127 2894173 2908694 3176164 3139149
14496C139149J94188l6914j62743J66950N4554J63613Q6265k55145j72858O23632
$$ 3139149 3333337 3296423 3133680 3300630 3355184 3518797 3605062 3349917 3177059 3800691
14486C800691J47655j70591J38620j03172k72804J72940J49139L92962k94451
$$ 3800691 3948346 3777755 3916375 3813203 3540399 3713339 3862478 4255440 3960989
14477C960989k16654O8065K10073K0806J77869J15468J5799k25878K71030P0420
$$ 3960989 3744335 3812400 4022473 4043279 4221148 4336616 4352415 4126537 4397567 4467987
14467D467987P2584k24150L46403o0952m5536q9422J1407K15178J69599N36058
$$ 4467987 4540571 4316421 4662824 4601872 4556336 4466914 4478321 4693499 4863098 5399156
14457E399156k57991j54918K4643J67134J10354J4126J30787j96460P0803J27721
$$ 5399156 5141165 4986247 5010890 5178024 5288378 5302504 5433291 5236831 5307634 5435355
14447E435355L14260q7768k28744N79712N7204n39167M88362k00963N64978o7848
$$ 5435355 5749615 5661847 5433103 6012815 6070019 5530852 6019214 5818251 6383229 6315381
14437F315381k00367L83865k98843K50337J42242j02402O43428M5193l22710K27004
$$ 6315381 6115014 6498879 6200036 6450373 6592615 6490213 7133641 7178834 6856124 7083128
14427G083128n7086M45610j85461K29728j11830L30706j49681J37400o487N76928
$$ 7083128 7026042 7471652 7286191 7515919 7404089 7734795 7585114 7722514 7716027 8292955
14417H292955j40997K34210J38933K7135J57648J72494P6217j82110N86521P2530
$$ 8292955 8151958 8386168 8525101 8552236 8709884 8882378 8958595 8776485 9363006 9435536
14407I435536Q4386k70464O18586O920J90396L18929J16062K56439Q9050K21236
$$ 9435536 9519922 9249458 9868044 9874964 10065360 10384289 10500351 10756790 10845840 11067076
14397A1067076r7765n6073M67711K41642j01383L92839J3604N58681R3105L16894
$$ 11067076 10969311 10913238 11380949 11622591 11521208 11914047 11927651 12486332 12579437 12896331
14387A2896331O0247O70759L1620k59919O72147K65800J87052K30095O01193j44452
$$ 12896331 12956578 13627337 13658957 13399038 14071185 14336985 14524037 14754132 15355325 15210873
14377A5210873P74848m54068N22525K72449M23382L87839k1114L87353J31214
$$ 15210873 15985721 15531653 16054178 16326627 16750009 17137848 17116734 17504087 17635301
14368A7635301P16409P98467L43927R1681P70151l14162P25418O85959L23829
$$ 17635301 18351710 19150177 19494104 19585785 20355936 20041774 20767192 21453151 21776980
14359B1776980O25869N77313M49049M39639O51657K98669P70804L36322N71690
$$ 21776980 22402849 22980162 23429211 23868850 24520507 24819176 25589980 25926302 26497992
14350B6497992O83061N46629J047940N94087N29312J101606N67689R41513O67217
$$ 26497992 27181053 27727682 28775622 29369709 29899021 31000627 31568316 32509829 33177046
14341C3177046Q82961P82406J199529J245440P90488P58345J366494J148357J283589
$$ 33177046 34060007 34842413 36041942 37287382 38077870 38836215 40202709 41351066 42634655
14332D2634655J044413J279824J802202J472215J219824J534082J613683J822741
$$ 42634655 43679068 44958892 46761094 48233309 49453133 50987215 52600898 54423639
14324E4423639J817456J548435K283611K064823K220358K380884K207703L003460
$$ 54423639 56241095 57789530 60073141 62137964 64358322 66739206 68946909 71950369
14316G1950369K477910K821867K675358L121086L353833L862411L356037L949973
$$ 71950369 74428279 77250146 79925504 83046590 86400423 90262834 93618871 97568844
14308I7568844L835165M310824N233115M664897M886525N697859N421394O494443
$$ 97568844 101404009 105714833 110947948 115612845 120499370 126197229 131618623 138113066
14300A38113066O657345O576837O977837Q038696P837940Q953914Q855169R797887
$$ 138113066 144770411 151347248 158325085 166363781 174201721 183155635 192010804 201808691
14292B01808691J0236167J0609893J1270821J1603175J2766694J2440173J3512460
$$ 201808691 212044858 222654751 233925572 245528747 258295441 270735614 284248074
14285B84248074J3670079J4504566J4255610J5179390J4642464J4839298J4498992
$$ 284248074 297918153 312422719 326678329 341857719 356500183 371339481 385838473
14278C85838473J3983736J3505004J2779201J1390331R967019P709513M366436
$$ 385838473 399822209 413327213 426106414 437496745 447463764 455173277 459539713
14271D59539713J185254J256903l91317k470628l308998m619547p636124r728509
$$ 459539713 460724967 461981870 461590553 459119925 455810927 451191380 443555256 433826747
14263D33826747j1718963j2989009j3797559j4919284j5100386j5844406j5453414
$$ 433826747 422107784 409118775 395321216 380401932 365301546 349457140 334003726
14256C34003726j5651684j3880658j4397908j3972329j3461972j3210146j2273965
$$ 334003726 318352042 304471384 290073476 276101147 262639175 249429029 237155064
14249B37155064j1495125j1190906j0807362r863912q941800q744044q101425
$$ 237155064 225659939 214469033 203661671 193797759 184855959 176111915 168010490
14242A68010490q035366p636109o905759o768272n676275n758987n580338n273387
$$ 168010490 159975124 152339015 145433256 138664984 132988709 127229722 121649384 116375997
14234A16375997n362430m441678m155612l398331m391717l625056l930830l276400
$$ 116375997 111013567 106571889 102416277 99017946 94626229 91001173 87070343 83793943
14226H3793943l018434l154371k822379k419171k840932k343406k274104j973472
$$ 83793943 80775509 77621138 74798759 72379588 69538656 67195250 64921146 62947674
14218F2947674k479778j848372j758870j858879j306993j872132j419426j614160
$$ 62947674 60467896 58619524 56860654 55001775 53694782 51822650 50403224 48789064
14210D8789064j689276j542634j235227n96317j196149j411191j348444j475829
$$ 48789064 47099788 45557154 44321927 43725610 42529461 41118270 39769826 38293997
14202C8293997q44494o72795q44773r91212j097599r31983r75979p90307n47398
$$ 38293997 37449503 36776708 35931935 34940723 33843124 32911141 31935162 31144855 30597457
14193C0597457p16257p85324o48117j036728n80767q73768j53256r13511j25266
$$ 30597457 29881200 29095876 28447759 27411031 26830264 25956496 25803240 24889729 24764463
14184B4764463q72336o3483q56867k78713p12146o90751m52728m23203p5629p36882
$$ 24764463 23892127 23828644 22971777 22693064 21980918 21290167 20837439 20414236 20338607 19601725
14174A9601725m59470k72137J49800q15106r2173p23703p0176l59565n69618r0820
$$ 19601725 19142255 18870118 19019918 18204812 18112639 17388936 17318760 16959195 16389577 16298757
14164A6298757k02194n96939k70828m41565K3940m09203l48364k5904n74112Q0987
$$ 16298757 16096563 15499624 15228796 14787231 14811171 14401968 14053604 14027700 13453588 13534575
14154A3534575J0079l07817n18601L9558O8055m41875n36038J15941J75174n97629
$$ 13534575 13544654 13236837 12718236 12757794 12825849 12383974 11847936 11963877 12139051 11541422
14144A1541422k19075j3101k17402j53689m24599j14836J8096l93925k70073L15268
$$ 11541422 11322347 11309246 11091844 10938155 10513556 10398720 10416816 10022891 9752818 10068086
14134A0068086p57590K25161k45328m09288N37331j10187k95346j73444k55589
$$ 10068086 9310496 9535657 9290329 8881041 9418372 9308185 9012839 8839395 8583806
14125H583806J62603l22398j55079j39221k87796J77999o4233j59772r3774J1668
$$ 8583806 8746409 8424011 8268932 8129711 7841915 8019914 7955681 7795909 7702135 7713803
14115G713803l98815J16514j52353k10483j66972K4589N4246k20078K208m7400
$$ 7713803 7314988 7431502 7279149 7068666 6901694 6926283 6980529 6760451 6762659 6715259
14105F715259m10364K95110j62602k34502k5184N0170j73743j61641M29267j66004
$$ 6715259 6304895 6600005 6437403 6202901 6177717 6227887 6054144 5892503 6321770 6155766
14095F155766J3016k80923m11697L46194l6321k88461J90333k48841p6477l35850
$$ 6155766 6168782 5887859 5476162 5822356 5786035 5497574 5687907 5439066 5362589 5026739
14085E026739K24556L890p922K25897k31442m26282J74355m2950k96160L8375
$$ 5026739 5251295 5255185 5247263 5473160 5241718 4815436 4989791 4946841 4650681 4689056
14075D689056L9379L3850k24040P1539K7876j17492k51043j08637P0016K70102
$$ 4689056 4728435 4762285 4538245 4609784 4637660 4520168 4269125 4160488 4230504 4500606
14065D500606q8690r0197l71563J37664q8412k47429Q5111L72535j29708l92843
$$ 4500606 4411916 4321719 3950156 4087820 3999408 3751979 3837090 4209625 4079917 3687074
14055C687074K91883q602j30981k06472J74499k02406r1733Q0558k39422L1857
$$ 3687074 3978957 3970355 3839374 3632902 3807401 3604995 3513262 3593820 3354398 3386255
14045C386255N34882k45437n16325J68233j86552K94122j14640K01327l88864
$$ 3386255 3921137 3675700 3159375 3327608 3141056 3435178 3320538 3521865 3133001
14036C133001J88425K25225j52036j32283N1575j92885J89481K5044o52461M29956
$$ 3133001 3321426 3546651 3394615 3262332 3313907 3121022 3310503 3335547 2683086 3113042
14026C113042l56072L60146k39992l642M51518o74371k74914J54283L1845L185
$$ 3113042 2756970 3117116 2877124 2873482 3325000 2650629 2375715 2529998 2561843 2565028
14016B565028O3976J9275K2504k60938J23038k66951L68817m7998l34757L17889
$$ 2565028 2629004 2648279 2670783 2409845 2532883 2265932 2634749 2586751 2251994 2569883
14006B569883l69087n1670N0621J3252L7640J51237m33051K55612L88419l77974
$$ 2569883 2200796 2149126 2199747 2212999 2250639 2401876 1968825 2224437 2612856 2234882
13996B234882J3306l35788m85M65574j90440K57266J78120M11436K479307P276073
$$ 2234882 2248188 1912400 1911915 2377489 2187049 2444315 2622435 3033871 5513178 12789251
13986A2789251J9378544K0478519B6204598j2892827m879852k645577r12820o28556
$$ 12789251 32167795 52646314 26204598 13311771 8431919 5786342 4873522 4244966
13978D244966o83514P9081m41564q1907l15853k00033R4122K41349m89605J53618
$$ 4244966 3561452 3640533 3198969 3117062 2801209 2601176 2695298 2936647 2447042 2600660
13968B600660k72917L2830K54665j0619n51572R4570J7425Q216L43749j99740
$$ 2600660 2327743 2360573 2615238 2604619 2053047 2147617 2165042 2173258 2517007 2317267
13958B317267o1603J15040l64491J8715n2213R9644J28595k95884P7458k52299
$$ 2317267 2255664 2370704 2006213 2024928 1972715 2072359 2200954 1905070 1982528 1730229
13948A730229Q8603J57543o7754J72525l86612J93932j10786m7687O8682L81327
$$ 1730229 1818832 1976375 1908621 2081146 1694534 1888466 1777680 1729993 1798675 2180002
13938B180002l35494N8003k12287J81118k02657K09809m7213n6772l433o1274
$$ 2180002 1844508 1902511 1690224 1871342 1668685 1878494 1831281 1774509 1771076 1709802
13928A709802k43085K44075l90881K63833J79104J20576L8261m26420M1671R1944
$$ 1709802 1466717 1710792 1319911 1583744 1762848 1883424 1921685 1495265 1536936 1628880
13918A628880J69854k33125J36185k36493P3105k07191J38949J54155j38605J03346
$$ 1628880 1798734 1565609 1701794 1465301 1538406 1331215 1470164 1624319 1485714 1589060
13908A589060j43960k59551M59778l08344K30246k32379J99655j91347N9432j05108
$$ 1589060 1445100 1185549 1645327 1336983 1567229 1334850 1534505 1343158 1402590 1297482
13898A297482j0466K66157L3222k93010J32482j52280j4296j07747j85718M58154
$$ 1297482 1287016 1553173 1586395 1293385 1425867 1273587 1259291 1151544 965826 1423980
13888A423980q5874J38643m92458K05189j63272K84879k32045K72685j3687O4443
$$ 1423980 1338106 1476749 984291 1189480 1026208 1311087 1079042 1351727 1338040 1402483
13878A402483j46961j87454J05898j68343k9363N55324q8007k11714k64451K14608
$$ 1402483 1255522 1068068 1173966 1005623 976260 1531584 1443577 1231863 967412 1182020
13868A182020o0102J91057j97007k59873J44841O9311K21948p1465j30427K40367
$$ 1182020 1121918 1312975 1115968 856095 1000936 1070247 1292195 1220730 1090303 1330670
13858A330670p0502k12870L8858j90661J93013J45249l24633J27340o1842K3430
$$ 1330670 1260168 1047298 1086156 895495 1088508 1233757 909124 1036464 974622 998052
13848I98052M17394m85928J1615J71056l88094J08960M65427l55482j67700J27544
$$ 998052 1415446 929518 941133 1112189 724095 833055 1298482 943000 775300 902844
13838I02844l08441K21260r0070N00210j13926k70587o4045L60065m3489j53982
$$ 902844 594403 815663 725593 1225803 1111877 841290 777245 1137310 1093821 939839
13828I39839J4821n0708j1023J28487k44170J83478J24889J89879n98516L86750
$$ 939839 954660 903952 892929 1021416 777246 960724 1085613 1275492 676976 1063726
13818A063726n14617M45529k99869J61523J8642Q3044k45446J18873J62638k09984
$$ 1063726 549109 994638 694769 856292 874934 957978 712532 831405 994043 784059
13808G84059J58541m52398N29201j83789m1043k25706M60139M419j52623K06424
$$ 784059 942600 490202 1019403 835614 794571 568865 1029004 1033423 880800 1087224
13798A087224m20089J60955R524j24629K00047j62364J12484C84342N74666J8083
$$ 1087224 667135 828090 837614 712985 913032 750668 863152 384342 959008 977091
13788I77091m4043k50569K05715j36586L70691m76337J63732k21604J9671N9751
$$ 977091 933048 682479 888194 751608 1122299 645962 809694 588090 607761 667512
13778F67512N5170j54592L31548k82408Q2583K95407O7408j50551l64596M3619
$$ 667512 722682 568090 899638 617230 699813 995220 1062628 912077 547481 591100
13768E91100J71633k18056K06094J92089j46237j7706j47312j73390O26653k05722
$$ 591100 762733 544677 750771 942860 796623 778917 631605 458215 1084868 879146
13758H79146n9935j86779J41647l72961l6647J36681J29362L8231j56990N08442
$$ 879146 819211 632432 774079 401118 364471 501152 630514 668745 511755 1020197
13748A020197E02352J58192j48868j47875L17082J380j98254j23353K82970q9620
$$ 1020197 502352 660544 511676 363801 680883 682263 484009 360656 643626 554006
13738E54006K78985K4229k29380J16242C70778J08390Q8797j81096R4358J86542
$$ 554006 832991 857220 627840 744082 370778 479168 567965 386869 481227 667769
13728F67769j99181J50199j98328Q1401q9300J74640k11787J51696K28485l11697
$$ 667769 468588 618787 420459 501860 412560 587200 375413 527109 755594 443897
13718D43897K79006J44204k29281j01963j35995J51636j88608J58459M5101r3695
$$ 443897 722903 867107 637826 535863 399868 551504 362896 521355 566456 472761
13708D72761j58361K91650o4168p427J64251j46690j81855L46960k32526K24918
$$ 472761 314400 606050 541882 534455 698706 552016 370161 717121 484595 709513
13698G09513n7477k95149A72805J63618K45632p2592O9125J9107k33311L96638
$$ 709513 652036 356887 172805 336423 582055 509463 578588 597695 364384 761022
13688G61022A97651Q04689m42573j0841j31665J51762j57674A61165K24512R7450
$$ 761022 197651 1002340 559767 548926 417261 569023 411349 161165 385677 483127
13678D83127J46740J59481l61349q6738p8716J96112k14140M33760B71158Q9246
$$ 483127 629867 789348 427999 341261 262545 458657 244517 678277 271158 360404
13668C60404N00164C77982j10183K30416J00370N7004p9827k75019o8029K74967
$$ 360404 860568 377982 267799 498215 598585 655589 575762 300743 232714 507681
13658E07681J41517k42380J76075j07824j7779m4945L1927P3694B58032N2366
$$ 507681 649198 406818 582893 475069 457290 412345 444272 517966 258032 310398
13648C10398J47363A67329K13396J28964j75747J0626K4236K94007C14925K51184
$$ 310398 457761 167329 380725 509689 333942 344568 368804 662811 314925 566109
13638E66109j51594J01873q4283F3892O85401k38960m4328B04590I9490M48852
$$ 566109 414515 516388 432105 63892 749293 510333 466005 204590 99490 548342
13628E48342J83468A85035L2324Q0912Q5612j64351K59766j29330J85445J9201
$$ 548342 731810 185035 217359 298271 383883 219532 479298 349968 535413 554614
13618E54614B1559i7089A15126L01400l8038L06154l17771k1664l366J00315j56269
$$ 554614 21559 -97089 115126 416526 378488 684642 366871 345207 341841 442156 285887
13607B85887b5051D09548R285j22666m1058L77362c35211A28564J11662K18054
$$ 285887 -25051 409548 418833 296167 255109 632471 -335211 128564 240226 458280
13597D58280N5794j49308A34915j1309J50755H9489J11270L30869k27906J18148
$$ 458280 514074 364766 134915 123606 274361 89489 200759 531628 303722 421870
13587D21870A29808L1333M65241A29978L00796A79210q5543L78361B32104J9834
$$ 421870 129808 161141 626382 129978 430774 179210 93667 472028 232104 251938
13577B51938L27681k38244j22845K91804J2914k46032L8540j9050j35332L00974
$$ 251938 579619 341375 218530 510334 523248 277216 315756 296706 161374 462348
13567D62348B4168N27490k52136m7767J91460j95657K14151c2324A16510N7414
$$ 462348 24168 551658 299522 251755 443215 247558 461709 -32324 116510 173924
13557A73924K81750A57075K85405A21730K46687A36958K0555L64896B15783b1604
$$ 173924 455674 157075 442480 121730 368417 136958 157513 522409 215783 -21604
13546E25894A38446K92113B4767L22843o0933J72788g733C81894J49946A4617
$$ 525894 138446 430559 24767 347610 286677 459465 -7733 381894 531840 14617
13535C84805A87579K39863j61289J79169o6914Q1447A75601E7132P1358K81091
$$ 384805 187579 427442 266153 445322 378408 459855 175601 57132 128490 409581
13525D09581O7192L85735A08327D0037L03706o3305J22033L0782J19577k08005
$$ 409581 476773 862508 108327 40037 343743 280438 402471 433253 552830 344825
13515C44825J379o0593D3377Q6636K55188J9226p0421A09885K88966j90565L49689
$$ 344825 346204 285611 43377 130013 385201 404427 334006 109885 398851 208286 557975
13504E57975H4656K49538l6551B4921J09159L34692A13793J24402P1487A07389
$$ 557975 84656 334194 297643 24921 134080 468772 113793 238195 309682 107389
13493A89475q0E0487K97292A31031L03957A51569L32673k19083L1680n7417l9725
$$ 189475 189395 50487 347779 131031 434988 151569 484242 265159 296839 239422 199697
13482A99697a6562C81318A24882J82801I7222M8038B4956K90780j02552p4311
$$ 199697 -16562 381318 124882 307683 97222 145260 24956 315736 213184 138873
13472A38873m1537K08475E1182J50894j2606J1872J96087A70306L0533e3370D48275
$$ 138873 97336 305811 51182 202076 189470 201342 397429 170306 200839 -53370 448275
13460I863J69337H6055K2775Q3376M91577k50258K2781F4175K4500L6128R3248
$$ 9863 179200 86055 108830 192206 683783 433525 456306 64175 88675 124803 218051
13449B18051d7081C18824a23618B52290j06863B1813M56162B26763E8599L7859
$$ 218051 -47081 318824 -123618 252290 145427 21813 477975 226763 58599 96458
13439I6458R0669D0628L75784R0590A64550N0761j02297K14074N2390A19719L2050
$$ 96458 187127 40628 416412 507002 164550 215311 113014 327088 379478 119719 151769
13428A51769J34820Q1885i1226C45169N9544P8883k27009a79189D91493k29444
$$ 151769 286589 368474 -91226 345169 404713 483596 256587 -179189 491493 262049
13418B62049J02673A01517K49226A73487l2932b29025A75745L56727E7887J10525
$$ 262049 364722 101517 350743 173487 140555 -229025 175745 532472 57887 168412
13408A68412R8232I5679K35739M7216j47436j0620p7284M6870k9812J78042J31796
$$ 168412 266644 95679 331418 378634 231198 220578 143294 190164 160352 338394 470190
13397D70190f7365D49340j42408l4553H1868N12841A00661P1159K55645j31334
$$ 470190 -67365 449340 306932 272379 81868 594709 100661 171820 427465 296131
13387B96131o8894O9062c3073A62629R7148K59202A86226p778j1971f5777A01876
$$ 296131 227237 296299 -33073 162629 259777 518979 186226 178448 166477 -65777 101876
13375g3725A55259O1824O9048L2255j7174J2972M7519E4151M26858G3338J95536
$$ -73725 155259 217083 286131 318386 301212 314184 361703 54151 481009 73338 268874
13364B68874f1204C81817E2847J85899J21024k9427d9301C47984A56286J45614
$$ 268874 -61204 381817 52847 238746 359770 330343 -49301 347984 156286 301900
13354C01900a45693F7266K19598f9344D01928q8136j52111K03319M0962j98228
$$ 301900 -145693 67266 286864 -69344 401928 313792 161681 365000 405962 207734
13344B07734A8884M69244r2010p9572H6981M15202j92228j4296j05597g8475A10286
$$ 207734 18884 488128 396118 316546 86981 502183 309955 295659 190062 -78475 110286
13332B23417A01453f944A49268J05596n7353a3808A52341O3266m1146A673L28824
$$ 223417 101453 -6944 149268 254864 197511 -13808 152341 215607 174461 1673 330497
13321C30497j05848J34681A32638J64315M9403L0670r2221j18656L2168J78040
$$ 330497 224649 359330 132638 296953 346356 377026 284805 166149 198317 376357
13311C76357A49377J88251r0859l9990J8154E966L98289A33235L06822e547A56116
$$ 376357 149377 337628 246769 206779 224933 5966 404255 133235 440057 -5547 156116
13299B84326o5700A2589f8702C68379A21942c9962C95005j93117P7017a27010
$$ 284326 218626 12589 -68702 368379 121942 -39962 395005 201888 278905 -127010
13288B5034b5039D6958K6983Q3418e1906F8598j9241J21634N5799J38471I5242
$$ 25034 -25039 46958 73941 157359 -51906 68598 49357 170991 226790 365261 95242
13276A3720K30277o0043F661J56213J63378F5825K51070j1325q5250a70673E9525
$$ 13720 243997 183954 6661 162874 326252 65825 316895 305570 220320 -170673 59525
13264C32797G5273L65546A27181k5709J59843J19722D7578c61584C49848g3491
$$ 332797 75273 440819 127181 101472 261315 381037 47578 -361584 349848 -73491
13253C51136A09120N544C0696a74791B2216b09409B93141H7447c4805I4570J17115
$$ 351136 109120 114664 30696 -174791 22216 -209409 293141 87447 -34805 94570 211685
13242B11685q9012B5314M17491a1109m5154A2258b5473B24925r136K90990A19725
$$ 211685 122673 25314 442805 -11109 -56263 12258 -25473 224925 215789 506779 119725
13230A8926f5018A4374K07181B3545M71470A52305J51061d4094B70077A2938L65507
$$ 18926 -65018 14374 221555 23545 495015 152305 303366 -44094 270077 12938 378445
13219C78445j59171j07941K12885B1955K60881E9000A3634K59778J57817a62112
$$ 378445 219274 111333 324218 21955 282836 59000 13634 273412 431229 -162112
13208I0449L1670K60629e9657D1577J21919m6004J82132a35074e3584G5073a06218
$$ 90449 122119 382748 -59657 41577 163496 117492 299624 -135074 -53584 75073 -106218
13196B53416G8477J21256M9306a20506D02529A68465P5657b19394B16120A04881
$$ 253416 78477 199733 249039 -120506 402529 168465 244122 -219394 216120 104881
13185a79155G2149f6365a6214G0048d3104n4432G5501J14936K49216b92694c2839
$$ -179155 72149 -66365 -16214 70048 -43104 -97536 75501 190437 439653 -292694 -32839
13173b3840B49563a41369k13117D29767F432a39307n2692A28655a32272B29322
$$ -23840 249563 -141369 -354486 429767 6432 -139307 -191999 128655 -132272 229322
13162g448A13891J49633b2014A3731J98195L1194a73068H7400K33850j20117d10933
$$ -7448 113891 263524 -22014 13731 211926 243120 -173068 87400 321250 201133 -410933
13150A74244l3889J19176h7969j7028K220A0384C822K32438D0936K48818k4763
$$ 174244 140355 259531 -87969 -104997 -102777 10384 3822 236260 40936 289754 264991
13139B64991a6590A97268f8620F6907J87343j19984b6033B01701K02375a5005
$$ 264991 -16590 197268 -68620 66907 254250 134266 -26033 201701 404076 -15005
13128A13089L7239j9733c0376A555L89708n6623h9224A7555K67008j01527P9399
$$ 113089 150328 130595 -30376 1555 391263 334640 -89224 17555 284563 183036 262435
13117B62435l4947b67320A31367a4563G419J55544E0464i9365A86378p9828a18278
$$ 262435 227488 -267320 131367 -14563 7419 162963 50464 -99365 186378 106550 -118278
13105A66028e1268J9155D6559J91413I7826M2435O9796G7603d9523A28831q350
$$ 166028 -51268 -32113 46559 237972 97826 140261 210057 77603 -49523 128831 120481
13094A20481K711m8548J70027b8732A69479q153D7671a94340K28A9013B977b9388
$$ 120481 123192 74644 244671 -28732 169479 161326 47671 -194340 -194112 19013 2977 -29388
13081H3215L9260D1107K4073J84163J48954a60498B85011l471A22283D751i909
$$ 83215 122475 41107 65180 249343 398297 -160498 285011 281540 122283 4751 -9909
13069f8403A01835i6729A4121J76000F6172K43604K586j49028c5620G3372M2767
$$ -68403 101835 -96729 14121 190121 66172 309776 312362 163334 -35620 73372 116139
13058A16139k1271C5093J61482f9975A91026H0652K62607A19480c1978m9782K5828
$$ 116139 94868 35093 196575 -69975 191026 80652 343259 119480 -31978 -81760 -55932
13047e5932O997r3938e0916A34883B4064a79472o380G5169b7656D9368J78518
$$ -55932 -48935 -142873 -50916 134883 24064 -179472 -185852 75169 -27656 49368 227886
13036B27886a95557B3687J24693K1191a67561A28563a79190d2841A76710j1661
$$ 227886 -195557 23687 148380 169571 -167561 128563 -179190 -42841 176710 165049
13026A65049L0878n4416P2795o6178P8733H5581j6673l419b16910B37775i9556
$$ 165049 195927 141511 214306 148128 226861 85581 68908 65489 -216910 237775 -99556
13014C47111j39308e6703B77487a277A84603a9104q1751C46530m3741j28923k7536
$$ 347111 207803 -56703 277487 -1277 184603 -19104 -100855 346530 302789 173866 146330
13003A46330i4606C12487e5480D08299H9523F721O0382i2003B5485q392L9945
$$ 146330 -94606 312487 -55480 408299 89523 6721 67103 -92003 25485 17093 57038
12992E7038i9208B80351i5297D8247J98291R0405b65661J01598A09859J08768
$$ 57038 -99208 280351 -95297 48247 246538 336943 -265661 -164063 109859 218627
12982B18627m0669n6704b3161n19115A20684L5716k8841f263B14214b61508e7007
$$ 218627 177958 121254 -23161 -542276 120684 156400 127559 -6263 214214 -261508 -57007
12970B57939i4714A23916J18088a04990D7869f5803B9446e9865j11164H0053a3887
$$ 257939 -94714 123916 242004 -104990 47869 -65803 29446 -59865 -171029 80053 -13887
12958a15640e4262B12693M1427e7745C5188J09132J3081h4586M839J697D0654
$$ -115640 -54262 212693 254120 -57745 35188 144320 157401 -84586 -79747 -78050 40654
12946C44696b3424A43669a36264A0011O1524a39567L9616C00503J53900a6594
$$ 344696 -23424 143669 -136264 10011 71535 -139567 -99951 300503 454403 -16594
12935B63781k6247o0662m4337B1346J62845B912A069c3351C7648J47004A2280
$$ 263781 237534 176872 132535 21346 184191 2912 1069 -33351 37648 184652 12280
12923D135Q2751C5311L07100o9390c5543E7537a27736A55620a11177C43499j31962
$$ 4135 86886 35311 342411 273021 -35543 57537 -127736 155620 -111177 343499 211537
12912B11537E3094G864e8728j23772N3129D2144a59884B92082j00453h5402G7207
$$ 211537 53094 7864 -58728 -182500 -129371 42144 -159884 292082 191629 -85402 77207
12900B27597b18158B26421l495l2848G7623a88127O1054m9410M9976B23241k7853
$$ 227597 -218158 226421 222926 190078 77623 -188127 -127073 -176483 -126507 223241 195388
12889A95388a43409D63048h5991r2464c4985l577B97974E2904c452j28989l8672
$$ 195388 -143409 463048 -85991 -178455 -34985 -38562 297974 52904 -3452 -132441 -171113
12878a71113k73167A82381N4871a6011B11021B5131b30946J04021B14625B5609
$$ -171113 -444280 182381 237252 -16011 211021 25131 -230946 -126925 214625 25609
12867A42143O9174c40054C0825f5614D4021g1213j66323a07312l1174o239E1950
$$ 142143 211317 -340054 30825 -65614 44021 -71213 -237536 -107312 -138486 -144725 51950
12855E4007K0988d4065B38587d7706A45744K11186d933B17868E2722b0917n2818
$$ 54007 74995 -44065 238587 -47706 145744 356930 -4933 217868 52722 -20917 -73735
12844g3735B36946D271L21041H9336a70539A16935a34839K7022c2487k80156J16045
$$ -73735 236946 4271 325312 89336 -170539 116935 -134839 -107817 -32487 -312643 -196598
12833a96598A31453L1202f386k58739O9320A38446F6864d8824G9363K26499j44213
$$ -196598 131453 162655 -6386 -265125 -195805 138446 66864 -48824 79363 305862 161649
12822A61649c55470A30315n8807B5277f8312N180A4644a45388n9650A88285B0120
$$ 161649 -355470 130315 71508 25277 -68312 -63132 14644 -145388 -205038 188285 20120
12810a65199D63016a02989B79234b4634F7126J12161e3721j43049i3374B42611
$$ -165199 463016 -102989 279234 -24634 67126 179287 -53721 -196770 -93374 242611
12799G8162A0827K85412j02389o5594b2079j91690B0199f3325j54770m7417h7913
$$ 78162 10827 296239 193850 128256 -22079 -213769 20199 -63325 -218095 -265512 -87913
12787B157M8668O7737B2075O740F01J04819K4816i4604D7249B953b16542F5287
$$ 2157 50825 118562 22075 28815 601 105420 130236 -94604 47249 2953 -216542 65287
12774E2667K19862d1692C10541e703C9284f0589p3860A06807E3289j5611b24493
$$ 52667 272529 -41692 310541 -5703 39284 -60589 -134449 106807 53289 37678 -224493
12762A49504R1386A0220J48407A5987a9743A52945Q1914j0132a88623D58739a02068
$$ 149504 240890 10220 158627 15987 -19743 152945 234859 224727 -188623 458739 -102068
12750f5369A0829a80078B60705N292L0203a60572B12151L62J911a65088A46572
$$ -65369 10829 -180078 260705 265997 296200 -160572 212151 212513 214424 -165088 146572
12738g3714j55207A58474f2573B40002D0759K66346b09411h3049k07468A66575
$$ -73714 -228921 158474 -62573 240002 40759 307105 -209411 -83049 -290517 166575
12727B02017f3678l0429F3497N3556a11018a5106B13025J9999D9522i1996G4520
$$ 202017 -63678 -94107 63497 117053 -111018 -15106 213025 233024 49522 -91996 74520
12715d7691l9019p2805F4277J91095A18520R9433J58924L23416B87005q5490B6645
$$ -47691 -86710 -159515 64277 255372 118520 217953 376877 700293 287005 201515 26645
12703d770D15943a48693D72345A04922C8905a5417k6761F9616K19231A19538L8794
$$ -4770 415943 -148693 472345 104922 38905 -15417 -42178 69616 288847 119538 158332
12692A58332a51705B66043I8663a61285G5670g3371G749K59455n6366i527k32225
$$ 158332 -151705 266043 98663 -161285 75670 -73371 7749 267204 210838 -9527 -241752
12681b41752B370K82976C2708J09509K07285A01150M2138L72683E5065J38545
$$ -241752 2370 285346 32708 142217 349502 101150 143288 515971 55065 193610
12671A93610L5526B4807f3648B4930J7431a26389B16471a57477C28604b62598
$$ 193610 229136 24807 -63648 24930 42361 -126389 216471 -157477 328604 -262598
12660e2593j00745c0780A53407D2174c1852D5939K41517a81030G3830B4723K40504
$$ -52593 -153338 -30780 153407 42174 -31852 45939 287456 -181030 73830 24723 265227
12649B65227l6606f6625B43558i5386E8531N4509L2251G875M50747A63610I901
$$ 265227 228621 -66625 243558 -95386 58531 113040 145291 7875 458622 163610 9901
12637b73894C86700G7014J73882K27551H3914b06151C10689A52652o8609j7851
$$ -273894 386700 77014 250896 478447 83914 -206151 310689 152652 84043 66192
12627F6192J69376a01678C46431d7057B47218b52923A98186m2529o6886K488M8224
$$ 66192 235568 -101678 346431 -47057 247218 -252923 198186 155657 88771 91259 139483
12616A39483b84559j5176f3187A13993D0020J45652j507i9266D7507P322K8270
$$ 139483 -284559 -299735 -63187 113993 40020 185672 184165 -99266 47507 54829 83099
12605H3099N8389o3544M02036I6485M9967J26698L35903b44624A80650c7689A85740
$$ 83099 141488 77944 479980 96485 146452 273150 609053 -244624 180650 -37689 185740
12593B246J69644H5347a58354A3645J21744h6090b0255C02170A03685b8783q3190
$$ 2246 171890 85347 -158354 13645 135389 -86090 -20255 302170 103685 -28783 -111973
12582a11973A01258H21J05799d9976k47587H2881J33759a58208B94345g455j86745
$$ -111973 101258 821 106620 -49976 -297563 82881 216640 -158208 294345 -7455 -194200
12571a94200A00770j7603b6964h516o8352k8660C04754f4521A37673a67703P9304
$$ -194200 100770 83167 -26964 -8516 -76868 -105528 304754 -64521 137673 -167703 -88399
12560h8399B00426J22865e0467I9082C6491a91976c4753r5097c5243A10581b27306
$$ -88399 200426 323291 -50467 99082 36491 -191976 -34753 -129850 -35243 110581 -227306
12548F8078a81234A82453l6882a97700E8793M6770g0719B01880a48686c3399B8526
$$ 68078 -181234 182453 145571 -197700 58793 105563 -70719 201880 -148686 -33399 28526
12536D261e93o9083B89642F8372c04925D65J4745J5712f8246j47346B67606c1913
$$ 4261 -593 -69676 289642 68372 -304925 465 15210 30922 -68246 -215592 267606 -31913
12523B31906a93885A26287F0032K25948j15301m0264b37727B2882d13638a44411
$$ 231906 -193885 126287 60032 285980 170679 130415 -237727 22882 -413638 -144411
12512D6479K3263a66597M3256A39775a28308A6148N599a05141C10573b8793j60992
$$ 46479 69742 -166597 -123341 139775 -128308 16148 21747 -105141 310573 -28793 -189785
12501a89785g5471A19769B006J02447O3881a82791C6021Q9070D156K01080b46115
$$ -189785 -75471 119769 2006 104453 168334 -182791 36021 125091 4156 205236 -246115
12489D9130a47981A39925f6921D6265i3459a7678B46871a791B43435b36008o2915
$$ 49130 -147981 139925 -66921 46265 -93459 -17678 246871 -1791 243435 -236008 -298923
12478b98923a46372B01195H7773b46153Q3767j34681B05767K4742D0320J18970
$$ -298923 -146372 201195 87773 -246153 -162386 -297067 205767 230509 40320 159290
12468A59290B1131a9585A06413D4874e4495D1905a32383E9794e8030o4051E915
$$ 159290 21131 -19585 106413 44874 -54495 41905 -132383 59794 -58030 -122081 5915
12456F6824b64076J06890F1098K22801o0196d76619a44539A41204c85106c3358
$$ 66824 -264076 -157186 61098 283899 223703 -476619 -144539 141204 -385106 -33358
12445C79629j11185B3956P1606a71849A90183E1329d65942G5813a93777A34330
$$ 379629 268444 23956 95562 -171849 190183 51329 -465942 75813 -193777 134330
12434A10341L28593c6801D5740R3660N5932A0102a76950E8164J46172a94944C7155
$$ 110341 438934 -36801 45740 139400 195332 10102 -176950 58164 204336 -194944 37155
12422a01693F8570J02947l8098E6484E498a4355C13767a9151j00110I4191L0932
$$ -101693 68570 171517 133419 56484 5498 -14355 313767 -19151 -119261 94191 125123
12411A25123b62839Q6039C16751j12379l3165a98617j4140A63968J9617b39166
$$ 125123 -262839 -176800 316751 204372 171207 -198617 -212757 163968 183585 -239166
12400g7667H2216J54569a10994A34254a21278k2130j16094A1129i2192j3148B27546
$$ -77667 82216 236785 -110994 134254 -121278 -143408 -259502 11129 -92192 -105340 227546
12388a00750I7324a47806C638R5759c26697f4006k51589g6834a9380C20970A7456
$$ -100750 97324 -147806 3638 99397 -326697 -64006 -315595 -76834 -19380 320970 17456
12376H6129M5025g8823B89311A4256M0309a46947n6546p2846d9785G086b16275
$$ 86129 131154 -78823 289311 14256 54565 -146947 -203493 -276339 -49785 7086 -216275
12364b45325B61363j01792n8697O3724b36211a4016k77272A86526j2031d2565
$$ -245325 261363 159571 100874 164598 -236211 -14016 -291288 186526 174495 -42565
12353c17018a19572J7027j50440F3827b79625N9616c3739j56757L0669A20938
$$ -317018 -119572 -102545 -252985 63827 -279625 -220009 -33739 -190496 -159827 120938
12342A52995J1450L551a28923N6493A47341i6118C2619A6061J2075i4975l4914
$$ 152995 164445 167996 -128923 -72430 147341 -96118 32619 16061 28136 -94975 -129889
12331a29889B05193c8621A8729d43l30641E1169c27489A07509a16494c4528j2131
$$ -129889 205193 -38621 18729 -443 -331084 51169 -327489 107509 -116494 -34528 -46659
12320d6659H6517a66092q4058J02411B10451F486f315j57787e2045A24903d06626
$$ -46659 86517 -166092 -250150 -147739 210451 6486 -6315 -164102 -52045 124903 -406626
12308G828f073k45543e2363A23390L22015k15513g455A90881a88125P0151N1566
$$ 7828 -6073 -251616 -52363 123390 445405 229892 -7455 190881 -188125 -117974 -66408
12297f6408A45806a53806k2030J3440O4619l2361G1866B0886h6156A44453a77391
$$ -66408 145806 -153806 -175836 -162396 -97777 -130138 71866 20886 -86156 144453 -177391
12285c4021A5898a06788A1426K2734J3671c4787C7314a48710C6473L67196A79444
$$ -34021 15898 -106788 11426 34160 47831 -34787 37314 -148710 36473 403669 179444
12273A48266L8028a6653C15719q353a8780B33376l278M8569p625d0816j78432
$$ 148266 186294 -16653 315719 307366 -18780 233376 230098 278667 271042 -40816 -219248
12262b19248A6559K55436D7755d2893C55827d8543j29521D92570c6897A37662
$$ -219248 16559 271995 47755 -42893 355827 -48543 -178064 492570 -36897 137662
12251a42231O639D70708k31020g221B19154I6173L00662A84168B214L70456j26968
$$ -142231 -135592 470708 239688 -7221 219154 96173 396835 184168 2214 372670 245702
12240B45702J552C0095J81429g4498A18151j826l1989J4059k9293a14594A7685
$$ 245702 247254 30095 211524 -74498 118151 116325 84336 98395 69102 -114594 17685
12228C44694a82348A11566j886n3964M18841A58400J44742J25322A95123C0184
$$ 344694 -182348 111566 109680 55716 474557 158400 303142 428464 195123 30184
12217B5511L8593N8084G539k847K4964L4924Q609M61357A92266k4947b34321B52052
$$ 25511 64104 122188 7539 4692 29656 64580 73189 534546 192266 167319 -234321 252052
12204D23258A9339K41450o7242H7016d8174B10789n9096A714J95044k9088J37053
$$ 423258 19339 260789 193547 87016 -48174 210789 151693 1714 196758 167670 304723
12193C04723K46709c00963A9524K04785c3381A95190B5570a17139B10697G8604
$$ 304723 551432 -300963 19524 224309 -33381 195190 25570 -117139 210697 78604
12182b9725B23546e5560l3060A29918a67173A8212N08745f1358A37191a09445
$$ -29725 223546 -55560 -88620 129918 -167173 18212 526957 -61358 137191 -109445
12171B16154D8216P3925d2930k04413B14177g0876a6447j16688A58427G8028k5891
$$ 216154 48216 122141 -42930 -247343 214177 -70876 -16447 -133135 158427 78028 52137
12160E2137J54486J90807b99431A52443b8755K490j7809j30881K3647H3716j3876
$$ 52137 206623 397430 -299431 152443 -28755 -26265 -44074 -174955 -151308 83716 69840
12149F9840k7325J76922J2420K6101F079J42722A851N674d5520p5426N1458k9237
$$ 69840 42515 219437 231857 257958 6079 148801 1851 7525 -45520 -120946 -69488 -98725
12137i8725A49059c1022I2333C860L761g7235B46058q9664L0664a70877j784E2321
$$ -98725 149059 -31022 92333 3860 7621 -77235 246058 156394 187058 -170877 -172661 52321
12124B65883c2199A33996d485A22275m8403Q8207l520L672g0367B18432a21722
$$ 265883 -32199 133996 -4485 122275 73872 162079 158559 162231 -70367 218432 -121722
12112a45823A24600c10386F7492K95341a59423B33498G2946J16805a80351g6336
$$ -145823 124600 -310386 67492 362833 -159423 233498 72946 189751 -180351 -76336
12101B04264A01239a08838B06768b07208d2382l57279B62455e7482E063J32775
$$ 204264 101239 -108838 206768 -207208 -42382 -399661 262455 -57482 5063 137838
12091A37838a7907o2022C7783i0272A18271a63396A88582G2051M58409A97301
$$ 137838 -17907 -79929 37783 -90272 118271 -163396 188582 72051 530460 197301
12080c2454n2447B02765a33426A2916N7463L74441A81116K31704J167238L17564
$$ -32454 -84901 202765 -133426 12916 70379 444820 181116 412820 1580058 1897622
12070A897622E34229f3792P586a1989A60233n0498a82354j10706f6728A28594
$$ 1897622 534229 -63792 -56206 -11989 160233 109735 -182354 -293060 -66728 128594
12059a47972D10212d08156f0912n5903m5317A58271b50698j04144I410b86359
$$ -147972 410212 -408156 -60912 -116815 -162132 158271 -250698 -354842 9410 -286359
12048G7199m03a60319A56085b9013C2856a03176q1193M5364N4072D9581R6673
$$ 77199 76796 -160319 156085 -29013 32856 -103176 -184369 -139005 -84933 49581 146254
12037A46254l5042R709J36158a07276B3206l973b2608o9952d2221j65069c9720
$$ 146254 111212 120921 257079 -107276 23206 19233 -22608 -92560 -42221 -207290 -39720
12025i9652j93792B96225H3193C1972i6434E8265a90827A86354d511j5884A93795
$$ -99652 -293444 296225 83193 31972 -96434 58265 -190827 186354 -4511 -20395 193795
12013a38489j73565A23452Q4632a08098H8290R0226H2056N8525d73347a5343k67819
$$ -138489 -312054 123452 208084 -108098 88290 178516 82056 140581 -473347 -15343 -283162
12002b83162D29069j65616B6656h3836A02677h8639j63310J11265P364G9478K7368
$$ -283162 429069 263453 26656 -83836 102677 -88639 -251949 -140684 -133320 79478 106846
11991A06846R797b51021g3696K6814k08759B24165B6287h2523k7467n4597j6569
$$ 106846 116643 -251021 -73696 -46882 -255641 224165 26287 -82523 -109990 -164587 -181156
11980a81156B08599C8625a79520B65609G7658J10846a51212h2l0273H4693K18543
$$ -181156 208599 38625 -179520 265609 77658 188504 -151212 -82 -30355 84693 303236
11969C03236h5068j24350j12766A98425B3386P6752i3592A2411L01791n4095g5324
$$ 303236 -85068 -209418 -322184 198425 23386 100138 -93592 12411 314202 260107 -75324
11957b4452m9587k5308A31174a19088k98680J26884d4337m02506A52429c87670
$$ -24452 -74039 -99347 131174 -119088 -417768 -290884 -44337 -446843 152429 -387670
11946a83016B37723A233J30142K394E2551b73800B42024d150q9112A09867a45713
$$ -183016 237723 1233 131375 133769 52551 -273800 242024 -4150 -93262 109867 -145713
11934c28388h1646a5409H1374M0357K3645a8315j78844A43470m1836b98328i311
$$ -328388 -81646 -15409 81374 121731 145376 -18315 -197159 143470 101634 -298328 -9311
11922a3546j3302p6596A29964a76771Q2506H3329d26678G759b12159c9959l3871
$$ -13546 -26848 -103444 129964 -176771 -94265 83329 -426678 7759 -212159 -39959 -73830
11911g3830r8275B9161J34113h9922m2990p987A38129a77684B96073A41302a4267
$$ -73830 -172105 29161 163274 -89922 -132912 -140899 138129 -177684 296073 141302 -14267
11899b74412A16173i6582A27805n8777h8195B76812a92354c0700k8846o448q8521
$$ -274412 116173 -96582 127805 69028 -88195 276812 -192354 -30700 -59546 -65994 -154515
11888a54515B98004a6575A83414c2293q0645j38874e1677I2603a00197C60246
$$ -154515 298004 -16575 183414 -32293 -112938 -251812 -51677 92603 -100197 360246
11877d9780A02641i9260G6879a63768A16193l8440b27372l1995B0474f1076J1848
$$ -49780 102641 -99260 76879 -163768 116193 77753 -227372 -259367 20474 -61076 -49228
11866d9228B33575b38334H1695b03944k31110B11193b16225F3038e8201H173a21080
$$ -49228 233575 -238334 81695 -203944 -435054 211193 -216225 63038 -58201 8173 -121080
11854A52756J10674h5781a8461A07392Q2668a09827l9308l941B31879b13442m7138
$$ 152756 263430 -85781 -18461 107392 190060 -109827 -149135 -153076 231879 -213442 -260580
11843b60580h7071D0682K12477A05962d6m49119K09786B74352c03460E5254P4849
$$ -260580 -87071 40682 253159 105962 -46 -449165 -239379 274352 -303460 55254 130103
11832A30103M477a12969b5409A43243b9281k10796Q7015B54639a29251A16357
$$ 130103 134580 -112969 -25409 143243 -29281 -240077 -153062 254639 -129251 116357
11821B00267a00950a5920p8568p8304f5515A40947b4907A95957a28298j39186
$$ 200267 -100950 -15920 -94488 -172792 -65515 140947 -24907 195957 -128298 -267484
11811b67484D6590L1594L6088h7799n1351B62959I1363j1689L5831e7338l3096
$$ -267484 46590 78184 114272 -87799 -139150 262959 91363 79674 115505 -57338 -90434
11800i0434k48478F1476e307A94215C5636a31285C94463H6968B7769J1555R3283
$$ -90434 -338912 61476 -5307 194215 35636 -131285 394463 86968 27769 39324 132607
11789A32607a6745q1924A2746N8113L2261J9809b2774B9609R149i0344F5930c59010
$$ 132607 -16745 -98669 12746 70859 103120 122929 -22774 29609 38758 -90344 65930 -359010
11776b83710D0291J92935c7567F6980J023L3004j3671c20472B01831b41495k7861
$$ -283710 40291 233226 -37567 66980 68003 101007 87336 -320472 201831 -241495 -269356
11765b69356B9720a07050G8993a93122N5668K6951j62039a5501D8589a10484j3206
$$ -269356 29720 -107050 78993 -193122 -137454 -110503 -272542 -15501 48589 -110484 -123690
11754a23690E6409J40777b00467B134b29059J5798B03506O1328a52957A53506
$$ -123690 56409 197186 -200467 2134 -229059 -213261 203506 264834 -152957 153506
11743A23282N2366q6205c58878a6938m5096j463A29938k1920K39624A70587j9238
$$ 123282 175648 89443 -358878 -16938 -62034 -63497 129938 108018 347642 170587 151349
11732A51349a15040J8847H0332d2254A04123L7132c5279j0081E005K58630a38014
$$ 151349 -115040 -96193 80332 -42254 104123 141255 -35279 -45360 5005 263635 -138014
11720c9340C00074j6451a72244P8161m877d807H5828N4055j0615g5087j64664
$$ -39340 300074 283623 -172244 -94083 -98960 -4807 85828 139883 129268 -75087 -239751
11709b39751h8840A36448K01092a03765K8847g62B60007f2713q7554B05342B6984
$$ -239751 -88840 136448 337540 -103765 -74918 -762 260007 -62713 -150267 205342 26984
11697A73250b71762H2407N5242l2721N5047P8638g9660q3234A57706J9999m4063
$$ 173250 -271762 82407 137649 104928 159975 238613 -79660 -162894 157706 177705 133642
11686A33642m4636a89460C58004c7056A61734K7189N544m7858C0451b5512A47034
$$ 133642 89006 -189460 358004 -37056 161734 188923 194467 146609 30451 -25512 147034
11674a22501A2403J43960f7997A0822c91580g764D44231j52638q222d9036j12615
$$ -122501 12403 156363 -67997 10822 -391580 -7764 444231 291593 283371 -49036 -161651
11663a61651A44921g4065k06952k3288d609B058J07172a03293F9463O8926J10894
$$ -161651 144921 -74065 -281017 -304305 -4609 2058 109230 -103293 69463 138389 249283
11652B49283g4397C56631a61523j04623M04a09807j17266J05610O817A19495a20229
$$ 249283 -74397 356631 -161523 -266146 -265742 -109807 -227073 -121463 -114646 119495 -120229
11640b32192A96679b35761I7893l4891c26394A1706g0013D8007a7304I9147c43044
$$ -232192 196679 -235761 97893 63002 -326394 11706 -70013 48007 -17304 99147 -343044
11628a9971B88199F2856e4340D993J08365J4316j7220k366C4894E781a0016B50751
$$ -19971 288199 62856 -54340 4993 113358 127674 110454 108088 34894 5781 -10016 250751
11615b59078A8676Q6941e1573P536C04433a84476a3184G3616K8939B4031c8193
$$ -259078 18676 105617 -51573 -44037 304433 -184476 -13184 73616 102555 24031 -38193
11603A54739d6517j77386d2168C9492N8093N5737a43171B48413b01311j6237D43507
$$ 154739 -46517 -223903 -42168 39492 97585 153322 -143171 248413 -201311 -217548 443507
11591A74348H3670K893J68439g9273A12405b3226B18362i7797A52967l0928a18808
$$ 174348 83670 86563 255002 -79273 112405 -23226 218362 -97797 152967 122039 -118808
11579A75011G541J44436b2720B62473a89392B17301C7390O1243M80816A46401
$$ 175011 7541 151977 -22720 262473 -189392 217301 37390 98633 579449 146401
11568A76695C5517J88089c09216A61195a49998N3635C4057K03157B1338J17500
$$ 176695 35517 223606 -309216 161195 -149998 -96363 34057 237214 21338 138838
11558A38838c9807D17831a06531C12329g6423A35645c9676A91345D6595J17271
$$ 138838 -39807 417831 -106531 312329 -76423 135645 -39676 191345 46595 163866
11548A63866q230G2230b56159B27571A250b4078H7212C6500f7657B06923E9775
$$ 163866 155636 72230 -256159 227571 1250 -24078 87212 36500 -67657 206923 59775
11536i1602c2286A32015P5559M4006I5344J64481a62263f1971A8235L87214c63408
$$ -91602 -32286 132015 207574 251580 95344 259825 -162263 -61971 18235 405449 -363408
11524B79054A16977a1534A24097a14419C3176L1919a7182A84945K0730d3484A84723
$$ 279054 116977 -11534 124097 -114419 33176 65095 -17182 184945 205675 -43484 184723
11512A55014l68A7399J35548a48925L7452C03628a37218B91223A42526c3289B8740
$$ 155014 154646 17399 152947 -148925 -111473 303628 -137218 291223 142526 -33289 28740
11500D91435A49831Q6585H9993J68298O7695A58125J41912B0571f0859a6194B99759
$$ 491435 149831 236416 89993 258291 325986 158125 300037 20571 -60859 -16194 299759
11488C29767j63383p1999J299k2221L00481g4226A82414B4757J34185G4763f4831
$$ 329767 166384 94385 95684 73463 373944 -74226 182414 24757 158942 74763 -64831
11476C1532P1507R6269a562A45945L5253J71623j45259R8269a40546B40304k5383
$$ 31532 103039 199308 -1562 145945 181198 352821 207562 305831 -140546 240304 214921
11465B14921J75185j91246r9391P7670r244J94682j72833H5661N15354A5773P5881
$$ 214921 390106 198860 99469 177139 167895 362577 189744 85661 601015 15773 91654
11454I1654d564C94950c6227B61105i1300o1248B33345o717q6690c0804F9729
$$ 91654 -4564 394950 -36227 261105 -91300 -152548 233345 226628 139938 -30804 69729
11442E40548A13523J12535H1663J6432e7111H3243k0882J30000a4588p4590j42573
$$ 540548 113523 226058 81663 98095 -57111 83243 62361 192361 -14588 -89178 -231751
11431b31751A82579a83031A03497J5637a87239F1134a51574a2254d020o2271q5466
$$ -231751 182579 -183031 103497 119134 -187239 61134 -151574 -12254 -4020 -66291 -151757
11420a51757j55650E5833J88205n6670h1369k26474A55432p2308L7833c4146q7993
$$ -151757 -307407 55833 244038 187368 -81369 -307843 155432 83124 120957 -34146 -122139
11409a22139A28281B3255K67771r4017b18226N547A76369B7962a76291O0997C62019
$$ -122139 128281 23255 291026 197009 -218226 -212679 176369 27962 -176291 -115294 362019
11397b05232A0013J7261R6365b16027c4902A99036I9042n136J7096R8541d6011
$$ -205232 10013 27274 123639 -216027 -34902 199036 99042 93906 111002 209543 -46011
11385b26228A79612A6225P6343a15471j00083f610l6830a3251l0731A14618b16328
$$ -226228 179612 16225 92568 -115471 -215554 -6610 -43440 -13251 -43982 114618 -216328
11373B96797d5365o4416B17505e6125A40903E2231a9063A23004C9108J01052M4387
$$ 296797 -45365 -109781 217505 -56125 140903 52231 -19063 123004 39108 140160 184547
11362A84547N2828H4487a90366C88304g2053j38685d6506A26686a82440A9282
$$ 184547 237375 84487 -190366 388304 -72053 -210738 -46506 126686 -182440 19282
11351a6786I5578a43252B64975c96164e4409A27885L3372a78198I0531N7152b94681
$$ -16786 95578 -143252 264975 -396164 -54409 127885 161257 -178198 90531 147683 -294681
11339A63521e1663k2831B93645a61082f14D0046K6958a188k57284A37565b04301
$$ 163521 -51663 -74494 293645 -161082 -614 40046 67004 -1188 -258472 137565 -204301
11327e4893A67223H1133f3074A01704b56664h1247K247A82456a1215j26862H7084
$$ -54893 167223 81133 -63074 101704 -256664 -81247 -79000 182456 -11215 -138077 87084
11315E1584q182O4597O0674a3044G2946b80434A48577f7440l6084B91907c10181
$$ 51584 43402 107999 168673 -13044 72946 -280434 148577 -67440 -103524 291907 -310181
11303A03005J17096b96402i0806b3410D2647e71414J67477d8068C19672a13983
$$ 103005 220101 -296402 -90806 -23410 42647 -571414 -403937 -48068 319672 -113983
11292c70823F4689K82579a30768m4289P7182j86791J03958G0228J4985P6846p6208
$$ -370823 64689 347268 -130768 -175057 -97875 -284666 -180708 70228 85213 162059 85851
11281H5851c37929I1225a84973j00364H5781a58929M1920d8362C4003I642a58393
$$ 85851 -337929 91225 -184973 -285337 85781 -158929 -117009 -48362 34003 9642 -158393
11269A01781e1184A01818a09527N2468j6694B48452H4361a81704A59961J6795
$$ 101781 -51184 101818 -109527 -57059 -73753 248452 84361 -181704 159961 176756
11259A76756c53654f0947B76998c73269J67165c8005A27231k4778J90183c9211
$$ 176756 -353654 -60947 276998 -373269 -206104 -38005 127231 102453 292636 -39211
11248B14379a16141k20693a27832E8476D902O0046i9818F4943a42577B61537j09721
$$ 214379 -116141 -336834 -127832 58476 4902 64948 -99818 64943 -142577 261537 151816
11237A51816F5067O6611a35338b6849R925K117m97371d1294A846a1017n2980A32793
$$ 151816 65067 131678 -135338 -26849 -16924 -14807 -512178 -41294 1846 -11017 -63997 132793
11224H9382c7026j08850B0470e5868A3694M3361J2790a03516j9228m9501O5871
$$ 89382 -37026 -145876 20470 -55868 13694 57055 69845 -103516 -122744 -172245 -106374
11213a06374k8536K7239I911J7941K42875a05933j36402A77615a0489A10833k0753
$$ -106374 -134910 -107671 9911 27852 270727 -105933 -242335 177615 -10489 110833 90080
11202I0080P4387i6074o7991d4000B17948b19752D1684c85334a39176q6793a08247
$$ 90080 164467 -96074 -164065 -44000 217948 -219752 41684 -385334 -139176 -225969 -108247
11190F0941J29451a2962q0246j29176A53253K87231A47980a14694K4406D0510
$$ 60941 190392 -12962 -93208 -222384 153253 440484 147980 -114694 -90288 40510
11179a00491j84855J31208j5599H8356A2325O5941L5262d97097h6655b0581D86869
$$ -100491 -285346 -154138 -169737 88356 12325 78266 113528 -497097 -86655 -20581 486869
11167a43164J3307l44962J51885g7692J2527A40828k9447b12755k2505L6922B30114
$$ -143164 -129857 -474819 -322934 -77692 -65165 140828 111381 -212755 -235260 -198338 230114
11155b66257a19828e5209l00130A60700A8484a20070C3444c8102A00627a23103
$$ -266257 -119828 -55209 -355339 160700 18484 -120070 33444 -38102 100627 -123103
11144A60878F3772M1623a30058H6149g348j76406j4061B27161E3394A3336b78724
$$ 160878 63772 105395 -130058 86149 -7348 -183754 -197815 227161 53394 13336 -278724
11132b9251n7451G4035O9471a89379h414A05006Q6839E8223N5041L42441e1263
$$ -29251 -86702 74035 143506 -189379 -8414 105006 191845 58223 113264 455705 -51263
11120A55238d2748j92053K3135c5213E0955J28769B2252L6491M6633L0442e3957
$$ 155238 -42748 -234801 -211666 -35213 50955 179724 22252 58743 105376 135818 -53957
11108a4535A10655J28841B4310L4308O3586J88505c10701a558k21558K2677f9803
$$ -14535 110655 239496 24310 58618 122204 310709 -310701 -1558 -223116 -200439 -69803
11096a06838A67915m930m5663a51974g4523A90555K62204H8998L8396R6886i088
$$ -106838 167915 162985 117322 -151974 -74523 190555 452759 88998 127394 224280 -9088
11084A23735K36295Q4867j10241A31727J69545L5446A50681J8046J39618m8537
$$ 123735 360030 444897 334656 131727 301272 336718 150681 168727 308345 259808
11074B59808K33087B34655p6586K12432K1610j4192I8738J21011M8526P7735j19574
$$ 259808 492895 234655 158069 370501 392111 377919 98738 219749 268275 346010 226436
11063B26436K06959L32278l35603J09018K06740k55321J167K70645K1576l47946
$$ 226436 433395 765673 430070 539088 745828 490507 491674 762319 783895 435949
11053D35949L18834J45307L3713K30451m77494K05053k3408m1777M7661m13090
$$ 435949 754783 900090 933803 1164254 686760 891813 868405 826628 874289 461199
11043D61199R6998M96398l9538k40712K64m3460K5348K29243k81682J93682D22280
$$ 461199 558197 1054595 1015057 774345 774609 731149 756497 985740 704058 897740 422280
11031D90694J61301K15744n5210m4360M879J88176k17339m7426j0061K2419j53865
$$ 490694 651995 867739 812529 768169 773048 961224 743885 696459 686398 708817 554952
11020E54952J1005J52520n7022k1715O5871k77058N05892j48294k64764J2348
$$ 554952 565957 718477 661455 639740 705611 428553 934445 786151 521387 533735
11010E33735j20959L19859R6624C71511M98917M7860l26188L3656k01566M36277
$$ 533735 412776 732635 829259 371511 870428 918288 592100 625756 424190 860467
11000H60467k92922l129j69001M90598k66089J26535M7454j1175j29367J21579
$$ 860467 567545 564416 395415 886013 619924 746459 793913 782738 653371 774950
10990G74950L09830j64397p9270L4385k1103Q9831K56151r8701m655N9226j95084
$$ 774950 1084780 920383 841113 875498 854395 944226 1200377 1101676 1097021 1156247 961163
10979I61163L67089K34296l4715M02515N16501M07206K33521j70628J05871M0240
$$ 961163 1328252 1562548 1527833 1930348 2446849 2854055 3087576 2916948 3022819 3063059
10969C063059J73108l53598o27084J00327l01809k77283k56308M6653j86308K78988
$$ 3063059 3236167 2882569 2255485 2355812 2054003 1776720 1520412 1567065 1380757 1659745
10959A659745L724k80817m4693N28920j77610j89962K07172p08439K19574m14072
$$ 1659745 1663469 1382652 1337959 1866879 1689269 1499307 1706479 998040 1217614 803542
10949H03542J34548m19886N8457k50413N8503A17077J80303l3777A03380K22674
$$ 803542 938090 518204 576661 326248 384751 117077 297380 263603 103380 326054
10939C26054G0855j2919B1433a1634A50645N16538B34825P6082A20078n6185A8746
$$ 326054 70855 57936 21433 -11634 150645 667183 234825 310907 120078 63893 18746
10927B86508j11865L1730j0241m9324c2572j2710E7871B7546a86678e2970A17294
$$ 286508 174643 206373 196132 146808 -32572 -45282 57871 27546 -186678 -52970 117294
10915B55752b50490A31633B5300a35201A91826K6475G0263a12809j06215J8275
$$ 255752 -250490 131633 25300 -135201 191826 218301 70263 -112809 -219024 -200749
10905b00749e3497m0268K9438j19580G9057A2439M9492d7381A12238J55829h7496
$$ -200749 -53497 -93765 -64327 -183907 79057 12439 61931 -47381 112238 268067 -87496
10893A9723b79339C17843p9201J97283B12011n2714e5847l21675F2343P248i9452
$$ 19723 -279339 317843 238642 435925 212011 159297 -55847 -377522 62343 69591 -99452
10881B04657b42699j19169A10795f1387G1582K93439a20016j52220C28519d0197
$$ 204657 -242699 -361868 110795 -61387 71582 365021 -120016 -272236 328519 -40197
10870a52747A46333c00563J38119A25189j6184E3689B62J81444D6578k504N5390
$$ -152747 146333 -300563 -162444 125189 109005 53689 262 181706 46578 44074 99464
10859I9464a30569B87384a17636A02603a60307G3306k9724R7847o3578g4144j26307
$$ 99464 -130569 287384 -117636 102603 -160307 73306 43582 141429 77851 -74144 -200451
10848b00451B07184g4405n68L4109F5476a68010j3280o1203q8168A68427B6792
$$ -200451 207184 -74405 -74973 -40864 65476 -168010 -181290 -242493 -330661 168427 26792
10836H7882a44803L5489E924J00196B8344c14406c3396B26389a3495H1412k0681
$$ 87882 -144803 -109314 5924 106120 28344 -314406 -33396 226389 -13495 81412 60731
10825F0731a63082A64964a22798H6628b3716I7179Q6879b36494c8774k76463F5743
$$ 60731 -163082 164964 -122798 86628 -23716 97179 184058 -236494 -38774 -315237 65743
10813a24278B6390b34392p6033L1421A02540a73756b5623A06124a50353A80013
$$ -124278 26390 -234392 -310425 -279004 102540 -173756 -25623 106124 -150353 180013
10802F5719C2219N73i5628A9765R7684a6230A91195c90807J62378k2152e9764
$$ 65719 32219 32792 -95628 19765 117449 -16230 191195 -390807 -228429 -250581 -59764
10790a89644k39765a5953p8770A31102C1828Q8948a20720j3725N0919a332C9938
$$ -189644 -429409 -15953 -94723 131102 31828 120776 -120720 -134445 -83526 -1332 39938
10778c6270k07798G1350a9798C05355a97490h585k67099R8606p6625b2668C0753
$$ -36270 -244068 71350 -19798 305355 -197490 -8585 -275684 -177078 -253703 -22668 30753
10766f573B62181B6747b09702i7398B01455h1184j12989K2371B7706q07F745c2125
$$ -6573 262181 26747 -209702 -97398 201455 -81184 -194173 -171802 27706 26899 6745 -32125
10753C02692f0981A01295b9093D86554e43135C5529L8487b66576b1012L256A75875
$$ 302692 -60981 101295 -29093 486554 -543135 35529 74016 -266576 -21012 -17756 175875
10741b16964R8454a1419D0168L3070M0318E1175M1726f3264p6860r0092L3189
$$ -216964 -118510 -11419 40168 73238 113556 51175 92901 -63264 -140124 -230216 -197027
10730a97027F4153J52795D6157c45402I8027b40441a6743E0577h7331j83256j2462
$$ -197027 64153 216948 46157 -345402 98027 -240441 -16743 50577 -87331 -270587 -283049
10719b83049J19220k5977P9345B71482q7006b28402M8547e665k0049k0978q431
$$ -283049 -163829 -189806 -110461 271482 184476 -228402 -179855 -5665 -25714 -46692 -55123
10708e5123p944A98196o2772c4958H0382l1608a06108J898K0007k90215a24510
$$ -55123 -63067 198196 135424 -34958 80382 48774 -106108 -104210 -84203 -374418 -124510
10696a05646o6662J6409A34278a86641E9816K632g6450A03370b69718C3894a98605
$$ -105646 -172308 -155899 134278 -186641 59816 62448 -76450 103370 -269718 33894 -198605
10684B65536d1751B21048k4358g9319D24867I7279b23189g5023a1600D8609B453
$$ 265536 -41751 221048 196690 -79319 424867 97279 -223189 -75023 -11600 48609 2453
10672a51729j31952a12885C40585e3924j12726l8480i0612C45533h6050j64171
$$ -151729 -283681 -112885 340585 -53924 -166650 -205130 -90612 345533 -86050 -250221
10662b50221f5969n0666l29756a77950Q8251j23836j2567C030J52426g2293r7812
$$ -250221 -65969 -116635 -446391 -177950 -89699 -213535 -226102 3030 155456 -72293 -170105
10651a70105A03169J04776c1062k05730b6205j13082j0109B9110J23810c31331
$$ -170105 103169 207945 -31062 -236792 -26205 -139287 -149396 29110 152920 -331331
10640c66397A21581b61297A00252N4091E3795P5454R9828b58593a12881G4959
$$ -366397 121581 -261297 100252 154343 53795 129249 229077 -258593 -112881 74959
10629b25726P1661k26592E5804a70586A14459E3300d03081A00312B834K83751
$$ -225726 -154065 -380657 55804 -170586 114459 53300 -403081 100312 2834 286585
10619B86585a15827i775k10627K3989A40213b87763A08781b18452a9687k52069
$$ 286585 -115827 -9775 -220402 -196413 140213 -287763 108781 -218452 -19687 -271756
10609b71756C49504A52605F846L1952J49061C6759J9114a36730c8373F4356f099
$$ -271756 349504 152605 6846 38798 187859 36759 55873 -136730 -38373 64356 -6099
10597e0448B31949a62949L6322J8644k93549A42410A6854K37684c6345k1533E6065
$$ -50448 231949 -162949 -126627 -107983 -401532 142410 16854 254538 -36345 -57878 56065
10585f9385A45733a92695C8153b39586c9479k77902a3627k16668J12471D4210
$$ -69385 145733 -192695 38153 -239586 -39479 -317381 -13627 -230295 -117824 44210
10574d1725B7844a10910A42897l6222B4195D574h7016L1145b1547j46304k45051
$$ -41725 27844 -110910 142897 106675 24195 4574 -87016 -55871 -21547 -167851 -412902
10563d12902A28242a72994A79217f370B22417i2540E784a64583F0808a39534D9977
$$ -412902 128242 -172994 179217 -6370 222417 -92540 5784 -164583 60808 -139534 49977
10551a69532D7336b61825G0544b80493O5526a06451j71006A12282N7450K5988
$$ -169532 47336 -261825 70544 -280493 -214967 -106451 -277457 112282 169732 195720
10541A95720b7195C6135a44541F1168J0188a16688C2585a08651K6003E740P7618
$$ 195720 -27195 36135 -144541 61168 71356 -116688 32585 -108651 -82648 5740 83358
10530H3358b01816f4883A32270d335j55309n5352B74617q6786D699c02582q5851
$$ 83358 -201816 -64883 132270 -4335 -159644 -214996 274617 187831 4699 -302582 -388433
10519c88433h1870L2371k8576A68918a85871M1939A37292k1830E381R8863k1910
$$ -388433 -81870 -49499 -78075 168918 -185871 -143932 137292 115462 5381 104244 82334
10508H2334e1718B67261A13608e1921F3637J40353c8781B0159R178g9074C69779
$$ 82334 -51718 267261 113608 -51921 63637 203990 -38781 20159 29337 -79074 369779
10496A4287C365K33042c40112a58563H3005O583a64213G3994L8313e477I4368
$$ 14287 3365 236407 -340112 -158563 83005 89588 -164213 73994 112307 -5477 94368
10484A38790J4466J16320q9044J71832K80718k48098j06222C9234L36870p9767
$$ 138790 153256 269576 180532 352364 633082 384984 278762 39234 376104 296337
10474B96337a83378g3287A435K73833b71146c7674j41641h2894l6812j41675c0968
$$ 296337 -183378 -73287 1435 275268 -271146 -37674 -179315 -82894 -119706 -261381 -30968
10462a14068N930H9632i6218B7178b70875H0571J33922i2530A31228g1753B1830
$$ -114068 -108138 89632 -96218 27178 -270875 80571 214493 -92530 131228 -71753 21830
10450b63484b4778E3944a93840h4771c2142q5432L6352J5018H1640O1459g5502
$$ -263484 -24778 53944 -193840 -84771 -32142 -117574 -81222 -66204 81640 143099 -75502
10438B47159a75726K3882A49475j0216D392a50037B61264b14331r9012R9978g2374
$$ 247159 -175726 -151844 149475 139259 4392 -150037 261264 -214331 -313343 -213365 -72374
10426C6137P8304f4444r7380H0882a83048J1343l2013A96385b28108N7524I9603
$$ 36137 114441 -64444 -161824 80882 -183048 -171705 -203718 196385 -228108 -170584 99603
10414a17653b5334A76810o7863i9717C158g1393m7216c3855C61564j37717b64055
$$ -117653 -25334 176810 108947 -99717 3158 -71393 -118609 -33855 361564 223847 -264055
10402a17689k50335a12074j83790R9191E43696a20061L3830I4088M2659a0955
$$ -117689 -368024 -112074 -295864 -196673 543696 -120061 -86231 94088 136747 -10955
10391A33830c77161B37978l9747r2428C5182Q4143L7652B8413d674A08767B5623
$$ 133830 -377161 237978 198231 105803 35182 119325 156977 28413 -4674 108767 25623
10379A48030K1009J01265d2151A80089O0445m5656l9016K60344A50303K44903
$$ 148030 169039 270304 -42151 180089 240534 194878 155862 416206 150303 395206
10369C95206K37158B28368J19307J52113m6490K01628A62668K28371o8190F8354
$$ 395206 632364 228368 347675 499788 453298 654926 162668 391039 322849 68354
10358D16026k5656l8031I5534J62148E6561L01537q1565k1484L18891j28543A90659
$$ 416026 390370 352339 95534 257682 56561 358098 276533 255049 573940 445397 190659
10346I9559K78234H8986B7944P8734k8926N8736R3164p6013a38364A43509O4375
$$ 99559 377793 88986 27944 106678 77752 136488 229652 153639 -138364 143509 207884
10335B07884P4106N375L7993o797f8628p0223D549K14824r7463f6264A5787J54957
$$ 207884 281990 287365 325358 318561 -68628 -138851 4549 219373 121910 -66264 15787 170744
10323A70744n7452L46867A95632B6192K1813K56043b36987J5094f2923A07481
$$ 170744 113292 460159 195632 26192 48005 304048 -236987 -221893 -62923 107481
10312A0991M98373D7148b67569N9945G2355c41463c8633l17481f1437k41783B95962
$$ 10991 509364 47148 -267569 -207624 72355 -341463 -38633 -356114 -61437 -303220 295962
10300b63006B20462c7354F8711L0934K6338a230l1667E9219A6379b45513A27977
$$ -263006 220462 -37354 68711 99645 125983 -1230 -32897 59219 16379 -245513 127977
10288a73335K3571I8006g6388B6520J05967D0701c19543A8364i0035A21552D7400
$$ -173335 -149764 98006 -76388 26520 132487 40701 -319543 18364 -90035 121552 47400
10276c37002A56203f5940A18108K0073a17147A27722c4999k09514L8379f015j92594
$$ -337002 156203 -65940 118108 138181 -117147 127722 -34999 -244513 -206134 -6015 -198609
10265a98609M7917a8484A44868k4753C0258K36597j29397K01488A55083m9932
$$ -198609 -150692 -18484 144868 120115 30258 266855 137458 338946 155083 105151
10255A05151J58414e4446A58248b67196B92233H0594j3464M6083D1372A8330a98176
$$ 105151 263565 -54446 158248 -267196 292233 80594 67130 113213 41372 18330 -198176
10243a93999k47315a845j22734H4366d4040p3536l20790E4293L4415f7432K4073
$$ -193999 -441314 -1845 -124579 84366 -44040 -117576 -438366 54293 88708 -67432 -43359
10232d3359p0152e0287j10198A06552C4766J48810a06123C1546O6987g48o7321
$$ -43359 -113511 -50287 -160485 106552 34766 183576 -106123 31546 98533 -748 -68069
10221f8069a1027C21650a53799O7667h175r0624A39241K70543G4331f220B04184
$$ -68069 -11027 321650 -153799 -86132 -8175 -98799 139241 409784 74331 -6220 204184
10209g9233j35655C13655j40200d3067k33842i8077A51789L3660A4043a64291
$$ -79233 -214888 313655 173455 -43067 -276909 -98077 151789 185449 14043 -164291
10198c28437F5071a19946A50887l3033a62640o7340F8296h2841j68113H4717d9119
$$ -328437 65071 -119946 150887 117854 -162640 -229980 68296 -82841 -250954 84717 -49119
10186c00292b075I6549D4444j2359c524A06451a24833L7992p5554j33302P4449
$$ -300292 -2075 96549 44444 32085 -3524 106451 -124833 -86841 -162395 -295697 -221248
10175b21248j11276a13160B61837c5552B02275p2537a48369k6984d0539C59579
$$ -221248 -332524 -113160 261837 -35552 202275 129738 -148369 -175353 -40539 359579
10164F6199R164C4239g5324E54081B21362a60129e8111B57532a41415j83545b8996
$$ 66199 75363 34239 -75324 554081 221362 -160129 -58111 257532 -141415 -324960 -28996
10152c46097A90124p48c3790j3793A63560a23975A02795D2340b13851c1381r5900
$$ -346097 190124 189376 -33790 -47583 163560 -123975 102795 42340 -213851 -31381 -127281
10141a27281l609r0875B81125b47216A78355a79454k15660g9743a5352E1980J9699
$$ -127281 -130890 -221765 281125 -247216 178355 -179454 -395114 -79743 -15352 51980 71679
10130G1679a4255k63307d9757A78853e5906G0707a4697q8000C2870L450g7283
$$ 71679 -14255 -277562 -49757 178853 -55906 70707 -14697 -102697 32870 36320 -77283
10118a55977j93515A15474e2610l55991G5413O8155a68078d6672F8807g4517j79160
$$ -155977 -349492 115474 -52610 -408601 75413 143568 -168078 -46672 68807 -74517 -253677
10107b53677l8779E5694d4598A85562L7354a01619r5283H2904P9251f6455b8143
$$ -253677 -292456 55694 -44598 185562 222916 -101619 -196902 82904 162155 -66455 -28143
10095a13627o8398g1591B28929a08750J5547L8971G0356a04916b4935l41827a42267
$$ -113627 -182025 -71591 228929 -108750 -93203 -54232 70356 -104916 -24935 -366762 -142267
10083a45211g1056A16794h1170k39240C1554a41849r9410a0550j47294B68324
$$ -145211 -71056 116794 -81170 -320410 31554 -141849 -241259 -10550 -157844 268324
10072A51003J7069b20812E9988c5279p4378A15071c96001d6074k54938h2404L1538
$$ 151003 168072 -220812 59988 -35279 -109657 115071 -396001 -46074 -301012 -82404 -50866
10061e0866l25005a54919k52159J36638a05408M0974p8856N4297J2617j15101
$$ -50866 -375871 -154919 -407078 -270440 -105408 -64434 -143290 -88993 -76376 -191477
10051a91477m7161A07681K8186m3538e0749H4922b2055L941Q777j72010p2463
$$ -191477 -238638 107681 135867 92329 -50749 84922 -22055 -18114 -9337 -181347 -253810
10040b53810E009b28153P6984f3783G2004c38713G7721a37551N6696B83173C691
$$ -253810 5009 -228153 -151169 -63783 72004 -338713 77721 -137551 -80855 283173 3691
10028B52656l7813a10804c35k10650a04671m9880j76092C8937b73578E6123g7668
$$ 252656 214843 -110804 -335 -210985 -104671 -154551 -330643 38937 -273578 56123 -77668
10016B955a6202k33483B42105a21875d7465b0824A94079a24711l1317n1991c1870
$$ 2955 -16202 -249685 242105 -121875 -47465 -20824 194079 -124711 -156028 -208019 -31870
10004a10619j20080d2534m1899k59298a55523G0098a57708j34556I5834K0443
$$ -110619 -230699 -42534 -84433 -343731 -155523 70098 -157708 -292264 95834 116277
9994A16277N6697d27105a32640L0072M7510A72146d99571a73800O5656j0052p6481
$$ 116277 172974 -427105 -132640 -102568 -55058 172146 -499571 -173800 -108144 -118196 -194677
9983a94677b7157A61765a42239J5679A38414e9460r7260F4050k5932a26764j4880
$$ -194677 -27157 161765 -142239 -126560 138414 -59460 -156720 64050 38118 -126764 -141644
9972a41644k40551B61271b40884A3570a20770B50969d2078A32267a3366k74126
$$ -141644 -382195 261271 -240884 13570 -120770 250969 -42078 132267 -13366 -287492
9962b87492a4034j29036J3988d1087B35412g2477k25148J41831A75477R436N1047
$$ -287492 -14034 -143070 -129082 -41087 235412 -72477 -297625 -155794 175477 184913 235960
9951B35960n5564b32660e1494r2965A45339a47336e1810A71372e00601a01577
$$ 235960 180396 -232660 -51494 -144459 145339 -147336 -51810 171372 -500601 -101577
9940a24375B04830I9993c25973D969J05894F468c33495a41161A95637A7033e7518
$$ -124375 204830 99993 -325973 4969 110863 6468 -333495 -141161 195637 17033 -57518
9928g7096b6483j49084C0120a94077M7696j54163E2692P454k6887J56289C991
$$ -77096 -26483 -175567 30120 -194077 -146381 -300544 52692 60146 33259 189548 3991
9916A45817b69350a02029N772N742j4000A31898a43179B7012P7041m5967i0382
$$ 145817 -269350 -102029 -96257 -90515 -104515 131898 -143179 27012 104053 58086 -90382
9904f0225A04868h0019q4466a2776k09876I4984l2308b7554k16689J04993q8690
$$ -60225 104868 -80019 -164485 -12776 -222652 94984 62676 -27554 -244243 -139250 -227940
9893b27940A44113a5984j43133e0348h024A38068O0945L1737b8583l4465o7098
$$ -227940 144113 -15984 -159117 -50348 -8024 138068 199013 230750 -28583 -63048 -130146
9882a30146j18610d1529C13312b8518F5425M4129J62994b06882Q8017k1062d7404
$$ -130146 -248756 -41529 313312 -28518 65425 109554 272548 -206882 -118865 -139927 -47404
9870D2930a08091m312E6103O7841b4438j37845C78727h6997q4561A2833b4005
$$ 42930 -108091 -112403 56103 123944 -24438 -162283 378727 -86997 -171558 12833 -24005
9858b89786A37294O1526i8944b9413j89382a06129l5307a1025C5165d08725A73559
$$ -289786 137294 198820 -98944 -29413 -218795 -106129 -141436 -11025 35165 -408725 173559
9846a91283A19481Q4887d36709H7936k3335c609l90090h0003A4085B719b28283
$$ -191283 119481 204368 -436709 87936 64601 -3609 -393699 -80003 14085 2719 -228283
9834a93350g8694o705p8356H1047b21644e5977C75510A26084a19237c740j39846
$$ -193350 -78694 -85399 -163755 81047 -221644 -55977 375510 126084 -119237 -3740 -143586
9823a43586b6496k14014h4083r8714h4393l6671e6687n6104G5031h6484D8429
$$ -143586 -26496 -240510 -84083 -182797 -84393 -121064 -56687 -112791 75031 -86484 48429
9811b64003L2318e8128C6335a46633r2521A53462a52837A1921a51937B5957K44754
$$ -264003 -231685 -58128 36335 -146633 -239154 153462 -152837 11921 -151937 25957 270711
9800B70711d7501A16282c01154J17263p2972J01474M7241D1062a60718k8996m0769
$$ 270711 -47501 116282 -301154 -183891 -256863 -155389 -108148 41062 -160718 -189714 -230483
9789b30483A46691A3526J51524a77865m3128g2017j66648e0752j06747C17982
$$ -230483 146691 13526 165050 -177865 -220993 -72017 -238665 -50752 -157499 317982
9778D8392b65807b0798q2925k3440A37536c717l39207A19303J10772b8596k46664
$$ 48392 -265807 -20798 -103723 -127163 137536 -3717 -342924 119303 230075 -28596 -275260
9767b75260a4127j06777A30768c19642J00133R5923o6185r0652c9910j12028p8909
$$ -275260 -14127 -120904 130768 -319642 -219509 -123586 -189771 -280423 -39910 -151938 -230847
9756b30847l19069f9379B15306k570a81150R846e2554j16469k02019B13708I0705
$$ -230847 -549916 -69379 215306 212736 -181150 -171304 -52554 -169023 -371042 213708 90705
9744b0607l15746q88d5591E854d9908j086j63379j64420A00789g6883k16373c3215
$$ -20607 -336353 -337241 -45591 5854 -49908 -50994 -214373 -378793 100789 -76883 -293256 -33215
9731H6805d7927H7217a33886j20008B43126a24136l49187J92501a05243D16935
$$ 86805 -47927 87217 -133886 -253894 243126 -124136 -473323 -280822 -105243 416935
9720A7888m262c6774k11096J18865A6972P0861d4649a5900k00689A60006b32542
$$ 17888 13626 -36774 -247870 -129005 16972 87833 -44649 -15900 -216589 160006 -232542
9708A26778M3377o8653b65307e2368l34186J86060j02121f9372E192K13612K2073
$$ 126778 170155 101502 -265307 -52368 -386554 -200494 -302615 -69372 5192 218804 240877
9697B40877c6693H1070a6182B17314a0987j23157C6415K06480F615a37019D1405
$$ 240877 -36693 81070 -16182 217314 -10987 -134144 36415 242895 6615 -137019 41405
9685B02813f2680D0410K42303h6897j14032R9670C918b00946B64259b97056j50438
$$ 202813 -62680 40410 282713 -86897 -200929 -101259 3918 -200946 264259 -297056 -447494
9674d47494D190J16129a21406e0583G7504k7612c8894C63689A9110M0438a36756
$$ -447494 4190 120319 -121406 -50583 77504 49892 -38894 363689 19110 59548 -136756
9662c2398j17395F0788a7579p9466l10652H2005a11129J4536J8221B071c45764
$$ -32398 -149793 60788 -17579 -97045 -407697 82005 -111129 -96593 -78372 2071 -345764
9650a31418e1785B80798j18682b3396D8920b59695A8627i7664A43281a10260A9533
$$ -131418 -51785 280798 162116 -23396 48920 -259695 18627 -97664 143281 -110260 19533
9638c11280f0780G7916J31708c96669J90922A76697g0727K7524k16377J07101
$$ -311280 -60780 77916 209624 -396669 -205747 176697 -70727 -43203 -259580 -152479
9628a52479N8649j24439j86443a44729f5718j87383F522c3752B88225C8653Q6225
$$ -152479 -93830 -218269 -404712 -144729 -65718 -253101 6522 -33752 288225 38653 124878
9617A24878a8982l09758C48551d77983h4135q4k22160R7174A82578M3289A02828
$$ 124878 -18982 -328740 348551 -477983 -84135 -84219 -306379 -209205 182578 225867 102828
9605c75639C139J14928g2095C7503J20878c39599C3043J55695p8889j3160J41214
$$ -375639 3139 118067 -72095 37503 158381 -339599 33043 188738 109849 96689 237903
9594B37903b15637N9559d4577B89651f3318E9003P9708a5792m00747i0721B28472
$$ 237903 -215637 -156078 -44577 289651 -63318 59003 138711 -15792 -416539 -90721 228472
9582a68585a6839j5426k40403M6870M8659d1842q4110B23829g8336B4853J28649
$$ -168585 -16839 -32265 -272668 -225798 -177139 -41842 -125952 223829 -78336 24853 153502
9571A53502a38099c9950A95596a29421N2057c0548D1198d6922A13737c32495b5626
$$ 153502 -138099 -39950 195596 -129421 -77364 -30548 41198 -46922 113737 -332495 -25626
9559b59312L9494B22656E9575M8960J085b8010n29245a0175k17267h677A41379
$$ -259312 -219818 222656 59575 108535 109620 -28010 -557255 -10175 -227442 -8677 141379
9547b5710j74142f9024L0490E4207b17635d2090A56417l8693l8271Q7997o6123
$$ -25710 -199852 -69024 -38534 54207 -217635 -42090 156417 117724 79453 167450 101327
9536A01327M2274b02153N4229B17870l4823a67665O9602C4318Q6294j083d71307
$$ 101327 143601 -202153 -147924 217870 183047 -167665 -98063 34318 120612 119529 -471307
9524a57227B78497A22692a52512k56098a21712J6799A4558h4725E4469a7583k31010
$$ -157227 278497 122692 -152512 -408610 -121712 -104913 14558 -84725 54469 -17583 -248593
9513b48593F7739c98319a41699B4925p515i9051j98654a26938B79754q7025a44133
$$ -248593 67739 -398319 -141699 24925 17410 -99051 -297705 -126938 279754 192729 -144133
9501b49949q3060A80446o8545a45050B18604f616D8084h5845j6217l33209K12364
$$ -249949 -333009 180446 111901 -145050 218604 -6616 48084 -85845 -102062 -435271 -222907
9490b22907B20414r2859b5806k0494r6833r5596J1759P6900j82759a140k1285
$$ -222907 220414 127555 -25806 -46300 -143133 -238729 -226970 -150070 -332829 -1140 -22425
9479b2425B34579A02939f3831A84195c44380a14768j20947C1783b24091J09606
$$ -22425 234579 102939 -63831 184195 -344380 -114768 -235715 31783 -224091 -114485
9469a14485j15504a05276b4135k31026M327b0850k43518f8065B58927a19167D05062
$$ -114485 -229989 -105276 -24135 -255161 -250834 -20850 -264368 -68065 258927 -119167 405062
9457a58956c7614J1489B45885e5528l5667j13070D7228B0606e4756A79589m5584
$$ -158956 -37614 -26125 245885 -55528 -91195 -204265 47228 20606 -54756 179589 134005
9446A34005a54193K7555A22491D086h6209l0027n0803d3193l65811P1148a40923
$$ 134005 -154193 -126638 122491 4086 -86209 -116236 -167039 -43193 -409004 -337856 -140923
9434d6348l2431C4969a25775B00462J22789j15873r6873a04321p3639k1031P0856
$$ -46348 -78779 34969 -125775 200462 323251 207378 110505 -104321 -177960 -198991 -128135
9423a28135p3809l50883b26988n6771B05542B2807c02513C15334j10429B0594
$$ -128135 -201944 -552827 -226988 -283759 205542 22807 -302513 315334 204905 20594
9412C05199d699r3919k40871J63992o1052B57943b1706k2236k92955h637I4039
$$ 305199 -4699 -98618 -339489 -175497 -236549 257943 -21706 -43942 -336897 -8637 94039
9400a50267A33584f8168b5108B5358a58699A11065g631A03527b61414b2126q9818
$$ -150267 133584 -68168 -25108 25358 -158699 111065 -7631 103527 -261414 -22126 -111944
9389a11944A45658f1833j9237C5335g2813l5298l55608D5663j2222a91504A6142
$$ -111944 145658 -61833 -81070 35335 -72813 -108111 -463719 45663 33441 -191504 16142
9377d0998B12082b76545A26086a89987d2253k07490k2445j06208a47951e8059
$$ -40998 212082 -276545 126086 -189987 -42253 -249743 -272188 -378396 -147951 -58059
9366A59443Q4254a19657A13792a27751k1084j4948k72279J33151A7776b80127
$$ 159443 243697 -119657 113792 -127751 -148835 -163783 -436062 -302911 17776 -280127
9355I5420J20780b92662a30183j62244k97139A41436a1966k72650a08725B7201
$$ 95420 216200 -292662 -130183 -292427 -589566 141436 -11966 -284616 -108725 27201
9344d3511D17125A15549J4274J21214b33189a03167j41823Q5728c0010q760j04391
$$ -43511 417125 115549 129823 251037 -233189 -103167 -244990 -159262 -30010 -38770 -143161
9333a43161j58854B60783a68908b2498j23810F936a53853A71549b50989B196P5837
$$ -143161 -302015 260783 -168908 -22498 -146308 6936 -153853 171549 -250989 2196 78033
9322G8033a36079C41106p2542b4678A8525c3979k49496M5251J00862O6237A83757
$$ 78033 -136079 341106 268564 -24678 18525 -33979 -283475 -238224 -137362 -71125 183757
9310b09769m1047B26429a65220j15999a27169f1892n7793N6699B0951K6906R6567
$$ -209769 -250816 226429 -165220 -281219 -127169 -61892 -119685 -62986 20951 47857 144424
9299A44424a1517k14755C6482b68534k6465R9537j01774J05803a5580k05343j69493
$$ 144424 -11517 -226272 36482 -268534 -294999 -195462 -297236 -191433 -15580 -220923 -390416
9288c90416a21850j57600q2009J6210A32467a65560A43320m1002a51786E4159
$$ -390416 -121850 -279450 -361459 -345249 132467 -165560 143320 102318 -151786 54159
9277c4230A5637a53519H4408f5487G2719f1888A92348a50684K6758A44697Q0700
$$ -34230 15637 -153519 84408 -65487 72719 -61888 192348 -150684 -123926 144697 225397
9266B25397b25573K9061D2233j7143b13448B00515K7831j5695h3025n33522c03484
$$ 225397 -225573 -196512 42233 25090 -213448 200515 228346 212651 -83025 -616547 -303484
9254A37411b51871C88588j09666a34060M3008A3509a31907k1924a4417m15928
$$ 137411 -251871 388588 278922 -134060 -91052 13509 -131907 -153831 -14417 -430345
9244d30345l7840b32170A38663a83742q0630A49115B9453H806L42291a97516k14312
$$ -430345 -468185 -232170 138663 -183742 -264372 149115 29453 8806 351097 -197516 -411828
9233d11828g4029c6644n085k25086l7541J22780j22647R3310r2330H2905J80456
$$ -411828 -74029 -36644 -41729 -266815 -304356 -181576 -304223 -210913 -303243 82905 263361
9222B63361i1374m7504D2064b9298C51397b6622p1114m07164d3290A44761a2098
$$ 263361 -91374 -138878 42064 -29298 351397 -26622 -97736 -504900 -43290 144761 -12098
9210a00377k22308K3761J02535A67073d106A20723a77631f2310H6303b01955b6857
$$ -100377 -322685 -298924 -196389 167073 -4106 120723 -177631 -62310 86303 -201955 -26857
9198F9285q138e8422A10101b00543d406A33112a09406j65974a06651A08371Q470
$$ 69285 61147 -58422 110101 -200543 -4406 133112 -109406 -275380 -106651 108371 116841
9187A16841D1973a36414C9663J41190E420L59074c21659a44936c5008m3544G6759
$$ 116841 41973 -136414 39663 180853 5420 364494 -321659 -144936 -35008 -78552 76759
9175A1153N38778a43487C6447r230O8347b27613k77794h4293r4076d8020G1128
$$ 11153 549931 -143487 36447 27217 95564 -227613 -505407 -84293 -178369 -48020 71128
9163A27524F2689a65526H8262M32948b1829l7730A45055b2239j19826M7548L4337
$$ 127524 62689 -165526 88262 521210 -21829 -59559 145055 -22239 -142065 -94517 -60180
9152f0180P131l29553A33464a5154j44960n4371H760i7648k96464C46778D4474
$$ -60180 -53049 -382602 133464 -15154 -160114 -214485 8760 -97648 -394112 346778 44474
9140B50009a1101k488k76923E3313J0894b00467j41612a21367k3343f7371A67667
$$ 250009 -11101 -13589 -290512 53313 64207 -200467 -342079 -121367 -144710 -67371 167667
9128d3587A8720L4729g2846I5094C7619J13330h5915A257c91535H391K11409b169
$$ -43587 18720 53449 -72846 95094 37619 150949 -85915 1257 -391535 8391 219800 -2169
9115A73962a89069j1141l32509a57450D3018c2266l97589h8877c9167H5703i8129
$$ 173962 -189069 -200210 -532719 -157450 43018 -32266 -429855 -88877 -39167 85703 -98129
9103I494b32473A38116a25290k05544a30971j71465a26518B02510a57589N0843
$$ 9494 -232473 138116 -125290 -330834 -130971 -302436 -126518 202510 -157589 -106746
9093a06746k1008F8235c89909A20571b42646b2055k51423a22326A66577J97725
$$ -106746 -127754 68235 -389909 120571 -242646 -22055 -273478 -122326 166577 364302
9083C64302I8113J0500c6717j25989N2552B9733a08829K5408A8615e8844A6355
$$ 364302 98113 108613 -36717 -162706 -110154 29733 -108829 -83421 18615 -58844 16355
9071A55715D446a78679i259k22002R2368F3676b59189M5884g4426B09239a84966
$$ 155715 4446 -178679 -9259 -231261 -138893 63676 -259189 -213305 -74426 209239 -184966
9059e1783B91664b8431j20188A78639a5208j28213A94334b24369q2559C3432K1041
$$ -51783 291664 -28431 -148619 178639 -15208 -143421 194334 -224369 -306928 33432 54473
9048E4473Q6216a71616C44711b12662I7065L259l9579a60407o4426P668R2601
$$ 54473 140689 -171616 344711 -212662 97065 100324 60745 -160407 -224833 -217165 -124564
9037a24564o9091j68350a08142A0035N984d1306A4075g4907j12376A1931a56901
$$ -124564 -193655 -362005 -108142 10035 16019 -41306 14075 -74907 -187283 11931 -156901
9025a16273j168c109r6653G6507b4668j5876l0810A79555m203m1698d5681C530
$$ -116273 -117441 -3109 -99762 76507 -24668 -40544 -71354 179555 175352 133654 -45681 3530
9012I3609a84678A12727b34365i3683C28473d7534E045M4378J03863B4583a3512
$$ 93609 -184678 112727 -234365 -93683 328473 -47534 5045 49423 153286 24583 -13512
9000b87312J31107J0535e6328B07862I477j164b8230m45028i4203r4054d3004
$$ -287312 -156205 -145670 -56328 207862 9477 8313 -28230 -473258 -94203 -188257 -43004
8988h3401j72304J26858D5525c7264C4779h1964c6613n14930H2326m0257j4209
$$ -83401 -255705 -128847 45525 -37264 34779 -81964 -36613 -551543 82326 42069 27860
8977B7860a55714K4556r0399Q74P8987g931m6340p5251F4163h3316B4138K24740
$$ 27860 -155714 -131158 -221557 -220683 -141696 -7931 -54271 -129522 64163 -83316 24138 248878
8965B48878C7519P32e2526E807g9967B04720e4812E10981a92272D4358h9610k5815
$$ 248878 37519 38251 -52526 5807 -79967 204720 -54812 510981 -192272 44358 -89610 -115425
8953a15425m7462k75341a56844K3264E0224b72800J22372j0837B01866E4081b13200
$$ -115425 -162887 -438228 -156844 -133580 50224 -272800 -150428 -161265 201866 54081 -213200
8941F40845a24035O0580j19560C30647d48516d7842j33959F1415a80532l360e1209
$$ 640845 -124035 -63455 -183015 330647 -448516 -47842 -181801 61415 -180532 -183892 -51209
8929c2595A01019K49195B1432l560J04809J45159F9840K108061I54512e5233l8017
$$ -32595 101019 350214 21432 17872 122681 267840 69840 2177901 954512 -55233 -93250
8918i3250r2098A42755j4924e2230j74305B7153b7968B16531n7333f3910m5699
$$ -93250 -185348 142755 127831 -52230 -226535 27153 -27968 216531 159198 -63910 -109609
8907a09609j63270a7399j56166B07964a51132E2429c09912a39665A80726d937
$$ -109609 -272879 -17399 -173565 207964 -151132 52429 -309912 -139665 180726 -4937
8896d05A15386l095d9041j68267H3214a58781j49449b3998p8356H4408b05582
$$ -405 115386 112291 -49041 -217308 83214 -158781 -308230 -23998 -102354 84408 -205582
8884a95968j364f3813H5508c91211I8758N53C3191j3902f3405I9178h9888l62345
$$ -195968 -197332 -63813 85508 -391211 98758 99311 33191 19289 -63405 99178 -89888 -452233
$$ [...]
##END NTUPLES=NMR SPECTRUM
##END=
