##TITLE=AC1459_PAST813265_7819218_GKhFzjxwCK
##JCAMPDX= 6.0         $$ Bruker NMR JCAMP-DX V2.0
##DATA TYPE= NMR SPECTRUM
##DATA CLASS= NTUPLES
##ORIGIN= BRUKER
##OWNER= Administrator
$$ 1.72 TOPSPIN		Version 2.1
$$ 2013-04-30 21:35:37.958 -0700  Administrator@X
$$ Compression mode = diff/dup
##.OBSERVE FREQUENCY= 400.02188249412
##.OBSERVE NUCLEUS= ^1H
##.ACQUISITION MODE= SIMULTANEOUS (DQD)
##.ACQUISITION SCHEME= undefined
##.AVERAGES= 64
##.DIGITISER RES= 22
##SPECTROMETER/DATA SYSTEM= spect
##.PULSE SEQUENCE= noesygpps1d.comp
##.SOLVENT NAME= COFFEE_meoh
##.SHIFT REFERENCE= INTERNAL, COFFEE_meoh, 1, 14.96076
##AUDIT TRAIL= $$ (NUMBER, WHEN, WHO, WHERE, PROCESS, VERSION, WHAT)
$$ ##TITLE= Audit trail, TOPSPIN		Version 2.1
$$ ##JCAMPDX= 5.01
$$ ##ORIGIN= Bruker BioSpin GmbH
$$ ##OWNER= Administrator
$$ $$ E:\/data/COFFEE/nmr/AC1459_PAST813265_7819218_GKhFzjxwCK/12/pdata/1/auditp.txt
$$ ##AUDIT TRAIL=  $$ (NUMBER, WHEN, WHO, WHERE, PROCESS, VERSION, WHAT)
(   1,<2013-04-30 21:35:32.911 -0700>,<Administrator>,<X>,<go>,<TOPSPIN 2.1>,
      <created by zg
	started at 2013-04-30 21:24:03.458 -0700,
	POWCHK enabled, PULCHK disabled,
       configuration hash MD5:
       F7 49 AB AC A2 8D 51 76 73 8D C1 9A A6 38 9F DE
       data hash MD5: 64K
       F3 37 0E 91 01 04 5B 66 88 8F A8 69 DD 0D B8 D7>)
(   2,<2013-04-30 21:35:35.895 -0700>,<Administrator>,<X>,<proc1d>,<TOPSPIN 2.1>,
      <Start of raw data processing
       efp LB = 0.3 FT_mod = 6 PKNL = 1 PHC0 = 0 PHC1 = 0 SI = 128K 
       data hash MD5: 128K
       5D AC 56 FA 56 17 90 D5 B5 48 6A 2C 90 BF D9 C1>)
(   3,<2013-04-30 21:35:36.895 -0700>,<Administrator>,<X>,<proc1d>,<TOPSPIN 2.1>,
      <pk PHC0 = -79.11255 PHC1 = 0 
       data hash MD5: 128K
       82 90 1C F2 8E 98 48 42 C9 C4 A7 DF 55 6F 15 3E>)
(   4,<2013-04-30 21:35:37.380 -0700>,<Administrator>,<X>,<proc1d>,<TOPSPIN 2.1>,
      <abs ABSG = 1 
       data hash MD5: 128K
       7A 4D 16 1F D1 90 84 CB ED C7 85 11 B5 BC 6A 87>)
(   5,<2013-04-30 21:35:37.489 -0700>,<Administrator>,<X>,<proc1d>,<TOPSPIN 2.1>,
      <abs ABSG = 2 
       data hash MD5: 128K
       52 EA 0C 0F 63 BA 8C DE 4F 29 70 D8 C2 D7 C5 84>)
(   6,<2013-04-30 21:35:37.598 -0700>,<Administrator>,<X>,<proc1d>,<TOPSPIN 2.1>,
      <abs ABSG = 3 
       data hash MD5: 128K
       89 7B 8C 9F 13 6C 8F A1 3B 3C B3 A1 0E 3F 7C 21>)
(   7,<2013-04-30 21:35:37.692 -0700>,<Administrator>,<X>,<proc1d>,<TOPSPIN 2.1>,
      <abs ABSG = 4 
       data hash MD5: 128K
       94 20 16 3E 76 AA 3F B3 40 33 B9 AE B2 85 36 F5>)
(   8,<2013-04-30 21:35:37.786 -0700>,<Administrator>,<X>,<proc1d>,<TOPSPIN 2.1>,
      <abs ABSG = 5 
       data hash MD5: 128K
       38 D1 8F E4 BC D4 D7 E2 8E 91 34 32 07 88 BF 50>)
$$ ##END=
$$ 
$$ $$ hash MD5
$$ $$ DD C8 6B A8 37 6A 31 A9 FB 25 9A FB 7B 43 0A 1F
##$RELAX= 
##$RELAX= 
##$RELAX= 
##$RELAX= 
##$RELAX= 
##$RELAX= 
##$RELAX= 
##$RELAX= 
$$ Bruker specific parameters
$$ --------------------------
##$DU= <E:\>
##$EXPNO= 12
$$ [...]
##$TP07= 0
##$TPNAME0= <>
##$TPNAME1= <>
##$TPNAME2= <>
##$TPNAME3= <>
##$TPNAME4= <>
##$TPNAME5= <>
##$TPNAME6= <>
##$TPNAME7= <>
##$TPOAL= (0..7)
0.5 0.5 0.5 0.5 0.5 0.5 0.5 0.5
##$TPOFFS= (0..7)
0 0 0 0 0 0 0 0
##$TUNHIN= 0
##$TUNHOUT= 0
##$TUNXOUT= 0
##$USERA1= <user>
##$USERA2= <user>
##$USERA3= <user>
##$USERA4= <user>
##$USERA5= <user>
##$V9= 5
##$VALIST= <valist>
##$VCLIST= <CCCCCCCCCCCCCCC>
##$VD= 0
##$VDLIST= <DDDDDDDDDDDDDDD>
##$VPLIST= <PPPPPPPPPPPPPPP>
##$VTLIST= <TTTTTTTTTTTTTTT>
##$WBST= 1024
##$WBSW= 4
##$XGAIN= (0..3)
0 0 0 0
##$XL= 0
##$YL= 0
##$YMAX_a= 6419281
##$YMIN_a= -13099663
##$ZGOPTNS= <>
##$ZL1= 120
##$ZL2= 120
##$ZL3= 120
##$ZL4= 120
##$ABSF1= 14.96076
##$ABSF2= -5.597422
##$ABSG= 5
##$ABSL= 3
##$ALPHA= 0
##$AQORDER= 0
##$ASSFAC= 0
##$ASSFACI= 0
##$ASSFACX= 0
##$ASSWID= 0
##$AUNMP= <proc_prof1d_extract.lims>
##$AXLEFT= 0
##$AXNAME= <>
##$AXNUC= <1H>
##$AXRIGHT= 0
##$AXTYPE= 0
##$AXUNIT= <>
##$AZFE= 0.1
##$AZFW= 0.1
##$BCFW= 0
##$BC_mod= 0
##$BYTORDP= 0
##$COROFFS= 0
##$CY= 15
##$DATMOD= 1
##$DC= 0
##$DFILT= <>
##$DTYPP= 0
##$F1P= 0
##$F2P= 0
##$FCOR= 0.5
##$FTSIZE= 131072
##$FT_mod= 6
##$GAMMA= 0
##$GB= 0
##$INTBC= 1
##$INTSCL= 1
##$ISEN= 128
##$LB= 0.3
##$LEV0= 0
##$LPBIN= 0
##$MAXI= 10000
##$MC2= 0
##$MEAN= 0
##$ME_mod= 0
##$MI= 0
##$NCOEF= 0
##$NC_proc= -2
##$NLEV= 6
##$NOISF1= 0
##$NOISF2= 0
##$NSP= 0
##$NTH_PI= 0
##$NZP= 0
##$OFFSET= 14.96076
##$PC= 1
##$PHC0= -79.11255
##$PHC1= 0
##$PH_mod= 1
##$PKNL= yes
##$PPARMOD= 0
##$PPDIAG= 0
##$PPIPTYP= 0
##$PPMPNUM= 2147483647
##$PPRESOL= 1
##$PSCAL= 4
##$PSIGN= 0
##$PYNMP= <proc.py>
##$REVERSE= no
##$SF= 400.020009734768
##$SI= 131072
##$SIGF1= 0
##$SIGF2= 0
##$SINO= 400
##$SIOLD= 131072
##$SPECTYP= <>
##$SREGLST= <1H.CDCl3>
##$SSB= 0
##$STSI= 131072
##$STSR= 0
##$SW_p= 8223.68421052631
##$SYMM= 0
##$S_DEV= 0
##$TDeff= 65536
##$TDoff= 0
##$TI= <>
##$TILT= no
##$TM1= 0
##$TM2= 0
##$TOPLEV= 0
##$USERP1= <user>
##$USERP2= <user>
##$USERP3= <user>
##$USERP4= <user>
##$USERP5= <user>
##$WDW= 1
##$XDIM= 131072
##$YMAX_p= 437624120
##$YMIN_p= -11861
##$CURPLOT= <Network HP LaserJet P1505>
##$CURPRIN= <$Network HP LaserJet P1505>
##$DFORMAT= <normdp>
##$LAYOUT= <+/1D_H.xwp>
##$LFORMAT= <normlp>
##$PFORMAT= <normpl>
##$SURQMSG= 1
$$ End of Bruker specific parameters
$$ ---------------------------------
##NTUPLES= NMR SPECTRUM
##VAR_NAME=  FREQUENCY,     SPECTRUM/REAL,   SPECTRUM/IMAG
##SYMBOL=    X,             R,               I
##VAR_TYPE=  INDEPENDENT,   DEPENDENT,       DEPENDENT
##VAR_FORM=  AFFN,          ASDF,            ASDF
##VAR_DIM=   131072,        131072,          131072
##UNITS=     HZ,            ARBITRARY UNITS, ARBITRARY UNITS
##FACTOR=    0.0627417313425164, 1,          1
##FIRST=     8223.62146879497, -958,         -60714
##LAST=      0,             1911,            -60824
##MIN=       0,             -11861,          0
##MAX=       8223.62146879497, 437624120,    0
$$ Real data points
##PAGE= N=1
##DATA TABLE= (X++(R..R)), XYDATA
$$ [...]
63868F32221K0113K1725K2983K3692K4212K4891K5356K4846K3120K0644J7940
63857H81743J5218J2557R845O640K728j265m510p183j0190j3667j6755j9014k1048
63844H35099k3274k5092k5935k6205k6487k6573k6126k5557k5411k5352k4671
63833E54416k3374k1995k0721j9450j8306j7343j6143j4525j3178j2697j2480
63822C64204j1545j0078r041q486p564o157n199n121n137m538l644k986k476j965
63808B80267j830k252k577k086j078m22l49l59j92k44q70j767k224j900j152o60
63792B60305p64j170j403j422j619k206k846l044k763k401k270k231j995j653
63778B32518j674k223k662k129n76J073J899J820J274N64j79p02p25k72L10O58
$$ y = [632221, 652334, 674059, 697042, 720734, 744946, 769837, 795193, 820039, 843159, 863803, 881743, 896961, 909518, 919363, 926003, 928731, 927466, 922956, 915773, 905583, 891916, 875161, 856147, 835099, 811825, 786733, 760798, 734593, 708106, 681533, 655407, 629850, 604439, 579087, 554416, 531042, 509047, 488326, 468876, 450570, 433227, 417084, 402559, 389381, 376684, 364204, 352659, 342581, 333540, 325054, 317490, 311333, 306134, 301013, 295876, 291338, 287694, 284708, 282232, 280267, 278437, 276185, 273608, 271522, 270444, 270022, 269673, 269314, 269122, 268878, 268008, 266241, 264017, 262117, 260965, 260305, 259541, 258371, 256968, 255546, 253927, 251721, 248875, 245831, 243068, 240667, 238397, 236166, 234171, 232518, 230844, 228621, 225959, 223830, 223254, 224327, 226226, 228046, 229320, 229884, 229705, 229003, 228278, 228006, 228316, 228974]
63762B28974O09L07J43L35M95J04n95o96J00R49J046P26P45J020R11M76M81J204
63744B37334J957K041J594J296J592K372L129L429L307L149L085K816K227J775
63730B71103J878K360K855L370L943M240M122M166M909N929O506O791P391Q071
63716C37634P898O664N029L263R16j901m073m831m767m916n416n671n398m888
63702C19543m445m017l382k467j530r76p71k65J010K513L239L009K614K644K892
63687C19611L051L241L567L709L331K540J618P02j5k45K3L95N74O60Q26J040J289
63670C45917J744K549L630M752N474N244L979K473J633J363Q66o4q85j505k629
63655C74541m506o222o865o705o554o528o143n284m326l475k551j447l92K88M23
$$ y = [228974, 229583, 229890, 230033, 230368, 230863, 230967, 230372, 229676, 229776, 230725, 231771, 232497, 233242, 234262, 235173, 235649, 236130, 237334, 239291, 241332, 242926, 244222, 245814, 248186, 251315, 254744, 258051, 261200, 264285, 267101, 269328, 271103, 272981, 275341, 278196, 281566, 285509, 289749, 293871, 298037, 302946, 308875, 315381, 322172, 329563, 337634, 345532, 352196, 357225, 360488, 361404, 359503, 355430, 350599, 345832, 340916, 335500, 329829, 324431, 319543, 315098, 311081, 307699, 305232, 303702, 302726, 301955, 301690, 302700, 305213, 308452, 311461, 314075, 316719, 319611, 322662, 325903, 329470, 333179, 336510, 339050, 340668, 341370, 341355, 341110, 341133, 341528, 342102, 342762, 343588, 344628, 345917, 347661, 350210, 353840, 358592, 364066, 369310, 373289, 375762, 377395, 378758, 379624, 379560, 378675, 377170, 374541, 370035, 363813, 356948, 350243, 343689, 337161, 331018, 325734, 321408, 317933, 315382, 313935, 313543, 313831, 314254]
63640C14254J11j90R0J076K293L234L911M637N530O404P070P523P856Q130Q224
63625C80153P985P595P613Q369R475J0382J1223J2555J4408J6210J7644J8945
63613E22557K0337K1859K3908K7067L1143L4973L7675L9460M0920M2027M2188
63602H84114M0754L7051L0615K1945J2666M395k279p456j1072j2969j3437j3110
63590I71217j2527j2162j2645j4531j7850k2080k6340k9603l1218l1506l1407
63579G29348l1211l0116k7416k3665k0070j7117j4361j1477q857o996n643l854
63567E28565r70K453M987N790N595N820O962Q456R827J1140J2272J2797J2939
63554F26633J3717J5701J8387K1247K4625K9029L4288M0006M6129N2343N7642
$$ y = [314254, 314365, 314175, 314265, 315341, 317634, 320868, 324779, 329416, 334946, 341350, 348420, 355943, 363799, 371929, 380153, 388138, 395733, 403346, 411715, 421190, 431572, 442795, 455350, 469758, 485968, 503612, 522557, 542894, 564753, 588661, 615728, 646871, 681844, 719519, 758979, 799899, 841926, 884114, 924868, 961919, 992534, 1014479, 1027145, 1031540, 1029261, 1021805, 1010733, 997764, 984327, 971217, 958690, 946528, 933883, 919352, 901502, 879422, 853082, 823479, 792261, 760755, 729348, 698137, 668021, 640605, 616940, 596870, 579753, 565392, 553915, 545058, 538062, 532419, 528565, 527595, 530048, 535035, 540825, 546420, 552240, 559202, 567658, 577485, 588625, 600897, 613694, 626633, 640350, 656051, 674438, 695685, 720310, 749339, 783627, 823633, 869762, 922105, 979747]
63543I79747O1209O2852O1646N5048M1077K1458J394j4167k3450k7385k7499k4844
63531A167086k0287j5080j0855q924r501j1799j5134j9606k5431l2050l8311m3237
63519I16871m6160m6619m4812m1835l8858l6210l3704l1345k9060k6191k2242
63508E19835j7948j4690j2884j1787j0796r982r305q315o979n982n732n724n315
63495C94396m593l963l359k404j165k50j18n54q41m07O96J865K543K720K819L289
63479C90674M364N930P406Q052P656O765N917M969L626K193J140J82j408l474
63465D43992m870m955m521m679n366n553m758l639l040k974k885k531k115j643
63451C90463p32P53K306L460M480N843P294Q150Q463R104J0544J2317J4010J6041
$$ y = [979747, 1040956, 1103808, 1165454, 1220502, 1261579, 1283037, 1284431, 1270264, 1246814, 1219429, 1191930, 1167086, 1146799, 1131719, 1120864, 1111940, 1102439, 1090640, 1075506, 1055900, 1030469, 998419, 960108, 916871, 870711, 824092, 779280, 737445, 698587, 662377, 628673, 597328, 568268, 542077, 519835, 501887, 487197, 474313, 462526, 451730, 441748, 432443, 424128, 417149, 411167, 405435, 399711, 394396, 389803, 385840, 382481, 380077, 378912, 378662, 378544, 377990, 377149, 376742, 377438, 379303, 381846, 384566, 387385, 390674, 395038, 400968, 408374, 416426, 424082, 430847, 436764, 441733, 445359, 447552, 448692, 448874, 447466, 443992, 439122, 434167, 429646, 424967, 419601, 414048, 409290, 405651, 402611, 399637, 396752, 394221, 392106, 390463, 389731, 390484, 392790, 396250, 400730, 406573, 413867, 422017, 430480, 439584, 450128, 462445, 476455, 492496]
63437D92496J9044K2975K7389L2080L7038M2055M6619M9654M9142M3045L1496
63426H93033J7670N680k170n794n882l121J634P616J4624K2625L0939L8523M4845
63413A060222M9675N2213N1262M6400L8342K8165J6775N222n196j3334j8509k0603
63401A290634k0258j8821j7568j7096j7769k0197k4606l0100l5369l9964m4067
63390A004819m7275m8532m7308m4082l9741l5171l1297k8562k6345k3595k0200
63379F12711j6963j4323j1875r162o220l193j95K413M325N923P930J0390J2715
63366E94476J4634J6357J7962J9527K1794K5586L0444L4901L8271M1133M4007
63355H99092M6678M9106N1633N3727N3657N0156M3548L4730K4143J2528J620o997
$$ y = [492496, 511540, 534515, 561904, 593984, 631022, 673077, 719696, 769350, 818492, 861537, 893033, 910703, 916383, 914213, 908419, 902537, 899416, 901050, 908666, 923290, 945915, 976854, 1015377, 1060222, 1109897, 1162110, 1213372, 1259772, 1298114, 1326279, 1343054, 1348276, 1343080, 1329746, 1311237, 1290634, 1270376, 1251555, 1233987, 1216891, 1199122, 1178925, 1154319, 1124219, 1088850, 1048886, 1004819, 957544, 909012, 861704, 817622, 777881, 742710, 711413, 682851, 656506, 632911, 612711, 595748, 581425, 569550, 560388, 554168, 550975, 550780, 553193, 557518, 563441, 571371, 581761, 594476, 609110, 625467, 643429, 662956, 684750, 710336, 740780, 775681, 813952, 855085, 899092, 945770, 994876, 1046509, 1100236, 1153893, 1204049, 1247597, 1282327, 1306470, 1318998, 1320618, 1313621]
63343A313621j3113j7261j9525j9822j8755j7371j6444j6647j8774k2980k8222
63332A104707l3210l7507m1088m3412m3804m2411l9951l6738l2631k7640k1984
63321G04331j5912r971m987j119K248M694L551l679j5612k7006l3176l3593l0957
63308E38812k7782k4698k1332j7684j4396j2093j0738r639q143o292m721l944
63296C77350l860l957l779l268k766k653k915l148l047k746k523k478k641l071
63282C34498l598l708l104k182j529j182p49j39K93L46K52K08Q1k21l79L1R55
63265C19873J833K213K147J975J865J812J976K590L445L864L572L194L452M089
63251C57900M293M029M165N165O398P120P457P985Q812R652J0485J1576J2947
$$ y = [1313621, 1300508, 1283247, 1263722, 1243900, 1225145, 1207774, 1191330, 1174683, 1155909, 1132929, 1104707, 1071497, 1033990, 992902, 949490, 905686, 863275, 823324, 786586, 753955, 726315, 704331, 688419, 678448, 673461, 672342, 674590, 679284, 682835, 679156, 663544, 636538, 603362, 569769, 538812, 511030, 486332, 465000, 447316, 432920, 420827, 410089, 400450, 392307, 386015, 381294, 377350, 373490, 369533, 365754, 362486, 359720, 357067, 354152, 351004, 347957, 345211, 342688, 340210, 337569, 334498, 330900, 327192, 324088, 321906, 320377, 319195, 318446, 318307, 318600, 318946, 319198, 319406, 319487, 319266, 318887, 318918, 319873, 321706, 323919, 326066, 328041, 329906, 331718, 333694, 336284, 339729, 343593, 347165, 350359, 353811, 357900, 362193, 366222, 370387, 375552, 381950, 389070, 396527, 404512, 413324, 422976, 433461, 445037, 457984]
63238D57984J4280J5326J6194J7239J8787K0750K2517K3439K3549K3492K3625
63227F77182K3610K3102K2398K2077K2297K2746K3062K3098K2984K3107K3725
63216I29388K4435K4449K3482K1899J9816J6660J2053O524P96n159j1717j8545
63204A044081k4639k9289l2482l4459l5372l5364l4529l2787l0067k6596k2785
63193G05712j8925j5163j1609q224m893j732R15L097N413Q232J1090J3304J4872
63180G02089J6309J7788J8899J9189J8594J7479J6502J6152J6220J5922J4858
63169H90001J3413J1999J0344Q051N370K720j93m051q850j3829j8383k2441k5959
63156H48192k8665l0411l1314l1438l0691k9087k6878k4415k2089k0208j8633
$$ y = [457984, 472264, 487590, 503784, 521023, 539810, 560560, 583077, 606516, 630065, 653557, 677182, 700792, 723894, 746292, 768369, 790666, 813412, 836474, 859572, 882556, 905663, 929388, 953823, 978272, 1001754, 1023653, 1043469, 1060129, 1072182, 1078706, 1079502, 1074343, 1062626, 1044081, 1019442, 990153, 957671, 923212, 887840, 852476, 817947, 785160, 755093, 728497, 705712, 686787, 671624, 660015, 651791, 646898, 645166, 646081, 649178, 654591, 662823, 673913, 687217, 702089, 718398, 736186, 755085, 774274, 792868, 810347, 826849, 843001, 859221, 875143, 890001, 903414, 915413, 925757, 933808, 939178, 941898, 941705, 937654, 928804, 914975, 896592, 874151, 848192, 819527, 789116, 757802, 726364, 695673, 666586, 639708, 615293, 593204, 572996, 554363]
63145E54363j6842j4622j2480j0969r933q863p632o361m908l206j901j775k539
63132D52332k962k314j023J38Q73J182J057P19P10J343K285K883K788K231J897
63117D64139K407L615M597M682M295M296M686M686M047L458L439L500K906J808
63103E16561J131J527K628L341K861J498M10K91O32P14Q49J828L275L672K333
63088E43551M72l33n8O2o65j580j610n10Q51J308O00k01K22J887L484M044M077
63071E55601M671O032P451Q404R078R949J1329J3242J5361J7138J8399J9732K1889
63058G18276K4878K8026L0891L3700L6835M0334M4020M7761N1367N4536N7015
63047A167639N8720N9639N9862N9741N9628N9313N8174N6226N4645N4599N5768
$$ y = [554363, 537521, 522899, 510419, 499450, 489517, 480654, 473022, 466661, 461753, 458547, 456646, 454871, 452332, 449370, 447056, 446033, 446171, 447044, 448226, 449283, 450002, 450712, 452055, 454340, 457223, 460011, 462242, 464139, 466546, 470161, 474758, 479440, 483735, 488031, 492717, 497403, 501450, 504908, 508347, 511847, 514753, 516561, 517692, 519219, 521847, 525188, 528049, 529547, 529957, 530248, 530880, 531594, 532443, 534271, 537546, 541218, 543551, 544023, 543690, 543632, 543694, 543029, 541449, 539839, 539329, 540180, 541488, 542088, 541887, 542109, 543996, 547480, 551524, 555601, 560272, 566304, 573755, 582159, 591237, 601186, 612515, 625757, 641118, 658256, 676655, 696387, 718276, 743154, 771180, 802071, 835771, 872606, 912940, 956960, 1004721, 1056088, 1110624, 1167639, 1226359, 1285998, 1345860, 1405601, 1465229, 1524542, 1582716, 1638942, 1693587, 1748186, 1803954]
63036A803954N6649N6359N5479N4836N4071N2002M7983M2258L5031K5911J4461
63025B298994R64j3590k8036m1533n3785o4767p4105q0827q4114q4210q2108p8392
63013A614491p3057o6450n9543n2856m5822l7861k9524k1835j4892p949p54N983
63001A209931J1590J6245K0450K4152K6689K7537K6992K6141K6064K6941K8022
62990A470754K8571K8550K8216K7452K5997K4039K1877J9060J4510P749m77r052
62978A687246j7568k6235l4930m2792m8865n3057n6183n8985o1156o1559n9471
62967A166445n5382n0553m6068m2412l9517l6857l3772l0144k6671k4203k2897
62956G57969k2190k1348j9887j7783j5648j4365j4183j4419j4328j3930j3601
$$ y = [1803954, 1860603, 1916962, 1972441, 2027277, 2081348, 2133350, 2181333, 2223591, 2258622, 2284533, 2298994, 2299958, 2286368, 2258332, 2216799, 2163014, 2098247, 2024142, 1943315, 1859201, 1774991, 1692883, 1614491, 1541434, 1474984, 1415441, 1362585, 1316763, 1278902, 1249378, 1227543, 1212651, 1204702, 1203948, 1209931, 1221521, 1237766, 1258216, 1282368, 1309057, 1336594, 1363586, 1389727, 1415791, 1442732, 1470754, 1499325, 1527875, 1556091, 1583543, 1609540, 1633579, 1655456, 1674516, 1689026, 1696775, 1696298, 1687246, 1669678, 1643443, 1608513, 1565721, 1516856, 1463799, 1407616, 1348631, 1287475, 1225916, 1166445, 1111063, 1060510, 1014442, 972030, 932513, 895656, 861884, 831740, 805069, 780866, 757969, 735779, 714431, 694544, 676761, 661113, 646748, 632565, 618146, 603818, 589888, 576287]
62945E76287j3310j2822j2285j1929j1545j0848j0112r658r059p699o044n265
62933D55711n600n993n615m780m079l443k631j909j670j779j836j704j404r18
62919D12350m71n88j423k274k314j592q99p77j031j215j187j171j372j727j957
62904C92352j939j842j825j723j305o88k19K2K13M32O93J154J824K170J626N05
62888C91450k57l32l06n41n27J83J089J375R82N09L03J78q3m02n19k19M55J053
62870C94391J084O09K30K43K79q5p28j342j857k131j682l30J183J891J750J511
62854C95016J551J513J153Q61J072J613J999K041J845J449Q42K78J96P29J450
62839D13608J779J495Q11N0o07j017j008n36J82P90J054R18M94R0J02O68J496
$$ y = [576287, 562977, 550155, 537870, 525941, 514396, 503548, 493436, 483778, 474719, 467020, 460976, 455711, 450111, 444118, 438503, 433723, 429644, 426201, 423570, 421661, 419991, 418212, 416376, 414672, 413268, 412350, 411879, 411291, 409868, 407594, 405280, 403688, 402789, 402012, 400981, 399766, 398579, 397408, 396036, 394309, 392352, 390413, 388571, 386746, 385023, 383718, 383030, 382811, 382833, 383046, 383478, 384171, 385325, 387149, 389319, 390945, 391450, 391193, 390861, 390555, 390014, 389487, 389670, 390759, 392134, 393116, 393625, 393928, 394106, 394023, 393621, 393102, 392883, 393338, 394391, 395475, 396084, 396314, 396557, 396836, 396751, 396023, 394681, 392824, 390693, 389011, 388681, 389864, 391755, 393505, 395016, 396567, 398080, 399233, 400094, 401166, 402779, 404778, 406819, 408664, 410113, 410955, 411233, 411429, 412158, 413608, 415387, 416882, 417693, 417743, 417136, 416119, 415111, 414575, 414757, 415547, 416601, 417519, 418013, 418103, 418205, 418873, 420369]
62822D20369K185K634K970L249L397L400L270K951K517K349K790L621M177M065
62808D63944L596L411L845M654N352N779O315P357Q689R736J0483J1575J3256
62795E57992J4832J5619J5898J6313J6926J7594J8928K1777K5952L0384L4613
62784G86828L9220M4708N0823N7213O3894P0734P7247Q3235Q9015R4636R9364
62773A556917J02288J02874J00741R5512Q7304P6793O4428N0067L3681J6005j907
62762B284703j9327l5808n0881o4084p4970q3036q8107r0889r2459r3094r2208
62751A499840q9621q6017q1858p6732p0418o3811n8059n3286m8818m4290l9951
62740G86979l6151l3041l0465k7801k4360k0265j6508j3759j1724r967q650p922
$$ y = [420369, 422554, 425188, 428158, 431407, 434804, 438204, 441474, 444425, 446942, 449291, 452081, 455702, 459879, 463944, 467540, 470951, 474796, 479450, 484802, 490581, 496896, 504253, 512942, 522678, 533161, 544736, 557992, 572824, 588443, 604341, 620654, 637580, 655174, 674102, 695879, 721831, 752215, 786828, 826048, 870756, 921579, 978792, 1042686, 1113420, 1190667, 1273902, 1362917, 1457553, 1556917, 1659205, 1762079, 1862820, 1958332, 2045636, 2122429, 2186857, 2236924, 2270605, 2286610, 2284703, 2265376, 2229568, 2178687, 2114603, 2039633, 1956597, 1868490, 1777601, 1685142, 1592048, 1499840, 1410219, 1324202, 1242344, 1165612, 1095194, 1031383, 973324, 920038, 871220, 826930, 786979, 750828, 717787, 687322, 659521, 635161, 614896, 598388, 584629, 572905, 562938, 554288, 546366]
62728E46366p278o322n492n286n244m515l088j640m86N76J653K688L765M905N849
62713E26451O645Q002J0362J3062J5156J6726J8575K0985K3620K6369K9424L2765
62701G48142L6415M0848M6262N1706N6001N9253O2393O5427O7409O8113O8296
62690A370265O7959O5708O0387N2403M2823L2042K0038P122o176j9462l2162m3410
62678A617537n2726o0263o6011o9370p0117o9143o7647o5947o3640o0456n6423
62667I15794n1645m6580m2107l8642l5418l1458k7075k3600k1607k0193j8268
62656E59201j5857j3718j2172j0896r743r085r160r455r157q096o878n978n185
62643D33821m175l255k971l151k971k014o91N05J588K618L223L052K351J607Q73
$$ y = [546366, 539088, 532766, 527274, 521988, 516744, 512229, 509141, 507501, 507015, 507591, 509244, 511932, 515697, 520602, 526451, 533096, 541098, 551460, 564522, 579678, 596404, 614979, 635964, 659584, 685953, 715377, 748142, 784557, 825405, 871667, 923373, 979374, 1038627, 1101020, 1166447, 1233856, 1301969, 1370265, 1438224, 1503932, 1564319, 1616722, 1659545, 1691587, 1711625, 1718747, 1712571, 1693109, 1660947, 1617537, 1564811, 1504548, 1438537, 1369167, 1299050, 1229907, 1162260, 1096313, 1032673, 972217, 915794, 864149, 817569, 775462, 736820, 701402, 669944, 642869, 619269, 597662, 577469, 559201, 543344, 529626, 517454, 506558, 496815, 487730, 478570, 469115, 459958, 451862, 444984, 439006, 433821, 429646, 426391, 423420, 420269, 417298, 415284, 414593, 415098, 416686, 419304, 422527, 425579, 427930, 429537, 430410]
62628D30410n7j048j748k161k522k620j925n07P79J354J601K066K534K569K557
62613D31282L288M568N249M908M618N487P198Q743R991J1496J3124J4090J4459
62600E38501J5473J7949K1289K4568K7783L1360L5077L8390M1391M4521M7479
62589H83781M9193M9044M7445M5096M2065L7692L1174K2241J1643R08q673j6885
62577A194724k4189l0749l6242m0485m3687m5981m7131m6899m5379m2846l9602
62566G51534l6079l2839l0217k8049k5892k3470k0865j8322j5991j3845j1844
62555D94121j0082q645p410o227n265m869m989n072m707m033l362k694j849q49
62541D24068R4Q11J197J245J187J335J636J736J552J344J102M95k37j07J372L354
$$ y = [430410, 430353, 429305, 427557, 425396, 422874, 420254, 418329, 417822, 418601, 419955, 421556, 423622, 426156, 428725, 431282, 434570, 439138, 444387, 449295, 453913, 459400, 466598, 475341, 485332, 496828, 509952, 524042, 538501, 553974, 571923, 593212, 617780, 645563, 676923, 712000, 750390, 791781, 836302, 883781, 932974, 982018, 1029463, 1074559, 1116624, 1154316, 1185490, 1207731, 1219374, 1220282, 1211609, 1194724, 1170535, 1139786, 1103544, 1063059, 1019372, 973391, 926260, 879361, 833982, 791136, 751534, 715455, 682616, 652399, 624350, 598458, 574988, 554123, 535801, 519810, 505965, 494121, 484039, 475394, 467984, 461757, 456492, 451623, 446634, 441562, 436855, 432822, 429460, 426766, 424917, 424068, 424162, 424973, 426170, 427415, 428602, 429937, 431573, 433309, 434861, 436205, 437307, 437802, 437565, 437458, 438830, 442184]
62525D42184M751N647O853Q563J0344J2216J4672J7642K0343K2362K4231K6654
62513F16462K9737L3140L6503L9483M1672M2705M2328M0530L7705L4447L0849
62502A025561K6338K0533J3914P217O06n944j1899j6576j9919k2093k2660k1068
62490I74010j7722j3578q909l462K303P326J1430J5549K0253K5091K9673L4262
62478A076226L8845M2661M5145M6350M5858M2225L4519K3831J2580K637n531j2669
62466A392677k0327k9926m1185n1726n8985o2402o3303o3037o1895n9611n6168
62455H24112n1954m7478m3009l8392l3409k8353k3889k0247j7033j4022j1514
62444D94812r664q049o393n122m615m381l654k437j312n39M0L56R0p33j653k314
$$ y = [442184, 446935, 452582, 459435, 467998, 478342, 490558, 505230, 522872, 543215, 565577, 589808, 616462, 646199, 679339, 715842, 755325, 796997, 839702, 882030, 922560, 960265, 994712, 1025561, 1051899, 1072432, 1086346, 1093563, 1094169, 1088225, 1076326, 1059750, 1039831, 1017738, 995078, 974010, 956288, 942710, 933801, 930339, 932642, 939968, 951398, 966947, 987200, 1012291, 1041964, 1076226, 1115071, 1157732, 1202877, 1249227, 1295085, 1337310, 1371829, 1395660, 1408240, 1410877, 1405346, 1392677, 1372350, 1342424, 1301239, 1249513, 1190528, 1128126, 1064823, 1001786, 939891, 880280, 824112, 772158, 724680, 681671, 643279, 609870, 581517, 557628, 537381, 520348, 506326, 494812, 485148, 477099, 470706, 465584, 460969, 456588, 452934, 450497, 449185, 448646, 448686, 449042, 449132, 448399, 446746, 444432]
62428D44432k719k988l195l362l359k961k249j732j813k332k868l243l425l301
62414D04885k872k387j929j254m75l44j310k636l186k818k298k039j705j097n31
62399C78004k38m0J46J10l5L86J754L481M584M667L997K880J515M10M10J927M271
62382D08229O052O420N812N386N824O890Q017Q900R406R447R347R993J1949J4520
62368E26192J6264J6620J6564J7444J9534K2130K4765K7820L1903L7059M2902
62357G99197M9192N5889O2639O8627P3137P6037P7402P6805P3328O6328N6033
62346A534614M3387K9619J5923L213q051j7774k5969l2811l8883m4931n1075n6442
62334A350820n9861o0879n9955n7770n4662n0784m6501m2355l8521l4712l0783
$$ y = [444432, 441713, 438725, 435530, 432168, 428809, 425848, 423599, 421867, 420054, 417722, 414854, 411611, 408186, 404885, 402013, 399626, 397697, 396443, 395968, 395624, 394314, 391678, 388492, 385674, 383376, 381337, 379632, 378535, 378004, 377766, 377726, 377872, 377982, 377947, 378333, 380087, 383568, 388152, 392819, 396816, 399696, 401211, 401621, 402031, 403958, 408229, 414281, 420701, 426513, 431899, 437723, 444613, 452630, 461530, 470936, 480383, 489730, 499723, 511672, 526192, 542456, 559076, 575640, 593084, 612618, 634748, 659513, 687333, 719236, 756295, 799197, 848389, 904278, 966917, 1035544, 1108681, 1184718, 1262120, 1338925, 1412253, 1478581, 1534614, 1578001, 1607620, 1623543, 1626756, 1618705, 1600931, 1574962, 1542151, 1503268, 1458337, 1407262, 1350820, 1290959, 1230080, 1170125, 1112355, 1057693, 1006909, 960408, 918053, 879532, 844820, 814037]
62323H14037k7234k4688k2983k1377j9706j8650j8555j8687j8268j7602j7319
62312E88968j7040j5805j3693j1851j0866j0111q943p544o217m768l127j785j025
62299D76193m37K63N90J75l80l04J98M14L73P29J595K341K565K536K599K791L123
62282D95364L669M251M476M291M063M016L957L784L878M630N761O485O494O544
62268E61663P750J0299J3147J5215J6659J8564K1588K5425K9621L4250L9558M5477
62256H39216N1782N8386O5092P1328P6405P9733Q0585P8161P2182O3160N1767
62245A587797L8389K3622Q810m547j5701k4776l2299l9052m5833n2745n8854o3084
62233A321727o5276o5860o4800o1572n6263m9978m3873l8202l2536k6764k1531
$$ y = [814037, 786803, 762115, 739132, 717755, 698049, 679399, 660844, 642157, 623889, 606287, 588968, 571928, 556123, 542430, 530579, 519713, 509602, 500659, 493115, 486898, 482130, 479003, 477218, 476193, 475756, 476019, 476609, 476784, 476404, 476100, 476298, 476712, 477085, 477814, 479409, 481750, 484315, 486851, 489450, 492241, 495364, 499033, 503284, 507760, 512051, 516114, 520130, 524087, 527871, 531749, 536379, 542140, 548625, 555119, 561663, 569413, 579712, 592859, 608074, 624733, 643297, 664885, 690310, 719931, 754181, 793739, 839216, 890998, 949384, 1014476, 1085804, 1162209, 1241942, 1322527, 1400688, 1472870, 1536030, 1587797, 1626186, 1649808, 1658618, 1654071, 1638370, 1613594, 1581295, 1542243, 1496410, 1443665, 1384811, 1321727, 1256451, 1190591, 1125791, 1064219, 1007956, 957978, 914105, 875903, 843367, 816603, 795072]
62222G95072j7664j5247j3485j1622r865q974r066r360r262r072r366j0167j1145
62209F50777j2126j2928j3132j2570j1696j1019j0439r620q626p638o435m764
62197E29784k960j546l94R97K628M088N364O837Q439R581J0017J0160J0392J0625
62183F04012J0712J0817J1132J1578J1929J1960J1392J0031Q110O309N318N529
62171G18829O977R407J2505J6292K1110K7017L3481L9968M6417N2665N7790O0640
62159A103098O0785N8356N3221M5211L5063K4304J3977M173n074j3230j9941k5658
62147A334285l1141l6612m1737m6079m9232n0788n0542m8683m5688m2076l8275
62136H53432l4490l0624k6488k2098j7669j3469r817p053n171l645j935j9J879
$$ y = [795072, 777408, 762161, 748676, 737054, 727189, 718215, 709149, 699789, 690527, 681455, 672089, 661922, 650777, 638651, 625723, 612591, 600021, 588325, 577306, 566867, 557247, 548621, 540983, 534548, 529784, 526824, 525278, 524884, 525881, 528509, 532597, 537961, 544798, 553237, 562818, 572835, 582995, 593387, 604012, 614724, 625541, 636673, 648251, 660180, 672140, 683532, 693563, 701673, 707982, 713300, 718829, 725806, 735213, 747718, 764010, 785120, 812137, 845618, 885586, 932003, 984668, 1042458, 1103098, 1163883, 1222239, 1275460, 1320671, 1355734, 1380038, 1394015, 1398188, 1393114, 1379884, 1359943, 1334285, 1303144, 1266532, 1224795, 1178716, 1129484, 1078696, 1028154, 979471, 933783, 891707, 853432, 818942, 788318, 761830, 739732, 722063, 708594, 698777, 691724, 686553, 682908, 680973, 680954, 682833]
62123F82833L886O305R016J1513J3489J4905J5664J5726J5364J4710J3168J0075
62111H26654N998K573P10l06j523k814l312k970k960m388p070r636j0757j0102
62097G80097q193n575k372J234M529O740P856Q558R373J0213J0725J0746J0326
62084H44257R710R298R438J0189J1433J3109J5135J7243J9152K0752K1884K2361
62072A023961K2481K3037K4250K5132K4770K3839K3975K5744K8252L0697L3173
62061A309311L5725L7690L8443L7948L5973L1633K4422J5286O009k133q815j4291
62049A547201j9204k4344k9974l5529m0351m4447m8186n1542n4117n5598n5855
62038A088054n4761n2386m9165m5594m1859l8033l4336l0862k7359k3696k0333
$$ y = [682833, 686719, 693024, 702040, 713553, 727042, 741947, 757611, 773337, 788701, 803411, 816579, 826654, 832652, 835225, 835935, 835629, 834106, 831292, 827980, 825010, 822050, 817662, 810592, 800956, 790199, 780097, 771904, 766329, 763957, 765191, 769720, 776460, 784316, 792874, 802247, 812460, 823185, 833931, 844257, 853967, 863265, 872703, 882892, 894325, 907434, 922569, 939812, 958964, 979716, 1001600, 1023961, 1046442, 1069479, 1093729, 1118861, 1143631, 1167470, 1191445, 1217189, 1245441, 1276138, 1309311, 1345036, 1382726, 1421169, 1459117, 1495090, 1526723, 1551145, 1566431, 1572440, 1570307, 1561492, 1547201, 1527997, 1503653, 1473679, 1438150, 1397799, 1353352, 1305166, 1253624, 1199507, 1143909, 1088054, 1033293, 980907, 931742, 886148, 844289, 806256, 771920, 741058, 713699, 690003, 669670]
62027F69670j7776j5813j3751j1427r488q503q266q180q042q116q494q717q289
62014E34808p389o728o584o314n172l377j820q15K83K058M247O216P806R227J0401
61999E36847J0908J0512R493Q405P640P121O340M826K677N09j218k606m067n824
61985E91563p835r912j1726j2855j3064j2466j1341r888q251o649n349m555m302
61972D73370m381m408m192l900l718l448k777j917j499j752k177k223j857j262
61958D33859l77Q64K087K746K849K983L563M301M652M672N145O679Q865J0635
61944D93523J1510J2149J3438J5437J7536J9386K1140K2839K4090K4552K4404
61933G00004K4166K4144K4109K3431K1657J9117J6759J5103J3542J0980P009K182
$$ y = [669670, 651894, 636081, 622330, 610903, 601415, 592912, 584646, 576466, 568424, 560308, 551814, 543097, 534808, 527419, 520691, 514107, 507793, 502621, 499244, 497424, 496609, 496892, 498950, 503197, 509413, 517219, 526446, 536847, 547755, 558267, 567760, 576165, 583805, 590926, 597266, 602092, 604769, 605278, 604060, 601454, 597387, 591563, 583728, 573816, 562090, 549235, 536171, 523705, 512364, 502476, 494225, 487576, 482227, 477672, 473370, 468989, 464581, 460389, 456489, 452771, 449323, 446546, 444629, 443130, 441378, 439201, 436978, 435121, 433859, 433482, 434346, 436433, 439179, 442028, 445011, 448574, 452875, 457527, 462199, 467344, 474023, 482888, 493523, 505033, 517182, 530620, 546057, 563593, 582979, 604119, 626958, 651048, 675600, 700004, 724170, 748314, 772423, 795854, 817511, 836628, 853387, 868490, 882032, 893012, 900021, 902203]
61921I02203k670o883j0020j2040j3422j4613j5287j4647j2436r170n342r65L940
61908G88648Q907J3320J6868J9634K1771K3153K3092K0851J6656J1864P550L289
61896I75603j922p877j3212j7156k0103k2332k3334k2856k1692k0704j9759j8258
61884G66398j6325j4787j4206j4383j4676j4509j3772j2874j2256j1827j1201
61873F15582j0314r363q199o498m524k922j642R8K478M554N580O057O900Q190
61859F05977R427J0567J2109J4427J7454K0844K4063K6684K8930L1579L4981L8466
61847H75508M1040M2342M2589M2034M0744L8601L5183K9994K3069J5060O653j676
61835A231141r291j5463j9998k3159k4784k4193k1242j6651j1012m326L033R868
$$ y = [902203, 899533, 892650, 882630, 870590, 857168, 842555, 827268, 812621, 800185, 791015, 785673, 784708, 788648, 797555, 810875, 827743, 847377, 869148, 892301, 915393, 936244, 952900, 964764, 972314, 975603, 973681, 965804, 952592, 935436, 915333, 893001, 869667, 846811, 825119, 804415, 784656, 766398, 750073, 735286, 721080, 706697, 692021, 677512, 663740, 650866, 638610, 626783, 615582, 605268, 595905, 587706, 581208, 576684, 573762, 572120, 572218, 574696, 579250, 584830, 590887, 597787, 605977, 615404, 625971, 638080, 652507, 669961, 690805, 714868, 741552, 770482, 802061, 837042, 875508, 916548, 958890, 1001479, 1043513, 1084257, 1122858, 1158041, 1188035, 1211104, 1226164, 1232817, 1231141, 1221850, 1206387, 1186389, 1163230, 1138446, 1114253, 1093011, 1076360, 1065348, 1061022, 1064055, 1073923]
61823A073923J5286J9459K2528K3647K2000J8002J2573N860k268j1095j9547k7379
61811A152989l4739m0872m4576m5895m6197m6329m5675m3341l9483l5121l1163
61800F99598k7943k5277k2715j9989j7326j5145j3524j2183j0898r661q607p898
61788E08432p520p022n894m312l101k644k467k209k245k790l170k714j826j324
61774D59194j223r92n44j19L57Q91Q67o9j004p39N30J616K161K688L114K688J614
61757D71030J222J952K550J991J102J260K237K474J159q22k020j944j323j176
61743D79692j763k472k694k533k379k179j649r89p15q04p38l68n8Q4M20J033J446
61726D63334J400J281J517K058K761L667M616N071M736L911K964J903P93Q8Q8
$$ y = [1073923, 1089209, 1108668, 1131196, 1154843, 1176843, 1194845, 1207418, 1213278, 1211010, 1199915, 1180368, 1152989, 1118250, 1077378, 1032802, 986907, 940710, 894381, 848706, 805365, 765882, 730761, 699598, 671655, 646378, 623663, 603674, 586348, 571203, 557679, 545496, 534598, 524937, 516330, 508432, 500912, 493890, 487996, 483684, 480583, 477939, 475472, 473263, 471018, 468228, 465058, 462344, 460518, 459194, 457971, 456979, 456435, 456316, 456673, 457564, 458431, 458362, 457358, 456619, 457149, 458765, 460926, 463614, 466728, 469416, 471030, 472252, 474204, 476754, 478745, 479847, 481107, 483344, 485818, 486977, 486155, 484135, 482191, 480868, 479692, 477929, 475457, 472763, 470230, 467851, 465672, 464023, 463034, 462319, 461515, 460777, 460409, 460351, 460435, 460855, 461888, 463334, 464734, 466015, 467532, 469590, 472351, 476018, 480634, 485705, 490441, 494352, 497316, 499219, 500012, 500100, 500188]
61711E00188L41J58n50j314j818k173k555k962l331l658l898l920l618l082k612
61696D65196k508k768l024k883k299j580j089j027j293j531j453j267j443k013
61682D39018k443k374k135k131k175j880j386j199j472j891k090j823j008k9L67
61667D15349j35r43j367j457j551j506j060n49m07l29K04Q73R73O87Q27J418J646
61650D12673J251R16J130J658K326L197L872L680K946K933M033N066M939M037
61636D54657L186K278Q05r63k290l017l452l662l592l522l653l630l159k697k768
61621D24521l016k768k231k124k277j693j79J041Q17n30j818k537l123m029n122
61606C94932o061o737p165p226o836o196n648n263m847m297l696l064k393j989
$$ y = [500188, 500529, 500687, 500137, 498823, 497005, 494832, 492277, 489315, 485984, 482326, 478428, 474508, 470890, 467808, 465196, 462688, 459920, 456896, 454013, 451714, 450134, 449045, 448018, 446725, 445194, 443741, 442474, 441031, 439018, 436575, 434201, 432066, 429935, 427760, 425880, 424494, 423295, 421823, 419932, 417842, 416019, 415011, 414982, 415349, 415214, 414271, 412904, 411447, 409896, 408390, 407330, 406781, 406374, 406045, 406249, 407122, 408095, 408782, 409609, 411027, 412673, 413924, 414840, 415970, 417628, 419954, 423151, 427023, 430703, 433649, 436582, 440615, 445681, 450620, 454657, 457843, 460121, 460926, 459963, 457673, 454656, 451204, 447542, 443950, 440428, 436775, 433145, 429986, 427289, 424521, 421505, 418737, 416506, 414382, 412105, 410412, 410233, 411274, 412091, 411561, 409743, 407206, 404083, 400054, 394932, 388871, 382134, 374969, 367743, 360907, 354711, 349063, 343800, 338953, 334656, 330960, 327896, 325503, 323514]
61592C23514k288l050l330k658j802j749k288k440k001j732k018k260j921j320
61578B92657r68q04n95n69j063j846k271k013j281n11k3J23J30J52Nm97r94q49
61560B78783o8N77N74K91L14O91J208J896K702L074K504J318M07J63K18J67J07
61543B94926L02O65Q46O94M35L93O66J117J626K129K434K222J484P03M17O82J148
61526C12889J479J369N09r88k293k561j949j440j574j881j696j065o28q33j462
61511B97876j761j131J58J056Q88K15R7O59J061P44M8m91p34p13m34j80l60q47
61493B96151r62m39J31J94K9K56Q37J032K80j087j964j405L82K055K529K080J696
61476C01795J685J691J714K141K696K508J511P16O80O82Or00j284j300j438j463
$$ y = [323514, 321226, 318176, 314846, 312188, 310386, 308637, 306349, 303909, 301908, 300176, 298158, 295898, 293977, 292657, 291689, 290885, 290290, 289721, 288658, 286812, 284541, 282528, 281247, 280736, 280713, 280836, 280966, 281118, 281123, 280626, 279632, 278783, 278715, 279292, 279866, 280157, 280471, 281162, 282370, 284266, 286968, 290042, 292546, 293864, 294271, 294434, 294652, 294819, 294926, 295228, 295893, 296739, 297433, 297868, 298261, 298927, 300044, 301670, 303799, 306233, 308455, 309939, 310642, 311059, 311741, 312889, 314368, 315737, 316246, 315258, 312965, 310404, 308455, 307015, 305441, 303560, 301864, 300799, 300171, 299338, 297876, 296115, 294984, 295142, 296198, 297086, 297301, 297398, 298057, 299118, 299862, 299910, 299419, 298685, 297972, 297538, 297358, 296998, 296151, 295189, 294750, 294881, 295075, 295104, 295360, 296197, 297229, 297509, 296422, 294458, 293053, 293435, 295490, 298019, 300099, 301795, 303480, 305171, 306885, 309026, 311722, 314230, 315741, 316457, 317137, 317819, 317825, 316925, 315641, 314341, 312903, 311440]
61460C11440q41J32O27N06L86N76P41O44N36O03O24M03J70L06Q66J501J801J655
61442C22676J341J222J368J573J730K006K595L470M345M814M539L614K595J974
61428C59862J704J497J344J328J197P37L95Q93K203L489M079L931L267K445K064
61413C90435K394K716K110Q87K62N29O10l46j936l380m383m741m226l348l176
61398C74407l816m144l639l308l875m344l515j973j148j189j157q57q93j190q57
61383C38502K93J322J506J151Q68P98Q72J162J692K289K750K910K659K181J937
61368C62892K062K061J609J171J283J617J548J321J739K832L659L636L273L474
61354C94177M569O196P709Q607Q964R415J0441J1730J2552J2536J1690J0010P647
$$ y = [311440, 310599, 310731, 311358, 311864, 312250, 312826, 313567, 314211, 314747, 315350, 315974, 316377, 316547, 316853, 317719, 319220, 321021, 322676, 324017, 325239, 326607, 328180, 329910, 331916, 334511, 337981, 342326, 347140, 351679, 355293, 357888, 359862, 361566, 363063, 364407, 365735, 366932, 367669, 368064, 368957, 371160, 374649, 378728, 382659, 385926, 388371, 390435, 392829, 395545, 397655, 398542, 398804, 399333, 399943, 399597, 397661, 394281, 389898, 385157, 380931, 377583, 374407, 370591, 366447, 362808, 359500, 355625, 351281, 347766, 345793, 344645, 343456, 342299, 341442, 340549, 339359, 338502, 338795, 340117, 341623, 342774, 343642, 344440, 345312, 346474, 348166, 350455, 353205, 356115, 358774, 360955, 362892, 364954, 367015, 368624, 369795, 371078, 372695, 374243, 375564, 377303, 380135, 383794, 387430, 390703, 394177, 398746, 404942, 412651, 421258, 430222, 439637, 450078, 461808, 474360, 486896, 498586, 508596, 516243]
61341E16243N343L978L677L861M078M284M392M086L286K300J381M59o35j969l512
61326E51252n052o173o586o419n971n310m378l352k524j936j437j043q68p54k51
61311D99198R23K519L835M244L864L686M699O800Q895J0007R807Q182N128J306
61297E73093k107m565o452p944q445p802p138p517q367q283p053n777n199m920
61283D81524m390l691l077k365j185M71K165L357L926M390N443P095Q589R305
61269E11557R339R033Q447P686P128O904O632O212O360P706R861J1887J3327J4124
61255F36203J4045J2898J1018Q989P089N522M621M256L540J858k00j644k471l477
61241G02247n049o907q676r987j0275r261p571o306o056o678p585p882o811m720
$$ y = [516243, 521586, 525564, 529241, 533102, 537180, 541464, 545856, 549942, 553228, 555528, 556909, 557368, 556733, 554764, 551252, 546200, 540027, 533441, 527022, 521051, 515741, 511363, 508011, 505487, 503551, 502114, 501071, 500203, 499449, 499198, 500121, 502640, 506475, 510719, 514583, 518269, 522968, 529768, 538663, 548670, 558477, 566659, 571787, 573093, 570986, 566421, 559969, 552025, 543580, 535778, 528640, 521123, 512756, 504473, 497420, 491643, 486444, 481524, 477134, 473443, 470366, 468001, 466816, 467287, 469452, 472809, 476735, 481125, 486568, 493663, 502252, 511557, 520896, 529929, 538376, 546062, 553190, 560094, 566726, 572938, 579298, 587004, 596865, 608752, 622079, 636203, 650248, 663146, 674164, 683153, 690242, 695764, 700385, 704641, 708181, 710039, 709839, 708195, 705724, 702247, 697198, 690291, 681615, 671628, 661353, 652092, 644521, 638215, 632159, 625481, 617896, 610014, 603203, 598483]
61227E98483l016k511k445j832r48n41l24M05J218R87k89j386j499r22j06Q86
61211E86160J912K573K607J831J2k471m251m290l242k478k040q29J437L824N807
61196E86562P966J0733J3639J6199J8583K0892K2513K2636K0967J7738J3612R667
61184G81707O933N763N820O540P131O704N065L197K151J821J461R55O54K88q35
61169H35355k716m621o058o992p336p234p522q924j0968j2570j3439j3985j4290
61156G18700j4178j3919j3707j2809j0462p280m480k108N81L296M807M728L622
61143F56791J498k149o642j0178j1900j2534j2758j2335j1165r771q306o363m139
61130E50049k508j641p57M76J641K801M730P432R784J1125J2101J3523J5455J7641
$$ y = [598483, 595467, 592956, 590511, 588679, 587731, 587190, 586866, 587271, 588489, 589476, 589187, 587801, 586302, 585380, 585274, 586160, 588072, 590645, 593252, 595083, 595095, 592624, 588373, 584083, 580841, 578363, 576323, 575494, 576931, 580755, 586562, 594528, 605261, 618900, 635099, 653682, 674574, 697087, 719723, 740690, 758428, 772040, 781707, 788640, 794403, 800223, 806763, 813894, 820598, 825663, 828860, 831011, 832832, 834293, 835248, 835902, 836190, 835355, 832639, 828018, 821960, 814968, 807632, 800398, 792876, 783952, 772984, 760414, 746975, 732990, 718700, 704522, 690603, 676896, 664087, 653625, 646345, 641865, 639757, 640338, 643634, 648441, 653169, 656791, 658289, 656140, 649498, 639320, 627420, 614886, 602128, 589793, 578628, 568857, 560551, 554188, 550049, 547541, 545900, 545143, 545619, 547260, 550061, 554791, 562223, 572007, 583132, 595233, 608756, 624211, 641852]
61116F41852J9800K1358K2017K2578K4008K5740K6403K6077K6148K6869K6949
61105I09799K5820K4457K3446K2108K0034J7658J4734J0167M141j445n590r392
61093A055937j3707j7429j9345k0107k0944k1793k2062k2028k2255k2538k2465
61082H31264k2124k1541k0433j9128j8478j8255j7125j4870j3008j2330j1579
61071F42393r701p717o953o866o141m740l429k270r25M55J711L153M606N163M730
61056F13469M615N701P254Q491R740J1162J1891J1740J2134J4013J6221J7448
61044G43879J8257J9793K1808K3482K4975K6708K8295K9532L1205L3662L5892
61033A037488L7229L8565M0722M3158M5442M8166N1159N2718N2102N0841N0235
$$ y = [641852, 661652, 683010, 705027, 727605, 751613, 777353, 803756, 829833, 855981, 882850, 909799, 935619, 960076, 983522, 1005630, 1025664, 1043322, 1058056, 1068223, 1072364, 1070919, 1065329, 1055937, 1042230, 1024801, 1005456, 985349, 964405, 942612, 920550, 898522, 876267, 853729, 831264, 809140, 787599, 767166, 748038, 729560, 711305, 694180, 679310, 666302, 653972, 642393, 632692, 624975, 618022, 611156, 605015, 600275, 596846, 594576, 593651, 594106, 595817, 598970, 603576, 608739, 613469, 618084, 623785, 631039, 639530, 649270, 660432, 672323, 684063, 696197, 710210, 726431, 743879, 762136, 781929, 803737, 827219, 852194, 878902, 907197, 936729, 967934, 1001596, 1037488, 1074717, 1113282, 1154004, 1197162, 1242604, 1290770, 1341929, 1394647, 1446749, 1497590, 1547825]
61022A547825M9842M9864N2339N8027O4856P1564P9893R0671J01053J08882J16801
61011B391617J28699J45478J68193K01640K49813L11383L85249M76922N93096
61002E052090P34658R03665J111423J364939J646401J921409K164774K348792
60994A7248151K392377K160583J575684P48242l7517n09146n86147l79393m7703
60985B2565131K97998N54171N66397J96649n29930j382886k066884k411459k432676
60976A5356511k248359j970752j669777j386770j143958r43315p75495o34629
60968D583456n20078m28292l52194k88169k37058j98278j68131j43934j25205
60959B122117j10543r7275q4546p3509o4143n4731m4632l4946k6319j8438j1853
$$ y = [1547825, 1597667, 1647531, 1699870, 1757897, 1822753, 1894317, 1974210, 2064881, 2165934, 2274816, 2391617, 2520316, 2665794, 2833987, 3035627, 3285440, 3596823, 3982072, 4458994, 5052090, 5786748, 6690413, 7801836, 9166775, 10813176, 12734585, 14899359, 17248151, 19640528, 21801111, 23376795, 24125037, 24087520, 23578374, 22992227, 22612834, 22565131, 22863129, 23417300, 23983697, 24180346, 23650416, 22267530, 20200646, 17789187, 15356511, 13108152, 11137400, 9467623, 8080853, 6936895, 5993580, 5218085, 4583456, 4063378, 3635086, 3282892, 2994723, 2757665, 2559387, 2391256, 2247322, 2122117, 2011574, 1914299, 1829753, 1756244, 1692101, 1637370, 1592738, 1557792, 1531473, 1513035, 1501182]
60948A501182p828o236n443m447l437k357p75R38K052K948M500O161O431N102
60934A498791L413J991K88k000m489p115j0112j3108j5549j7896k0962k4295k6762
60921A362195k8559l0882l3650l5280l5075l4147l3515l2765l1235k9289k7712
60910A010086k6641k5631k4206k2126j9615j7350j5658j3991j1914j0099r256
60899H13599q646p076n095m514n694o968p093o709o722o814o471o240o849p947
60885G20761q706r091r566j0030j0044r781r850j0297j0490j0058r373q922q642
60872E95911q137p330o626o357o283n864m987m135l701l531l356l256l244k822
60858E26282j626l64l58k010m214n480n263m098k825j947j509j360j458j919k703
$$ y = [1501182, 1493354, 1487118, 1481675, 1477228, 1473791, 1471434, 1470659, 1471597, 1473649, 1476597, 1481097, 1487258, 1493689, 1498791, 1502204, 1504195, 1504483, 1502483, 1497994, 1490879, 1480767, 1467659, 1452110, 1434214, 1413252, 1388957, 1362195, 1333636, 1302754, 1269104, 1233824, 1198749, 1164602, 1131087, 1098322, 1067087, 1037798, 1010086, 983445, 957814, 933608, 911482, 891867, 874517, 858859, 844868, 832954, 822855, 813599, 804953, 797877, 792782, 788268, 782574, 775606, 768513, 761804, 755082, 748268, 741797, 735557, 728708, 720761, 712055, 702964, 693398, 683368, 673324, 663543, 653693, 643396, 632906, 622848, 613475, 604553, 595911, 587774, 580444, 573818, 567461, 561178, 555314, 550327, 546192, 542491, 538960, 535604, 532348, 529104, 526282, 524656, 524292, 523934, 521924, 517710, 512230, 506967, 502869, 500044, 498097, 496588, 495228, 493770, 491851, 489148]
60843D89148l467l873l898l694l357k981k811l096l865m916n892o314n840m634
60829D30510l219j906p74r7j60m97n1J454K982L516L305L123K980K360J343O34
60813D45503N66R03J398J895J963J158k42j419j909j914j741j475j153p53m9J007
60797D43738J769J385r8j611k261k269k553l599m989n900n860n106m241l672l451
60782D01282l481l644l756l773l944m347m397l466j996j156j241j270n82J41R5
60767C64465k52O5J080K092K813L316L277K369J184P46J133J533J568J627J961
60752C88977K336K730L402M093M044L105K095J753J946K208K338K161J255m76
60738D21967k393l747m462m978n531n985o205o305o461o631o487n700m362l050
$$ y = [489148, 485681, 481808, 477910, 474216, 470859, 467878, 465067, 461971, 458106, 453190, 447298, 440984, 435144, 430510, 427291, 425385, 424611, 424514, 424354, 423857, 423806, 425260, 428242, 431758, 435063, 438186, 441166, 443526, 444869, 445503, 446069, 446972, 448370, 450265, 452228, 453386, 453144, 451725, 449816, 447902, 446161, 444686, 443533, 442780, 442731, 443738, 445507, 446892, 446794, 445183, 442922, 440653, 438100, 434501, 429512, 423612, 417752, 412646, 408405, 404733, 401282, 397801, 394157, 390401, 386628, 382684, 378337, 373940, 370474, 368478, 367322, 366081, 364811, 364229, 364370, 364465, 364213, 364278, 365358, 367450, 370263, 373579, 376856, 379225, 380409, 381155, 382288, 383821, 385389, 387016, 388977, 391313, 394043, 397445, 401538, 405582, 408687, 410782, 412535, 414481, 416689, 419027, 421188, 422443, 421967, 419574, 415827, 411365, 406387, 400856, 394871, 388666, 382361, 375900, 369269, 362782, 357082, 352720, 349670]
60724C49670k357k369k701k900k729k229j724j576j808k117k329k489k421j714
60710C18207m85M40N49L57M74N50r0j123j497r03l2N92J111J571J572J032N78
60693C22903P46J301J707J778J570J163Q58J148K122L198L812M020M164M311M395
60678C59196M557M844M818M084L111K908L696M421M018K783J904J757J391J3j716
60663D01785k533k344k240k827l480l521l284l367l508k967j749o70l13n11q20
60648C67651r59p50j57N74J075J227J070M80p06k235l476m001l912l509k963k348
60632C47061j848j729k125k795l203k945k128j187m15R0J71j69l48L29J597K280
60616C32636J722N90j04k12k20l25l04PN92J281J645J286N34K67P32J152R46N34
$$ y = [349670, 347313, 344944, 342243, 339343, 336614, 334385, 332661, 331085, 329277, 327160, 324831, 322342, 319921, 318207, 317722, 318162, 318711, 319068, 319542, 320092, 320002, 318879, 317382, 316479, 316447, 317039, 318150, 319721, 321293, 322325, 322903, 323649, 324950, 326657, 328435, 330005, 331168, 332026, 333174, 335296, 338494, 342306, 346326, 350490, 354801, 359196, 363753, 368597, 373415, 377499, 380610, 383518, 387214, 391635, 395653, 398436, 400340, 402097, 403488, 403501, 401785, 399252, 396908, 394668, 391841, 388361, 384840, 381556, 378189, 374681, 371714, 369965, 369295, 368982, 368471, 367651, 366692, 365942, 365785, 366359, 367434, 368661, 369731, 370211, 369505, 367270, 363794, 359793, 355881, 352372, 349409, 347061, 345213, 343484, 341359, 338564, 335361, 332416, 330288, 329101, 328686, 328776, 328947, 328778, 328430, 328759, 330356, 332636, 334358, 334948, 334844, 334632, 334412, 334087, 333783, 333790, 334382, 335663, 337308, 338594, 339128, 339395, 340127, 341279, 342225, 342759]
60598C42759M03K82L8M32J856L129K881J654J201J923K481J954R78M69M31M12
60582C63283K27k33r95j536j068L72J829K646L072L466L761M013M672N894P227
60567C96630Q334R454J0850J2307J3441J3960J3466J1602Q623N283J985j327m389
60554E00219o515p533q029q307p895o423m305k009O01L573O153P440P475P186
60540D81631P529Q975J1381J3935J5653J6287J6445J6402J5333J2275P481K323
60528F25650j990n128p307q693r167q535o982n275m233l975m046m152m271m095
60514E47801l181j783p58l48J16R88J679J903K539M409O942R073J0984J3819J7925
60499F12108K2474K6794L1036L5417L9776M4041M8351N2274N4547N4052N0653
$$ y = [342759, 343162, 343444, 343482, 343914, 345770, 348899, 351780, 353434, 354635, 356558, 359039, 360993, 361971, 362440, 362871, 363283, 363510, 363277, 362282, 360746, 359678, 360050, 361879, 364525, 367597, 371063, 374824, 378837, 383509, 389403, 396630, 404964, 414418, 425268, 437575, 451016, 464976, 478442, 490044, 498667, 503950, 505935, 504608, 500219, 493704, 486171, 478142, 469835, 461940, 455517, 451212, 449203, 449804, 453377, 459530, 466970, 474445, 481631, 489160, 498135, 509516, 523451, 539104, 555391, 571836, 588238, 603571, 615846, 623327, 625650, 623660, 618532, 611225, 602532, 593365, 584830, 577848, 572573, 568340, 564365, 560319, 556167, 551896, 547801, 544620, 542837, 542079, 541731, 541847, 542835, 544514, 546417, 548956, 553365, 560307, 569380, 580364, 594183, 612108, 634582, 661376, 692412, 727829, 767605, 811646, 859997, 912271, 966818, 1020870, 1071523]
60488A071523M4773L6597K6088J3514l80j4576k7957l9485m8496n4749n8129n8533
60476H90190n6213n2040m7116m2132l7193l2269k7580k3560k0482j8216j6334
60465E17055j4528j2846j1588j0881j0457r853q837p559o352n393m655m048l559
60452D06499l195k933k738k580k365j970j431j024j014j395j843j961j496n45
60438C80009M31R06P73L52p3n38j033j236r54o19q12j366j455p17J31J19p96j709
60420C71413j840j273n26K58J328K566L220K730J578Q54J013J478J532J078M34
60405C85843j55n02m18J9M55P67J216J851K230K076J775J799K109K467K895L274
60389D07701L053K083J247J442K279K609K144J650J665J954K257K671L093L106
$$ y = [1071523, 1116296, 1152893, 1178981, 1192495, 1192115, 1177539, 1149582, 1110097, 1061601, 1006852, 948723, 890190, 833977, 781937, 734821, 692689, 655496, 623227, 595647, 572087, 551605, 533389, 517055, 502527, 489681, 478093, 467212, 456755, 446902, 438065, 430506, 424154, 418761, 414106, 410058, 406499, 403304, 400371, 397633, 395053, 392688, 390718, 389287, 388263, 387249, 385854, 384011, 382050, 380554, 380009, 380440, 381346, 382119, 382471, 382398, 381860, 380827, 379591, 378637, 378018, 377206, 375840, 374385, 373668, 373799, 373918, 373122, 371413, 369573, 368300, 367774, 368032, 369360, 371926, 375146, 377876, 379454, 380308, 381321, 382799, 384331, 385409, 385843, 385688, 385186, 384768, 384787, 385242, 386009, 387225, 389076, 391306, 393382, 395157, 396956, 399065, 401532, 404427, 407701, 410754, 412837, 414084, 415526, 417805, 420414, 422558, 424208, 425873, 427827, 430084, 432755, 435848, 438954]
60375D38954K660K245K184K275K304K336K346K116J649J196Q37N00L21M95P69
60360D63187Q01R08J669K855L598L796M351N763P403Q601R566J0717J1790J2260
60346E47265J1987J0979R119O635M192J935q74m579q064r841r818r154q625p998
60332E33159o952n765m835m162l534k936k611k830l631m566m862m108k716j499
60318D78152q27m92k22k4J19N59J806L947O384Q271R401J0561J2808J6336K0288
60303E67067K3616K5907K7193K7250K5349K0847J3992O016j765q967j5826k1931
60291F88748k5932k6950k5690k3450k0525j6522j1980q496o928o395n486l890
60279E06504k407j803k075k590k750k576k674l386m221m543m466m484m469l929
$$ y = [438954, 441614, 443859, 446043, 448318, 450622, 452958, 455304, 457420, 459069, 460265, 461102, 461602, 461923, 462418, 463187, 463988, 464896, 466565, 469420, 473018, 476814, 481165, 486928, 494331, 502932, 512498, 523215, 535005, 547265, 559252, 570231, 579350, 585985, 590177, 592112, 591238, 586659, 578595, 568754, 558936, 549782, 541157, 533159, 526207, 520442, 515607, 511445, 507911, 504975, 502364, 499534, 495903, 491337, 486475, 482367, 479651, 478152, 477325, 476833, 476611, 476587, 476706, 477265, 479071, 483018, 489402, 497673, 507074, 517635, 530443, 546779, 567067, 590683, 616590, 643783, 671033, 696382, 717229, 731221, 737237, 735472, 726505, 710679, 688748, 662816, 635866, 610176, 586726, 566201, 549679, 537699, 529203, 522275, 515880, 510394, 506504, 504097, 502294, 500219, 497629, 494879, 492303, 489629, 486243, 482022, 477479, 473013, 468529, 464060, 460131]
60265D60131l094k759l019l078k597k222k422k699k407j675j001n72l80m50n99
60250D31157m72j00J38J94L41M27J5o15n73J76N74R5m25k44J45R9M3O44J588K142
60230D35349K324K592K983L347L846M383M243L175K112J904K055J770J481K057
60216D73621L132L681L853M707O226P103O723O027O092O933Q025R029R575R186
60202E63913P905O430N327M637M306M357M477M127L287K516K167K022J835J545
60188F18851R39k37j647k500k548k390k621l236l972m634m906m538l972m107n098
60173E73384n947n715m588l346k364j609j182j220j483j599j591j702j789j345
60159E37904k34R68J461R49j38r52q33J85J426K182K331K254K281K352K284K133
$$ y = [460131, 457037, 454278, 451259, 448181, 445584, 443362, 440940, 438241, 435834, 434159, 433158, 432586, 432206, 431756, 431157, 430685, 430585, 430723, 430917, 431258, 431685, 431700, 431085, 430512, 430688, 431262, 431357, 430932, 430688, 430833, 430932, 430975, 431619, 433207, 435349, 437673, 440265, 443248, 446595, 450441, 454824, 459067, 462242, 464354, 466258, 468313, 470083, 471564, 473621, 476753, 480434, 484287, 488994, 495220, 502323, 509046, 515073, 521165, 528098, 536123, 545152, 554727, 563913, 571818, 578248, 583575, 588212, 592518, 596875, 601352, 605479, 608766, 611282, 613449, 615471, 617306, 618851, 619790, 619553, 617906, 615406, 612858, 610468, 607847, 604611, 600639, 596005, 591099, 586561, 582589, 578482, 573384, 567437, 561722, 557134, 553788, 551424, 549815, 548633, 547413, 545930, 544331, 542740, 541038, 539249, 537904, 537670, 538638, 540099, 541048, 540910, 539958, 539125, 539310, 540736, 542918, 545249, 547503, 549784, 552136, 554420, 556553]
60143E56553K103K238K437K792L551M705N879O854P895R211J0350J0634J0071
60130F35273R280Q568P605O158M513K964J460L8q74j003p31o55q86j110j082p66
60114F68752k19L40N62L07j79n90r16j307j821k345k661k600k365k528l242l769
60098F45419l419k715k704l289l317k445j547r49K70K488M404M877M717N389O688
60083F53867P249O730O031N572M817L518K190J201L63m92j385k650m589o674q014
60068F67734q717r783j1475j2774j2722j1578j0294r472r181r215r140q559p566
60055E37258o712o315o127n634m478k691q86N6J6J05J443L662N327N775N693N870
60039E32362O256O508O737P148P499P271O262M761L313K265J446L70j109k552
$$ y = [556553, 558656, 560894, 563331, 566123, 569674, 574379, 580258, 587112, 595007, 604218, 614568, 625202, 635273, 644553, 653121, 660726, 666884, 671397, 674361, 675821, 675859, 674985, 673982, 673251, 672596, 671710, 670600, 669518, 668752, 668533, 668873, 669435, 669742, 669563, 668973, 668057, 666750, 664929, 662584, 659923, 657323, 654958, 652430, 649188, 645419, 642000, 639285, 636581, 633292, 629975, 627530, 625983, 625034, 625304, 627792, 632196, 637073, 641790, 647179, 653867, 661116, 667846, 673877, 679449, 684266, 687784, 689974, 691175, 691538, 691046, 689661, 687011, 682422, 675748, 667734, 659017, 649234, 637759, 624985, 612263, 600685, 590391, 580919, 571738, 562523, 553383, 544824, 537258, 530546, 524231, 518104, 512470, 507992, 505301, 504415, 504471, 504487, 504592, 506035, 509697, 515024, 520799, 526492, 532362, 538618, 545126, 551863, 559011, 566510, 573781, 580043, 584804, 588117, 590382, 591828, 592198, 591089, 588537]
60025E88537l649m704n997p117p586p731q184q738q590p571o376n563n116m919
60011D96696m980n090n009m918n066n053m261k924j966j712j672j550j548j517
59997D49430q54L99J276J181O84N99R59J425K035K994M131N049N571N670N346
59982D85895M734M056L321K403J479Q79M05o02k271l821m464m228l657l127k736
59967D78266k456k120j495n16O98K066L461M523M923M762M297L533K531J787J590
59952E05850J264K6j633k450k252k119k514k629k007j585k205l183l309k667k279
59937D76308k444k453j886j275j314j940k426k173j331n74j92M17J926L926N267
59922D69836N572N680O287O994P199P194P674Q625R386R540R122Q183O757N159
$$ y = [588537, 584888, 580184, 574187, 567070, 559484, 551753, 543569, 534831, 526241, 518670, 512294, 506731, 501615, 496696, 491716, 486626, 481617, 476699, 471633, 466580, 462319, 459395, 457429, 455717, 454045, 452495, 450947, 449430, 448576, 448975, 450251, 451432, 452116, 452715, 453674, 455099, 457134, 460128, 464259, 469308, 474879, 480549, 485895, 490629, 494685, 498006, 500409, 501888, 502767, 503172, 502570, 500299, 496478, 492014, 487786, 484129, 481002, 478266, 475810, 473690, 472195, 471679, 472377, 474443, 477904, 482427, 487350, 492112, 496409, 499942, 502473, 504260, 505850, 507114, 507140, 505507, 503057, 500805, 498686, 496172, 493543, 491536, 489951, 487746, 484563, 481254, 478587, 476308, 473864, 471411, 469525, 468250, 466936, 464996, 462570, 460397, 459066, 458492, 458300, 458717, 460643, 464569, 469836, 475408, 481088, 487375, 494369, 501568, 508762, 516436, 525061, 534447, 543987, 553109, 561292, 568049, 573208]
59908E73208L792K743J877J277J164J464J727J566R11j04j283k356k994l042k751
59893E77199k681l060l284k396l48J678K579K621K855L593M231M361M290M420
59879E96058M861N699O878P750P495O239N039M530M246L479K131M82j202k567
59865F51118l252l418l628m008m082l627l021k563k182j993k327k827k415p32
59851F11043J193K315K909L925N602P401Q736R003P454L935l57l621m922m584
59837F50032l388j895m60O60J146N37j498m469p050q107p609o348n096m238l820
59822E98397l610l327l027l019l258l267k824k248j867j707j808k296k913l084
59808E60142k775k646l048l521l632l598l599l257k400j696j815k486l038l400
$$ y = [573208, 577000, 579743, 581620, 582897, 584061, 585525, 587252, 588818, 589729, 589625, 588342, 585986, 582992, 579950, 577199, 574518, 571458, 568174, 565778, 565430, 567108, 569687, 572308, 575163, 578756, 582987, 587348, 591638, 596058, 600919, 606618, 613496, 621246, 628741, 634980, 640019, 644549, 648795, 652274, 654405, 654887, 653685, 651118, 647866, 644448, 640820, 636812, 632730, 629103, 626082, 623519, 621337, 619344, 617017, 614190, 611775, 611043, 612236, 614551, 617460, 621385, 626987, 634388, 643124, 652127, 659581, 663516, 663159, 659538, 654616, 650032, 646644, 644749, 644289, 644949, 646095, 646632, 645134, 640665, 633615, 625508, 617899, 611551, 606455, 602217, 598397, 594787, 591460, 588433, 585414, 582156, 578889, 576065, 573817, 571950, 570243, 568435, 566139, 563226, 560142, 557367, 554721, 551673, 548152, 544520, 540922, 537323, 534066, 531666, 529970, 528155, 525669, 522631, 519231]
59794E19231l846m152l783k740j582p39k64o7mol20j201k166k213j182k11k30
59777D94525p49p67j78N19J179J704J504M90MJ352L639M564L492K286K654M059
59761E20277M875M551L773L227L150L628M408M746M178L430L843N764Q039R242
59747E87131R085Q383Q003Q075Q120P634O590N435M651M176L444K111N79m62r33
59732F62022j383k059k536k445k108k054k317k656l084l665m068l910l355k832
59718F23550k413k022j924k311k652k336j749j844k628l048k442j226j8R73J512
59703E99422J292O77O34J498K443K633K158J581J244J394K241L461M242M168L497
59688F32585K419P94j057k239k351j937j566j177p48p08j219j851k357k992l672
$$ y = [519231, 515385, 511233, 507450, 504710, 503128, 502389, 502125, 502058, 502054, 502048, 501728, 500527, 498361, 496148, 494966, 494755, 494525, 493776, 493009, 492831, 493350, 494529, 496233, 497737, 498227, 498231, 499583, 503222, 507786, 511278, 513564, 516218, 520277, 525152, 529703, 533476, 536703, 539853, 543481, 547889, 552635, 556813, 560243, 564086, 569850, 577889, 587131, 596216, 604599, 612602, 620677, 628797, 636431, 643021, 648456, 653107, 657283, 660727, 662838, 663417, 662955, 662022, 660639, 658580, 656044, 653599, 651491, 649437, 647120, 644464, 641380, 637715, 633647, 629737, 626382, 623550, 621137, 619115, 617191, 614880, 612228, 609892, 608143, 606299, 603671, 600623, 598181, 596955, 596937, 597910, 599422, 600714, 601391, 602025, 603523, 605966, 608599, 610757, 612338, 613582, 614976, 617217, 620678, 624920, 629088, 632585, 635004, 635798, 634741, 632502, 630151, 628214, 626648, 625471, 624723, 624015, 622796, 620945, 618588, 615596, 611924]
59673F11924l846l543l560m052m133l501l246m110n100m951l966l236k848k246
59659E59586j612j568j902j847j280n67M25J965L459L992L706L558L831L868L239
59644E78853K150P75r49k771m209n154n772n897n234m067l067k412j724q15R4
59629E39801P06P88J78q70j634j746j710k046k447k406k193k393k851k944k669
59614E15564k582k831l062l052k801k134r56K93J047J318J430J384J076Q03Q42
59599E06339Q67M60j31l78k64J1N42J324J763J488J103J297J706J610J219J145
59583E20101J088K56j173k235k701l173l782m008l843l974m565m901m501l727
59569D78862l060k479j855j230o41j20N4k78o76o14j99J49N06J155J796J887J573
$$ y = [611924, 608078, 604535, 600975, 596923, 592790, 589289, 586043, 581933, 576833, 571882, 567916, 564680, 561832, 559586, 557974, 556406, 554504, 552657, 551377, 550810, 551235, 553200, 556659, 560651, 564357, 567915, 571746, 575614, 578853, 581003, 581778, 580829, 578058, 573849, 568695, 562923, 557026, 551792, 547725, 544658, 542246, 540522, 539707, 539801, 540507, 541295, 541473, 540603, 538969, 537223, 535513, 533467, 531020, 528614, 526421, 524028, 521177, 518233, 515564, 512982, 510151, 507089, 504037, 501236, 499102, 498146, 498439, 499486, 500804, 502234, 503618, 504694, 505497, 506339, 507206, 507666, 507535, 507157, 506893, 506904, 507446, 508770, 510533, 512021, 513124, 514421, 516127, 517737, 518956, 520101, 521189, 521445, 520272, 518037, 515336, 512163, 508381, 504373, 500530, 496556, 491991, 487090, 482589, 478862, 475802, 473323, 471468, 470238, 469597, 469477, 469531, 469253, 468577, 467963, 467764, 467913, 468419, 469574, 471370, 473257, 474830]
59552D74830J461J688J985K430L165L658L338K773L109M355N364N664O210P986
59538E28016J0783J3723J6344J8750K0947K2082K0252J3816L677o261j1967j2529
59526F37633r936o342k721L63K438L769M998N939N762M523L248K312Q99j569m552
59511F46764p284r544j1159j1715j1283j0632j0275r913r157q161p230o334n325
59498E28752m218l166k501k580l093k877j227Q30J605Q80P4K91J254K208K862
59483E19094L190L205L165L392L797M108M407M808M968M748M872N812O477N386
59469E81429K924R36J59l85j359k100k108j948j985j546o7J934L740N427P288
59454E92339R088J0455J1393J1988J2252J2513J3201J4034J4078J2938J1077Q824
$$ y = [474830, 476291, 477979, 479964, 482394, 485559, 489217, 492555, 495328, 498437, 502792, 508156, 513820, 520030, 528016, 538799, 552522, 568866, 587616, 608563, 630645, 650897, 664713, 668390, 662129, 650162, 637633, 627697, 621355, 618634, 618997, 621435, 625204, 630202, 636141, 641903, 646426, 649674, 651986, 652885, 651316, 646764, 639480, 629936, 618777, 607062, 595779, 585147, 574872, 564959, 555802, 547641, 540411, 534077, 528752, 524534, 521368, 518867, 516287, 513194, 510317, 509090, 509920, 511525, 512405, 512479, 512770, 514024, 516232, 519094, 522284, 525489, 528654, 532046, 535843, 539951, 544358, 549166, 554134, 558882, 563754, 569566, 576043, 581429, 584353, 585289, 585448, 585063, 583704, 581604, 579496, 577548, 575563, 574017, 573950, 575884, 579624, 585051, 592339, 601427, 611882, 623275, 635263, 647515, 660028, 673229, 687263, 701341, 714279, 725356, 734180]
59442G34180N815J716l197q299j2763j5499j5826j4370j2533j1078r909r016q546
59429F20675q046o840n162l912l227k401j110L70K165M765P946J0914J3553J6354
59415F46044J9288K1919K4448K7241K9689L0964L1324L0548K5800J4068k709j7750
59403H80874k5699k6662k3455j7704j0242k645L881R435J3137J1670K649j1278
59391H03961k3920l0851l1924k9381k5384k1270j7556j4150j1056q583o625m519
59379E78742k245p67m82l66M72J401J521J287J706K631L122K911K481K218K374
59364E97006L231M486N108M655M081M425N436O297O892P529Q150Q748R776J1259
59350F87079J2344J2561J2753J3786J5265J6460J7557J8870J9717J9332J8136
$$ y = [734180, 739995, 741711, 738514, 730215, 717452, 701953, 686127, 671757, 659224, 648146, 638237, 629221, 620675, 612629, 605789, 600627, 596715, 593488, 591087, 589977, 590347, 592512, 597277, 605223, 616137, 629690, 646044, 665332, 687251, 711699, 738940, 768629, 799593, 830917, 861465, 887265, 901333, 898624, 880874, 855175, 828513, 805058, 787354, 777112, 774467, 778348, 787783, 800920, 812590, 815239, 803961, 780041, 749190, 717266, 687885, 662501, 641231, 623675, 609525, 598469, 589886, 583261, 578742, 576497, 575730, 575248, 574882, 575354, 576755, 578276, 579563, 581269, 583900, 587022, 589933, 592414, 594632, 597006, 600237, 604723, 609831, 614486, 618567, 622992, 628428, 634725, 641617, 649146, 657296, 666044, 675820, 687079, 699423, 711984, 724737, 738523, 753788, 770248, 787805, 806675, 826392, 845724, 863860]
59339H63860J6870J5198J2368Q682N045J597k014n456q086j0146j2441j5056j7366
59326H53055j8957j9694j9301j7833j6146j4989j3969j2237r823p524n864m901
59314F91817m489m096k960j168J42L94N55J653L182M097M666O076Q609J1341J3280
59299G33099J4076J3996J3821J3927J2821P756j912j2848k0554k3481k3267k1828
59287G05606j9801j7344j4804j2396j0235q541p145n288k725l81R82J980L473
59274F13381N085O074O913Q583J0854J2694J3838J4715J5211J4944J4151J3029
59262G49472J0732O578J809j539l229m742o815q740j0038j1126j2086j2215j1160
59249F86901r405p457n573m251l831l588k427m91J002J575J934K567L124L429
$$ y = [863860, 880730, 895928, 908296, 916978, 922023, 923620, 921606, 916150, 908064, 897918, 885477, 870421, 853055, 834098, 814404, 795103, 777270, 761124, 746135, 732166, 719929, 710106, 702582, 696718, 691817, 687328, 683232, 680272, 679104, 679246, 679640, 680195, 681848, 685030, 689127, 693793, 699869, 708478, 719819, 733099, 747175, 761171, 774992, 788919, 801740, 809496, 807584, 794736, 774182, 750701, 727434, 705606, 685805, 668461, 653657, 641261, 631026, 622485, 615340, 610052, 607327, 606946, 607928, 609908, 613381, 618466, 624540, 631453, 640036, 650890, 663584, 677422, 692137, 707348, 722292, 736443, 749472, 760204, 766782, 768591, 767052, 763823, 759081, 752266, 743526, 733488, 722362, 710276, 698061, 686901, 677496, 670039, 664466, 660215, 656384, 652796, 650369, 649878, 650880, 652455, 654389, 656956, 660080, 663509]
59235F63509L887M558M823M370L759L641M045M512M455L431J601j63j264k217
59221G02947l774n582o574o398n679n015m699n006n853o322n629m367l826m169
59207F30054m348l762k913k381k112j870j618j234n55K26P14Q37P40L91k20p06
59191F11243o78k24L87J036J444J203O47Q05J844K454J701N29L25R28J331J529
59175F26504K196L151L632L692M013M656N291O168P534Q591Q490P943Q381R792
59161G10034J0911J1191J1062J0385Q413N350K440K93j636l764n803p574r248
59148G42054j0641j1283j1216j0874j0239r075p754o921o578o440o758p744q689
59135F27842q761q207p624o703n079l596l135k791j063J569L182L330L441M368
$$ y = [663509, 667396, 671954, 676777, 681147, 684906, 688547, 692592, 697104, 701559, 704990, 706591, 706428, 705164, 702947, 699173, 693591, 687017, 680619, 674940, 669925, 665226, 660220, 654367, 648045, 642416, 638049, 634223, 630054, 625706, 621944, 619031, 616650, 614538, 612668, 611050, 609816, 609261, 609487, 610201, 611038, 611778, 612169, 611949, 611243, 610565, 610341, 610728, 611764, 613208, 614411, 615058, 615863, 617707, 620161, 621862, 622391, 622716, 623644, 624975, 626504, 628700, 631851, 635483, 639175, 643188, 647844, 653135, 659303, 666837, 675428, 683918, 691861, 700242, 710034, 720945, 732136, 743198, 753583, 761996, 767346, 769786, 770079, 768443, 764679, 758876, 751302, 742054, 731413, 720130, 708914, 698040, 687801, 678726, 670972, 664051, 657473, 651033, 644275, 636531, 627842, 619081, 610874, 603250, 596547, 591468, 587872, 584737, 581946, 580883, 582452, 585634, 588964, 592405, 596773]
59121E96773N457O201P039Q162R107R780J0501J0944J0475R581R447J0074J0385
59108G13926J0160J0212J0607J0451R676R316R696R855R180Q040O580M416J862
59095H23977l3j060k038l160l566k892j818q15K30R19L80j287k989m338n926p775
59079G87809r035r548j0169j1179j1852j1904j1906j1919j1233r836q713q248
59067F62267p741o830o013n505m953m484m584m807m227l231l180m057m364l580
59053E94711k864k813k536j654j287k119l159l320k843k360j866j320j005p73
59039E64792j74M82N47O24J918L866M513L659L400M843O573P268P716Q939J0411
59024F29377J1578J3375J6594K0091K2209K2825K2856K2717K2369K1791K0368
$$ y = [596773, 602230, 608431, 615470, 623632, 632739, 642519, 653020, 663964, 674439, 684020, 693467, 703541, 713926, 724086, 734298, 744905, 755356, 765032, 774348, 784044, 793899, 803079, 811119, 817699, 822115, 823977, 823944, 822884, 820846, 817686, 814120, 811228, 809410, 808595, 808825, 809744, 810124, 808837, 805848, 801510, 795584, 787809, 778774, 769226, 759057, 747878, 736026, 724122, 712216, 700297, 689064, 679228, 670515, 662267, 654526, 647696, 641683, 636178, 631225, 626741, 622157, 617350, 613123, 609892, 606712, 602655, 598291, 594711, 591847, 589034, 586498, 584844, 583557, 581438, 578279, 574959, 572116, 569756, 567890, 566570, 565565, 564792, 564618, 565100, 565647, 566271, 568189, 572055, 576568, 580227, 583627, 588470, 595043, 602311, 610027, 618966, 629377, 640955, 654330, 670924, 691015, 713224, 736049, 758905, 781622, 803991, 825782, 846150]
59013H46150J6919J1284M921p85n703r874j2572j3271j2397j0508p842n108l262
59000G97952j990K5K857M981N719O073O528N949L751J255k99j400k832m231n294
58985H19044o744q903j0760j1611j2112j2652j2317j0567q407o742n131l236j761
58972G08101q04Q35L471N477N884O081P387Q806R044Q916R713J0716J0445R147
58958H03219P932O541M037Q62j798l993o610r594j2134j3940j5051j5083j3963
58945G30425j2597j1680j0707r187p703o699n551l978k976l021k832j445k7op73
58930F51243j025r73j371j655j059m43r89k083k440k339k794l479l579l728m924
58915F18362o195n618l246r76J81Q38J495K008K585L664M917N695O277P332Q645
$$ y = [846150, 863069, 874353, 879274, 878489, 872786, 862912, 850340, 837069, 824672, 814164, 806322, 801214, 797952, 795962, 795987, 798844, 803825, 809544, 815617, 822145, 828094, 831845, 833100, 832801, 831401, 828569, 824338, 819044, 812300, 803397, 792637, 781026, 768914, 756262, 743945, 733378, 724971, 718229, 713098, 709862, 708101, 707297, 708132, 711603, 717080, 722964, 729045, 736432, 745238, 754282, 763198, 772911, 783627, 794072, 803219, 811151, 817692, 821729, 822591, 820793, 816800, 810190, 800596, 788462, 774522, 759471, 744388, 730425, 717828, 706148, 695441, 686254, 678551, 671852, 666301, 662323, 659347, 656326, 653494, 652049, 652022, 652016, 651243, 650218, 649245, 647874, 646219, 645160, 644717, 643728, 641645, 639205, 636866, 634072, 630593, 627014, 623286, 618362, 612167, 606549, 603303, 602327, 602508, 603346, 604841, 606849, 609434, 613098, 618015, 623710, 629987, 637319, 645964]
58900F45964R666J0734J2336J3752J3921J3127J2391J1737J0603R496R655J1336
58888G84718J3718J6193J8538K0258K1092K1617K2232K2012J9741J5634J0958
58877I86711O645L154Q03r26l441p206j0771j2858j4219j5981j7307j6500j3617
58864H84487j0349p898o452o071o590p260p713q645j0446j2224j3257j4130j5107
58851G58345j4905j2790j0358r245q485o315l407j887k064k551k950m005n617
58838F73766o954q230j0167j2019j2220j0790r178q057p091o468o604o689n441
58825E63858l236j699j319j195q51n93l43K64Q09O82M13R21J901K372K353K452
58809E66789K466J929J459J830K390K066J225Q72P28l2q61o43K12L93j62n98r66
$$ y = [645964, 655630, 666364, 678700, 692452, 706373, 719500, 731891, 743628, 754231, 763727, 773382, 784718, 798436, 814629, 833167, 853425, 874517, 896134, 918366, 940378, 960119, 975753, 986711, 993356, 996510, 997313, 996387, 992946, 985740, 974969, 962111, 947892, 931911, 914604, 898104, 884487, 874138, 866240, 859788, 853717, 847127, 839867, 832154, 823509, 813063, 800839, 787582, 773452, 758345, 743440, 730650, 720292, 711047, 702562, 696247, 692840, 690953, 688889, 686338, 683388, 679383, 673766, 666812, 658582, 648415, 636396, 624176, 613386, 604208, 596151, 589060, 582592, 575988, 569299, 563858, 560622, 558923, 557604, 556409, 555558, 554965, 554622, 554886, 555695, 556377, 556790, 557711, 559612, 561984, 564337, 566789, 569255, 571184, 572643, 574473, 576863, 578929, 580154, 581026, 581754, 581722, 580861, 580218, 580430, 580823, 580661, 580063, 579097]
58792E79097j789k460k061j170q67o71N17K098K595K216K426L460M411N237O448
58777E99487P339O840N671N405N771N172L420J601l28l288o687q772r323r683
58763F02625j0131r634q162o993o520n811m419k724o05K265M988O322O712P502
58749E75415Q488Q300O923N650M894M113L585M040M926N251N605P146R143R952
58735F63431R859J0367J1255J1141J0500J1165J2990J4003J3786J3801J4279J3732
58723H10309J1801R808Q254O413M578M035M678N281O108Q369J1096J1701R984
58710I12415Q471Q254P517M893J366k014n560r227j2031j4036j6631k0134k3305
58697H39978k5624k7661k8937k8072k5512k3421k2434k0983j8326j5560j3258
$$ y = [579097, 577308, 574848, 572787, 571617, 570750, 570079, 570596, 572694, 575289, 577505, 579931, 583391, 587802, 593039, 599487, 606826, 613666, 619337, 624742, 630513, 635685, 639105, 640706, 640378, 637090, 630403, 621631, 612308, 602625, 592494, 582860, 574698, 567705, 561185, 555374, 550955, 548231, 547626, 549891, 554879, 561201, 567913, 575415, 583903, 592203, 599126, 604776, 609670, 613783, 617368, 621408, 626334, 631585, 637190, 644336, 653479, 663431, 673290, 683657, 694912, 706053, 716553, 727718, 740708, 754711, 768497, 782298, 796577, 810309, 822110, 831918, 840172, 846585, 851163, 855198, 859876, 865157, 871265, 879634, 890730, 902431, 912415, 920886, 929140, 936657, 941550, 942916, 940902, 935342, 926115, 914084, 900048, 883417, 863283, 839978, 814354, 786693, 757756, 729684, 704172, 680751, 658317, 637334, 619008, 603448, 590190]
58686E90190j0841q635p767p613o279m089l408m499m786l215j924k403l130k528
58672E19073j425q73j29J619L652N274O958Q849J0090J0589J1466J2929J3720
58659F01792J3188J1833R544N705J369j339k356l576n299n856n139n183o526p250
58645F00907o617o316p034p050n537m088l648k988j599r56j456j210N53J876J517
58630E56354J039J766K462J883R32N33n8j276j987j725j659j996j113J428L714
58615E60297M680N626P194P893P153O742P494P625O038M310L610K695Q34l71p3
58600F31747p5j524k656k086j409k236l377l292k756k788k479j082J55M54J336
58585F07932L910O783Q632J0300J2398J3486J2750J1802J1827J1595J0331R630
$$ y = [590190, 579349, 570714, 562947, 555334, 549055, 544966, 541558, 537059, 532273, 529058, 527134, 524731, 521601, 519073, 517648, 516775, 516646, 518265, 521917, 527191, 534149, 542998, 553088, 563677, 575143, 588072, 601792, 614980, 626813, 636357, 642062, 643431, 642092, 639736, 636160, 630861, 625005, 619866, 614683, 608157, 600907, 594290, 587974, 580940, 573890, 568353, 564265, 560617, 557629, 556030, 555074, 553618, 552408, 552961, 554837, 556354, 557393, 559159, 561621, 563504, 564436, 564969, 564911, 563635, 561648, 559923, 558264, 556268, 555155, 556583, 560297, 564977, 570603, 577797, 585690, 592843, 599585, 607079, 614704, 620742, 625052, 628662, 631357, 632191, 631820, 631747, 631672, 630148, 627492, 625406, 623997, 621761, 618384, 615092, 612336, 609548, 607069, 605987, 606142, 606596, 607932, 611842, 618625, 627257, 637557, 649955, 663441, 676191, 687993, 699820, 711415, 721746, 731376]
58573G31376J0392J0841R906R659J1828J4757J6402J7685K0218K3347K6028K9071
58561I31510L2933L5902L6936L7655L9050L8993L5656L0631K5830K0224J2641
58550A277961N020l17m192q262j1667j3175j4308j7035k0317k2087k2813k4212
58538A124596k6262k8103l0023l2057l2720l1477l0156k9646k7819k3318j8491
58527H14524j5715j3711j0532p415o234n765m016j886j117q80K61J178L22j114
58513G47900j435j622l059m363l768k497k437k665j556k17m67j506j735j737k342
58498G16494k103j3J785J246j6K51R86L92k81P81K314K594L138N743Q488Q870
58482G50669Q547J0627J4434J7206J8983K1426K3802K4357K3940K4047K3152J9023
$$ y = [731376, 741768, 752609, 762515, 772174, 784002, 798759, 815161, 832846, 853064, 876411, 902439, 931510, 964443, 1000345, 1037281, 1074936, 1113986, 1152979, 1188635, 1219266, 1245096, 1265320, 1277961, 1282981, 1282664, 1278472, 1270210, 1258543, 1245368, 1231060, 1214025, 1193708, 1171621, 1148808, 1124596, 1098334, 1070231, 1040208, 1008151, 975431, 943954, 913798, 884152, 856333, 833015, 814524, 798809, 785098, 774566, 767151, 760917, 755152, 751136, 749250, 748133, 747253, 747514, 748692, 749014, 747900, 746465, 744843, 741784, 737421, 733653, 731156, 728719, 726054, 724498, 724281, 723814, 722308, 720573, 718836, 716494, 714391, 714378, 716163, 717409, 717393, 717644, 718630, 719022, 718741, 719522, 721836, 724430, 727568, 733311, 741799, 750669, 759216, 769843, 784277, 801483, 820466, 841892, 865694, 890051, 913991, 938038, 961190, 980213]
58470I80213J2936P543K467l955j0535j4939j7617k0011k0902j8659j5065j2718
58458H68758j0666o798k354L21K303N819R573J0904J0593J0898J0864Q232M072
58445I22519Q12k293p028j1636j3209j2697j2724j2549j0146o973n554m428r41
58432H23153L136M331L848N427Q747J0856J2435J6442K1875K5061K6028K7474
58420I88813K8311K4434J5560N642l015j0761j6556j8564j8250j8603j8995j6906
58408I41110j3610j2657j3729j3539j1897j1271j1362r801p253o203n646k771
58396H21371J112K223R37Q36K200K366J642K648M525M027J637N94O81q39l045
58381H42915k517P7R53K7L80J746J171n24L38L395M861M527N541P799Q319P608
$$ y = [980213, 993149, 1000692, 1003159, 999204, 988669, 973730, 956113, 936102, 915200, 896541, 881476, 868758, 858092, 851294, 848940, 849261, 851564, 857383, 866956, 877860, 888453, 899351, 910215, 918447, 922519, 923331, 921038, 914010, 902374, 889165, 876468, 863744, 851195, 841049, 834076, 828522, 824094, 823153, 826289, 830620, 834468, 839895, 848642, 859498, 871933, 888375, 910250, 935311, 961339, 988813, 1017124, 1041558, 1057118, 1062760, 1059745, 1048984, 1032428, 1013864, 995614, 977011, 958016, 941110, 927500, 914843, 901114, 887575, 875678, 864407, 853045, 843244, 835991, 829788, 824142, 821371, 822483, 824706, 825643, 826479, 828679, 831045, 832687, 835335, 839860, 843887, 845524, 846118, 846799, 845960, 842915, 840398, 840475, 841428, 841455, 841835, 843581, 844752, 844228, 844566, 847961, 852822, 857349, 862890, 870689, 879008, 886616]
58365H86616Q890J1505J1976J1022J2465J5732J6645J5221J5416J7418J7523J5418
58353A055847J4185J3406R765M306J520J379j94l116l253n30R44P80K487N813
58339A103339O913O162P707J1336J2829J2313J3942J7407J8290J6790J7319J9550
58327A263897J8756J5083J3289J3327J0588N672M066N737N026J502P74L685M867
58314A366269L246L642O749P739O280P580J2024J4065J2858J3492J6397J6275
58302A486616J3130J3204J7240J8939J6909J6822J9740J9921J6466J5455J8141
58291A672583J8760J6417J7137K1607K3138K0534K0660K5279K7887K6579K7344
58280A917925L1596L3324L1748L3615L9643M2150L9508L9241M3422M5088M2783
$$ y = [886616, 895506, 907011, 918987, 930009, 942474, 958206, 974851, 990072, 1005488, 1022906, 1040429, 1055847, 1070032, 1083438, 1093203, 1097509, 1099029, 1100408, 1100214, 1097098, 1093845, 1093315, 1094259, 1095039, 1097526, 1103339, 1110252, 1116414, 1124121, 1135457, 1148286, 1160599, 1174541, 1191948, 1210238, 1227028, 1244347, 1263897, 1282653, 1297736, 1311025, 1324352, 1334940, 1340612, 1344678, 1350415, 1355441, 1356943, 1357717, 1361402, 1366269, 1369515, 1373157, 1379906, 1387645, 1393925, 1401505, 1413529, 1427594, 1440452, 1453944, 1470341, 1486616, 1499746, 1512950, 1530190, 1549129, 1566038, 1582860, 1602600, 1622521, 1638987, 1654442, 1672583, 1691343, 1707760, 1724897, 1746504, 1769642, 1790176, 1810836, 1836115, 1864002, 1890581, 1917925, 1949521, 1982845, 2014593, 2048208, 2087851, 2130001, 2169509, 2208750, 2252172, 2297260, 2340043]
58269B340043M3980N0213N3625N2435N4659O2141O6530O5605O7632P4727P8281
58258C009871P5965P6421Q1709Q2367P5746P1514P3069P1584O4898O3450P0512
58247C817106P5731P5460P9830R1984J00736J02150J07564J21290J31797J34412
58237D838060J40863J56214J68712J73161J81476J98901K13241K19302K29927
58228F519857K50857K69427K80688K98706L28983L56589L75391M00951M40181
58219I521630M77738N07655N47342O04178O60785P10625P73942Q60405R52334
58210A5616634J044089J159255J308584J472617J647923J865700K141256K454219
58202B8710277K805189L239903L791155M457240N269343O314530P657677R313380
$$ y = [2340043, 2384023, 2434236, 2487861, 2540296, 2594955, 2657096, 2723626, 2789231, 2856863, 2931590, 3009871, 3085836, 3162257, 3243966, 3326333, 3402079, 3473593, 3546662, 3618246, 3683144, 3746594, 3817106, 3892837, 3968297, 4048127, 4140111, 4240847, 4342997, 4450561, 4571851, 4703648, 4838060, 4978923, 5135137, 5303849, 5477010, 5658486, 5857387, 6070628, 6289930, 6519857, 6770714, 7040141, 7320829, 7619535, 7948518, 8305107, 8680498, 9081449, 9521630, 9999368, 10507023, 11054365, 11658543, 12319328, 13029953, 13803895, 14664300, 15616634, 16660723, 17819978, 19128562, 20601179, 22249102, 24114802, 26256058, 28710277, 31515466, 34755369, 38546524, 43003764, 48273107, 54587637, 62245314, 71558694]
58194G1558694J1330942J3822385J6866751K0476157K4657284K9312448L3993721
58187B22018382L7961724M0595387M1411585L9391396L2745507K0262572L237567
58180D37624120j4427858k8560756l7199632m0871265m1044827l8874425l5164702
58173B01480655l0711137k6215057k2052522j8349370j5178706j2566065j0426967
58166F5980831q647335p183702o016229n073764m280197l620173l096238k669655
58158B5393538k297937j985438j745971j554418j379591j227891j113212j017475
58150A3071605r18851q27579p58515o97442o27322n60218n12081m71800m24406
58141G273391l80056l51977l29128k97919k69041k56729k51697k39301k25109
$$ y = [71558694, 82889636, 96712021, 113578772, 134054929, 158712213, 188024661, 222018382, 259980106, 300575493, 341987078, 381378474, 414123981, 434386553, 437624120, 423196262, 394635506, 357435874, 316564609, 275519782, 236645357, 201480655, 170769518, 144554461, 122501939, 104152569, 88973863, 76407798, 65980831, 57333496, 50149794, 44133565, 39059801, 34779604, 31159431, 28063193, 25393538, 23095601, 21110163, 19364192, 17809774, 16430183, 15202292, 14089080, 13071605, 12152754, 11325175, 10566660, 9869218, 9241896, 8681678, 8169597, 7697797, 7273391, 6893335, 6541358, 6212230, 5914311, 5645270, 5388541, 5136844, 4897543, 4672434]
58132D672434k18925k12243j94652j75300j66060j59725j45642j30836j25313
58123C143738j21949j10868r9028r6199r5626q7486p8041p6928p8276p2419o4309
58112B162609o2824o3298n7635n0784n0709n2469m8108m2375m3122m5879m2905
58101A602501l8218l9023m1338l8294l3884l4631l6257l2113k6509k6321k7642
58090A228271k3760j8342j7853j8682j4529r104q969j1017r212o728r329j3644
58078A067102j3781j2890j6553k1311k1241j9444k1589k4495k2454j8726j9394
58067H55224k1651j9474j5261j4695j5497j2355p812p407q893o924l741m706p836
58054G08972q041p239j0049j3811j3033r637q923r485o918l495m200o936o330
$$ y = [4672434, 4453509, 4241266, 4046614, 3871314, 3705254, 3545529, 3399887, 3269051, 3143738, 3021789, 2910921, 2811893, 2715694, 2620068, 2532582, 2454541, 2377613, 2299337, 2226918, 2162609, 2099785, 2036487, 1978852, 1928068, 1877359, 1824890, 1776782, 1734407, 1691285, 1645406, 1602501, 1564283, 1525260, 1483922, 1445628, 1411744, 1377113, 1340856, 1308743, 1282234, 1255913, 1228271, 1204511, 1186169, 1168316, 1149634, 1135105, 1126001, 1117032, 1106015, 1096803, 1090075, 1080746, 1067102, 1053321, 1040431, 1023878, 1002567, 981326, 961882, 940293, 915798, 893344, 874618, 855224, 833573, 814099, 798838, 784143, 768646, 756291, 748479, 741072, 732179, 725255, 721514, 716808, 708972, 700931, 693692, 683643, 669832, 656799, 647162, 638239, 628754, 621836, 618341, 614141, 607205, 600875]
58041F00875l755m106o156n490l573m630o886o075m284o157r538r138o454o815
58027E17818r396r352p295p604r604r196p151p265q413o798l925m111o084n308
58013D16316k567k152l448k466O1J08j764j716k04n85j879n48K140K042o0n4J673
57996D04897J431k63J94K107J646p53j242K17L99n69J0J297L93j414p35Q83q49
57979D07649m932o341m498l476m409m618l784m293n727n275l311k630k830j420
57965C50105N21j12k194j883M91J312M60R24K534K461J128J325K182M43k963m044
57949C52690k797k712l828k872N6J451J001J805M126N122M785N980Q603R753R598
57934C92761J0955J3279J3323J1593J1692J3218J1958P451L780K275k1l767n791
$$ y = [600875, 597120, 593014, 586858, 581368, 577795, 573165, 566279, 560204, 555920, 549763, 540225, 531087, 524633, 517818, 508422, 499070, 491775, 484171, 474567, 465371, 458220, 450955, 442542, 435744, 431819, 427708, 421624, 416316, 413749, 411597, 408149, 405683, 405744, 405852, 404088, 402372, 402168, 401583, 399704, 399156, 401296, 403338, 403278, 403224, 404897, 406328, 406065, 406259, 408366, 410012, 409259, 408017, 408234, 408633, 408064, 408074, 409371, 409764, 408350, 407615, 408498, 407649, 402717, 396376, 391878, 388402, 383993, 379375, 375591, 371298, 365571, 360296, 356985, 354355, 351525, 350105, 350626, 350514, 348320, 346437, 346928, 348240, 348700, 349624, 352158, 354619, 355747, 357072, 359254, 359697, 356734, 352690, 349893, 347181, 343353, 340481, 340537, 341988, 342989, 344794, 348920, 354042, 358827, 364807, 373410, 383163, 392761, 403716, 416995, 430318, 441911, 453603, 466821, 478779, 486230, 490010, 492285, 492264, 488497, 482706]
57921D82706n360n796q356j0252j0119r928j0245r040o451n356n994n215k263
57908C88331j00J48P71K379K501O29m94l8n93l103n079n314n560o294n460k901
57892C59823j373j700j440L65J525J134J135K186K311J008M21J130R83o21j476
57877C65411q38q41k377l574l483l390l551k573q01l32r99n06J000J007l23M5
57861C43875K498M061L997M941P375Q278O804O039P322P876O166M595M611L928
57847D22366J174j273j672j980l863n672n943o158p458q193p216o240o570o807
57833C54495n852m981m876m048k150j375k500l022j369M53O47O83K190L960M393
57818C36648M156M171L689K312J349J328P44j194l264m886p086r596j0350r178
$$ y = [482706, 477346, 471550, 463194, 452942, 442823, 432895, 422650, 413610, 407159, 401803, 395809, 390594, 388331, 388231, 388379, 389150, 391529, 394030, 394659, 394165, 394127, 393534, 390431, 385352, 380038, 374478, 368184, 362724, 359823, 358450, 356750, 355310, 355675, 357200, 358334, 359469, 361655, 363966, 364974, 365395, 366525, 367508, 366887, 365411, 364573, 363732, 361355, 357781, 354298, 350908, 347357, 344784, 343983, 343651, 342652, 342146, 343146, 344153, 343830, 343875, 346373, 350434, 354431, 359372, 366747, 375025, 381829, 387868, 395190, 403066, 409232, 413827, 418438, 422366, 423540, 422267, 420595, 418615, 414752, 409080, 403137, 396979, 389521, 381328, 374112, 367872, 361302, 354495, 348643, 343662, 338786, 334738, 332588, 331213, 328713, 325691, 324322, 324775, 325422, 326105, 328295, 332255, 336648, 340804, 344975, 348664, 350976, 352325, 353653, 354397, 353203, 349939, 345053, 337967, 328371, 318021, 308843]
57804C08843q589r404r188o641l933k767j766K29J774J876K033L070L346K234
57790B81117J984L785N355M902M188N130O445O454O240P241Q339Q111P515P817
57776C64623Q100P284O334O217N881M341K594J463j01k649m613m928m917n759
57762C83870o555o650p213q687r330q201o886o503n775l904k349j825o52J758
57748C11098K962J522r9O30K453L025K701K810K710J520N29J037J819J358N37
57733C36612O41Q38L3q25o97n67j347j816r44l3l67r68q78j205k602l299k142
57716C20434j005j630k601k191j531k091k631j793j263k986n382n751m509l721
57702B81349l271j919m58m36j104q60l39r29j629o33J151J300l27j891k684l196
$$ y = [308843, 300254, 290850, 281662, 275021, 271088, 268321, 266555, 266784, 268558, 270434, 272467, 275537, 278883, 281117, 283101, 286886, 292241, 297143, 301331, 306461, 312906, 319360, 325600, 332841, 341180, 349291, 356806, 364623, 372723, 380007, 386341, 392558, 398439, 402780, 405374, 406837, 406736, 404087, 399474, 394546, 389629, 383870, 377315, 370665, 363452, 354765, 345435, 337234, 330348, 323845, 318070, 314166, 311817, 309992, 309340, 311098, 314060, 315582, 315483, 316113, 318566, 321591, 324292, 327102, 329812, 331332, 331861, 332898, 334717, 336075, 336612, 337253, 338091, 338124, 337299, 336602, 336035, 334688, 332872, 331928, 331895, 331528, 330560, 329682, 328477, 325875, 322576, 320434, 319429, 317799, 315198, 313007, 311476, 309385, 306754, 304961, 303698, 300712, 295330, 289579, 285070, 281349, 278078, 276159, 275701, 275265, 274161, 273301, 272962, 272033, 270404, 269771, 270922, 272222, 271895, 270004, 267320, 264124]
57686B64124l114k034j185j798k648j749M93K312L565N246P186Q817J1116J5225
57672C05556K0203K4652K9469L6379M4644N1846N6973O0042N9307N1497L4881
57661G75449J0755j7020m2452n9182o4661o2043n6357m9926m2864l5869k9773
57650C26057k3970j7894j2871j0148q516o257m020l212l095k136q61n72n27P46
57636B32724K506L004K544K542K676J783N75N56J102N52o42o50M49R56N15K08
57620B51400K41k6k62K60R51R02P18J183J286r6j753j998j661k445l587l144j623
57603B40346j197k078k723k925l661m505m201l289l254l691l148k133k241k933
57589A98367k383j027r68k192k651k004j972k907l206k439k026k382k240j216
$$ y = [264124, 261010, 258976, 257791, 255993, 253345, 251596, 252089, 254401, 257966, 263212, 270398, 279215, 290331, 305556, 325759, 350411, 379880, 416259, 460903, 512749, 569722, 629764, 689071, 740568, 775449, 786204, 769184, 726732, 667550, 602889, 540846, 484489, 434563, 391699, 355830, 326057, 302087, 284193, 271322, 261174, 252658, 246401, 242381, 239169, 236074, 233938, 233077, 232505, 231978, 232724, 235230, 238234, 240778, 243320, 245996, 247779, 248354, 248910, 250012, 250564, 249922, 249272, 249721, 250677, 251192, 251400, 251641, 251615, 251353, 251613, 252564, 253466, 254184, 255367, 256653, 256557, 254804, 252806, 251145, 248700, 245113, 241969, 240346, 239149, 237071, 234348, 231423, 227762, 223257, 219056, 215767, 212513, 208822, 205674, 203541, 201300, 198367, 195984, 194957, 193989, 191797, 189146, 187142, 185170, 182263, 179057, 176618, 174592, 172210, 169970, 168754]
57575A68754m82m85m41k85p41j399j104k88m77j535j871j279r53q22L44K091K485
57558A61512J370O81J098J197M11J06R80J865J968K061K648K955K485J763J052
57543A84152M3r06j009o22q64j551j405k70P52J249J646J648O51n37n36K30K05
57526A82876n20m83L48N94J64L89J353J713J283J290J822J635O94M16J119J629
57510A96322J676K164K896K572J398J049J707J767Q84O02J362J610O24l54o16
57495B15663j167k506l565l660l366k796j287N56R35l15j279j052r14j575j811
57480A91861q13L80Q65J174J588J344M04l6K27j90j685k694k315j725j877j909
57464A84599j052j45O7L09J183J868J594R51O53M91K76L56N02o6r47o91P04J398
$$ y = [168754, 168272, 167787, 167346, 167061, 166320, 164921, 163817, 163529, 163052, 161517, 159646, 158367, 157414, 156592, 156936, 159027, 161512, 162882, 163563, 164661, 165858, 166269, 166375, 167355, 169220, 171188, 173249, 175897, 178852, 181337, 183100, 184152, 184195, 183289, 182280, 181658, 180794, 179243, 177838, 177568, 178320, 179569, 181215, 182863, 183514, 182977, 182441, 182671, 182876, 182356, 181873, 182221, 182815, 182979, 183368, 184721, 186434, 187717, 189007, 190829, 192464, 193158, 193574, 194693, 196322, 197998, 200162, 203058, 205630, 207028, 208077, 209784, 211551, 212435, 213037, 214399, 216009, 216633, 216279, 215663, 214496, 211990, 208425, 204765, 201399, 198603, 197316, 197872, 198807, 198492, 197213, 196161, 195247, 193672, 191861, 191048, 191428, 192293, 193467, 195055, 196399, 196803, 196767, 196994, 196804, 195119, 192425, 190110, 188385, 186508, 184599, 183547, 183402, 183469, 183778, 184961, 186829, 188423, 189374, 190027, 190518, 190794, 191150, 191652, 191586, 190639, 189948, 190652, 192050]
57446A92050N76l50k71l4l88m37N78J647J601Q49L70K71M25J114K093K332J578
57429B04004Q72P89O22n6n17k85N3J76O35J529K072J991J910J924J460Q19J003
57412B19001J679J415K52j22O82J085N14M92J720K544J702L42j40k13o51q23r4
57395B29385P78J069J400K264K835K482J942J867J776J475J833L037L807L506
57381B59456L281L895M278L476K286J652J148L68N3M84M64o55j604j258l94o8
57365B76862J83R32J429J077P45J110J290O74M81J732L198L219K300K026K517
57350B99775K774K689K970L744M532N036M985M063K812K504L255L571K628J512
57336C46850J298J469J398J748L067M432M872M774M653L976K549J586J990K860
$$ y = [192050, 192626, 192276, 192005, 191971, 191583, 191146, 191724, 193371, 194972, 195821, 196191, 196462, 196887, 198001, 200094, 202426, 204004, 204876, 205665, 206287, 206231, 205714, 205429, 205482, 205658, 206293, 207822, 209894, 211885, 213795, 215719, 217179, 217998, 219001, 220680, 222095, 222347, 222225, 222907, 223992, 224506, 224998, 226718, 229262, 230964, 231306, 231166, 230953, 230302, 229479, 229385, 230163, 231232, 232632, 234896, 237731, 240213, 242155, 244022, 245798, 247273, 249106, 252143, 255950, 259456, 262737, 266632, 270910, 274386, 276672, 278324, 279472, 279840, 279893, 280377, 280841, 280186, 278582, 277324, 276930, 276862, 277045, 277977, 279406, 280483, 281228, 282338, 283628, 284302, 284783, 286515, 289713, 292932, 295232, 297258, 299775, 302549, 305238, 308208, 311952, 316484, 321520, 326505, 330568, 333380, 335884, 339139, 342710, 345338, 346850, 348148, 349617, 351015, 352763, 355830, 360262, 365134, 369908, 374561, 378537, 381086, 382672, 384662, 387522]
57322C87522L033K793K799K734K285K095K464K499J764J304J810K384K305K343
57308D20134K980L186K474K270L535M856M722L984M072M458M026L442L980N183
57294D73302N876O299P162P691O823N398N103N973O856P557Q681J0007J0814J1216
57280E78758J1600J1525J0590R557R129Q679P614O854P284P900P253N806N040
57267F87589N180N430N528N517M975M067M221O023P576O892M861L990N086P006
57253G63941Q767J0056J0445R998R945J1016J2082J1959J1564J2399J3963J4720
57241I00855J4752J5300J6306J6606J6148J6048J6697J7438J7898J8210J8340
57230A084598J8420J9135K0599K1610K1277K0402K0109K0189K0144K0555K1883
$$ y = [387522, 390555, 393348, 396147, 398881, 401166, 403261, 405725, 408224, 409988, 411292, 413102, 415486, 417791, 420134, 423114, 426300, 428774, 431044, 434579, 439435, 444157, 448141, 452213, 456671, 460697, 464139, 468119, 473302, 479178, 485477, 492639, 500330, 507153, 512551, 517654, 523627, 530483, 538040, 546721, 556728, 567542, 578758, 590358, 601883, 612473, 622030, 631159, 639838, 647452, 654306, 661590, 669490, 676743, 682549, 687589, 692769, 698199, 703727, 709244, 714219, 718286, 722507, 728530, 736106, 742998, 747859, 751849, 756935, 763941, 772708, 782764, 793209, 803207, 813152, 824168, 836250, 848209, 859773, 872172, 886135, 900855, 915607, 930907, 947213, 963819, 979967, 996015, 1012712, 1030150, 1048048, 1066258, 1084598, 1103018, 1122153, 1142752, 1164362, 1185639, 1206041, 1226150, 1246339, 1266483, 1287038, 1308921]
57219A308921K3187K3601K3843K4658K5253K5014K5221K6990K9020K9524K9073
57208A594305K9248K9804K9586K9022K9211K9601K9145K8700K9639L0958L0640
57197A919859K9217K9188L1175L3330L4292L4387L4049L3458L3521L5023L6905
57186B284404L7478L6969L6919L7511L7699L7491L7811L8420L8199L7360L7211
57175B697472L7872L8286L8299L8747L9630M0101L9972L9593L8711L7145L5955
57164C121783L5985L6088L4849L3201L2997L3763L3458L1926L0913L0924L0649
57153C486536K9522K8368K7517K6393K5065K4221K3717K2944K2283K2340K2295
57142C761201K1091J9688J9905K1533K2881K3709K5181K7314K8907K9908L1418
$$ y = [1308921, 1332108, 1355709, 1379552, 1404210, 1429463, 1454477, 1479698, 1506688, 1535708, 1565232, 1594305, 1623553, 1653357, 1682943, 1711965, 1741176, 1770777, 1799922, 1828622, 1858261, 1889219, 1919859, 1949076, 1978264, 2009439, 2042769, 2077061, 2111448, 2145497, 2178955, 2212476, 2247499, 2284404, 2321882, 2358851, 2395770, 2433281, 2470980, 2508471, 2546282, 2584702, 2622901, 2660261, 2697472, 2735344, 2773630, 2811929, 2850676, 2890306, 2930407, 2970379, 3009972, 3048683, 3085828, 3121783, 3157768, 3193856, 3228705, 3261906, 3294903, 3328666, 3362124, 3394050, 3424963, 3455887, 3486536, 3516058, 3544426, 3571943, 3598336, 3623401, 3647622, 3671339, 3694283, 3716566, 3738906, 3761201, 3782292, 3801980, 3821885, 3843418, 3866299, 3890008, 3915189, 3942503, 3971410, 4001318, 4032736]
57131D032736L3401L4619L4720L4460L4030L3055L1924L1338L1166L1497L3968
57120D396914L9890M7910N5617O2515O9290P5443Q0287Q5217R2392J02173J14365
57109E222013J30592J52460J78577K06614K37355K73671L16834L67308M28289
57100G513713N04983O01193P19724Q65137J042834J256400J508518J802245K137592
57091A7952339K508298K905264L320532L744267M161425M555972M914506N221210
57083D9283813N455726N601428N641640N527250N154830M411218L265567J816842
57075H6158314K45565j275631k629874l750687m607518n202843n564284n725694
57067E7647348n715294n558906n284738m921230m495259m034538l566959l114898
$$ y = [4032736, 4066137, 4100756, 4135476, 4169936, 4203966, 4237021, 4268945, 4300283, 4331449, 4362946, 4396914, 4436804, 4484714, 4540331, 4602846, 4672136, 4747579, 4827866, 4913083, 5005475, 5107648, 5222013, 5352605, 5505065, 5683642, 5890256, 6127611, 6401282, 6718116, 7085424, 7513713, 8018696, 8619889, 9339613, 10204750, 11247584, 12503984, 14012502, 15814747, 17952339, 20460637, 23365901, 26686433, 30430700, 34592125, 39148097, 44062603, 49283813, 54739539, 60340967, 65982607, 71509857, 76664687, 81075905, 84341472, 86158314, 86403879, 85128248, 82498374, 78747687, 74140169, 68937326, 63373042, 57647348, 51932054, 46373148, 41088410, 36167180, 31671921, 27637383, 24070424, 20955526]
57059B0955526k692352k307917j967162j671546j418531j204395j025464q76966
57051G791193p53347o50334n64967m93894m33494l81542l37115k99213k66736
57042C610551k39113k15514j94344j74731j57332j42428j28700j15099j02217
57033B141073r0349p8221o5038n1676l8239k3023n628J1638K7179M0838M8166
57022A916720L8642N907m1672q5881j13827j24690j23520j14546j01278q7610
57012A168245p5819o5684n6868n0087m5299m1070l6625l2637k9581k6936k4402
57001F83237k2262k0418j8601j7428j7645j8528j8606j7691j6594j5265j3038
56990D87161j0323q127o182l376J99L368N853Q286J0438J1100R637O177O56o598
$$ y = [20955526, 18263174, 15955257, 13988095, 12316549, 10898018, 9693623, 8668159, 7791193, 7037846, 6387512, 5822545, 5328651, 4895157, 4513615, 4176500, 3877287, 3610551, 3371438, 3155924, 2961580, 2786849, 2629517, 2487089, 2358389, 2243290, 2141073, 2050724, 1972503, 1907465, 1855789, 1817550, 1794527, 1788899, 1800537, 1827716, 1868554, 1916720, 1955362, 1961269, 1919597, 1833716, 1719889, 1595199, 1471679, 1357133, 1255855, 1168245, 1092426, 1026742, 969874, 919787, 874488, 833418, 796793, 764156, 734575, 707639, 683237, 660975, 640557, 621956, 604528, 586883, 568355, 549749, 532058, 515464, 500199, 487161, 476838, 468711, 462529, 459153, 459352, 462720, 468573, 476859, 487297, 498397, 508034, 514211, 514867, 508269]
56976E08269j3637j8005j9164j8455j7003j5058j3005j1298r609p374m971l112
56964C57578j477P66L597O548R753J3239J6048J7493J8446J9599J9290J5031O742
56951E02653l204j2649k0524k5688k7081k5154k1632j7820j4207j1157q578n458
56939C09501j203L099O152Q464J1413J5000J8277K1309K4879K8502L0400K9097
56927E04890K3772J3785k74j5330k7303l3937l5426l3146k9013k5155k2502k0136
56915C00225j7194j4425j2717j1378r536p962p644p699o708n128m281l979l263
56902A88311k602l046m004m108l618l704m027l360j961j009j43K055N577R200
56888A73561J2715J6686K0483K2862K3995K4574K3343J8204R592M70o931j2068
$$ y = [508269, 494632, 476627, 457463, 439008, 422005, 406947, 393942, 382644, 373035, 365661, 360690, 357578, 356101, 356867, 360464, 367012, 376765, 390004, 406052, 423545, 441991, 461590, 480880, 495911, 502653, 499449, 486800, 466276, 440588, 413507, 388353, 366721, 348901, 334694, 323537, 314959, 309501, 308298, 311397, 317549, 326013, 337426, 352426, 370703, 392012, 416891, 445393, 475793, 504890, 528662, 542447, 542173, 526843, 499540, 465603, 430177, 397031, 368018, 342863, 320361, 300225, 283031, 268606, 255889, 244511, 234975, 227013, 219369, 211670, 204962, 199834, 195553, 191574, 188311, 185709, 182663, 178659, 174551, 170933, 167229, 163202, 159842, 157881, 156872, 156729, 158784, 164361, 173561, 186276, 202962, 223445, 246307, 270302, 294876, 318219, 336423, 346015, 346485, 339554, 327486]
56876C27486j4360j3217r938o924m702j906J853N384Q301J1681J6000K0599K5387
56863C65644L1085L7514M3505M8617N3051N5834N4759M8080L4905J5078q943l0944
56851G48185m4795m9641m9082m5773l9640l1019k1962j3732n774K154R356J6237
56839D74514K4456L4507M5350N6661O8795Q0282Q8143R1083Q9376Q0954O1256
56828A195377K8960j0287m7354p5161r0456r3347q7169p6940o5931n4521m2706
56817E80465l1709k2239j3240l737N743J4619K3601L3440M3659N3221O1167O5955
56805H10945O5588N8734M4660K2600o284l6293n9465p1696p4773p2183o5662n6585
56793E59586m7442l9732l2454k4449j6581j0126m647J015P095J3422K0159K6751
$$ y = [327486, 313126, 299909, 289971, 283047, 278345, 276439, 278292, 283676, 291977, 303658, 319658, 340257, 365644, 396729, 434243, 477748, 526365, 579416, 635250, 690009, 738089, 772994, 788072, 779129, 748185, 703390, 653749, 604667, 558894, 519254, 488235, 466273, 452541, 446767, 448921, 458277, 474514, 498970, 533477, 578827, 635488, 704283, 784565, 872708, 963791, 1053167, 1134121, 1195377, 1224337, 1214050, 1166696, 1091535, 1001079, 907732, 820563, 743623, 677692, 623171, 580465, 548756, 526517, 513277, 509540, 515283, 529902, 553503, 586943, 630602, 683823, 744990, 810945, 876533, 935267, 979927, 1002527, 996243, 959950, 900485, 828789, 754016, 681833, 616171, 559586, 512144, 472412, 439958, 415509, 398928, 388802, 384155, 385170, 392265, 405687, 425846, 452597]
56781D52597L1670L4180L4829L3196K6990J4819j484j8329l2765m2653m6573m5186
56769D41291m1361l7438l3429k8788k4366k1294j9204j7007j4465j1950r507p176
56757A75306n425m452l877l525l589l736l302k589k534k927k578j439p41p32l54
56742A33506M57M10o26j047l41r6j175k108j650p62n81n02K44R36Q31N76P21M63
56724A29256o56j424q03L98J057J394J842J829J048M35N88O85J57j69K05L19l59
56707A35802p05R7J079J351J637K474K799J926J043J043Q12n35j571r02K25r7
56691A46478j302j586r72p36q39l21N02N05j29k57K07M02J68N1J00R7L34R02R81
56672A44585R4p94p51m28p27j002j63J329K198K310K304K137J487R64J313K026
$$ y = [452597, 484267, 518447, 553276, 586472, 613462, 628281, 626797, 608468, 575703, 533050, 486477, 441291, 399930, 362492, 329063, 300275, 275909, 254615, 235411, 218404, 203939, 191989, 182482, 175306, 169881, 165429, 161552, 158027, 154438, 150702, 147400, 144811, 142277, 139350, 136772, 135333, 134592, 133860, 133506, 133963, 134373, 133747, 132700, 132359, 132263, 131088, 128980, 127330, 126568, 125987, 125485, 125729, 126665, 127496, 128072, 128793, 129256, 128600, 127176, 126373, 126771, 127828, 129222, 131064, 132893, 133941, 134376, 134964, 135649, 135806, 135637, 135842, 136161, 135802, 135097, 135194, 136273, 137624, 139261, 141735, 144534, 146460, 147503, 148546, 149358, 148823, 147252, 146350, 146575, 146478, 145176, 143590, 142618, 141882, 141043, 140722, 141224, 141729, 141600, 141343, 141550, 141952, 142120, 142171, 142271, 142368, 142702, 143604, 144585, 144679, 143885, 143134, 142706, 141979, 140977, 140814, 142143, 144341, 146651, 148955, 151092, 152579, 153543, 154856, 156882]
56656A56882K084J521J065R22J001J572K565L144K944K758K999K706J277j26k02
56641A83112O14J223J530J691J061n54j846j818j418j903k771k959k849l274l645
56626A66194k931j592p45l32K02L73m77j586j784j313j116j099o65o8K16N87J302
56609A55166J471N57j77N48J880K205J642J376J461J065K20m29q78j304j230n25
56593A63048k36r40j457p35K62K20k83r0L26k4n08J3J039J409J384J738J898J107
56575A68171L86J032K213K310J768K126L124L239K572K711M090N688P076Q709
56561B15215J0582J2338J4288J6583J8145J7999J6773J5054J1744O199P93j421
56549C54292p29J46O6k4J06m05j452k060k374l250m263m411m252m997o129o398
$$ y = [156882, 158966, 160487, 161552, 162474, 163475, 165047, 167612, 170756, 173700, 176458, 179457, 182163, 183440, 183314, 183112, 183726, 184949, 186479, 188170, 189231, 188677, 186831, 185013, 183595, 181692, 178921, 175962, 173113, 169839, 166194, 163263, 161671, 160926, 160594, 160796, 161169, 160692, 159106, 157322, 156009, 154893, 153794, 153129, 153061, 153277, 153864, 155166, 156637, 157194, 157017, 157565, 159445, 161650, 163292, 164668, 166129, 167194, 167414, 166985, 166107, 164803, 163573, 163048, 162812, 161872, 160415, 159680, 159942, 160162, 159879, 159789, 160115, 160091, 159583, 159596, 160635, 162044, 163428, 165166, 167064, 168171, 168557, 169589, 171802, 174112, 175880, 178006, 181130, 184369, 186941, 189652, 193742, 199430, 206506, 215215, 225797, 238135, 252423, 269006, 287151, 305150, 321923, 336977, 348721, 354920, 355713, 354292, 353563, 353709, 353775, 353751, 353857, 353452, 352000, 349940, 347566, 344316, 340053, 335642, 331390, 326393, 320264, 313866]
56533C13866o410p569r149r271q303q242r109r030p832p345p975q023o793n548
56519B03267m874l888k508j953k342k257j235m15k34K03J010J069K54j47L01N37
56503A86788J32m7K66K48k24l01ll07j137j341q76r20j510j291L0J078J068O72
56485A82325L54j75n45R4J197J273L73L4N22M88l15m07P26J612J276O08N09O02
56467A90551N47Q02J398J628J442J549J825J289m6j079j515k048k508j834j53
56452A91848J018R89N27J90j65k32N25J506J730J712K490L227K212K0j053o58
56436B05886o47j577j867r54l20o91q35kQ76J162J369J453N45r95j589j036p49
56419B00029j101r50j82p6o81n44M22O24m6K62J902K714J615K47j8j4m17k55P85
$$ y = [313866, 307456, 299887, 290738, 281467, 273164, 264922, 255813, 246783, 238951, 231606, 223631, 215608, 208815, 203267, 198393, 194505, 191997, 190044, 187702, 185445, 184210, 183795, 183561, 183764, 184774, 185843, 186097, 185950, 186251, 186788, 186920, 186873, 187139, 187387, 187163, 186862, 186859, 186552, 185415, 184074, 183198, 182278, 180768, 179477, 179507, 180585, 181653, 182325, 182679, 182504, 181959, 182053, 183250, 184523, 184896, 184930, 185452, 185940, 185625, 185218, 185944, 187556, 188832, 189440, 189949, 190551, 191098, 191900, 193298, 194926, 196368, 197917, 199742, 201031, 200985, 199906, 198391, 196343, 193835, 192001, 191848, 192866, 193855, 194382, 194572, 194407, 194175, 194700, 196206, 197936, 199648, 202138, 205365, 207577, 207597, 206544, 205886, 205239, 203662, 201795, 200841, 200521, 199830, 198995, 198993, 199869, 201031, 202400, 203853, 204398, 203403, 201814, 200778, 200029, 198928, 197978, 197796, 197720, 197039, 196495, 196917, 197541, 197495, 197757, 199659, 202373, 203988, 204235, 204217, 204203, 203786, 203531, 204316]
56400B04316J172J91n43K14J359J598J489J855K109J578Q07L43j95r44j310j315
56384B12724j674k079j393J00P97M69M63R78Q16J84Q01K607L430K693K269K747
56368B25932K224Q2j351n71O62N30k6M56J396J718J738J826J354L50Q9P93J028
56351B38230L78K41R87J086J07k81N16Q70K48M49K038K854J847J134K263L561
56335B56528L371K906L568M279L890L498M069M342L366K613L207L637K542J260
56321C03076J219J261L4j332j377r86j467k015j398k57L84R14J634J552M46j17
56305C01571N71J183J221K206M297M972L154J473K021L098K598J454J011K13j671
56290C29372k572j002R53J038M72J114J956J661J684L433N025M416L196L673M724
$$ y = [204316, 205488, 205679, 205136, 205350, 206709, 208307, 209796, 211651, 213760, 215338, 216145, 216488, 216293, 215349, 214039, 212724, 211050, 208971, 207578, 207678, 208475, 208944, 209407, 210385, 211201, 211385, 212186, 214793, 218223, 220916, 223185, 225932, 228156, 228238, 226887, 226316, 226978, 227508, 227482, 227938, 229334, 231052, 232790, 234616, 235970, 236320, 236409, 237202, 238230, 238608, 238849, 239836, 240922, 241029, 240748, 241264, 242134, 242382, 242831, 244869, 247723, 249570, 250704, 252967, 256528, 259899, 262805, 266373, 270652, 274542, 278040, 282109, 286451, 289817, 292430, 295637, 299274, 301816, 303076, 304295, 305556, 305590, 304258, 302881, 301895, 300428, 298413, 297015, 296758, 297142, 298056, 299690, 301242, 301688, 301571, 302142, 303325, 304546, 306752, 311049, 316021, 319175, 320648, 322669, 325767, 328365, 329819, 330830, 331043, 329372, 326800, 325798, 326751, 327789, 328261, 329375, 331331, 332992, 334676, 338109, 343134, 347550, 350746, 354419, 359143]
56275C59143M278L441M290N737N576M668N214O578O644N786N830O510O430O139
56261D36264P011Q464R362J0537J2950J5230J6120J7311K0637K4535K6724K8263
56249F33408L1389L5323L8034M0188M3538M7090M8718M8983M9651M9996M8299
56238A114617M5359M2778L9368L3131K5238J8143J1287K598p045j4898k0747k6403
56226A263426l1881l5731l8141m0223m1388m0706l9562l9597l9529l7394l4290
56215H44984l2335l0819k7981k4848k3395k2610k0390j7593j6329j5836j4198
56204E98650j2292j1895j1701r562o962o669p614o755m498l517l579k403n10l16
56190E10377j415j376l92m39q98L94K606L046J908J428J454L49q36J29K133K486
$$ y = [359143, 363421, 366862, 371152, 376889, 382465, 387133, 392347, 398925, 405569, 411355, 417185, 423695, 430125, 436264, 443275, 451739, 461101, 471638, 484588, 499818, 515938, 533249, 553886, 578421, 605145, 633408, 664797, 700120, 738154, 778342, 821880, 868970, 917688, 966671, 1016322, 1066318, 1114617, 1159976, 1202754, 1242122, 1275253, 1300491, 1318634, 1329921, 1332519, 1325474, 1310576, 1289829, 1263426, 1231545, 1195814, 1157673, 1117450, 1076062, 1035356, 995794, 956197, 916668, 879274, 844984, 812649, 781830, 753849, 729001, 705606, 682996, 662606, 645013, 628684, 612848, 598650, 586358, 574463, 562762, 553200, 546238, 539569, 531955, 525200, 520702, 517185, 513606, 511203, 510693, 510377, 508962, 507586, 507194, 506755, 505857, 506251, 508857, 511903, 513811, 515239, 516693, 517042, 516206, 516335, 518468, 520954]
56174E20954J973L288N613N911M598M642N906N747M491M885O657O949N892O453
56160E93959Q943J0730J1197J2126J3442J3469J3059J4641J7712J9935K1911K5900
56148G77024L0808L3893L6551M2839N2893O3387P3971Q7292J02984J17434J29382
56137A548458J40127J48304J50041J44376J33307J17265R6297P5106O0612N4231
56127B668124N1888N0812N0287M6700L5279J7345l34j3872k4221l1676l5455l8967
56115B775910m8540o5816q6949j09025j30892j48136j54803j50977j42126j30710
56105A607936j15117r6767q0669o8108n5903m3663l4709k9157k3360j6983j3430
56094A030070j2584j0436o636m855m996k939J172K566Q11R08M064N722M462M462
$$ y = [520954, 522927, 526215, 531828, 537739, 542337, 546979, 552885, 558632, 563123, 568008, 574665, 581614, 587506, 593959, 602902, 613632, 624829, 636955, 650397, 663866, 676925, 691566, 709278, 729213, 751124, 777024, 807832, 841725, 878276, 921115, 974008, 1037395, 1111366, 1198658, 1301642, 1419076, 1548458, 1688585, 1836889, 1986930, 2131306, 2264613, 2381878, 2478175, 2553281, 2613893, 2668124, 2720012, 2770824, 2821111, 2867811, 2903090, 2920435, 2920101, 2906229, 2882008, 2850332, 2814877, 2775910, 2727370, 2661554, 2574605, 2465580, 2334688, 2186552, 2031749, 1880772, 1738646, 1607936, 1492819, 1396052, 1315383, 1247275, 1191372, 1147709, 1113000, 1083843, 1060483, 1043500, 1030070, 1017486, 1007050, 1000414, 995559, 990563, 987624, 988796, 991362, 992173, 993081, 997145, 1002867, 1007329, 1011791]
56080A011791P091Q350O906O687R148J0673R891R880J1209J0550Q137Q556J2231
56067A131100J4185J3067J3127J5430J5797J3501J3182J5920J7160J5715J5940
56056A294124J8779J9723J7877J7748J9879J9347J5775J4889J7739J8606J6183
56045A490669J6161J9924K1636J9792K0432K5260K8000K6472K6922L1974L5746
56034A762988L5333L5779L9046L9749L6552L6031M0301M2745M0886M1139M5691
56023B196240M7563M4342M3684M9041N3169N2304N3350O0048O5430O5331O6139
56012B796641P1685P5846P5599P7852Q5639R1379R1459R3422J01020J06870J07698
56001C775110J11623J22051J30287J32533J37814J50291J60831J65268J73089
$$ y = [1011791, 1018882, 1027232, 1034138, 1040825, 1049973, 1060646, 1070537, 1080417, 1091626, 1102176, 1110313, 1118869, 1131100, 1145285, 1158352, 1171479, 1186909, 1202706, 1216207, 1229389, 1245309, 1262469, 1278184, 1294124, 1312903, 1332626, 1350503, 1368251, 1388130, 1407477, 1423252, 1438141, 1455880, 1474486, 1490669, 1506830, 1526754, 1548390, 1568182, 1588614, 1613874, 1641874, 1668346, 1695268, 1727242, 1762988, 1798321, 1834100, 1873146, 1912895, 1949447, 1985478, 2025779, 2068524, 2109410, 2150549, 2196240, 2243803, 2288145, 2331829, 2380870, 2434039, 2486343, 2539693, 2599741, 2665171, 2730502, 2796641, 2868326, 2944172, 3019771, 3097623, 3183262, 3274641, 3366100, 3459522, 3560542, 3667412, 3775110, 3886733, 4008784, 4139071, 4271604, 4409418, 4559709, 4720540, 4885808, 5058897]
55992E058897J88468K01348K07509K17894K37270K54181K63632K78239L04432
55983G211870L29932L48248L72210M08815M45052M74184N10765N62877O16112
55974A1280065O62882P19994P98117Q83052R67615J071214J206078J357057J518489
55965B0464563J716005J966791K256700K584892K990682L507669M138210M906691
55957D4532203N887119P141576Q688727J0572535J2895075J5737537J9121811
55950A24576583K3064999K7503994L2056121L6015121L8720502L9679903L8011817
55943C59629040L2064754K0426408L820622j4265574k9357498l8619420m1919906
55936B91778426m0860441l7293274l2627614k7810928k3384575j9524380j6215999
$$ y = [5058897, 5247365, 5448713, 5656222, 5874116, 6111386, 6365567, 6629199, 6907438, 7211870, 7541802, 7890050, 8262260, 8671075, 9116127, 9590311, 10101076, 10663953, 11280065, 11942947, 12662941, 13461058, 14344110, 15311725, 16382939, 17589017, 18946074, 20464563, 22180568, 24147359, 26404059, 28988951, 31979633, 35487302, 39625512, 44532203, 50419322, 57560898, 66249625, 76822160, 89717235, 105454772, 124576583, 147641582, 175145576, 207201697, 243216818, 281937320, 321617223, 359629040, 391693794, 412120202, 415940824, 401675250, 372317752, 333698332, 291778426, 250917985, 213624711, 180997097, 153186169, 129801594, 110277214, 94061215]
55929I4061215j3435684j1156401r291419p740993o461994n433610m599046l897006
55921C2045062l312419k846095k467453k140286j863371j644692j463448j294276
55913A5013022j142986j023798r24751q27170p37157o67714o09921n49789m94668
55904H035068m56566m26814l91948l57991l35706l17795k93125k68236k53307
55895D933580k41254k21461k00389j88492j79906j64563j47947j39739j34585
55886C315244j22713j08670j01585r7144q6796p5298p2219p4778p4985p5210q1037
55875B344809q6868q4125p6513p2823p1648o6842o0944n9634n9605n4950m9140
55864A601717m8213m8604m3945l7460l5666l6108l3105k9402l0322l2426k9604
$$ y = [94061215, 80625531, 69469130, 60177711, 52436718, 45974724, 40541114, 35942068, 32045062, 28732643, 25886548, 23419095, 21278809, 19415438, 17770746, 16307298, 15013022, 13870036, 12846238, 11921487, 11094317, 10357160, 9689446, 9079525, 8529736, 8035068, 7578502, 7151688, 6759740, 6401749, 6066043, 5748248, 5455123, 5186887, 4933580, 4692326, 4470865, 4270476, 4081984, 3902078, 3737515, 3589568, 3449829, 3315244, 3192531, 3083861, 2982276, 2885132, 2798336, 2723038, 2650819, 2576041, 2501056, 2425846, 2344809, 2257941, 2173816, 2097303, 2024480, 1952832, 1885990, 1825046, 1765412, 1705807, 1650857, 1601717, 1553504, 1504900, 1460955, 1423495, 1387829, 1351721, 1318616, 1289214, 1258892, 1226466, 1196862]
55853A196862k4788k4195k5472k2862j8727j8900k1477k1071j9342k0783k2828
55842I56417k0676j7251j8059k0631j9300j6029j6264j8230j6668j3244j3184
55831G66881j5078j3888j0805j0462j1612j0004p388q289j0837j0010p266p821
55819F43421j0963j1909j0826j1290j2203r956o373o078p943p314m742m319n380
55806E34125l925n77P74O33K636O204P817Q022R976J2665J2583J0529R858R827
55792F21147P456M029K796K255j242o157q139p783q836j0654r884q000r554j4078
55778E53356j6984j7410j7999j8083j4459q196l558p46L495Q754J1313J0861R972
55765E00316P633N91r087j4998j5334j4208j3907j2519r720q313q912q957q016
$$ y = [1196862, 1172074, 1147879, 1122407, 1099545, 1080818, 1061918, 1040441, 1019370, 1000028, 979245, 956417, 935741, 918490, 900431, 879800, 860500, 844471, 828207, 809977, 793309, 780065, 766881, 751803, 737915, 727110, 716648, 705036, 695032, 687644, 679355, 668518, 658508, 651242, 643421, 632458, 620549, 609723, 598433, 586230, 576274, 569901, 563823, 555880, 548566, 543824, 539505, 534125, 530200, 529623, 530397, 531030, 533666, 539870, 547687, 555709, 565685, 578350, 590933, 601462, 611320, 621147, 628603, 632632, 635428, 637683, 636441, 630284, 622145, 614362, 605526, 594872, 584988, 576988, 567434, 553356, 536372, 518962, 500963, 482880, 468421, 460225, 456667, 455921, 459416, 468170, 479483, 490344, 500316, 507949, 508540, 499453, 484455, 469121, 454913, 441006, 428487, 418767, 410454, 401542, 392585, 384569]
55752C84569q674j1404j3629j4361j4906j4861j2462q900p278p270n867l199k256
55739B59502l041k390J69J749J463J255J256m97l343m184k802k110k823k780j810
55724B39614k268m238n071m162l575l605k425l63K21m10M44K838M094L990N058
55709B30142P333P852O034M563M205K662n20k728l034l553n048n692n222n858
55695B31136p867q611p115n513m856l652j615o73j169j018K34N56l38J1K391M421
55679A96322M701M655N072M582K892J840J972J501j51j257j170j428k463k699
55665B14369j790j343j628j054L72O58l22l28J081J777J267J730L687M656L483
55650B26615K252K418K693K256K444L618L805K144M82oo62k332l756m322n433
$$ y = [384569, 375895, 364491, 350862, 336501, 321595, 306734, 294272, 285372, 278094, 270824, 264957, 261758, 259502, 256461, 254071, 254240, 255989, 257452, 258707, 259963, 259466, 256123, 251939, 249137, 247027, 244204, 241424, 239614, 237346, 233108, 228037, 223875, 220300, 216695, 214270, 213907, 214128, 213718, 214162, 217000, 221094, 225084, 230142, 237475, 245327, 251361, 255924, 260129, 262791, 262271, 259543, 256509, 252956, 247908, 242216, 236994, 231136, 223269, 214658, 207543, 202030, 197174, 193522, 191907, 191234, 190065, 189047, 189281, 189837, 189499, 189510, 191901, 196322, 201023, 205678, 210750, 215332, 218224, 220064, 222036, 223537, 223386, 222129, 220959, 219531, 217068, 214369, 212579, 211236, 209608, 208554, 208926, 209584, 209262, 208934, 210015, 211792, 213059, 214789, 218476, 223132, 226615, 228867, 231285, 233978, 236234, 238678, 242296, 246101, 248245, 248727, 248721, 248059, 245727, 241971, 237649, 232216]
55635B32216p604r166r215q971r026q222o418n273n184m482k787j943k516k585
55621A48824j268k14l41l83P9l99j872k138o96L7j062j961j476j473k923l453
55605A29281j398R52Q77p06j364r01m54rP47R19j04j261j542j466j470q55L83
55588A21629P90j35r25p30o56j342j581p07J45L61J009K396L044K437K195L179
55572A31109M030M025M485N931O616N670M749M788L985J087k020l256l379l825
55558A63995m042l207k487l132m238m529m437m552l944k111o27q24j646j629j176
55543A21414j052n72P50J635J069J77K75P59O55M85R09J220Q58O64J093J064K7
55526A31430q03o91p56j614j983j246r62k043k850k122j296j810k388j457m9J26
$$ y = [232216, 224612, 215446, 206231, 197260, 188234, 180012, 173594, 168321, 163137, 158655, 155868, 153925, 151409, 148824, 147556, 147342, 147001, 146618, 146697, 146298, 144426, 142288, 141592, 141629, 140567, 138606, 137130, 135657, 132734, 129281, 127883, 128835, 129712, 129006, 127642, 126741, 126287, 126278, 127025, 127944, 127840, 126579, 125037, 123571, 122101, 121246, 121629, 122419, 122284, 121359, 120629, 119973, 118631, 117050, 116343, 116488, 116849, 117858, 120254, 123298, 125735, 127930, 131109, 135139, 139164, 143649, 149580, 156196, 161866, 166615, 171403, 175388, 176475, 174455, 171199, 167820, 163995, 159953, 156746, 154259, 151127, 146889, 142360, 137923, 133371, 129427, 127316, 126689, 125865, 124219, 122590, 121414, 120362, 119790, 120540, 122175, 123244, 123421, 123696, 124455, 125110, 125595, 126504, 127724, 128582, 129246, 130339, 131403, 131430, 130627, 129936, 129180, 127566, 125583, 124337, 123375, 121332, 118482, 116360, 115064, 113254, 110866, 109409, 109360, 109486]
55510A09486m61o38r13j936k494j480j17P2j66L43P07k28j368j260q22j508k336
55493I4881j545J10N34k57o61m57p43j519j797j521j295r26o2N33K42J46J406
55476H7069L061L401K536J747J230L88n69j124j620k342k457j486n95p82j112
55461H7345m79L11J14l33J43Q53N24k75j88N06O46L53M54O46K12l03j6O11O82
55442I1806M81N64M72q1j28P85J248K56q14m70L37J43l01L04J013K48j049p71
55424I4043Q01J500O19o45j431j664j092Q9N04m18r85J46J352N36j248j469k10
55407I0428M61K14M36J202J285P88Q12R61l5j585j918j119q01j104q02o1j66p55
55389H8241j80J421K218J818J563J695J077q0p4J275K147J762J442K057K773K945
$$ y = [109486, 109025, 108387, 107474, 105538, 103044, 101564, 101447, 101519, 101353, 101696, 102403, 102175, 100807, 99547, 98725, 97217, 94881, 93336, 93446, 93980, 93723, 93062, 92605, 91862, 90343, 88546, 87025, 85730, 84804, 84742, 85275, 85517, 85663, 87069, 90130, 93531, 96067, 97814, 99044, 99432, 98863, 97739, 96119, 93777, 91320, 89834, 89239, 88457, 87345, 86866, 87177, 87291, 86958, 87101, 87954, 88478, 88203, 88015, 88521, 89167, 89520, 89974, 90620, 90832, 90529, 90513, 91124, 91806, 92287, 92851, 93323, 93242, 93114, 93899, 95147, 95403, 94589, 94119, 94456, 94599, 94298, 94602, 95615, 95863, 94814, 94043, 94844, 96344, 96963, 96318, 94887, 93223, 92131, 92220, 92724, 92306, 91321, 91467, 92819, 93355, 92107, 90638, 90428, 90889, 91103, 91539, 92741, 94026, 94814, 95626, 96587, 96552, 94967, 93049, 91930, 91129, 90025, 89223, 89162, 88996, 88241, 88061, 89482, 91700, 93518, 95081, 96776, 97853, 97773, 97699, 98974, 101121, 102883, 104325, 106382, 109155, 112100]
55373A12100K944K661J229j061k626k848k708k772k502j850j643j971j973j545
55359I5435j496j792j406k55M81K47l24q17j406j777j386p73r21j394q78M55J084
55342H3077O11J63K71K83om5J40%j35M34J076N05q88j471r59m95l17M03J434J550
55322H5631Q65P46J215Q19o43j584j289p71n81n2P39O36l25n49M82J308R88L51
55304H7986J12k24p59o18K49O19J69J00Q18J038J36o30l44Q0k74p04l66K34L30
55285H7952Q6j87o80j173q94K2M00k7j40N07Q93M97K18M78L29n69r07R8J204J136
55265H9243M58K64L92L17M26J021J281N91j92r0L21n3r70j294p15P3M63L45j19
55246I1762n66o80o84j012j399j191o12n40r03o54L54R30M61j02J68Q88J321J406
$$ y = [112100, 115044, 117705, 118934, 117873, 115247, 112399, 109691, 106919, 104417, 102567, 100924, 98953, 96980, 95435, 93939, 92147, 90741, 90486, 90967, 91214, 90890, 90073, 88667, 86890, 85504, 84731, 83810, 82416, 81538, 81993, 83077, 83688, 83851, 84122, 84405, 84399, 84354, 84494, 84494, 84359, 84793, 85869, 86374, 85486, 84015, 83056, 82561, 82244, 82647, 84081, 85631, 86496, 87242, 88457, 89276, 88633, 87049, 85760, 84989, 84408, 84356, 85095, 85731, 85406, 84857, 85339, 86647, 87635, 87986, 88098, 87874, 87115, 86497, 86746, 87365, 87534, 87634, 88452, 89490, 89626, 88996, 88652, 88732, 88458, 87754, 87388, 87622, 87952, 88038, 87851, 87171, 85998, 85104, 85126, 85526, 85499, 85359, 85866, 86759, 87256, 87474, 87952, 88281, 87712, 86805, 86903, 88107, 89243, 89701, 89965, 90357, 90674, 91100, 92121, 93402, 93993, 93801, 93711, 94032, 93979, 93009, 91715, 91000, 91073, 91536, 91881, 91762, 91196, 90516, 89832, 88820, 87421, 86230, 85618, 85078, 84175, 83521, 83875, 84805, 85266, 85164, 85332, 86220, 87541, 88947]
55228H8947J232N93l23r02j112j492j845j287M1P82L39l54n06m90o58n53K7N83
55210H3022R65J589K170J791O40Q8M52N07k15n33J60O59L7o99l54N44Q25M25r8
55191I1975n72q33m52K88L53l45o11pL29j87l81O48J895K155J869J906J888J174
55173A01092L41J80K32l55j340j916j912j480n51N10P60O4m22j1M92L38M1J47
55155I6210J61k07j95N12Q06m3j018j066p68r28r13O0J216J414R90Q33O84j18
55137I7630j144j580j553j431q30L51R93L98k59K38R65L72j047j488o06L74Q43
55120I2226J195J432J065L66K05O79J122J193R38J83j019j743j233j44K98l8l93
55103I6332l68k0P03J550J628O24l98m91k80o88j114m16J025J778J486J018Q57
$$ y = [88947, 90179, 90772, 90449, 89547, 88435, 86943, 85098, 83811, 83852, 84634, 84973, 84619, 84113, 83623, 82965, 82412, 82439, 83022, 83987, 85576, 87746, 89537, 90177, 90265, 90717, 91224, 91009, 90476, 90636, 91295, 91332, 90633, 90279, 90823, 91648, 92073, 91975, 91403, 90570, 90118, 90406, 90759, 90414, 89803, 89796, 90125, 89938, 89557, 90205, 92100, 94255, 96124, 98030, 99918, 101092, 101433, 101613, 101845, 101490, 100150, 98234, 96322, 94842, 94291, 94801, 95561, 95625, 95203, 95192, 95684, 96022, 96063, 96210, 96371, 96164, 95969, 96481, 97287, 97244, 96226, 95160, 94392, 93464, 92551, 92611, 93827, 95241, 96231, 97064, 97748, 97630, 96486, 94906, 93353, 91922, 91092, 91443, 92436, 92834, 92575, 92813, 93778, 94150, 93103, 91615, 91009, 91383, 92226, 93421, 94853, 95918, 96284, 96489, 97168, 98290, 99483, 100421, 100604, 99585, 97842, 96609, 96465, 96763, 96725, 96332, 95964, 95944, 96647, 98197, 99825, 100449, 100051, 99560, 99280, 98592, 97478, 97062, 98087, 99865, 101351, 102369, 103226]
55086A03226P17M73K51j38p84j089n98O8J18k07l16m13q23j014m72J87K97M41
55068I9924J293K033J545M16L5L56L16q0N3N85N40m4j84K07J66n63j194j310j206
55049A02888q89j19N96M40l30p31o42p03q32l26N90Q38K16k89j17K49L69L43J57
55030A01708l62q63p92l67j77l0O67J533J555O78j45m30m63l19J50M62j7p69o87
55011A01332P4K29n51j145q04r5L16N89R92J378J687K047K134J439L49l5N94J363
54993A11893J459R17M1r38j545j338o58k57j89J10O83R42P04L55Q4j67j16N32
54975A12512J297J480J285J322J283L89r74j522r14n8N05J069J536J194J12o45
54959A19871o09n22q86j075n27K23L46j49o05n00J99R62J026L14k04J86O96J77
$$ y = [103226, 103943, 104416, 104667, 104529, 103745, 102656, 102058, 102126, 102244, 102037, 101721, 101308, 100485, 99471, 98999, 99186, 99483, 99924, 101217, 103250, 104795, 105211, 105246, 105602, 105918, 105838, 105891, 106476, 107016, 106972, 106788, 106995, 107161, 106598, 105404, 104094, 102888, 101999, 101880, 102476, 102916, 102586, 101855, 101213, 100510, 99678, 99352, 99942, 100780, 100996, 100707, 100590, 100839, 101208, 101551, 101708, 101346, 100483, 99691, 99324, 99147, 99117, 99784, 101317, 102872, 103550, 103405, 102975, 102512, 102193, 102343, 102805, 102788, 102019, 101332, 101406, 101635, 101084, 99939, 99135, 99040, 99356, 99945, 100937, 102315, 104002, 106049, 108183, 109622, 109971, 109936, 110530, 111893, 113352, 114269, 114310, 113372, 111827, 110489, 109831, 109574, 109385, 109495, 110178, 111120, 111824, 112179, 112263, 112096, 111980, 112512, 113809, 115289, 116574, 117896, 119179, 119568, 118594, 117072, 116158, 116100, 116605, 117674, 119210, 120404, 120516, 119871, 119262, 118740, 117854, 116779, 116252, 116475, 116821, 116672, 116067, 115567, 115766, 116728, 117754, 118068, 117864, 118050, 118746, 118923]
54941A18923r49j228m67J02l6QP37J323J043L47p6k32k78K0O96J361J804K129
54923A25227K205J936K040L311N058N729N312N542P178Q618Q062N769L195J022
54909A90204r12k596l845m816n703o319o459o255n753m775l511k608k362k412
54895A31878k481k654k648j814k94P61O73J35Q5M24M91K27K05Q36J989L101L488
54878A34402K997K397K566L322L795L924M571N904O742N981L871J462n42j922
54864A79470k661l033l476m063m453m517m480m437m277m038l700k838j256J69
54850A32410K93p45j738k069k111k111j961j956k416k527j095J309K631K087J072
54835A21073Q18Q20L72nK29L51l95j385j562r99m90l32m08p44j092q10J09O49
$$ y = [118923, 117974, 116746, 116279, 116381, 116345, 116353, 117090, 118413, 119456, 119803, 119727, 119495, 119217, 119237, 119933, 121294, 123098, 125227, 127432, 129368, 131408, 134719, 139777, 145506, 150818, 156360, 163538, 172156, 180218, 185987, 189182, 190204, 189292, 186696, 182851, 178035, 172332, 166013, 159554, 153299, 147546, 142771, 139260, 136652, 134290, 131878, 129397, 126743, 124095, 122281, 121987, 122748, 123421, 123556, 123641, 124065, 124556, 124783, 124988, 125824, 127813, 130914, 134402, 137399, 139796, 142362, 145684, 149479, 153403, 157974, 163878, 170620, 176601, 180472, 181934, 181392, 179470, 176809, 173776, 170300, 166237, 161784, 157267, 152787, 148350, 144073, 140035, 136335, 133497, 132241, 132410, 132703, 131958, 130220, 128151, 126040, 123929, 121968, 120012, 117596, 115069, 113974, 115283, 117914, 120001, 121073, 121891, 122711, 123083, 123078, 123307, 123658, 123263, 121878, 120316, 119317, 118827, 118495, 118087, 117343, 116251, 115441, 115550, 116199]
54817A16199J88n89r40j187j722j855q28P76J800J991J756J163L45J54J154K389
54801A20794K443J347L09j74o40j220j167j18J183J768J414N43l19p59o03r1K47
54784A24957M2n92j120r90j95O03P91N31M33O53R64J500K532L523L500K595K171
54767A41898K951M077M477M308M306M663N190N881O520O408N247L621K010kk747
54752A98808n437o961p249p002o580n897n066m305l539k665j966j672j528j237
54738A37704q86n38J9O14N48k73p85j83Q11J005M80K58O74J119J214J291J712
54721A44784K499L538M616N309N405N204M963M356L047J437J58r06k354m190n671
54706A72195o176n713m696l714l381l820m358m133l002j566m96j07m14j137j735
$$ y = [116199, 116387, 115798, 114858, 113671, 111949, 110094, 109266, 110042, 111842, 113833, 115589, 116752, 117097, 117251, 118405, 120794, 123237, 124584, 124893, 124719, 124079, 122859, 121692, 121574, 122757, 124525, 125939, 126482, 126163, 125404, 124801, 124710, 124957, 124999, 124407, 123287, 122297, 122102, 122705, 123496, 124027, 124460, 125113, 126077, 127577, 130109, 133632, 137132, 139727, 141898, 144849, 148926, 153403, 157711, 162017, 166680, 171870, 177751, 184271, 190679, 195926, 199547, 201557, 201555, 198808, 193371, 186410, 179161, 172159, 165579, 159682, 154616, 150311, 146772, 144107, 142141, 140469, 138941, 137704, 136818, 136280, 136299, 136913, 137461, 137188, 136403, 136220, 137031, 138036, 138516, 138774, 139448, 140567, 141781, 143072, 144784, 147283, 150821, 155437, 160746, 166151, 171355, 176318, 180674, 183721, 185158, 185316, 184410, 182056, 177866, 172195, 166019, 160306, 155610, 151896, 148515, 144695, 140337, 136204, 133202, 131636, 131140, 131033, 130619, 129482, 127747]
54691A27747j717r77J93J233J597J185M77j03p75j747k332j646j88M70j66q25
54675A22426m53L24M10j06m54m76m91l96J09P91J190J230R90K74q66j749j818
54658A20935j349q34k43M88Q38M47r1P1Q27J395J368Q83O4r43j633j548q28L8
54640A19885P53J183J239J160J345J624J301K90n85q45r90j377j430p69r2o9j92
54623A22431K43Q43Q80N92N83N82J5p07p43k50n0j54J39Q45J179P75J08k92k49
54604A26770K59R38J066L48m00k56M95Q24M05k40o98q61n60J32N40K55m2M12J098
54585A30485R17n6p08n91l21l94o69r85j301j262n67L23O94O48P47Q65M33l30
54567A27928n91k39M1O2L31Q69R15J91n20m40K09O66N33O5j21M27J411J924J518
$$ y = [127747, 126030, 125053, 125246, 126479, 128076, 129261, 129738, 129635, 128860, 127113, 124781, 123135, 122947, 123417, 123251, 122426, 121973, 122297, 122707, 122601, 122147, 121671, 121180, 120784, 120893, 121684, 122874, 124104, 125094, 125368, 124502, 122753, 120935, 119586, 118752, 118509, 118997, 119835, 120282, 120191, 120262, 121089, 122484, 123852, 124735, 124799, 123856, 122223, 120675, 119847, 119885, 120638, 121821, 123060, 124220, 125565, 127189, 128490, 128780, 128195, 127350, 126360, 124983, 123553, 122784, 122692, 122623, 122431, 122674, 123517, 124397, 124989, 125572, 126154, 126169, 125462, 124719, 124469, 124419, 124265, 124404, 125249, 126428, 127203, 127311, 127019, 126770, 127029, 127967, 129033, 129381, 128981, 128725, 129220, 130044, 130449, 130209, 129511, 128650, 128090, 128222, 128762, 129017, 128975, 129387, 130485, 131402, 131346, 130638, 130047, 129726, 129332, 128663, 127678, 126377, 125115, 124548, 124871, 125565, 126213, 126960, 127825, 128258, 127928, 127337, 127098, 127139, 127201, 127532, 128401, 129316, 129507, 128987, 128547, 128756, 129422, 129955, 130020, 129899, 130326, 131737, 133661, 135179]
54548A35179Q20O12Q53J097J306J514J307N13j65q4L07M24O95J594K180J205p84
54531A48573k015j942j577j508j277p65n45n99k13N42O51j28p49n24n8m1l14n71
54513A36940q72j028o05J06K24k17j10Q91J636J214K50k58l52n30o66l86J31N11
54495A36879P79J006R42N50K95M23N24K57m4PK21K61J65M8j88m76m63m9M30Q20
54475A42387J292J745J744J314J045J116R98M32n6l0K14L52O03J168J686J789
54459A57799J650J513J290R51P85Q64P30O2r03j822k582k930k448j287k65J40
54443A53547L18O61Q66N60Kl48m87o42q08r24j050j053n79L09Q95O36j92q98j080
54424A49733o76J89J127J639J595J276Q60L24j87l95l58l71m21k96j67l41m93
$$ y = [135179, 135999, 136611, 137464, 138561, 139867, 141381, 142688, 143201, 143036, 142952, 143259, 143683, 144378, 145972, 148152, 149357, 148573, 146558, 144616, 143039, 141531, 140254, 139489, 138944, 138345, 138132, 138674, 139325, 139197, 138448, 137924, 137866, 137825, 137511, 136940, 136068, 135040, 134435, 134541, 134765, 134548, 134438, 135329, 136965, 138179, 138429, 138171, 137819, 137289, 136623, 136237, 136368, 136879, 137658, 138664, 139606, 140156, 140451, 140874, 141398, 141655, 141611, 141618, 141839, 142100, 142265, 142313, 142125, 141649, 141186, 141137, 141567, 142387, 143679, 145424, 147168, 148482, 149527, 150643, 151641, 152073, 152017, 151987, 152201, 152553, 153156, 154324, 156010, 157799, 159449, 160962, 162252, 163203, 163988, 164852, 165582, 165644, 164741, 162919, 160337, 157407, 154959, 153672, 153407, 153547, 153865, 154526, 155392, 155952, 155954, 155606, 155119, 154477, 153669, 152745, 151695, 150642, 150063, 150372, 151267, 151903, 151711, 150813, 149733, 149057, 149246, 150373, 152012, 153607, 154883, 155743, 156067, 155880, 155485, 155127, 154756, 154335, 154039, 153872, 153531, 153038]
54407A53038j7Q61J222Q17L54K94L30L09O63J531K353K713K707K278J122l19r29
54390A69327m14J98J14j83L7O23J060J182Q09m01k073l010k695j985j666j340
54374A59583n21K66N03Q27J916L026K907J687N53jm34q96r15l50L05N86M51Q5
54356A69578q6M63J582K210J616N08Q9M01M84n6o74r99j333j904k417k610k643
54339A64209k644k348j463k18O78O63r3p63p29l30k85n28l25L87O86O4p24p80
54321A55457k78J70N35R42R39K03n10k86M24L33p49j624j431o11K4L07M11L05
54303A54561J3q6K76P56P44J61l91l19K81P24N35J7j83P3L49L59K48J47o9l35
54283A57861k70K67Q88J165J054O25m7n96n29J6K75q3n28o28o54p81m94M15J043
$$ y = [153038, 153021, 153882, 155104, 155921, 156275, 156569, 156899, 157208, 157871, 159402, 161755, 164468, 167175, 169453, 170575, 170256, 169327, 168913, 169111, 169225, 169042, 169079, 169702, 170762, 171944, 172753, 172352, 170279, 167269, 164574, 162589, 160923, 159583, 159062, 159328, 159831, 160658, 162574, 165600, 168507, 170194, 170747, 170746, 170312, 169416, 168501, 168151, 168456, 169042, 169493, 169578, 169492, 169955, 171537, 173747, 175363, 175871, 175960, 176361, 176845, 176789, 176115, 175116, 173783, 171879, 169462, 166852, 164209, 161565, 159217, 157754, 157536, 158214, 158877, 158784, 158021, 157292, 156962, 156677, 156149, 155824, 156211, 156897, 156961, 156237, 155457, 155179, 155349, 155884, 156826, 157765, 157968, 157458, 157172, 157596, 157929, 157180, 155556, 154125, 153514, 153538, 153845, 154256, 154561, 154574, 154488, 154764, 155520, 156264, 156425, 156034, 155715, 155996, 156720, 157255, 157272, 157089, 157162, 157511, 157870, 158118, 158265, 158196, 157861, 157591, 157858, 158746, 159911, 160965, 161590, 161543, 160947, 160418, 160434, 160709, 160626, 160098, 159470, 158816, 158035, 157541, 157956, 158999]
54264A58999M72p25j100k07R85J471J263R47Q05O44K15l21l65M34J465J626O67
54247A67275m86j043j267j662j900j369l10L90L39r1m62o16n24k25Q2K58L86N08
54229A59283M38J26j51k11k43l73l86j56J24L64P34J125J059N07R1J45K60J72
54211A62908K70P08Q25K18m73n40k39j01pJ63j46j175j942j543o93o41j126q66
54193A55600K42R59O79J24j09l36p82r67n14K68R65J485J632J067j4q16q95n68
54175A58020k15K07O72P93L42l35p77r56j087j226j235j000n81j78K8Q0J45J79
54157A52876Kk49j79K30N28N83P56J087R87K85k29J3L94Q2o23q27l39M08J189
54138A56974J850J886J178O63J104J683J060m90j336p83K00O46O88P55O63L1j067
$$ y = [158999, 159471, 158746, 157646, 157439, 158424, 159895, 161158, 162105, 162910, 163554, 163769, 163448, 163083, 163517, 164982, 166608, 167275, 166789, 165746, 164479, 162817, 160917, 159548, 159238, 159628, 159967, 159876, 159414, 158798, 158274, 158049, 158131, 158389, 158775, 159283, 159721, 159847, 159696, 159485, 159242, 158869, 158483, 158327, 158451, 158815, 159549, 160674, 161733, 162240, 162331, 162476, 162736, 162908, 163178, 163886, 164711, 164929, 164456, 163916, 163677, 163576, 163569, 163732, 163586, 162411, 160469, 158926, 158233, 157592, 156466, 155600, 155842, 156801, 157480, 157604, 157495, 157159, 156377, 155410, 154896, 155164, 156129, 157614, 159246, 160313, 160299, 159483, 158588, 158020, 157805, 158012, 158684, 159477, 159819, 159484, 158707, 157751, 156664, 155438, 154203, 153203, 152622, 152444, 152472, 152552, 152697, 152876, 152878, 152629, 152450, 152680, 153208, 153791, 154547, 155634, 156621, 156906, 156677, 156690, 157084, 157166, 156543, 155716, 155377, 155785, 156974, 158824, 160710, 161888, 162551, 163655, 165338, 166398, 165908, 164572, 163789, 163989, 164635, 165323, 166078, 166741, 166772, 165705]
54121A65705k079k209r34J130K277J516M8j64J029J976J636P09K27K66M11M10
54105A71954J47l00l73L26J143J047J53m82n22n78p61l86N80J134Q13M06N10N63
54087A75374K8n34l92K16O92J045J548K075K488L060L925M634M836M891N272N939
54071B15097O685P460P835O872M159N38k803n369p048p478o543n046m072l803
54057B06484l589k958k051j177m38J93P08R97Q56K99j69O9J006J993K589K952
54041B07764L349L766M108M364M453M398M656N631O813P135O364N377M901M728
54027B77807M456M111L639K658J286M84Q53J745K170K022J737J278L15j029k257
54012C01275l165l793l994l641l093k874k955k856k340j617r33l21K39P37J070
$$ y = [165705, 163626, 161417, 160483, 161613, 163890, 165406, 165454, 165290, 166319, 168295, 169931, 170640, 170867, 171133, 171544, 171954, 172101, 171801, 171428, 171754, 172897, 173944, 174097, 173615, 173093, 172515, 171754, 171368, 171948, 173082, 173895, 174301, 174811, 175374, 175402, 174868, 174476, 174692, 175384, 176429, 177977, 180052, 182540, 185600, 189525, 194159, 198995, 203886, 209158, 215097, 221782, 229242, 237077, 243949, 248108, 248646, 245843, 240474, 233426, 225948, 219405, 214359, 210287, 206484, 202895, 199937, 197886, 196709, 196271, 196464, 197172, 198169, 199025, 199324, 199155, 199224, 200230, 202223, 204812, 207764, 211113, 214879, 218987, 223351, 227804, 232202, 236858, 242489, 249302, 256437, 262801, 268178, 273079, 277807, 282263, 286374, 290013, 292671, 293957, 294441, 295294, 297039, 299209, 301231, 302968, 304246, 304561, 303532, 301275, 298110, 294317, 290323, 286682, 283589, 280715, 277760, 274904, 272564, 270947, 270014, 269693, 269932, 270669, 271739]
53997B71739R85J71j367l173m702n623n804n353m752m479m395l881k775j720j291
53982B23580j314j330j315j524j878j940j403m32M23N20l31j542k176j809p92
53967B06737K62Q90Q43K98p0K55Q95J030N46L0k92p16j060n21J000K324K410J675
53949B16536J313J793K664L398L836M000L994L936L789L532L551M317N549O335
53935B68543O338O217O432O490N955N546O378Q493J0890J2833J4395J5806J6678
53922C90994J5975J2672O816J07m975p057o663n075l039q57J006K135K672K990
53908D07701L178L155K956K471J343m09k027k770k703k335j891j467j468k230
53894D03504l445m540n442o462p615q552r060r225r168r000q807q413p431n894
$$ y = [271739, 272724, 272895, 271528, 268355, 263653, 258030, 252226, 246873, 242121, 237642, 233247, 229366, 226591, 224871, 223580, 222266, 220936, 219621, 218097, 216219, 214279, 212876, 212444, 212867, 213387, 213056, 211514, 209338, 207529, 206737, 206999, 207889, 208732, 209030, 208960, 209215, 210110, 211140, 211686, 211716, 211424, 210708, 209648, 209127, 210127, 212451, 214861, 216536, 217849, 219642, 222306, 225704, 229540, 233540, 237534, 241470, 245259, 248791, 252342, 256659, 262208, 268543, 274881, 281098, 287530, 294020, 299975, 305521, 311899, 320392, 331282, 344115, 358510, 374316, 390994, 406969, 419641, 426457, 426564, 421589, 414532, 407869, 402794, 399755, 398898, 399904, 402039, 404711, 407701, 410879, 414034, 416990, 419461, 420804, 420395, 418368, 415598, 412895, 410560, 408669, 407202, 405734, 403504, 400059, 395519, 390077, 383615, 376000, 367448, 358388, 349163, 339995, 330995, 322188, 313775, 306344, 300450]
53880C00450m506l855l732l640l597l825m023l636k820k395k834l733m417m561
53866B48876m167l391k569k125k165k296k023j338p75q15j323j670j497j102r64
53851B20656j126j306j359j249q62k98j01n89j196j143o16m51p36o72J31J134
53835B10217J863K421K699K080N15r28j283p98k98l2J92L48L08K53M17O57P54
53818B19385P84Q75R40R35R77J031R46R54J488K407L094L470M072M925N276M869
53802B56428M403M350M288M035M296N391O347O204N273M294L246K094J640K396
53788C14685L273K827J254k3l92m02m37k98m0j98j100k732m909o941p665o741
53772B90161n436n103n356m947l853l185l247l232k801k590k931l280l169k763
$$ y = [300450, 295944, 292089, 288357, 284717, 281120, 277295, 273272, 269636, 266816, 264421, 261587, 257854, 253437, 248876, 244709, 241318, 238749, 236624, 234459, 232163, 230140, 228802, 228027, 227212, 225889, 224219, 222722, 221620, 220656, 219530, 218224, 216865, 215616, 214754, 214456, 214355, 213766, 212570, 211427, 210811, 210360, 209624, 208952, 209083, 210217, 212080, 214501, 217200, 219280, 219795, 218867, 217584, 216786, 216488, 216456, 216648, 216996, 217304, 217557, 217974, 218631, 219385, 220169, 221044, 221984, 222919, 223896, 224927, 225873, 226827, 228315, 230722, 233816, 237286, 241358, 246283, 251559, 256428, 260831, 265181, 269469, 273504, 277800, 283191, 289538, 295742, 301015, 305309, 308555, 310649, 312289, 314685, 317958, 320785, 322039, 322016, 321624, 321222, 320785, 320487, 320447, 320249, 319149, 316417, 311508, 304567, 296902, 290161, 284725, 279622, 274266, 269319, 265466, 262281, 259034, 255802, 253001, 250411, 247480, 244200, 241031, 238268]
53758B38268k234j515q79q25j240j434j178r41j028j206j291j308j083m31K18
53743B21893K62o7N8P52J237J094P53O18M95K12l9j32k00k30r5k9l12n36k1J103
53723B26816K027K547L146L744L472K139Q63O98J410K124K461K511K336K132K349
53708B60775L123L855L843L067K128J657J942K786L615L987M043M123M132L825
53694C06901L483L591L897L615K640J660R51M2j126j726j281n59m83q45q39m68
53678C19453m67j079j652j584j098q29r51j026o83j90j02m39o69n67o11j179j828
53661C04499j890j366p12j01M40M99k48j240j532j038n05l00q9L29O94Q54R50
53644B99244R31P03P02J485K629K994K292J465J228J167O78M1m9N46J413K116
$$ y = [238268, 236034, 234519, 233640, 232815, 231575, 230141, 228963, 228022, 226994, 225788, 224497, 223189, 222106, 221675, 221893, 222155, 222088, 222146, 222898, 224135, 225229, 225982, 226600, 227095, 227307, 227268, 227136, 226936, 226706, 226611, 226582, 226270, 225734, 225713, 226816, 228843, 231390, 234536, 238280, 241752, 243891, 244754, 245452, 246862, 248986, 251447, 253958, 256294, 258426, 260775, 263898, 267753, 271596, 274663, 276791, 278448, 280390, 283176, 286791, 290778, 294821, 298944, 303076, 306901, 310384, 313975, 317872, 321487, 324127, 325787, 326738, 326780, 325654, 323928, 322647, 322088, 321605, 320760, 319921, 319453, 318986, 317907, 316255, 314671, 313573, 312744, 311793, 310767, 310084, 309894, 309792, 309353, 308684, 308117, 307506, 306327, 304499, 302609, 301243, 300531, 300430, 300870, 301369, 301121, 299881, 298349, 297311, 296806, 296506, 296417, 296746, 297440, 298294, 299244, 300175, 300878, 301580, 303065, 305694, 308688, 310980, 312445, 313673, 314840, 315518, 315559, 315510, 316056, 317469, 319585]
53628C19585K426K388K389K770L301L508L511L863M587N074N108N127N306N237
53614C74180M838M769N430O224O355N893N542N743O368O945O968O320N472M918
53600D55965M419L390J889N99k49j087k152l127l758m043l731k588j264r31j787
53585D41545k854l424l675l705l184k369k200k768k914k061j208j297j778j810
53571D06298j755k276k823k425j343o50n45l71R7M73P10J086J415J220O77M68
53555D00256P98J251J543J675J546J125Q57J193J917K527L034L595L759L059K122
53540D30257K127L142M061M320M623N613O806P436P708Q461R941J1460J2200J1994
53526E30149J1360J0992J1286J2189J3477J4963J6434J7613J8420J9105J9972
$$ y = [319585, 322011, 324399, 326788, 329558, 332859, 336367, 339878, 343741, 348328, 353402, 358510, 363637, 368943, 374180, 379018, 383787, 389217, 395441, 401796, 407689, 413231, 418974, 425342, 432287, 439255, 445575, 451047, 455965, 460384, 463774, 465663, 466262, 466013, 464926, 462774, 459647, 455889, 451846, 448115, 445527, 444263, 443332, 441545, 438691, 435267, 431592, 427887, 424703, 422334, 420134, 417366, 414452, 412391, 411183, 409886, 408108, 406298, 404543, 402267, 399444, 397019, 395676, 395026, 394481, 394110, 394207, 394680, 395390, 396476, 397891, 399111, 399788, 400256, 401054, 402305, 403848, 405523, 407069, 408194, 409051, 410244, 412161, 414688, 417722, 421317, 425076, 428135, 430257, 432384, 435526, 439587, 443907, 448530, 454143, 460949, 468385, 476093, 484554, 494495, 505955, 518155, 530149, 541509, 552501, 563787, 575976, 589453, 604416, 620850, 638463, 656883, 675988, 695960]
53515F95960K1089K2412K3929K5440K6534K7120K7681K8653K9725L0229L0016
53504I88788K9482K8860K8033K7023K6223K5931K5963K5899K5530K4941K4272
53493A280945K3550K2812K2199K1839K1558K0978K0142J9644J9754J9754J8814
53482A511989J7385J6880J7743J8736J8473J6933J4921J2817J0453P841N203K545
53470A671919k97l309o412r609j2732j5384j7409j9046k0265k0489j9541j8306
53458A509120j7930j8688k0227k2407k5115k7575k8766k8517k7559k6526k5499
53447A240311k4421k3350k2231k0969j9722j8696j7626j5945j3485j0618p752
53436A045496n050k716j087k65Q0N40J600L404N621P698R360J0748J2030J3210
$$ y = [695960, 717049, 739461, 763390, 788830, 815364, 842484, 870165, 898818, 928543, 958772, 988788, 1018270, 1047130, 1075163, 1102186, 1128409, 1154340, 1180303, 1206202, 1231732, 1256673, 1280945, 1304495, 1327307, 1349506, 1371345, 1392903, 1413881, 1434023, 1453667, 1473421, 1493175, 1511989, 1529374, 1546254, 1563997, 1582733, 1601206, 1618139, 1633060, 1645877, 1656330, 1664171, 1669374, 1671919, 1671622, 1668313, 1661901, 1652292, 1639560, 1624176, 1606767, 1587721, 1567456, 1546967, 1527426, 1509120, 1491190, 1472502, 1452275, 1429868, 1404753, 1377178, 1348412, 1319895, 1292336, 1265810, 1240311, 1215890, 1192540, 1170309, 1149340, 1129618, 1110922, 1093296, 1077351, 1063866, 1053248, 1045496, 1040446, 1037730, 1036643, 1036378, 1036458, 1036998, 1038598, 1042002, 1047623, 1055321, 1064681, 1075429, 1087459, 1100669]
53422A100669J4453J6161J8368K0508K2086K3276K4456K5614K6688K8070L0158
53411A350507L2616L4714L6257L7634L9092M0521M1958M3787M6287M9321N2494
53400A805188N5434N7953O0096O1983O3537O4600O5347O6154O6977O7315O7025
53389B501609O6576O6174O5284O3456O1008N8297N5044N1053M7088M3994M1318
53378C120901L7767L2868K7316K1839J6596J1658P120K568k837r522j7269k5827
53366C223178l5082m4578n3466o1082o7100p1086p2660p2314p1383p0831p0445
53355B533151o9541o7942o5959o3709o0976n7749n4586n2331n1349n1169n0959
53344A886881n0360m9599m8769m7418m5088m1848l8082l4131l0452k7631k5705
$$ y = [1100669, 1115122, 1131283, 1149651, 1170159, 1192245, 1215521, 1239977, 1265591, 1292279, 1320349, 1350507, 1383123, 1417837, 1454094, 1491728, 1530820, 1571341, 1613299, 1657086, 1703373, 1752694, 1805188, 1860622, 1918575, 1978671, 2040654, 2104191, 2168791, 2234138, 2300292, 2367269, 2434584, 2501609, 2568185, 2634359, 2699643, 2763099, 2824107, 2882404, 2937448, 2988501, 3035589, 3079583, 3120901, 3158668, 3191536, 3218852, 3240691, 3257287, 3268945, 3276065, 3278633, 3275796, 3266274, 3249005, 3223178, 3188096, 3143518, 3090052, 3028970, 2961870, 2890784, 2818124, 2745810, 2674427, 2603596, 2533151, 2463610, 2395668, 2329709, 2266000, 2205024, 2147275, 2092689, 2040358, 1989009, 1937840, 1886881, 1836521, 1786922, 1738153, 1690735, 1645647, 1603799, 1565717, 1531586, 1501134, 1473503, 1447798]
53333A447798k3872k1359j8301j5285j2529j0177q918r357j0873j2055j2298j2226
53321A280548j2399j2411j1585r908p977o340n184m359l447j997J58K753N233
53308A213085P008P896Q414R323J0681J1811J2480J3516J5735J8754K1512K3591
53296A373806K5344K7051K8719L0481L2437L4248L5463L6068L6055L4849L2030
53285A726551K8379K5289K3202K1463J9604J7683J5402J1980P288K202k518o924
53273A889601j1058j4350j6398j7771j9462k1826k4521k7213k9891l2619l5164
53262A639328l6956l7505l7042l6559l6874l7749l8353l8364l8120l7843l7325
53251A226638l6363l4989l3293l1465l0011k9332k9208k9093k8839k8608k8218
$$ y = [1447798, 1423926, 1402567, 1384266, 1368981, 1356452, 1346275, 1337357, 1328000, 1317127, 1305072, 1292774, 1280548, 1268149, 1255738, 1244153, 1234245, 1226268, 1219928, 1214744, 1210385, 1206938, 1204941, 1205099, 1207852, 1213085, 1220093, 1227989, 1236403, 1245726, 1256407, 1268218, 1280698, 1294214, 1309949, 1328703, 1350215, 1373806, 1399150, 1426201, 1454920, 1485401, 1517838, 1552086, 1587549, 1623617, 1659672, 1694521, 1726551, 1754930, 1780219, 1803421, 1824884, 1844488, 1862171, 1877573, 1889553, 1896841, 1899043, 1896525, 1889601, 1878543, 1864193, 1847795, 1830024, 1810562, 1788736, 1764215, 1737002, 1707111, 1674492, 1639328, 1602372, 1564867, 1527825, 1491266, 1454392, 1416643, 1378290, 1339926, 1301806, 1263963, 1226638, 1190275, 1155286, 1121993, 1090528, 1060517, 1031185, 1001977, 972884, 944045, 915437, 887219]
53240H87219k7287k5911k4578k3433k2201k0738j9079j7108j4822j2716j1150
53229F68196r655p740o076n778o647p390p528p860q832r848j0578j1611j3164
53216E55489j4343j4448j4010j3699j3147j1825j0273r446r258q827p831o847
53204D21535o409o519o907p303p476p376p148o907o714o799p279p535o606m593
53190C25964k926k712l421l776l423k932k617k239j750j543j836k332k615k593
53176B89249k406k178j908j584j324j306j426j246o23q6j58m76k47M81Q19L16
53160B75897n41j266j925k453k335j480o95o49r53q94n09l34n22p54p67m61J84
53143B59543Q59R72L90k03p4O78J369J521J127M91R7K49N93M33k36n88j10O98
$$ y = [887219, 859932, 834021, 809443, 786010, 763809, 743071, 723992, 706884, 692062, 679346, 668196, 658541, 650801, 644725, 638947, 632300, 624910, 617382, 609522, 600690, 590842, 580264, 568653, 555489, 541146, 526698, 512688, 498989, 485842, 474017, 463744, 454298, 445040, 436213, 428382, 421535, 415126, 408607, 401700, 394397, 386921, 379545, 372397, 365490, 358776, 351977, 344698, 337163, 330557, 325964, 323038, 320326, 316905, 313129, 309706, 306774, 304157, 301918, 300168, 298625, 296789, 294457, 291842, 289249, 286843, 284665, 282757, 281173, 279849, 278543, 277117, 275871, 275248, 275162, 275004, 274528, 274281, 274762, 275581, 275897, 275356, 274090, 272165, 269712, 267377, 265897, 265202, 264553, 263600, 262706, 262197, 261863, 261341, 260587, 259820, 259359, 259543, 260402, 261374, 261764, 261561, 261487, 262165, 263534, 265055, 266182, 266673, 266770, 267019, 267612, 268045, 267809, 267221, 267111, 267809]
53125B67809J121J037O34%n04k06Q47J519R57j82o38k08L03L10r3n94q51n50N6
53106B70767j8j280k839l368k756j889j193l54O35J167R24K64m33j106j582j515
53090B55424r73m89k78L8O85J124O76n17j474j357l38O27Q66O69O71P88L97n06
53072B56033j072p85j76J03J53K38R9m67r26p98n62q71j294r44k5L64j06o64p28
53053B47572m81j02N67J334J624J397J236J251P58n26j826k350k239k020j739
53038B44456j263q14o22m09J72Q72J157R03L83j69n82o08k13K43M94P35J108J131
53020B46974K75j013j619j097j72K93K86L27N87Q09Q52Q71R33Q01K98k91l76L29
53002B49067J412K038J672O03l79q07r28j158j344r93j25N45M88nl12k64m5L73
$$ y = [267809, 268930, 269967, 270601, 270601, 270097, 269891, 270738, 272257, 273214, 273032, 272394, 272186, 272489, 272799, 272706, 272112, 271261, 270711, 270767, 270749, 269469, 266630, 263262, 260506, 258617, 257424, 257070, 257705, 258872, 259796, 260060, 259627, 258521, 256939, 255424, 254451, 253962, 253684, 253722, 254407, 255531, 256207, 255690, 254216, 252859, 252521, 253148, 254014, 254683, 255354, 256142, 256539, 256033, 254961, 254176, 254000, 254103, 254256, 254494, 254593, 254126, 253200, 252402, 251840, 250969, 249675, 248731, 248706, 249070, 248964, 248300, 247572, 247091, 246989, 247556, 248890, 250514, 251911, 253147, 254398, 255156, 254630, 252804, 250454, 248215, 246195, 244456, 243193, 242379, 241757, 241348, 241520, 242392, 243549, 244452, 244835, 244666, 244084, 243476, 243263, 243506, 244000, 244735, 245843, 246974, 247249, 246236, 244617, 243520, 243348, 243641, 243927, 244254, 244841, 245650, 246502, 247373, 248306, 249107, 249405, 249114, 248738, 249067, 250479, 252517, 254189, 254792, 254413, 253606, 252678, 251520, 250176, 249183, 249058, 249603, 250091, 250086, 249774, 249510, 249465, 249838]
52984B49838J087J774J884J361P26M15M70Q73J631K425K676K220J545J257J587
52969B71769K459L529M114L598K157O82j70m31l21M9K89j65j212j951j911j768
52953B80717k278l059l160k457j721j511j677j858j864j564r46l84l80r08j326
52938B55624j102m90k98r49j815j775o18N10M88k75m77J73O95N04K33M46O86L88
52920B51948j02k45j86k13m9M03M17m61j335j083r0L35o5l22Q8N76M88j67j084
52901B48853j903k061j283l01j60p73j009l45M80O75M35L92P31J264J794K116
52885B48905K030J611J129O38m3q51j414j443q95J31J200J570R44P6n5N34J115
52868B55182J510K172L076L523L209K577J956J188L75O6L07L17m15j362j780j723
$$ y = [249838, 250925, 252699, 254583, 255944, 256670, 257085, 257555, 258428, 260059, 262484, 265160, 267380, 268925, 270182, 271769, 274228, 277757, 281871, 285469, 287626, 288308, 288138, 287707, 287386, 287435, 287724, 287559, 286347, 284396, 282485, 280717, 278439, 275380, 272220, 269763, 268042, 266531, 264854, 262996, 261132, 259568, 258622, 258238, 257858, 256950, 255624, 254522, 254032, 253734, 252785, 250970, 249195, 248577, 249087, 249575, 249300, 248823, 248996, 249691, 250195, 250428, 250874, 251560, 251948, 251846, 251601, 251415, 251202, 251153, 251556, 251973, 251512, 250177, 249094, 249004, 249339, 249274, 248952, 249040, 249616, 250104, 249937, 248853, 246950, 244889, 243606, 243305, 243145, 242372, 241363, 241018, 241498, 242173, 242608, 243000, 243731, 244995, 246789, 248905, 250935, 252546, 253675, 254313, 254270, 253419, 252005, 250562, 249667, 249798, 250998, 252568, 253512, 253588, 253533, 254067, 255182, 256692, 258864, 261940, 265463, 268672, 271249, 273205, 274393, 274768, 274834, 275141, 275458, 275043, 273681, 271901, 270178]
52852B70178j666j613j225n66j92n11j357k186k585k629k719k958k931k292j379
52837B43369p61n03l41l25o03q19n37j02k85j049j554j404j016o93k47K31K43
52820B33604j85l47J0K69J15J68Q55J491J243L55l22m85l64qO82J432J765J499
52802B41777P36l35j284j586j319j236j707k059j610p64m68q65j342j586j828
52787B24524k063j829r66LM72M20K56K28K64L16O35J474K487K776J863M52k78
52770B31034n1L33K18j42k58j37m6MR0Q1j82o23j130j632j836j355l19O07J058
52751B25714J319J608J642J353J303J837K366K205J672J564J938K136J864J448
52737B49969J099O85K62J82N42J024J426J780J858J111n11k025k196q70Q05J517
$$ y = [270178, 268512, 266899, 265674, 265108, 264916, 264405, 263048, 260862, 258277, 255648, 252929, 249971, 247040, 244748, 243369, 242608, 242105, 241764, 241439, 240836, 240017, 239480, 239378, 239093, 238044, 236490, 235086, 234070, 233377, 233130, 233361, 233604, 233419, 233072, 233082, 233351, 233466, 233634, 234489, 235980, 237223, 237578, 237256, 236771, 236407, 236399, 237081, 238513, 240278, 241777, 242513, 242178, 240894, 239308, 237989, 236753, 235046, 232987, 231377, 230613, 230145, 229280, 227938, 226352, 224524, 222461, 220632, 219666, 219669, 220141, 220561, 220817, 221045, 221309, 221625, 222260, 223734, 226221, 228997, 230860, 231312, 231034, 230983, 231316, 231534, 231392, 231134, 230997, 230951, 230955, 231045, 231126, 230944, 230321, 229191, 227559, 225723, 224368, 224049, 224656, 225714, 227033, 228641, 230283, 231636, 232939, 234776, 237142, 239347, 241019, 242583, 244521, 246657, 248521, 249969, 251068, 251753, 252015, 252197, 252739, 253763, 255189, 256969, 258827, 259938, 259427, 257402, 255206, 254336, 255141, 256658]
52721B56658R97mp66j222j544j594j244q79j015j470j485p45K82J032J350J195
52705B49546N65j11j59M20P98M84k4j09N1J0l6L25Q17P35Lo80p26k12M11P53O28
52684B53489J20n12j014j175p48K73J185J043j93j454j904j800j631j137R8J582
52668B46222K310J970J062J32m87m83J23O94P10N57Q61J380J414J118J354K207
52652B61144K709K300J569J214J058O32J2m67q40j270j598j621j583j853k323
52637B59083k478k014j096p9P19J115J151J128J346J851K512L223L850M076L497
52622B77884K013Q3j571k538k968l190l237k939k364j837j476j060m98o5R5L45
52606B56677J065J997K453K047R55l66j376j616j085l72m3m3MJ64L38P69J761
$$ y = [256658, 257655, 257651, 256885, 255663, 254119, 252525, 251281, 250402, 249387, 247917, 246432, 245687, 245969, 247001, 248351, 249546, 250111, 250000, 249841, 250261, 251059, 251543, 251519, 251410, 251461, 251471, 251435, 251760, 252577, 253312, 253315, 252635, 251909, 251697, 252108, 252861, 253489, 253609, 253097, 252083, 250908, 250160, 250433, 251618, 252661, 252468, 251014, 249110, 247310, 245679, 244542, 244640, 246222, 248532, 250502, 251564, 251696, 251209, 250726, 250849, 251543, 252253, 252810, 253671, 255051, 256465, 257583, 258937, 261144, 263853, 266153, 267722, 268936, 269994, 270626, 270638, 270171, 269331, 268061, 266463, 264842, 263259, 261406, 259083, 256605, 254591, 253495, 253416, 254135, 255250, 256401, 257529, 258875, 260726, 263238, 266461, 270311, 274387, 277884, 279897, 279980, 278409, 275871, 272903, 269713, 266476, 263537, 261173, 259336, 257860, 256800, 256302, 256237, 256332, 256677, 257742, 259739, 262192, 264239, 265194, 264828, 263452, 261836, 260751, 260379, 260336, 260293, 260297, 260461, 260799, 261568, 263329]
52589B63329K868L145K325J186N31L58K79K24K48J86l2k6M90J023Q60J63j57K14
52571B77214M75n6q46r11k62J42j81o42n86k33j59m40p47r48j073j019p71o72
52553B68285r13j043n90J8j12j027j812j781j121k85M34O49%j097j632j245n85
52536B56143j40M26J289J727J197M36N29J315J679J187N14L34N45O73M64j2m11
52519B67895l03L45R41R23M67K19M55R59J523K175K964L855M669N040M608L562
52503C00297K486J496N9j924l545l998l654l331l040k377j644j479j653j274j82
52488B76237Q00J062Q04L95Qr6K93Q09Q29M33K39L56K66j34k85J16P16J239J758
52469B85845K046J618P13L67J080K161K809L099L378L460L108K560K006J045n57
$$ y = [263329, 266197, 269342, 271667, 272853, 273384, 273742, 274021, 274245, 274493, 274679, 274647, 274621, 275111, 276134, 276994, 277157, 277000, 277214, 277689, 277633, 276787, 275876, 275614, 275756, 275575, 274933, 274347, 274114, 273955, 273515, 272768, 271820, 270747, 269728, 268957, 268285, 267372, 266329, 265739, 265757, 265645, 264618, 262806, 261025, 259904, 259619, 260053, 260702, 260702, 259605, 257973, 256728, 256143, 256003, 256429, 257718, 259445, 260642, 261078, 261607, 262922, 264601, 265788, 266302, 266636, 267181, 267854, 268318, 268306, 267895, 267592, 267937, 268878, 269801, 270268, 270487, 270942, 271901, 273424, 275599, 278563, 282418, 287087, 292127, 296735, 300297, 302783, 304279, 304338, 302414, 298869, 294871, 291217, 287886, 284846, 282469, 280825, 279346, 277693, 276419, 276237, 277037, 278099, 278903, 279298, 279306, 279210, 279503, 280312, 281141, 281574, 281813, 282169, 282435, 282301, 282016, 282132, 282848, 284087, 285845, 287891, 289509, 290222, 290589, 291669, 293830, 296639, 299738, 303116, 306576, 309684, 312244, 314250, 315295, 314738]
52454C14738k115k787k792l062l869m457m109k996j927j609k121k848k976k291
52440B74779j379q59o64l71MM0m10r34j072p17l5P47J289J192L78n91q35o1J058
52421B71559J574J362J108J259J455J252Q89Q78J279J887K798M078N222N749O177
52406C08526P506R728J1759J2872J3254J2874J0896O802J391l937q270j1109j1977
52393C60315j0961r187p923p330o660n491m142l021k168j462q19j05Q32J924K849
52378C06651L276L172K884K906L318L615L444L317L959N045N400M687L941L948
52364C59563M011L041J253k91j185j812k235k088j496j124j137r74l06M56R13
52349C56589J211J555J745J629J505J689K039K212K204K270K562L127M058N348
$$ y = [314738, 312623, 309836, 307044, 303982, 300113, 295656, 291547, 288551, 286624, 285015, 282894, 280046, 277070, 274779, 273400, 272541, 271877, 271506, 271510, 271550, 271140, 270206, 269134, 268417, 268382, 269129, 270418, 271610, 271988, 271397, 270562, 270501, 271559, 273133, 274495, 275603, 276862, 278317, 279569, 280458, 281336, 282615, 284502, 287300, 291378, 296600, 302349, 308526, 316032, 325760, 337519, 350391, 363645, 376519, 387415, 394217, 395608, 391671, 383401, 372292, 360315, 349354, 340167, 332244, 324914, 318254, 312763, 308621, 305600, 303432, 301970, 301151, 301046, 301878, 303802, 306651, 309927, 313099, 315983, 318889, 322207, 325822, 329266, 332583, 336542, 341587, 346987, 351674, 355615, 359563, 363574, 366615, 367868, 367577, 366392, 364580, 362345, 360257, 358761, 357637, 356500, 355526, 355220, 355676, 356589, 357800, 359355, 361100, 362729, 364234, 365923, 367962, 370174, 372378, 374648, 377210, 380337, 384395, 389743]
52335C89743O703P745Q379Q793R202R717J0427J1389J2590J3954J5430J6945J8373
52322E39390J9541K0268K0448K0106J9432J8642J7841J7076J6478J6235J6453
52311G41910J7108J8128J9267K0007J9814J8666J7102J5678J4526J3567J2941
52300I28714J2763J2595J1658R806P893O726N890M213J352j703l940n531p251
52287I83185r168j0564j0976j0687j0133r419q527p525o366m825k877q32J020
52274H92306K604L898M928O048P697R678J1187J1838J2200J2906J3692J3887J3464
52261A016333J3032J2947J3084J3374J3873J4325J4200J3407J2482J1863J1394
52250A160314J0640R381P569N179K408k81k626m892p438j0116j2378j3812j4409
$$ y = [389743, 396446, 404191, 412570, 421363, 430565, 440282, 450709, 462098, 474688, 488642, 504072, 521017, 539390, 558931, 579199, 599647, 619753, 639185, 657827, 675668, 692744, 709222, 725457, 741910, 759018, 777146, 796413, 816420, 836234, 854900, 872002, 887680, 902206, 915773, 928714, 941477, 954072, 965730, 975536, 983429, 990155, 996045, 1000258, 1001610, 999907, 995967, 990436, 983185, 974017, 963453, 952477, 941790, 931657, 922238, 913711, 906186, 899820, 894995, 892118, 891286, 892306, 894910, 898808, 903736, 909784, 917481, 927159, 938346, 950184, 962384, 975290, 988982, 1002869, 1016333, 1029365, 1042312, 1055396, 1068770, 1082643, 1096968, 1111168, 1124575, 1137057, 1148920, 1160314, 1170954, 1180335, 1187904, 1193083, 1195491, 1195210, 1192584, 1187692, 1180254, 1170138, 1157760, 1143948, 1129539]
52237A129539j4399j4158j4095j4348j4600j4562j4412j4416j4252j3300j1677
52226I75320j0305r645q976p514n702m648m483m178l047j609p01l24J61J149K489
52211I17987L811M824N520O249P243P967P443N526L355K087J726J655J822K606
52197I79821L814M689M840M545M185M018M403N434O335O035M577L204K746K618
52183A041264J819K76j389k921m561o357q025r410j0562j1261j0972r499p498
52170I60904n966n261m839m004k728j531o46K76J574L017M107M636M756M719M783
52155I63797N010M916L746J501o63j611j435r47m19M03J375K031K473L208M016
52140I87401M008L015K021J794J914J620R99Q03J539L147N199P138Q781J0736
$$ y = [1129539, 1115140, 1100982, 1086887, 1072539, 1057939, 1043377, 1028965, 1014549, 1000297, 986997, 975320, 965015, 955370, 946394, 938880, 933178, 928530, 924047, 919869, 916822, 915213, 914512, 914188, 914349, 915498, 917987, 921798, 926622, 932142, 938391, 945634, 953601, 961044, 966570, 969925, 972012, 973738, 975393, 977215, 979821, 983635, 988324, 993164, 997709, 1001894, 1005912, 1010315, 1015749, 1022084, 1028119, 1032696, 1035900, 1038646, 1041264, 1043083, 1043359, 1041970, 1039049, 1034488, 1028131, 1020106, 1010696, 1000134, 988873, 977901, 968402, 960904, 954938, 949677, 944838, 940834, 938106, 936575, 935929, 936205, 937779, 940796, 944903, 949539, 954295, 959014, 963797, 968807, 973723, 977469, 978970, 978307, 976696, 975261, 974314, 973895, 974298, 975673, 977704, 980177, 983385, 987401, 991409, 994424, 996445, 998239, 1000153, 1001773, 1002772, 1003575, 1005114, 1008261, 1013460, 1020598, 1029379, 1040115]
52126A040115J3780J7656K1129K3444K5058K6672K8359L0064L2008L3951L4781
52115A327017L3728L1440K9096K6954K4578K2053J9881J7861J5055J1156P141
52104A565960M232K677J787R16Q2k93j45n2o06j714k865m006n620p924j0652j3736
52088A528041j7378k1137k3680k4121k2972k1283j9327j6785j3707j0554p648
52077A329449n159l300j905k23K191M729O555P878R627J2075J4554J6399J7450
52064A410320J7772J7492J6910J6176J4995J3201J1398J0350R924R348Q403P552
$$ y = [1040115, 1053895, 1071551, 1092680, 1116124, 1141182, 1167854, 1196213, 1226277, 1258285, 1292236, 1327017, 1360745, 1392185, 1421281, 1448235, 1472813, 1494866, 1514747, 1532608, 1547663, 1558819, 1565960, 1570192, 1572869, 1574656, 1575572, 1575654, 1575361, 1575216, 1575164, 1574558, 1572844, 1569979, 1565973, 1560353, 1552429, 1541777, 1528041, 1510663, 1489526, 1465846, 1441725, 1418753, 1397470, 1378143, 1361358, 1347651, 1337097, 1329449, 1324290, 1320990, 1319085, 1318862, 1321053, 1325782, 1332337, 1340215, 1349842, 1361917, 1376471, 1392870, 1410320, 1428092, 1445584, 1462494, 1478670, 1493665, 1506866, 1518264, 1528614, 1538538, 1547886, 1556289, 1563841]
$$ [...]
##END NTUPLES=NMR SPECTRUM
##END=
