##TITLE=AC1460_TOLI013266_8026534_Pm2D3dMUwm
##JCAMPDX= 6.0         $$ Bruker NMR JCAMP-DX V2.0
##DATA TYPE= NMR SPECTRUM
##DATA CLASS= NTUPLES
##ORIGIN= BRUKER
##OWNER= Administrator
$$ 1.72 TOPSPIN		Version 2.1
$$ 2013-07-11 17:12:47.153 -0700  Administrator@X
$$ Compression mode = diff/dup
##.OBSERVE FREQUENCY= 400.02188249412
##.OBSERVE NUCLEUS= ^1H
##.ACQUISITION MODE= SIMULTANEOUS (DQD)
##.ACQUISITION SCHEME= undefined
##.AVERAGES= 8
##.DIGITISER RES= 22
##SPECTROMETER/DATA SYSTEM= spect
##.PULSE SEQUENCE= zg30
##.SOLVENT NAME= COFFEE_meoh
##.SHIFT REFERENCE= INTERNAL, COFFEE_meoh, 1, 14.98509
##AUDIT TRAIL= $$ (NUMBER, WHEN, WHO, WHERE, PROCESS, VERSION, WHAT)
$$ ##TITLE= Audit trail, TOPSPIN		Version 2.1
$$ ##JCAMPDX= 5.01
$$ ##ORIGIN= Bruker BioSpin GmbH
$$ ##OWNER= Administrator
$$ $$ E:\/data/COFFEE/nmr/AC1460_TOLI013266_8026534_Pm2D3dMUwm/10/pdata/1/auditp.txt
$$ ##AUDIT TRAIL=  $$ (NUMBER, WHEN, WHO, WHERE, PROCESS, VERSION, WHAT)
(   1,<2013-07-11 17:12:40.200 -0700>,<Administrator>,<X>,<go>,<TOPSPIN 2.1>,
      <created by zg
	started at 2013-07-11 17:11:33.856 -0700,
	POWCHK enabled, PULCHK disabled,
       configuration hash MD5:
       C8 4E 4E 5D D3 5C D8 9E 9F 52 82 E0 59 8A DE 15
       data hash MD5: 64K
       7C 9A 76 32 15 C7 12 2C 6D 98 1A 60 7A 9A 37 E0>)
(   2,<2013-07-11 17:12:43.137 -0700>,<Administrator>,<X>,<proc1d>,<TOPSPIN 2.1>,
      <Start of raw data processing
       efp LB = 0 FT_mod = 6 PKNL = 1 PHC0 = 0 PHC1 = 0 SI = 32K 
       data hash MD5: 32K
       16 A7 7E 72 B7 C9 22 40 E5 0B 5B B0 7D AB C3 C8>)
(   3,<2013-07-11 17:12:43.497 -0700>,<Administrator>,<X>,<proc1d>,<TOPSPIN 2.1>,
      <pk PHC0 = 97.6355 PHC1 = 0 
       data hash MD5: 32K
       6E E5 90 33 6E 78 EE E1 9B E5 CD EC E4 0F D4 72>)
(   4,<2013-07-11 17:12:43.606 -0700>,<Administrator>,<X>,<proc1d>,<TOPSPIN 2.1>,
      <abs ABSG = 1 
       data hash MD5: 32K
       FE 94 0F C5 27 17 DD FA C5 EA 84 C1 0C 8B 72 9C>)
(   5,<2013-07-11 17:12:43.700 -0700>,<Administrator>,<X>,<proc1d>,<TOPSPIN 2.1>,
      <abs ABSG = 2 
       data hash MD5: 32K
       48 41 68 3F E3 5B C8 65 6E 93 43 B0 2E 7E F0 4A>)
(   6,<2013-07-11 17:12:43.762 -0700>,<Administrator>,<X>,<proc1d>,<TOPSPIN 2.1>,
      <abs ABSG = 3 
       data hash MD5: 32K
       97 C8 00 EF 05 44 50 0E AF F9 72 5A 83 65 E9 06>)
(   7,<2013-07-11 17:12:43.825 -0700>,<Administrator>,<X>,<proc1d>,<TOPSPIN 2.1>,
      <abs ABSG = 4 
       data hash MD5: 32K
       36 F8 E5 A0 A9 D0 CE 81 B8 65 6D 07 9C 21 D5 BF>)
(   8,<2013-07-11 17:12:43.903 -0700>,<Administrator>,<X>,<proc1d>,<TOPSPIN 2.1>,
      <abs ABSG = 5 
       data hash MD5: 32K
       A5 63 09 8D 82 AA 8C 25 6D DE 15 F5 BA 40 FB 2D>)
$$ ##END=
$$ 
$$ $$ hash MD5
$$ $$ A3 02 E2 CB 38 AB 45 02 48 95 C7 8A 91 2A 33 E3
##$RELAX= 
##$RELAX= 
##$RELAX= 
##$RELAX= 
##$RELAX= 
##$RELAX= 
##$RELAX= 
$$ Bruker specific parameters
$$ --------------------------
##$DU= <E:\>
##$EXPNO= 10
##$NAME= <AC1460_TOLI013266_8026534_Pm2D3dMUwm>
$$ [...]
##$TP= (0..7)
150 150 150 150 150 150 150 150
##$TP07= 0
##$TPNAME0= <>
##$TPNAME1= <>
##$TPNAME2= <>
##$TPNAME3= <>
##$TPNAME4= <>
##$TPNAME5= <>
##$TPNAME6= <>
##$TPNAME7= <>
##$TPOAL= (0..7)
0.5 0.5 0.5 0.5 0.5 0.5 0.5 0.5
##$TPOFFS= (0..7)
0 0 0 0 0 0 0 0
##$TUNHIN= 0
##$TUNHOUT= 0
##$TUNXOUT= 0
##$USERA1= <user>
##$USERA2= <user>
##$USERA3= <user>
##$USERA4= <user>
##$USERA5= <user>
##$V9= 5
##$VALIST= <valist>
##$VCLIST= <CCCCCCCCCCCCCCC>
##$VD= 0
##$VDLIST= <DDDDDDDDDDDDDDD>
##$VPLIST= <PPPPPPPPPPPPPPP>
##$VTLIST= <TTTTTTTTTTTTTTT>
##$WBST= 1024
##$WBSW= 4
##$XGAIN= (0..3)
0 0 0 0
##$XL= 0
##$YL= 0
##$YMAX_a= 597809
##$YMIN_a= -508121
##$ZGOPTNS= <>
##$ZL1= 120
##$ZL2= 120
##$ZL3= 120
##$ZL4= 120
##$ABSF1= 14.98509
##$ABSF2= -5.573092
##$ABSG= 5
##$ABSL= 3
##$ALPHA= 0
##$AQORDER= 0
##$ASSFAC= 0
##$ASSFACI= 0
##$ASSFACX= 0
##$ASSWID= 0
##$AUNMP= <proc_prof1d_extract_pilot.lims>
##$AXLEFT= 0
##$AXNAME= <>
##$AXNUC= <1H>
##$AXRIGHT= 0
##$AXTYPE= 0
##$AXUNIT= <>
##$AZFE= 0.1
##$AZFW= 0.1
##$BCFW= 0
##$BC_mod= 0
##$BYTORDP= 0
##$COROFFS= 0
##$CY= 15
##$DATMOD= 1
##$DC= 0
##$DFILT= <>
##$DTYPP= 0
##$F1P= 0
##$F2P= 0
##$FCOR= 0.5
##$FTSIZE= 32768
##$FT_mod= 6
##$GAMMA= 0
##$GB= 0
##$INTBC= 1
##$INTSCL= 1
##$ISEN= 128
##$LB= 0
##$LEV0= 0
##$LPBIN= 0
##$MAXI= 10000
##$MC2= 0
##$MEAN= 0
##$ME_mod= 0
##$MI= 0
##$NCOEF= 0
##$NC_proc= -8
##$NLEV= 6
##$NOISF1= 0
##$NOISF2= 0
##$NSP= 0
##$NTH_PI= 0
##$NZP= 0
##$OFFSET= 14.98509
##$PC= 1
##$PHC0= 97.6355
##$PHC1= 0
##$PH_mod= 1
##$PKNL= yes
##$PPARMOD= 0
##$PPDIAG= 0
##$PPIPTYP= 0
##$PPMPNUM= 2147483647
##$PPRESOL= 1
##$PSCAL= 4
##$PSIGN= 0
##$PYNMP= <proc.py>
##$REVERSE= no
##$SF= 400.02
##$SI= 32768
##$SIGF1= 0
##$SIGF2= 0
##$SINO= 400
##$SIOLD= 32768
##$SPECTYP= <>
##$SREGLST= <1H.CDCl3>
##$SSB= 0
##$STSI= 32768
##$STSR= 0
##$SW_p= 8223.68421052631
##$SYMM= 0
##$S_DEV= 0
##$TDeff= 65536
##$TDoff= 0
##$TI= <>
##$TILT= no
##$TM1= 0
##$TM2= 0
##$TOPLEV= 0
##$USERP1= <user>
##$USERP2= <user>
##$USERP3= <user>
##$USERP4= <user>
##$USERP5= <user>
##$WDW= 1
##$XDIM= 32768
##$YMAX_p= 412240770
##$YMIN_p= -694768
##$CURPLOT= <Network HP LaserJet P1505>
##$CURPRIN= <$Network HP LaserJet P1505>
##$DFORMAT= <normdp>
##$LAYOUT= <+/1D_H.xwp>
##$LFORMAT= <normlp>
##$PFORMAT= <normpl>
##$SURQMSG= 1
$$ End of Bruker specific parameters
$$ ---------------------------------
##NTUPLES= NMR SPECTRUM
##VAR_NAME=  FREQUENCY,     SPECTRUM/REAL,   SPECTRUM/IMAG
##SYMBOL=    X,             R,               I
##VAR_TYPE=  INDEPENDENT,   DEPENDENT,       DEPENDENT
##VAR_FORM=  AFFN,          ASDF,            ASDF
##VAR_DIM=   32768,         32768,           32768
##UNITS=     HZ,            ARBITRARY UNITS, ARBITRARY UNITS
##FACTOR=    0.250966925370066, 1,           1
##FIRST=     8223.43324360094, -33319,       -224734
##LAST=      0,             -34036,          -84691
##MIN=       0,             -694768,         0
##MAX=       8223.43324360094, 412240770,    0
$$ Real data points
##PAGE= N=1
##DATA TABLE= (X++(R..R)), XYDATA
$$ [...]
$$ plain form
19560 460989 -73948 63976 -116860 82100 -132518 -157345 -137716 134753 38506 -59114 -76137
19549 -76137 -151068 -42108 318590 96514 952 -197229 -107618 124359 -247894 446 -157755
19537 143380 -208083 18686 -6705 -53932 -322787 -38540 -110369 -158137 -298933 -349571 -123801
19525 157330 9924 110662 -28931 337208 -313354 -537036 167223 91130 -10724 1517 -157190
19513 46104 -108463 -196680 75829 135609 -137646 -311290 75102 -118400 -346453 -100844
19502 -341190 -83089 230442 50089 21535 165837 30365 -50134 -46569 -104597 24288 193185
19491 193185 151082 127386 65354 291668 111462 -78763 -168822 -212190 95597 152758 -99240
19479 -161759 -57761 76610 -83777 74861 64496 -104156 -158533 247429 98425 -163958 -58422
$$ packed form
19560D60989g3948F3976a16860H2100a32518k4827J9629A34753C8506e9114j7023
19549g6137p4931d2108C18590I6514I52a97229Q9611A24359b47894D46a57755
19537A43380b08083A8686f705m7227k68855c8540p1829m7768j40796n0638a23801
19525A57330I924J00738b8931C37208c13354k23682A67223p6093a0724A517a57190
19513D6104a08463q8217G5829N9780a37646j73644G5102a18400k28053a00844
19502c41190h3089B30442E0089B1535J44302C0365e0134L565n8028B4288J68897
19491A93185m2103k3696o2032K26314A11462g8763r0059m3368I5597N7161i9240
19479a61759e7761G6610h3777G4861j0365a04156n4377B47429I8425a63958e8422
$$ plain form
19467 47294 186882 150754 28117 -72766 -345562 -119460 -69959 -159039 28325 29989 -91213
19455 21198 -108539 -200532 -27575 370947 118030 -299043 -112547 2628 113809 -123837
19444 -365038 -429594 169088 -108003 -17952 136109 -224483 -128792 -430712 -31820 -44636
19434 -44636 -268975 -301018 62958 46767 -148173 -271437 -18552 287360 -199601 -512894
19424 -512894 -90264 -63108 -1202 -58452 -126204 -175675 -250388 -129231 -223249 -118482 260276
19412 -164354 -205219 -78530 288159 -35091 -59601 -347895 50970 111613 -16871 43180 45480
19401 45480 74896 -210572 -160085 97672 -183590 348093 -52232 311511 -302746 -119263
19390 7746 -336226 -4726 -307828 156398 52150 51752 -487928 32864 -107927 -225667 48709
$$ packed form
19467D7294J39588l6128B8117g2766k72796a19460M9501q9080B8325J664i1213
19455B1198a08539r1993b7575C70947A18030b99043a12547B628J11181a23837
19444c65038o4556A69088a08003a7952A36109b24483R5691l01920c1820j2816
19434d4636k24339l2043F2958j6191a48173j23264a8552B87360a99601l13293
19424e12894i0264K7156a202n7250o7752m9471p4713J21157r4018J04767B60276
19412a64354m0865g8530B88159c5091k4510k88294E0970O0643a6871D3180K300
19401D5480K9416b10572N0487I7672a83590C48093e2232C11511c02746a19263
19390G746c36226d726l03102A56398E2150l98d87928C2864a07927j17740D8709
$$ plain form
19378 179545 -101533 -119248 22905 57919 -70092 -106928 -70203 -29206 143811 -88497 -125489
19367 -125489 -189360 195728 115740 -237727 -23750 21250 -220374 59736 -122285 23734 -60156
19355 170558 -107996 -219566 -141399 223584 -68369 -32222 -77420 -175889 137721 -47064 74687
19343 -49232 -10959 -191858 73584 -206504 348466 25647 -144345 -206030 95008 -162061 -107309
19332 -107309 165247 -122524 205869 -165313 -326001 -413288 -365207 68833 -118812 207868
19321 -34118 -28314 -98298 -85647 85338 -135614 -179621 -285474 -82814 169025 18453 -100137
19309 69407 -364219 -243619 -138426 -17797 -327859 -4349 -86440 -173557 -92035 -41126 284284
19297 61692 -326691 -101637 85741 -106785 -257215 -74981 278626 120025 -253519 -252277
$$ packed form
19378A79545a01533j7715B2905L5014g0092l6836L6725b9206A43811h8497l6992
19367a25489o3871A95728p9988b37727b3750B1250b20374E9736a22285B3734f0156
19355A70558a07996j11570P8167B23584f8369c2222m5198r8469A37721d7064G4687
19343d9232a0959j80899G3584b06504C48466B5647a44345o1685I5008a62061N4752
19332a07309A65247a22524B05869a65313j60688q7287M8081F8833a18812B07868
19321c4118N804o9984J2651H5338a35614m4007j05853h2814A69025A8453a00137
19309F9407c64219J20600J05193a7797l10062d349q2091q7117Q1522d1126B84284
19297F1692c26691a01637H5741a06785j50430g4981B78626A20025b53519J242
$$ plain form
19287 -252277 -186545 -219032 52015 -62256 -283726 -270934 -71338 157904 -137463 -144090 73530
19275 -73447 268093 -4210 161762 314251 48037 156524 -339735 -151329 -35746 48730 139284
19264 139284 151031 -102661 -96747 -224646 -255796 -117197 276620 -68606 105915 -285824
19253 -31345 189412 -83713 -78105 -67734 -118176 -194694 -292635 -395168 152341 180865 -375571
19241 -305613 -47743 108287 -54031 -285701 -513873 -106025 -268615 -53723 517386 -232134
19230 -23528 -115961 -94727 132046 -115179 -82945 -60935 121934 -178558 302856 -69789 -30472
19218 82686 -112561 239371 85066 -206719 107475 -245595 7161 -19060 212143 -122796
19207 74523 -118561 -343183 149894 123632 -258550 -342096 391809 156229 124197 -244433
$$ packed form
19287b52277O5732l2487E2015f2256k21470J2792g1338A57904a37463o627G3530
19275g3447B68093d210A61762J52489D8037J08487c39735a51329c5746D8730R0554
19264A39284J1747a02661N914j27899l1150a17197B76620f8606A05915b85824
19253c1345A89412h3713N608J0371n0442p6518r7941j02533A52341K8524c75571
19241c05613d7743A08287e4031k31670k28172a06025j62590e3723E17386b32134
19230b3528r2433K1234A32046a15179L2234K2010A21934a78558C02856f9789c0472
19218H2686a12561B39371H5066b06719A07475b45595G161a9060B12143a22796
19207G4523a18561k24622A49894k6262b58550q3546C91809A56229l2032b44433
$$ plain form
19196 136060 74126 83920 -65350 30533 106011 -199500 -182857 178109 270980 -395971 202337
19184 -12564 4585 -99286 189014 65706 107500 236082 79239 -105444 -267076 -340526 -152684
19172 39774 -13583 23985 -137783 -180646 274747 -54730 109707 -98893 -116130 -469448 -215733
19160 -33859 -66154 -265614 -34247 -140005 -287532 -63093 25107 109515 -35361 61222 16644
19148 -186254 -49336 -177952 -200505 24427 -28309 -43331 -119515 -176214 -13959 -172661 13152
19136 149498 -225695 6640 -11846 20332 -138573 -276080 -111191 -282186 -257086 -187198 -117592
19125 -117592 -191587 -71667 98358 -373246 98811 87736 -110167 8498 -242420 -90850 52926
19113 -249910 -46453 -1428 43965 -154391 297237 -79734 -72724 8148 -231545 -190301 423068
$$ packed form
19196A36060o1934R794f5350C0533P5478a99500J6643A78109R2871c95971B02337
19184a2564D585i9286A89014F5706M1794J28582G9239a05444j61632p3450a52684
19172C9774a3583B3985a37783m2863B74747e4730A09707i8893j7237l53318b15733
19160c3859l2295j99460c4247j05758j47527f3093B5107Q4408c5361F1222A6644
19148a86254d9336j28616k2553B4427b8309j5022p6184n6699a3959j58702A3152
19136A49498b25695F640a1846B0332a38573j37507a11191j70995K5100O9888O9606
19125a17592p3995g1667I8358c73246I8811j1075a10167H498b42420i0850E2926
19113b49910d6453a428D3965a54391B97237g9734P010H148b31545M1244D23068
$$ plain form
19101 -211649 69447 -340541 -50902 -97321 110081 -344814 396357 -137913 84926 150985
19091 150985 247342 -247043 -118073 115127 -11564 -173579 -111036 -319758 174823 1052
19080 -67120 306183 228948 82782 -42819 -110223 -150496 -230969 185392 -160806 -5494 -315642
19069 -315642 165182 89465 -90994 -114754 -203518 -278002 -206875 67537 -52967 -198045 121293
19057 167475 -115783 153893 215584 158522 3391 159525 167579 -19263 -147018 -312142 -58559
19045 47950 126899 -248662 -126407 395838 -16976 49010 -206615 133906 155682 156441 -68919
19033 152156 -46194 114796 -247354 -176152 -137008 94502 191541 -354520 -125475 -177708 -102205
19022 -102205 -121561 35643 -159851 124385 -81941 10396 -106904 98594 -34373 107769 117188
$$ packed form
19101b11649F9447c40541e0902m6419A10081c44814C96357a37913H4926O6059
19091A50985R6357b47043a18073A15127a1564j62015O2543k08722A74823A052
19080f7120C06183p7235H2782d2819o7404m0273q0473A85392a60806e494l10148
19069c15642A65182p5717i0994k3760q8764p4484P1127F7537e2967j45078A21293
19057A67475a15783A53893O1691n7062C391J56134Q054a9263j27755j65124e8559
19045D7950P8949b48662J22255C95838a6976D9010b06615A33906K1776P59f8919
19033A52156d6194A14796b47354P1202L9144I4502R7039c54520a25475n2233P5503
19022a02205j9356C5643a59851A24385h1941A0396a06904I8594c4373A07769R419
$$ plain form
19011 117188 206229 144935 -40469 101336 -25040 -45548 -183069 -182288 -97702 -163486 -24626
18999 -425197 105133 -175134 73925 -258414 95717 15769 -180862 -277948 45733 5073 31219
18988 31219 -137377 167819 3531 -21155 31919 -238794 289093 -9002 95287 253055 -35393
18976 194343 -84954 77917 -20618 -64639 311600 79396 106331 305112 -117455 -255695 33961
18964 -449633 -77055 92962 -121077 16820 -72113 -161103 -264205 160071 -220410 -134736 -64453
18952 -76894 -309608 112020 72626 -30718 -47040 -139524 179583 38547 64040 -10484 -108319
18941 -108319 69983 30550 -77853 -302474 -167020 -279043 126038 -274341 -206989 277893
18930 93845 250238 -114423 -184250 152714 -160278 240265 -25839 -192161 -226461 -230781 74364
$$ packed form
19011A17188Q9041o1294d0469A01336b5040k0508j37521P81Q4586o5784b4626
18999d25197A05133a75134G3925b58414I5717A5769a80862r7086D5733E073K6146
18988C1219a37377A67819C531b1155C1919b38794B89093i002I5287J57768c5393
18976A94343h4954G7917b0618m4021C11600G9396K6935J98781a17455j38240C3961
18964d49633g7055I2962a21077A6820g2113q8990j03102A60071b20410Q5674f4453
18952g6894k32714A12020l9394c0718j6322r2484A79583C8547K5493a0484r7835
18941a08319F9983C0550g7853k24621J35454j12023A26038b74341O7352B77893
18930I3845J56393a14423o9827A52714a60278B40265b5839j66322l4300m320G4364
$$ plain form
18918 -214877 -396076 96098 212958 132365 -252751 100029 -242771 -87061 -380902 73133
18907 -101582 125260 -38465 121858 79561 -214098 -40470 -208248 -21021 -93296 522551
18896 -50715 -3333 -75567 -79006 -279627 127480 -204646 -81730 -132439 -254708 -28113 -245586
18885 -245586 -68386 78435 -496642 221982 74968 40792 309696 60862 -301514 334060
18874 -215150 24108 29121 -29622 -47625 -91880 -244806 -269927 -225302 -11148 126500 116823
18863 116823 -2891 -28126 -43358 -137889 54343 -138767 21428 -22281 245335 -57076 223380
18851 -225651 -267287 -85269 48110 -26211 72226 -102126 159574 55604 -355928 156788 -82992
18839 -106733 57415 120197 -233761 -399568 -213086 25463 -242175 97271 7563 283272 277057
$$ packed form
18918b14877j81199I6098J16860q0593b52751A00029b42771h7061k93841G3133
18907a01582A25260c8465A21858m2297b14098d0470j67778b1021p2275E22551
18896e0715c333p2234l439k00621A27480b04646h1730n0709j22269b8113k17473
18885b45586f8386G8435d96642B21982G4968l4176K68904F0862c01514C34060
18874b15150B4108N013b9622j8003m4255j52926k5121M4625a1148A26500r677
18863A16823b891k5235j5232r4531E4343a38767B1428b2281B45335e7076B23380
18851b25651m1636h5269D8110b6211G2226a02126A59574E5604c55928A56788h2992
18839a06733E7415O2782b33761j65807J86482B5463b42175I7271G563K75709o215
$$ plain form
18828 277057 -287060 -50410 134350 -428507 -131006 -41951 -63170 210942 183766 56001
18817 161325 409692 241408 37292 -331049 88680 220741 176623 112729 107838 232069 -65481
18805 -346633 42393 95750 -192026 -12225 189637 -365410 -127127 -16025 48533 -180475
18794 12505 29740 -107247 121484 -208897 156459 51151 -77457 -98946 27069 26797 -203747
18782 -142405 11083 -5159 -39304 -123824 152773 -192658 63431 5904 122221 133160 -15532
18770 184833 228440 -158181 71100 -13436 -252432 -383266 -204890 -301653 -200926 -356495
18760 -356495 8044 188792 -266157 279492 119968 13320 -239383 -346988 162753 -117989
18749 -312586 -31984 233955 185429 -420777 298333 -86805 -293464 23223 146594 88959
$$ packed form
18828B77057b87060e0410A34350d28507a31006d1951k1219B10942k7176E6001
18817A61325K48367j68284C7292c31049H8680J32061m4118o3894m891J24231f5481
18805c46633D2393N3357a92026a2225A89637c65410a27127a6025D8533a80475
18794A2505J7235a07247A21484b08897A56459E1151g7457k1489B7069k72b03747
18782a42405A1083e159l4145q4520A52773a92658F3431E904J16317J0939a5532
18770A84833M3607a58181G1100a3436k38996j30834J78376r6763J00727j55569
18760c56495H044J80748b66157B79492A19968A3320b39383j07605A62753a17989
18749c12586c1984B33955m8526d20777B98333h6805k06659B3223J23371n7635
$$ plain form
18739 88959 -155395 11273 227104 -187100 -297049 -259844 279428 -331932 91907 -24298
18728 231651 98571 -170608 63237 -72481 -110704 -572 -464859 -41064 78256 255592 -323526
18716 117689 3789 19551 -177729 -255142 -161092 -29269 289757 -63597 119486 -1877 8280
18704 -71405 -23641 235553 26038 -104773 -42050 45128 -87728 -137201 -168266 388804 -150124
18692 11380 -79054 -171100 309599 -92559 -106461 166836 171746 201548 211882 -202602 -117707
18681 -117707 -199212 -14768 75277 -17831 -180608 -115747 15481 -268536 -59090 -242977 135353
18669 277444 -257991 -254870 -120741 -183177 -122034 37202 -245915 150399 48195 -205927 -143043
18658 -143043 30571 -204839 173361 39955 -130823 -164700 -347598 98285 118852 -27873 -195009
$$ packed form
18739H8959a55395A1273K15831a87100j09949L7205B79428c31932I1907b4298
18728B31651I8571a70608F3237g2481l8223e72m64287d1064G8256J77336c23526
18716A17689C789J5762a77729p7413R4050b9269B89757f3597A19486a877H280
18704g1405b3641B35553B6038a04773d2050D5128h7728m9473l1065C88804a50124
18692A1380g9054r2046C09599i2559j3902A66836M910K9802J0334b02602Q4895
18681a17707q1505a4768G5277a7831j62777O4861A5481b68536e9090j83887A35353
18669B77444b57991L121a20741o2436O1143C7202b45915A50399D8195b05927O2884
18658a43043C0571b04839A73361C9955a30823l3877j82898I8285K0567b7873j67136
$$ plain form
18647 -195009 100283 -353661 -320978 9363 100893 -238364 4652 81383 82860 261952 -389527
18635 161320 -35585 63278 -268840 76135 -16475 -30730 -166402 102183 -11634 56889 -268133
18623 -192644 212833 70408 -163904 -42032 23089 159644 -152174 176113 -490723 -69638
18612 -56895 -240498 -118792 10624 24786 231627 32632 21930 277611 425680 40307 -84766
18600 -42561 -205782 -150609 -98416 -192509 163551 131012 24936 -388358 -12334 -406010 -304071
18589 -304071 332015 371011 3615 -8973 -94128 -228821 -107476 -290045 -21345 25164 -236289
18577 -211271 -146461 80309 73812 -149152 -105618 -139107 65956 -31992 220577 201079 15704
18565 -424002 -286099 173595 -76847 -134744 -380219 56781 -71819 -228070 23680 -152616
$$ packed form
18647a95009A00283c53661L2683I363R1530b38364D652P6731J477J79092c89527
18635A61320c5585F3278b68840G6135a6475j4255j35672A02183a1634E6889b68133
18623a92644B12833G0408a63904d2032B3089J36555a52174A76113d90723f9638
18612e6895j83603a18792A0624J4162K06841C2632j0702K55681J48069D0307h4766
18600d2561j63221N5173N2193r4093A63551l2539B4936c88358a2334l93676J01939
18589c04071C32015L8996C615h973q5155j34693a07476j82569b1345B5164b36289
18577b11271O4810H0309o497a49152M3534l3489F5956c1992B20577j9498A5704
18565d24002J37903A73595g6847n7897k45475E6781g1819j56251B3680a52616
$$ plain form
18554 143694 81993 -204477 -134213 -99245 -262900 312657 -155528 -67598 -99202 -85174 163005
18542 -17028 -111072 -22734 -124465 8828 309949 -120689 58194 -243616 -66265 -180053 -182522
18531 -182522 -197378 -375225 -290173 255589 -294125 -164607 202532 152349 -490 50015 107107
18520 107107 -187643 -63801 -122660 -91155 -200298 -207823 122278 218755 -4881 181989 -160535
18508 328678 -328874 14503 90585 -3503 -109659 -261888 58374 173554 -89846 -67674 -422521
18497 -422521 -295092 4056 145008 172662 -127278 -45882 -172866 -29730 43164 -31765 171131
18485 -165091 7093 438867 -211490 -206774 266060 306146 -46691 38297 206024 107033 -26548
18473 -120251 -115710 2625 -188358 -38318 -160549 57443 80834 5500 233486 106344 95260
$$ packed form
18554A43694o1701b04477P0264L4968j63655C12657a55528f7598l1604J4028A63005
18542a7028r4044b2734j01731H828L01121a20689E8194b43616f6265j13788k469
18531a82522j4856j77847Q5052B55589b94125J29518B02532n0183d90E0015N7092
18520A07107a87643f3801n8859L1505j09143p525A22278R6477d881A81989a60535
18508C28678c28874A4503P6082c503j06156j52229E8374J15180h9846K2172l54847
18497d22521J27429D056J40952K7654a27278d5882j26984b9730D3164c1765A71131
18485a65091G093M31774b11490M716B66060M0086d6691C8297J67727r8991b6548
18473a20251M541B625a88358c8318j22231E7443K3391E500K27986A06344j1084
$$ plain form
18462 95260 -21756 -170361 -4332 179460 -33491 59625 75595 45274 -134231 -57834 130986
18450 -63789 74222 -113166 207508 -152656 -140044 -192829 -281264 -61268 -103820 -53198 -41920
18439 -41920 -27885 1063 261457 128593 230334 -22243 -535126 224523 -22687 43546 -201126
18427 -134245 106361 252870 -37871 184154 -67470 191472 39703 164611 -376120 -167976
18416 -394293 -239146 137468 -164600 37979 -91307 160055 -34712 -248309 -8732 28327 237142
18405 237142 132249 147336 -80921 495960 -227965 -50307 158672 -380787 -139714 91703
18394 -191828 -20052 -43072 -100308 -262322 -109113 -56822 -227478 99100 -271584 -445362
18384 -445362 227281 208821 8424 -299459 10979 47707 14578 -48656 22948 113276 -30258
$$ packed form
18462I5260b1756j48605d332A79460c3491E9625J5970l0321a34231e7834A30986
18450f3789G4222a13166B07508a52656J2612n2785q8435f1268m2552N0622J1278
18439d1920J4035A063K60394A28593J01741b2243n12883B24523b2687D3546b01126
18427a34245A06361J46509c7871A84154f7470A91472C9703J24908c76120a67976
18416c94293J55147A37468a64600C7979i1307A60055c4712k13597h732B8327K08815
18405B37142j04893J5087h0921D95960b27965e0307A58672c80787a39714I1703
18394a91828b0052k3020n7236j62014a09113N2291j70656I9100b71584j73778
18384d45362B27281j8460H424b99459A0979L6728A4578d8656B2948R0328c0258
$$ plain form
18372 -63751 -154963 28526 -252440 90419 -41954 -293612 196404 51534 67554 86445 59964
18361 59964 -296232 105913 -87183 152314 166018 105626 129548 -40250 -87092 116571 191191
18350 191191 -316460 -10563 59570 -93019 -128757 -202886 -237446 -71893 -191119 -90235 -146846
18339 -146846 -347194 -68170 203875 -125842 -16225 143934 -247891 92191 -105402 75636
18328 -67843 -147951 144598 -193824 60036 -53402 -257085 -207249 242162 -377381 -147169
18317 -304137 -2639 258984 -275900 -118987 204151 72251 -30986 -181136 -165827 -18337 31065
18305 25109 116562 -136686 -254263 -11316 -209061 -126607 -12908 -79095 -31030 -194070 373225
18293 -479076 -220418 93561 148806 -44684 144339 -90568 -108818 -412922 -445785 -114801 69970
$$ packed form
18372f3751r1212B8526b52440I0419d1954k51658A96404E1534J6020J8891k6481
18361E9964b96232A05913h7183A52314J3704o0392K3922d0250m6842A16571P4620
18350A91191c16460a0563E9570i3019l5738p4129l4560g1893j19226i0235n6611
18339a46846k00348f8170B03875a25842a6225A43934b47891I2191a05402G5636
18328f7843q0108A44598a93824F0036e3402k03683M9836B42162c77381a47169
18317c04137b639B58984b75900a18987B04151G2251c0986j50150J5309a8337C1065
18305B5109R1453a36686j17577a1316j97745Q2454a2908o6187c1030j63040C73225
18293d79076b20418I3561N5245d4684A44339i0568j8250l04104l2863a14801F9970
$$ plain form
18281 194492 256923 17231 -198260 -132145 -218151 189943 -106481 415788 50144 -120825
18270 -313872 -116761 -73929 48250 -12842 326084 -38236 -229965 -84691 108619 -57666 19466
18258 -16457 16147 53061 -62198 -106651 -87064 -52093 117446 21540 -150847 -103433 -77704
18247 -77704 357934 250126 -21961 -131559 198214 -323514 200439 66282 -46686 38854
18236 -90957 -321052 -133940 166077 -207608 -208694 89335 7567 -71760 -88721 -61341 282208
18224 -53310 277001 -39076 86118 -238357 -115887 188100 -107360 -15451 -261591 180130
18213 -197879 54576 209978 -206256 243247 -204293 -47782 49301 133 126959 -362664 -319997
18202 -319997 93622 -134966 51039 -92311 -22673 253773 61961 -51925 -361801 200353 -217345
$$ packed form
18281A94492O2431A7231a98260O6115q6006A89943a06481D15788E0144a20825
18270c13872a16761M2832D8250a2842C26084c8236j91729h4691A08619e7666A9466
18258a6457A6147L6914f2198m4453J9587L4971A17446B1540a50847M7414K5729
18247g7704C57934j07808b1961j09598A98214c23514B00439F6282d6686C8854
18236i0957k30095a33940A66077b07608j086H9335G567g1760j6961K7380B82208
18224e3310B77001c9076H6118b38357a15887A88100a07360a5451k46140A80130
18213a97879E4576J55402b06256B43247b04293d7782D9301A33J26826c62664M2667
18202c19997I3622a34966E1039i2311b2673B53773F1961e1925l09876B00353b17345
$$ plain form
18190 9636 -38801 27387 -41478 117779 -117705 -15234 186601 -233533 -166505 54815 147083
18179 147083 115709 -27541 83463 105368 -101592 -77321 415443 50264 247623 -226467 -43235
18167 154662 -144151 -89974 -124733 135903 46811 -88627 -38484 -250266 -24491 -267723 -128240
18155 160272 -162966 -109941 93760 -130078 5923 -432914 320081 -158525 -179896 -338726
18145 -338726 -116281 -322434 19351 37641 306947 139371 -443119 29216 -139584 -180408
18135 -180408 -102946 101959 -259896 69551 -272089 -200650 -249118 13467 197160 16206 -184338
18123 -145611 -173125 -105968 -27530 -65726 11900 93947 202681 -55580 54808 168179 -247107
18111 182043 247642 54410 -57040 -334276 191368 -33117 -13854 81641 445900 -109677 -159814
$$ packed form
18190I636c8801B7387d1478A17779a17705a5234A86601b33533O7028E4815R2268
18179A47083l1374b7541H3463K1905a01592K4271D15443E0264J97359b26467d3235
18167A54662a44151N4177l4759A35903D6811h8627c8484k11782b4491k43232a28240
18155A60272a62966N3025I3760a30078E923d32914C20081a58525k1371j58830
18145c38726a16281k06153A9351J8290K69306A39371d43119B9216a39584m0824
18135a80408P7462A01959b59896F9551b72089P1439m8468A3467J83693A6206a84338
18123a45611k7514O7157b7530l8196A1900Q2047J08734e5580E4808J13371b47107
18111A82043O5599E4410e7040k77236A91368c3117a3854H1641L64259a09677n0137
$$ plain form
18100 -159814 194434 60651 -304204 -167894 -27493 -345157 -143986 140609 181454 -106379
18089 76588 -187350 444 183366 35007 144367 -20484 -367859 17579 -689 -181773 164016
18077 -16003 -61533 -175929 227693 220773 137338 76447 85186 263785 -133515 90336 110623
18066 110623 8749 -75802 65464 -179197 -220589 102978 -18370 -158604 64619 358596 -41137
18054 -382298 -216437 -54469 22380 -231713 -55697 291212 -99116 27349 81943 324331 264561
18043 264561 -111429 29494 -163924 -327948 -105341 -94669 -31587 -135543 203198 -12976
18032 59228 -46167 -54984 -117398 -24118 127745 -237103 132062 8288 -84875 -29156 101343
18020 -159604 1110 -116804 -319285 83456 -160734 -269512 -47242 -384913 17903 -313944
$$ packed form
18100a59814A94434F0651c04204J36310b7493l17664a43986A40609M0845a06379
18089G6588a87350D44J82922C5007J09360b0484l47375A7579f89j81084A64016
18077a6003m5530j14396B27693o920q3435o0891Q739J78599a33515I0336K0287
18066A10623H749g5802F5464a79197m1392A02978a8370j40234F4619K93977d1137
18054c82298J65861e4469B2380b31713e5697B91212i9116B7349N4594K42388n9770
18043B64561a11429B9494a63924j64024a05341J0672c1587j03956B03198a2976
18032E9228d6167q817o2414b4118A27745b37103A32062H288h4875b9156A01343
18020a59604A110a16804k02481H3456a60734j08778d7242l37671A7903c13944
$$ plain form
18009 61275 77256 184092 318756 -66588 84620 115015 -252472 234275 346834 -137381
17998 -11034 183159 214967 148883 105806 88273 -286376 -189273 -114180 168770 -158458 54861
17986 -38077 -113829 -42234 246753 -55772 109303 -3033 -27748 -48267 246168 20081 -193524
17974 -36900 8793 -92881 -180232 95349 59242 -144011 64585 151526 370332 111466 -157163
17962 41382 -51457 27004 -53741 -109494 162873 -158985 -200336 -267301 98120 -446466 -16993
17950 -12751 152184 76029 -22983 63559 93620 149869 -164804 225516 171973 -58430 337493
17938 -169129 -258732 -27214 -6391 109988 -288650 2498 171934 154544 -72637 -639407 -180862
17926 -192532 259340 -47772 166937 -26016 -225347 176298 116266 70896 -287192 172912
$$ packed form
18009F1275J5981J06836J34664f6588H4620L0395b52472B34275J12559a37381
17998a1034A83159L1808o6084m3077j7533b86376R7103P5093A68770a58458E4861
17986c8077p5752d2234B46753e5772A09303c033k4715k0519B46168B0081a93524
17974c6900H793i2881q7351I5349l6107a44011F4585Q6941K18806A11466a57163
17962D1382e1457B7004e3741n5753A62873a58985m1351o6965I8120d46466a6993
17950a2751A52184G6029b2983F3559L0061N6249a64804B25516n3543e8430C37493
17938a69129q9603b7214f391A09988b88650B498J69436j7390g2637n66770a80862
17926a92532B59340d7772A66937b6016j99331A76298o0032m5370b87192A72912
$$ plain form
17915 18556 -280804 -45666 235389 31567 194017 -181162 -67543 340484 153042 -100434
17904 -257867 -34318 -197228 59363 -30060 -238201 -351629 2109 -147527 266162 -396688
17893 72213 75639 11014 126812 -9333 74636 -51999 405004 -186170 99412 330429 -3257
17881 -158908 84866 -146594 247683 -35918 -244742 -39447 130304 12742 -77990 -35664 213852
17869 -51975 101251 134807 -127349 -106925 -32281 284786 -123812 -167653 -240032 -8413 -236395
17858 -236395 69260 -112821 92185 -28015 110412 -98906 133106 -125137 -71649 -32358 -226086
17847 -226086 -172801 112548 27586 -148145 -37333 -65099 -30867 21836 -348592 -218739 89864
17835 -150831 196876 214041 -239226 44107 -19221 91246 305508 33681 131986 49176 -3086
$$ packed form
17915A8556b80804d5666B35389C1567J62450a81162f7543C40484A53042a00434
17904b57867c4318j62910E9363c0060k08141j13428B109a47527B66162c96688
17893G2213L426A1014J15798i333G4636e1999D05004a86170I9412K31017c257
17881a58908H4866a46594B47683c5918k08824c9447A30304A2742g7990c5664B13852
17869e1975A01251L3556a27349K0424c2281B84786a23812m3841p2379h413k27982
17858b36395F9260a12821I2185b8015A10412i8906A33106a25137N3488c2358j93728
17847b26086N3285A12548B7586a48145c7333k7766c0867B1836c48592J29853H9864
17835a50831A96876J7165b39226D4107a9221I1246K14262C3681R8305D9176c086
$$ plain form
17823 -155316 -152802 42382 215216 -21002 168219 -111433 231639 21791 90288 -151227 -295836
17812 -295836 -214891 280380 106204 -24566 -83101 -209549 98127 -284012 -34266 74443 -13454
17800 83342 121501 -152563 8690 -40128 -200027 -157130 7422 87142 -207875 150353 -150807
17788 121567 -271872 155169 -80488 -233173 1144 282532 -165299 91896 32305 344770
17778 344770 40597 114083 168620 113231 32557 125989 -37377 -137395 242342 80217 -100837
17766 144715 -94537 -110861 -47110 -47773 -42811 -230791 258599 -109607 -7177 131903 -17494
17754 -107920 16043 73498 -111846 282119 -20451 -127430 -139333 -164672 119072 103805 56959
17743 56959 -229786 -114880 294672 -244163 -103719 221360 -47201 -78821 52064 -98168
$$ packed form
17823a55316K514D2382J72834b1002A68219a11433B31639B1791O8497a51227j44609
17812b95836Q0945B80380A06204b4566n8535j26448I8127b84012c4266G4443a3454
17800H3342L8159a52563H690d0128j59899M2897G422P9720b07875A50353a50807
17788A21567b71872A55169h0488j52685A144K81388a65299I1896C2305L12465
17778C44770D0597P3486N4537n5389C2557R3432c7377j00018B42342H0217a00837
17766A44715i4537j6324d7110o63M962j87980B58599a09607g177A31903a7494
17754a07920A6043N7455a11846B82119b0451j06979j1903k5339A19072j5267m6846
17743E6959b29786a14880B94672b44163a03719B21360d7201l1620E2064i8168
$$ plain form
17732 -291338 -65469 212933 134344 -127899 209614 135084 -88015 322872 -112545 229061
17721 160681 -175490 -138879 -7132 -241958 171600 -126845 190325 112021 -96778 -196200 192626
17709 96708 43528 28295 50167 63896 -26349 -16576 -197733 -154309 294989 -30103 23222
17697 49092 -203753 -73528 -230181 -170469 139453 -195998 -216846 271887 151047 -72008
17686 319131 123469 176084 178339 -234361 140896 31877 -3646 236471 -117301 -309351 -27939
17674 -338518 82339 -7971 -112589 255316 81725 -31650 -103408 94485 19823 -80319 67535
17662 276018 141052 -122961 -193014 32904 -346173 235538 23918 242174 67278 149347
17652 149347 -191026 -124788 76156 -90266 163161 137023 -1778 -288595 -371385 -133561 3668
$$ packed form
17732b91338f5469B12933p8589a27899B09614p4530h8015C22872a12545B29061
17721A60681a75490L6611g132k34826A71600a26845A90325p8304i6778r9422A92626
17709I6708D3528j5233K1872J3729b6349R773j81157M3424B94989c0103B3222
17697D9092b03753g3528j56653N9712A39453a95998k0848B71887j20840g2008
17686C19131A23469N2615K255b34361A40896C1877c646B36471a17301j92050b7939
17674c38518H2339g971j04618B55316H1725c1650p1758I4485A9823h0319F7535
17662B76018j34966a22961p0053C2904c46173B35538B3918K18256F7278Q2069
17652A49347a91026O6238G6156i0266A63161k6138a778k86817q2790a33561C668
$$ plain form
17640 18119 176051 48859 -190360 -157412 -19554 -208626 404761 -44337 139228 -17085 -145148
17629 -145148 160376 175299 107104 26348 19979 -22406 -21650 112569 35544 72566 142939 -35719
17616 -129469 -42295 -32331 177464 -320582 -66622 -179540 332976 -320098 341746 -59998
17605 136604 16233 -54519 67638 -391713 230558 -200608 455280 170249 189253 -85542
17594 182608 -20482 11101 96410 -335634 -87434 249238 -55062 358147 110347 -122251
17583 216843 16386 155766 -26931 90280 277264 43530 237402 -48818 231530 -166852
17572 227750 -59677 136473 -151187 -197101 254580 132226 14729 -340583 217996 -43850
17561 237916 127016 226122 -8083 19423 240141 345050 -86369 3297 257472 -111291 -102738
$$ packed form
17640A8119J57932D8859a90360L2948a9554j89072D04761d4337A39228a7085j28063
17629a45148A60376J4923o8195B6348o369b2406P56A12569C5544L7022P0373c5719
17616a29469d2295R964A77464c20582f6622j12918C32976c20098C41746e9998
17605A36604A6233e4519F7638c91713B30558b00608D55280A70249J9004h5542
17594A82608b0482A1101Q5309c35634h7434B49238e5062C58147A10347a22251
17583B16843A6386J39380b6931I0280J86984D3530J93872d8818B31530a66852
17572B27750e9677A36473a51187m5914B54580j22354A4729c40583B17996d3850
17561B37916j10900R9106h083A9423K20718J04909h6369C297K54175a11291Q553
$$ plain form
17550 -102738 -48531 -89917 22235 -60761 30435 -267656 299018 276478 334829 -66735 190141
17538 -2135 130891 -60479 327606 51077 60559 -233207 -99892 194943 -99810 55947 216023
17527 216023 10982 145678 28642 220641 -35971 106699 82139 -41687 72702 62304 -129666
17515 50066 144602 309525 126270 -99721 54339 358506 -98057 -4194 45797 233036 89204
17503 -111936 16122 239444 -131245 10002 195770 -180726 113102 282920 116572 35146
17492 230378 60372 -32745 152501 -22238 -63019 281726 19369 -30679 2931 353265 324265
17481 324265 238308 101519 -168721 322673 66385 -23250 161176 268501 -1434 107655
17470 47451 -89370 309503 8570 292584 302422 129956 29437 246909 20421 -292552 268098
$$ packed form
17550a02738d8531m1386B2235f0761C0435b67656B99018k2540N8351f6735A90141
17538b135A30891f0479C27606E1077R482b33207i9892A94943i9810E5947J60076
17527B16023A0982J34696B8642J91999c5971A06699k4560d1687G2702j0398a29666
17515E0066R4536J64923A26270i9721E4339L04167i8057d194D5797J87239H9204
17503a11936A6122K23322a31245A0002J85768a80726A13102J69818A16572C5146
17492B30378F0372c2745A52501b2238m0781B81726A9369c0679B931L50334k9000
17481C24265q5957A01519a68721C22673F6385b3250A61176J07325a434A07655
17470D7451h9370C09503H570K84014R838A29956B9437K17472B0421b92552B68098
$$ plain form
17458 -265067 7580 279408 171415 -13377 253531 244773 14172 208858 370558 -8809 418275
17446 -145222 386610 -35901 186120 265078 494165 -67045 -26995 117572 560868 215130
17435 55485 59379 421231 -7545 -28591 -20905 160146 309501 218666 417419 207848 215982
17424 215982 519577 163833 484247 255827 -83338 209091 270519 119497 302985 91221
17413 269667 212342 343836 354522 62576 95977 219476 244576 218837 -239112 175366 505576
17402 505576 -174688 193522 247549 47315 71254 -140577 151558 138232 168771 63616 136140
17391 136140 328191 -7656 123854 40856 21034 396129 -108949 347716 139605 367567
17381 367567 45298 189152 -46360 31188 324719 211827 -153046 147446 107302 52646
$$ packed form
17458b65067G580K71828j07993a3377B53531q758A4172J94686J61700h809D18275
17446a45222C86610c5901A86120P8958K29087f7045b6995A17572M43296B15130
17435E5485L894L61852g545k1046P686A60146J49355r0835J98753B07848Q134
17424B15982L03595A63833L20414k28420h3338B09091O1428A19497J83488I1221
17413B69667n7325J31494J0686F2576L3401J23499K5100k5739b39112A75366L30210
17402E05576a74688A93522N4027D7315K3939a40577A51558j3326L0539F3616P2524
17391A36140J92051g656A23854D0856j9822L75095a08949C47716A39605K27962
17381C67567D5298J43854d6360C1188K93531j12892a53046A47446m0144E2646
$$ plain form
17370 -70426 278051 -5613 -46210 75520 331829 363475 70975 122081 -185808 147431 307072
17359 307072 89462 101817 203010 250933 -124524 -80106 -209252 304797 119753 92598
17349 92598 -14131 174821 268536 328408 74125 -182661 277619 409708 -49275 345208 24899
17337 209544 37690 -52672 -117802 406039 -97751 -64641 96039 140530 -222677 340877 21132
17325 169261 288149 292761 32275 -224306 199758 286397 -150137 361316 177244 243411
17315 243411 503443 107708 78716 306438 372645 90226 258226 181360 116537 406148
17305 406148 63758 133390 -106601 117131 356124 -84821 297114 -62172 256475 91894
17294 519301 136016 176037 -67129 233658 109897 377007 218957 -167741 -35731 336721
$$ packed form
17370g0426B78051e613m0597G5520K56309L1646G0975N1106a85808A47431J59641
17359C07072H9462J2355J01193M7923a24524M4418j29146C04797A19753k7155
17349I2598a4131A74821R3715N9872G4125a82661B77619J32089d9275C45208B4899
17337B09544C7690e2672o5130D06039i7751L3110I6039M4491b22677C40877B1132
17325A69261J18888M612C2275b24306A99758Q6639a50137C61316A77244O6167
17315B43411K60032A07708k8992K27722O6207I0226J68000p6866o4823K89611
17305D06148F3758O9632a06601A17131K38993h4821B97114f2172B56475I1894
17294E19301A36016M0021f7129B33658A09897K67110j58050a67741c5731C36721
$$ plain form
17283 620026 87591 269525 94203 79003 -11088 64782 263609 197715 116303 52147 255310
17272 255310 72125 187440 360744 167856 290686 -431156 209179 531317 445916 14260
17261 159765 385950 94641 186453 162389 66607 258231 556973 257819 212885 82371 334603
17250 334603 91886 247401 65941 234804 202065 -71267 371440 176935 682219 -142353
17239 -30718 332076 -7598 -167516 74450 165552 486759 138150 280561 294445 99710 -107311
17227 136787 263468 -16048 360633 230458 195010 -22071 377691 204240 -3452 143780
17216 -64436 209571 167986 -36769 211208 321627 83264 100 335691 271932 259442 492676
17205 492676 259834 -25709 436102 146790 207409 452809 197062 317228 -67196 224723
$$ packed form
17283F20026H7591J81934I4203j5200a1088F4782J98827o5894q1412E2147K03163
17272B55310G2125J15315J73304A67856J22830d31156B09179L22138q5401A4260
17261A59765K26185I4641R1812k4064F6607J91624K98742B57819m4934H2371K52232
17250C34603I1886J55515F5941J68863l2739g1267C71440A76935N05284a42353
17239c0718C32076g598j59918G4450R1102L21207A38150J42411J3884I9710a07311
17227A36787J26681a6048C60633j30175l5448b2071C77691j73451c452A43780
17216f4436B09571m1585c6769B11208J10419H3264A00L35591o3759j2490K33234
17205D92676k32842b5709D36102A46790O0619K45400A97062J20166f7196B24723
$$ plain form
17194 455748 186836 265989 -62217 338184 250390 414386 501152 318796 319473 -29258 195956
17182 390110 281635 381414 292439 259002 213805 288549 397399 164877 545833 254859
17171 211494 277181 -14295 634336 357097 536738 116127 108319 4242 52371 532008 450352
17160 450352 221884 479398 205580 -207516 -17131 518330 209940 -281377 321197 372661
17150 372661 273084 97848 173708 572090 424822 360324 313471 128807 768044 46490 368332
17139 368332 255581 270961 401738 213978 460723 390618 404410 124610 190063 149926
17129 149926 346736 585623 187139 505369 157503 257285 109217 473806 109104 -32102
17118 480898 404989 470204 -24450 326345 704904 -10840 313548 493983 393925 392311 141716
$$ packed form
17194D55748A86836P9153f2217C38184q7794J63996Q6766j82356O77b9258A95956
17182C90110j08475R9779q8975l3437m5197P4744J08850A64877L80956B54859
17171B11494O5687a4295F34336k77239J79641A16127p808D242M8129M79637q1656
17160D50352B21884K57514B05580b07516a7131E18330B09940b81377C21197N1464
17150C72661r9577I7848P5860L98382j47268o4498m6853A28807O39237D6490L21842
17139C68332j12751J5380J30777j87760K46745p0105J3792A24610O5453m0137
17129A49926J96810K38887A87139L18230A57503R9782A09217L64589A09104c2102
17118D80898p5909O5215b4450C26345L78559a0840C13548J80435j00058j614A41716
$$ plain form
17106 404339 74606 565442 340322 581686 323885 692518 637043 405826 795033 237652
17095 343623 532552 279323 492678 333493 502275 327626 490105 36407 914940 607890
17085 607890 151684 640538 274585 446448 250678 464529 409292 339956 416428 523632
17075 523632 445525 451070 407200 505439 699083 760039 507944 412253 335631 454742 309411
17064 309411 455250 384060 315022 640659 376563 304266 141239 187680 434643 195698
17053 502037 548559 649730 298552 920062 591504 544974 442395 391154 577427 559258
17043 559258 547632 629453 475609 409533 525059 644949 816276 448848 788419 584710
17033 584710 661301 696875 896864 755756 316725 539837 550957 805872 575645 679847
$$ packed form
17106D04339G4606M90836k25120K41364k57801L68633n5475k31217L89207B37652
17095C43623J88929k53229K13355j59185J68782j74649J62479C6407Q78533l07050
17085F07890A51684M88854B74585J71863j95770K13851n5237o9336P6472J07204
17075E23632p8107N545m3870R8239J93644O0956k52095r5691p6622J19111j45331
17064C09411J45839p1190o9038L25637k64096p2297A41239M6441K46963A95698
17053E02037M6522J01171B98552O21510l28558m6530j02579n1241J86273j8169
17043E59258j1626Q1821j53844o6076J15526J19890J71327l67428L39571k03709
17033E84710P6591L5574J99989j41108C16725K23112J1120K54915k30227J04202
$$ plain form
17023 679847 676602 432055 334518 712635 551130 639294 459270 623230 566445 610724 368559
17012 368559 643456 790113 549010 895633 599412 902132 568306 489426 720708 542640
17002 542640 548420 810545 656800 869147 950975 842198 697069 755426 532801 721265
16992 721265 810178 896039 945950 860702 461515 1081155 506003 793541 1004429 784199
16982 784199 697120 815036 671986 1105026 748143 706071 1089619 639207 596004 886828
16972 886828 744825 955812 995888 960463 924208 941895 675397 870386 1032194 1075300
16962 1075300 619841 1207942 992271 982353 1048115 643039 993065 1016987 1206384 842292
16952 842292 807504 1265708 913597 950636 1167630 1234204 982768 1235498 1183221 1072851
$$ packed form
17023F79847l245k44547r7537L78117j61505Q8164j80024J63960n6785M4279k42165
17012C68559K74897J46657k41103L46623k96221L02720l33826p8880K31282j78068
17002E42640N780K62125j53745K12347Q1828j08777j45129N8357k22625J88464
16992G21265Q8913Q5861M9911q5248l99187O19640E06003K87538K10888k20230
16982G84199q7079J17916j43050M33040l56883m2072L83548m50412m3203K90824
16972H86828j42003K10987M0076l5425l6255J7687k66498J94989J61808M3106
16962A075300m55459N88101k15671r918O5762m05076L50026K3922J89397l64092
16952H42292l4788M58204l52111L7039K16994O6574k51436K52730n2277j10370
$$ plain form
16942 1072851 1183540 1231718 1361789 1010130 1041891 1219159 1184469 1021770 1410769 1292503
16932 1292503 1441381 1284429 1310609 1166011 1266947 1272252 1340323 1136185 1358683 1335184
16922 1335184 1377962 1417025 1328519 1408359 1710670 1812750 1650141 1584195 1287198 1351770
16912 1351770 1278444 1433124 1436111 1518524 1679658 1763282 1609733 1738519 2041585 1739584
16902 1739584 1781904 1773589 1740034 1685448 1644470 1700336 1762861 1587589 1745485 1936028 1879154
16891 1879154 2218927 2066960 1990631 1943314 2248648 2126564 2478885 1952048 1985562 2230647
16881 2230647 2184234 2401948 1788060 2190455 2444004 2347616 2166021 2397318 2332956 2280521
16871 2280521 2627494 2413497 2475649 2758645 2437835 2730577 2736957 2832944 2565487 2579144
$$ packed form
16942A072851J10689M8178J30071l51659L1761J77268l4690j62699L88999j18266
16932A292503J48878j56952K6180j44598J00936N305O8071k04138K22498k3499
16922A335184M2778L9063q8506P9840L02311J02080j62609o5946k96997O4572
16912A351770p3326J54680K987Q2413J61134Q3624j53549J28786L03066l02001
16902A739584M2320q315l3555n4586m0978N5866O2525j75272J57896J90543n6874
16891A879154L39773j51967p6329m7317L05334j22084L52321n26837L3514K45085
16881B230647m6413K17714o13888M02395K53549r6388j81595K31297o4362n2435
16871B280521L46973k13997O2152K82996l20810K92742O380R5987k67457J3657
$$ plain form
16861 2579144 2738148 2715127 3041973 2951282 2924234 2951765 2798986 3043736 3228139 3546971
16851 3546971 3081214 3385447 3317800 3415970 3354877 3696179 3442346 3584587 3630787 3736022
16841 3736022 3844861 3723284 3596258 3885881 3980232 4264746 3894205 4248642 4205676 4461424
16831 4461424 4692770 4711767 4404616 4858520 4501409 4663511 5035795 4993432 5290991 5412561
16821 5412561 5194323 5069865 5387230 5522153 5860639 5848489 5912212 6071865 5989497 6613842
16811 6613842 6604819 6539808 6377196 6869509 6992626 7137672 7250551 7496761 7633468 7619125
16801 7619125 7983172 8433109 8568308 8598040 8547581 9016123 9388759 9193567 9547227 9703467
16791 9703467 10196957 10290442 10525866 11136894 11052177 11491014 12042411 12333184 12701665 13001037
$$ packed form
16861B579144J59004k3021L26846r0691k7048K7531j52779K44750J84403L18832
16851C546971m65757L04233o7647R8170o1093L41302k53833J42241M6200J05235
16841C736022J08839j21577j27026K89623R4351K84514l70541L54437m2966K55748
16831D461424K31346J8997l07151M53904l57111J62102L72284m2363K97559J21570
16821E412561k18238j24458L17365J34923L38486j2150O3723J59653q2368O24345
16811F613842r023o5011j62612M92313J23117J45046J12879K46210J36707j4343
16801G619125L64047M49937J35199K9732n0459M68542L72636j95192L53660J56240
16791I703467M93490R3485K35424O11028q4717M38837N51397K90773L68481K99372
$$ plain form
16781 13001037 13140774 13799090 14038154 14657643 15099206 15435516 16186051 16474036 16801761
16772 16801761 17729231 17778352 18843010 19190212 19866822 20669401 21172885 22177676 22852768
16763 22852768 23807552 24592682 25782168 26790919 27553887 28816293 29844948 31436477
16755 31436477 32833830 34102973 35712929 37103174 38817232 40588393 42403884 44670523
16747 44670523 46508835 48912404 51408521 53557878 56310228 59665332 62865463 65669701
16739 65669701 69266820 72716922 76480174 80566823 84636775 89661350 94189431 99033476
16731 99033476 103954239 109547851 114961013 119941308 124954299 130608895 135431282 140330157
16723 140330157 144621404 148916508 151941897 154969502 156971555 158243267 158764750 158886426
$$ packed form
16781A3001037J39737O58316K39064O19489M41563L36310P50535K87985L27725
16772A6801761R27470M9121J064658L47202O76610Q02579N03484J004791O75092
16763B2852768R54784P85130J189486J008751P62968J262406J028655J591529
16755C1436477J397353J269143J609956J390245J714058J771161J815491K266639
16747D4670523J838312K403569K496117K149357K752350L355104L200131K804238
16739F5669701L597119L450102L763252M086649M069952N024575M528081M844045
16731I9033476M920763N593612N413162M980295N012991N654596M822387M898875
16723A40330157M291247M295104L025389L027605K002053J271712N21483J21676
$$ plain form
16715 158886426 157023238 155310454 152584449 149124596 145434064 141235812 135809216 131424121
16707 131424121 126008113 120706899 115273494 110127589 104411339 99569742 94552867 89736443
16699 89736443 85164270 80730172 76731056 72596837 68662023 65028144 61647881 58664471
16691 58664471 56238321 53252172 50700543 48133346 45841695 43909411 41667030 39708803
16683 39708803 37755205 36350549 34770278 32801684 31649389 30323288 29187584 28018784
16675 28018784 26994685 25805853 24850320 23496186 23063102 22235010 21282520 20537684 19734981
16666 19734981 18880602 18114326 17731739 17082762 16319146 16012241 15507373 14937167 14655389
16657 14655389 14058088 13579977 13217449 12800989 12802068 12276911 11677249 11463057 11063264 10958198
$$ packed form
16715A58886426j863188j712784k726005l459853l690532m198252n426596m385095
16707A31424121n416008n301214n433405n145905n716250m841597n016875m816424
16699H9736443m572173m434098l999116m134219l934814l633879l380263k983410
16691E8664471k426150k986149k551629k567197k291651j932284k242381j958227
16683C9708803j953598j404656j580271j968594j152295j326101j135704j168800
16675B8018784j024099j188832r55533j354134m33084q28092r52490p44836q02703
16666A9734981q54379p66276l82587o48977p63616l06905n04868n70206k81778
16657A4655389n97301m78111l62528m16460J079n25157n99662k14192l99793j05066
$$ plain form
16647 10958198 10728960 10207764 10133671 9769275 9553576 9160025 8876495 8775732 8587535
16638 8587535 8036322 8338301 7975970 7411659 7594666 7269433 7233284 6997752 6979204 6714594
16628 6714594 6594700 6542091 6067370 5962666 5874817 6024651 5499923 5776550 5513196 5391573
16618 5391573 5255953 5120482 5452503 5123333 4759742 4972659 4682026 4487722 4764972
16609 4764972 4373796 4465484 4081973 4172205 4211646 3914252 3875100 4123897 3598955 3698511
16599 3698511 3483848 3569637 3662304 3698078 3518083 3407700 3413344 3437862 3301095 3074837
16589 3074837 3173092 3083363 3081454 3074232 3076618 2950260 3040679 2782629 2549416 2957447 2620628
16578 2620628 2703482 2431420 2546253 2664028 2168057 2707506 2596159 2527699 2347480 2619392
$$ packed form
16647A0958198k29238n21196p4093l64396k15699l93551k83530j00763j88197
16638H587535n51213L01979l62331n64311J83007l25233l6149k35532j8548k64610
16628F714594j19894n2609m74721j04704q7849J49834n24728K76627k63354j21623
16618E391573j35620j35471L32021l29170l63591K12917k90633j94304K77250
16609D764972l91176R1688l83511R0232L9441k97394l9152K48797n24942R9556
16599C698511k14663Q5789R2667L5774j79995j10383N644K4518j36767k26258
16589C074837R8255q9729j909p222K386j26358R0419k58050k33213M08031l36819
16578B620628Q2854k72062J14833J17775m95971N39449j11347o8460j80219K71912
$$ plain form
16568 2619392 2439901 2367201 2377217 2138685 2031089 2317645 2412403 2105923 1900782 1961421
16558 1961421 1998376 2099213 1822053 1892245 2004873 1686832 1682326 1648198 1833365 1581060
16548 1581060 1531587 1509595 1723505 1562642 1777893 1610704 1829485 1520390 1717274 1694889
16538 1694889 1631701 1387824 1254990 1678903 1439348 1591538 1601276 1652231 1790010 1499434
16528 1499434 1400639 1417254 1052994 1340644 1598102 1127889 1545327 1097547 1440745 1129948
16518 1129948 1258695 1110296 1398188 1041616 1051996 1092206 1319649 1156853 1393012 841670
16508 841670 1156282 1151424 1273246 1353902 1216406 1260468 1033034 1366015 1002751 1036884
16498 1036884 903394 1109510 665869 961995 995464 968315 1240517 998664 774355 1031835
$$ packed form
16568B619392j79491p2700J0016k38532j07596K86556R4758l06480k05141O0639
16558A961421L6955J00837k77160P0192J12628l18041m506l4128J85167k52305
16548A581060m9473k1992K13910j60863K15251j67189K18781l09095J96884k2385
16538A694889o3188k43877j32834M23913k39555J52190R738N0955J37779k90576
16528A499434r8795J6615l64260K87650K57458m70213M17438m47780L43198l10797
16518A129948J28747j48399K87892l56572J0380M0210K27443j62796K36159n51342
16508H41670L14612m858J21822Q0656j37496M4062k27434L32981l63264L4133
16498A036884j33490K06116m43641K96126L3469k7149K72202k41853k24309K57480
$$ plain form
16488 1031835 785915 1290985 826946 964724 958943 827492 1061916 806353 881532 1049803
16478 1049803 853351 828734 860684 573598 706295 551168 698581 875613 964758 958731
16468 958731 678929 1033968 615919 975477 701345 686300 808965 754451 936673 1122937
16458 1122937 691074 639227 738417 342690 660718 667377 384815 502492 342067 526739
16448 526739 939369 905246 701415 678928 604042 537539 592591 568039 259145 566430 1122682
16437 1122682 650346 440365 610065 705454 841648 211882 430974 418349 652923 575595
16427 575595 651082 282158 464655 582884 674139 428845 735533 501086 435309 219822
16417 219822 439622 314113 495749 490391 712963 479844 529823 648367 236890 737724
$$ packed form
16488A031835k45920N05070m64039J37778n781j31451K34424k55563P5179J68271
16478A049803j96452k4617L1950k87086J32697j55127J47413J77032Q9145o027
16468I58731k79802L55039m18049L59558k74132j5045J22665n4514J82222J86264
16458A122937m31863n1847R9190C42690L18028O659k82562J17677j60425J84672
16448E26739M12630l4123k03831k2487p4886o6503N5052k4552B59145L07285N56252
16437A122682m72336k09981J69700R5389J36194B11882K19092j2625K34574p7328
16427E75595P5487B82158J82497J18229R1255k45294L06688k34447o5777k15487
16417B19822K19800j25509J81636n358K22572k33119M9979J18544B36890N00834
$$ plain form
16407 737724 459445 877856 220015 509273 546551 397966 461973 383366 331237 321636 559799
16396 559799 732890 663755 406936 569798 245774 581988 218547 304950 506530 475149
16386 475149 312733 411133 148537 321474 506080 327757 268097 494352 140557 250761
16376 250761 459124 788167 392015 224647 225917 32322 106479 358838 115032 380018
16366 380018 445527 189304 293466 392918 284773 306519 164371 247350 201766 441745
16356 441745 109218 240411 284479 330671 253287 337888 287173 -61944 403332 -50693 501680
16344 332059 300312 366759 531886 354603 296978 318389 367631 487801 302381 554192
16334 554192 50636 208464 118423 -29603 -125954 207288 308843 31759 187969 22943 481672
$$ packed form
16407G37724k78279M18411B20015K89258L7278j48585O4007p8607n2129r601K38163
16396E59799J73091o9135k56819J62862B45774L36214B18547Q6403K01580l1381
16386D75149j62416R8400A48537J72937J84606j78323n9660K26255A40557J10204
16376B50761K08363L29043C92015j67368J270C2322P4157K52359A15032K64986
16366C80018O5509A89304J04162R9452j08145K1746j42148Q2979m5584K39979
16356D41745A09218J31193M4068M6192p7384Q4601n0715f1944D03332e0693E01680
16344C32059l1747O6447J65127j77283n7625K1411M9242J20170j85420K51811
16334E54192E0636J57828r0041b9603r6351B07288J01555C1759J56210B2943M58729
$$ plain form
16323 481672 220189 113592 -64956 249666 240556 36177 353174 29432 265471 151130
16313 151130 38135 270820 -33243 705966 217244 161251 199461 -47303 348546 -101505
16302 297115 147882 -54508 17907 386694 174942 253578 252457 265398 -22531 44647 201164
16291 201164 39516 80725 12445 -107083 224608 88194 -27618 347660 -76654 258250 123703
16279 316825 -41052 308986 390573 190054 240814 281480 185023 -9347 321075 109058 433866
16268 433866 147113 175646 467066 407086 366111 -17953 473322 130964 171495 363837
16258 363837 -136888 20360 32372 100739 210813 201062 213433 548216 274504 41692 373885
16247 373885 157617 364634 6325 195200 4256 137495 -22477 558782 232465 131306
$$ packed form
16323D81672B20189j06597f4956B49666r110C6177L16997B9432K36039j14341
16313A51130C8135K32685c3243G05966B17244n5993L8210d7303C48546a01505
16302B97115A47882e4508A7907L68787A74942P8636j121J2941b2531D4647J56517
16291B01164C9516M1209A2445a07083B24608H8194b7618C47660g6654B58250A23703
16279C16825d1052C08986Q1587A90054N0760M0666r6457i347C21075A09058L24808
16268D33866A47113K8533K91420n9980m0975a7953D73322A30964M0531J92342
16258C63837a36888B0360J2012O8367J10074r751J2371L34783k73712D1692L32193
16247C73885A57617K07017F325J88875D256J33239b2477E58782B32465j01159
$$ plain form
16237 131306 35483 -63400 -36160 127258 -17573 104325 -51591 333602 162534 32974 432864
16226 432864 137454 176084 -150835 -87126 -101219 -383263 348839 -52165 293496 252811
16216 252811 -386766 -148574 181354 100261 136889 58752 -92464 361803 359614 284926 157657
16205 157657 133633 52192 384074 34157 6391 -211494 -141258 31857 -5948 112737 491729
16194 491729 140249 -101334 -116224 104856 -39893 57828 61211 -240466 284106 -127720
16183 -245816 -298460 111695 242391 228748 394903 -15922 108607 -33048 -111363 230030
16172 326194 74098 185368 223589 -155822 -19770 135368 -81337 -553714 -237270 -42107
16161 126240 53597 -44612 -55685 -74171 -31743 -20250 129057 -93098 107283 27931 241173
$$ packed form
16237A31306C5483f3400K7240A27258a7573A04325e1591C33602A62534C2974L99890
16226D32864A37454L8630a50835O3709j4093k82044C48839e2165B93496m0685
16216B52811c86766a48574A81354q1093L6628E8752i2464C61803k189p4688j27269
16205A57657k4024E2192L31882C4157F391b11494P0236C1857e948A12737L78992
16194D91729A40249a01334j4890A04856c9893E7828L383b40466B84106a27720
16183b45816n2644A11695J30696j3643J66155a5922A08607c3048p8315B30030
16172C26194G4098J11270L8221a55822a9770A35368h1337m72377b37270d2107
16161A26240E3597d4612j1073j8486c1743J1493A29057i3098A07283B7931K13242
$$ plain form
16150 241173 272279 341329 121055 127532 157675 119384 118297 -48092 200618 -24753 -69510
16139 -69510 -128017 -127831 -221565 -33295 -102209 116589 -229539 -134024 69973 -185851 29407
16127 94960 -22506 68138 -67243 -104493 -37586 -397895 -24245 -167190 222575 121449 3128
16115 -41934 217195 55747 -5921 -74717 168900 -172493 367151 175303 15030 376608 56390
16103 457158 132163 80724 -18601 -73616 273127 285679 -133254 -79089 -147048 -47860 -255385
16092 -255385 238205 -345879 -123889 -4715 24948 96950 34242 70799 130029 238712 -197461
16080 239614 -13044 -213500 131137 86541 -228706 76795 -35683 159001 -185560 58885
16069 154179 -95066 -35520 -34068 -49577 -368020 -217678 300536 203711 -279386 243749 90868
$$ packed form
16150B41173L1106O9050A21055O477L0143l8291j087d8092B00618b4753m4757
16139f9510n8507J86r3734c3295o8914A16589b29539R5515F9973a85851B9407
16127I4960b2506F8138f7243l7250c7586l60309b4245j42945B22575j01126C128
16115d1934B17195E5747e921o8796A68900a72493C67151A75303A5030L61578E6390
16103D57158A32163n1439a8601n5015B73127J2552a33254N4165o7959d7860k07525
16092b55385B38205c45879a23889d715B4948P2002C4242L6557N9230J08683a97461
16080B39614a3044k00456A31137m4596b28706G6795c5683A59001a85560E8885
16069A54179i5066c5520J452j5509l18443J50342C00536r6825b79386B43749I0868
$$ plain form
16057 90348 276757 -183259 -123293 281392 -112955 55500 -101772 52995 -173391 -290484
16047 -290484 -242810 213353 -98942 -160823 -29294 94699 -57278 318494 53717 -70001 338686
16035 -147583 -197663 -90646 -295369 -219487 -113899 208374 -5304 -191779 -26065 -92280 -161050
16024 -161050 263893 -55987 -94164 -10839 379373 57742 157536 -19887 -92916 28903 -23050
16012 -128311 -16277 -268662 452743 -175513 -2731 86285 215523 -155119 105831 26189
16001 -134912 -319421 184689 -4305 101838 -137889 131988 78046 193673 -114502 119857
15990 -147546 550513 -152751 82915 215470 282742 -163786 335198 373262 286373 335300
15980 335300 8698 395075 -219669 271035 10928 -3176 54774 254698 12659 10660 108919
$$ packed form
16057I0348J86409a83259N9966B81392a12955E5500a01772E2995a73391j17093
16047b90484M7674B13353i8942o1881b9294I4699e7278C18494E3717g0001C38686
16035a47583n0080i0646k04723P5882J05588B08374e304j86475b6065o6215o8770
16024a61050B63893e5987l8177a0839C79373E7742R9794a9887p3029B8903b3050
16012a28311a6277k52385D52743a75513b731H6285J29238a55119A05831B6189
16001a34912j84509A84689d305A01838a37889A31988n3942J15627a14502A19857
15990a47546E50513a52751H2915J32555O7272a63786C35198L8064q6889M8927
15980C35300H698L86377b19669B71035A0928c176E4774J99924A2659j999R8259
$$ plain form
15969 108919 14125 -211227 -44696 -83938 -310723 101575 -54169 -82686 133743 -84643 -41156
15957 -25027 -102836 -52042 -231998 -271 -96634 278861 -328105 -3484 106344 33768 -1548 -289124
15945 -289124 184325 34423 -55243 -102959 -317006 157107 -245434 -47040 -267988 -2753 196153
15933 103251 -50446 382123 -269866 -181786 -402465 -321503 -129299 -154940 -249136 102712
15922 -243379 10314 -235500 88283 99492 49226 22221 -144464 -399667 22553 -36550 -13801
15910 151649 201402 -114381 -160479 -10984 189146 -35111 -203166 195626 -57846 -70818 -64471
15899 -64471 128601 76337 122687 -179175 123469 -119349 37708 -20607 61823 13926 -216069
15887 -28584 -231062 19579 -28281 -297600 -186151 -158911 296762 149025 28909 117400 -143897
$$ packed form
15969A08919A4125b11227d4696l9242k26785A01575e4169k8517A33743h4643d1156
15957b5027p7809N0794j79956b71r6363B78861c28105c484A06344C3768a548k87576
15945b89124A84325C4423e5243m7716k14047A57107b45434d7040k20948b753A96153
15933A03251e0446C82123b69866Q8080k20679Q0962a29299k5641r4196A02712
15922b43379A0314b35500H8283J1209D9226B2221a44464k55203B2553c6550a3801
15910A51649M9753a14381m6098a0984A89146c5111j68055A95626e7846j2972O347
15899f4471A28601n2264M6350a79175A23469a19349C7708b0607F1823A3926b16069
15887b8584k02478A9579b8281k69319J11449K7240B96762j47737B8909Q8491a43897
$$ plain form
15875 -94834 -115578 -101633 34411 -58135 87671 -131992 16884 174814 -67715 -83745 124936
15863 153026 -119105 -92325 -106873 -137659 31886 -37660 51516 -44597 -110563 -113917 -411165
15852 -411165 89861 133681 -175427 123644 -68378 -128681 -110671 -223095 128343 -34622 -194449
15841 -194449 -107584 -317744 -161084 1857 -126847 176662 -117597 43014 -137031 -258741
15831 -258741 -407227 -232702 -166246 244896 -173626 -129503 6399 -168306 21345 -285017
15820 2768 -115857 -61417 11174 -98213 -157252 168801 404184 -14098 -69028 -382789 -186206
15808 33458 189251 -246317 42980 -156160 -54159 -317221 -74944 -158916 -240341 -166068 83985
15796 77883 64262 212832 -58111 93579 -117618 -84546 -179262 -215352 -193548 -22484 242153
$$ packed form
15875i4834k0744J3945C4411e8135H7671a31992A6884J57930f7715j6030A24936
15863A53026a19105K6780j4548l0786C1886c7660E1516d4597o5966l354k97248
15852d11165H9861M3820a75427A23644f8378o0303J8010j12424A28343c4622j59827
15841a94449Q6865k10160J56660A857a26847A76662a17597D3014a37031j21710
15831b58741j48486J74525O6456B44896a73626M4123F399a68306B1345b85017
15820B768a15857N4440A1174i8213n9039A68801K35383a4098n4930l13761a86206
15808C3458J55793b46317D2980a56160e4159k63062g4944q3972q1425P4273H3985
15796G7883j3621J48570e8111I3579a17618L3072r4716l6090K1804b2484B42153
$$ plain form
15784 271044 249902 -235074 425430 -141599 -299021 -20179 -288397 -135588 -5802 -1248 347732
15772 -14336 52494 7184 -294911 -113544 -107071 142597 -28211 -212584 233207 -12803 -301004
15761 -301004 -218618 152643 32699 3931 -88145 115127 -49377 84153 -39531 -9082 282781
15749 238573 -22135 35427 43808 275985 118959 279831 248349 -13110 184696 43343 -376467
15737 65599 -116086 80284 82840 29206 -87933 -173824 181628 131241 133298 226651 -193982
15725 -242220 51214 -182208 -350270 130583 -77762 163969 -124675 -57898 -187810 -14201
15714 -18489 50663 -209838 -182284 -169379 -186846 119923 -39980 -454749 -48458 -100162 -8100
15702 -24373 108224 -148534 -177516 -49487 7364 53821 -48042 129002 8271 75729 23654
$$ packed form
15784B71044k1142b35074D25430a41599j57422b0179k68218a35588e802a248C47732
15772a4336E2494G184b94911a13544O473A42597b8211j84373B33207a2803k88201
15761c01004Q2386A52643C2699C931h8145A15127d9377H4153c9531i082B82781
15749B38573b2135C5427Q381K32177A18959J60872l1482a3110A84696D3343c76467
15737F5599a16086H0284K556B9206h7933q5891A81628n0387K057R3353a93982
15725b42220E1214a82208j68062A30583g7762A63969a24675e7898j29912a4201
15714a8489E0663b09838K7554J2905j7467A19923c9980m14769d8458n1704h100
15702b4373A08224a48534k8982d9487G364M6457d8042A29002H271O7458B3654
$$ plain form
15690 30461 253294 88560 364621 -302691 263422 162525 300152 -89164 -76958 -250442
15680 -250442 116611 -243039 4354 -289955 -157405 179166 -210660 -230890 101010 -60140
15669 -156455 -8378 136575 -3219 29516 -308882 -14836 -220076 58115 77694 257301 -23952
15657 -367280 -164645 1946 -3068 -286342 42969 -178006 56776 34798 -130073 143684 -93568
15645 -58130 -30120 288261 -169607 102362 -311953 -132996 -212536 28857 62634 -195507
15634 -116051 -81338 -101939 51126 -40139 35746 -189060 -26437 240677 -219215 -58452 -285111
15623 -285111 29968 50142 288748 -291362 36564 -70674 68389 -14295 207112 -2836 -134037
15612 -134037 125005 60269 -224896 -148664 -7163 101964 189326 227359 -172891 -125001 143445
$$ packed form
15690C0461K22833H8560K76061c02691B63422j00897J37627h9164J2206j73484
15680b50442A16611b43039D354b89955J32550A79166b10660k0230A01010f0140
15669a56455h378A36575c219B9516c08882a4836k05240E8115J9579J79607b3952
15657c67280a64645A946c068k83274D2969a78006E6776k1978a30073A43684i3568
15645e8130K8010B88261a69607A02362c11953a32996p9540B8857L3777a95507
15634a16051L4713k0601E1126d0139C5746a89060b6437B40677b19215e8452k26659
15623b85111B9968K0174K38606b91362C6564g0674F8389a4295B07112b836j31201
15612a34037A25005F0269b24896P6232g163A01964Q7362L8033a72891M7890A43445
$$ plain form
15600 -298245 -79772 161867 -126990 -384535 163996 -101769 144974 5602 -4341 -79648 181310
15588 -352337 73497 177863 -16531 255455 -39342 -272859 -691 111973 86466 59245 251562
15577 251562 -152166 46637 116892 41043 -165407 28328 -13397 -63756 -147900 86465 20743
15565 139303 95656 76143 43314 -182149 -28125 154359 -155595 208504 -103592 335099
15554 20021 -77001 83627 -38006 56009 47220 74533 202633 -149521 -20524 100774 -200139
15542 -107104 -12634 -139049 -157970 297000 124561 260287 -26372 37838 -26985 -46698 -305303
15531 -305303 -200980 -264921 85594 50903 134554 -113659 -23862 15187 331971 332407 -112770
15519 72895 59871 169463 -79622 -369019 17906 104478 278527 -67041 106711 178936 91130
$$ packed form
15600b98245g9772A61867a26990k57545A63996a01769A44974E602d341p5307A81310
15588c52337G3497J04366a6531B55455c9342k33517f91A11973k5507k7221J92317
15577B51562a52166D6637P0255D1043a65407B8328a3397n0359q4144H6465B0743
15565A39303m3647j9513l2829a82149b8125A54359a55595B08504a03592C35099
15554B0021g7001H3627c8006E6009q789K7313J28100a49521b0524A00774b00139
15542a07104a2634j26415j8921B97000A24561J35726b6372C7838b6985j9713k58605
15531c05303J04323o3941H5594l4691Q3651a13659b3862A5187L16784M36a12770
15519G2895j3024J09592g9622k89397A7906Q6572J74049f7041A06711P2225q7806
$$ plain form
15508 91130 -45516 -136120 84603 -207167 -92763 -99475 -139525 40702 -46437 -50960 -422840 -57948
15495 -104834 -15200 -169957 -4948 -13311 -13009 -142226 -144000 95094 -181781 -140971 185249 71606
15482 -59024 -75307 76472 -292820 -19020 -79484 -278900 -42519 -95305 27813 -74013 -331319
15471 -331319 -78571 -79123 -391348 -125119 13258 -270881 -143774 47522 -202409 154841 -54291
15459 -222068 264003 -149039 63276 -59029 -184292 232708 -43918 -7220 43452 -222641 -21172
15447 206329 -93344 -174019 182956 30770 87333 -198005 -209709 15799 -351296 39804 -44585
15435 -77495 20694 -114315 322466 186641 -10301 70608 -371272 -174611 -190125 36801 482489
15424 482489 -184177 -217971 -102577 -162329 70340 182322 16742 -184257 50433 113641 -145572
$$ packed form
15508I1130d5516r0604H4603b07167i2763o712m0050D0702d6437m523l71880e7948
15495a04834a5200j54757d948q363L02j29217j774I5094a81781M0810A85249G1606
15482e9024j6283G6472b92820a9020o0464j99416d2519n2786B7813g4013k57306
15471c31319g8571n52l12225a25119A3258b70881J27107D7522b02409A54841e4291
15459b22068B64003a49039F3276e9029j25263B32708d3918g220D3452b22641b1172
15447B06329i3344q0675A82956C0770N6563a98005j1704A5799c51296C9804d4585
15435g7495B0694a14315C22466j35825a0301G0608c71272a74611j5514C6801M45688
15424D82489a84177l3794a02577n9752G0340J11982A6742a84257E0433O3208a45572
$$ plain form
15412 156655 102106 395542 -150016 -98761 -254247 99562 107541 -10787 -105638 -185450 -57839
15400 150583 192214 38626 -113176 105056 -88598 -107810 329671 180878 19999 -242777
15389 6191 -182508 -311194 107269 149533 -166064 -57736 26830 96713 391221 -75077 -15046
15377 139198 271640 34844 -42723 297660 -233804 -12464 137769 -83598 243740 145678
15367 145678 195002 51373 197832 -9492 -11344 80024 -140303 204276 -124359 -300572 -33908
15355 224130 -269671 82633 -65440 33173 -416177 129794 75477 120369 65154 326441 121889
15343 215873 -24769 -326606 139844 -96166 118829 419187 70720 -171921 136145 -47325
15332 -106526 57617 -162391 -193204 -121050 126191 -153548 -281671 -258928 -14716 -36129 331997
$$ packed form
15412A56655n4549K93436a50016N1255j55486I9562P979a0787r4851p9812e7839
15400A50583M1631C8626a13176A05056h8598j9212C29671j48793A9999b42777
15389F191a82508j28686A07269M2264a66064e7736B6830O9883K94508g5077a5046
15377A39198J32442C4844d2723B97660b33804a2464A37769h3598B43740r8062
15367A45678M9324E1373J46459i492j852H0024a40303B04276a24359j76213c3908
15355B24130b69671H2633f5440C3173d16177A29794n4317M4892n5215K61287A21889
15343B15873b4769l01837A39844i6166A18829L00358G0720a71921A36145d7325
15332a06526E7617a62391l0813P2154A26191a53548j28123K2743a4716k1413C31997
$$ plain form
15320 -115445 330711 -125143 -58698 -86792 -58641 362663 -76161 135309 -88457 114609
15309 -102352 -23731 -214332 -75661 -58598 64203 -105847 18015 17781 287713 -54100 155933
15297 126073 -489603 365775 -151167 22748 340431 172337 161729 162175 52365 210936 130975
15286 130975 311097 29349 -257402 153545 62420 -251948 -324945 -102483 -126963 -65400
15276 -65400 -16306 -334180 104931 -87756 -227995 97588 177894 -145955 -99688 -76226 405094
15264 123975 438678 30019 -65803 308945 -166076 302626 93755 -288403 1041 10201 527006
15253 527006 478224 287038 539203 619938 1312002 1012126 913357 1351068 609564 191763
15242 144746 191716 -55795 27973 112258 213143 3616 25048 -66709 -321159 168575 125347
$$ packed form
15320a15445C30711a25143e8698k8094K8151C62663g6161A35309h8457A14609
15309a02352b3731j90601g5661J7063F4203a05847A8015k34K69932e4100A55933
15297A26073d89603C65775a51167B2748L17683j68094j0608M46E2365J58571p9961
15286A30975J80122B9349b57402A53545F2420b51948p2997a02483k4480O1563
15276f5400a6306l17874A04931h7756j40239I7588Q0306a45955M6267K3462D05094
15264A23975L14703C0019f5803C08945a66076C02626I3755b88403A041R160N16805
15253E27006m8782j91186K52165Q0735O92064k99876r8769M37711F09564A91763
15242A44746M6970e5795B7973Q4285J00885C616K1432f6709k54450A68575m3228
$$ plain form
15231 125347 259421 34639 32685 -116408 6574 -33768 -41380 -316060 62729 -11674 325432
15219 -91340 366489 -50501 365043 265514 128885 191408 178803 275282 157941 -219653 1128
15207 -74802 20388 3395 217585 -86435 34706 24366 19178 57250 168868 -135770 -212565
15196 -212565 117516 -92512 206409 -158011 141227 139118 159974 109332 -79147 -200413 46641
15184 -148555 225950 88737 249243 -247261 270912 177927 -125100 -36050 -106703 213526
15173 221716 236595 -53260 -61121 -10167 104146 205455 370067 101885 46253 285757 -9977
15161 30463 -300672 385264 70197 491451 13376 -157711 107557 -67147 -25084 -103733 -32203
15149 116897 302329 79658 23517 250184 113136 2808 84003 -47316 -13081 -111245 106847
$$ packed form
15231A25347J34074C4639j954a16408F574c3768p612k74680F2729a1674C25432
15219i1340C66489e0501C65043r9529A28885O2523j2605R6479j17341b19653A128
15207g4802B0388C395K14190h6435C4706j0340n188L8072J11618a35770p6795
15196b12565A17516i2512B06409a58011A41227k109K0856n0642g9147j21266D6641
15184a48555B25950H8737J60506b47261B70912r2985a25100c6050p0653B13526
15173B21716J4879e3260p861a0167A04146J01309J64612A01885D6253K39504i977
15161C0463c00672C85264G0197M21254A3376a57711A07557f7147b5084p8649c2203
15149A16897J85432G9658B3517K26667A13136B808Q1195d7316a3081r8164A06847
$$ plain form
15137 114649 20199 192327 193502 125597 161763 40878 -219953 58381 191862 -52260 84709
15125 39058 170515 -69494 215946 -29332 340001 249694 243800 257019 34632 426057 -5627
15113 39720 84221 207753 -28810 -108163 -72823 223655 182889 -68160 133744 -174733 263505
15101 293781 310875 -70701 400419 88802 -43538 195570 251891 15809 -149572 154065 169984
15090 169984 289004 18855 139865 252960 102155 238444 -100641 136972 466315 220955
15079 -65793 43380 505693 -148904 -21668 398344 282243 156254 372050 109577 360582
15069 360582 -143683 96175 82457 289559 -131909 66393 131450 145319 16724 69937 148604
15058 148604 145762 371472 6559 60678 580689 -90265 495575 298793 237137 -185575 -197180
$$ packed form
15137A14649B0199J72128J175o7905L6166D0878b19953E8381J33481e2260H4709
15125C9058J31457f9494B15946b9332C40001r0307n894J3219C4632L91425e627
15113C9720M4501J23532b8810p9353L5340B23655m0766f8160A33744a74733B63505
15101B93781J7094g0701D00419H8802d3538A95570N6321A5809a49572A54065J5919
15090A69984J19020A8855J21010J13095A02155J36289a00641A36972L29343B20955
15079f5793D3380M62313a48904b1668C98344j16101j25989K15796A09577K51005
15069C60582a43683I6175j3718K07102a31909F6393O5057J3869A6724N3213P8667
15058A48604k842K25710F559N4119N20011i0265D95575j96782o1656a85575j1605
$$ plain form
15047 -197180 37286 158817 182822 129004 137437 259475 261130 304339 -141932 62539 38590
15036 38590 205222 187908 -112776 237511 135595 259031 136621 -19705 219020 122372
15026 122372 243347 284237 129773 -97997 205024 126515 -18823 5776 554722 111011 244955
15015 244955 500874 -18622 400246 329844 313990 119218 214846 180209 371000 146823
15004 353186 446591 212421 327590 259209 188002 439523 399872 169471 55679 -103829
14993 162182 -19879 219232 -52645 96655 -77218 278409 347191 -211004 104820 388817
14983 388817 77797 -14374 506384 112493 187478 129166 117546 179725 332652 121237 357863
14972 357863 327500 343903 266745 51941 85949 132527 450810 357451 226855 184232 320045
$$ packed form
15047a97180C7286J21531K4005n3818Q433J22038J655M3209a41932F2539k3949
15036C8590J66632j7314a12776B37511j01916J23436j22410a9705B19020r6648
15026A22372J20975M0890A29773i7997B05024p8509a8823E776N48946A11011J33944
15015B44955K55919a8622D00246p0402j5854A19218R5628l4637J90791A46823
15004C53186R3405B12421J15169o8381p1207K51521l9651A69471E5679a03829
14993A62182a9879B19232e2645I6655g7218B78409O8782b11004A04820K83997
14983C88817G7797a4374E06384A12493P4985n8312j1620O2179J52927A21237K36626
14972C57863l0363J6403p7158E1941L4008M6578L18283r3359j30596m2623J35813
$$ plain form
14961 320045 438658 238380 179153 255571 40206 419224 70380 363963 206518 215118 -13184
14949 204217 217986 68713 -96077 363281 223327 438469 359149 491530 131013 347605
14939 347605 185717 139584 148010 -124924 506392 557203 207248 125225 327154 460677
14929 460677 1719 232647 496931 -43592 235409 371331 -66315 249846 238782 -32326 531546
14917 155374 236141 359595 338926 200231 330632 280419 168445 344211 551188 401048
14907 401048 494551 377599 551616 284847 245769 239156 283302 63790 415667 280366 288252
14896 288252 125849 488298 229233 54935 246109 191510 261681 334827 271560 274920 231708
14885 231708 362686 476084 227408 317734 256722 297718 471969 321600 -28924 167932
$$ packed form
14961C20045J18613k00278n9227P6418D0206L79018G0380K93583j57445Q600a3184
14949B04217J3769F8713i6077C63281j39954K15142p9320J32381A31013K16592
14939C47605j61888m6133Q426a24924E06392N0811B07248q2023K01929J33523
14929D60677A719K30928K64284d3592B35409J35922f6315B49846j1064c2326E31546
14917A55374Q0767J23454k0669j38695J30401n0213j11974J75766K06977j50140
14907D01048R3503j16952J74017k66769l9078o613M4146F3790L51877j35301P886
14896B88252A25849L62449B29233E4935J91174n4599P0171P3146o3267L360m3212
14885B31708J30978J13398B27408R0326o1012M0996J74251j50369b8924A67932
$$ plain form
14874 140453 245425 266977 333984 645525 326022 -38370 468324 310898 484348 90426
14863 163409 395237 10190 58867 157137 357847 337355 454704 153991 481065 367620
14853 367620 96017 419061 491805 284929 237017 158642 321674 660370 499939 130541
14842 282565 282185 171209 354636 120513 478118 134477 628202 413160 339646 547076
14832 547076 175216 347111 163524 487796 474735 647239 479160 233930 419610 270953
14822 270953 276176 841504 573612 350123 332208 794270 421719 660911 572126 305603
14812 305603 592125 439633 362882 647011 1659 328319 579459 244477 407411 129561
14801 594905 289826 431884 461634 482463 402904 593442 142944 672770 313514 492911
$$ packed form
14874A40453J04972K1552O7007L11541l19503c8370D68324j57426J73450I0426
14863A63409K31828A0190M8677R8270K00710k0492J17349A53991L27074j13445
14853C67620I6017L23044P2744k06876m7912p8375J63032L38696j60431A30541
14842B82565l80j10976J83427A20513L57605A34477M93725k15042p3514K07430
14832E47076A75216J71895A63524L24272j3061J72504j68079B33930J85680j48657
14822B70953N223N65328k67892k23489j7915M62062l72551K39192q8785k66523
14812C05603K86522j52492p6751K84129A659L26660K51140B44477J62934A29561
14801E94905B89826J42058K9750K0829p9559J90538A42944N29826C13514J79397
$$ plain form
14791 492911 612401 425150 236899 740392 318409 162490 438279 467931 374869 792814
14781 792814 625675 238522 443944 272298 271366 311084 665097 442661 593724 491334
14771 491334 459566 390244 477052 676090 500563 404539 296656 495048 502292 686812 469844
14760 469844 765002 398275 594349 521231 595449 588543 295706 770522 411542 914517
14750 914517 570451 566085 664042 744261 633334 637125 635227 704425 748279 649292 308376
14738 713150 431681 448824 -21238 925701 819898 841752 437338 418128 870356 936327
14728 936327 967363 912195 704244 619115 682864 786496 592945 533627 767837 819849 689038
14717 689038 882929 834144 721585 649945 756865 961502 698255 698559 677458 1074727 922294
$$ packed form
14791D92911J19490j87251j88251N03493C18409j55919K75789K9652r3062M17945
14781G92814j67139B38522K05422j71646r32L9718L54013k22436J51063j02390
14771D91334l1768o9322Q6808J99038j75527r6024j07883J98392P244J84520k16968
14760D69844K95158l66727J96074p3118P4218o906k92837M74816l58980N02975
14750I14517l44066m366R7957Q0219j10927L791j898O9198M3854r8987C08376
14738G13150k81469J7143b1238I25701j05803K1854m04414j9210M52228O5971
14728I36327L1036n5168k07951q5129O3749J03632j93551n9318K34210N2012j30811
14717F89038J93891m8785j12559p1640J06920K04637k63247L04k1101L97269j52433
$$ plain form
14706 922294 672900 828153 672980 412778 514648 1017023 874785 831262 345657 894379
14696 894379 627921 999191 898388 921931 736091 690120 994449 540514 920566 1057719
14686 1057719 970436 1135620 936978 1116172 720769 815992 1144813 719919 1141947 888496
14676 888496 1034147 797711 856534 995879 1223927 819327 848340 1086109 1124751 915264
14666 915264 1044151 608540 915045 934663 1157646 552544 1337904 982541 527650 943672
14656 943672 1002017 992979 1230327 1133956 968081 1076219 1339363 1083185 976305 1049271
14646 1049271 1177808 1247753 1529447 1158899 1314415 905697 1286529 1111903 1238784 1114274
14636 1114274 1113857 1255797 989348 1183785 1130617 1255716 1151014 1338452 1118077 1381889
$$ packed form
14706I22294k49394J55253j55173k60202J01870N02375j42238m3523C45657N48722
14696H94379k66458L71270j00803K3543j85840m5971L04329m53935L80052J37153
14686A057719q7283J65184j98642J79194l95403R5223L28821m24894M22028k53451
14676H88496J45651k36436N8823J39345K28048m04600K9013K37769L8642k09487
14666I15264J28887m35611L06505J9618K22983E52544P85360l55363m54891M16022
14656I43672N8345r038K37348r6371j65875J08138K63144k56178j06880P2966
14646A049271J28537O9945K81694l70548J55516m08718L80832j74626J26881j24510
14636A114274m17J41940k66449J94437n3168J25099j04702J87438k20375K63812
$$ plain form
14626 1381889 1456907 1288879 1388889 1121195 1422580 1349982 1428523 1125371 1582093 1350742
14616 1350742 1548837 1528725 1523927 1389047 1720180 1499620 1515096 1592973 1301504 1370275
14606 1370275 1297918 1221092 1353793 1392398 1214300 1351045 1340744 1564972 1502979 1525414
14596 1525414 1522720 1451822 1542535 1607692 1808926 1657661 1988686 1713179 1752448 1572505
14586 1572505 1959632 1973898 1736470 1627950 1924749 2317601 1927421 2018902 1672914 1958024
14576 1958024 1633501 1911012 1936796 1570031 2256691 1708199 1891515 1968392 1865355 2153806
14566 2153806 1669228 2383449 2143606 2529375 2498752 2306281 2486375 2670650 3035415 2782746
14556 2782746 2670095 3199364 3098108 3545530 3920731 4036536 5430731 7369505 10897487
$$ packed form
14626A381889P5018j68028J00010k67694L01385p2598P8541l03152M56722k31351
14616A350742J98095k0112m798j34880L31133k20560J5476P7877k91469O8771
14606A370275p2357p6826J32701L8605j78098J36745j0301K24228o1993K2435
14596A525414k694p0898R0713O5157K01234j51265L31025k75507L9269j79943
14586A572505L87127J4266k37428j08520K96799L92852l90180R1481l45988K85110
14576A958024l24523K77511K5784l66765O86660n48492J83316P6877j03037K88451
14566B153806m84578P14221k39843L85769l0623j92471J80094J84275L64765k52669
14556B782746j12651N29269j01256M47422L75201J15805J394195J938774L527982
$$ plain form
14547 10897487 18486455 36124724 40798822 19415577 9655731 5297260 3388585 2257569
14539 2257569 1784964 2298154 2150925 2174738 1857781 2224744 2023504 2148814 1875138 2095622
14529 2095622 1903461 2249135 1981375 2123749 2218968 2081777 1986738 1903894 2000406 2355052
14519 2355052 2432662 2216138 2332261 2436149 2392309 2339302 2856578 2370439 2483902 2497840
14509 2497840 2584474 2699116 2534981 2706134 2791541 2538654 2898628 2686932 2765119 2729947
14499 2729947 3142804 2891305 3393643 3203257 2903934 3546303 3088371 3209897 3379086
14490 3379086 3032409 3780694 3401530 3308430 3279061 3678183 3355640 3482286 3259195 3742528
14480 3742528 3350879 3600652 3640332 3517994 3627909 3841169 3966096 4031452 3716985 4055896
$$ packed form
14547A0897487P588968J7638269M674098A9415577I655731m358471j908675j131016
14539B257569m72605N13190j47229K3813l16957L66963k01240J25310k73676K20484
14529B095622j92161L45674k67760J42374R5219j37191r5039q2844R6512L54646
14519B355052P7610k16524J16123J03888m3840n3007N17276m86139J13463J3938
14509B497840Q6634J14642j64135J71153Q5407k52887L59974k11696P8187l5172
14499B729947M12857k51499N02338j90386k99323O42369m57932J21526J69189
14490C379086l46677P48285l79164r3100k9369L99122l22543J26646k23091M83333
14480C742528l91649K49773L9680j22338J09915K13260J24927O5356l14467L38911
$$ plain form
14470 4055896 3641254 4206265 4130653 3976973 4020340 4494033 4269993 4437180 4148353 4848263
14460 4848263 4608723 4337377 4794768 4572418 4616589 4978151 4604369 4832766 4872304 4877860
14450 4877860 5120690 4790234 4822725 5584173 5168346 5374683 5556919 5419318 5618700 5409812
14440 5409812 5820132 5482865 5918024 5973864 6135664 6341745 6049278 6173015 6309818 6530062
14430 6530062 6511018 6600219 6715978 6682215 6685690 6896508 7225964 7208119 7344795 7350972 7322565
14419 7322565 7364360 7611998 7669724 7748300 7968216 8000311 8000142 8569353 8111706 8583360 8736061
14408 8736061 8400967 8757825 9087597 9165374 8911579 9427386 9595728 9624087 9828108 10018517
14398 10018517 10266933 10695323 10338770 10357982 10774211 11123658 11145116 11496934 11543566 11953666
$$ packed form
14470D055896m14642N65011p5612j53680M3367M73693k24040J67187k88827O99910
14460D848263k39540k71346M57391k22350M4171L61562l73782K28397L9538N556
14450D877860K42830l30456L2491P61448m15827K06337J82236j37601J99382k08888
14440E409812M10320l37267M35159N5840J61800K06081k92467J23737J36803K20244
14430F530062j9044Q9201J15759l3763L475K10818L29456j7845J36676O177k8407
14419G322565M1795K47638N7726P8576K19916L2095j69N69211m57647M71654J52701
14408H736061l35094L56858L29772P7777k53795N15807J68342K8359K04021J90409
14398A0018517K48416M28390l56553J9212M16229L49447K1458L51818M6632M10100
$$ plain form
14388 11953666 11941059 12040180 12517281 13005997 12778556 13002078 13129454 13517274 13658010 14326694
14378 14326694 14273697 14725942 14714900 15144064 15443414 15827553 16177137 15915124 16467076 17082264
14368 17082264 17280641 17513463 17845807 18431134 18729297 19062384 19448123 19987642 20455177
14359 20455177 21123320 21218445 21719203 22415943 23106954 23122081 23871040 24504627 24798004 25750118
14349 25750118 26127353 26678192 27416832 27836003 29078025 29745808 30504588 31316327 31785710
14340 31785710 32994930 33992577 34585686 35606554 36588314 37491663 38736866 40065114 40915725
14331 40915725 42259092 43550108 45055393 46429896 47761376 49205217 50867132 52806914
14323 52806914 54445098 56007814 58363495 60155005 62164167 64507688 66831845 69711209
$$ packed form
14388A1953666j2607R9121M77101M88716k27441K23522J27376L87820J40736O68684
14378A4326694n2997M52245j1042M29164K99350L84139L49584k62013N51952O15188
14368A7082264J98377K32822L32344N85327K98163L33087L85739N39519M67535
14359B0455177O68143R5125N00758O96740O91011J5127P48959O33587K93377R52114
14349B5750118L77235N50839P38640M19171J242022O67783P58780Q11739M69383
14340C1785710J209220R97647N93109J020868R81760R03349J245203J328248Q50611
14331D0915725J343367J291016J505285J374503J331480J443841J661915J939782
14323E2806914J638184J562716K355681J791510K009162K343521K324157K879364
$$ plain form
14315 69711209 72060878 74792526 77750730 80503221 84094063 87485560 91373722 94700719
14307 94700719 98889754 102852776 107784474 112123726 117011302 122475780 128201830 134081047
14299 134081047 140381923 147130243 153950236 161609114 169148165 177493501 186271281 195591636
14291 195591636 204933416 215450606 226100072 237083964 248814638 261037956 273590087
14284 273590087 286236196 299309567 312419102 325693375 339056548 351793112 363995101
14277 363995101 375489882 386689092 395785786 403686162 408041284 410506098 412024549 412240770
14269 412240770 411399641 408671690 405195924 400840906 395226319 388501697 380407270 370009714
14261 370009714 357994092 345407473 332127773 318500193 304377836 291323294 278572662
$$ packed form
14315F9711209K349669K731648K958204K752491L590842L391497L888162L326997
14307I4700719M189035L963022M931698M339252M887576N464478N726050N879217
14299A34081047O300876O748320O819993P658878P539051Q345336Q777780R320355
14291A95591636R341780J0517190J0649466J0983892J1730674J2223318J2552131
14284B73590087J2646109J3073371J3109535J3274273J3363173J2736564J2201989
14277C63995101J1494781J1199210R096694P900376M355122K464814J518451K16221
14269D12240770q41129k727951l475766m355018n614587o724622q094427j0397556
14261C70009714j2015622j2586619j3279700j3627580j4122357j3054542j2750632
$$ plain form
14254 278572662 265646851 253017207 240907678 229343935 218508691 207699905 197619496
14247 197619496 188030156 179167563 170759448 162966529 155676218 148223047 141464874 134768688
14239 134768688 128732605 123501078 118271010 112935405 108205571 103573241 99497020 95328921
14231 95328921 91861386 88030821 84631889 81264699 78211839 75241784 72574494 69946002
14223 69946002 67256032 64752325 62476707 60538821 58526273 56278200 54669643 52884208
14215 52884208 51181375 49783891 48300659 46838290 45356480 43885767 42730883 41805502
14207 41805502 40799379 39579387 38185117 37027307 36066901 34922582 34375356 33548277
14199 33548277 32929332 31876870 30900250 29882263 29465422 28568338 28288855 27215570 26669875
$$ packed form
14254B78572662j2925811j2629644j2109529j1563743j0835244j0808786j0080409
14247A97619496r589340q862593q408115p792919p290311p453171o758173o696186
14239A34768688o036083n231527n230068n335605m729834m632330m076221m168099
14231I5328921l467535l830565l398932l367190l052860k970055k667290k628492
14223F9946002k689970k503707k275618j937886k012548k248073j608557j785435
14215E2884208j702833j397484j483232j462369j481810j470713j154884r25381
14207D1805502j006123j219992j394270j157810r60406j144319n47226q27079
14199C3548277o18945j052462r76620j017987m16841q97084k79483j073285n45695
$$ plain form
14190 26669875 25838654 25486178 24464319 24399608 23882097 23095412 22688574 22143084 21340891
14181 21340891 20874072 20557454 20170219 19960700 19400206 19231161 18548461 18120790 18033769
14172 18033769 17425477 17242267 16794716 16653313 16463187 15668865 15436795 15025586 14602821
14163 14602821 14644609 14101810 14204255 14346674 13849512 13729097 12947179 12904948 12740007 12403129
14153 12403129 12391077 11999836 11721426 11695881 11829740 11568826 11059596 10876228 10832041 10861332
14143 10861332 10336006 10482138 10316999 9806557 9814888 9757602 9715945 9202601 9407814 9157157
14133 9157157 9017515 8666250 8510940 8334892 8504541 8493563 8511103 8024496 8137527 8130744
14123 8130744 7900303 7749495 7710578 7593448 7634227 7559171 7408537 7555357 7214499 6749775
$$ packed form
14190B6669875q31221l52476j021859o4711n17511p86685m06838n45490q02193
14181B1340891m66819l16618l87235k09519n60494j69045o82700m27671q7021
14172A8033769o08292j83210m47551j41403j90126p94322k32070m11209m22765
14163A4602821M1788n42799J02445J42419m97162j20415p81918m2231j64941l36878
14153A2403129j2052l91241k78410k5545J33859k60914n09230j83368m4187K9291
14143A0861332n25326J46132j65139n10442Q331n7286m1657n13344K05213k50657
14133I157157j39642l51265j55310j76048J69649j0978J7540m86607J13031o783
14123H130744k30441j50808l8917j17130M0779p5056j50634J46820l40858m64724
$$ plain form
14113 6749775 6635638 6516814 6629226 6629083 6616933 6118982 6216927 6473102 6273747 6274046 5944254
14102 5944254 6106738 5856754 5914745 5853428 6010790 5453856 5423230 5830084 5488442 5397559
14092 5397559 5225676 5286215 4992502 5296601 5288491 5382049 4986108 5010366 4798820 4803447 4944646
14081 4944646 4797297 4464827 4577679 4612831 4386900 4819336 4708152 4289889 4724500 4338273
14071 4338273 4210097 4329441 4278147 4066092 4220410 4033699 3805344 4090979 3970957 4443979
14061 4443979 3655094 4000741 3637040 3510992 3914930 4196980 3840983 3710920 3452622
14052 3452622 3325101 3740353 3648948 3554359 3381319 3480299 3146023 3380903 3498942 3473501
14042 3473501 3196515 2764842 3543968 3328975 3121402 2964913 3330174 3170993 3129909 2926182
$$ packed form
14113F749775j14137j18824J12412j43j2150m97951R7945K56175j99355K99l29792
14102E944254J62484k49984N7991o1317J57362n56934l0626M06854l41642r0883
14092E397559j71883O0539k93713L04099q110R3558l95941K4258k11546M627J41199
14081D944646j47349l32470J12852L5152k25931M32436j11184m18263M34611l86227
14071D338273j28176J19344n1294k12055J54318j86711k28355K85635j20022M73022
14061D443979p88885L45647l63701j26048M03938K82050l55997j30063k58298
14052C452622j27521M15252r1405r4589j73040R8980l34276K34880J18039k5441
14042C473501k76986m31673P79126k14993k07573j56489L65261j59181m1084k03727
$$ plain form
14032 2926182 3048258 2973976 2834051 2620369 2764917 3214941 3068359 2823857 2535099 2846772
14022 2846772 2584056 2694694 2454337 2826864 2762950 2548678 2543420 2545565 2360556 2326837
14012 2326837 2263135 2230560 2389859 2522799 2414674 2340337 2081930 2285870 2145811 2046069
14002 2046069 2335429 2181469 2127560 2321972 2190086 1960819 1422632 1770767 2152896 2071966
13992 2071966 1948508 2187188 2693212 3614772 5980964 11711364 28304141 41825486
13984 41825486 24367898 14414519 9045918 6205343 5014724 3924773 3673002 3133702
13976 3133702 3081737 2881512 3040627 2806815 2706751 2515451 2717308 2121573 2508302 2190745
13966 2190745 2409738 2049756 2232917 2231031 2056285 2187064 2218570 1813258 2146877 1820542
$$ packed form
14032B926182J22076p4282j39925k13682J44548M50024j46582k44502k88758L11673
14022B846772k62716J10638k40357L72527o3914k14272n258K145j85009l3719
14012B326837o3702l2575J59299J32940j08125p4337k58407K03940j40059r9742
14002B046069K89360j53960n3909J94412j31886k29267n38187L48135L82129q0930
13992B071966j23458K38680N06024R21560K366192N730400J6592777J3521345
13984D1825486j7457588r953379n368601k840575j190619j089951k51771n39300
13976C133702n1965k00225J59115k33812j00064j91300K01857n95735L86729l17557
13966B190745K18993l59982J83161j886j74746J30779L1506m05312L33619l26335
$$ plain form
13956 1820542 2153751 2211333 1623911 1837722 1886989 1806135 1656579 1654197 1634100 1834680
13946 1834680 1771498 1716475 1581044 1755119 1651009 1814682 1526312 1795246 1874795 1636254
13936 1636254 1488355 1292195 1545224 1691899 1628130 1621999 1700837 1705964 1599137 1601876 1684526
13925 1684526 1687037 1704850 1624449 2027777 1533424 1471591 1633456 1562845 1641013 1578920 1432737
13914 1432737 1353288 1418234 1718727 1572194 1373455 1300037 1325698 1538505 1363315 1097699
13904 1097699 1285550 1513280 1212012 1631913 1542039 1223078 1264109 1096277 1232112 1410615
13894 1410615 1055737 1561156 1324601 1163691 1244847 1402249 1456824 1250251 1286411 1344351
13884 1344351 1195827 1440669 969483 1252800 1292005 1330617 1186286 1159565 1167075 874323
$$ packed form
13956A820542L33209N7582n87422K13811M9267q0854j49556k382k0097K00580
13946A834680o3182n5023j35431J74075j04110J63673k88370K68934P9549k38541
13936A636254j47899j96160K53029J46675o3769o131P8838N127j06827K739Q2650
13925A684526K511J7813q0401M03328m94353o1833J61865p0611P8168o2093j46183
13914A432737p9449O4946L00493j46533j98739p3418K5661K12807j75190k65616
13904A097699J87851K27730l01268M19901q9874l18961M1031j67832J35835J78503
13894A410615l54878N05419k36555j60910Q1156J57402N4575k06573L6160N7940
13884A344351j48524K44842m71186K83317L9205L8612j44331k6721P510k92752
$$ plain form
13874 874323 1340974 963390 1145360 1131228 1212174 1363383 943671 910068 1078802 983104
13864 983104 1045160 1072494 1138731 1195830 999949 1117016 920383 603912 1096346 1259062
13854 1259062 1361756 1211608 1242605 853022 869927 843136 735664 984273 936536 819507
13844 819507 983158 973224 1264299 821038 899443 949932 1145073 1001068 1217644 981480
13834 981480 689343 895882 774111 988408 934417 681249 836532 796629 902087 954727
13824 954727 1197196 1080205 843612 1023123 1118999 990743 731046 956371 1143252 675679
13814 675679 475387 917418 807660 502082 899444 1044453 581112 718604 959672 854908
13804 854908 1008461 681832 414174 906768 923654 1007000 896831 908784 657971 934264
$$ packed form
13874H74323M66651l77584J81970j4132Q0946J51209m19712l3603J68734r5698
13864I83104O2056K7334O6237N7099j95881J17067j96633l16471M92434J62716
13854A259062J02694j50148L0997l89583J6905k6791j07472K48609m7737j17029
13844H19507J63651r934K91075m43261P8405N0489J95141j44005K16576k36164
13834I81480k92137K06539j21771K14297n3991k53168J55283l9903J05458N2640
13824I54727K42469j16991k36593J79511R5876j28256k59697K25325J86881m67573
13814F75679k00292M42031j09758l05578L97362J45009m63341J37492K41068j04764
13804H54908J53553l26629k67658M92594J6886Q3346j10169J1953k50813K76293
$$ plain form
13794 934264 1147400 539496 721871 1022729 442686 952990 648420 537255 1143711 942822
13784 942822 897531 374243 753017 683019 784815 1074988 779468 729097 452222 532744
13774 532744 827270 348163 806992 1002090 822723 491444 735123 810400 851896 632175
13764 632175 700470 275640 731851 539091 571343 752795 870036 784458 803189 403023
13754 403023 1000090 739541 578697 716771 942729 734743 471269 511586 841878 583184
13744 583184 559631 594763 432837 603107 897735 560797 725985 870758 400197 575733
13734 575733 444247 651978 292436 528883 290989 377613 420122 588343 592400 531278
13724 531278 369805 423585 327223 452199 645158 565084 250901 383584 484414 343468
$$ packed form
13794I34264K13136E39496J82375L00858D42686N10304l04570j11165O06456k00889
13784I42822m5291C74243L78774o9998J01796K90173k95520n0371k76875Q0522
13774E32744K94526C48163M58829J95098j79367l31279K43679P5277M1496k19721
13764F32175O8295B75640M56211j92760L2252J81452J17241q5578J8731m00166
13754D03023N97067k60549j60844J38074K25958k07986k63474M0317L30292k58694
13744E83184k3553L5132j61926J70270K94628l36938J65188J44773D00197J75536
13734E75733j31486K07731B92436K36447k37894Q6624M2509J68221M057o1122
13724E31278j61473N3780r6362J24976J92959q0074B50901J32683J00830j40946
$$ plain form
13714 343468 576430 608323 507897 360252 630973 859415 689618 480389 383554 790344
13704 790344 557257 378298 721603 491557 738904 638444 375347 333806 600464 312631
13694 312631 561133 615729 73383 470718 481078 461053 784917 546941 367369 373881 437377
13683 437377 540696 481227 382353 484593 455448 549896 753351 279091 534415 681973
13673 681973 297985 455444 596288 601483 418071 783291 194656 407604 94935 615015
13663 615015 588273 247489 -105508 277991 404943 810241 255880 183625 323138 396704
13653 396704 260195 166232 533886 614645 598375 625974 329804 570867 262925 587999
13643 587999 100304 652200 632924 459609 -15938 351542 386725 374152 755247 233861
$$ packed form
13714C43468K32962L1893j00426j47645K70721K28442j69797k09229r6835M06790
13704G90344k33087j78959L43305k30046K47347j00460k63097m1541K66658k87833
13694C12631K48502N4596G3383L97335J0360k0025L23864k37976j79572O512O3496
13683D37377J03319n9469r8874J02240k9145R4448K03455B79091K55324J47558
13673F81973B97985J57459J40844N195j83412L65220A94656K12948I4935N20080
13663F15015k6742B47489a05508B77991J26952M05298B55880p2255J39513P3566
13653C96704j36509r3963L67654Q0759j6270K7599k96170K41063B62925L25074
13643E87999A00304N51896j9276j73315a5938C51542L5183j2573L81095B33861
$$ plain form
13632 330823 522097 393112 213786 423829 219852 124880 402572 171138 -319990 288653
13621 -15688 548362 709638 375856 440819 -49659 443170 566874 340257 316388 545588
13611 545588 320945 437337 279947 580901 521086 526210 271036 205043 225716 491773
13601 491773 465839 339548 296393 519741 169733 180599 329918 359921 357988 489017 297193
13590 297193 425295 314586 305549 130579 245465 634009 55706 354242 333803 165928
13579 133768 396525 161723 314369 442235 598324 682132 437054 209573 510261 457773
13569 457773 465674 44766 401944 -73983 526431 180931 400616 414367 236559 248261 277076
13558 277076 409167 189986 192533 367634 410081 152891 197854 155982 374303 460208 390562
$$ packed form
13632C30823J91274j28985j79326K10043k03977r4972K77692A71138c19990B88653
13621a5688E48362J61276l33782O4963d9659D43170J23704k26617k3869K29200
13611E45588k24643J16392j57390L00954n9815N124k55174o5993K0673K66057
13601D91773k5934j26291m3155K23348A69733J0866J49319L0003j933J31029j91824
13590B97193J28102j10709r037A30579J14886L88544E5706K98536k0439A65928
13579A33768K62757A61723J52646J27866J56089Q3808k45078B09573L00688n2488
13569D57773P901D4766L57178g3983E26431A80931K19685J3751j77808J1702K8815
13558B77076J32091A89986K547J75101M2447A52891M4963m1872K18321Q5905o9646
$$ plain form
13547 390562 373640 509597 288300 285404 215178 243122 115623 549665 486068 189031 93796
13535 166665 188830 170232 63517 204991 154924 268542 138754 227005 476306 288230
13525 288230 268773 307692 385043 569362 167967 157172 -11731 67080 208292 163267 85576
13514 85576 124677 476414 115879 458387 280325 271563 -10623 197880 214662 279034 307216
13503 307216 259589 404246 272514 512167 66640 295606 332121 473456 339221 138401
13492 153286 24835 516101 446163 211180 336305 394212 230446 341477 441519 390861
13482 390861 62148 231017 165433 163243 40381 85458 710778 184367 282019 120627 79562
13471 79562 312447 134996 228832 325048 262177 -102919 57996 818 198534 248832 -37163
$$ packed form
13547C90562j6922J35957k21297k896p0226K7944A15623M34042o3597A89031I3796
13535A66665K2165j8598F3517J41474n0067J13618j29788Q8251K49301j88076
13525B88230j9457L8919P7351J84319A67967j0795a1731F7080J41212m5025p7691
13514H5576L9101L51737A15879L42508j78062q762a0623A97880J6782O4372K8182
13503C07216m7627J44657j31732K39653F6640K28966L6515J41335j34235A38401
13492A53286B4835M91266o9938B11180J25125N7907j63766J11031J00042n0658
13482C90861F2148J68869o5584k190D0381M5077O25320A84367R7652A20627m1065
13471G9562K32885A34996R3836R6216o2871a02919E7996H18J97716N0298c7163
$$ plain form
13459 601350 349508 -10089 350060 32953 -44892 335357 258619 391936 366413 2913 266335
13448 266335 3193 198063 487392 28798 462807 219310 -11012 436884 14048 429309
13438 429309 53122 100501 138220 101173 280032 60713 72344 73825 249607 13508 235511
13427 235511 188886 175834 79996 525907 279549 197000 204566 269835 132952 126688 306307
13416 306307 454092 -64150 348870 248248 141951 278805 -84981 113267 58001 290628
13406 290628 -117410 259530 319377 198665 -76256 26688 207270 127280 201946 41819 -185393
13394 138484 -52065 407843 327863 -104177 152920 183409 -64265 79421 -6486 426195 169907
13382 203112 162076 53964 444244 175888 131586 151273 -125650 41172 124483 41543 355594
$$ packed form
13459F01350k51842a0089C50060C2953d4892C35357p6738J33317k5523B913K63422
13448B66335C193J94870K89329B8798M34009B19310a1012D36884A4048M15261
13438D29309E3122M7379L7719l7047J78859F0713J1631J481J75782A3508K22003
13427B35511m6625j3052G9996M45911k46358q2549P566O5269A32952o264J79619
13416C06307J47785f4150C48870j00622j06297J36854h4981A13267n5266K32627
13406B90628a17410B59530N9847j20712g6256B6688J80582p9990P4666D1819a85393
13394A38484e2065D07843p9980a04177A52920L0489f4265G9421f486D26195A69907
13382B03112m1036E3964L90280A75888m4302J9687a25650D1172Q3311D1543L14051
$$ plain form
13371 355594 108165 125350 238691 186695 113087 225080 56636 -27202 -258583 465033
13360 -59367 126511 -69452 385824 342445 428669 80142 -59836 243168 182475 419173 93058
13348 204665 469068 -49981 488968 584342 153018 12270 223289 -124975 391191 185525
13337 371302 23889 314962 180281 248209 84626 106772 183219 120579 216185 226920 162312
13326 162312 68671 144586 -194353 491455 433098 112906 345648 176344 410367 -228159
13315 4161 247658 355222 125935 490600 206051 205186 190830 184591 110276 59733 525364
13304 525364 364268 117994 247675 303319 520995 -75764 131242 165519 105485 123668
13294 123668 -42601 134015 134316 67011 23124 512060 -177471 342023 286701 92028 269035
$$ packed form
13371C55594A08165J7185J13341n1996p3608J11993E6636b7202k31381D65033
13360e9367A26511f9452C85824m3379Q6224H0142e9836B43168o0693K36698I3058
13348B04665K64403d9981D88968R5374A53018A2270K11019a24975C91191A85525
13337C71302B3889K91073j34681O7928H4626K2146P6447o2640R5606J0735o4608
13326A62312F8671P5915a94353D91455n8357A12906K32742j69304K34023b28159
13315D161K43497J07564A25935L64665B06051q65j4356o239p4315n0543M65631
13304E25364j61096A17994J29681N5644K17676g5764A31242L4277o0034J8183
13294A23668d2601A34015L01F7011B3124M88936a77471C42023n5322I2028J77007
$$ plain form
13283 269035 84860 112777 305625 194183 382747 76860 139899 248113 244065 2617 205873
13272 205873 266015 277919 153720 241181 85016 186788 139611 23291 -59370 291706 226380
13261 226380 178627 -67434 166356 203026 276357 151840 33868 287655 99000 -74044 -59209
13250 -59209 196399 292037 35818 297020 200432 41542 -2027 -299481 196220 17129 252277
13239 252277 303097 232705 38105 247295 -271009 221804 23321 264207 162917 338261
13229 338261 -214261 51118 -195071 133998 389376 -39205 -10981 41254 -316695 160460
13218 146514 -172101 -65868 396551 215482 143353 80427 292832 211940 288148 60817 248347
13207 248347 116693 134913 51402 210484 159953 4624 -216015 82691 190473 -252835 231056
$$ packed form
13283B69035H4860K7917J92848j11442J88564G6860O3039J08214m048B617K03256
13272B05873O0142J1904j24199Q7461H5016J01772m7177B3291e9370B91706o5326
13261B26380m7753f7434A66356L6670P3331j24517C3868K53787I9000g4044J4835
13250e9209A96399R5638C5818K61202r6588D1542b027k97454A96220A7129K35148
13239B52277N0820p0392C8105K09190b71009B21804B3321K40886j01290J75344
13229C38261b14261E1118a95071A33998K55378c9205a0981D1254c16695A60460
13218A46514a72101f5868C96551j81069p2129o2926K12405q0892P6208F0817J87530
13207B48347A16693J8220E1402J59082n0531D624b16015H2691J07782b52835B31056
$$ plain form
13195 -162392 -112908 358 121071 282644 -69619 405233 397268 98738 -118005 82532 -97143
13183 -119943 532861 -38264 219897 -78665 -224005 -102711 93057 115821 140895 292691
13173 292691 -39901 103059 159756 -16291 -189487 297425 -171728 -83871 93051 142517 -139809
13161 -93232 16280 48520 60745 -96086 540011 -77201 145515 213064 138882 181817 318878
13150 318878 -215884 108146 204544 86637 -36289 -22604 94353 -106280 -2980 247707 126374
13139 126374 -51684 89250 396473 103521 134514 416539 144324 162361 183266 147657 -303286
13127 231310 16394 -127915 50443 -116525 144309 159468 -195596 -116221 32042 123746 -54635
13115 55781 -141751 120829 82144 225972 120999 133047 -24090 179589 -30786 251810
$$ packed form
13195a62392M9484C58J20713J61573f9619D05233p965I8738a18005H2532i7143
13183a19943E32861c8264B19897g8665j45340a02711I3057K2764K5074J51796
13173B92691c9901A03059N6697a6291j73196B97425a71728h3871I3051M9466a39809
13161i3232A6280L2240J2225i6086E40011g7201A45515O7549p4182M2935J37061
13150C18878b15884A08146R6398H6637c6289J3685I4353a06280b980B47707j21333
13139A26374e1684H9250L07223A03521L0993K82025A44324J8037K0905l5609c03286
13127B31310A6394a27915E0443a16525A44309J5159a95596P9375C2042R1704e4635
13115E5781a41751A20829l8685J43828j04973J2048b4090A79589c0786B51810
$$ plain form
13104 -180888 336118 408176 172361 -62590 112473 -211615 85759 240476 -65698 -217355
13094 -217355 -82941 102951 90786 136938 153647 -233827 9866 -146051 66642 42268 -19521
13082 137437 -152777 -161723 195748 112161 104804 43851 -129500 113377 102675 65432 -270611
13070 -39359 147506 298766 63904 23081 186330 258472 -65428 -39418 151268 260619 107446
13058 50613 415323 90313 -83164 24351 26897 190132 483053 6114 -58133 130949 -7703
13046 54531 108642 147410 312816 147302 143578 68076 37526 159343 132716 305244 216568
13035 216568 -62379 -1517 72392 -9056 25526 161656 343169 38944 20186 76833 204129
13024 204129 97523 137542 -323842 26957 477244 214459 -72873 72663 -96302 -52952 125228
$$ packed form
13104a80888C36118P2058A72361f2590A12473b11615H5759J54717f5698j51657
13094b17355h2941A02951j2165M6152J6709b33827I866a46051F6642k4374a9521
13082A37437a52777q946A95748q3587p357D3851a29500A13377j0702l7243b70611
13070c9359A47506J51260F3904B3081J63249P2142f5428K6010A51268J09351A07446
13058E0613L64710I0313h3164B4351K546J63235K92921F114e8133A30949g703
13046E4531N4111L8768J65406A47302l724F8076l0550J21817k6627J72528q8676
13035B16568f2379a517G2392i056B5526J36130J81513C8944j8758N6647J27296
13024B04129I7523M0019c23842B6957M50287B14459g2873G2663i6302M3350A25228
$$ plain form
13012 20815 95005 57033 16135 195428 139075 304377 -64489 -81568 102524 265792 69555
13000 -10048 368928 505088 -98834 -209807 100424 -16035 46492 -154548 -105026 293514
12989 63298 321296 161544 128417 13224 228469 -74503 207465 120192 162425 251171 -187211
12977 263178 155722 192518 -178790 16250 317376 258442 130863 230772 111846 195896
12967 195896 21600 -234560 162306 -32957 6684 -102060 -48673 71059 417184 236796 158539
12956 158539 30828 -373427 133196 7120 80988 83849 67163 22253 10565 105829 -519884
12944 315140 -379750 -34339 36770 -64625 -34718 77375 -34932 60176 146661 -101326 328925
12932 179624 45001 19061 140819 430264 177817 147136 -137975 -4865 -95112 315089 -24872
$$ packed form
13012B0815P4190l7972A6135J79293n6353J65302f4489j7079A02524J63268F9555
13000a0048C68928J36160i8834j10973A00424a6035D6492a54548M9522B93514
12989F3298K57998j59752l3127A3224K15245g4503B07465q7273M2233Q8746a87211
12977B63178j07456L6796a78790A6250L01126n8934j27579R9909A11846Q4050
12967A95896B1600b34560A62306c2957F684a02060d8673G1059L46125j80388p8257
12956A58539C0828c73427A33196G120P3868K861j6686B2253A0565R5264e19884
12944C15140c79750c4339C6770f4625K9907G7375c4932F0176Q6485a01326C28925
12932A79624D5001A9061J21758K89445A77817l0681a37975d865r0247C15089b4872
$$ plain form
12920 245223 229165 -48336 -139651 -85481 150629 176870 -150459 -224525 -24539 355572 -54099
12908 -154249 -175616 98799 -99150 -87224 -25439 86245 -15516 373471 61948 -77025 -136781
12897 -136781 209643 -18257 142360 -200355 -43598 136116 -56672 106422 -39437 -163014
12887 -163014 80715 6160 144162 -235471 -362929 203119 -117512 -21514 73129 29941 -167246
12875 -229925 159986 -21178 -56051 77535 57656 4739 9148 209227 117619 1410 -59661 12649
12862 53532 63327 -105 161471 72090 70964 297947 -116259 -129756 -218931 -167188 -24982 79767
12849 265269 -27572 113443 85183 32742 121675 148225 -105615 13577 134807 297182 4136
12837 -69440 -40401 -210944 -128366 -38369 467742 -311642 134992 169714 -47604 -203378 -160106
$$ packed form
12920B45223j6058d8336r1315N4170A50629K6241a50459p4066b4539C55572e4099
12908a54249k1367I8799i9150J1926b5439H6245a5516C73471F1948g7025n9756
12897a36781B09643a8257A42360b00355d3598A36116e6672A06422c9437j23577
12887a63014H0715F160J38002b35471j27458B03119a17512b1514G3129B9941a67246
12875b29925A59986b1178l4873G7535j9879D739M409K00079r1608A410e9661A2649
12862E3532R795a05A61471G2090j126K26983a16259j3497q9175N1743b4982G9767
12849B65269b7572A13443k8260C2742Q8933K6550a05615A3577J21230J62375D136
12837f9440K9039j70543Q2578c8369D67742c11642A34992L4722d7604j55774M3272
$$ plain form
12826 -160106 128466 -63090 -78084 -60565 -79102 11071 -215468 32700 -121209 246851 987
12814 -183600 177644 -28629 158745 47741 129586 46060 -187540 113737 315346 -28879
12803 221434 252727 -21942 359719 238168 -143028 -261005 -92250 41965 -175226 23422
12792 186398 -102919 -20496 55282 129117 -92324 152168 -198767 124695 -263101 -121380
12781 17929 -1558 54638 28622 63251 67176 -74227 -104682 40228 -155722 -25566 -28399 -134522
12769 -134522 299095 -490859 -11085 391114 -21582 -93143 -22985 119106 72886 169017 -151757
12757 304253 -122587 51008 -43254 236545 254784 290049 158922 9761 100755 -34767 175681
12745 -139129 366659 279362 147069 306350 -221063 123481 69291 -194320 48427 226597
$$ packed form
12826a60106A28466f3090j4994J7519j8537A1071b15468C2700a21209B46851I87
12814a83600A77644b8629A58745D7741Q1845D6060a87540A13737K01609b8879
12803B21434L1293b1942C59719j21551a43028j17977i2250D1965a75226B3422
12792A86398a02919b0496E5282P3835i2324A52168a98767A24695b63101a21380
12781A7929a558E4638k6016L4629L925g4227l0455D0228a55722b5566k833j06123
12769a34522B99095d90859a1085C91114b1582p1561b2985A19106m6220R6131a51757
12757C04253a22587E1008d3254B36545J8239L5265j31127I761R0994c4767A75681
12745a39129C66659q7297j32293J59281b21063A23481n4190a94320D8427J78170
$$ plain form
12735 226597 375736 -78960 110156 -204173 -91370 -204952 -207451 58421 -165128 2286 312650
12724 312650 -185778 104653 225881 -321736 -37510 73373 153507 -70291 127813 75975
12714 75975 121097 262731 304914 -99150 321981 69043 -26247 224739 40234 343700 345846
12703 345846 -59451 -139744 251375 470040 63096 263111 45722 157412 439013 58741
12692 10566 67875 309636 139436 -60877 249982 16150 -68461 -117274 -26302 -192939 15516
12680 -48617 -126936 385637 73219 -200811 -82701 212529 -228749 116017 69370 9119 258646
12669 258646 -168421 -202439 -166682 117299 -127235 408669 281628 -6628 444245 293506
12659 293506 9256 -95675 136568 390552 218707 30031 -38639 249410 -116156 314768
$$ packed form
12735B26597J49139g8960A10156b04173i1370j13582k499E8421a65128B286L10364
12724C12650a85778A04653J21228c21736c7510G3373Q0134g0291A27813n1838
12714G5975M5122J41634M2183i9150C21981F9043b6247B24739D0234L03466K146
12703C45846e9451q0293B51375K18665F3096K00015D5722J11690K81601E8741
12692A0566N7309K41761A39436f0877B49982A6150f8461m8813b6302j66637A5516
12680d8617p8319C85637G3219b00811h2701B12529b28749A16017m6647I119K49527
12669B58646a68421l4018L5757A17299a27235D08669j27041f628D44245j50739
12659B93506I256i5675A36568K53984j71845C0031c8639B49410a16156C14768
$$ plain form
12648 55877 -193260 125040 289590 -213194 -33330 84569 -70221 -16752 -362360 -184942
12638 -184942 124269 137274 -238579 71108 131518 -39022 80059 91370 190244 427104 522303
12627 522303 211639 282901 -130685 204801 131235 347859 -18775 12565 -79378 -229367
12617 -229367 13544 -28674 145688 35988 -158667 168172 130095 92617 -18794 -27280 -373975
12606 -373975 -210724 124651 11331 52986 25970 28057 139120 313953 102969 -145581
12595 48783 212356 -114351 195849 155473 -150208 219159 321817 -47743 85974 -205221
12584 5743 -45300 89126 107654 -156714 -14507 302342 -26538 60673 -301455 -541917 -195802
12572 1379 -52704 193403 47127 178033 -38319 158432 233448 43485 1763 173019 -173598
$$ packed form
12648E5877a93260A25040J64550b13194c3330H4569g0221a6752l45608J77418
12638a84942A24269J3005b38579G1108O0410c9022H0059J1311R8874K36860R5199
12627E22303B11639P1262a30685B04801p3566K16624a8775A2565g9378j49989
12617b29367A3544b8674A45688C5988a58667A68172l8077l7478a8794q486l46695
12606c73975J63251A24651A1331M1655B5970K087J11063J74833A02969a45581
12595D8783J63573a14351A95849m0376a50208B19159J02658d7743H5974b05221
12584E743d5300H9126J8528a56714a4507C02342b6538F0673c01455k40462a95802
12572A379e2704A93403D7127J30906c8319A58432P5016D3485A763J71256a73598
$$ plain form
12560 121964 -37619 -178750 149103 -26024 -243653 72457 -206529 -57686 74434 220291
12550 220291 66777 169923 -203214 -60605 -188842 -149589 35311 -175299 -86455 64021 -71426
12538 -68833 160767 43109 -81595 88722 226654 296441 -83381 268463 17420 206613 266469
12527 266469 -106619 16847 191153 238829 80743 170753 98628 -296776 219598 -386109
12516 -165568 -173224 67424 50632 -201365 45690 573516 9513 300356 181097 137907 -30976
12504 -95176 -92252 -4398 66979 23761 14615 -122734 -16428 109769 -75475 -73864 -287269 -19383
12491 119805 144334 25939 244789 -89045 25934 88731 -277980 -166550 -151975 -65634 -155075
12480 -155075 209431 -189734 150313 54672 -17170 65903 188202 -38613 -39022 248508 -23383
$$ packed form
12560A21964c7619j41131A49103b6024k17629G2457b06529e7686G4434J45857
12550B20291F6777J03146b03214f0605j28237L9253C5311a75299h6455F4021g1426
12538f8833A60767D3109h1595H8722J37932O9787h3381B68463A7420J89193N9856
12527B66469a06619A6847J74306M7676H0743R0010p2125b96776B19598c86109
12516a65568p656F7424j6792b01365D5690N27826I513K90843j19259m3190c0976
12504i5176K924d398F6979B3761r146a22734a6428A09769g5475J611k13405a9383
12491A19805K4529B5939K18850h9045B5934O2797b77980J11430J4575f5634q9441
12480a55075B09431a89734A50313E4672a7170F5903J22299c8613m09B48508b3383
$$ plain form
12468 34444 140250 -109925 81070 -179138 -214505 -503329 8411 -138334 59009 240256 75601
12456 3335 -66043 -121403 -197403 -120222 130449 -187816 174895 207674 418550 -186057 172346
12444 -96892 14495 -32689 213619 337351 -41234 -95270 -231709 -332272 253872 -78121 -26907
12432 115940 -104753 121644 -21074 -1882 -222530 -74845 132612 290365 22205 -29151 -118410
12421 -118410 -108373 -178903 71651 61993 -73492 136654 -132030 224744 -153654 -99169 315230
12409 125157 148737 -232607 -106895 -216856 -136964 -144760 -406454 11945 154137 -184273
12398 -70736 -133680 78979 -57084 57901 393597 -70754 48 -17304 29434 215415 324493 -16126
12385 530077 -2441 73349 -355343 -389855 27966 -370638 -74094 74874 -129104 -232284 -204026
$$ packed form
12468C4444J05806a09925H1070a79138l5367k88824H411a38334E9009J81247G5601
12456C335f6043n5360p6000P7181A30449a87816A74895L2779K10876a86057A72346
12444i6892A4495c2689B13619J23732d1234n4036j36439j00563B53872g8121b6907
12432A15940a04753A21644b1074a882k20648g4845A32612J57753B2205b9151q9259
12421a18410J0037p0530G1651r658g3492A36654a32030B24744a53654N4485C15230
12409A25157K3580b32607a06895j09961P9892p796k61694A1945J42192a84273
12398g0736o2944G8979e7084E7901L35696g0754D8a7304B9434J85981J09078a6126
12385E30077b441G3349c55343l4512B7966c70638g4094G4874a29104j03180K8258
$$ plain form
12374 -204026 323169 15737 -50796 140018 68638 -14685 -63871 -76246 189914 -167456 111083
12362 -75311 -74911 46211 -51652 101289 8455 -69664 97104 376294 54522 -83265 37924 -64839
12349 52716 100952 -176468 -230386 132165 15949 -150304 67831 82954 187074 -110426 -110328
12338 -110328 172206 18447 -151268 -125926 58936 -132993 106033 25271 -187400 -272574
12328 -272574 44070 -160018 14727 -70281 -94432 -148742 -253507 99609 -66852 93406 61512
12317 61512 -56878 -13054 -70691 157532 -82809 36326 -82135 193117 -48183 346897 12150
12305 -44533 -34764 213752 -27546 131541 -177348 -335033 -19286 -15682 212409 -50100 29719
12293 162954 108442 -309662 40516 384531 41501 31836 52805 -92627 99087 141174 -32224
$$ packed form
12374b04026C23169A5737e0796A40018F8638a4685m9186j2375A89914a67456A11083
12362g5311M00D6211e1652A01289H455f9664I7104K79190E4522h3265C7924f4839
12349E2716M8236a76468n3918A32165A5949a50304F7831J5123J04120a10426R8
12338a10328A72206A8447a51268K5342E8936a32993A06033B5271a87400q5174
12328b72574D4070a60018A4727g0281k4151n4310j04765I9609f6852I3406l1894
12317F1512e6878a3054n7637A57532h2809C6326h2135A93117d8183C46897A2150
12305d4533R769B13752b7546A31541a77348j57685a9286L604B12409e0100B9719
12293A62954n4512c09662D0516L44015D1501r665K0969i2627I9087M2087c2224
$$ plain form
12281 -30522 11888 -60239 -206942 120373 -264178 300913 261949 4204 64363 -41128 134736
12269 19556 77209 -16723 -61481 475774 221774 -35736 200892 -224126 -8937 56272 48879
12258 48879 165592 -54093 161963 -93393 -102774 41756 18840 58312 334946 33451 -114522
12246 -64276 140394 213239 221858 33557 -47969 -32427 208840 6132 -58880 266750 132348
12234 -223115 -11785 -77278 508645 161454 96066 560231 259523 112950 114698 20541 9647
12222 625738 246430 257889 300098 125030 102345 198695 -103048 298701 75103 51254 -57847
12210 -146894 253742 200075 132280 150708 304768 358202 -10025 160219 155734 136526 -109440
12198 -62433 270511 203467 -135325 200811 112528 211873 -12502 189815 -96797 -63290 282185
$$ packed form
12281c0522A1888f0239j46703A20373b64178C00913l8964D204O0159d1128A34736
12269A9556N7653a6723m4758D75774B21774c5736B00892b24126h937E6272p393
12258D8879J16713e4093A61963i3393r381D1756A8840L9472K76634C3451a14522
12246f4276A40394P2845Q619C3557d7969J5542B08840F132e8880B66750A32348
12234b23115a1785o5493E08645A61454o5388M64165B59523A12950J748B0541I647
12222F25738B46430J1459M2209A25030k2685R6350a03048B98701G5103k3849e7847
12210a46894B53742n3667o7795J8428J54060N3434a0025A60219m485j9208a09440
12198f2433B70511o7044a35325B00811q8283R9345a2502A89815i6797L3507B82185
$$ plain form
12186 235869 230495 346413 152280 36314 -88156 138111 88278 133017 -240085 157599 91770
12175 91770 371762 22065 -106119 92381 38726 229379 -1762 -19257 -117135 40502 -53999
12163 372375 -2350 -87011 229357 40011 185842 258483 -173322 -54349 -104969 -164220 -207465
12152 -207465 270646 7149 -91185 192176 3243 -264203 84740 382712 -106942 227153 106932
12140 88268 -137022 243546 -319376 -222288 -314593 -147794 -128256 -9325 -184405 -161383 -43126
12128 -29832 -65609 -78225 18049 -112111 38424 -83258 -134498 134837 -11010 281348 163550
12117 163550 146122 -129685 -298342 -73752 46062 -4074 -149642 -326868 143974 -246925
12106 141545 96341 64935 -59727 119010 147279 -71431 205041 324177 -45441 -14029 103526
$$ packed form
12186B35869n374J15918A52280C6314h8156A38111m9833M4739b40085A57599o5829
12175I1770K79992B2065a06119I2381C8726J90653a762j7495r7878D0502e3999
12163C72375b350q4661B29357D0011J45831P2641a73322e4349n0620n9251m3245
12152b07465B70646G149i1185A92176C243b64203H4740K97972a06942B27153A06932
12140H8268a37022B43546c19376R7088r2305a47794J9538i325j75080K3022d3126
12128b9832l5777j2616A8049a12111C8424h3258n1240A34837a1010B81348j17798
12117A63550j7428a29685j68657g3752D6062d074j45568j77226A43974b46925
12106A41545m5204l1406e9727A19010K8269g1431B05041J19136d5441a4029A03526
$$ plain form
12094 -404673 15624 -220063 -61208 -107927 189056 209708 -335148 -137896 -118709 199018
12083 95809 -72345 -144394 96111 8921 224767 425512 1617322 955744 462901 251424
12073 251424 -3661 14691 -2035 8396 54924 13182 192792 339349 65753 -147149 -46598
12061 -19254 -96856 212051 369668 97678 26242 -913 -110897 -224797 -148263 -27176 136355
12049 8836 -141139 135293 56838 -72557 -22217 -170128 -11595 75500 -122783 -20523 174293
12037 -74188 -489664 -217169 -282660 205811 9049 167646 150640 145526 116591 51840 231877
12026 231877 -363748 32825 2466 -154772 -57926 -197091 255901 -3098 194135 180940 96007
12015 96007 -133189 377873 -253120 227805 -126222 -191170 -42261 329376 -184823 23381
$$ packed form
12094d04673A5624b20063f1208m6719A89056K0652c35148a37896J9187A99018
12083I5809g2345p2049I6111H921K15846K00745J191810o61578D62901k11477
12073B51424c661A4691b035H396M6528A3182J79610J46557F5753a47149d6598
12061a9254p7602B12051J57617I7678B6242i13j09984j13900P6534b7176A36355
12049H836a41139A35293E6838g2557b2217j47911a1595G5500a22783b0523A74293
12037g4188m15476b17169o5491B05811I049J58597j7006n114k8935E1840J80037
12026B31877c63748C2825B466a54772e7926j39165B55901c098A94135j3195q4933
12015I6007a33189C77873b53120B27805a26222o4948d2261C29376a84823B3381
$$ plain form
12004 227709 201749 187408 -76086 253947 -20125 499489 31210 -174601 15883 -187004 -217480
11993 -217480 202600 18734 -122977 420680 -167356 -71333 -312355 -9127 195445 125011
11983 125011 327305 -17261 51375 84063 -107958 2323 12968 -242963 -47089 135917 -29162
11971 8563 112385 -254377 457778 47164 -116783 79986 -204823 127417 54206 -319263
11960 -31984 -34590 127260 165631 -243449 -152236 -10582 -86929 -367505 -44408 56156 47385
11949 47385 -177548 194869 76665 396773 283297 -174928 -44188 14870 50523 186864
11939 186864 -329151 -44090 240127 -96701 140697 151813 135312 186884 78451 -215722 -4901
11927 175748 74612 -785 49945 -107765 -66183 21541 -457358 104983 -61815 -470297 342572
$$ packed form
12004B27709k5960j4341g6086B53947b0125D99489C1210a74601A5883a87004l0476
11993b17480B02600A8734a22977D20680a67356g1333k41022i127A95445p0434
11983A25011K02294a7261E1375L2688a07958B323J0645b42963d7089A35917b9162
11971H563J03822b54377D57778D7164a16783G9986b04823A27417E4206c19263
11960c1984k606A27260L8371b43449R1213a0582p6347k80576d4408E6156q771
11949D7385a77548A94869G6665L20108j13476a74928d4188A4870L5653J36341
11939A86864c29151d4090B40127i6701A40697J1116j6501N1572G8451b15722d901
11927A75748G4612g85D9945a07765M1582B1541d57358A04983f1815m08482C42572
$$ plain form
11915 29673 88786 -26945 -146728 391948 -38285 62001 -168112 -202259 38444 -331651 -280297
11904 -280297 176242 11658 -215033 345137 -169028 -28113 -357268 -54499 -169125 220122
11893 -18608 52536 230092 90265 148177 260022 230443 24521 -38747 -134127 -354185 4968
11881 -206995 -148739 201142 -221802 -162672 69232 -109208 -108217 -443735 159028 -202316 5101
11869 -358028 348495 144759 -300452 83148 -24572 -29682 254454 7798 -239143 -108532 -298650
11858 -298650 -128070 -77907 77519 28388 -109632 -336685 34630 -141512 -128103 -178095 -75393
11846 -214593 245410 -38029 17825 -39286 75777 276081 -219191 113543 92890 210528
11836 210528 -17441 131716 -134657 -164603 106635 -245101 110849 46735 -448704 -79838
$$ packed form
11915B9673N9113b6945j19783C91948c8285F2001a68112l4147C8444c31651N1354
11904b80297A76242A1658b15033C45137a69028b8113l29155e4499j14626B20122
11893a8608E2536J77556I0265N7912J11845k9579B4521c8747r5380k20058D968
11881b06995N8256B01142b21802N9130F9232a09208R91l35518A59028b02316E101
11869c58028C48495A44759c00452H3148b4572n110B54454G798b39143a08532j90118
11858b98650a28070N0163G7519B8388a09632k27053C4630a41512J3409m9992g5393
11846b14593B45410c8029A7825c9286G5777K00304b19191A13543k0653J17638
11836B10528a7441A31716a34657k9946A06635b45101A10849D6735d48704g9838
$$ plain form
11825 73834 291823 -69797 133144 48407 -139235 209351 223751 -24708 74860 -26980 -24467
11814 -24467 136847 171654 53220 -59652 148681 -196369 -40687 292042 -240318 -136914
11804 -136914 -131587 -123804 82294 145575 -242890 45815 12176 21935 -99477 -78183 -80442 62053
11791 217127 -121341 114778 11951 230115 -258953 -223152 -75129 65816 -277295 -147168
11781 -147168 213578 -16021 -36709 89797 80801 -123402 -420654 40401 -141317 294704 165667
11770 165667 51847 31066 72320 -75288 -67435 222200 -112516 -77574 -129108 186836 167148
11759 167148 54220 -177707 -34297 62920 -13869 -67695 29664 -23585 -261398 -228937 166192
11747 149518 -125071 -36988 -58362 -117973 331463 -44375 -116050 -199676 18420 -547929 -306998
$$ packed form
11825G3834K17989f9797A33144D8407a39235B09351J4400b4708G4860b6980K513
11814b4467A36847L4807E3220e9652A48681a96369d0687B92042b40318J03404
11804a36914N327P783H2294O3281b42890D5815A2176R759i9477K1294k259F2053
11791B17127a21341A14778A1951K18164b58953L5801g5129F5816b77295J30127
11781a47168B13578a6021k0688H9797q996a23402k97252D0401a41317B94704j29037
11770A65667E1847k0781M1254g5288P853B22200a12516L4942n1534A86836j9688
11759A67148E4220a77707c4297F2920a3869n3826B9664b3585k37813L2461A66192
11747A49518a25071c6988k1374n9611C31463d4375p1675q3626A8420e47929K40931
$$ plain form
11736 -306998 183539 1609 98112 -24758 111257 -98317 58292 -346930 61612 285014 -52505
11724 8417 -23362 -76980 136051 -217250 156996 50188 47070 -61173 50546 -47473 -136535
11713 -136535 18633 183342 104367 -30652 94387 -163815 391398 -216026 -66289 -60684 378081
11701 -57909 -8240 75617 217897 127674 79242 -165483 13672 -50116 90683 -57713 123631
11689 -222281 349827 102512 -122885 -163585 -154669 228391 238320 -175170 284935 -86405 -13726
11677 -352363 236860 -47360 96702 -349198 109615 -81840 47773 -251623 107332 -54968
11666 120140 135946 21967 137416 318535 244794 -164323 138880 -318352 15265 -140068
11655 -135573 -31304 -56015 128262 6044 169747 58295 -11012 157912 84281 349965 -255607
$$ packed form
11736c06998A83539A609R6503b4758A11257i8317E8292c46930F1612K23402e2505
11724H417b3362n3618A36051b17250A56996E0188l118f1173E0546d7473q9062
11713a36535A8633J64709p8975c0652I4387a63815C91398b16026f6289N605C78081
11701e7909h240G5617J42280r0223m8432a65483A3672e0116I0683e7713A23631
11689b22281C49827A02512a22885m0700Q916B28391R929a75170B84935h6405a3726
11677c52363B36860d7360I6702c49198A09615h1840D7773b51623A07332e4968
11666A20140J5806B1967J15449J81119p3741a64323A38880c18352A5265a40068
11655a35573c1304k4711A28262F044J63703E8295a1012A57912p3631K65684b55607
$$ plain form
11643 -94199 165149 138824 324142 347088 160355 120796 120070 11406 -144505 -15551 -74762
11632 -74762 384838 -13599 112495 -71657 224476 210682 171609 308996 73868 165166 -3160
11620 22531 -150866 -45694 -35582 64801 -105577 268127 4498 25483 -213636 -234228 48520
11608 392259 333813 122751 -55039 -63783 -249118 81231 103847 183492 -107166 172469 -11920
11596 -31640 240575 -34077 153532 206619 47043 -20431 252412 2605 -61514 119667 -186492
11584 237829 -268860 193548 247168 265736 115501 -88773 392865 126358 -31559 163406
11573 -3264 133373 69443 -291799 -137105 -115672 322773 334977 -84952 166332 -40172 -209089
11562 -209089 99315 41307 91961 -134585 196976 -293198 124304 268905 504449 131435
$$ packed form
11643i4199A65149k6325J85318K2946A60355l9559p26A1406a44505a5551n9211
11632g4762C84838a3599A12495g1657B24476j3794l9073J37387G3868R1298c160
11620B2531a50866d5694J0112F4801a05577B68127D498K0985b13636k0592D8520
11608C92259n8446A22751e5039q744j85335H1231K2616P9645a07166A72469a1920
11596c1640B40575c4077A53532N3087D7043b0431B52412B605f1514A19667a86492
11584B37829b68860A93548N3620J8568A15501h8773C92865A26358c1559A63406
11573c264A33373o3930b91799a37105K1433C22773J2204h4952A66332d0172j68917
11562b09089I9315D1307N0654a34585A96976b93198A24304J44601K35544A31435
$$ plain form
11551 132531 278802 -1496 80391 166080 -1206 -305423 278841 71556 -216366 250955 -32346
11539 -220045 22209 200235 182090 7997 95721 365841 97245 -275284 68785 146017 94835
11528 94835 105707 -139639 397570 -30275 278264 18831 347734 -874 70800 52642 -162545
11516 -38414 30293 71252 -144255 -29691 492310 -46571 -68599 96952 16637 93945 300957
11505 300957 -26606 -139734 -185784 98837 195169 25602 -259691 287086 -29763 -100905 124687
11493 -22859 -80255 44925 538456 30541 6769 130429 201199 177161 -306852 178469 154070
11482 154070 45391 239758 63051 34 207560 186475 200755 -23142 188300 13878 -59784
11470 174012 -210930 148900 220634 -45634 189317 568674 -30913 45034 401266 2395 397168
$$ packed form
11551A32531J46271a496H0391Q5689a206l04217B78841G1556b16366B50955c2346
11539b20045B2209J78026j8145G997Q7724K70120I7245b75284F8785P7232n1182
11528I4835J0872a39639C97570c0275B78264A8831L28903h74G0800j8158a62545
11516c8414C0293M0959a44255b9691D92310d6571k2028I6952A6637P7308K07012
11505C00957b6606j13128m6050I8837R6332B5602b59691B87086b9763p1142A24687
11493b2859n7396D4925M93531C0541F769J23660P0770k4038c06852A78469k4399
11482A54070D5391J94367F3051C4K07526k1085J4280b3142A88300A3878e9784
11470A74012b10930A48900P1734d5634A89317L79357c0913D5034L56232B395L94773
$$ plain form
11459 397168 17789 134356 32618 7748 269963 -319568 -98077 114771 160289 -110051 20251
11447 97845 4614 368436 155459 -17909 -1852 29993 -39421 -389088 285268 35411 -110934
11435 -178814 148867 -72806 268739 -56842 -224093 -118741 -50524 -196616 -36564 83953
11424 212836 -6693 -16873 -59788 -120879 -55623 259936 208148 -92734 241876 199593 -42423
11412 112785 19923 236446 -149425 -51999 116458 91169 -53900 281570 75123 15466 179797
11401 179797 -233685 112361 96459 133254 40194 -176399 288592 12774 -219118 -108196
11390 274218 -354134 16405 -103297 -398310 -137565 2424 49870 -45939 -5628 20697 -23295
11378 184263 -60557 -54875 45419 73463 210323 246047 -159009 -273338 -321182 -194082 117540
$$ packed form
11459C97168A7789J16567C2618G748K62215c19568i8077A14771M5518a10051B0251
11447I7845D614L63822A55459a7909a852B9993c9421l49667B85268C5411a10934
11435a78814A48867g2806B68739e6842j67251J05352e0524j46092c6564H3953
11424B12836f693j0180m2915o1091e5623B59936n1788i2734B41876m2283d2423
11412A12785A9923K16523a49425e1999A16458k5289e3900B81570G5123A5466J64331
11401A79797b33685A12361j5902L6795D0194a76399B88592A2774b19118a08196
11390B74218c54134A6405a03297k95013a37565B424M7446d5939e628B0697b3295
11378A84263f0557N682D5419K8044J36860L5724a59009j14329m7844J27100A17540
$$ plain form
11366 188813 -36610 -69160 -90475 83000 -296809 129365 -13366 -294103 14558 -22974 -34110
11355 -34110 -34270 -161668 94002 176659 -36111 -11960 -61799 -65343 -209530 82699 293186 66283
11342 -24576 53663 38385 -298901 -402263 -49971 6373 -267870 -325520 -36613 200271 253012
11331 253012 -69454 59945 30181 231326 -42696 178571 125629 -186136 252202 99195 229555
11320 229555 356913 -110304 -64955 -263489 67145 161778 152568 -149334 -274161 -267927 110330
11308 -235830 462465 184200 -73211 53870 114305 7942 -54135 65732 126189 277290 -73434
11296 57108 377800 -304060 106908 20631 114270 -122147 86786 96584 164094 69517 -85530
11284 -17836 61511 70308 -76447 -122498 86922 -35109 239483 -74428 -184206 10375 160715
$$ packed form
11366A88813c6610l2550k1315H3000b96809A29365a3366k80737A4558b2974j1136
11355c4110j60j27398I4002Q2657c6111a1960m9839l544j44187H2699K10487F6283
11342b4576E3663j5278b98901j03362d9971F373b67870n7650c6613B00271N2741
11331B53012f9454E9945k9764K01145d2696A78571n2942a86136B52202I9195J30360
11320B29555J27358a10304M5349j98534F7145R4633r210a49334j24827O234A10330
11308b35830D62465A84200g3211E3870O0435G942e4135F5732O0457J51101g3434
11296E7108L20692c04060A06908B0631R3639a22147H6786R798O7510F9517h5530
11284a7836F1511Q797g6447m6051H6922c5109B39483g4428j09778A0375J50340
$$ plain form
11273 160715 79806 69406 68010 105965 -155633 -96658 32614 -2501 -29157 -227899 -76697
11261 -183311 274007 -225642 -148393 -105823 -46461 234927 148942 -128499 45204 -250781
11250 62684 -16933 -187281 -259091 -86637 245518 -392683 68742 -69174 -280151 5796 38782
11239 38782 147795 93067 -86271 -144795 114267 31640 -152373 285502 -59891 456381 111935
11227 -259428 -223308 -50055 -260171 -222849 59358 44585 -195534 -68953 -47750 -247131 -271003
11216 -271003 138090 -98873 -287749 -231280 -99547 -601499 -87716 -77707 -216902 149262
11205 -239663 -176067 -97439 142761 34909 1016 -415855 56008 -288214 -154263 -113634 -285032
11194 -285032 -126347 58774 237198 67174 59459 74525 -142346 124663 -15844 -101786 40939
$$ packed form
11273A60715G9806j0400j396L7955a55633N8975C2614b501k6656j98742g6697
11261a83311B74007b25642P7249M2570d6461B34927q5985a28499D5204b50781
11250F2684a6933j70348p1810h6637B45518c92683F8742f9174k10977E796L2986
11239C8782J09013n4728h6271n8524A14267C1640a52373B85502e9891D56381A11935
11227b59428L6120e0055k10116L7322E9358j4773a95534f8953K1203j99381k3872
11216b71003A38090i8873j88876N6469i9547n01952h7716J0009j39195A49262
11205b39663O3596P8628A42761C4909A016d15855E6008b88214J33951M0629j71398
11194b85032a26347E8774J78424F7174p715J5066a42346A24663a5844q5942D0939
$$ plain form
11182 -130215 81448 54160 63907 -232432 212416 118566 -310995 128533 -183314 -54184 65105
11170 158008 -295513 45141 -40845 73537 107128 -264074 107817 -112333 127708 -142667
11159 -192833 150910 -51275 1218 363868 -62790 -77353 -480673 -107905 -104642 109309 154565
11148 154565 136732 -91129 10836 146742 55740 -141269 11975 -56897 -118356 -20936 -346557
11137 -346557 -265137 -33206 -107444 328418 286950 -90223 -34638 204642 156430 -219212 -16621
11125 3092 -69181 271948 -41990 158588 192704 -11669 140358 129184 126131 368616 -208295
11113 -128665 111735 -63441 198460 46917 188007 -126266 205430 105780 104818 334114 -114237
11101 164658 -157202 6714 253885 82974 270821 39701 -54214 271166 526172 240227
$$ packed form
11182a30215H1448k7288R747b32432B12416r3850c10995A28533a83314e4184F5105
11170A58008b95513D5141d0845G3537L3591b64074A07817a12333A27708a42667
11159a92833A50910e1275A218L62650f2790j4563m03320a07905L263A09309M5256
11148A54565j7833i1129A0836J35906E5740a41269A1975e6897o1459b0936l25621
11137c46557Q1420c3206p4238C28418m1468i0223c4638B04642m8212b19212a6621
11125C092f9181B71948d1990A58588L4116a1669A40358j1174l053K42485b08295
11113a28665A11735f3441A98460D6917J41090a26266B05430r9650r62K29296a14237
11101A64658a57202F714K47171H2974J87847C9701e4214B71166K55006B40227
$$ plain form
11090 -23353 -83727 237590 509012 -261646 228542 510648 137687 36156 4713 450064
11080 450064 -121031 -34304 55968 167247 33601 280641 -147367 207214 -51974 548251
11069 575151 33264 335771 471159 421237 462894 407541 175761 596295 611288 463737
11059 463737 121458 361704 363419 357128 419352 547837 293674 749169 735881 737363 621842
11048 621842 583986 460090 585812 728602 642165 856294 759049 737747 753921 756228 619114
11037 619114 508106 614886 710878 910232 710323 825589 536664 576587 603009 945283
11027 945283 547457 783996 515439 887526 590886 561647 705873 632699 725641 452268
11017 452268 791998 837809 359136 248798 741800 606695 261653 541016 669783 553155
$$ packed form
11090b3353o0374B37590K71422b61646B28542K82106A37687C6156D713M45351
11080D50064a21031c4304E5968J11279C3601K47040a47367B07214e1974E48251
11069E75151C3264L02507J35388m9922M1657n5353A75761M20534J4993j47551
11059D63737A21458K40246J715o291O2224J28485k54163M55495j3288J482j15521
11048F21842l7856j23896J25722J42790q6437K14129r7245k1302J6174K307j37114
11037F19114j11008J06780R5992J99354j99909J15266k88925L9923K6422L42274
11027I45283l97826K36539k68557L72087k96640k9239J44226p3174R2942k73373
11017D52268L39730M5811C59136j10338M93002j35105B61653K79363J28767j16628
$$ plain form
11007 553155 751397 569950 536076 392289 638714 659720 645654 420155 824489 868355
10997 868355 876953 876730 573036 593143 918252 684132 613753 538664 781805 662311 820868
10986 820868 614516 1015782 999848 833218 1049624 992564 1268666 907425 1265531 1548615
10976 1548615 1458001 1943664 2268504 2323203 2368620 2236359 2404023 2206455 2740939 2459559
10966 2459559 1860777 1610926 1677523 1412889 1524276 1561697 1475910 1501296 1619888 1632047
10956 1632047 1465841 1609067 1467628 1171945 1154988 784329 1099508 679844 666821 242982
10945 325603 151372 247870 138442 164788 146921 111914 313335 263001 394360 -8914 -19888
10934 -19888 -59827 154408 -221291 4846 -217659 264911 371197 -45838 194284 -116867
$$ packed form
11007E53155J98242j81447l3874j43787K46425K1006j4066k25499M04334M3866
10997H68355Q598k23l03694K0107L25109k34120p0379p5089K43141j19494J58557
10986H20868k06352M01266j5934j66630K16406n7060K76102l61241L58106K83084
10976A548615r0614M85663L24840N4699M5417j32261J67664j97568N34484k81380
10966B459559n98782k49851O6597k64634J11387L7421q5787K5386J18592J2159
10956A632047j66206J43226j41439k95683j6957l70659L15179m19664j3023B42982
10945C25603A51372R6498j09428K6346j7867l5007K01421n0334J31359h914j0974
10934a9888l9939A54408b21291D846b17659B64911J06286d5838A94284a16867
$$ plain form
10923 -30350 -95368 53392 -7691 71536 -13354 -177306 -196451 -252666 221442 192968 97994
10912 97994 -40023 227441 70039 -477512 -38708 -234639 -294414 -81140 -40694 108894 -125890
10900 336315 188112 -229097 247664 9582 -310181 -13966 14509 -359405 86707 144373 132422
10889 132422 -58979 -181976 280972 166102 -122384 -320152 -304381 -164712 -53035 104526
10878 53974 135410 -58521 153123 -259767 -13506 115942 -154883 230628 -326323 310722
10867 -291783 -147483 -37567 -327838 -144115 117890 126122 -86799 -108764 126423 -47904 93293
10855 -12959 -396499 81885 39299 -266149 -22984 271333 117576 -106636 -138949 -179585 -223482
10844 -223482 157294 62962 29008 187829 -8568 -314404 -83054 -255813 -164686 -5804 227055
$$ packed form
10923c0350o5018E3392g691G1536a3354j63952j9145n6215B21442k8474r4974
10912I7994d0023B27441G0039d77512c8708j95931n9775h1140M0446A08894a25890
10900C36315j48203b29097B47664I582c10181a3966A4509c59405H6707N7666j1951
10889A32422e8979j22997B80972j14870a22384j97768J5771J39669e3035A04526
10878E3974Q1436e8521A53123b59767a3506A15942a54883B30628c26323C10722
10867b91783J44300c7567k90271a44115A17890Q232h6799k1965A26423d7904I3293
10855a2959l83540H1885C9299b66149b2984B71333A17576a06636l2313m0636m3897
10844b23482A57294F2962B9008J58821h568l05836h3054j72759R1127e804B27055
$$ plain form
10832 -156707 -325205 -284560 -55479 89914 -68930 89709 -29249 -213920 -168888 -184681 -110994
10821 -110994 -170646 -38394 173361 121830 -108838 126011 -44778 -282735 -374555 150910
10810 -146508 -4867 -26087 112941 -228269 45297 -73521 -177586 58692 -174019 -134981 124237
10798 -45748 -32588 39465 171915 -102399 -79831 -227361 -122720 -20686 59636 61659 -206320
10786 2020 135295 4728 315967 131905 -3090 -184035 46343 57512 -12890 39339 109987
10775 109987 25640 -257609 -113723 36556 -54778 228168 -101511 221832 105547 -46716
10764 -183991 41047 -244508 -108194 -163869 -128167 3018 31952 -325060 172739 -161877 -162721
10753 -162721 385164 -165511 -6784 -40849 -113627 -272177 171626 -291099 155376 -39317
$$ packed form
10832a56707j68498M0645e5479H9914f8930H9709b9249j84671M5032j5793P3687
10821a10994n9652c8394A73361n1531a08838A26011d4778k37957r1820A50910
10810a46508d867k1220A12941b28269D5297g3521j04065E8692a74019L9038A24237
10798d5748J3160C9465J32450a02399K2568j47530J04641b0686E9636K023b06320
10786B020J33275D728L11239A31905c090j80945D6343J1169a2890C9339P0648
10775A09987B5640b57609a13723C6556e4778B28168a01511B21832A05547d6716
10764a83991D1047b44508a08194n5675L5702C018K8934c25060A72739a61877q44
10753a62721C85164a65511f784l4065p2778j58550A71626b91099A55376c9317
$$ plain form
10742 112563 2300 22803 -117560 -196281 213390 -235325 3607 189284 37612 70698 -84642
10730 107371 83021 163693 120105 75573 14045 -232895 131047 210267 209085 -128985 73469
10718 22239 59055 112167 31619 -137948 -217590 16812 -213081 -180365 85738 52464 -282982
10706 78000 16281 1913 -411453 -139038 43081 256030 211718 -516585 48137 -47241 132801
10694 -136282 46458 -56180 -41140 -35964 -25288 -127315 -133926 -39162 16201 421233 130583
10682 -345060 -37435 2006 -88623 -129854 -121378 -114990 -68654 114244 -163911 -7962 164786 -212709
10669 60051 -36106 -130437 223713 -404222 62287 292924 223633 -16535 66129 -14900 -48925
10658 -48925 -60145 -265897 23853 -124687 -3886 144147 -347897 -231693 -150236 79697 -65892
$$ packed form
10742A12563B300K0503a17560p8721B13390b35325C607J85677C7612L3086h4642
10730A07371k4350Q0672m3588m4532A4045b32895A31047P9220j182a28985G3469
10718B2239L6816N3112C1619a37948p9642A6812b13081L2716H5738l3274b82982
10706G8000A6281A913d11453a39038D3081K12949m4312e16585D8137d7241A32801
10694a36282D6458e6180J5040N176J0676j02027o611c9162A6201M05032A30583
10682c45060c7435B006h8623m1231Q476O388M6336A14244a63911g962A64786b12709
10669F0051c6106r4331B23713d04222F2287K30637o9291a6535F6129a4900l4025
10658d8925j1220k05752B3853a24687c886A44147c47897J16204Q1457G9697f5892
$$ plain form
10646 4701 -331630 -266027 -358946 -127931 -104762 -363928 221773 -218472 -238147 367704 -51906
10634 -60272 -43129 -18798 14491 67885 -60558 -225860 -122626 54223 14437 -484291 -14136
10622 -32174 -137859 100361 38091 -157308 -50343 190645 129735 -184044 -54944 23704 264356
10611 264356 -208297 89089 -12622 -153141 -213274 -147794 21839 -89298 227426 -51196 -244709
10600 -244709 -98483 58334 -223804 11069 125411 353631 -14314 -142956 -32892 -409400
10590 -409400 13652 -81693 -150898 156592 -258932 -326975 136609 -149772 -426829 478211
10579 139805 174923 121972 -114105 -119256 -125572 21285 -58529 30994 -3462 -188785 -139756 -265943
10567 -265943 -248236 27597 -153831 11453 145483 -1852 -351788 -175392 191344 -110649
$$ packed form
10646D701c31630O5603r2919a27931K3169k59166B21773b18472j9675C67704e1906
10634f0272J7143a8798A4491N3394f0558j65302J03234E4223A4437d84291a4136
10622c2174j05685A00361C8091a57308e0343A90645o0910a84044e4944B3704K40652
10611B64356b08297H9089a2622j40519o0133O5480B1839h9298B27426e1196j93513
10600b44709i8483E8334b23804A1069J14342K28220a4314j28642c2892l76508
10590d09400A3652h1693o9205A56592b58932o8043A36609a49772k77057D78211
10579A39805L5118n2951a14105n151o316B1285e8529C0994c462j85323M9029j26187
10567b65943J7707B7597a53831A1453J34030a852l49936a75392A91344a10649
$$ plain form
10556 -117096 21284 13406 -174704 -123222 -30577 64261 -23084 -183757 47625 94015 -222871
10544 -220575 -93470 100874 -378105 60979 -213322 44700 15421 -92334 -247961 -129033
10534 -129033 -14870 211419 83139 149050 -143057 -261731 222527 93976 59061 -103065
10523 -179807 8703 -131493 -217521 323513 -28657 365059 -12754 -48689 135091 75600 -224045
10511 -165533 243490 -161794 -337088 204405 -66447 -244714 95632 -371530 217662 -91811
10500 -86856 273609 266249 -1438 -12452 -103158 -99129 93656 -168582 3706 -24370 203194 -9724
10487 -98926 -217002 208242 167157 222925 418462 204530 -776 318294 251967 232446 269053
10476 269053 -223955 36570 -16233 -186793 -23991 145879 137124 7219 -127769 116015 86669
$$ packed form
10556a17096B1284p878a74704N1482c0577F4261b3084j60673D7625M6390b22871
10544b20575i3470A00874c78105F0979b13322D4700A5421i2334j55627J18928
10534a29033a4870B11419H3139O5911a43057j18674B22527I3976l4915a03065
10523a79807H703a31493q6028C23513b8657C65059a2754l5935A35091n9491b24045
10511a65533B43490a61794j75294B04405f6447j78267I5632c71530B17662i1811
10500h6856B73609p360a438j1014r0706M029I3656a68582C706b4370B03194i724
10487i8926j18076B08242m1085N5768J95537B04530g76C18294o6327j9521L6607
10476B69053b23955C6570a6233j70560b3991A45879q755G219a27769A16015k9346
$$ plain form
10465 86669 -124127 58580 -96931 -247382 50714 449387 -84462 -43744 -70134 -17434 49751
10453 36480 -14601 33302 -66244 105982 -273252 133281 -150137 29019 134191 -120295
10442 127600 -139354 -20191 -332706 -111963 271723 -172637 -201286 155794 -367410 107812
10431 123375 65073 -40302 -25814 -188362 226805 -429138 1680 -107090 -182461 -19740 21301
10419 237532 -193949 -265910 22983 -151320 121832 72914 13421 -48456 165831 391039
10409 391039 -313818 222470 -46116 -231348 277750 -31953 -277350 63658 -15358 -296351
10399 -296351 240794 8353 -57573 -110979 89897 142337 468957 -32958 144677 205801 258474
10388 258474 -106339 -159052 -14457 187874 415525 426269 233403 -297397 122044 -26612
$$ packed form
10465H6669a24127E8580i6931j50451E0714L98673h4462M0718k6390a7434D9751
10453C6480a4601C3302f6244A05982b73252A33281a50137B9019J05172a20295
10442A27600a39354b0191l12515a11963B71723a72637k8649A55794c67410A07812
10431A23375n8302d0302J4488j62548B26805d29138A680a07090p5371a9740B1301
10419B37532a93949p1961B2983a51320A21832m8918A3421d8456A65831K25208
10409C91039c13818B22470d6116j85232B77750c1953k45397F3658a5358k80993
10399b96351B40794H353e7573n3406H9897N2440L26620c2958A44677O1124N2673
10388B58474a06339n2713a4457A87874K27651J0744j92866b97397A22044b6612
$$ plain form
10377 349910 396198 116372 111415 311023 -147254 405362 251169 20528 271392 341663
10367 341663 358581 311484 497049 -19365 153717 178458 252379 181069 242540 -24867 94324
10355 94399 238219 -42953 73955 173833 189520 525213 366611 232355 550756 202474
10344 374568 379683 399156 218857 305272 78888 109917 -79990 160028 266160 -9867 517565
10332 435012 40304 57771 2007 297960 23509 34357 -69063 68603 130603 204665 348818
10321 348818 353535 401379 124644 80750 -11146 -7667 198706 -87489 -272002 198384 309683
10310 309683 -37440 -97730 106929 244377 335297 -25172 76193 43873 -85728 110271 141150
10299 141150 26268 52024 178125 -41843 -196470 359136 -72031 -4772 229883 -152366 300271
$$ packed form
10377C49910M6288A16372m957J99608a47254D05362j54193B0528K50864P0271
10367C41663J6918m7097J85565a9365A53717K4741P3921p1310O1471b4867I4324
10355I4399J43820d2953G3955R9878J5687L35693j58602j34256L18401B02474
10344C74568N115J9473j80299Q6415G8888L1029g9990A60028J06132i867E17565
10332D35012D0304J7467B007K95953B3509J0848f9063F8603O2000P4062J44153
10321C48818M717M7844A24644m3894a1146L479A98706h7489j84513A98384J11299
10310C09683c7440o0290A06929J37448R0920b5172G6193l2320h5728A10271L0879
10299A41150B6268K5756J26101d1843j54627C59136g2031d772B29883a52366C00271
$$ plain form
10287 276966 -257902 201600 199397 124164 108999 -364544 -1735 -65241 -114384 -206533 -33355
10275 125127 99367 -257290 -305859 546985 190064 -15025 32805 -415877 164633 -242099
10264 237082 -84990 200146 -25862 -169163 271639 303082 100627 214992 194340 336246
10254 336246 -123408 36016 392187 87459 -171603 -251514 -50524 169430 331449 19041
10243 -24097 -9146 276975 87209 87259 151753 -553596 -3409 -270129 1777 33712 55976 99669
10231 99669 61875 -362554 -91445 -181965 -277503 -132548 -29182 -288017 -147743 -87698 -260377
10220 -260377 -153372 43984 240464 55513 -387944 -340500 -180197 51910 -18060 -233258
10210 -233258 -463797 -202631 -345060 -10241 -486548 14691 216679 184186 85911 86341 120068
$$ packed form
10287B76966b57902B01600k203p5233j5165c64544a735o3506m9143r2149c3355
10275A25127k5760b57290m8569E46985A90064a5025C2805d15877A64633b42099
10264B37082h4990B00146b5862j43301B71639L1443A00627J14365k0652J41906
10254C36246a23408C6016L56171H7459a71603p9911e0524A69430J62019A9041
10243b4097i146B76975H7209N0O4494e53596c409k66720A777L1935K2264M3693
10231I9669l7794c62554i1445r0520r5538a32548b9182k58835J40274O0045j72679
10220b60377J07005D3984J96480E5513c87944M7444J60303E1910a8060k15198
10210b33258k30539b02631j42429a0241m76307A4691K01988l2493H5911M30L3727
$$ plain form
10199 120068 117666 160160 -211640 14444 118829 -360412 -96191 -195512 -49838 85005 139333
10188 139333 24856 218476 106373 277435 129533 525931 -223066 -168339 123132 56016
10177 -43753 -351626 129128 -58253 -106497 121429 90699 -363223 -246930 -290845 -32399 -27637
10166 -27637 -80994 52255 -248858 171926 -57579 103061 61918 -29787 -52493 -63392 151067
10154 266460 3969 -398983 -239131 -77897 -104511 -201362 -168586 -115157 -175118 189966 -227659
10142 -122263 67348 -11497 50421 -29407 -126545 4228 -387577 422086 -84136 -81185 -243768
10131 -243768 -48161 -19282 -156986 -107468 242831 241387 -205388 -15830 -448881 -156103 -222291
10120 -222291 235815 -268996 -166206 -43837 -430896 57803 -28615 -21331 76155 243239 -3781
$$ packed form
10199A20068k402M2494b11640A4444J04385c60412i6191r9321d9838H5005N4328
10188A39333B4856J93620A06373J71062A29533L96398b23066N4727A23132E6016
10177d3753l07873A29128e8253m8244A21429l0730c63223J16293m3915c2399M762
10166b7637n3357E2255b48858A71926e7579A03061m1143b9787k2706j0899A51067
10154B66460C969c98983J59852g7897k6614r6851L2776N3429n9961A89966b27659
10142a22263F7348a1497E0421b9407r7138D228c87577D22086h4136K951j62583
10131b43768d8161a9282j37704M9518B42831j444b05388a5830m33051a56103o6188
10120b22291B35815b68996J02790d3837l87059E7803b8615P284G6155J67084c781
$$ plain form
10108 -36268 42001 -146102 155320 -111314 -362489 338218 329206 -138940 -120603 10855 -132911
10096 102705 -119168 149550 -108219 -155264 112031 -387051 147430 465182 55207 -116129
10085 75763 -297315 -201414 217545 -120585 22721 -200527 -38986 217644 -129152 -102511
10075 -102511 -100601 -23584 25326 -120217 -152121 7768 -181893 -103953 -40116 -219298 -152420
10064 -152420 463709 21918 -132333 -240810 -79708 162365 -283336 -274562 90357 239769
10054 239769 -10353 -284829 -157887 -351645 75829 -108398 -120614 234363 28756 -175115
10043 -80638 151170 -136852 -35019 -267987 -176839 5677 228408 -21085 -75934 -68602 -85565
10032 -85565 -277618 -51610 103314 67490 -63977 -151472 -191999 51329 -93027 -82541 -531909
$$ packed form
10108c6268D2001a46102A55320a11314k51175C38218r012a38940J8337A0855a32911
10096A02705a19168A49550a08219m7045A12031c87051A47430L17752E5207a16129
10085G5763b97315R5901B17545a20585B2721b00527c8986B17644a29152K6641
10075a02511J910b3584B5326a20217l1904G768a81893P7940d0116j79182O6878
10064a52420D63709B1918a32333j08477g9708A62365b83336Q774I0357J49412
10054B39769a0353k74476J26942j93758G5829a08398j2216B34363B8756a75115
10043h0638A51170a36852c5019k32968R1148E677K22731b1085n4849P332j6963
10032h5565j92053e1610A03314l5824f3977q7495m0527E1329i3027J0486m49368
$$ plain form
10021 -531909 266103 -61942 -218728 53287 -12391 76886 244349 97597 151895 -58136 80637
10009 -270233 -118242 -127039 -174255 -405593 -33128 -51354 370705 143115 -116740 -88956 -108797
9998 -108797 -73435 -200972 -141902 -32188 -78158 -81571 -143729 -264590 -150951 -372068 -38802
9986 -215605 -404255 30222 51540 -28372 -259358 96687 -14376 -59025 151607 -118045 224006
9974 -76192 -9308 -94207 -164474 -22832 -188131 207423 -80536 -9328 -339407 -163432 29176
9962 -475190 96403 -301240 -90635 -183566 -3283 16010 -166719 -199320 -119139 61300 -352721
9950 -147766 195408 176064 43322 -1971 -170305 -281424 -90688 136364 -7740 -180179 -30794
9938 337309 -74909 92368 -138026 -445019 -32709 -23014 984 -120058 -90651 -6994 -72027 141936
$$ packed form
10021e31909B66103f1942j56786E3287a2391G6886J67463I7597N4298e8136H0637
10009b70233a18242q797m7216k31338c3128j8226C70705A43115a16740K7784j9841
9998a08797L5362j27537N9070c2188m5970l413o2158j20861J13639k21117c8802
9986b15605j88650C0222K1318b8372k30986I6687a4376m4649A51607a18045B24006
9974g6192i308q4899p0267b2832j65299B07423h0536i328l30079a63432B9176
9962d75190I6403c01240i0635r2931c283A6010a66719l2601Q0181F1300c52721
9950a47766A95408j9344D3322a971j68334j11119i0688A36364g740j72439c0794
9938C37309g4909I2368a38026l06993c2709R695I84a20058K9407f994o5033A41936
$$ plain form
9925 -124991 170221 -143956 291022 78707 -165353 42446 27001 -112363 -252716 -89563
9914 353106 71179 57780 -47646 -235395 31271 -6916 64078 -131631 61781 -141597 88296
9902 -36354 -169802 -74087 -119011 -101540 25416 -245338 -197687 -219273 96423 -93541 -404 -49547
9890 -49547 -249392 24783 -110581 -43245 -206039 -404267 31367 -21848 -521714 6630 291471
9879 291471 -286867 -133674 -49572 -255003 -225555 -190853 71187 13024 -111695 -329775 109816
9867 85246 11140 -121786 126763 -155059 -204687 99829 10968 -150608 -116481 107148 -107499
9855 -357616 -241583 153895 22308 -145244 134208 -81528 -479221 -317081 27667 -180337
9844 -55178 190874 154572 186070 -129021 -21502 63766 12636 72569 283067 -261395 -74329
$$ packed form
9925a24991A70221a43956B91022G8707a65353D2446j5445a12363j40353h9563
9914C53106G1179j3399d7646j87749C1271f916F4078a31631F1781a41597H8296
9902c6354j33448g4087m4924J7471B5416b45338M7651k1586I6423i3541d04m9143
9890d9547j99845B4783a10581d3245j62794j98228C1367b1848m99866F630K84841
9879B91471b86867a33674d9572k05431K9448L4702G1187A3024a11695k18080A09816
9867H5246A1140a21786A26763a55059m9628I9829A0968a50608L4127A07148a07499
9855c57616J16033A53895B2308a45244A34208h1528l97693J62140B7667a80337
9844e5178A90874l6302L1498a29021b1502F3766A2636N9933K10498b61395g4329
$$ plain form
9832 -107301 -327469 4252 -123865 177219 -67943 -323370 4244 -104022 -18997 -98071 -209395
9821 -209395 234340 26566 -216634 -253523 123920 165753 -383102 -330358 11630 -157444 160282
9809 -272802 11180 -21397 -219998 40044 -37702 241595 -124540 -299346 98357 -78536 28780
9797 -38987 120452 -404655 -162540 232312 -133450 -211481 -76587 425438 -262337 -230742
9787 -230742 -76304 -231815 -126167 -119883 192853 -27345 91135 -309140 -411861 -243033 -803
9775 3065 10077 -184550 -122147 -229045 -60789 -254842 121860 50428 -307930 -55014 -332884
9764 -332884 182324 -238900 -195388 -89612 -351331 376048 -169902 -30352 32118 -51986 3023
9752 87758 -235834 -37740 -122501 -362566 -160654 -297916 -138251 146043 300021 -453852
$$ packed form
9832a07301k20168D252a23865A77219f7943k55427D244a04022a8997p9074j11324
9821b09395B34340B6566b16634l6889A23920M1833c83102N2744A1630a57444A60282
9809b72802A1180b1397j98601D0044c7702B41595a24540j74806I8357g8536B8780
9797c8987A20452d04655a62540B32312a33450p8031g6587D25438b62337L1595
9787b30742g6304j55511J05648O284A92853b7345I1135c09140j02721J68828h03
9775C065P012a84550O2403j06898f0789j94053A21860E0428c07930e5014k77870
9764c32884A82324b38900M3512h9612k61719C76048a69902c0352C2118e1986C023
9752H7758b35834c7740q4761k40065a60654j37262a38251A46043J53978d53852
$$ plain form
9741 -461566 -55146 -153672 52772 -28281 -102532 -245841 -219655 185928 -195550 -145601 -245322
9730 -245322 104566 -58099 -146162 197214 20646 -355230 -117956 -317785 82613 -383687
9719 -63973 -258642 131743 40006 -48044 -344316 -6255 3882 -226947 -445901 -181057 138015
9707 100796 164019 91790 300049 127896 -62606 187038 -4169 -182624 -76401 93289 -217660
9695 -95565 -106615 306547 -89294 -29069 -103680 -95096 144195 134840 154899 258320 58256 99967
9683 99967 117545 43108 -67073 -174866 -221229 97780 -7054 -150167 -35707 -104498 -387846
9672 -387846 -40756 115435 -241110 11704 -222036 103978 128025 -194549 31205 -11989 220450
9660 70401 1097 -252134 -62092 -82676 -126761 -188758 257127 -267895 147319 -463 90333 11366
$$ packed form
9741d61566e5146r8526E2772b8281p4251j43309K6186A85928a95550M9949r9721
9730b45322A04566e8099q8063A97214B0646c55230a17956j99829H2613c83687
9719f3973j94669A31743D0006d8044k96272f255C882b26947k18954a81057A38015
9707A00796O3223p2229K08259A27896f2606A87038d169j78455g6401I3289b17660
9695i5565j1050C06547h9294b9069p4611Q584A44195r355K0059J03421E8256M1711
9683I9967J7578D3108f7073j07793m6363I7780g054j43113c5707o8791k83348
9672c87846d0756A15435b41110A1704b22036A03978K4047a94549C1205a1989B20450
9660G0401A097b52134f2092k0584m4085o1997B57127b67895A47319d63I0333A1366
$$ plain form
9647 -125122 153322 267381 -5722 -51290 -449825 217579 16649 -117739 -146747 -208478 -77233
9635 -177876 -33822 -190259 209139 -28483 -208688 51384 27064 19288 -125756 22950 32459
9624 32459 -270236 -199149 182189 -133492 -21959 109289 -293103 -60560 -171299 -269805 299280
9612 -81109 -48119 237307 -40288 -120353 128948 -130953 -193388 138994 198219 344850 -52723
9600 -101680 -307437 -3363 89840 -34687 5080 -332583 -77953 -256286 -228288 -47496 -143774
9589 -143774 -60835 -150445 -79987 -140754 17171 140922 -239938 -2454 130669 -20673 -78077
9578 -78077 26777 -326752 -229366 13342 -329422 -75724 48727 -308013 -262629 107378 -53156
9566 -103710 -197376 132617 -82039 -245209 -31446 -137271 243508 11211 -60022 -480749 -34865
$$ packed form
9647a25122A53322J14059e722m5568l98535B17579A6649a17739k9008o1731g7233
9635a77876c3822j56437B09139b8483j80205E1384k4320p776a25756B2950R509
9624C2459b70236P1087A82189a33492b1959A09289b93103f0560j10739r8506B99280
9612h1109L2990B37307d0288q0065A28948a30953o2435A38994N9225J46631e2723
9600a01680k05757c363H9840c4687E080c32583g7953j78333K7998d7496r6278
9589a43774f0835q9610P0458o0767A7171J23751b39938b454A30669b0673n7404
9578g8077B6777c26752R7386A3342c29422g5724D8727c08013M5384A07378e3156
9566a03710r3666A32617h2039j63170c1446j05825B43508A1211f0022m20727c4865
$$ plain form
9554 -51487 -28308 -178157 171952 -180839 -333755 -19573 -124685 152391 -280060 -281381 44449
9542 -219565 -123287 -151855 -174826 -238211 -213910 -114602 158379 205914 -351775 31942 -15880
9530 97360 74085 -86878 22992 55319 66353 13638 -80943 98310 -30813 -339519 -13506 107099
9517 -158768 -236071 -134789 -161743 41929 32414 -60840 373857 -291686 -73170 -247944 -306113
9506 -306113 121012 -292305 -72263 85854 -363057 162326 -114652 -142769 69414 52212 92622
9495 92622 93633 -325 -204737 27608 -266844 -210964 -508212 -55623 -80548 -190704 -203520 31000
9482 9549 -216475 -8374 340389 85630 47226 125675 -12918 -9871 -224431 -372013 -115261
9470 104757 178006 -69883 179249 260429 -92163 -1357 -34530 36972 -231076 -21569 136458
$$ packed form
9554e1487K3179j49849A71952a80839j52916a9573j05112A52391b80060j321D4449
9542b19565R6278k8568k2971o3385K4301R9308A58379M7535c51775C1942a5880
9530I7360k3275h6878B2992L2327J1034A3638h0943I8310c0813l08706a3506A07099
9517a58768p7303J01282k6954D1929r515f0840C73857b91686g3170j74774n8169
9506c06113A21012b92305g2263H5854c63057A62326a14652k8117F9414j7202M0410
9495I2622J011c25k04412B7608b66844N5880k97248e5623k4925j10156j2816C1000
9482I549b16475h374C40389H5630l8404P8449a2918L047k14560j47582a15261
9470A04757P3249f9883A79249Q1180i2163a357l3173C6972b31076b1569A36458
$$ plain form
9458 -58625 -108268 -220912 70370 -103206 158880 84820 229885 -141962 -25120 -416504 -213138
9447 -213138 -169101 -72597 40336 106901 -207685 212889 91752 -306805 71407 -123073 -169159
9436 -169159 -270815 28211 -305634 120241 -6737 -219554 75982 -75712 478131 -374765 50537
9424 -155777 214731 80339 48218 74620 -137340 78023 28762 -46911 -281406 99793 -33705
9412 -182925 -111046 196156 -275871 -267242 396467 -4262 38038 -144398 6732 -40987 57438
9400 -177826 22300 -172271 295405 237510 -130692 126020 348252 14880 46084 -132126
9389 -377966 -98913 76763 132599 485161 -13702 131340 -373104 -46807 -31845 155902 373953
9378 373953 -142651 -152938 56513 -15774 210305 -337931 280795 -155165 -436694 -260730
$$ packed form
9458e8625m9643j12644G0370a03206A58880p4060J45065a41962b5120l91384K03366
9447b13138M4037g2597D0336O6565b07685B12889I1752c06805G1407a23073m6086
9436a69159j01656B8211c05634A20241f737k12817G5982g5712D78131c74765E0537
9424a55777B14731H0339l2121K6402a37340G8023B8762d6911k34495I9793c3705
9412a82925P1879A96156b75871Q629C96467d262C8038a44398F732d0987E7438
9400a77826B2300a72271B95405n7895a30692A26020K22232A4880L1204a32126
9389c77966i8913G6763N5836L52562a3702A31340c73104d6807J4962A55902K18051
9378C73953a42651j0287E6513a5774B10305c37931B80795a55165k81529J75964
$$ plain form
9368 -260730 -204407 -136883 63484 -56134 -11705 5360 -150596 -9180 101471 -122625 40982
9356 124418 185548 306139 -93818 -166282 -140049 72495 54946 -422985 -342371 33536 -174105
9344 -93413 -169837 88201 19547 96357 -165948 21980 75666 79399 281300 -259275 -211472
9333 -211472 -117245 -165223 104507 -369146 -13867 -314266 149515 -92262 205004 -236736
9322 99162 -141433 222998 95165 -520025 -44561 -214077 -15696 -159328 89351 -48845 -132853
9311 -132853 -127202 -153515 -47394 -140171 191602 -222376 -46533 -152489 -154841 -5545 833 -71691
9298 12193 -149360 -117765 188306 -171849 -61415 128039 -270927 -174090 -68735 171355 -229974
9286 -201770 24891 -15899 -396402 -284718 -57630 -347587 2284 -51673 103726 162913 -176313
$$ packed form
9368b60730N6323O7524F3484e6134a1705E360a50596i180A01471a22625D0982
9356A24418O1130J20591i3818p2464K6233G2495j7549d22985Q0614C3536a74105
9344i3413p6424H8201A9547P6810a65948B1980N3686L733K01901b59275M7803
9333b11472R4227m7978A04507c69146a3867l00399A49515i2262B05004b36736
9322I9162a41433B22998I5165e20025d4561j69516a5696j43632H9351d8845q4008
9311a32853N651k6313d7394r2777A91602b22376d6533j05956k352e545H33g1691
9298A2193a49360L1595A88306a71849f1415A28039b70927R6837f8735A71355b29974
9286b01770B4891a5899l80503J11684e7630k89957B284e1673A03726N9187a76313
$$ plain form
9274 50854 -42878 46133 -148983 -124660 70474 -189581 84312 116511 219472 -504389 -7817
9262 -193546 173434 2692 313174 51687 -86404 -331754 356596 62243 -27925 -143745 -96916
9251 -96916 -85470 122311 105402 -233686 102190 -119714 -254636 -321 -226524 -194599 -258017
9240 -258017 -83267 -321605 -94717 -183587 135128 6405 -19627 151911 10333 -35515 95902
9228 88279 -245419 85815 -208054 243812 33728 -188072 -42903 107433 260154 -174360
9217 -14885 -255151 -193626 -468792 63365 -178446 104040 -598 -168953 -111249 113490 -205488
9205 -58280 -253551 -194774 -99036 -134182 139099 198778 -163081 145548 -25801 510412 -59673
9193 189352 35637 -42206 105615 -85418 305404 151680 -15390 -39706 -103627 -5437 -395343
$$ packed form
9274E0854d2878D6133a48983K4323G0474a89581H4312L2199J02961e04389g817
9262a93546A73434B692L10482E1687h6404k45350C56596F2243b7925j15820M6829
9251i6916J1446A22311j6909b33686A02190a19714j34922c21k26203L1925o3418
9240b58017h3267k38338i4717q8870A35128F405a9627A51911A0333c5515I5902
9228H8279b45419H5815b08054B43812C3728a88072d2903A07433J52721a74360
9217a4885k40266O1525k75166F3365a78446A04040e98j68355N7704A13490b05488
9205e8280j95271N8777R5738l5146A39099N9679a63081A45548b5801E10412e9673
9193A89352C5637d2206A05615h5418C05404A51680a5390k4316o3921e437l89906
$$ plain form
9182 -395343 -77748 -138985 -150853 -46221 -168871 -389808 -39927 -156377 157549 171607 110674
9171 110674 17863 -148857 -145892 -240700 -470935 273435 4512 7039 -87949 59329 108944 190990
9159 190990 -120125 -50511 -162467 -77052 -30735 107076 -163538 -106489 44237 -227590 -140576
9148 -140576 -45770 -164218 51813 96181 114049 35879 -65228 -242284 -110803 -340328 -78432
9136 -44391 -146512 -19223 111590 98850 -92066 -157542 -231719 -306862 84896 96939 227325
9125 227325 -237563 56706 -110911 13165 -207830 317971 125068 56437 -292895 26575
9114 29745 90425 -434457 -150754 -340409 116941 75970 -69705 -182802 133114 -104480
9103 -8851 -270643 -224239 -118061 -452755 -63218 220953 -95087 141899 -29227 176191 2122
$$ packed form
9182c95343g7748o1237j1868d6221j22650k20937c9927j16450A57549J4058o0933
9171A10674A7863a48857K965r4808k30235B73435D512K527h7949E9329M9615Q2046
9159A90990a20125e0511j11956g7052c0735A07076a63538N7049D4237b27590Q7014
9148a40576d5770j18448E1813M4368J7868C5879f5228j77056a10803k29525g8432
9136d4391j02121a9223A11590j2740i2066o5476p4177p5143H4896J2043J30386
9125B27325b37563E6706a10911A3165b07830C17971A25068E6437b92895B6575
9114B9745O0680d34457a50754j89655A16941m0971f9705j13097A33114a04480
9103h851k61792M6404J06178l34694f3218B20953i5087A41899b9227A76191B122
$$ plain form
9091 254820 -15924 -56228 -102495 -129581 -18483 -132876 -349935 -151442 -101395 -77102 200042
9079 -95425 -228288 -67718 131086 134055 365 227351 110306 -133320 -251198 294196 14159
9067 -91699 -305646 62308 -179805 -163961 -249127 52197 -28462 -73922 -8654 124995 -354444
9055 -199476 53209 -13851 57981 -82578 10815 12231 -68448 127788 -371136 13207 -218344
9043 443351 188526 -50456 85555 -82276 -50250 19032 -400779 37073 66114 -283337 -166578
9032 -166578 111787 -136864 15420 -254139 47488 -84093 92228 -2148 -34644 -310261 163834
9020 -86710 288804 -26053 -533983 -88982 -353795 -62673 140108 -560639 233427 -140609
9009 168969 72995 -277815 4065 -32671 -123614 -39813 -3605 -147877 -201514 144611 126348
$$ packed form
9091B54820a5924m0304m6267k7086a8483j14393k17059a51442N0047K4293B00042
9079i5425j32863f7718A31086K969C65K26986A10306a33320j17878B94196A4159
9067i1699k13947F2308a79805J5844q5166E2197b8462m5460h654A24995c54444
9055a99476E3209a3851E7981h2578A0815J416f8448A27788c71136A3207b18344
9043D43351A88526e0456H5555h2276L2026A9032d00779C7073K9041b83337J16759
9032a66578A11787a36864A5420b54139D7488h4093I2228b148l2496k75617A63834
9020h6710B88804b6053n07930h8982k64813f2673A40108e60639B33427a40609
9009A68969G2995b77815D065c2671r0943c9813c605j44272n3637A44611j8263
$$ plain form
8998 126348 -122433 -77203 243388 -221893 177268 -183148 109336 -126831 47314 -57880
8987 -250036 -93836 146865 179186 226225 19228 159668 -55201 79779 57240 48301 -95464
8975 118802 -259917 -46554 -120228 -121168 126468 -236584 -49912 61156 10648 -326358 -139050
8963 20177 40348 -10113 -82288 -27302 -37699 44934 -341992 -87165 73696 4434 82633 -15592
8950 -285135 224593 173400 -104663 -195499 -81586 -36269 146326 256627 -141840 -117299 48509
8938 51202 -35280 -216515 66099 -519331 -246980 113176 -95940 -40920 -310652 -78634 -351268
8927 -351268 127728 -44035 142768 158942 289990 427469 978365 173736 91253 144445
8917 144445 28449 71313 -192971 -141896 -86733 -187029 -190724 -295787 -137228 -159290 -24673
$$ packed form
8998A26348a22433M5230B43388b21893A77268a83148A09336a26831D7314e7880
8987b50036i3836A46865L2321M7039A9228J40440e5201G9779k2539q939i5464
8975A18802b59917d6554p3674r40A26468b36584d9912F1156A0648c26358a39050
8963B0177K0171a0113p2175b7302j0397D4934c41992h7165G3696D434P8199a5592
8950b85135B24593n1193a04663r0836h1586c6269A46326J10301a41840K4541D8509
8938E1202c5280j81235F6099e19331b46980A13176i5940d0920k69732g8634k72634
8927c51268A27728d4035A42768J6174J31048J37479N50896A73736q2483N3192
8917A44445B8449M2864a92971N1075N5163j00296l695j05063a37228k2062b4673
$$ plain form
8905 -256481 16903 -163731 6369 -205167 -150643 -354247 -34885 66150 -370753 199915 -88597
8893 43885 -60172 223509 231312 -238432 123711 -19068 -495054 50595 -101944 -119566 188661
8881 145777 86976 217296 -345363 -163013 270357 -202833 -41083 -26915 -7625 317716 -137198
8869 -66935 -185197 -117465 -122926 -195072 -13323 -195127 66748 197203 82116 -410992 -159811
8857 -231122 -163871 -290936 -27644 62084 136539 -25008 -137040 21340 -95910 -284323 -317694
$$ packed form
8905b56481A6903a63731F369b05167N4524k03604c4885F6150c70753A99915h8597
8893D3885f0172B23509P803b38432A23711a9068m75986E0595a01944j7622A88661
8881A45777n8801J30320c45363a63013B70357b02833d1083J4168g625C17716a37198
8869f6935j18262O7732n461p2146a3323j81804F6748J30455H2116d10992a59811
8857b31122O7251j27065b7644F2084P4455b5008j12032B1340i5910j88413l3371
$$ [...]
##END NTUPLES=NMR SPECTRUM
##END=
