##TITLE=AC1460_TOLI013266_8026534_Pm2D3dMUwm
##JCAMPDX= 6.0         $$ Bruker NMR JCAMP-DX V2.0
##DATA TYPE= NMR SPECTRUM
##DATA CLASS= NTUPLES
##ORIGIN= BRUKER
##OWNER= Administrator
$$ 1.72 TOPSPIN		Version 2.1
$$ 2013-07-11 17:25:46.419 -0700  Administrator@X
$$ Compression mode = diff/dup
##.OBSERVE FREQUENCY= 400.02188249412
##.OBSERVE NUCLEUS= ^1H
##.ACQUISITION MODE= SIMULTANEOUS (DQD)
##.ACQUISITION SCHEME= undefined
##.AVERAGES= 64
##.DIGITISER RES= 22
##SPECTROMETER/DATA SYSTEM= spect
##.PULSE SEQUENCE= noesygpps1d.comp
##.SOLVENT NAME= COFFEE_meoh
##.SHIFT REFERENCE= INTERNAL, COFFEE_meoh, 1, 14.96096
##AUDIT TRAIL= $$ (NUMBER, WHEN, WHO, WHERE, PROCESS, VERSION, WHAT)
$$ ##TITLE= Audit trail, TOPSPIN		Version 2.1
$$ ##JCAMPDX= 5.01
$$ ##ORIGIN= Bruker BioSpin GmbH
$$ ##OWNER= Administrator
$$ $$ E:\/data/COFFEE/nmr/AC1460_TOLI013266_8026534_Pm2D3dMUwm/12/pdata/1/auditp.txt
$$ ##AUDIT TRAIL=  $$ (NUMBER, WHEN, WHO, WHERE, PROCESS, VERSION, WHAT)
(   1,<2013-07-11 17:25:41.294 -0700>,<Administrator>,<X>,<go>,<TOPSPIN 2.1>,
      <created by zg
	started at 2013-07-11 17:14:11.216 -0700,
	POWCHK enabled, PULCHK disabled,
       configuration hash MD5:
       C8 4E 4E 5D D3 5C D8 9E 9F 52 82 E0 59 8A DE 15
       data hash MD5: 64K
       B7 29 BA 40 73 33 5F E3 68 94 90 C1 58 90 71 5C>)
(   2,<2013-07-11 17:25:44.341 -0700>,<Administrator>,<X>,<proc1d>,<TOPSPIN 2.1>,
      <Start of raw data processing
       efp LB = 0.3 FT_mod = 6 PKNL = 1 PHC0 = 0 PHC1 = 0 SI = 128K 
       data hash MD5: 128K
       7A C8 3C AF 36 F4 46 47 53 4F B4 27 34 27 81 B4>)
(   3,<2013-07-11 17:25:45.341 -0700>,<Administrator>,<X>,<proc1d>,<TOPSPIN 2.1>,
      <pk PHC0 = -79.88159 PHC1 = 0 
       data hash MD5: 128K
       93 B0 FE F7 87 05 F8 37 BE B9 F5 05 EB 52 08 8B>)
(   4,<2013-07-11 17:25:45.778 -0700>,<Administrator>,<X>,<proc1d>,<TOPSPIN 2.1>,
      <abs ABSG = 1 
       data hash MD5: 128K
       91 2F 26 D8 50 F9 8B 20 15 C5 E0 E2 35 08 CB A6>)
(   5,<2013-07-11 17:25:45.950 -0700>,<Administrator>,<X>,<proc1d>,<TOPSPIN 2.1>,
      <abs ABSG = 2 
       data hash MD5: 128K
       7A 12 63 7F C2 7A 2F 33 7F ED 44 18 02 D3 35 98>)
(   6,<2013-07-11 17:25:46.012 -0700>,<Administrator>,<X>,<proc1d>,<TOPSPIN 2.1>,
      <abs ABSG = 3 
       data hash MD5: 128K
       59 AD ED BC 0A A9 C0 F6 89 84 45 E4 1B 6F BA 82>)
(   7,<2013-07-11 17:25:46.091 -0700>,<Administrator>,<X>,<proc1d>,<TOPSPIN 2.1>,
      <abs ABSG = 4 
       data hash MD5: 128K
       A6 5F CB C1 B3 15 80 67 69 79 77 25 77 C8 49 AA>)
(   8,<2013-07-11 17:25:46.200 -0700>,<Administrator>,<X>,<proc1d>,<TOPSPIN 2.1>,
      <abs ABSG = 5 
       data hash MD5: 128K
       23 04 26 EB FC FB 1B A7 54 59 36 6B 4B 37 CB 02>)
$$ ##END=
$$ 
$$ $$ hash MD5
$$ $$ FA 33 3D E3 AE 25 4C AF 33 72 56 45 FF 25 B8 8D
##$RELAX= 
##$RELAX= 
##$RELAX= 
##$RELAX= 
##$RELAX= 
##$RELAX= 
##$RELAX= 
##$RELAX= 
$$ Bruker specific parameters
$$ --------------------------
##$DU= <E:\>
##$EXPNO= 12
$$ [...]
150 150 150 150 150 150 150 150
##$TP07= 0
##$TPNAME0= <>
##$TPNAME1= <>
##$TPNAME2= <>
##$TPNAME3= <>
##$TPNAME4= <>
##$TPNAME5= <>
##$TPNAME6= <>
##$TPNAME7= <>
##$TPOAL= (0..7)
0.5 0.5 0.5 0.5 0.5 0.5 0.5 0.5
##$TPOFFS= (0..7)
0 0 0 0 0 0 0 0
##$TUNHIN= 0
##$TUNHOUT= 0
##$TUNXOUT= 0
##$USERA1= <user>
##$USERA2= <user>
##$USERA3= <user>
##$USERA4= <user>
##$USERA5= <user>
##$V9= 5
##$VALIST= <valist>
##$VCLIST= <CCCCCCCCCCCCCCC>
##$VD= 0
##$VDLIST= <DDDDDDDDDDDDDDD>
##$VPLIST= <PPPPPPPPPPPPPPP>
##$VTLIST= <TTTTTTTTTTTTTTT>
##$WBST= 1024
##$WBSW= 4
##$XGAIN= (0..3)
0 0 0 0
##$XL= 0
##$YL= 0
##$YMAX_a= 6228703
##$YMIN_a= -12392287
##$ZGOPTNS= <>
##$ZL1= 120
##$ZL2= 120
##$ZL3= 120
##$ZL4= 120
##$ABSF1= 14.96096
##$ABSF2= -5.597221
##$ABSG= 5
##$ABSL= 3
##$ALPHA= 0
##$AQORDER= 0
##$ASSFAC= 0
##$ASSFACI= 0
##$ASSFACX= 0
##$ASSWID= 0
##$AUNMP= <proc_prof1d_extract.lims>
##$AXLEFT= 0
##$AXNAME= <>
##$AXNUC= <1H>
##$AXRIGHT= 0
##$AXTYPE= 0
##$AXUNIT= <>
##$AZFE= 0.1
##$AZFW= 0.1
##$BCFW= 0
##$BC_mod= 0
##$BYTORDP= 0
##$COROFFS= 0
##$CY= 15
##$DATMOD= 1
##$DC= 0
##$DFILT= <>
##$DTYPP= 0
##$F1P= 0
##$F2P= 0
##$FCOR= 0.5
##$FTSIZE= 131072
##$FT_mod= 6
##$GAMMA= 0
##$GB= 0
##$INTBC= 1
##$INTSCL= 1
##$ISEN= 128
##$LB= 0.3
##$LEV0= 0
##$LPBIN= 0
##$MAXI= 10000
##$MC2= 0
##$MEAN= 0
##$ME_mod= 0
##$MI= 0
##$NCOEF= 0
##$NC_proc= -2
##$NLEV= 6
##$NOISF1= 0
##$NOISF2= 0
##$NSP= 0
##$NTH_PI= 0
##$NZP= 0
##$OFFSET= 14.96096
##$PC= 1
##$PHC0= -79.88159
##$PHC1= 0
##$PH_mod= 1
##$PKNL= yes
##$PPARMOD= 0
##$PPDIAG= 0
##$PPIPTYP= 0
##$PPMPNUM= 2147483647
##$PPRESOL= 1
##$PSCAL= 4
##$PSIGN= 0
##$PYNMP= <proc.py>
##$REVERSE= no
##$SF= 400.02000965389
##$SI= 131072
##$SIGF1= 0
##$SIGF2= 0
##$SINO= 400
##$SIOLD= 131072
##$SPECTYP= <>
##$SREGLST= <1H.CDCl3>
##$SSB= 0
##$STSI= 131072
##$STSR= 0
##$SW_p= 8223.68421052631
##$SYMM= 0
##$S_DEV= 0
##$TDeff= 65536
##$TDoff= 0
##$TI= <>
##$TILT= no
##$TM1= 0
##$TM2= 0
##$TOPLEV= 0
##$USERP1= <user>
##$USERP2= <user>
##$USERP3= <user>
##$USERP4= <user>
##$USERP5= <user>
##$WDW= 1
##$XDIM= 131072
##$YMAX_p= 437239541
##$YMIN_p= -16739
##$CURPLOT= <Network HP LaserJet P1505>
##$CURPRIN= <$Network HP LaserJet P1505>
##$DFORMAT= <normdp>
##$LAYOUT= <+/1D_H.xwp>
##$LFORMAT= <normlp>
##$PFORMAT= <normpl>
##$SURQMSG= 1
$$ End of Bruker specific parameters
$$ ---------------------------------
##NTUPLES= NMR SPECTRUM
##VAR_NAME=  FREQUENCY,     SPECTRUM/REAL,   SPECTRUM/IMAG
##SYMBOL=    X,             R,               I
##VAR_TYPE=  INDEPENDENT,   DEPENDENT,       DEPENDENT
##VAR_FORM=  AFFN,          ASDF,            ASDF
##VAR_DIM=   131072,        131072,          131072
##UNITS=     HZ,            ARBITRARY UNITS, ARBITRARY UNITS
##FACTOR=    0.0627417313425164, 1,          1
##FIRST=     8223.62146879497, 912,          -54868
##LAST=      0,             2866,            -55480
##MIN=       0,             -16739,          0
##MAX=       8223.62146879497, 437239541,    0
$$ Real data points
##PAGE= N=1
##DATA TABLE= (X++(R..R)), XYDATA
$$ [...]
61730D50276m95o1N38J020J087Q07O47Q65J151J212J398K208L412M134L862K987
61714D75048K283K174K441K388J437k44j785k541k683k694k705k746l130l959
61700D63284m619m490l932l809m224m516m332l897l323k580k142k605l575l927
61686D11313l417l061l496m027l874l426l474l859l757k898j760q47l59l40o29
61671C72089q56q61q44q75o10R2P38Q82Q39J230K052K718K831K487J935J393J090
61654C86330J098J205J153R77R06J043J269J372J263J221J765K921L836L707K962
61639D13028K729L143L085J878K85o61r31j094j360j736k457l540m428m749m921
61624C98271n301n341m432l061k222k013j681q46J61R72J396J146J27j081j718
$$ y = [450276, 449781, 449720, 450258, 451278, 452365, 453172, 453819, 454684, 455835, 457047, 458445, 460653, 464065, 468199, 472061, 475048, 477331, 479505, 481946, 484334, 485771, 485527, 483742, 481201, 478518, 475824, 473119, 470373, 467243, 463284, 458665, 454175, 450243, 446434, 442210, 437694, 433362, 429465, 426142, 423562, 421420, 418815, 415240, 411313, 407896, 404835, 401339, 397312, 393438, 390012, 386538, 382679, 378922, 376024, 374264, 373417, 373058, 372718, 372089, 371233, 370372, 369528, 368653, 368043, 368135, 368873, 369755, 370594, 371824, 373876, 376594, 379425, 381912, 383847, 385240, 386330, 387428, 388633, 389786, 390763, 391669, 392712, 393981, 395353, 396616, 397837, 399602, 402523, 406359, 410066, 413028, 415757, 418900, 421985, 423863, 424148, 423487, 422556, 421462, 420102, 418366, 415909, 412369, 407941, 403192, 398271, 392970, 387629, 383197, 380136, 377914, 375901, 374220, 373374, 373535, 374507, 375903, 377049, 377176, 376095, 374377]
61609C74377j757j786k125k676l365m057m308l905l468l713m334m411l767l025
61595C27680k542k191k140k713l429l260k169j366j617k170j926r58k31k92q60
61580B99816j347j326p08Q9L84j11r60j465j292n76K94Q88J043J053J247J438
61564B98467J104K18o54j039q92k35R85K362K995K413J208M27M81R42J145Q14
61548C10741K28o3K28Q41J354J690J913J767R75Jk66K78O93L19l59n86m43m31
61530C18880m46pO96Q41J71n76o87m01l93p75j091j180j443k104k600k217j098
61513C05570k12j67m68k21P12J624J848J363O10jk61j88M4K80N25P59P28K32l87
61494C12390m32L46J358J854J751J616J873K380K745K839K747K434J800J115J020
$$ y = [374377, 372620, 370834, 368709, 366033, 362668, 358611, 354303, 350398, 346930, 343217, 338883, 334472, 330705, 327680, 325138, 322947, 320807, 318094, 314665, 311405, 309236, 307870, 306253, 304083, 302157, 301199, 300968, 300676, 299816, 298469, 297143, 296435, 296524, 296908, 296797, 295837, 294372, 293080, 292504, 292798, 293686, 294729, 295782, 297029, 298467, 299571, 299789, 299135, 298096, 297204, 296969, 297954, 300316, 303311, 305724, 306932, 307359, 307840, 308782, 309927, 310741, 310969, 310906, 311134, 311975, 313329, 315019, 316932, 318699, 319674, 319675, 319409, 319687, 320380, 320699, 320340, 319754, 319311, 318880, 318434, 318427, 319123, 319964, 320135, 319559, 318872, 318471, 318078, 317303, 316212, 315032, 313589, 311485, 308885, 306668, 305570, 305358, 305191, 304723, 304502, 305214, 306838, 308686, 310049, 310659, 310658, 310397, 310209, 310253, 310533, 311058, 311817, 312545, 312777, 312390, 311958, 312304, 313662, 315516, 317267, 318883, 320756, 323136, 325881, 328720, 331467, 333901, 335701, 336816, 337836]
61479C37836J723K481K290J065k34p20m37k7K1l98j089j585j345k82J034J820
61463C42153J655O18q08j890k114j648j113p94n22k92l79o96p22l30m8j17l9N28
61445C33442J106J199J089J165J175Q50P21J361K355K854K765K523K100J295O16
61430C56616Q03J595K008J758J490J621J904K134K349K331J815J220J344K180
61416C81168K840K750K119J258K52o15r86j036j227j464j279q57q78j372j688
61401C78985j653j684j722j212l67k37j103j894j720r71m32k57l26o36p95r6J276
61384C65156K074J685J081J359K234K752K736K662K716K823L055L303L076K362
61370C99074J998K470K995K680J986K009K753L193K837K241J956J827J512J033
$$ y = [337836, 339559, 342040, 344330, 345395, 345161, 344441, 344004, 343977, 343998, 343600, 342511, 340926, 339581, 339299, 340333, 342153, 343808, 344426, 343618, 341728, 339614, 337966, 336853, 336059, 335537, 335245, 334866, 334170, 333448, 333118, 333070, 332953, 332914, 333442, 334548, 335747, 336836, 338001, 339176, 340026, 340747, 342108, 344463, 347317, 350082, 352605, 354705, 356000, 356616, 357419, 359014, 361022, 362780, 364270, 365891, 367795, 369929, 372278, 374609, 376424, 377644, 378988, 381168, 384008, 386758, 388877, 390135, 390387, 389772, 388786, 387750, 386523, 385059, 383780, 382923, 382045, 380673, 378985, 377332, 375648, 373926, 372714, 372347, 372110, 371007, 369113, 367393, 366422, 365990, 365733, 365407, 364771, 363976, 363880, 365156, 367230, 368915, 369996, 371355, 373589, 376341, 379077, 381739, 384455, 387278, 390333, 393636, 396712, 399074, 401072, 403542, 406537, 409217, 411203, 413212, 415965, 419158, 421995, 424236, 426192, 428019, 429531, 430564]
61356D30564P11Q81J736L111M492N402N674N318M484L599L046K546J523K24k71
61341D73040L97J216J190O35L95N06N57O71J163J576J101k30j591k509l194l821
61325D71102m115l771k811j583n78k0M82J516K904L809L990M166M689M928M639
61310D89347M921O710R124J0598J1032J1511J2287J2482J1671J0385R000P250
61298F06318N114L091J356l84k067l193l765m462n560o490o762o635o572o658
61284E63331o844p121p230o722n595m417l548k779j854r20j71M68J069J501J681
61269E20849J731J718J522J146R31J352K684M711O599P347O785N914N811O403
61255E75503O700O053M635K909J248Oo42j009j584k410l201l860m458m791m541
$$ y = [430564, 431275, 432156, 433892, 437003, 441495, 446897, 452571, 457889, 462373, 465972, 469018, 471564, 473087, 473311, 473040, 473437, 474653, 475843, 476478, 476873, 477379, 477936, 478607, 479770, 481346, 482447, 482217, 480626, 478117, 474923, 471102, 466987, 463216, 460405, 458822, 458244, 458224, 458706, 460222, 463126, 466935, 470925, 475091, 479780, 484708, 489347, 494268, 500978, 510102, 520700, 531732, 543243, 555530, 568012, 579683, 590068, 599068, 606318, 611432, 614523, 615879, 615495, 613428, 610235, 606470, 602008, 596448, 589958, 583196, 576561, 569989, 563331, 556487, 549366, 542136, 535414, 529819, 525402, 521854, 519075, 517221, 516301, 516130, 516598, 517667, 519168, 520849, 522580, 524298, 525820, 526966, 527897, 529249, 531933, 536644, 543243, 550590, 557375, 563289, 569100, 575503, 582203, 588256, 592891, 595800, 597048, 597054, 596412, 595403, 593819, 591409, 588208, 584348, 579890, 575099, 570558]
61240E70558l812l086k735k857l326l592k952j580p03r99j382m81J217K063J848
61225E48181K105L561M952N001M269M089M598M954M903N069N856O865P446P328
61211F19177O633N658M623L618K859K807L715N054N892N942N865O384P534Q872
61197F94633J0040J0995J1973J3261J4683J5382J4542J2276R463O834M661L141
61185H21884K307J696P39m82j476k319l597n379p062q292r275j0060j0397j0474
61171G57813j0834j1361j1224j0308r708j0241j1277j1674j1296j0877j0919j1287
61159F26807j1501j0947r267o949n152m408l991k961j330K71J526K429K664J801
61145E78992o5k275m151n285n589n354n049m733m011k736j458p10k61N53J958
$$ y = [570558, 566746, 563660, 560925, 558068, 554742, 551150, 548198, 546618, 545915, 544916, 543534, 543053, 544270, 546333, 548181, 550286, 553847, 558799, 563800, 568069, 572158, 576756, 581710, 586613, 591682, 597538, 604403, 611849, 619177, 625810, 631468, 636091, 639709, 642568, 645375, 649090, 654144, 660036, 665978, 671843, 678227, 685761, 694633, 704673, 715668, 727641, 740902, 755585, 770967, 785509, 797785, 807248, 814082, 818743, 821884, 824191, 825887, 826626, 826144, 824668, 822349, 818752, 813373, 806311, 798019, 788744, 778684, 768287, 757813, 746979, 735618, 724394, 714086, 704378, 694137, 682860, 671186, 659890, 649013, 638094, 626807, 615306, 604359, 595092, 588143, 582991, 578583, 574592, 571631, 570301, 570572, 572098, 574527, 577191, 578992, 578927, 576652, 572501, 567216, 561627, 556273, 551224, 546491, 542480, 539744, 538286, 537576, 537315, 537868, 539826]
61130E39826L517M668N292N809O859Q634J0568J2026J3129J4424J5846J6804J7346
61117F74748J8339K0139K1886K2650K2585K2388K2245K1875K1201K0348J9277
61106I07681J7929J6431J4850J2993J0752Q291N677K740n04l776o942r952j2317
61093I63853j3505j4008j4968j6389j6911j5899j4592j4259j4290j3311j1274
61082H04447r213p507n765m031k798j971r61K70J250K072L426N612Q255J0949
61068H04035J3354J4909J5387J5595J6607J8287J9520J9923K0427K1904K4091
61057A004039K6059K7210K7639K7932K8746L0099L1214L1438L1030L0557K9933
61046A325896K8795K7387K6187K4917K2993K0704J8952J7900J6941J5897J5190
$$ y = [539826, 543343, 548011, 553303, 559112, 565971, 574605, 585173, 597199, 610328, 624752, 640598, 657402, 674748, 693087, 713226, 735112, 757762, 780347, 802735, 824980, 846855, 868056, 888404, 907681, 925610, 942041, 956891, 969884, 980636, 988927, 994604, 997344, 996840, 993064, 986122, 976170, 963853, 950348, 936340, 921372, 904983, 888072, 872173, 857581, 843322, 829032, 815721, 804447, 795234, 787727, 781962, 777931, 775133, 773162, 772201, 772471, 773721, 775793, 779219, 784831, 793086, 804035, 817389, 832298, 847685, 863280, 879887, 898174, 917694, 937617, 958044, 979948, 1004039, 1030098, 1057308, 1084947, 1112879, 1141625, 1171724, 1202938, 1234376, 1265406, 1295963, 1325896, 1354691, 1382078, 1408265, 1433182, 1456175, 1476879, 1495831, 1513731, 1530672, 1546569, 1561759]
61035A561759J4856J4533J4530J5701J8076K0570K2255K3007K2903K2239K2156
61024A772585K4029K8004L3342M0242M9676O1217P2927Q4014R5877J09850J26041
61013B497804J45558J71638K06709K50164L00899L60364M31267N15697O17477
61004E497577P43967R01567J091901J316145J574111J838683K023481J998768
60996A6986200J677535J106535M64964m2941l03583l18310j47944J29664M05688
60987A9957808N29613L69527q9519p13215j297724j691328j855035j835397j704159
60978A1670571j520847j325311j140294r74551q28729p01956n93570n01492m22745
60969C661076l55884l00908k56853k21315j92304j68934j50147j34294j20237
$$ y = [1561759, 1576615, 1591148, 1605678, 1621379, 1639455, 1660025, 1682280, 1705287, 1728190, 1750429, 1772585, 1796614, 1824618, 1857960, 1898202, 1947878, 2009095, 2082022, 2166036, 2261913, 2371763, 2497804, 2643362, 2815000, 3021709, 3271873, 3572772, 3933136, 4364403, 4880100, 5497577, 6241544, 7143111, 8235012, 9551157, 11125268, 12963951, 14987432, 16986200, 18663735, 19770270, 20235234, 20192293, 19888710, 19570400, 19422456, 19552120, 19957808, 20487421, 20856948, 20767429, 20054214, 18756490, 17065162, 15210127, 13374730, 11670571, 10149724, 8824413, 7684119, 6709568, 5880839, 5178883, 4585313, 4083821, 3661076, 3305192, 3004284, 2747431, 2526116, 2333812, 2164878, 2014731, 1880437, 1760200]
60960A760200j07704r6349q5527p5086o5342n6191m7390l9851l5177l3489l2947
60949A085147l2019l0969l0356k9353k6874k3564k1150k0210j9747j8901j7905
60938H14099j7209j6706j6162j5688j5421j5182j4724j3978j2952j1761j0760
60927F53556j0268j0104r797r221q643q069p133n692m181l206l070l655m368m313
60913E61836l087j478p60j161j610j177j29P80J340J736J870J429M62o05j358
60898E58088j600j463j532k437l970n096n248n136n699o751p330p090o583o282
60884D91871o111n954n893n845n584n266n373n857n977n270m245l699l672l469
60870D19656k583j218J7P34J010J245J785K670L652M422M795M713M243L548K848
$$ y = [1760200, 1652496, 1556147, 1470620, 1395534, 1330192, 1274001, 1226611, 1186760, 1151583, 1118094, 1085147, 1053128, 1022159, 991803, 962450, 935576, 912012, 890862, 870652, 850905, 832004, 814099, 796890, 780184, 764022, 748334, 732913, 717731, 703007, 689029, 676077, 664316, 653556, 643288, 633184, 623387, 614166, 605523, 597454, 590321, 584629, 580448, 577242, 574172, 570517, 566149, 561836, 558749, 557271, 556511, 555350, 553740, 552563, 552434, 553214, 554554, 556290, 558160, 559589, 560051, 559446, 558088, 556488, 555025, 553493, 551056, 547086, 541990, 536742, 531606, 525907, 519156, 511826, 504736, 498153, 491871, 485760, 479806, 473913, 468068, 462484, 457218, 451845, 445988, 440011, 434741, 430496, 426797, 423125, 419656, 417073, 415855, 415872, 416606, 417616, 418861, 420646, 423316, 426968, 431390, 436185, 440898, 445141, 448689, 451537]
60855D51537K405K449K999L712M132M131L870L327K299J022K59L78P46N26k68
60840D83524j144k061l287m508n043m947n004n429n543n004m475m521m715m538
60826D23305m418m886n281m478k680j379j431k196k790l159l462l386k805k473
60812C78481l122m219m518l702k701k369k570k683k387j671o88Q6P8o86j492j831
60796C44006j926k007j670n73P33J372J369J498K061K578K696K658K634K406J949
60781C59784J713J938K222K098J609R82K45m99q74p42m80l50o5N50R40N34k85
60764C69320o61m57l01n18q11r55j138j443j617j534j395j286j013n63k74l07
60748C55047l28k9M16O88Q59J203J613J532M94j393l466m915n323m951m428m088
$$ y = [451537, 453942, 456391, 459390, 463102, 467234, 471365, 475235, 478562, 480861, 481883, 482142, 482520, 483266, 483792, 483524, 482380, 480319, 477032, 472524, 467481, 462534, 457530, 452101, 446558, 441554, 437079, 432558, 427843, 423305, 418887, 414001, 408720, 404242, 401562, 400183, 398752, 396556, 393766, 390607, 387145, 383759, 380954, 378481, 375359, 371140, 366622, 362920, 360219, 357850, 355280, 352597, 350210, 348539, 347851, 347937, 348015, 347329, 345837, 344006, 342080, 340073, 338403, 337830, 338563, 339935, 341304, 342802, 344863, 347441, 350137, 352795, 355429, 357835, 359784, 361497, 363435, 365657, 367755, 369364, 370346, 370591, 370092, 369218, 368476, 367996, 367646, 367581, 368131, 369071, 369605, 369320, 368659, 368202, 367901, 367383, 366572, 365617, 364479, 363036, 361419, 359885, 358490, 357204, 356191, 355628, 355354, 355047, 354719, 354690, 355106, 355794, 356653, 357856, 359469, 361001, 361495, 360102, 356636, 351721, 346398, 341447, 337019, 332931]
60732C32931l690k884j779q82n19n05m11j7N71J118J428J373J026Q10J222K171
60716C31963K811K392J245N03Q29J724K218J866R93K71K58J022K038K688K878
60701C55699K869K524J429p0p58n0R92Q52o14k267l229l500l261k506j548j090
60685C45472j370j748j428l13J009J878K031J738J588J881K334K484K333K163
60671C60052J941J368M49m76j305k268l333m008l920l229k305j367n71r6O3J30
60655C41125K39L28M44Q57J680K587L072K894K319J958K275K972L077J933k8j847
60639C65885l148m198m997n073m254l018j863q35J00O83O75K56j92m26l65l4L67
60622C39563O28Q03J057J226R26J77n58r83j147r50j10J126J855J546P24K80M74
$$ y = [332931, 329241, 326357, 324578, 323696, 323177, 322672, 322261, 322244, 322815, 323933, 325361, 326734, 327760, 328570, 329792, 331963, 334774, 337166, 338411, 338914, 339743, 341467, 343685, 345551, 346544, 346815, 347073, 348095, 350133, 352821, 355699, 358568, 361092, 362521, 362451, 361693, 361643, 362635, 363487, 362873, 360606, 357377, 353877, 350616, 348110, 346562, 345472, 344102, 342354, 340926, 340613, 341622, 343500, 345531, 347269, 348857, 350738, 353072, 355556, 357889, 360052, 361993, 363361, 363810, 363334, 362029, 359761, 356428, 352420, 348500, 345271, 342966, 341599, 341028, 340932, 340995, 341125, 341364, 341692, 342136, 342993, 344673, 347260, 350332, 353226, 355545, 357503, 359778, 362750, 365827, 367760, 367732, 365885, 362737, 358539, 353542, 348469, 344215, 341197, 339334, 338499, 338599, 339282, 339957, 340213, 340021, 339595, 339230, 339196, 339563, 340191, 340994, 342051, 343277, 344203, 344380, 343822, 342839, 341692, 340742, 340632, 341758, 343613, 345159, 345883, 346163, 346637]
60605C46637R52J304J222N49l65o77qR57J239Q38N61Q70J436J813J945J884J565
60588C62722J107R27J206J524J359Q15N14P48J147J301J371J713K093J895J111
60573C81553O50J275K718M189N359O378P245P856Q397R093R562R154P834O116
60559D67379M132J644j008k879l657m090m736n081m459l119j743m47R28K108K771
60544D47743L346M584O453Q219R563J0920J2607J4318J5660J6614J7220J7183
60532E84430J6141J4084J1274P935M163J43l648o542q130q637q627q375p789p039
60518E79383o679o810o616n332l360j750p71K26J520K447K545K547L599N833Q368
60503E75150J0630J3048J6282K0267K4332K8017L1366L4443L6996L8775L9880
$$ y = [346637, 347589, 348893, 350115, 350664, 350299, 349622, 349614, 350571, 351810, 352648, 353209, 354079, 355515, 357328, 359273, 361157, 362722, 363829, 364756, 365962, 367486, 368845, 369660, 370174, 370922, 372069, 373370, 374741, 376454, 378547, 380442, 381553, 382203, 383478, 386196, 390385, 395744, 402122, 409367, 417223, 425620, 434713, 444275, 453429, 461263, 467379, 471511, 473155, 472147, 469268, 465611, 461521, 456785, 451704, 447245, 444126, 442383, 441936, 442864, 444972, 447743, 451089, 455673, 462126, 470345, 479908, 490828, 503435, 517753, 533413, 550027, 567247, 584430, 600571, 614655, 625929, 633864, 638027, 638170, 634522, 627980, 619850, 611213, 602586, 594211, 586422, 579383, 572704, 565894, 559278, 553946, 550586, 548836, 548065, 548291, 549811, 552258, 554803, 557350, 560949, 566782, 575150, 585780, 598828, 615110, 635377, 659709, 687726, 719092, 753535, 790531, 829306, 869186]
60492H69186M0520M0459L9036L5805L1002K5285J9077J2234M308m833j4588k3843
60480A073648l1666l7749m2235m5279m6888m7002m5578m2770l9099l5215l1356
60469F28811k7388k3509k0368j8149j6115j3747j1732j0920j0709r671p712o293
60457D52498o238o533n964m859m337m506m445l577k317j443j389k001k548k289
60443D00052j356p21r54j493j578j342j327j454j312j137j557k462k964k483j305
60428C76607rR93J339Q56j8m84k58K03M23M32M45N04O60J074J713K189K150J688
60410C90507J227J077J191J280J157R76J038J364J654J742J772J727J231J84o91
60395D07436m80Q52K418L368L537L326L305L787M406M321L224J967J657K297K870
$$ y = [869186, 909706, 950165, 989201, 1025006, 1056008, 1081293, 1100370, 1112604, 1116912, 1112079, 1097491, 1073648, 1041982, 1004233, 961998, 916719, 869831, 822829, 777251, 734481, 695382, 660167, 628811, 601423, 577914, 557546, 539397, 523282, 509535, 497803, 486883, 476174, 466503, 458791, 452498, 446260, 439727, 433763, 428904, 424567, 420061, 415616, 412039, 409722, 408279, 406890, 404889, 402341, 400052, 398696, 397975, 397021, 395528, 393950, 392608, 391281, 389827, 388515, 387378, 385821, 383359, 380395, 377912, 376607, 376598, 377591, 378930, 379786, 379768, 379284, 379026, 379229, 379652, 380084, 380529, 381033, 381693, 382767, 384480, 386669, 388819, 390507, 391734, 392811, 394002, 395282, 396439, 397415, 398453, 399817, 401471, 403213, 404985, 406712, 407943, 408127, 407436, 406956, 407808, 410226, 413594, 417131, 420457, 423762, 427549, 431955, 436276, 439500, 441467, 443124, 445421, 448291]
60380D48291K724K183J805J715J883K416L192L675L514L024K724K608K237J457
60366D83448O97N79J273K302K919K798K364K379L201M551N906O968P783Q577R505
60351E45250J0405J0812J0282Q730O415L726R97j641m265o823q713r205q419p440
60337E50111p071o923o179m896l898l597l630l573l406l251l214l470l989m196
60323D88818l465k001p00p9J29L59Q26J814L534N535P003P940R296J1437J3245
60308E43691J3396J1996J0180Q540O901N425M863N376N851M856K037j644m837
60295F16631o862q107r557j1691j3744j4343j2960j0464q098o290m799l632l172
60282E02912l446l874m008m042m288m562m480m094l715l357k836k350k279k476
$$ y = [448291, 451015, 453198, 455003, 456718, 458601, 461017, 464209, 467884, 471398, 474422, 477146, 479754, 481991, 483448, 484145, 484724, 485997, 488299, 491218, 494016, 496380, 498759, 501960, 506511, 512417, 519385, 527168, 535745, 545250, 555655, 566467, 576749, 585479, 591894, 595620, 596617, 594976, 590711, 583888, 575175, 565970, 557551, 550111, 543040, 536117, 529938, 525042, 521144, 517547, 513917, 510344, 506938, 503687, 500473, 497003, 493014, 488818, 485353, 483352, 482652, 482573, 482702, 483061, 483887, 485701, 489235, 494770, 501773, 509713, 519009, 530446, 543691, 557087, 569083, 579263, 587803, 594704, 600129, 604992, 610368, 616219, 621075, 623112, 621468, 616631, 609769, 601662, 592105, 580414, 566670, 552327, 539367, 528903, 520805, 514515, 509716, 506084, 502912, 499466, 495592, 491584, 487542, 483254, 478692, 474212, 470118, 466403, 463046, 460210, 457860, 455581, 453105]
60268D53105k345j772j351j457j723j770j812k090k271k059j861k138k446j992
60254D26018q95l3L34Q39J809K696L006K975K946K656J811P48K1m18r64j581j848
60237D40120j620j083l18O21J264J081L98L73J584L160L821L417K859K700K548
60222D60925K048J719K311L662M812N145M983N063N713O652P305P340P044P101
60208E31823P769Q443Q338P478O554O008N768N793O108O294N660M289L094K527
60194F15946J891N26j034j842j957k248l026l756m048m191m517m875m996m894
60180E76979m724m505m143l582k905k370k244k373k175j353m46k88r95j846k188
60165E40842k063j945k109k368k298j668p38mL44N12O24N32K59J90M92P53N51
$$ y = [453105, 450760, 448988, 447637, 446180, 444457, 442687, 440875, 438785, 436514, 434455, 432594, 430456, 428010, 426018, 425123, 425090, 425424, 426263, 428072, 430768, 433774, 436749, 439695, 442351, 444162, 444910, 444931, 444513, 443549, 441968, 440120, 438500, 437417, 437099, 437720, 438984, 440065, 440463, 440836, 442420, 445580, 449401, 452818, 455677, 458377, 460925, 462973, 464692, 467003, 470665, 475477, 480622, 485605, 490668, 496381, 503033, 510338, 517678, 524722, 531823, 539592, 548035, 556373, 563851, 570405, 576413, 582181, 587974, 594082, 600376, 606036, 610325, 613419, 615946, 617837, 618363, 617329, 615487, 613530, 611282, 608256, 604500, 600452, 596261, 591744, 586869, 581873, 576979, 572255, 567750, 563607, 560025, 557120, 554750, 552506, 550133, 547958, 546605, 546159, 545871, 544876, 543030, 540842, 538779, 536834, 534725, 532357, 530059, 528391, 527653, 527649, 527993, 528505, 529129, 529661, 529920, 530110, 530602, 531355, 531906]
60148E31906J32Q1N83J313J883K136K227K663L820N214N761N157M498M925O175
60133E78474P135P331P126O794O238N444M496L243J666L81MJ98J03m17o79l28
60117F27209K89P99J105R74J12j175k105k335k213k016j610r81n15n22r25j488
60101F14603j985k196k130k144k434k572k116j343p77k58O28J521J597Q35N2k57
60085F01024k64l2N60J151J154P72P28R04L86r77k271l066m054n598o795o760
60069E76862n899n190m954n000n292n710n813n504n453o133o963o981o043m815
60055D97112l903l360k760j541K85J771K000J494J771L288M797N221N018N096
60041E16289N335N120M576M313M373M243L557K252M44j352k424k744l096l798
$$ y = [531906, 532038, 532119, 532702, 534015, 535898, 538034, 540261, 542924, 546744, 551958, 557719, 562876, 567374, 572299, 578474, 585609, 592940, 600066, 606860, 613098, 618542, 623038, 626281, 627947, 628328, 628332, 628530, 628633, 628216, 627537, 627209, 627498, 628297, 629402, 630376, 630488, 629313, 627208, 624873, 622660, 620644, 619034, 618053, 617538, 617016, 616091, 614603, 612618, 610422, 608292, 606148, 603714, 601142, 599026, 597683, 596906, 596648, 597276, 598797, 600394, 601229, 601281, 601024, 600760, 600728, 601288, 602439, 603593, 604365, 605093, 605997, 606383, 605406, 603135, 600069, 596015, 590417, 583622, 576862, 570963, 565773, 560819, 555819, 550527, 544817, 539004, 533500, 528047, 521914, 514951, 507970, 501927, 497112, 493209, 489849, 487089, 485548, 485833, 487604, 489604, 491098, 492869, 496157, 500954, 506175, 511193, 516289, 521624, 526744, 531320, 535633, 540006, 544249, 547806, 550058, 550502, 549150, 546726, 543982, 540886, 537088]
60027E37088m173l882l804m671n668n585m783m768o039p560q265q074p381o455
60013D55980n490m589l605k452j507j169j253j295j284j445j617j455j089q98
59999D26832q27n09L6M65P07R60J234J427J685K141K528K608K744L383M197M435
59983D54046L960L224K377J177k36j239j559j592j736j987k188k248j995j298
59969D48706m20K10N45Q54J174J314J396J779K405K750K640K609L114L811L902
59954D76789L024J481k75j987l319l669k722j215n29j095j740j306m58q13k403
59939D59763l419k810j757j771k519k608j678m15Q77K392L769M301M150M245M845
59924D67365N185M746L939L274K647J796Q33Mo26r66q24j70Q00J933L111M058
$$ y = [537088, 532915, 529033, 525229, 520558, 514890, 509305, 504522, 499754, 493715, 486155, 477890, 469816, 462435, 455980, 450490, 445901, 442296, 439844, 438337, 437168, 435915, 434620, 433336, 431891, 430274, 428819, 427730, 426832, 426005, 425496, 425532, 425997, 426704, 427664, 428898, 430325, 432010, 434151, 436679, 439287, 442031, 445414, 449611, 454046, 458006, 461230, 463607, 464784, 464548, 463309, 461750, 460158, 458422, 456435, 454247, 451999, 450004, 448706, 448286, 448496, 449041, 449895, 451069, 452383, 453779, 455558, 457963, 460713, 463353, 465962, 469076, 472887, 476789, 479813, 481294, 481019, 479032, 475713, 472044, 469322, 468107, 467578, 466483, 464743, 463437, 462979, 462166, 459763, 456344, 453534, 451777, 450006, 447487, 444879, 443201, 442786, 443663, 446055, 449824, 454125, 458275, 462520, 467365, 472550, 477296, 481235, 484509, 487156, 488952, 489785, 489789, 489163, 488197, 487373, 487203, 488003, 489936, 493047, 497105]
59908D97105M503M508M316L956L449L123L217L290K653J326j0r28j511j771j514
59893E25712q91l91j28L17J105J775J969K048K636L801N027N844O238O471O697
59878E68230O813O685O420O168N723M683L132J728R05M47P0p7R9J97j2L3Q93K040
59860F14177K350J506K89m55n22o4P36J652K568L638M907N865N784M455K254k66
59844F48874k543m043m612m538l898k372j97J217N45j865m485o361p575q129p593
59829E92425n981m125k790k019j503j118q61p68r91j568k141k275k007j665j332
59814E61281r60q05j110j508j427j034j080j815k636k935k745k450k262k101j694
59799E34719r16k51n56j986l563m322m453m654m860m464l519k731k363k013j424
$$ y = [497105, 501608, 506116, 510432, 514388, 517837, 520960, 524177, 527467, 530120, 531446, 531436, 530508, 528997, 527226, 525712, 524821, 524430, 524302, 524619, 525724, 527499, 529468, 531516, 534152, 537953, 542980, 548824, 555062, 561533, 568230, 575043, 581728, 588148, 594316, 600039, 604722, 607854, 609582, 610487, 610934, 611004, 610927, 611026, 611223, 611211, 611244, 612137, 614177, 616527, 618033, 618322, 617867, 617345, 617281, 618017, 619669, 622237, 625875, 630782, 636647, 642431, 646886, 649140, 648874, 646331, 642288, 637676, 633138, 629240, 626868, 626671, 627888, 628433, 626568, 622083, 615722, 608147, 600018, 592425, 586444, 582319, 579529, 577510, 576007, 574889, 574028, 573260, 572269, 570701, 568560, 566285, 564278, 562613, 561281, 560321, 559516, 558406, 556898, 555471, 554437, 553357, 551542, 548906, 545971, 543226, 540776, 538514, 536413, 534719, 533803, 533552, 532996, 531010, 527447, 523125, 518672, 514018, 509158, 504694, 501175, 498444, 496081, 494068, 492644]
59784D92644q19m68m95r50j517j503p43n4n6o2P78J905K118J543J428K176L000
59767D98925L446L890M409M591M626N241O294O766O392O055O275O600O854P535
59753E77899Q486Q598P485O260N897N986N846N715N945O042N483M675M236M064
59739F62617L796L558L492L186K302J200L26m49j306j966k176k078j722r06Q4
59724F69958M38l0n85q37j281k033k203j331l60k66o99r47j243j942k338j613
59708F52688l14L95M40N54Q15P98Q26J629K924L596L335K914K801K591K053J603
59692F79648J441J026j50j873l556m774n261m877l855k753j979j617j660k063
59678F47697k583k991l449m349n695o901p274o677n702n208n416n521m597k882
$$ y = [492644, 491825, 491357, 490862, 489912, 488395, 486892, 486149, 486095, 486039, 485977, 486755, 488660, 490778, 492321, 493749, 495925, 498925, 502371, 506261, 510670, 515261, 519887, 525128, 531422, 538188, 544580, 550635, 556910, 563510, 570364, 577899, 586385, 594983, 602468, 608728, 614625, 620611, 626457, 632172, 638117, 644159, 649642, 654317, 658553, 662617, 666413, 669971, 673463, 676649, 678951, 680151, 680477, 680028, 678722, 676756, 674580, 672502, 670780, 669874, 669958, 670396, 670366, 669781, 668944, 667663, 665630, 663427, 662096, 661736, 661470, 660771, 659824, 658581, 656639, 654301, 652688, 652374, 652769, 653209, 653763, 654578, 655376, 656202, 657831, 660755, 664351, 667686, 670600, 673401, 675992, 678045, 679648, 681089, 682115, 681965, 680092, 676536, 671762, 666501, 661624, 657769, 655016, 653037, 651420, 649760, 647697, 645114, 642123, 638674, 634325, 628630, 621729, 614455, 607778, 602076, 596868, 591452, 585931, 581334, 578452]
59664E78452j633j483j621r74L43J368J603J387J248J516K262L152L540L185K624
59649E94969K405K253J550L15q94j912l070m477n684o195n925n174m440m173m352
59634E55196m408l839k859k132j972k133k364k760l475m288m684m379l710l374
59620E08819l702m397n016n380n348m648l484k730k816k840j742k7Q71Q45J265
59605D69670K653L716L308K096J352J225J166J247J850K609K733K143J390Q17
59591D97975M48M20Q02J219J291J125Q60J91j087k373k827k350j516q47o42j105
59575D91584j959k331j669n85k16q92j873k259j717n57N30R54O90J13n54j241
59559D78018j613j358q54p59q29k24R30J480J128J021J879K895L296L633M493
$$ y = [578452, 576819, 575336, 573715, 572741, 573084, 574452, 576055, 577442, 578690, 580206, 582468, 585620, 589160, 592345, 594969, 597374, 599627, 601177, 601492, 600598, 598686, 595616, 591139, 585455, 579260, 573335, 568161, 563721, 559548, 555196, 550788, 546949, 544090, 541958, 539986, 537853, 535489, 532729, 529254, 524966, 520282, 515903, 512193, 508819, 505117, 500720, 495704, 490324, 484976, 480328, 476844, 474114, 471298, 468458, 466716, 466689, 467560, 468405, 469670, 472323, 476039, 479347, 481443, 482795, 484020, 485186, 486433, 488283, 490892, 493625, 495768, 497158, 497975, 498423, 498843, 499645, 500864, 502155, 503280, 504140, 504331, 503244, 500871, 498044, 495694, 494178, 493331, 492689, 491584, 489625, 487294, 485625, 485040, 484824, 483932, 482059, 479800, 478083, 477526, 478056, 479010, 479700, 479813, 479259, 478018, 476405, 475047, 474193, 473434, 472605, 472381, 473311, 474791, 475919, 476940, 478819, 481714, 485010, 488643, 493136]
59544D93136N266N454O016P905J0410J2508J4893J8496K1582K0580J4128M740
59532F35114l711q896j0462r263o877m763l232j731q3J218J903K187K111J440
59518E94955L41o29j327k112l162m252n227o069o631o865p098p512p679p232o595
59503E22906o307o052n272m304l861l696k908j420j26L95L78J50j45j68L55J002
59487D90927J087O58L29L25M89J011K185L626M652N278N954O542O492N856N141
59472E40552M343L108J699P81M22K11J27L00L49M1J72J486L088L468K828K753
59456E65728L707M562M717M873N380N576N258N244N787N993N337M352L174R78
59442F30666k310n190o495o807o975o545m921k996k180k474k809k745k650k549
$$ y = [493136, 498402, 503856, 509872, 517777, 528187, 540695, 555588, 574084, 595666, 616246, 630374, 635114, 631403, 622507, 612045, 602782, 595905, 591142, 587910, 586179, 586096, 587314, 589217, 591404, 593515, 594955, 595296, 594667, 593340, 591228, 588066, 583814, 578587, 572518, 565887, 559022, 551924, 544412, 536733, 529501, 522906, 516599, 510547, 505275, 500971, 497110, 493414, 490506, 489086, 488960, 489355, 489733, 489883, 489738, 489570, 489925, 490927, 492014, 492672, 493001, 493326, 493815, 494826, 497011, 500637, 505289, 510567, 516521, 523063, 529555, 535411, 540552, 544895, 548003, 549702, 550483, 550905, 551116, 551243, 551543, 551892, 551933, 552105, 553591, 556679, 560147, 562975, 565728, 569435, 573997, 578714, 583587, 588967, 594543, 599801, 605045, 610832, 616825, 622162, 626514, 629688, 630666, 628356, 623166, 616671, 609864, 602889, 596344, 591423, 588427, 586247, 583773, 580964, 578219, 575569, 573020]
59428E73020j950o56J056K959M900O567P837R100J0761J2690J4573J6442J8424
59415F75723K0532K3235K7417L2690L6022L3355K3213Q450n690j5069j8572j7522
59403H23784j3913q976k853M674J2837J8891J9002J1205k021j4849k2512k4468
59391H00801k3212k1006j8562j5947j3291j0649q190o471n702n106l886k563k179
59378F64037k577k633k023j406j012m96j61p55j854k027j013j78l02m23L61J388
59362F48926J712J703K282L433M499N244N828O302O889Q101R952J1663J2702J3513
59348G42749J4625J5717J6218J6184J6011J5792J5414J4767J3490J1152Q101N348
59336I05568L218R30k035m988p070q478j0059j2192j4581j6589j7400j6605j4979
$$ y = [573020, 571070, 570414, 571470, 574429, 579329, 585896, 593733, 602833, 613594, 626284, 640857, 657299, 675723, 696255, 719490, 746907, 779597, 815619, 848974, 872187, 880637, 874947, 859878, 841306, 823784, 809871, 800895, 798042, 802716, 815553, 834444, 853446, 864651, 862630, 847781, 825269, 800801, 777589, 756583, 738021, 722074, 708783, 698134, 689944, 683473, 677771, 672665, 668779, 666216, 664037, 661460, 658827, 656804, 655398, 654386, 653890, 653729, 652974, 651120, 649093, 648080, 647902, 647600, 647177, 647538, 648926, 650638, 652341, 654623, 658056, 662555, 667799, 673627, 679929, 686818, 694919, 704871, 716534, 729236, 742749, 757374, 773091, 789309, 805493, 821504, 837296, 852710, 867477, 880967, 892119, 900220, 905568, 908786, 909716, 907681, 902693, 895623, 887145, 877086, 864894, 850313, 833724, 816324, 799719, 784740]
59323G84740j3923j3826j3745j3031j2141j1411j0272q488p053o805p082o720
59311F60243n721m863m264l385k015l30J679M162O987R899J2545J3861J2191O893
59297G07882n50p663j2811j5570j6159j5323j4132j3016j1400q902o312m604l652
59284E77788k706j634p60P5J349K983M412N324N838O232P013Q705J1001J2650
59270F38270J2889J2435J2329J2400J1750J0353R090Q329P436N808L656J584j24
59257G46205j654l215m564n042m350l203k639k703k525j772j096q79n50K95J083
59242G13391J301J505K436L814M750M893M369L210J597J92n60j118k215l897n658
59227G28010p034p659p415p032p758r705j1249j0865q989p256o457o193n978n736
$$ y = [784740, 770817, 756991, 743246, 730215, 718074, 706663, 696391, 687903, 680850, 674045, 666963, 660243, 654522, 649659, 645395, 642010, 639995, 639665, 641344, 645506, 652493, 662392, 674937, 688798, 700989, 707882, 707332, 699669, 686858, 671288, 655129, 639806, 625674, 612658, 601258, 592356, 586044, 581440, 577788, 575082, 573448, 572688, 572763, 574112, 577095, 581507, 586831, 592669, 598901, 605914, 614619, 625620, 638270, 651159, 663594, 675923, 688323, 700073, 710426, 719516, 727845, 735281, 741089, 744745, 746329, 746205, 744551, 741336, 736772, 731730, 727380, 724177, 721538, 718835, 716310, 714538, 713442, 712563, 712013, 712308, 713391, 714692, 716197, 718633, 722447, 727197, 732090, 736459, 739669, 741266, 741458, 740898, 739780, 737565, 733668, 728010, 720976, 713317, 705902, 698870, 691112, 681407, 670158, 659293, 650304, 643048, 636591, 630398, 624420, 618684]
59213F18684n406m914m464m291m236l962l337k359j143j54J28k5J78Q38J223J086
59197E87846J089J617K255K822L719M704M697L571K767L153L692L300K697L033
59183F30962L900M259M243M455M417L401K107J734J964J550M38l13m72p70j329
59168F60546j430q93k89J20N32P87O03L28L93K25j050l117m860n956o848p459
59152F31632p292o601o158o008n629n117n004n113m915m724n263o212o574o303
59138E50719o158o109n409m177l367l103k512j414o44m65r1Q67J769K191K572
59123E24669L270L973M485N088N858O566P385Q688J0055J0564J0188R846R887
59110F20522R729R141Q698Q625Q331P550O851O594O275N371L992K400O48j012
$$ y = [618684, 613278, 608364, 603900, 599609, 595373, 591411, 588074, 585715, 584572, 584418, 584546, 584521, 584699, 585537, 586760, 587846, 588935, 590552, 592807, 595629, 599348, 604052, 608749, 612320, 615087, 618240, 621932, 625232, 627929, 630962, 634862, 639121, 643364, 647819, 652236, 655637, 657744, 659478, 661442, 662992, 663430, 663117, 662645, 661875, 660546, 659116, 658223, 657934, 658054, 658586, 659373, 659976, 660304, 660697, 660922, 659872, 656755, 651895, 645939, 639091, 631632, 624340, 617739, 611581, 605573, 599944, 594827, 589823, 584710, 579795, 575071, 569808, 563596, 557022, 550719, 544561, 538452, 533043, 528866, 525499, 522396, 519884, 518470, 517826, 517361, 517270, 518137, 519906, 522097, 524669, 527939, 531912, 536397, 541485, 547343, 553909, 561294, 569982, 580037, 590601, 600789, 610635, 620522, 630251, 639392, 648090, 656715, 665046, 672596, 679447, 686041, 692316, 697687, 701679, 704079, 704727, 703715]
59096G03715k148k755l164l308k951k541k739l112k483p74O59P92n0j304l022
59081F74815n171p024p920p893p205o018m838m475n109o042o586o549n855m533
59067E89597l226k751k979k999k506k058j874j544j154j513k754l817l856l244
59053E53322k679k229j810j695j842j570o20J84P1m65l60N03J255J285Q62N19
59037E44731L38O1k91k33N97J838K862L735N034O550P155O555O215P622J0358
59022F03127J2899J4610J5780J6327J5880J4730J3359J1284P745L335m47l111
59010G25518n259o976p600p154o493n885m806l198j657k71J322K685K913K253
58996F85392J953K269K180J277L60j85r67k082k586k149j694j828k020j913k055
$$ y = [703715, 701567, 698812, 695648, 692340, 689389, 686848, 684109, 680997, 678514, 677740, 678399, 679191, 679141, 677837, 674815, 669644, 662620, 654700, 646807, 639602, 633584, 628746, 624271, 619162, 613120, 606534, 599985, 594130, 589597, 586371, 583620, 580641, 577642, 575136, 573078, 571204, 569660, 568506, 566993, 564239, 560422, 556566, 553322, 550643, 548414, 546604, 544909, 543067, 541497, 540877, 541061, 541132, 540667, 540307, 540810, 542065, 543350, 544212, 544731, 545069, 545130, 544839, 544606, 545203, 547041, 549903, 553638, 558672, 565222, 572377, 578932, 585147, 592769, 603127, 616026, 630636, 646416, 662743, 678623, 693353, 706712, 717996, 725741, 729076, 728629, 725518, 720259, 713283, 705683, 698529, 692036, 686151, 681345, 678147, 676490, 676219, 677541, 680226, 683139, 685392, 687345, 689614, 691794, 693071, 693431, 693246, 692279, 690197, 687611, 685462, 683768, 681940, 679920, 678007, 675952]
58981F75952k607k634j489K46J811L159M268M807N137O329Q593J0765J1950J2414
58967G38701J2350J1273R336P840P498P498P089O782O995O802N193K559j73k865
58953H26878n605p825r149j0267j1888j3446j3961j3509j2909j2420j1636j0302
58941F93961q551o755n500n088m875l856k257j441j868k339j864j017o05k40P35
58926F48440J831K042J177k33j657k553k413j612j330j992k602k333j816j914
58912F33035k219j702k45J394K573L068L104L638N784R192J1862J2338J1303J0395
58898G03520J0241J0480J0826J1122J1010J0435J0051J0468J1563J2953J4507
58887H27176J5979J6861J7035J6859J6351J5130J3276J1247Q830N482J858o42
$$ y = [675952, 673345, 670711, 669222, 669468, 671279, 674438, 678706, 683513, 688650, 694979, 703572, 714337, 726287, 738701, 751051, 762324, 771660, 779500, 786998, 794496, 801585, 808367, 815362, 822164, 827357, 829916, 829743, 826878, 821273, 813448, 804299, 794032, 782144, 768698, 754737, 741228, 728319, 715899, 704263, 693961, 685410, 678655, 673155, 668067, 663192, 659336, 657079, 655638, 653770, 651431, 649567, 648550, 647945, 647705, 648440, 650271, 652313, 653490, 653257, 651600, 649047, 646634, 645022, 643692, 641700, 639098, 636765, 634949, 633035, 630816, 629114, 628869, 630263, 632836, 635904, 639008, 642646, 648430, 657622, 669484, 681822, 693125, 703520, 713761, 724241, 735067, 746189, 757199, 767634, 777685, 788153, 799716, 812669, 827176, 843155, 860016, 877051, 893910, 910261, 925391, 938667, 949914, 958744, 964226, 966084, 965442]
58875I65442k136m318p626j0217j0750j0290j0261j0209r079p219n537l923k156
58862H71721j237k167m171n704o505p359q501r534j0267j0550j0012q916q316
58849G78482q480q233o942n823o008o673o601o352p136q611r611j0198j1027j1500
58835F65287j0475q409o914o510o406o110n689m793l058j298o95r64p34M22J671
58820F05325K455K949L185L014K908L502M453M793M282L391K284R01k50n35k46
58805F42411k74q53j587k316l085l632l882m463n737o828o665n593m835m799m931
58790E82931m777m165k798p52J005J625J493J541J960K526L420M636N371N106
58776E99122M709N202O062N906M352K005p17l526n664o610o840o895o378n057
$$ y = [965442, 963306, 958988, 951362, 941145, 930395, 920105, 909844, 899635, 890556, 883337, 877800, 873877, 871721, 870484, 868317, 864146, 858442, 851937, 844578, 836077, 826543, 816276, 805726, 795714, 786798, 778482, 770002, 761769, 754827, 749004, 742996, 736323, 729722, 723370, 716234, 707623, 698012, 687814, 676787, 665287, 654812, 646403, 639489, 632979, 626573, 620463, 614774, 609981, 606923, 605625, 604930, 603966, 603232, 603654, 605325, 607780, 610729, 613914, 616928, 619836, 623338, 627791, 632584, 636866, 640257, 642541, 643442, 643192, 642657, 642411, 642137, 641284, 639697, 637381, 634296, 630664, 626782, 622319, 616582, 609754, 603089, 597496, 592661, 587862, 582931, 578154, 573989, 571191, 570439, 571444, 573069, 574562, 576103, 578063, 580589, 584009, 588645, 594016, 599122, 603831, 609033, 615095, 621001, 625353, 627358, 626641, 623115, 617451, 610841, 604001, 597106, 590728, 585671]
58762E85671l994m169m737m219k692j347n14K91R78J186J413K283L139K902J875
58747E78066J163Q35K78j61L23J302J705J791K720M334N236N056M936N591O495
58732F19670P151P793Q542R055R133Q718P496N490L721L143L274L072K684L038
58718G01980M143N170N928O902Q083Q951R314R055P630N047K667J599R65q99m102
58703G72433p484j0450j2974j4556j4922j5104j6128j7340j7604j7319j7299j6655
58691E94598j4114j0688q635q137p490o234n568n775n694n025m768n137n120m409
58677D97804l773l285k176o06L40O32J361K744L938M900O451Q404R632J0120J0942
58662E47428J2066J2193J0848Q686N738J604k595m838n123n500o802p750p618
$$ y = [585671, 581677, 577508, 572771, 568552, 565860, 564513, 563999, 564290, 565268, 566454, 567867, 570150, 573289, 576191, 578066, 579229, 580064, 580342, 580181, 580504, 581806, 583511, 585302, 588022, 592356, 597592, 602648, 607584, 613175, 619670, 626821, 634614, 643156, 652211, 661344, 670062, 677558, 683048, 686769, 689912, 693186, 696258, 698942, 701980, 706123, 711293, 717221, 724123, 732206, 741157, 750471, 759526, 767156, 772203, 774870, 776469, 777434, 776535, 772433, 764949, 754499, 741525, 726969, 712047, 696943, 680815, 663475, 645871, 628552, 611253, 594598, 580484, 569796, 561161, 553024, 545534, 539300, 533732, 527957, 522263, 517238, 512470, 507333, 502213, 497804, 494031, 490746, 488570, 487964, 488304, 488936, 490297, 493041, 496979, 501879, 508330, 516734, 526366, 536486, 547428, 559494, 571687, 582535, 591221, 596959, 598563, 595968, 591130, 586007, 580507, 573705, 565955, 558337]
58649E58337p388p508o943n307l820l219k697j783j302j602j704j151q62j215
58635E11836j132QJ162J334J012R56J033R83J041J041K80j082j834j444o99k04
58619E14291L74J178J766K186L026M174M869N131N521N558M239K219J380J964
58605E57876K240J425P61J081J421Q62j00q94j732k461k231j093k80l04k57M95
58589E56809J536K605L971N335O091O798Q474J0429J0929J0143R973J0725J0593
58576F54411Q922P331O782O261N312N301O930Q909J0333J2137J4906J7531J9322
58563G84388K1343K4278K6948K8292K8860K9003K7625K4052J9458J5054J0531
58552A039832N531R59k368m832o722p469p134o982p687q592r554j1623j5005j8220
$$ y = [558337, 550949, 543441, 536498, 531191, 527371, 524152, 521455, 519672, 518370, 516768, 515064, 513913, 513051, 511836, 510704, 510712, 511874, 513208, 514220, 515176, 516209, 517192, 518233, 519274, 519554, 518472, 516638, 515194, 514495, 514291, 514665, 515843, 517609, 519795, 522821, 526995, 531864, 536995, 542516, 548074, 552313, 554532, 555912, 557876, 560116, 561541, 562302, 563383, 564804, 565666, 565566, 564672, 562940, 560479, 558248, 557155, 556875, 556571, 556314, 556809, 558345, 560950, 564921, 570256, 576347, 583145, 591619, 602048, 612977, 623120, 633093, 643818, 654411, 663333, 670664, 677446, 683707, 689019, 694320, 701250, 710159, 720492, 732629, 747535, 765066, 784388, 805731, 830009, 856957, 885249, 914109, 943112, 970737, 994789, 1014247, 1029301, 1039832, 1045363, 1046322, 1043954, 1039122, 1032400, 1024931, 1017797, 1010815, 1003128, 994536, 984982, 973359, 958354, 940134]
58538I40134k0168k1332k2208k2413k2004k1679k1039j8769j5176j2324j0952
58527G32070r650p705o242n753n142m171m112m947m707k798j279j453k032j962
58513F70117k203l192l433k361j783k696l334k309r77p66q29l14l22j479k115
58498F42004j065J48Q3j31Q15J984K351K926M431N259M264L200L929N374N795
58483F81367N932P329R414J0929J2393J4668J6755J7290J6670J5643J3599J0190
58471H32179O648L608k02n166r029j0144r987j0206r703p205m230k662j636M82
58457G72747L122N221P594J0884J3328J3434J2688J2748J2129Q756L711o59m341
58444H71362q211j1053j1308j0209r888r915q734o910n897n103l211r36L60J336
$$ y = [940134, 919966, 898634, 876426, 854013, 832009, 810330, 789291, 770522, 755346, 743022, 732070, 722420, 714715, 708473, 702720, 697578, 693407, 689295, 684348, 679641, 676843, 675564, 674111, 672079, 670117, 667914, 664722, 661289, 658928, 657145, 654449, 651115, 648806, 647829, 647063, 646234, 645920, 645598, 644119, 642004, 640939, 641087, 641170, 641039, 641854, 643838, 646189, 649115, 653546, 658805, 663069, 666269, 670198, 675572, 681367, 687299, 694628, 704042, 714971, 727364, 742032, 758787, 776077, 792747, 808390, 821989, 832179, 838827, 842435, 842233, 837067, 828038, 817894, 807907, 797701, 787998, 780793, 776563, 773901, 772265, 772747, 775869, 781090, 788684, 799568, 812896, 826330, 839018, 851766, 863895, 872651, 876362, 875703, 871362, 863151, 852098, 840790, 830581, 820693, 810778, 802044, 795134, 789237, 784134, 780923, 779987, 780347, 781683]
58430G81683L180N133O157P366R934J2432J3050J2598J2369J1076P125K112j239
58417H82976k987m771o424o912p028q069r291r468r304r624r218p250n550n599
58403G81481n657l935j997j671j358Q70L228L311K637L777N439M942L382L587
58389G98036M792M201K246J517J852J095m40p99n19j509k910k384l98J029K548
58374H08357O088J0343J2121J1254J0106R249P760O630P621R721J0692J1014J2380
58361I33336J3796J3287J1950J2072J2799J1930J0265R783R271O441K689R91P83
58348A049393l03j410k00K173K903K720M112O189O580O633R162J2685J3612J2628
58334A126877J3133J4950J5404J5067J6393J7996J6548J3049J1046J0048P003
$$ y = [781683, 784863, 789996, 796153, 803519, 813453, 825885, 838935, 851533, 863902, 874978, 882103, 884215, 882976, 879989, 875218, 868794, 861882, 854854, 846785, 837494, 828026, 818722, 809098, 799880, 792630, 787080, 781481, 775824, 771889, 769892, 768221, 766863, 767733, 770961, 774272, 776909, 780686, 786125, 791067, 794449, 798036, 802828, 807029, 809275, 810792, 812644, 813739, 813299, 812500, 811981, 810472, 807562, 805178, 804780, 805809, 808357, 814445, 824788, 836909, 848163, 858269, 867518, 875278, 881908, 889529, 899250, 909942, 920956, 933336, 947132, 960419, 972369, 984441, 997240, 1009170, 1019435, 1029218, 1038489, 1044930, 1047619, 1048610, 1049393, 1049090, 1047680, 1047480, 1049653, 1052556, 1055276, 1059388, 1065577, 1072157, 1078790, 1087952, 1100637, 1114249, 1126877, 1140010, 1154960, 1170364, 1185431, 1201824, 1219820, 1236368, 1249417, 1260463, 1270511, 1277514]
58323A277514K956J604K437J983P19J947M758N262L990N061Q514J0453J0297J0962
58309A348457J2399J1991J0832J2462J5818J6523J4769J4745J6791J7485J6928
58298A509200J8313K0791K0430J7971J7828J9783J9630J7606J8019K0736K1484
58287A721791K0404K1821K5505K6815K5545K6065K8584K9113K8002K9525L2990
58276B016160L3548L1857L3295L7556L8966L7413L8663M3307M5821M5386M7077
58265B449049N1381N3290N2794N5348O0820O3046O1564O2500O6492O7386O4429
58254C108099O3868O6890O7869O6312O8258P4191P7993P9504Q5172R4746J00771
58243C953673J02951J08986J19471J26653J30031J37781J50509J59566J64123
$$ y = [1277514, 1280470, 1282074, 1284511, 1286494, 1287213, 1289160, 1293918, 1299180, 1303170, 1308231, 1316745, 1327198, 1337495, 1348457, 1360856, 1372847, 1383679, 1396141, 1411959, 1428482, 1443251, 1457996, 1474787, 1492272, 1509200, 1527513, 1548304, 1568734, 1586705, 1604533, 1624316, 1643946, 1661552, 1679571, 1700307, 1721791, 1742195, 1764016, 1789521, 1816336, 1841881, 1867946, 1896530, 1925643, 1953645, 1983170, 2016160, 2049708, 2081565, 2114860, 2152416, 2191382, 2228795, 2267458, 2310765, 2356586, 2401972, 2449049, 2500430, 2553720, 2606514, 2661862, 2722682, 2785728, 2847292, 2909792, 2976284, 3043670, 3108099, 3171967, 3238857, 3306726, 3373038, 3441296, 3515487, 3593480, 3672984, 3758156, 3852902, 3953673, 4056624, 4165610, 4285081, 4411734, 4541765, 4679546, 4830055, 4989621, 5153744]
58234E153744J73344J88508K00204K06657K17293K34427K49493K61377K79612
58225G164659L05272L28183L47433L74260M10183M43858M74341N14816N68005
58216A0931010O21945O75765P44203Q30394R21076J015533J130837J271583J425202
58207A9567548J594801J803686K059854K352738K693710L119282L644370M257453
58199D1093442M973291N839990O881287Q091353R506923J1224221J3328151J5876426
58191A16815084J8965310K2712706K7149828L2210966L7711995M2900354M5771080
58184C44237323M3298704L3268315J6435199l226006k0729413l2791939l8835931
58177C41656252m0099047l8292087l4875216l0882838k6909782k3199678j9841185
$$ y = [5153744, 5327088, 5515596, 5715800, 5922457, 6139750, 6374177, 6623670, 6885047, 7164659, 7469931, 7798114, 8145547, 8519807, 8929990, 9373848, 9848189, 10363005, 10931010, 11552955, 12228720, 12972923, 13803317, 14724393, 15739926, 16870763, 18142346, 19567548, 21162349, 22966035, 25025889, 27378627, 30072337, 33191619, 36835989, 41093442, 46066733, 51906723, 58788010, 66879363, 76386286, 87610507, 100938658, 116815084, 135780394, 158493100, 185642928, 217853894, 255565889, 298466243, 344237323, 387536027, 420804342, 437239541, 434013535, 413284122, 380492183, 341656252, 301557205, 263265118, 228389902, 197507064, 170597282, 147397604, 127556419]
58170A27556419j6898101j4387358j2252096j0426476q885182p603356o523638
58163E0580212n596994m813776m166926l622574l150896k750657k420525k137521
58155B1920343j883840j665765j487232j331553j186150j059667r58106q67945
58147A1480085p78566o98923o36713n81925n25634m75697m39644m09800l78388
58138F554795l50528l30164l09222k82428k57596k40426k23932k03070j85083
58129D172346j75072j65664j51136j38077j31958j26406j15849j06223j03101
58120B958860j01084r4694q8481q6892q4926p8125p1542o9911o8675o3411n8531
58109B092588n8293n8371n4531n0743n0781n0571m6566m3148m4068m4892m1480
$$ y = [127556419, 110658318, 96270960, 84018864, 73592388, 64707206, 57103850, 50580212, 44983218, 40169442, 36002516, 32379942, 29229046, 26478389, 24057864, 21920343, 20036503, 18370738, 16883506, 15551953, 14365803, 13306136, 12348030, 11480085, 10701519, 10002596, 9365883, 8783958, 8258324, 7782627, 7342983, 6933183, 6554795, 6204267, 5874103, 5564881, 5282453, 5024857, 4784431, 4560499, 4357429, 4172346, 3997274, 3831610, 3680474, 3542397, 3410439, 3284033, 3168184, 3061961, 2958860, 2857776, 2763082, 2674601, 2587709, 2502783, 2424658, 2353116, 2283205, 2214530, 2151119, 2092588, 2034295, 1975924, 1921393, 1870650, 1819869, 1769298, 1722732, 1679584, 1635516, 1590624, 1549144]
58098A549144l7797l7856l7937l4215l0361l0179l0186k6772k3448k3731k3911
58087A212751k0209j6312j6515j7888j6393j4637j6336j8919j8550j7164j7947
58076A021881j9094j8202j7598j9316k0098j7254j4264j4747j6167j5162j3746
58065H36233j4447j4675j1873r115r640j0793r169o949p326q479p847p658j0272
58052G07990j2665j1375q653p950p731n493l529m746o812o361n123o151p753p051
58038F06597n820o990q779q014o030n757o101m693l122m012n913o293o543q779
58024E19751j0831r757p331o791p098n745m237n234o973o165l951l542m236l242
58010D34618j356j366k582k213n38J79L01J624L206L007K065K654L908L574K289
$$ y = [1549144, 1511347, 1473491, 1435554, 1401339, 1370978, 1340799, 1310613, 1283841, 1260393, 1236662, 1212751, 1192542, 1176230, 1159715, 1141827, 1125434, 1110797, 1094461, 1075542, 1056992, 1039828, 1021881, 1002787, 984585, 966987, 947671, 927573, 910319, 896055, 881308, 865141, 849979, 836233, 821786, 807111, 795238, 786123, 776483, 765690, 756521, 749572, 742246, 733767, 725920, 718262, 707990, 695325, 683950, 675297, 667347, 659616, 654123, 650594, 645848, 639036, 632675, 627552, 621401, 613648, 606597, 600777, 593787, 585008, 576994, 570964, 565207, 559106, 554413, 551291, 547279, 541366, 535073, 528530, 519751, 508920, 499163, 491832, 485041, 477943, 472198, 467961, 462727, 455754, 449589, 445638, 442096, 437860, 434618, 433262, 431896, 429314, 427101, 426563, 426742, 427043, 428667, 431873, 434880, 436945, 439599, 443507, 447081, 449370]
57995D49370J928J638k51k425k955l330n667q072p453m940l845m137l659k910
57981D03292l688m745l737k069k801n036n361l728k963l373k744j052l65n66L17
57966C61381J904J864J79r98j292j917k249o58J740K186P84L9L28k84k054l194
57950C57759l311l627m031l285j872j281r80O62K962L857L611M174N480N834N482
57935C71434O263Q038Q924Q668Q535Q281O484L491Q61j549m800p958r264r483
57921C97925j0624j2069j1544r330p795p254n916l661k204j746r94k55r25k201
57907C21407j858j32P45O30J340K620K129k78k021j940j470j310m24J170J932
57892C22540J758K221L455L840L142K872L208K770J754J996L450L910K808K014
$$ y = [449370, 451298, 452936, 452685, 450260, 447305, 443975, 438308, 430236, 422783, 417843, 413998, 409861, 406202, 403292, 399604, 394859, 391122, 389053, 386252, 381216, 375855, 372127, 369164, 365791, 363047, 361995, 361630, 361064, 361381, 363285, 365149, 365328, 364330, 363038, 361121, 358872, 358214, 359954, 362140, 362924, 362963, 363291, 363007, 360953, 357759, 354448, 350821, 346790, 343505, 341633, 340352, 339372, 340034, 342996, 346853, 350464, 354638, 360118, 365952, 371434, 377697, 385735, 394659, 403327, 411862, 420143, 426627, 430118, 430979, 429430, 424630, 416672, 407408, 397925, 387301, 375232, 363688, 354358, 346563, 339309, 333393, 329732, 327528, 325782, 324788, 324533, 323608, 321407, 319549, 319417, 320162, 320792, 322132, 324752, 326881, 326603, 324582, 322642, 321172, 319862, 319438, 320608, 322540, 324298, 326519, 329974, 333814, 336956, 339828, 343036, 345806, 347560, 349556, 353006, 356916, 359724, 361738]
57878C61738K230J868L27q19q50j101k137k615j977j513j746j435k12M01l03r72
57862C50884o75k97m32j79Q82J644J472J331K014K903L285L227K707J490J65l52
57846C70069l93r10j495j095l05n95j495j193J49N35l05m63O92J547J266J016
57830C67025J413J463Q68Q41J804K617K793L147L662L166J751J057J411J249K5
57815C94292r43j315k678n572q163r041r049r175q997q353q260q890q759p156
57801B97941n422m668m209l331k620k411j883q17l53q99j132j42J190J908K256
57786B75408K358J607L14J04J524L104L668L799M109M071L581L685M619N000M073
57771C21024K967K610K231J080j22p19j355k510l413l538l574l861l496k125r04
$$ y = [361738, 363968, 365836, 366163, 365344, 364494, 363393, 361256, 358641, 356664, 355151, 353405, 351970, 351758, 352159, 351856, 350884, 350209, 349912, 349480, 349301, 350183, 351827, 353299, 354630, 356644, 359547, 362832, 366059, 368766, 370256, 370421, 370069, 369676, 368766, 367271, 366176, 365871, 365276, 363781, 362588, 362737, 363272, 362967, 362504, 363196, 364743, 366009, 367025, 368438, 369901, 370769, 371610, 373414, 376031, 378824, 381971, 385633, 388799, 390550, 391607, 393018, 394267, 394292, 393349, 392034, 389356, 383784, 375621, 366580, 357531, 348356, 339359, 331006, 322746, 313856, 305097, 297941, 292519, 287851, 283642, 280311, 277691, 275280, 273397, 272580, 272227, 271328, 270196, 270054, 271244, 273152, 275408, 277766, 279373, 279687, 279791, 281315, 284419, 288087, 291886, 295995, 300066, 303647, 307332, 311951, 316951, 321024, 323991, 326601, 328832, 329912, 329790, 329071, 327716, 325206, 321793, 318255, 314681, 310820, 307324, 305199, 304295]
57756C04295n94l00P26J695J883J978K600L014K611K244K804L721M017L721L195
57741C37610K313J199N54M25k7q89j101l72J00m40j232j669k257l038k898j481
57725C26797j81j5k03J30M25P4k35K25R95J488J918K260J804O86K75J007J406
57708C38856M01r80j311o32L94J632K755K917K223J972K521K614J737J094J203
57693C57396N81j632l809m271l821m002m545m432m039m187m266l205j420r8O50
57678C14900J490K653M209O627R829J2800J5214J8260K2800K8158L3870M0960
57666E11770M9698N7247N9085N2107L5794J2283j3242l4135m6481n1185n1061
57655E81880m7575m1670l5540l1061k7708k4070k0283j7145j4193j0820q117p300
$$ y = [304295, 303701, 303401, 304127, 305822, 307705, 309683, 312283, 315297, 317908, 320152, 322956, 326677, 330694, 334415, 337610, 339923, 341122, 341676, 342101, 342074, 341185, 340084, 339712, 339812, 339372, 338140, 336471, 334214, 331176, 328278, 326797, 326616, 326601, 326398, 326528, 326953, 327027, 326792, 327017, 328012, 329500, 331418, 333678, 335482, 336168, 336443, 337450, 338856, 339257, 338277, 336966, 336334, 336728, 338360, 341115, 344032, 346255, 348227, 350748, 353362, 355099, 356193, 357396, 357977, 356345, 352536, 348265, 344444, 340442, 335897, 331465, 327426, 323239, 318973, 315768, 314348, 314250, 314900, 316390, 319043, 323252, 329879, 339708, 352508, 367722, 385982, 408782, 436940, 470810, 511770, 561468, 618715, 677800, 729907, 765701, 777984, 764742, 730607, 684126, 632941, 581880, 534305, 492635, 457095, 426034, 398326, 374256, 353973, 336828, 322635, 311815, 303698, 296398]
57643B96398p295o141m028k770k804k911k512k152j981j508p96l61o9M67Q78O52
57627B63067K41K23j3j219k662l044k491k136k219k072j605j314j212j003q71
57612B41670r74p86qN30J21n35m76j6J44L22Q93J024J2j051p73J92J66q74j566
57593B38015j529j530j667j332p43q24j550j977j807j576j483j275j065j074r36
57578B17647m23k19p79j207o41J5o05k003k609k281k170k496k381j696j259j204
57562A95689q40j67O2k30l12jJ87J58L02O00P24P82R32P73K10K20J388K449J886
57543B04812L16m01J23Q19J342K211L015K552Q90m78o67j60M88J073J063P5r77
57526B16096q05K49O61P1m73n16o04o50K39J966L169L148K562J954J075J5m79
$$ y = [296398, 289103, 282962, 278934, 276164, 273360, 270449, 267937, 265785, 263804, 262296, 261500, 261139, 261070, 261537, 262415, 263067, 263308, 263531, 263518, 262299, 259637, 256593, 254102, 251966, 249747, 247675, 246070, 244756, 243544, 242541, 241670, 240696, 239910, 239902, 240432, 240553, 240018, 239542, 239526, 239670, 239992, 240885, 241909, 241921, 240870, 240097, 240289, 240455, 239581, 238015, 236486, 234956, 233289, 231957, 231214, 230390, 228840, 226863, 225056, 223480, 221997, 220722, 219657, 218583, 217647, 217224, 217005, 216226, 215019, 214378, 214393, 213788, 211785, 209176, 206895, 204725, 202229, 199848, 198152, 196893, 195689, 194849, 194682, 194744, 194514, 194202, 194201, 194388, 194546, 194848, 195448, 196172, 196954, 197886, 198659, 198869, 199089, 200477, 202926, 204812, 205128, 204727, 204850, 205669, 207011, 209222, 212237, 214789, 215679, 215201, 214534, 214374, 214862, 215935, 216998, 217073, 216096, 215291, 215540, 216201, 216272, 215799, 215283, 214679, 214029, 214268, 216234, 219403, 222551, 225113, 227067, 228142, 228157, 227678]
57509B27678k99j96l78j75N61J015Q26O63R71J207Q03r7j156k193k796k571j937
57492B21926j752k036j987j326o65m69n81q14j077r58j27R27J353J046M70k23
57476B13707r60j142m29K66j62j299j824j492j174j262j421j609j935j780n57
57461A96927Q81J118K82k43O1N85J128J951K420J463m56j551j117j89L44O12O87
57444B04903K75j86K22J278J709J163O25O62P50N97O08P44M33j31q4M90N40j08
57426B14490m41m3L48M13P06J228J137L60m9L71Q51R02R47J048N70m19q44k59
57408B21316O05J238J793J932Q71q92j648q46J14P4m98q57j068j066l01Q99J208
57391B22874L30l05K97J352J904K247K757K814K005J149J006J129R32Q18J265
$$ y = [227678, 227379, 227183, 226805, 226630, 227191, 228206, 229032, 229695, 230666, 231873, 232676, 232579, 231423, 229230, 226434, 223863, 221926, 220174, 218138, 216151, 214825, 214160, 213691, 213110, 212296, 211219, 210261, 210134, 211061, 212414, 213460, 213930, 213707, 212747, 211605, 211176, 211442, 211280, 209981, 208157, 206665, 205491, 204229, 202808, 201199, 199264, 197484, 196927, 197808, 198926, 199208, 198965, 199026, 199611, 200739, 202690, 205110, 206573, 206117, 204566, 203449, 203260, 203604, 204216, 204903, 205178, 204992, 205214, 206492, 208201, 209364, 209989, 210651, 211401, 211998, 212606, 213350, 213783, 213652, 213568, 214058, 214598, 214490, 214049, 214006, 214354, 214767, 215473, 216701, 217838, 218198, 218149, 218520, 219371, 220273, 221220, 222268, 222838, 222419, 221575, 221316, 221921, 223159, 224952, 226884, 227755, 226863, 225215, 224369, 224483, 224557, 224059, 223202, 222134, 221068, 220767, 221666, 222874, 223204, 222899, 223196, 224548, 226452, 228699, 231456, 234270, 236275, 237424, 238430, 239559, 240491, 241309, 242574]
57376B42574J813J899J726J482P33n67j430j176m91m01q72j205j052n12J67N77
57360B43265N23M81R61J489J365J196K109L488L413J652K77O85J865K390K378
57345B67537K422K288J723J270J225J079P20Q65J587J798J112O04R43J291R67
57330B87431O99J112J525J284Q92P69L69m26o02J65N54k61j076o24L95P50O93
57313B93649R75J151N34k16j00N60R25J184J915K713K864K586K379K040J461J401
57297C16021K196K773K272J579J868K638K694K168K009K278K483K801L537L978
57283C51295L331K243K009K725L448L684L646L521L553M202N333O040O065O449
57269D07544P784Q928Q670P554O803O492O209O433P678R070R374Q832Q544Q782
$$ y = [242574, 244387, 246286, 248012, 249494, 250227, 249660, 248230, 247054, 246563, 246162, 245290, 244085, 243033, 242521, 242688, 243265, 243788, 244269, 245230, 246719, 248084, 249280, 251389, 254877, 258290, 259942, 260219, 260904, 262769, 265159, 267537, 269959, 272247, 273970, 275240, 276465, 277544, 278264, 279129, 280716, 282514, 283626, 284230, 285173, 286464, 287431, 288130, 289242, 290767, 292051, 292943, 293712, 294081, 293655, 293053, 293218, 293772, 293511, 292435, 291811, 292206, 292956, 293649, 294624, 295775, 296309, 296093, 295993, 296553, 297478, 298662, 300577, 303290, 306154, 308740, 311119, 313159, 314620, 316021, 318217, 320990, 323262, 324841, 326709, 329347, 332041, 334209, 336218, 338496, 340979, 343780, 347317, 351295, 354626, 356869, 358878, 361603, 365051, 368735, 372381, 375902, 379455, 383657, 388990, 395030, 401095, 407544, 415328, 424256, 432926, 440480, 447283, 453775, 459984, 466417, 474095, 483165, 492539, 501371, 509915, 518697]
57255E18697R099R454R857R727Q795P895P646P338O418N946P036Q803R575R263
57241F35549Q958Q995R059R423J0358J1038J0694J0199J0869J2358J3390J3772
57229G64662J4043J3883J2736J1419J1200J1810J2124J2226J2952J3930J4033
57218I05018J3424J3285J3823J4337J4865J5969J7214J7721J7866J8636J9702
57207A081860K0020J9995K0944K2559K3098K2178K1348K1653K2495K3170K3819
57196A323139K4516K4941K5193K5543K5412K4102K2371K1671K1876K1503K0171
57185A580438J8991J8482J7902J6978J6512J6882J7424J7719J8120J8761J9363
57174A777572K0160K1732K3809K5569K7054K8866L0598L1201L0904L1082L2067
$$ y = [518697, 527796, 537250, 547107, 556834, 565629, 573524, 581170, 588508, 594926, 600872, 607908, 616711, 626286, 635549, 644507, 653502, 662561, 671984, 682342, 693380, 704074, 714273, 725142, 737500, 750890, 764662, 778705, 792588, 805324, 816743, 827943, 839753, 851877, 864103, 877055, 890985, 905018, 918442, 931727, 945550, 959887, 974752, 990721, 1007935, 1025656, 1043522, 1062158, 1081860, 1101880, 1121875, 1142819, 1165378, 1188476, 1210654, 1232002, 1253655, 1276150, 1299320, 1323139, 1347655, 1372596, 1397789, 1423332, 1448744, 1472846, 1495217, 1516888, 1538764, 1560267, 1580438, 1599429, 1617911, 1635813, 1652791, 1669303, 1686185, 1703609, 1721328, 1739448, 1758209, 1777572, 1797732, 1819464, 1843273, 1868842, 1895896, 1924762, 1955360, 1986561, 2017465, 2048547, 2080614]
57163B080614L2783L2716L2614L2938L3218L3300L3695L4405L4848L5102L5804
57152B452037L6588L6307L5007L4099L4212L4456L4197L3979L4200L4345L4042
57141B833469L3637L3328L2955L2917L3829L5126L5333L4071L2464L1368L0568
57130C199065K9906K9673K9648K9224K8799K9524L1409L3249L4695L6950M0907
57119C553049M6187N2282N9246O6832P4411Q2135R0849J00729J11425J23750J39605
57108D500500J59888J83958K11356K42547K77925L18003L65022M22666M93634
57099G175499N78799O78930P95958R32709J093195J282957J506684J764436K050781
57090A7859948K356544K669072K971536L244810L470576L631626L711484L696657
$$ y = [2080614, 2113397, 2146113, 2178727, 2211665, 2244883, 2278183, 2311878, 2346283, 2381131, 2416233, 2452037, 2488625, 2524932, 2559939, 2594038, 2628250, 2662706, 2696903, 2730882, 2765082, 2799427, 2833469, 2867106, 2900434, 2933389, 2966306, 3000135, 3035261, 3070594, 3104665, 3137129, 3168497, 3199065, 3228971, 3258644, 3288292, 3317516, 3346315, 3375839, 3407248, 3440497, 3475192, 3512142, 3553049, 3599236, 3651518, 3710764, 3777596, 3852007, 3934142, 4024991, 4125720, 4237145, 4360895, 4500500, 4660388, 4844346, 5055702, 5298249, 5576174, 5894177, 6259199, 6681865, 7175499, 7754298, 8433228, 9229186, 10161895, 11255090, 12538047, 14044731, 15809167, 17859948, 20216492, 22885564, 25857100, 29101910, 32572486, 36204112, 39915596, 43612253]
57082D3612253L575209L325810K911674K301829J511950O22686k51230j015975
57074E6594206j630247k097874k443805k696487k878983l004032l074367l088996
57066C5679415l049637k962163k834713k676033k494722k298959k096789j895971
57058A5370428j702483j519477j348742j192756j054218r33895q30012p39619
57050F049226o59717n87738n22179m62786m09483l61696l19195k82643k52187
57041B191602k26367k03414j82698j63878j45741j27195j08496r0183p1732n2547
57031H19351l2957j2723R532L2292M7382M4166J9422j8251n4512p8825q8654q7310
57019E98913p9985p0949o2421n4877m8121m2000l6497l1675k7565k3969k0522
$$ y = [43612253, 47187462, 50513272, 53424946, 55726775, 57238725, 57861411, 57610181, 56594206, 54963959, 52866085, 50422280, 47725793, 44846810, 41842778, 38768411, 35679415, 32629778, 29667615, 26832902, 24156869, 21662147, 19363188, 17266399, 15370428, 13667945, 12148468, 10799726, 9606970, 8552752, 7618857, 6788845, 6049226, 5389509, 4801771, 4279592, 3816806, 3407323, 3045627, 2726432, 2443789, 2191602, 1965235, 1761821, 1579123, 1415245, 1269504, 1142309, 1033813, 943630, 871898, 819351, 786394, 773671, 783203, 815495, 862877, 907043, 926465, 908214, 853702, 774877, 686223, 598913, 518928, 447979, 385558, 330681, 282560, 240560, 204063, 172388, 144823, 120854, 100332]
57008A00332j7173j4233j1788r680q161p708p882p378n855m605A231c889m728
56995h617l526k430j588n78M67J231K203M026b463E934J0344J2942J6065J8528
56981F3813J9019J6583J0849K809n164j1007j4318j5527j4749j2486j0298r275
56969B0249q567D912H17h55c66B845O276Q738J0749J3405J6873K0280K3321K6258
56955A28745K8108K6539K0170R981j680j2362j9839k2801k1956j9558j7337j5370
56943H2640j2947r733n963k339K30J557K879N825J0699J6409K1960K7169L1941
56930A70327L5619L6999L4416K6390J3295j777j4852k3868k9047l1109l0455k7907
56918A58031k4843k2044j9350j6582j4052j2002j0334r097q468q124E817H3c688
$$ y = [100332, 83159, 68926, 57138, 47458, 39297, 31589, 23707, 16329, 10474, 5869, 1231, -3889, -8617, -12143, -14573, -16161, -16739, -16272, -15041, -12838, -8812, -2463, 5934, 16278, 29220, 45285, 63813, 82832, 99415, 110264, 113073, 107909, 96902, 82584, 67057, 52308, 39822, 29524, 20249, 11682, 4912, 817, -855, -366, 2845, 9121, 17859, 28608, 42013, 58886, 79166, 102487, 128745, 156853, 183392, 203562, 213543, 211863, 199501, 179662, 156861, 134905, 115347, 98010, 82640, 69693, 59960, 53997, 51658, 51888, 53445, 56324, 62149, 72848, 89257, 111217, 138386, 170327, 205946, 242945, 277361, 303751, 317046, 315269, 300417, 276549, 247502, 216393, 185938, 158031, 133188, 111144, 91794, 75212, 61160, 49158, 38824, 29727, 21259, 13135, 5817, 83, -3688]
56904e621m30O61J429a768A337L917M453N061O061P269Q553J0238J2274J3761
56890G2924J4237J4771J6742K0016K3344K5950K7431K6596K1940J3428K892p251
56878B73020j4958j8850j8934j6953j4866j2993j0480p131l613j87L497P423J1346
56865A76321J5741K1437K8325L5580M3112N1427N9833O5737O5865N7727M0634
56854F61739J6920p947k8026m0303m5168m4338l9678l3459k7608k2197j5991q690
56842C65254j318N737J3486K2746L3112M4016N5622O8182Q1451R4653J05482J08754
56830I97177R8106P0883L1349j1277m7747p2492q4690q7216q4087p7910o9546
56819F62550n9576m8972l8306k7509j6851p140J447R811J8790K8383L8558M9826
$$ y = [-5621, -6051, -5390, -3961, -1768, 1337, 5254, 9707, 14768, 20829, 28098, 36651, 46889, 59163, 72924, 87161, 101932, 118674, 138690, 162034, 187984, 215415, 242011, 263951, 277379, 280271, 273020, 258062, 239212, 220278, 203325, 188459, 175466, 164986, 157855, 154242, 154055, 157552, 164975, 176321, 192062, 213499, 241824, 277404, 320516, 371943, 431776, 497513, 563378, 621105, 661739, 678659, 670712, 642686, 602383, 557215, 512877, 473199, 439740, 412132, 389935, 373944, 365254, 363936, 369673, 383159, 405905, 439017, 483033, 538655, 606837, 688288, 782941, 888423, 997177, 1095283, 1166166, 1197515, 1186238, 1138491, 1065999, 981309, 894093, 810006, 732096, 662550, 602974, 554002, 515696, 488187, 471336, 464196, 465643, 475454, 494244, 522627, 561185, 611011]
56807F11011O2077P3093P8551P3658N5615K6079q402l9374o0996p2128p4847p2073
56795F52264o6351n9398n1890m4013l6192k8847k1727j4454p543j786L225Q861
56783C32149J5669K2931K9907L6055L9719L8101K9409J4558l416k0806l4312m2197
56771D57767m5144m5198m3535m0089l5239l0451k6697k3495k0162j7037j4765
56760A15955j3195j1724j0188q854p980p644p567p054n737m252l496l351l066
56747B1847k604k479k405j559k50J64o58j512j552j305j197o03P94J993J986J165
56731A1825M74J8o34j444j993k052j494k50J252K173K257K131K268K403K182J713
56715B0829J162O06M84J296K563L079K568K141K618L366L292K204O85o23j212
$$ y = [611011, 673088, 746181, 824732, 898390, 954005, 980084, 971682, 932308, 871312, 799184, 724337, 652264, 585913, 526515, 474625, 430612, 394420, 365573, 343846, 329392, 321849, 320063, 323288, 332149, 347818, 370749, 400656, 436711, 476430, 514531, 543940, 558498, 555082, 534276, 499964, 457767, 412623, 367425, 323890, 283801, 248562, 218111, 191414, 167919, 147757, 130720, 115955, 102760, 91036, 80848, 71994, 64014, 56370, 48803, 41749, 36012, 31760, 28264, 24913, 21847, 19243, 16764, 14359, 12800, 12550, 12714, 12056, 10544, 8992, 7687, 6490, 5887, 6681, 8674, 10660, 11825, 12299, 12317, 11683, 10239, 8246, 6194, 4700, 4450, 5702, 7875, 10132, 12263, 14531, 16934, 19116, 20829, 21991, 22597, 23081, 24377, 26940, 30019, 32587, 34728, 37346, 40712, 44004, 46208, 46893, 46270, 45058]
56700D5058q51KM92L36n5l43m53j38P21J469J358P91P59J224J342J103J226J459
56682E5500P84n66j068l15M22M32N42J133J146O7q98p77l57n95j018q97o50p73
56664E2112o84L8N09M5m30J72J212J355O47J51K26M59O61P52K81q16j591j269
56646E3830m05J08M34J097J662J367N46K48O86J111R64M06OL60J547K585K232
56629F8784P07l57k37j10r97j990j765p08j84m12n02p8L71M26N6o56j369j476
56611E9503r15m54n96q88q73q29r22n80M38J262J111M84L42Q39J627K490L000
56594F5039K488J161K23J63M5p21j220o87L8n0m39j90L91N35N56J100J744J618
56576G1794Q19k3p69j292q59P25K316K941L179L862M494M306L848M075M782N431
$$ y = [45058, 44207, 44209, 44701, 45037, 44982, 44639, 44186, 44048, 44769, 46238, 47596, 48387, 49146, 50370, 51712, 52815, 54041, 55500, 56284, 55718, 54650, 54335, 54757, 55189, 55731, 56864, 58010, 58077, 57179, 56402, 56045, 55450, 54432, 53535, 52885, 52112, 51428, 51466, 51975, 52020, 51590, 51762, 52974, 54329, 54976, 55127, 55353, 55812, 56473, 57225, 57506, 56690, 55099, 53830, 53425, 53533, 53967, 55064, 56726, 58093, 58639, 58887, 59573, 60684, 61648, 62054, 62060, 62420, 63967, 66552, 68784, 69491, 69134, 68897, 68787, 67790, 65800, 64035, 63327, 63143, 62731, 62229, 62151, 62522, 62948, 63004, 62348, 60979, 59503, 58588, 58134, 57538, 56650, 55777, 54948, 54026, 53446, 53884, 55146, 56257, 56741, 57083, 57922, 59549, 62039, 65039, 67527, 68688, 68911, 69074, 69119, 68398, 67178, 66491, 66529, 66479, 66040, 65850, 66241, 66776, 67332, 68432, 70176, 71794, 72613, 72590, 71821, 70529, 69670, 70395, 72711, 75652, 78831, 82693, 87187, 91493, 95341, 99416, 104198, 109629]
56560A09629O517Q507J0349J0683R691Q255O257L432R37R1L13J86j43L40J135
56545A76179P73o30j511j435j465j976k144j779j793k537l177l151k875k761k707
56530A47011k747l107l531l551l296l115k671j528k33K97J10j58n34j314j953
56515A19680j778j289j434j924j775j063o65o04k20K77P3o65r99r04j160j678
56499A03872j510n65J50J38o5l5M8J37M25P38P91Q25J133J268Q01K84L89O46K98
56480A09768k50j70K68L22K44O41J030P04L13Q41J598J156k04q59l49L53P16R48
56462A17070P66j89r59k96J179J722J153P96R96Q18J49n1L46M98M33J022J983
56445A27436J984Q85r2m52p99r88j73J192J492M87l59m10n79j212j358p21k88
$$ y = [109629, 116146, 124653, 135002, 145685, 155376, 163631, 169888, 173320, 174257, 174348, 174661, 174847, 174704, 175044, 176179, 176952, 176322, 174811, 173376, 171911, 169935, 167791, 166012, 164219, 161682, 158505, 155354, 152479, 149718, 147011, 144264, 141157, 137626, 134075, 130779, 127664, 124993, 123465, 123232, 123529, 123639, 123481, 122947, 121633, 119680, 117902, 116613, 115179, 113255, 111480, 110417, 109752, 109148, 108928, 109205, 109278, 108613, 107614, 106710, 105550, 103872, 102362, 101797, 101947, 102085, 102020, 101985, 102033, 102170, 102595, 103333, 104124, 104949, 106082, 107350, 108151, 108435, 108824, 109470, 109768, 109518, 109348, 109616, 109938, 110182, 110823, 111853, 112557, 112870, 113711, 115309, 116465, 116261, 115402, 115053, 115406, 116122, 117070, 117836, 117647, 116688, 116392, 117571, 119293, 120446, 121242, 122238, 123056, 123205, 123154, 123500, 123998, 124431, 125453, 127436, 129420, 130305, 130213, 129761, 128962, 127974, 127801, 128993, 130485, 130972, 130613, 130203, 129624, 128412, 127054, 126333, 126045]
56428A26045l92r4Q79J465J192R21J086R85M19K31O03N73j32n21k20j06m20j01
56410A32413J174K053J551M97or0k93m97m89m81m47rO29P78N05N48Q89Q15M11
56391A39951M75Q81P83M71J110K470K848J723N23L55P59J191J845K514K469J971
56375A62339K116K768K507J035k13l47m7R6L63O40L35j30K80J064O53o79q65N48
56357A72463J551R77J04R4L86O28J663L379L942K614J073O70N08l42r53m26L24
56340A88655K33j39J12P71J439K338L155K938K013K041L213L599K366J302J862
56325B15898K984L315L341L630L168J345l41m54J67R2l88k44M50J167J992K776
56309B38898K710J915J808K837L646L524L561M326M644M035L966N073N636M532
$$ y = [126045, 125653, 125559, 126438, 127903, 129095, 130016, 131102, 132087, 132506, 132737, 133340, 133913, 133781, 133260, 133040, 132934, 132514, 132413, 133587, 135640, 137191, 137688, 137682, 137592, 137299, 136802, 136313, 135832, 135385, 135376, 136005, 136783, 137288, 137836, 138725, 139540, 139951, 140426, 141307, 142090, 142561, 143671, 146141, 148989, 150712, 151235, 151590, 152349, 153540, 155385, 157899, 160368, 162339, 164455, 167223, 169730, 170765, 170552, 170205, 170158, 170254, 170617, 171257, 171592, 171462, 171742, 172806, 173459, 172780, 171915, 172463, 174014, 174991, 175095, 175189, 175575, 176203, 177866, 181245, 185187, 187801, 188874, 189544, 190052, 189710, 188757, 188331, 188655, 188888, 188749, 188861, 189632, 191071, 193409, 196564, 199502, 201515, 203556, 206769, 210368, 212734, 214036, 215898, 218882, 222197, 225538, 229168, 232336, 233681, 233340, 232886, 233053, 233145, 232757, 232513, 232963, 234130, 236122, 238898, 241608, 243523, 245331, 248168, 251814, 255338, 258899, 263225, 267869, 271904, 275870, 280943, 286579, 291111]
56295B91111L384L755M513M183L723M565N799N763M937M932N826O647P191P580
56281C63909P283O355O227P627R139R405R189R719J0725J1626J2830J4310J4843
56268D93187J4381J5055J7927K0928K2075K2597K4619K7825L0832L3957L8130
56257G61513M2768M7188N2478N9649O7537P4878Q2675R2106J01830J09943J17011
56246A609576J24480J31585J36512J39256J40644J39718J34724J25739J13923
56237B796157R9195Q0839N9523L6624J2709j1561l4333n4189p1495q6538r8219
56226B728712j06293j12648j18293j21370j20500j17682j15211j12144j06781
56217A697790j00353r4922q9666q2739p5075o8945o4189n9215n4346n0804m7754
$$ y = [291111, 294495, 298250, 302763, 306946, 310669, 315234, 321033, 326796, 331733, 336665, 342491, 349138, 356329, 363909, 371192, 377547, 383774, 391401, 400540, 409945, 419134, 428853, 439578, 451204, 464034, 478344, 493187, 507568, 522623, 540550, 561478, 583553, 606150, 630769, 658594, 689426, 723383, 761513, 804281, 851469, 903947, 963596, 1031133, 1106011, 1188686, 1280792, 1382622, 1492565, 1609576, 1734056, 1865641, 2002153, 2141409, 2282053, 2421771, 2556495, 2682234, 2796157, 2895352, 2976191, 3035714, 3072338, 3085047, 3073486, 3039153, 2984964, 2913469, 2826931, 2728712, 2622419, 2509771, 2391478, 2270108, 2149608, 2031926, 1916715, 1804571, 1697790, 1597437, 1502515, 1412849, 1330110, 1255035, 1186090, 1121901, 1062686, 1008340, 957536, 909782]
56206I09782m3592l9015l5664l2959k9421k5738k3433k1806j9358j6855j5751
56195F06190j5015j2905j0455r679r697q276o006n223n775n578m507m137m305
56182E04632l535k161j710j796r39L52N53K40R91K113J822P41Q08J742J922J769
56166E07544K806M408M962N127O384P640P061O029P213R839J1054J0951J2072
56153F03090J4622J6552J7767K0046K3236K5665K7881L1943L7484M2542M7675
56142I08503N5168O4602P3375Q0959Q8376R3982R4346Q9153Q1199P1976O1481
56131A763120N1867M6452M5009M4085M1772L8246L2367K2550J0818J395m782j0066
56119B082833j5375k0069k5999l6485n1100o5926p8815q9938r7664r9122r4926
$$ y = [909782, 866190, 827175, 791511, 758552, 729131, 703393, 679960, 658154, 638796, 621941, 606190, 591175, 578270, 567815, 558136, 548439, 540163, 534157, 528934, 523159, 517581, 513074, 508937, 504632, 501097, 498936, 497226, 495430, 494491, 494843, 495396, 495636, 496627, 498740, 500562, 501303, 502111, 503853, 505775, 507544, 510350, 514758, 519720, 524847, 531231, 538871, 545932, 551961, 559174, 569013, 580067, 591018, 603090, 617712, 634264, 652031, 672077, 695313, 720978, 748859, 780802, 818286, 860828, 908503, 963671, 1028273, 1101648, 1182607, 1270983, 1364965, 1459311, 1548464, 1629663, 1701639, 1763120, 1814987, 1861439, 1906448, 1950533, 1992305, 2030551, 2062918, 2085468, 2096286, 2097681, 2092899, 2082833, 2067458, 2047389, 2021390, 1984905, 1933805, 1867879, 1789064, 1699126, 1601462, 1502340, 1407414]
56108A407414q8495q0748p0259n8371m8840m2282l5905k9009k3732k0379j6900
56097H92494j3140j0777r188o319l172k327k618q10K180K731J436K186M742N097
56083H62515L225L377O260P940P346P826J0147J1028R871J0089J2309J3035J1631
56070I76599J1774J4341J5606J4344J3986J5905J7063J6230J6010J7027J6622
56059A145507J4960J5581J8296J8519J5434J3695J5158J6187J5186J5308J7503
56048A321334J8321J7018J7451K0480K1967K0722K0854K3760K5529K4836K5506
56037A557778K8559K9777K8029K7936L1295L3936L3988L5021L8082L9212L7820
56026A921433L8708M2628M3978M1267M0426M4106M7262M7271M8712N3817N7919
$$ y = [1407414, 1318919, 1238171, 1167912, 1109541, 1060701, 1018419, 982514, 953505, 929773, 909394, 892494, 879354, 868577, 859389, 853070, 849898, 847571, 844953, 844143, 846323, 849054, 850490, 852676, 857418, 862515, 865740, 869117, 875377, 883317, 890663, 898489, 908636, 919664, 929535, 939624, 951933, 964968, 976599, 988373, 1002714, 1018320, 1032664, 1046650, 1062555, 1079618, 1095848, 1111858, 1128885, 1145507, 1160467, 1176048, 1194344, 1212863, 1228297, 1241992, 1257150, 1273337, 1288523, 1303831, 1321334, 1339655, 1356673, 1374124, 1394604, 1416571, 1437293, 1458147, 1481907, 1507436, 1532272, 1557778, 1586337, 1616114, 1644143, 1672079, 1703374, 1737310, 1771298, 1806319, 1844401, 1883613, 1921433, 1960141, 2002769, 2046747, 2088014, 2128440, 2172546, 2219808, 2267079, 2315791, 2369608, 2427527]
56015B427527N8804O0892O5820O8842O8899P1876P9305Q4538Q5010Q7199R4433
56004C253145J01031J03959J08762J18166J26526J31382J38550J49918J58624
55995D390063J62379J68671J80471J90398J95610K04181K19654K34125K44151
55986F189703K58176K80142L01765L19484L42349L74196M05682M33418M68508
55977I373423N16037N65660O13359O71775P47317Q29002R12606J012649J137077
55968A6378905J275361J426644J612960J848679K125976K447759K842818L329142
55960C3288244L897979M556171N344959O292863P396317Q678729J0222799J2115456
55952I1793517J4418223J7220917K0643543K4737652K9457614L4676952L9863865
$$ y = [2427527, 2486331, 2547223, 2613043, 2681885, 2750784, 2822660, 2901965, 2986503, 3071513, 3158712, 3253145, 3354176, 3458135, 3566897, 3685063, 3811589, 3942971, 4081521, 4231439, 4390063, 4552442, 4721113, 4901584, 5091982, 5287592, 5491773, 5711427, 5945552, 6189703, 6447879, 6728021, 7029786, 7349270, 7691619, 8065815, 8471497, 8904915, 9373423, 9889460, 10455120, 11068479, 11740254, 12487571, 13316573, 14229179, 15241828, 16378905, 17654266, 19080910, 20693870, 22542549, 24668525, 27116284, 29959102, 33288244, 37186223, 41742394, 47087353, 53380216, 60776533, 69455262, 79678061, 91793517, 106211740, 123432657, 144076200, 168813852, 198271466, 232948418, 272812283]
55945B72812283M3417759M2611943L5006622K0551138K326155j5054250k8006726
55938C73664924l5346387l7830478l6962250l4179505l0573828k6824335k3246291
55931A48701850j9961992j7046851j4535554j2392043j0556695r000862p703067
55924E7504786o613020n680075m888292m231038l678303l198276k785885k442591
55916B3987306k150102j888624j660405j472006j311828j165971j038511r36254
55908A2363605q49626p67230o93912o36811n87927n37133m89007m50998m17701
55899F933260l81740l47983l22614k99761k72690k47068k29864k15755j97460
55890D418325j79261j67596j57977j43633j28336j18815j12926j06402j02846
$$ y = [272812283, 316230042, 358841985, 393848607, 414399745, 416725900, 401671650, 373664924, 338318537, 300488059, 263525809, 229346304, 198772476, 171948141, 148701850, 128739858, 111693007, 97157453, 84765410, 74208715, 65207853, 57504786, 50891766, 45211691, 40323399, 36092361, 32414058, 29215782, 26429897, 23987306, 21837204, 19948580, 18288175, 16816169, 15504341, 14338370, 13299859, 12363605, 11513979, 10746749, 10052837, 9416026, 8828099, 8290966, 7801959, 7350961, 6933260, 6551520, 6203537, 5880923, 5581162, 5308472, 5061404, 4831540, 4615785, 4418325, 4239064, 4071468, 3913491, 3769858, 3641522, 3522707, 3409781, 3303379, 3200533]
55881C200533j05965j09843j07634j02482r9808r6584q8447p9836p6791p6340
55871B256803p2916o8606o7578o6714o1480n5046n2328n0751m5949m0983m0860
55860A633592m3138m2687m0793m1053m1236l7669l3070l1798l1739k8849k5354
55849A236206k5512k7371k6608k4668k5402k7226k6168k3387k2555k2900k1581
55838I62828j9761j9848j9980j7548j4911j5384j6880j5667j3045j2203j1931
55827G85670r654p292p884r560r084q136r925j2667j2632j0885j0821j1753j0947
55814F54430r369r477r809p649m543l595l742k336p19j444k528l54L860O277O917
55799F15919Q307R746Q671N904M145K860j39l891o020p343r703j1400r875o947
$$ y = [3200533, 3094568, 2984725, 2877091, 2774609, 2674801, 2578217, 2489770, 2409934, 2333143, 2256803, 2183887, 2115281, 2047703, 1980989, 1919509, 1864463, 1812135, 1761384, 1715435, 1674452, 1633592, 1590454, 1547767, 1506974, 1465921, 1424685, 1387016, 1353946, 1322148, 1290409, 1261560, 1236206, 1210694, 1183323, 1156715, 1132047, 1106645, 1079419, 1053251, 1029864, 1007309, 984409, 962828, 943067, 923219, 903239, 885691, 870780, 855396, 838516, 822849, 809804, 797601, 785670, 776016, 768724, 760840, 751280, 742196, 734060, 724135, 711468, 698836, 687951, 677130, 665377, 654430, 645061, 635584, 625775, 618126, 613583, 609988, 606246, 603910, 603191, 601747, 599219, 598865, 602725, 609002, 615919, 624226, 633972, 642643, 648547, 652692, 655552, 655413, 651522, 645502, 638159, 628456, 617056, 607181, 600234]
55785F00234o194p253p708q353j1120j3910j3215j0082p939o312k274L524Q095
55772E17493J1806J6837K1017J9221J0620n68j0846j9072k3473k2584j8804j6175
55760D85472j5012j3056j0701j0104j0319q664o117o034q159r154q574q926j0173
55747C60479r618p307o233o851o404m178k579k434j893o08o23k382l921m548n477
55732B95423o422n591l330j993j965j557q93j846m009m811l893l437l883l367
55718B48426j707q70r85J33K925N305O456P630Q670P519L917J50k440m412n508
55703B75209m654k934k853m272m675l754l867n553o602o174n921o214n293l106
55689B09337k077k849l047j503j00q1lJ124J987J749J651K465L212L530M420N545
$$ y = [600234, 594040, 586787, 579079, 570726, 559606, 545696, 532481, 522399, 514460, 508148, 505874, 509398, 517493, 529299, 546136, 567153, 586374, 596994, 596426, 585580, 566508, 543035, 520451, 501647, 485472, 470460, 457404, 446703, 436599, 426280, 417616, 411499, 405465, 397306, 388152, 379578, 370652, 360479, 350861, 343554, 337321, 330470, 324066, 319888, 317309, 314875, 312982, 312374, 311751, 309369, 305448, 300900, 295423, 289001, 283410, 280080, 278087, 276122, 274565, 273672, 271826, 267817, 263006, 259113, 255676, 251793, 248426, 246719, 245849, 244864, 244997, 247922, 253227, 259683, 267313, 275983, 283502, 287419, 287569, 285129, 280717, 275209, 270555, 267621, 264768, 260496, 255821, 252067, 248200, 242647, 236045, 229871, 223950, 217736, 212443, 209337, 207260, 204411, 201364, 199861, 199761, 199680, 199677, 200801, 202788, 204537, 206188, 208653, 211865, 215395, 219815, 225360]
55673B25360M862K109l09j062j510k506k730j630r04j469j750o12O14O13J76L34
55657B19586P15J078K175L798M329L411K778L329L688K838J800J459J004k40j579
55642B50169k682m336o524p916q199q661r536r261p392n746n447n264m144l040
55628A62021k875k892k326j680j217l35O10J23j673k482j270J19J0q14j200j579
55612A42540k343k511j697j323k282l297l088k267j729j074p4K44n54j248j069
55597A18228r82j571j653m85O39N68J58M34P00J58l57J26R87J378J708K384K620
55580A25040J910J146J012Q81N96J381L634N609O006N993P084Q615R079Q334O853
55565A93173M374J069j527k560l347n087o665o645n921o218p169p058n639m203
$$ y = [225360, 230222, 232331, 232022, 230960, 229450, 226944, 224214, 222584, 221680, 220211, 218461, 217849, 218463, 219076, 219252, 219586, 220301, 221379, 223554, 227352, 231681, 235092, 237870, 241199, 244887, 247725, 249525, 250984, 251988, 251748, 250169, 247487, 243151, 236627, 228711, 220512, 211851, 202315, 193054, 185662, 179916, 174469, 169205, 165061, 162021, 159146, 156254, 153928, 152248, 151031, 150696, 151306, 151429, 149756, 147274, 146004, 146123, 146133, 145319, 144119, 142540, 140197, 137686, 135989, 134666, 132384, 129087, 125999, 123732, 122003, 120929, 120855, 121099, 120545, 119297, 118228, 117246, 115675, 114022, 113537, 114176, 114744, 114902, 115336, 116036, 116194, 115837, 115963, 116950, 118328, 120036, 122420, 125040, 126950, 128096, 129108, 129989, 130585, 131966, 135600, 141209, 147215, 153208, 160292, 168907, 177986, 186320, 193173, 197547, 198616, 197089, 194529, 191182, 186095, 179430, 172785, 166864, 160646, 153477, 146419, 140780, 136577]
55551A36577l473l216l338l768l775k784j400m96LM72O58L88K01L49K16l00k22
55534A16092P43J302O67J8M94J157O20o24j212j142j313j781k003k046k180k128
55518A06664j873k212l294l810k969k014k300l051k656j128K94J041J213O12o15
55503H3902j307o76M31R11J023J260R32n37k060k344j886j784j634m94J028J588
55487G8353J347J388J588J002j29o71n66o43q39l76M46M97k21m21M50J447J499
55470H4151N06r74k139k277j511r30j221j690j364m21M09J020J475J306M37j14
55454G6663L41Q62M05l48j32P77J159Q42M58m0r46j520r20J16K29l84n00j31l25
55435G6606j000r25J61J129J356J405J670J720J321Q47N19K44J45L15L02j79m43
$$ y = [136577, 133104, 129888, 126550, 122782, 119007, 116223, 114823, 114327, 114330, 114802, 115460, 115848, 116049, 116398, 116614, 116314, 116092, 116835, 118137, 118804, 118822, 119316, 120473, 121093, 120469, 119257, 118115, 116802, 115021, 113018, 110972, 108792, 106664, 104791, 102579, 99285, 95475, 92506, 90492, 88192, 85141, 82485, 81357, 81651, 82692, 83905, 84517, 83902, 82595, 81919, 82350, 83261, 84284, 85544, 86476, 85939, 83879, 81535, 79649, 77865, 76231, 75737, 76765, 78353, 79700, 81088, 82676, 83678, 83549, 82878, 82312, 81669, 80830, 80454, 80900, 81397, 81176, 80755, 81205, 82652, 84151, 84657, 83683, 81544, 79267, 77756, 76826, 75605, 73915, 72551, 72130, 72539, 73559, 75034, 76340, 76777, 76663, 77004, 77866, 78271, 77923, 77791, 78568, 79727, 80569, 81027, 80987, 80041, 78521, 77601, 77717, 77946, 77562, 77062, 76931, 76606, 75606, 74681, 74842, 75971, 77327, 78732, 80402, 82122, 83443, 84290, 84809, 85053, 85198, 85513, 85815, 85636, 85193]
55418H5193P6N35q2j042q43K94P72K41j4N58R25L67m91j018j463k018k245k036
55400G7709j974k288k389j894j113k87P20J683J952J458Q61N38K72M9K22O65O89
55383G6873R2n53q10q30o98k73K66M10O1m00p48r43o48L44J340J394O58J19Q3
55364G5737o4n10o92m65m66r54j327j198r47q72o55k07m6l45l80L53J144R77J6
55345F9099n79j77O22R21O54M60O41O79O2p97j016m98n7j78m22l86m22q56j197
55326F6553q63j34K76J90r4l39l09K55J026J085J97n66k07P82J211P88J06l87
55308F9570n12q1O73Q98K69l08%O61P58M45K73j35j296k414k254j028M6O70J367
55289F7602J813J050n88j454q16K74O31K44l56q66r97m95L05P24O36M47K78L7
$$ y = [85193, 85269, 85804, 85722, 84680, 83837, 84131, 84903, 85144, 85130, 85688, 86613, 86980, 86489, 85471, 84008, 81990, 79745, 77709, 75735, 73447, 71058, 69164, 68051, 67764, 68484, 70167, 72119, 73577, 74438, 74976, 75248, 75297, 75519, 76184, 76873, 76965, 76412, 75602, 74772, 74074, 73801, 74067, 74477, 74538, 74138, 73390, 72447, 71799, 72143, 73483, 74877, 75535, 75654, 75737, 75673, 75163, 74471, 74006, 73540, 72586, 71259, 70061, 69114, 68242, 67587, 67380, 67334, 66989, 66609, 66962, 68106, 69083, 69099, 68520, 68343, 68965, 69886, 70540, 71000, 71641, 72320, 72382, 71585, 70569, 70071, 70014, 69836, 69414, 69028, 68606, 67750, 66553, 65690, 65556, 65832, 66022, 65928, 65589, 65280, 65535, 66561, 67646, 67843, 67277, 67070, 67852, 69063, 69851, 69957, 69570, 69058, 68977, 69650, 70548, 70817, 70509, 70509, 71170, 71928, 72373, 72646, 72511, 71215, 68801, 66547, 65519, 65565, 66235, 67602, 69415, 70465, 69877, 68423, 67607, 67881, 68512, 68756, 68400, 67534, 66537, 66042, 66347, 67071, 67707, 68154, 68432, 68469]
55271F8469J06Q31J504J049k81j077o88J66P61J184J535J466R08L42N0j13j66
55254G6046L2J99j32p21q61m30J18O67J325J625R25l51j054q61m62j92K87Q27
55236G6987O38m11j444j858j935j895j406m40L59N99O41P71O85J17o51j148j105
55219F8504l78Q39J774J746J066N58L39j34r48j552j630j306o75J06M31k6n47
55202F8167l05K68K22k31j40M03L78l32p68n36j27L19J064J526P75n79p82M27
55184F9749J285O76l80n78p6M15Q33J213J210R08R60J297R86j5m55J86P59M17
55166G9390M8O47J588J808J493J311J037K32n49o44o36j448k628k877j913o80
55150G6179J68Q41J580K073J895J004k04j079j181q17o73q57q20l58N1J20J44
$$ y = [68469, 68575, 69406, 70910, 71959, 71678, 70601, 69913, 70079, 70840, 72024, 73559, 75025, 75933, 76275, 76325, 76212, 76046, 76078, 76277, 76145, 75424, 74563, 74133, 74251, 74918, 76243, 77868, 78793, 78442, 77388, 76527, 76065, 75873, 76160, 76987, 77625, 77214, 75770, 73912, 71977, 70082, 68676, 68236, 68595, 69194, 69835, 70606, 71291, 71408, 70757, 69609, 68504, 68126, 68965, 70739, 72485, 73551, 74109, 74448, 74314, 73366, 71814, 70184, 68878, 68203, 68309, 68740, 68714, 68167, 67862, 68130, 68352, 68121, 67981, 68384, 68762, 68430, 67662, 67126, 66999, 67318, 68382, 69908, 70683, 70104, 69322, 69749, 71034, 71710, 71330, 70752, 70676, 71091, 71924, 73137, 74347, 75255, 76215, 77512, 78498, 78483, 78028, 78214, 78973, 79390, 79438, 80085, 81673, 83481, 84974, 86285, 87322, 87554, 87005, 86361, 85725, 84277, 81649, 78772, 76859, 76179, 76347, 77188, 78768, 80841, 82736, 83740, 83536, 82457, 81276, 80459, 79786, 78929, 78109, 77751, 77802, 77922, 78066]
55133G8066J98r2o21n44M28J324J190K80n73j073j269j012l26K36K45j7j29j24
55115G6187j77k35l67p85j211r33Q1Q94Q71M48K45K86N07J140J981K196J491P00
55097H3319N65P46O52M40N23P64Q87J033J298J380J112O89J7j241k594k812j635
55080H5143l14J85L73Q48J054M75j10J17M88p2j184j607j173p04m63OP02J023
55062H4787Q00M81K99Q9j34j14J85N85R90J302J297J004P36M85j68j147j689j517
55044H8271j397j831k111j448k99M08O39Q79J070Q98O31O73P77N74L82N86P52
55027H9454K95m58q39j005j477k016j982j439q83j86J011K167K206J037l07j018
55011H4560j178j061o66p0M10N59L91N7j00K77R95J303Q69L01K64O14R13J093
$$ y = [78066, 78264, 78172, 77551, 77007, 77435, 78759, 79949, 80229, 79656, 78583, 77314, 76302, 75976, 76212, 76457, 76440, 76311, 76187, 76010, 75775, 75408, 74623, 73412, 72479, 72560, 73454, 74325, 74773, 75018, 75304, 75811, 76951, 78932, 81128, 82619, 83319, 83884, 84630, 85282, 85722, 86245, 87009, 87896, 88929, 90227, 91607, 92719, 93408, 93425, 92184, 89590, 86778, 85143, 84829, 85014, 85387, 86235, 87289, 87764, 87654, 87771, 88259, 88187, 87003, 85396, 84223, 83519, 83056, 83062, 83764, 84787, 85587, 86068, 86367, 86456, 86322, 86208, 86393, 86978, 87968, 89270, 90567, 91571, 92307, 92792, 92624, 91477, 89788, 88271, 86874, 85043, 82932, 81484, 81185, 81593, 82232, 83111, 84181, 85079, 85710, 86383, 87160, 87734, 88116, 88702, 89454, 89749, 89291, 88452, 87447, 85970, 83954, 81972, 80533, 79650, 79464, 80475, 82642, 84848, 85885, 85578, 84560, 83382, 82321, 81655, 81585, 81995, 82554, 82945, 83002, 82902, 83179, 84174, 85477, 86346, 86647, 86911, 87525, 88438, 89531]
54993H9531J078N02m68q29q0Q63R65N80O19R83R43N18K37j5o58j255r91p3M19
54974I2869P1n65r85j096o99L38J388J551Q19mm37o21o46m68l42n67q46o29P5
54955H9206Q37J479J893J667O83l25o59o85j057j467j216n86m13o06l30M97J122
54938I0040J270J394J652J686J464J395J531J550J430J347J091N20K83J105K560
54923A10318L659M297N011N607N381M569M086L852K832R10p80j632k338l406m267
54908A38099m442m348m311l834k624j452j240j823k284k100j502j030r98j133
54894A04978p98J28Q39O69J83L26Q44P43Q6RQ43J646J888K229L108L800L691L439
54876A28651L973N093N851N822N191M061K351J60k157m144n306n396m789m171
$$ y = [89531, 90609, 91111, 90643, 89814, 89734, 90597, 91562, 92142, 92761, 93744, 94687, 95205, 95442, 95427, 94769, 93514, 92523, 92450, 92869, 92940, 92375, 91390, 90294, 89595, 89933, 91321, 92872, 93691, 93687, 93250, 92629, 91983, 91515, 91173, 90606, 89760, 89131, 89206, 90043, 91522, 93415, 95082, 95765, 95440, 94781, 94096, 93039, 91572, 90356, 89770, 89357, 88751, 88421, 88918, 90040, 91310, 92704, 94356, 96042, 97506, 98901, 100432, 101982, 103412, 104759, 105850, 106370, 106653, 107758, 110318, 113977, 118274, 123285, 128892, 134273, 138842, 142928, 146780, 149612, 150522, 149742, 148110, 145772, 142366, 138099, 133657, 129309, 124998, 121164, 118540, 117088, 115848, 114025, 111741, 109641, 108139, 107109, 106111, 104978, 104180, 104308, 105147, 105816, 105999, 106325, 107169, 107912, 107998, 108007, 108850, 110496, 112384, 114613, 117721, 121521, 125212, 128651, 132624, 137717, 143568, 149390, 154581, 158642, 160993, 161153, 158996, 154852, 149546, 144150, 139361, 135190]
54862A35190l727l031j864p15k99r30k275l476l693k956k194k049k042j609j229
54847A03101j596k163j854q49l47o26q25o28p02j185j245o30k35n39p42j67N82
54830H9350O76L22J68L08N31Q96J358J501J223J023J090R18K48l31l64l00o26
54813I7991r72p82k78L5K34O52J078J018M81n6k98k65n3K25M08M28L30O8m18r03
54793I8923j052q09k43O89J689J860Q07l65k68P92J313R98J016J769K071J187
54777A10377J15j1M88Q55J224J940K588K837L360M710O107O461N982N650N589
54762A58272N104L977K707J634O31n02j917l705n489o448o287n685n292m841l867
54747A28292k651j786j376j331j736k275k005o78M62J82r71j442p92P5M59N79
$$ y = [135190, 131463, 128432, 126568, 125853, 125554, 124624, 122349, 118873, 115180, 112224, 110030, 107981, 105939, 104330, 103101, 101505, 99342, 97488, 96639, 96292, 95666, 94841, 94213, 93511, 92326, 91081, 90451, 90216, 89677, 88935, 88768, 89350, 90026, 90348, 90516, 90824, 91355, 92251, 93609, 95110, 96333, 97356, 98446, 99364, 99612, 99281, 98917, 98617, 97991, 97019, 96237, 95959, 95994, 96228, 96880, 97958, 98976, 99457, 99401, 99103, 98838, 98785, 99010, 99418, 99846, 100176, 100244, 99826, 98923, 97871, 97062, 96819, 97508, 99197, 101057, 101864, 101499, 101231, 102023, 103336, 104334, 105350, 107119, 109190, 110377, 110492, 110481, 110969, 111824, 113048, 114988, 117576, 120413, 123773, 128483, 134590, 141051, 147033, 152683, 158272, 163376, 167353, 170060, 171694, 172325, 171823, 169906, 166201, 160712, 154264, 147977, 142292, 137000, 132159, 128292, 125641, 123855, 122479, 121148, 119412, 117137, 115132, 114454, 114916, 115098, 114127, 112685, 111893, 111968, 112427, 113006]
54731A13006Q35J287J899K503K666K281K070K771M043M900N033M913M783M373
54717A57363L548K401P88j484l962n769o569o713o463n734m654l651k867k005
54703A14229r27l5J76l79j316k015j972j190j72O03J043J128O41l87j351j573
54687A06503j025k63J40j75j208k371k688j787l98M52M67J4m71o22j13Q71J507
54670I8833J251N58K12K47J25l08o53n79j21M67P94M98k31o62l98P5J86J25L53
54651A00772O94O58K92L8p1m18j063j582j558r02J66J140J511J288R00M57k79
54634A02043j006r14j00J64o83j350o05P12R69K63m0K47qr66j327m76M71M83Q9
54615I7966K18P02Q76Q23J030J347J181M63k54n71o22p75j184j579j378l09J067
$$ y = [113006, 113841, 115128, 117027, 119530, 122196, 124477, 126547, 129318, 133361, 138261, 143294, 148207, 152990, 157363, 160911, 163312, 164100, 162616, 158654, 152885, 146316, 139603, 133140, 127406, 122752, 119101, 116234, 114229, 113302, 113267, 113443, 113064, 111748, 109733, 107761, 106571, 106399, 107002, 108045, 109173, 109814, 109427, 108076, 106503, 105478, 105215, 105355, 105180, 103972, 101601, 98913, 97126, 96728, 97180, 97647, 97661, 97190, 96568, 96455, 97326, 98833, 100084, 100642, 100854, 101101, 101226, 100918, 100265, 99686, 99565, 100032, 100826, 101324, 101093, 100431, 100033, 100108, 100294, 100419, 100772, 101466, 102124, 102416, 102454, 102383, 101965, 100902, 99320, 97762, 96860, 97026, 98166, 99677, 100965, 101865, 102322, 102043, 101037, 100123, 100023, 100187, 99504, 98154, 97549, 98261, 99230, 99493, 99453, 99700, 99692, 98726, 97399, 96923, 97394, 97877, 97966, 98184, 98886, 99762, 100585, 101615, 102962, 104143, 104606, 104352, 103781, 103159, 102384, 101200, 99621, 98243, 97934, 99001]
54598I9001J767J442P21L76M86N74K16n81j343j458p97J4K60Kj36M0J01j61l61
54579A00163j20L40N59M24J66J6L4J31K11L56P80J372J537R25O6k20O3J82j74
54560A06811m99l48M8K92M51P30R94R11M67n9m09n21m89m01j99L38J188J807J569
54541A12681N55m33q07p76q88j241j393r56m8Q44J323J342J079O90L37K94P35
54524A13338J406J782J581R22J8q53j189o51K43N12K0l26qK82j30p22o60k25l14
54505A15026r35j326j310j439j783j669p93K63R39J340J674J751J370P07K6n84
54489A13257r84r31l75L88J057J413J244N86kJ09Q14J421J573J513J455J254Q40
54472A24632M61L14L48M82O57O48L48K05P84J783K134J317%r00j223j309j259
$$ y = [99001, 100768, 102210, 102931, 103307, 103793, 104367, 104583, 104002, 102659, 101201, 100404, 100418, 100678, 100680, 100544, 100584, 100685, 100524, 100163, 100043, 100383, 100942, 101366, 101532, 101548, 101582, 101713, 101924, 102280, 103060, 104432, 105969, 106894, 106960, 106740, 106803, 106985, 106811, 106312, 105964, 106012, 106304, 106755, 107485, 108479, 109390, 109857, 109798, 109389, 108868, 108379, 107978, 107779, 108117, 109305, 111112, 112681, 113236, 112803, 111996, 111220, 110332, 109091, 107698, 106742, 106694, 107538, 108861, 110203, 111282, 111972, 112309, 112603, 113338, 114744, 116526, 118107, 119029, 119047, 118194, 117005, 116354, 116597, 117109, 117129, 116803, 116795, 117077, 116947, 116225, 115565, 115340, 115026, 114091, 112765, 111455, 110016, 108233, 106564, 105771, 106034, 106973, 108313, 109987, 111738, 113108, 113815, 113841, 113257, 112273, 111342, 110967, 111355, 112412, 113825, 115069, 115655, 115653, 115762, 116576, 117997, 119570, 121083, 122538, 123792, 124632, 125093, 125407, 125755, 126237, 126894, 127542, 127890, 128095, 128879, 130662, 132796, 134113, 134113, 133213, 131990, 130681, 129422]
54455A29422r11l47J18L21L72L43J00n33j393j937j638n90N02R76P42J15n52r22
54437A24188p73l42j68l05j33O20J235R90L31K09O23O88M2p05r27o15J1P42J164
54418A26875Q53Qo84q72p44m40P3N21L82l79j192j599j517q82L50J684K287J886
54400A26610J026L01j51l84m15l09m7O31J700K380J962R02K55R2m34j430j820
54383A30869r79K92R81J119J189J134P14L00M81J197J846K072J991J864J878K006
54367A48954J955J578J343J852K802L119K379J358P97L34o95k041k838k780k336
54352A55781j990j788j588j357j207j317j716k127k186j842j277n48K68O93K41
54337A38040q04j649j975k065j931j248k88Q4k99n28j4O34P29O00Q52J263J280
$$ y = [129422, 128511, 128164, 128282, 128603, 128975, 129318, 129418, 128885, 127492, 125555, 123917, 123327, 123829, 124805, 125547, 125662, 125110, 124188, 123415, 123073, 122905, 122600, 122467, 123087, 124322, 125312, 125643, 125852, 126475, 127163, 127205, 126500, 125573, 124958, 124969, 125711, 126875, 127728, 127736, 127052, 126180, 125436, 124996, 125069, 125590, 125972, 125593, 124401, 122802, 121285, 120403, 120753, 122437, 124724, 126610, 127636, 127937, 127786, 127402, 126987, 126678, 126631, 127262, 128962, 131342, 133304, 134206, 134461, 134553, 134119, 132689, 130869, 129890, 130182, 131163, 132282, 133471, 134605, 135319, 135619, 136100, 137297, 139143, 141215, 143206, 145070, 146948, 148954, 150909, 152487, 153830, 155682, 158484, 161603, 163982, 165340, 166137, 166471, 165776, 163735, 160897, 158117, 155781, 153791, 152003, 150415, 149058, 147851, 146534, 144818, 142691, 140505, 138663, 137386, 136838, 137106, 137799, 138040, 137236, 135587, 133612, 131547, 129616, 128368, 128080, 128164, 127865, 127337, 127323, 127957, 128686, 129286, 130138, 131401, 132681]
54320A32681J028R56Q91M03k92n58l96m45r97j642j893j642j070m88k67n33r90
54303A24746j257j232r48m08K33O33P64R95J396J413P22q0j69L83Q17P53M77L10
54285A29548K70L25N16P26O71K05n09j108j227p22R2P04R94J256J565J491P27
54268A35524l39j020r89l98M20J028J066O03J11KM05J340K576L268K555P63o60
54251A46255q05k42J39L59P83J030M61o27j255j019m35n8N3M2J5Q9K78L25j0n29
54231A44849q29p81n40k07J98N72Q28R63R16N50l1m80o89r04j186j241j013r16
54213A40059j208j566j653j558j391j022n33l20l49PR01J513J231N81L48M73N59
54196A36072O92R53P71j99j168j176m52J68N70R89R56p2j367j653r72l66N2J117
$$ y = [132681, 133709, 134665, 135556, 135959, 135667, 135109, 134713, 134268, 133271, 131629, 129736, 128094, 127024, 126536, 126269, 125736, 124746, 123489, 122257, 121309, 120901, 121134, 121767, 122531, 123526, 124922, 126335, 127057, 126977, 126808, 127191, 128008, 128761, 129238, 129548, 129818, 130143, 130659, 131385, 132056, 132261, 131752, 130644, 129417, 128695, 128787, 129491, 130485, 131741, 133306, 134797, 135524, 135185, 134165, 133176, 132778, 133198, 134226, 135292, 135895, 136006, 136008, 136413, 137753, 140329, 143597, 146152, 146915, 146255, 145450, 145208, 145347, 145706, 146489, 147519, 147980, 147353, 146098, 145079, 144644, 144586, 144639, 144681, 144696, 144785, 145063, 145388, 145378, 144849, 144020, 143239, 142699, 142492, 142690, 143262, 144090, 145053, 145969, 146519, 146488, 146008, 145319, 144415, 143229, 141988, 140975, 140059, 138851, 137285, 135632, 134074, 132683, 131661, 131128, 130808, 130459, 130466, 131367, 132880, 134111, 134692, 135040, 135513, 136072, 136764, 137717, 138488, 138289, 137121, 135945, 135493, 135661, 136231, 137220, 138176, 138104, 136737, 135084, 134112, 133746, 133798, 134915]
54178A34915K606K945J516j87n09L46J030Q71J55o99j453j872j878j609j091k80
54162A34806M26M15j77l96K11R67J066N69q0q01j510j689j076l72l94q99r35k39
54144A29892N03P30O13N21M80L99L92N27O14M50K04K01M39N35K07l52p59r13r89
54125A33694j013p49o1Q30J594K053K128J873J646J873K398K479J807J060R85
54110A52597J378J565J546J943K928L975M653M959M826L964K366N09j126k282
54096A83801k716k342j657j406j631j598r06j12K0n65j360j989k380k550k472
54081A60137k049j115K27J271J237K81n12m31Rn9n92p88k75L90N22J41j01L01
54063A58594J179J854J737Q46k28p79n51J4Q4p43j828j978p02J203K554K939K772
$$ y = [134915, 137521, 140466, 141982, 141795, 141286, 141632, 142662, 143533, 143688, 142989, 141536, 139664, 137786, 136177, 135086, 134806, 135232, 135647, 135470, 135074, 135285, 136252, 137318, 137887, 137807, 137006, 135496, 133807, 132731, 132359, 131965, 131066, 130131, 129892, 130395, 131125, 131738, 132259, 132739, 133138, 133530, 134057, 134671, 135121, 135325, 135526, 135965, 136500, 136707, 136355, 135596, 134683, 133694, 132681, 131932, 131871, 132701, 134295, 136348, 138476, 140349, 141995, 143868, 146266, 148745, 150552, 151612, 152597, 153975, 155540, 157086, 159029, 161957, 165932, 170585, 175544, 180370, 184334, 186700, 187209, 186083, 183801, 181085, 178743, 177086, 175680, 174049, 172451, 171545, 171433, 171453, 170888, 169528, 167539, 165159, 162609, 160137, 158088, 156973, 157200, 158471, 159708, 159989, 159477, 159046, 159055, 158996, 158404, 157616, 157341, 157731, 158253, 158394, 158293, 158594, 159773, 161627, 163364, 164210, 163982, 163203, 162652, 162666, 162750, 162007, 160179, 158201, 157499, 158702, 161256, 164195, 166967]
54046A66967K512K346K398K769L349L910M376M703M765M669M916N749O524O404
54032B26357N500M702M430M215L614K821K179J698J306J060Q43L21m74r79p60
54017B56833p3M00J79q07k194l305l692l666l917m536m877m548l946l560l352
54002B14939l144l156l554l864l457k443j577j324j389j257q26m24l75p19j218
53987A86212j543j418p78Q2N88M05m4O2Q83J626J621J243J287J874K620L566N016
53970B03302O638P643P957Q227Q452P499M522K17l788o263o794n698m104l408
53956B24402l899m313l469j893j063j387j849j577p99l4P62J769K609K716K243
53941B14218J992K437L157L451L232L061L381M025M504M587M393M122L851L526
$$ y = [166967, 169479, 171825, 174223, 176992, 180341, 184251, 188627, 193330, 198095, 202764, 207680, 213429, 219953, 226357, 231857, 236559, 240989, 245204, 248818, 251639, 253818, 255516, 256822, 257882, 258725, 259046, 258572, 257593, 256833, 256760, 257160, 257339, 256532, 254338, 251033, 247341, 243675, 239758, 235222, 230345, 225797, 221851, 218291, 214939, 211795, 208639, 205085, 201221, 197764, 195321, 193744, 192420, 191031, 189774, 188948, 188524, 188149, 187430, 186212, 184669, 183251, 182473, 182555, 183143, 183548, 183504, 183566, 184449, 186075, 187696, 188939, 190226, 192100, 194720, 198286, 203302, 209940, 217583, 225540, 233767, 242219, 249718, 254240, 254457, 250669, 244406, 237612, 231914, 227810, 224402, 220503, 216190, 212721, 210828, 209765, 208378, 206529, 204952, 204153, 204119, 204881, 206650, 209259, 211975, 214218, 216210, 218647, 221804, 225255, 228487, 231548, 234929, 238954, 243458, 248045, 252438, 256560, 260411, 263937]
53927B63937L066K549K334K744L487L808L400K868K935L548M286N179O451P683
53913C18275Q086P568O797O147N370M389L558K834J583k67j676j796j267j421
53899C58180k500l482l569l101k941l507m620n927p083p724p599o846o013n647
53885B87621n836o220o479o572o479o019n155m186l323k417j496j200k025l344
53871B26870l938l471k721k366k291k176k005j682r33LK51o27j902k526k282j695
53855A96509j269j199j495j924k064j759j253p29o6O39Q50K88n06p99n35j87j
53838A84500J36K86L21J26l16q53j110q09k74j97o48p95L6J428K360K319J583
53821A88093P15J65J24M14P44J156J897K680K727J816P56L72O02J038J766K928
$$ y = [263937, 267003, 269552, 271886, 274630, 278117, 281925, 285325, 288193, 291128, 294676, 298962, 304141, 310592, 318275, 326361, 333929, 340726, 346873, 352243, 356632, 360190, 363024, 364607, 364340, 362664, 360868, 359601, 358180, 355680, 352198, 348629, 345528, 342587, 339080, 334460, 328533, 321450, 313726, 306127, 299281, 293268, 287621, 281785, 275565, 269086, 262514, 256035, 250016, 244861, 240675, 237352, 234935, 233439, 232239, 230214, 226870, 222932, 219461, 216740, 214374, 212083, 209907, 207902, 206220, 205287, 205290, 205541, 204914, 203012, 200486, 198204, 196509, 195240, 194041, 192546, 190622, 188558, 186799, 185546, 184817, 184751, 185390, 186240, 186528, 186022, 185223, 184688, 184501, 184500, 184636, 184922, 185243, 185369, 185053, 184200, 183090, 182281, 182007, 181810, 181162, 180367, 180403, 181831, 184191, 186510, 188093, 188808, 188973, 189097, 189511, 190255, 191411, 193308, 195988, 198715, 200531, 201287, 201659, 202261, 203299, 205065, 207993]
53805B07993M037M517M566M737M940M713M222M120M429M423L778L118L128L714
53791B66435M275M372L918L021J899P70k67j144j706j944k178k672l184l292l107
53776B65196l263m091n163n690n245m101l059k897l643m500m620l909k868j923
53762B10224j236r44j130j610k066k360k418k014j038Q3O64M33l18j178j823j966
53746A91303j509p72j83K11N89Q56P51M17L30O36R89J131J112R01L13m52p22j52
53728A95749P50J256J280J219J190R38M12j1K6N22J267K054K589K513J806J006
53712B14566P13R63J323J582J999K822L825M499M469L769K856K409K699L106K786
53697B54386J922J673K559L596L696L179L017L100K501J198K64J80K04k14n71
$$ y = [207993, 212030, 216547, 221113, 225850, 230790, 235503, 239725, 243845, 248274, 252697, 256475, 259593, 262721, 266435, 270710, 275082, 279000, 282021, 283920, 284690, 284423, 283279, 281573, 279629, 277451, 274779, 271595, 268303, 265196, 261933, 257842, 252679, 246989, 241744, 237643, 234584, 231687, 228044, 223544, 218924, 215015, 212147, 210224, 208988, 208044, 206914, 205304, 203238, 200878, 198460, 196446, 195408, 195491, 196155, 196588, 196270, 195092, 193269, 191303, 189794, 189022, 188839, 189050, 189639, 190495, 191246, 191663, 191993, 192629, 193618, 194749, 195861, 196762, 197075, 196623, 195901, 195749, 196499, 197755, 199035, 200254, 201444, 202382, 202794, 202783, 202809, 203331, 204598, 206652, 209241, 211754, 213560, 214566, 215279, 216242, 217565, 219147, 221146, 223968, 227793, 232292, 236761, 240530, 243386, 245795, 248494, 251600, 254386, 256308, 257981, 260540, 264136, 267832, 271011, 274028, 277128, 279629, 280827, 281091, 281271, 281475, 281261, 280690]
53682B80690m11l20r45j789j803q17L44Q93P37L15J43L47M27j46j038j302o96
53665B74629o0m2k73j61J73L15K48J05j53l80k37M9k66j114j402p47l44r81j425
53646B67934j79K014L150K850K452K477J939M88n67o9J449K722L303L465L373
53631B96801L073K771K603K556K754L328L805L392K113J024R23J476J952K196
53617C30767K424K613K624K629K926L499M045M318M308M247M411M736M766M287
53603C82600L813L892M135L669K498J562J336J157L29p81j276q39O3P28O74j10
53587D03450j100j669j742j684j597j257q43r77j802k637k963l115l460l547k752
53572C72305j439o62p97j143r91n19l79q40j564k046j995j414n70R1K88K34M41
$$ y = [280690, 280279, 279959, 279014, 277225, 275422, 274605, 274949, 275842, 276579, 276894, 277037, 277384, 277811, 277665, 276627, 275325, 274629, 274569, 274527, 274254, 274093, 274266, 274581, 274829, 274934, 274781, 274401, 274164, 274213, 273947, 272833, 271431, 270684, 270340, 269359, 267934, 267755, 269769, 272919, 275769, 278221, 280698, 282637, 283125, 282558, 282489, 283938, 286660, 289963, 293428, 296801, 299874, 302645, 305248, 307804, 310558, 313886, 317691, 321083, 323196, 324220, 325143, 326619, 328571, 330767, 333191, 335804, 338428, 341057, 343983, 347482, 351527, 355845, 360153, 364400, 368811, 373547, 378313, 382600, 386413, 390305, 394440, 398109, 400607, 402169, 403505, 404662, 404991, 404210, 402934, 402095, 402158, 402886, 403560, 403450, 402350, 400681, 398939, 397255, 395658, 394401, 393558, 392581, 390779, 388142, 385179, 382064, 378604, 375057, 372305, 370866, 370204, 369407, 368264, 367273, 366754, 366375, 365535, 363971, 361925, 359930, 358516, 357946, 358037, 358325, 358559, 359000]
53555C59000J004J329Q98P4k70R9N92P23O34N49M14L36O99J471K026K126K385
53538C74089L257M297N036N775O753P294O848O214O491P348P706P704Q500J0241
53524D67553J1735J2275J2418J2692J2910J3095J3822J5185J6568J7805J9429
53513F25487K1337K2479K2502K2526K3470K4708K5258K5333K5677K6091K5761
53502H90629K4607K3387K2705K2557K2595K2384K1656K0754K0371K0564K0579
53491A132788J9979J9232J8850J8698J8605J8767J8996J8571J7556J7277J8486
53480A337805J9934K0002J8967J8303J8205J7332J4883J1608Q589O150M183K561
53468A498522Q59j504m513p493r918j1861j3570j5157j6706j8102j8750j8145
$$ y = [359000, 360004, 361333, 362231, 362305, 362035, 362134, 362726, 363449, 364083, 364632, 365046, 365382, 366081, 367552, 369578, 371704, 374089, 377346, 381643, 386679, 392454, 399207, 406501, 413349, 419563, 426054, 433402, 441108, 448812, 457312, 467553, 479288, 491563, 503981, 516673, 529583, 542678, 556500, 571685, 588253, 606058, 625487, 646824, 669303, 691805, 714331, 737801, 762509, 787767, 813100, 838777, 864868, 890629, 915236, 938623, 961328, 983885, 1006480, 1028864, 1050520, 1071274, 1091645, 1112209, 1132788, 1152767, 1171999, 1190849, 1209547, 1228152, 1246919, 1265915, 1284486, 1302042, 1319319, 1337805, 1357739, 1377741, 1396708, 1415011, 1433216, 1450548, 1465431, 1477039, 1485628, 1491778, 1495961, 1498522, 1499381, 1497877, 1493364, 1485871, 1475953, 1464092, 1450522, 1435365, 1418659, 1400557, 1381807, 1363662]
53456A363662j6808j6040j6581j8007j9535k0797k1720k2176k2118k1738k1232
53445A146910k0705k0282k0000j9534j8442j6729j4803j2811j0475p736n102l171
53433I77120k060j492j129o19L66J832L396M703N854P224R020J1046J2853J4027
53419A042141J4556J5005J6218J8484K1095K2951K3683K3976K4698K5921K7109
53408A275837K8052K9152L0750L2677L4690L6895L9353M1749M3943M6379M9325
53397A688802N2080N3751N4585N5542N6674N7124N6831N6977N8140N9185N8827
53386B308518N7419N6149N5132N3477N0907M8094M5449M2667L9626L6812L4406
53375B828656L1598K7361K1669J5508R866M898N8n231j1085j7322k3888l0872
$$ y = [1363662, 1346854, 1330814, 1314233, 1296226, 1276691, 1255894, 1234174, 1211998, 1189880, 1168142, 1146910, 1126205, 1105923, 1085923, 1066389, 1047947, 1031218, 1016415, 1003604, 993129, 985393, 980291, 977120, 975060, 973568, 972439, 971820, 972186, 974018, 977414, 982117, 987971, 995195, 1004215, 1015261, 1028114, 1042141, 1056697, 1071702, 1087920, 1106404, 1127499, 1150450, 1174133, 1198109, 1222807, 1248728, 1275837, 1303889, 1333041, 1363791, 1396468, 1431158, 1468053, 1507406, 1549155, 1593098, 1639477, 1688802, 1740882, 1794633, 1849218, 1904760, 1961434, 2018558, 2075389, 2132366, 2190506, 2249691, 2308518, 2365937, 2422086, 2477218, 2530695, 2581602, 2629696, 2675145, 2717812, 2757438, 2794250, 2828656, 2860254, 2887615, 2909284, 2924792, 2934658, 2939556, 2939614, 2934383, 2923298, 2905976, 2882088, 2851216]
53363B851216l8064m4714m9920n3260n5059n6144n7209n8146n8197n7045n5446
53352B268012n4303n3307n1401m8541m6044m4884m4605m4390m4280m4592m4822
53341A746843m4056m2085l9427l6558l3825l1700l0307k8931k6756k3949k1357
53330A387892j9280j7220j4856j2616j1159j0722j1053j1682j2230j2683j3228
53319A241163j3684j3455j2328j0895r828r081q215p092n730l953j819m5P41R86
53305A146765J737L349N291P022Q488R806J1117J2670J4587J6611J8537K0566
53293A276546K2760K4543K5474K6112K7253K8543K8824K7785K6268K4848K3152
53282A562108K0913J8718J7190J6021J4382J1872Q657N014J150k711o311r387
$$ y = [2851216, 2813152, 2768438, 2718518, 2665258, 2610199, 2554055, 2496846, 2438700, 2380503, 2323458, 2268012, 2213709, 2160402, 2109001, 2060460, 2014416, 1969532, 1924927, 1880537, 1836257, 1791665, 1746843, 1702787, 1660702, 1621275, 1584717, 1550892, 1519192, 1488885, 1459954, 1433198, 1409249, 1387892, 1368612, 1351392, 1336536, 1323920, 1312761, 1302039, 1290986, 1279304, 1267074, 1254391, 1241163, 1227479, 1214024, 1201696, 1190801, 1180973, 1171892, 1163677, 1156585, 1150855, 1146902, 1145083, 1145038, 1145779, 1146765, 1148502, 1151851, 1157142, 1164164, 1172652, 1182458, 1193575, 1206245, 1220832, 1237443, 1255980, 1276546, 1299306, 1323849, 1349323, 1375435, 1402688, 1431231, 1460055, 1487840, 1514108, 1538956, 1562108, 1583021, 1601739, 1618929, 1634950, 1649332, 1661204, 1669861, 1674875, 1676025, 1673314, 1667003, 1657616]
53270A657616j1750j3511j5133j7011j9064k1042k3036k5228k7273k8470k8618
53259A427480k8322k8395k9294l0955l2750l3688l3215l1818l0487k9610k8821
53248A090125k7821k6815k6118k5769k5600k5314k4661k3821k3377k3480k3342
53237H14007k2183k0355j8871j7996j7101j5755j4138j2484j0874r628r070q859
53225F36693q353p689p669q460r255r452r422r806j0826j2445j4437j6045j6326
53212D96508j5279j3899j2862j1836j0404q875p702o816o063n650n630n572n347
53199C80573n631o911q458r050q453p557p174p274p317o909o103n345n022m957
53185B84412m595l801l151l154l568l721l265k336j350q23j064j765k214k178
$$ y = [1657616, 1645866, 1632355, 1617222, 1600211, 1581147, 1560105, 1537069, 1511841, 1484568, 1456098, 1427480, 1399158, 1370763, 1341469, 1310514, 1277764, 1244076, 1210861, 1179043, 1148556, 1118946, 1090125, 1062304, 1035489, 1009371, 983602, 958002, 932688, 908027, 884206, 860829, 837349, 814007, 791824, 771469, 752598, 734602, 717501, 701746, 687608, 675124, 664250, 654622, 645552, 636693, 628340, 620651, 612982, 604522, 595267, 585815, 576393, 566587, 555761, 543316, 528879, 512834, 496508, 481229, 467330, 454468, 442632, 432228, 423353, 415651, 408835, 402772, 397122, 391492, 385920, 380573, 374942, 368031, 359573, 350523, 342070, 334513, 327339, 320065, 312748, 305839, 299736, 294391, 289369, 284412, 279817, 276016, 272865, 269711, 266143, 262422, 259157, 256821, 255471, 254648, 253584, 251819, 249605, 247427]
53171B47427k159k541k939k822k331j949j657r69K16J298J578R28j27q36p70j19
53155B32228N09N99M4q84j688j847j290n35j50j41k34m89j018j310o92N50J336
53138B24988J280J065J145J033M08p8J78O56N91K93N80J325J603J135N86M40M38
53121B37666L56M63Q93J212J064Q08R93J415J264K39r22j230o50j44n27j554k290
53104B39056k197j557j004r31j270j543j261m94J43L49O06J263J611P58q09j546
53088B31174r55j87k77p75p90m53n15j105j747k129k108j425j54Q37P06k49r88
53071B18860j082r83r96p81k0R40J346P48n59j599j463k82P07M32q35j886j986
53054B10561j383o12J76R82J591J637J028K15j21K25O81N60%k36J53O39P79P78
$$ y = [247427, 245268, 242727, 239788, 236966, 234635, 232686, 231029, 230060, 230276, 231574, 233152, 234080, 233953, 233117, 232347, 232228, 232737, 233336, 233380, 232496, 230808, 228961, 227671, 227136, 226986, 226845, 226611, 226122, 225104, 223794, 223102, 223652, 224988, 226268, 227333, 228478, 229511, 229919, 229841, 230019, 230675, 231266, 231559, 232139, 233464, 235067, 236202, 236788, 237228, 237666, 238022, 238485, 239378, 240590, 241654, 242462, 243455, 244870, 246134, 246373, 245451, 244221, 243571, 243427, 242900, 241346, 239056, 236859, 235302, 234298, 233367, 232097, 230554, 229293, 228799, 228942, 229291, 229897, 231160, 232771, 233529, 232720, 231174, 230219, 230032, 229755, 228980, 228190, 227737, 227222, 226117, 224370, 222241, 220133, 218708, 218554, 219391, 220097, 219848, 218860, 217778, 216795, 215799, 215018, 214998, 215938, 217284, 218032, 217473, 215874, 214411, 214129, 214836, 215268, 214433, 212547, 210561, 209178, 208566, 208742, 209724, 211315, 212952, 213980, 214195, 214074, 214299, 214980, 215540, 215540, 215304, 215457, 216096, 216875, 217653]
53036B17653Q73Q24M88K36K61M6p64j500j265k63M89N07J49j30r1M77J423J915
53018B21328J307K16j64K84O10M39M34Q49Q48j01j135j137l44J15j18l01J40Q23
53000B24093R92M19m93j147j170o55m5K79L23L28L98M13K65Oj80j5P55K013L077
52981B29656L171K272J253R19J099J040N66L24P53J314J200M54j23o1L72Q00J183
52964B46192J511J545J126L80n48j636k667l158k899k238j625j177q84q71j161
52949B31890j488j612j536j191l54P98J501J272O56N60J001J081J61j377k575
52934B28787k817k223j418r14o66k71L59Q09P93O70R74J636J956J350n0j444j942
52917B25589j287j82L89J74k36k92m4K69N57O27J45p20j185q05p7K71J75q4m69
$$ y = [217653, 218526, 219350, 219838, 220074, 220335, 220381, 219617, 218117, 216852, 216589, 217078, 217585, 217734, 217604, 217513, 217990, 219413, 221328, 222635, 222851, 222687, 222971, 223581, 224020, 224454, 225303, 226151, 226050, 224915, 223778, 223434, 223549, 223431, 223130, 223270, 224093, 225085, 225504, 225011, 223864, 222694, 222039, 221994, 222273, 222596, 222924, 223322, 223735, 224000, 224006, 223826, 223811, 224566, 226579, 229656, 232827, 235099, 236352, 237271, 238370, 239410, 239976, 240300, 241053, 242367, 243567, 244021, 243898, 243837, 244209, 245009, 246192, 247703, 249248, 250374, 250754, 250206, 248570, 245903, 242745, 239846, 237608, 235983, 234806, 233922, 233051, 231890, 230402, 228790, 227254, 226063, 225709, 226507, 228008, 229280, 229936, 230496, 231497, 232578, 232739, 231362, 228787, 225970, 223747, 222329, 221415, 220749, 220478, 220837, 221646, 222439, 223109, 224083, 225719, 227675, 229025, 228975, 227531, 225589, 224302, 224120, 224509, 224683, 224447, 224155, 224111, 224380, 224937, 225564, 225709, 224989, 223804, 222999, 222922, 223193, 223368, 223284, 222815]
52898B22815q69p36K32J353J660J084L02k79o78p15j32O98J005O29J79N6j6l16
52880B26272n46k00P19J627J839J148J32k68L34J360J935J762J213Q23J001J728
52864B40879K339J992P38l45n06k30l44q54j356j942k792l368l042k216j852k087
52848B25014k285k202k147k176k078k058k358k409j454PO10N7n43m10k9J6m8J19
52830B05626L50N39R35J331R46l24j388j277l19N42Q89Q09M64K08N15J221J523
52813B12590J187J035J628K282K115J316N86r0j118k177k448j818j067q39j056
52798B12126j305j292r50n11m10p53j074r10l70J46N03P37P51M77J17j16k78m30
52780B06458m20k15o5n6R5M25M16k17r28j058p81p23r47j006p11l33j1L77Q62
$$ y = [222815, 221946, 221210, 221442, 222795, 224455, 225539, 225841, 225562, 224884, 224169, 224037, 224735, 225740, 226369, 226548, 226604, 226588, 226272, 225726, 225526, 226245, 227872, 229711, 230859, 230991, 230723, 231057, 232417, 234352, 236114, 237327, 238150, 239151, 240879, 243218, 245210, 245948, 245603, 245097, 244867, 244523, 243669, 242313, 240371, 237579, 234211, 231169, 228953, 227101, 225014, 222729, 220527, 218380, 216204, 214126, 212068, 209710, 207301, 205847, 205854, 206464, 206521, 205978, 205568, 205539, 205555, 205507, 205626, 205976, 206515, 207450, 208781, 209727, 209403, 208015, 206738, 206419, 206961, 207850, 208659, 209123, 209331, 209846, 211067, 212590, 213777, 214812, 216440, 218722, 220837, 222153, 222739, 222649, 221531, 219354, 216906, 215088, 214021, 213182, 212126, 210821, 209529, 208579, 208068, 207658, 206905, 205831, 204921, 204551, 204697, 205200, 205937, 206688, 207165, 207282, 207166, 206888, 206458, 206038, 205823, 205758, 205702, 205797, 206222, 206638, 206421, 205493, 204435, 203654, 202931, 201984, 200978, 200267, 199934, 199923, 200300, 201162]
52761B01162J303J600J632J234N05m9q8J40L13N87J140J557J330P88P84J554K489
52744B17981K941K792K233J558J135J146J302J247J058R91R65Q04P81J226J772
52729B39932J684R22R4n86j500k623l187k725j795j196j050j064j227j639k026
52714B22014j969j414n73M77J621K344K123J161K94P1K43K76J5k96m00k35J26
52697B25878N48Q64R53P78L54k20o94p79m96l22o86j360j577r19J63Q57Q51M09
52679B24602j92q85j512j716j328o29qL98O43P01N41L26L25O58J197J659J721
52662B26501J237M59jL03J195K050K453K523K599K631K137Q07r26k152k355j841
52646B37620j246q64o40n38o00o97n97k56J03K26Qm05n92j41P95J565J912K383
$$ y = [201162, 202465, 204065, 205697, 206931, 207436, 207387, 207299, 207439, 207752, 208339, 209479, 211036, 212366, 213154, 213938, 215492, 217981, 220922, 223714, 225947, 227505, 228640, 229786, 231088, 232335, 233393, 234384, 235349, 236153, 236934, 238160, 239932, 241616, 242538, 242632, 242046, 240546, 237923, 234736, 232011, 230216, 229020, 227970, 226906, 225679, 224040, 222014, 220045, 218631, 218058, 218535, 220156, 222500, 224623, 225784, 226078, 226149, 226392, 226668, 226683, 226387, 225987, 225752, 225878, 226426, 227290, 228243, 229021, 229375, 229155, 228461, 227682, 227186, 226864, 226178, 224818, 223241, 222322, 222485, 223342, 224193, 224602, 224410, 223525, 222013, 220297, 218969, 218340, 218332, 218730, 219373, 220074, 220615, 220941, 221266, 221924, 223121, 224780, 226501, 227738, 228197, 228196, 228499, 229694, 231744, 234197, 236720, 239319, 241950, 244087, 244894, 243968, 241816, 239461, 237620, 236374, 235510, 234870, 234332, 233732, 233035, 232438, 232182, 232285, 232511, 232519, 232114, 231522, 231381, 232176, 233741, 235653, 238036]
52628B38036L372M187L781K169L64r73j971k645k560j683p27l06l48o41j173j611
52612B37271j306l27K76j44q13o94j1J69m58j181j369j031l31O71J690K217K029
52595B36658J400P92N24O18P33M39k10n90l16K50N66O06N56K65l51p74m82J33
52577B40817J81l56n63M2P49O15k99j044q80l2O16M68j08k08N01J335J463Q77
52559B44174J83k83o27r17j044r77p83m44l0J19j97o26o94n11n20o84n33k3L05
52540B35888J71KK61P48R03N50J06M2L92P61Q16O46N20L97N5l61l85qK20J26L04
52519B42154J072J710J430N78P2P0J24L27J190K501L327L299K936K589J962R20
52503B66261j21q86j558k140k294k142k363l072l423k861k000j602j451r73m19
$$ y = [238036, 241408, 245595, 249376, 251545, 251909, 250936, 248965, 246320, 243760, 242077, 241350, 241044, 240696, 240055, 238882, 237271, 235965, 235638, 235914, 235770, 234957, 234263, 234252, 234421, 233963, 232782, 231413, 230382, 230051, 230722, 232412, 234629, 236658, 238058, 238850, 239374, 239992, 240725, 241164, 240954, 240364, 240048, 240298, 240864, 241470, 242026, 242291, 241940, 241166, 240684, 240817, 240998, 240642, 240079, 240121, 240870, 241485, 241186, 240142, 239262, 239230, 239846, 240314, 240206, 239998, 240499, 241834, 243297, 244174, 244357, 244074, 243447, 242530, 241486, 240509, 239726, 239282, 239252, 239371, 239174, 238548, 237854, 237343, 236823, 236139, 235606, 235583, 235888, 236059, 236061, 236322, 237070, 237973, 238523, 238629, 238671, 239063, 239824, 240640, 241286, 241806, 242203, 242258, 241897, 241512, 241504, 241724, 241850, 242154, 243226, 244936, 246366, 246944, 247016, 247086, 247210, 247537, 248727, 251228, 254555, 257854, 260790, 263379, 265341, 266261, 266140, 265254, 263696, 261556, 259262, 257120, 254757, 251685, 248262, 245401, 243401, 241799, 240348, 239375, 238956]
52488B38956m41q60q15p9O65R19R42J025Q80K23m98n01K88J091J257J006R25J028
52470B46011P99K49K12J266K757L534L324K772K298J735J133J030J599K117J778
52455B72614O11p35j761k280k273j966j868k263k815k990k655k070j481j002p09
52440B46357o19o60q27j161j498j562j362j172r88m61L96R79R01O08O63Q88P24
52423B41206J90k15k97k46j4O89J675K266K245K253K908L903M476M591N133O810
52407B77573R207J1099J1586J0679Q779N992K270j916n574p931q930q830p800
52394B96204o130m497l520l119k722k038j274p13l81k12j85j96l4M08J028J677
52378B74296K277K726K908K826K654K624K929L623M446M867M605M013L598L262
$$ y = [238956, 238515, 237655, 236840, 236761, 237426, 238345, 239287, 240312, 241192, 241415, 240917, 240416, 240704, 241795, 243052, 244058, 244983, 246011, 246810, 247059, 247271, 248537, 251294, 254828, 258152, 260924, 263222, 264957, 266090, 267120, 268719, 270836, 272614, 273225, 272490, 270729, 268449, 266176, 264210, 262342, 260079, 257264, 254274, 251619, 249549, 248068, 247066, 246357, 245738, 245078, 244251, 243090, 241592, 240030, 238668, 237496, 236508, 236047, 236443, 237422, 238323, 238931, 239594, 240482, 241206, 241396, 241181, 240884, 240638, 240624, 241313, 242988, 245254, 247499, 249752, 252660, 256563, 261039, 265630, 270763, 277573, 286780, 297879, 309465, 320144, 328923, 334915, 337185, 335269, 329695, 321764, 312834, 304004, 296204, 290074, 285577, 282057, 278938, 276216, 274178, 272904, 272191, 271810, 271598, 271413, 271217, 271183, 271591, 272619, 274296, 276573, 279299, 282207, 285033, 287687, 290311, 293240, 296863, 301309, 306176, 310781, 314794, 318392, 321654]
52364C21654K432J063q8m19l01m80j088j657j881j722j026K79J626K210K064K023
52348C24689K409K546K013J581K075K972L167K719K750L629M445M515M381M821
52334C68712N751O714P729Q946R998J0505J0855J1756J3185J4486J5376J6246
52322E00259J7386J8472J8967J8683J7964J7446J7559J8020J8040J7318J6546
52311F96660J6542J7199J7734J7750J7491J7261J7130J7108J7039J6492J5241
52300H83647J3817J2950J2553J1769J0069P722N185K633J41k241m624p000q779
52287I37842r250q623p949p948q342q499q077o861m747k201j68R19J632K742M342
52272H74812O014P391Q252Q516Q526Q900R841J0860J1483J1752J1875J1891J2044
$$ y = [321654, 324086, 325149, 325061, 324642, 324341, 323861, 322773, 321116, 319235, 317513, 316487, 316766, 318392, 320602, 322666, 324689, 327098, 329644, 331657, 333238, 335313, 338285, 341452, 344171, 346921, 350550, 354995, 359510, 363891, 368712, 374463, 381177, 388906, 397852, 407850, 418355, 429210, 440966, 454151, 468637, 484013, 500259, 517645, 536117, 555084, 573767, 591731, 609177, 626736, 644756, 662796, 680114, 696660, 713202, 730401, 748135, 765885, 783376, 800637, 817767, 834875, 851914, 868406, 883647, 897464, 910414, 922967, 934736, 944805, 952527, 957712, 960345, 960486, 958245, 953621, 946621, 937842, 928592, 919969, 912020, 904072, 895730, 887231, 879154, 872293, 867546, 865345, 865177, 866096, 867728, 870470, 874812, 880826, 888217, 896469, 904985, 913511, 922411, 932252, 943112, 954595, 966347, 978222, 990113, 1002157]
52259A002157J2829J4192J5188J5023J4092J3384J3239J3197J2822J1941J0304
52248A148368P726M573J521j198l797o132p619q145q575r851j1804j3277j3414
52235A078376j2542j1728j1651j2083j2371j2222j1889j1669j1405j0557q832
52224I51427o693n108m598m593m096k913j830j398j125k74J119K521L784M966
52210I31189N619N187L988L039K770K755K711K888L238L132K351J696K093L579
52196I76235N500P194Q149Q092P367O701O206N153L140R07n86j372k204l460m923
52181A022099o315p481q212q442q442q438q203p406o173m963m104l652l470l135
52167I33663k149n02J166K262K702K606J978J066N60R37J889K712K959K501J404
$$ y = [1002157, 1014986, 1029178, 1044366, 1059389, 1073481, 1086865, 1100104, 1113301, 1126123, 1138064, 1148368, 1156094, 1160667, 1162188, 1160990, 1157193, 1151061, 1143442, 1135297, 1126722, 1116871, 1105067, 1091790, 1078376, 1065834, 1054106, 1042455, 1030372, 1018001, 1005779, 993890, 982221, 970816, 960259, 951427, 944734, 939626, 935028, 930435, 926339, 923426, 921596, 920198, 919073, 918799, 919918, 922439, 926223, 931189, 936808, 941995, 945983, 949022, 951792, 954547, 957258, 960146, 963384, 966516, 968867, 970563, 972656, 976235, 981735, 988929, 997078, 1005170, 1012537, 1019238, 1025444, 1030597, 1033737, 1034644, 1034058, 1032686, 1030482, 1027022, 1022099, 1015784, 1008303, 1000091, 991649, 983207, 974769, 966566, 959160, 952987, 948024, 943920, 940268, 936798, 933663, 931514, 931012, 932178, 934440, 937142, 939748, 941726, 942792, 943352, 944289, 946178, 948890, 951849, 954350, 955754]
52152I55754J23o22n43pO18J323J997K220J953J712J705J403N06l78n28NQ00J676
52134I69717K389K666L063M829Q030J0897J2148J2904J4940J8003K0513K2216
52122A102315K4094K5980K6438K5313K4433K5078K6309K6610K5845K4691K3272
52111A380378K1426J9600J8412J7680J6608J4776J2482J0319Q680P438O020M040
52099A537859J887J82j240l183n938r008j1955j4703j6919j8037j8255j8602j9542
52086A402546k0243j9657j7730j5128j2470j0195q566p225n390k924o61P85J919
52073A285061L542N592P466R008J0510J1968J3002J3410J3377J3264J3454J4174
52061A413828J5153J5696J5371J4462J3526J2816J2200J1262R352O046J889j776
$$ y = [955754, 955877, 955255, 954712, 954705, 955323, 956646, 958643, 960863, 962816, 964528, 966233, 967636, 968142, 967764, 967236, 967241, 968041, 969717, 972106, 974772, 977835, 982664, 990694, 1001591, 1013739, 1026643, 1041583, 1059586, 1080099, 1102315, 1126409, 1152389, 1178827, 1204140, 1228573, 1253651, 1279960, 1306570, 1332415, 1357106, 1380378, 1401804, 1421404, 1439816, 1457496, 1474104, 1488880, 1501362, 1511681, 1520361, 1527799, 1533819, 1537859, 1539746, 1539928, 1538688, 1535505, 1529567, 1520559, 1508604, 1493901, 1476982, 1458945, 1440690, 1422088, 1402546, 1382303, 1362646, 1344916, 1329788, 1317318, 1307123, 1298557, 1291332, 1285942, 1283018, 1282357, 1283142, 1285061, 1288603, 1294195, 1301661, 1310669, 1321179, 1333147, 1346149, 1359559, 1372936, 1386200, 1399654, 1413828, 1428981, 1444677, 1460048, 1474510, 1488036, 1500852, 1513052, 1524314, 1533666, 1539712, 1541601, 1539825]
52049A539825m083n453o882q859j1276j3874j6318j8159j9191j9666j9920j9971
52037A376173j9729j9258j8637j7811j6793j5680j4516j3506j3324j4453j6099
52026A196367j6677j5715j4431j3965j3878j3171j1904j0819r953q755p354o636
52014A053109p040q042q918r410r660j0019j0927j2490j4192j5489j6407j7207
52002I13308j7675j7417j6604j5720j4709j3141j1243r983r962j0767j1646j2254
51990G52187j2628j2889j3193j3624j3995j4097j4087j4305j4692j4917j4964
51979E98796j5052j4945j4051j2375j0705r541q449o885n008l200j275J029L173
51966E01512M281M477M881O053P130O951N498L627J739m90l017m953n573n304
$$ y = [1539825, 1535742, 1530289, 1523407, 1514548, 1503272, 1489398, 1473080, 1454921, 1435730, 1416064, 1396144, 1376173, 1356444, 1337186, 1318549, 1300738, 1283945, 1268265, 1253749, 1240243, 1226919, 1212466, 1196367, 1179690, 1163975, 1149544, 1135579, 1121701, 1108530, 1096626, 1085807, 1075854, 1067099, 1059745, 1053109, 1046069, 1038027, 1029109, 1019699, 1010039, 1000020, 989093, 976603, 962411, 946922, 930515, 913308, 895633, 878216, 861612, 845892, 831183, 818042, 806799, 796816, 786854, 776087, 764441, 752187, 739559, 726670, 713477, 699853, 685858, 671761, 657674, 643369, 628677, 613760, 598796, 583744, 568799, 554748, 542373, 531668, 522127, 513678, 506793, 501785, 498585, 497310, 498339, 501512, 505793, 510270, 515151, 521204, 528334, 535285, 540783, 544410, 546149, 545659, 542642, 537689, 532116, 526812]
51952E26812n098n112m703l582k242j000O40L169O136Q665J0682J2910J5724J8633
51938E81634K1129K3460K6064K8488K9336K7392K2499J5367O880k045j0319j6933
51926G52952k1548k4537k6267k6737k6046k4783k3436k1844j9729j7512j5855
51915E04658j4529j2664j0220q246p296o431m554k020j20P55J454K711M191N105
51901D52794N115M345K854N38k532n819q472r829r876r172q344p676p148o509
51887C90269n374l548j378N28K003L369M722N680O037O170O419O606O538O446
51873D34487O412N853M237J983L6j263k153k677k665k435k655l363l718k928j025
51858D28126J334L392M558M630L863K591Q57j227l075m142m700n422o317o792
$$ y = [526812, 521714, 516602, 511899, 508317, 506075, 505075, 505715, 508884, 515020, 523685, 534367, 547277, 563001, 581634, 602763, 626223, 652287, 680775, 710111, 737503, 760002, 775369, 782249, 780204, 769885, 752952, 731404, 706867, 680600, 653863, 627817, 603034, 579598, 557754, 538025, 520513, 504658, 490129, 477465, 467245, 458999, 451703, 445272, 440718, 438698, 438578, 439333, 440787, 443498, 447689, 452794, 457909, 462254, 465108, 465646, 463114, 457295, 448823, 438994, 429118, 419946, 411602, 403926, 396778, 390269, 384895, 381347, 379969, 380497, 382500, 385869, 390591, 396271, 402308, 408478, 414897, 421503, 428041, 434487, 440899, 446752, 450989, 452972, 453008, 451745, 449592, 446915, 444250, 441815, 439160, 435797, 432079, 429151, 428126, 429460, 432852, 437410, 442040, 445903, 448494, 449351, 448124, 445049, 440907, 436207, 430785, 424468, 417676]
51844D17676o717o547o321n490m114l254l556m139l676k119o03J05K97N63J018
51829C73123J457J766J888J633P78n72j827k306j915j311j152j256r26l1P49R13
51813C71011P98R37J219J183Q03M70L72L52K47j4n13j172j554j273n53J0J92K17
51795C72732Q7n89j892l166l643l211k305j262j47R03J545J520R32K01j68R2P52
51778C62381J263J387J591K467L829M843N124N299O098P278P910P485O288M795
51764D28038L292K045J223L95j257l872o418p760p918p805p979q154p857p006
51750C68967n794m409l029j821p97J23R06J443J778K132K619L151L618M056M592
51735C77535N250N790N665M484K644J255J101J877K743L322L689L643K717R15
$$ y = [417676, 410959, 404412, 398091, 392601, 388487, 385233, 381677, 377538, 373862, 371743, 371140, 371245, 371542, 372105, 373123, 374580, 376346, 378234, 379867, 380645, 380073, 378246, 375940, 374025, 372714, 371562, 370306, 369380, 369349, 370098, 371011, 371809, 372746, 373965, 375148, 375951, 376421, 376793, 377145, 377392, 377378, 376865, 375693, 374139, 372866, 372313, 372323, 372515, 372732, 372819, 372230, 370338, 367172, 363529, 360318, 358013, 356751, 356604, 357507, 359052, 360572, 361504, 361705, 361537, 361629, 362381, 363644, 365031, 366622, 369089, 372918, 377761, 382885, 388184, 394282, 401560, 409470, 416955, 423243, 428038, 431330, 433375, 434598, 434993, 433736, 429864, 423446, 415686, 407768, 399963, 391984, 383830, 375973, 368967, 363173, 358764, 355735, 353914, 353117, 353240, 354146, 355589, 357367, 359499, 362118, 365269, 368887, 372943, 377535, 382785, 388575, 394240, 398724, 401368, 402623, 403724, 405601, 408344, 411666, 415355, 418998, 421715, 422630]
51721D22630j120k894m362n355n290l948k095q63o77j127j663k044k197j976j180
51706C85839K49J932L029K822J466p3j000j306j297r43o0J088J890J975J402L23
51690C97336j090k451l306l612l783m125m441m301l526k256p45P35J842K277K083
51675C70637J782K040L080M354N042M960M869N651P270Q753R227Q599P086M540
51661D47890P40l691p248q764q380p001n106k502P91M088O586P928P859N916K020
51646D41126k743o597q511q829q418p649o381m634k859j617j159j328j735k057
51632C76609k208k210k042j742j568j797k307k678k741k754k896k959k769k630
51618C43308k890l290l244k759k495k724k741j769j78Q00N65j38j58P38J849K543
$$ y = [422630, 421510, 418616, 414254, 408899, 403609, 399661, 397566, 396703, 396026, 394899, 393236, 391192, 388995, 387019, 385839, 386088, 388020, 391049, 393871, 395337, 395264, 394264, 392958, 391661, 390718, 390658, 391746, 393636, 395611, 397013, 397336, 396246, 393795, 390489, 386877, 383094, 378969, 374528, 370227, 366701, 364445, 363700, 364435, 366277, 368554, 370637, 372419, 374459, 377539, 381893, 386935, 391895, 396764, 402415, 409685, 418438, 427665, 436264, 443350, 447890, 448630, 444939, 437691, 428927, 420547, 413546, 408440, 405938, 406729, 410817, 417403, 425331, 433190, 439106, 441126, 438383, 431786, 423275, 414446, 406028, 398379, 391998, 387364, 384505, 382888, 381729, 380401, 378666, 376609, 374401, 372191, 370149, 368407, 366839, 365042, 362735, 360057, 357316, 354562, 351666, 348707, 345938, 343308, 340418, 337128, 333884, 331125, 328630, 325906, 323165, 321396, 321218, 322018, 322583, 322445, 322287, 323025, 324874, 327417]
51602C27417K899L417M427N831P307Q676J0026J1302J1677R856N551L63l441n066
51588D00242n456n532n111l873k419j497p58P31L052N392P330R256J1332J2889
51574D25578J3233J2607J1975J2094J2829J3105J1614Q102M083J715J884L809
51562E32628O563J0240J5219K0966K6180K9765L1205L0311K7278K2895J8218J3859
51550G85327R786N641J042m221r859j5069j9145k2026k3971k4925k4600k3107
51538F34873k1020j8811j6669j4876j3857j3550j3231j2359j1301j0813j0952
51527D77434j1019j0535r759r084q429p613o909o732o908o789o111n242m564m001
51513C73739l362k673k005j411j232j848k849l031j833l06J44l97o11P9P80N61
$$ y = [327417, 330316, 333733, 338160, 343991, 351298, 359974, 370000, 381302, 392979, 402835, 408386, 408749, 405308, 400242, 394786, 389254, 384143, 380270, 377851, 376354, 375596, 376327, 379379, 384771, 392101, 401357, 412689, 425578, 438811, 451418, 463393, 475487, 488316, 501421, 513035, 521137, 525220, 526935, 528819, 532628, 539191, 549431, 564650, 585616, 611796, 641561, 672766, 703077, 730355, 753250, 771468, 785327, 795113, 800754, 801796, 797575, 787716, 772647, 753502, 731476, 707505, 682580, 657980, 634873, 613853, 595042, 578373, 563497, 549640, 536090, 522859, 510500, 499199, 488386, 477434, 466415, 455880, 446121, 437037, 428608, 420995, 414086, 407354, 400446, 393657, 387546, 382304, 377740, 373739, 370377, 367704, 365699, 364288, 363056, 361208, 358359, 355328, 353495, 353189, 353333, 352936, 352325, 352404, 353184, 353745]
51497C53745k67p37n11LM48Q83J481K124K416K067J310P51N81K29p92j997k492
51480C59242k281k200k581k857k724k779l516m416m657m237l801l744l974m214
51466C11261m052l087j496j53K83Q5j20k15l37k34M11J274J726J807K184L190
51450C12527M460N531O326P027P928R405J1546J3659J4594J3654J1110P877M939
51437D30583K985K196K242K525K381J148j524n138q500j0701j1735j1887j1114
51424C83461r414p335n481l935k682k155k520k919k372j223o64r08r35j03R89
51409C41804J562J619J448J067O23O75J462K385K722K447J976J593J477J837K605
51394C67302L332L762M164M895O026P547R431J1234J2269J2623J3434J5636J8886
$$ y = [353745, 353478, 352741, 352230, 352233, 352681, 353564, 355045, 357169, 359585, 361652, 362962, 363713, 364294, 364523, 363731, 361734, 359242, 356961, 354761, 352180, 349323, 346599, 343820, 340304, 335888, 331231, 326994, 323193, 319449, 315475, 311261, 307209, 304122, 302626, 302473, 302756, 302841, 302721, 302506, 302169, 301935, 302346, 303620, 305346, 307153, 309337, 312527, 316987, 322518, 328844, 335871, 343799, 353204, 364750, 378409, 393003, 406657, 417767, 425644, 430583, 433568, 435764, 438006, 440531, 442912, 444060, 442536, 437398, 428898, 418197, 406462, 394575, 383461, 374047, 366712, 361231, 357296, 354614, 352459, 349939, 347020, 344648, 343425, 342761, 341853, 340918, 340815, 341804, 343366, 344985, 346433, 347500, 348123, 348798, 350260, 352645, 355367, 357814, 359790, 361383, 362860, 364697, 367302, 370634, 374396, 378560, 383455, 389481, 397028, 406459, 417693, 429962, 442585, 456019, 471655, 490541]
51381D90541K2227K5397K8914L3184L7982M2462M5220M4825M0976L4917K8242
51370H74887K1534J4616P558O30o316j3535k0546k6395l0682l3750l5904l7201
51358G14896l7800l7835l6925l4637l1385k8096k4973k1544j8012j5401j4018
51347D14270j2793j0804q580p148o513n969n262m606l861k676j279k45L53Q37
51333C45724J028L76r67k065k449k697l383m120m138l342k278j355o24q5K66O35
51317C20526J210J789J934J531R10L79p5n83j083j381j420j399j564j852j777
51302C17145r04M98J513J461O19j79m89n39o52q03p98o03k34L52J052J517J530
51285C20486J451J901K992M133M771N028N303N452M835L295J643Q24P97O98M2
$$ y = [490541, 512768, 538165, 567079, 600263, 638245, 680707, 725927, 770752, 811728, 846645, 874887, 896421, 911037, 918595, 919225, 912909, 899374, 878828, 852433, 821751, 788001, 752097, 714896, 677096, 639261, 602336, 567699, 536314, 508218, 483245, 461701, 443689, 428288, 414270, 401477, 390673, 382093, 374945, 368432, 362463, 357201, 352595, 348734, 346058, 344779, 344534, 344887, 345724, 346752, 347128, 346161, 344096, 341647, 338950, 335567, 331447, 327309, 323967, 321689, 320334, 319710, 319625, 319891, 320526, 321736, 323525, 325459, 326990, 327900, 328279, 328204, 327621, 326538, 325157, 323737, 322338, 320774, 318922, 317145, 316241, 316739, 318252, 319713, 320332, 320153, 319664, 319125, 318473, 317670, 316872, 316269, 316035, 316387, 317439, 318956, 320486, 321937, 323838, 326830, 330963, 335734, 340762, 346065, 351517, 356352, 359647, 361290, 362114, 362911, 363609, 363651]
51270C63651o81p42n4R14J718K175K163J603N72p37k143l345l926l752l254k956
51254C51206k828k503k040j979k514l046k848j916r15l77k57j65P8K55R0k19p7
51237C29945P81J824K308K139J770J332M71q72k123k780k961k953k654j894r41
51222C23392k27K47Q10J512K060K220J976J411P36L46N23J089J642K033K363K699
51206C44832K992L199L177K690J790R88O58N20J42k69k02J77P3p72j689j976j674
51189C54656j175p02m41o39j073r58P2J214J320L39o36p19o0O28R01P66M29O6
51171C53988k95p57j275j466r75k8P31R93J070J263J381J165Q81J009J448J469
51155C60602N83q75k144k762k777k473k126j880j704j452j066o06o9O14J278J531
$$ y = [363651, 362970, 362228, 362174, 363088, 364806, 366981, 369144, 370747, 371319, 370582, 368439, 365094, 361168, 357416, 354162, 351206, 348378, 345875, 343835, 341856, 339342, 336296, 333448, 331532, 330617, 330240, 329983, 329818, 329896, 330151, 330241, 330022, 329945, 330726, 332550, 334858, 336997, 338767, 340099, 340570, 339698, 337575, 334795, 331834, 328881, 326227, 324333, 323392, 323165, 323412, 324222, 325734, 327794, 330014, 331990, 333401, 334137, 334483, 335006, 336095, 337737, 339770, 342133, 344832, 347824, 351023, 354200, 356890, 358680, 359668, 360326, 360846, 360988, 360719, 360517, 360694, 360767, 359995, 358306, 356330, 354656, 353481, 352779, 352338, 351699, 350626, 349668, 349740, 350954, 352274, 352613, 351977, 351258, 351198, 351826, 352727, 353493, 353922, 353988, 353693, 352936, 351661, 350195, 349220, 349192, 349923, 350916, 351986, 353249, 354630, 355795, 356676, 357685, 359133, 360602, 361185, 360310, 358166, 355404, 352627, 350154, 348028, 346148, 344444, 342992, 341926, 341320, 341251, 341865, 343143, 344674]
51139C44674J272R82J143J501J383O45j53n00m06l4O01J328J700J501J110R91
51123C57738J107J125R95R33J016J118J159J201J311J550J918K182K034J556J248
51108C78191J394J670J762J842K084K123J574P80M14N36P54J014J467J710J167
51093C98482K80K93J497K552K090L68j237j785j341m62K45L82R7K6N04J093J195
51076D04279P74J70l56n16J09J498K907L734M291N091N865O130O428P913J0749
51061D59066J3921J6677J9026K0535J9908J6616J2124Q594O917O752P789R715
51049F17640J1281J0831Q155M898K630J179p31l705p127r942j1415j1187r245
51036F03262o085k860j205k537o880j2266j5874j6272j4395j2166j0560r326p938
$$ y = [344674, 345946, 346928, 348071, 349572, 350955, 351600, 351447, 350947, 350541, 350507, 351108, 352436, 354136, 355637, 356747, 357738, 358845, 359970, 360965, 361898, 362914, 364032, 365191, 366392, 367703, 369253, 371171, 373353, 375387, 376943, 378191, 379585, 381255, 383017, 384859, 386943, 389066, 390640, 391420, 391834, 392370, 393124, 394138, 395605, 397315, 398482, 398762, 399055, 400552, 403104, 405194, 405562, 404325, 402540, 401199, 400737, 400982, 401364, 401461, 401487, 401991, 403084, 404279, 405053, 405223, 404867, 404351, 404460, 405958, 408865, 412599, 416890, 421981, 427846, 433976, 440404, 448317, 459066, 472987, 489664, 508690, 529225, 549133, 565749, 577873, 586467, 593384, 600136, 607925, 617640, 628921, 639752, 647907, 652805, 655435, 656614, 655883, 652178, 645051, 635109, 623694, 612507, 603262, 597177, 594317, 593112, 590575, 583695, 571429, 555555, 539283, 524888, 512722, 502162, 492836, 484898]
51023D84898o142l780r62J601L124L766M552O129Q118R722J0516J0476R879R340
51009E51237R381R700R416Q306P160O599O156N064L396J807O61n1k67j00j11o76
50993F17678j255r89J52J465K571L702N072O690Q761J1500J4490J6833J7968J7862
50979G22500J6515J4201J2096J1759J3583J6568J9850K3671K8383L3348L7635
50968I50109M1307M5233M9781N4318N8044O0871O3382O6046O8530O9786O9002
50957A596409O6390O2729N8291N2707M5956L8840L2220K6243K0552J4879R196
50946B024412L814m42k583k549j721j941m064p456j0663j2552j3227j3962j5862
50933A941204j8576k0892k2519k4510k7717l1687l5551l9155m2724m6088m8928
$$ y = [484898, 478756, 474976, 474014, 475615, 478739, 482505, 487057, 493186, 501304, 511026, 521542, 532018, 541897, 551237, 560618, 570318, 579734, 588040, 595200, 601799, 607955, 613019, 616415, 618222, 618883, 618832, 618565, 618465, 618354, 617678, 616423, 615434, 615586, 617051, 619622, 623324, 628396, 635086, 643847, 655347, 669837, 686670, 704638, 722500, 739015, 753216, 765312, 777071, 790654, 807222, 827072, 850743, 879126, 912474, 950109, 991416, 1036649, 1086430, 1140748, 1198792, 1259663, 1323045, 1389091, 1457621, 1527407, 1596409, 1662799, 1725528, 1783819, 1836526, 1882482, 1921322, 1953542, 1979785, 2000337, 2015216, 2024412, 2028226, 2027784, 2025201, 2022652, 2020931, 2018990, 2014926, 2007470, 1996807, 1984255, 1971028, 1957066, 1941204, 1922628, 1901736, 1879217, 1854707, 1826990, 1795303, 1759752, 1720597, 1677873, 1631785, 1582857]
50922A582857n1264n3100n4019n3753n2617n0836m8051m4232m0370l7311l4535
50911A062769l1150k7610k5152k3752k2061j9451j6795j4955j3681j2496j1554
50900H44112j1001j0274q831o950n212l707k348j458j355j649j635j162n77qO81
50885G88626J387J871K354L404N004O304O646O485O807P894R150J0107J0989J2042
50871H79070J2948J3419J4006J5501J7744J9805K1447K3523K6573K9915L2747
50860A106698L5463L9005M3520M8531N4166O1134O9464P8240Q6749R5172J03881
50849A822023J12664J21038J28779J35834J42044J47187J51046J53264J53337
50840C067216J50689J44520J33855J18392R9328P8742N8087L7782J8183J50j5579
$$ y = [1582857, 1531593, 1478493, 1424474, 1370721, 1318104, 1267268, 1219217, 1174985, 1134615, 1097304, 1062769, 1031619, 1004009, 978857, 955105, 933044, 913593, 896798, 881843, 868162, 855666, 844112, 833111, 822837, 814006, 807056, 801844, 798137, 795789, 794331, 792976, 791327, 789692, 788530, 787953, 787945, 788626, 790013, 791884, 794238, 797642, 802646, 808950, 815596, 822081, 828888, 836782, 845932, 856039, 867028, 879070, 892018, 905437, 919443, 934944, 952688, 972493, 993940, 1017463, 1044036, 1073951, 1106698, 1142161, 1181166, 1224686, 1273217, 1327383, 1388517, 1457981, 1536221, 1622970, 1718142, 1822023, 1934687, 2055725, 2184504, 2320338, 2462382, 2609569, 2760615, 2913879, 3067216, 3217905, 3362425, 3496280, 3614672, 3714000, 3792742, 3850829, 3888611, 3906794, 3906944, 3891365]
50829C891365k8790l9200m6074m8873m7768m3190l5514k5752j5907q020l102j470
50817C547705l604r889j9705l1609m4487n7979p1793q5236r7609j08621j18154
50806B899019j25800j30831j32548j30726j25847j18935j10914j02111r2483q2249
50796A746575p2108o2740n4302m6419l8664l0962k3642j7136j1703p448m420k567
50784A374464j613j232j330j972l025m134n057n801o437p067p956r298j0804j1951
50770A296787j2772j3961j5846j7803j9065j9712k0327k0970k1157k0741k0057
50759A094376j9098j7270j4400j1411r408q286o842m282r88K291N487Q918J2410
50746A031497J5428J8022K0912K4448K8126L1512L4999L9124M3636M7994N2341
$$ y = [3891365, 3862575, 3823375, 3777301, 3728428, 3680660, 3637470, 3601956, 3576204, 3560297, 3552277, 3549175, 3547705, 3544101, 3534212, 3514507, 3482898, 3438411, 3380432, 3308639, 3223403, 3125794, 3017173, 2899019, 2773219, 2642388, 2509840, 2379114, 2253267, 2134332, 2023418, 1921307, 1828824, 1746575, 1674467, 1611727, 1557425, 1511006, 1472342, 1441380, 1417738, 1400602, 1388899, 1381451, 1377031, 1374464, 1372851, 1371619, 1370289, 1368317, 1365292, 1361158, 1356101, 1350300, 1343863, 1336796, 1328840, 1319542, 1308738, 1296787, 1284015, 1270054, 1254208, 1236405, 1217340, 1197628, 1177301, 1156331, 1135174, 1114433, 1094376, 1075278, 1058008, 1043608, 1032197, 1022789, 1014503, 1007661, 1003379, 1002391, 1004682, 1010169, 1019087, 1031497, 1046925, 1064947, 1085859, 1110307, 1138433, 1169945, 1204944, 1244068, 1287704, 1335698, 1388039]
50735A388039N7127O1949O5813O8609P1304P4379P7014P8340P8591P8342P7330
50724B176837P4906P1188O6758O1369N3809M3219K9932J5015m72j5542k9070l9871
50712B508078m6872m9442m7792m3112l6959l0354k3590j6750j0100m018J039M369
50700B204497N125K827k295r545j8296k8281l9316n0741o1156o8935p3204p4196
50688A786484p2666o9198o4226n8301n1977m5474l8762l1908k5078j8329j1664
50677A298901n203R63P004J3143J9243K4815K9431L2841L4792L5034L3600L0921
50665A555485K7639K4366K1532J9237J7318J5695J4606J4280J4539J4909J5080
50654A754686J5035J4857J4698J4861J5703J7366J9755K2693K5971K9368L2812
$$ y = [1388039, 1445166, 1507115, 1572928, 1641537, 1712841, 1787220, 1864234, 1942574, 2021165, 2099507, 2176837, 2251743, 2322931, 2389689, 2451058, 2504867, 2548086, 2578018, 2593033, 2592561, 2577019, 2547949, 2508078, 2461206, 2411764, 2363972, 2320860, 2283901, 2253547, 2229957, 2213207, 2203107, 2199089, 2200128, 2204497, 2209622, 2212449, 2210154, 2200609, 2182313, 2154032, 2114716, 2063975, 2002819, 1933884, 1860680, 1786484, 1713818, 1644620, 1580394, 1522093, 1470116, 1424642, 1385880, 1353972, 1328894, 1310565, 1298901, 1293698, 1294661, 1301665, 1314808, 1334051, 1358866, 1388297, 1421138, 1455930, 1490964, 1524564, 1555485, 1583124, 1607490, 1629022, 1648259, 1665577, 1681272, 1695878, 1710158, 1724697, 1739606, 1754686, 1769721, 1784578, 1799276, 1814137, 1829840, 1847206, 1866961, 1889654, 1915625, 1944993, 1977805]
50643A977805L6403M0122M3608M6436M8440M9520M9466M8241M6273M4013M1370
50632B471697L7981L4021L0353K7964K7384K8163K8216K4010J2635n544k6428
50621B690452m4626n6328o0395n7920n1304m3130l5010k7298j9876j2849o368
50610B275348m36M677Q192R528Q894O641K347m810j4765k6243l7718m8182n7008
50597B126465o3759o8460p1592p3444p3706p2052o8916o5283o1868n8672n5327
50586A393386n1585m7452m3066l8573l4006k9373k4906k1070j8070j5384j2171
50575A057730q218m175p90J886M272O548Q547J0205J1707J3187J4553J5758J6999
50562A148209J8571K0620K3061K5589K7793K9459L0747L1913L2963L3847L4776
$$ y = [1977805, 2014208, 2054330, 2097938, 2144374, 2192814, 2242334, 2291800, 2340041, 2386314, 2430327, 2471697, 2509678, 2543699, 2574052, 2602016, 2629400, 2657563, 2685779, 2709789, 2722424, 2716880, 2690452, 2645826, 2589498, 2529103, 2471183, 2419879, 2376749, 2341739, 2314441, 2294565, 2281716, 2275348, 2274912, 2279589, 2287781, 2297309, 2306203, 2312844, 2315191, 2310381, 2295616, 2269373, 2231655, 2183473, 2126465, 2062706, 1994246, 1922654, 1849210, 1775504, 1703452, 1634536, 1569253, 1507385, 1448713, 1393386, 1341801, 1294349, 1251283, 1212710, 1178704, 1149331, 1124425, 1103355, 1085285, 1069901, 1057730, 1049512, 1045337, 1044547, 1046433, 1050705, 1057253, 1065800, 1076005, 1087712, 1100899, 1115452, 1131210, 1148209, 1166780, 1187400, 1210461, 1236050, 1263843, 1293302, 1324049, 1355962, 1388925, 1422772, 1457548]
50551A457548L5812L6284L5293L3049L0979L0183L0343L0608L1047L2505L5438
50540A819089L9583M4534M9915N5143N9842O4482O9890P6024Q2027Q7654R3863
50529B542046J01480J10018J18257J25501J31595J36151J38505J38320J35639
50520C677512J30345J22018J10404R5700P8371N8976L8128J6347o087k8779n0821
50509D242114p1098q9002j04484j17231j26155j29975j28213j21405j10537r6569
50499C147445q0334o2567m3884k4843o078J1750K8133M2583N4154O1281O2317
50488C189957N6339M3357K4018m11k7735n5021p9675j00352j16648j28112j34105
50477B671612j34672j31080j25105j18036j10531j03158r6425r0256q4024p7393
$$ y = [1457548, 1493360, 1529644, 1564937, 1597986, 1628965, 1659148, 1689491, 1720099, 1751146, 1783651, 1819089, 1858672, 1903206, 1953121, 2008264, 2068106, 2132588, 2202478, 2278502, 2360529, 2448183, 2542046, 2643526, 2753544, 2871801, 2997302, 3128897, 3265048, 3403553, 3541873, 3677512, 3807857, 3929875, 4040279, 4135979, 4214350, 4273326, 4311454, 4327801, 4321714, 4292935, 4242114, 4171016, 4082014, 3977530, 3860299, 3734144, 3604169, 3475956, 3354551, 3244014, 3147445, 3067111, 3004544, 2960660, 2935817, 2929739, 2941489, 2969622, 3012205, 3066359, 3127640, 3189957, 3246296, 3289653, 3313671, 3313260, 3285525, 3230504, 3150829, 3050477, 2933829, 2805717, 2671612, 2536940, 2405860, 2280755, 2162719, 2052188, 1949030, 1852605, 1762349, 1678325, 1600932]
50467A600932p0832o4933n9457n3591m7087m0644l4967k9858k4656j9243j4141
50456A141523r780o074k774K22K960N462P546Q990J0030J1370J3522J6403J9629
50443A219029K2767K5091K5567K3571J9490J4330R012M296R17q34j531k045k582
50430A357078k647j801RK651N740Q452J0111J1139J2754J5565J9052K2643K6660
50417A487406L1647L7314M2851M8065N3553N9680O5818P0799P3835P4924P4536
50406B120428P3089P0694O7289O2954N7935N2320M5680L7180K6155J2736k036
50395B624424j6816l0861m4213n6947o8394p7325q2872q4990q4067q0483p4570
50384A922886o6813n7817m8187l8400k8632j8738q698R75R515J6551K2127K6021
$$ y = [1600932, 1530100, 1465167, 1405710, 1352119, 1305032, 1264388, 1229421, 1199563, 1174907, 1155664, 1141523, 1131743, 1125669, 1122895, 1123117, 1126077, 1131539, 1139085, 1148075, 1158105, 1169475, 1182997, 1199400, 1219029, 1241796, 1266887, 1292454, 1316025, 1335515, 1349845, 1358857, 1363153, 1364070, 1363236, 1361705, 1359660, 1357078, 1354431, 1352630, 1352639, 1355290, 1361030, 1369482, 1379593, 1390732, 1403486, 1419051, 1438103, 1460746, 1487406, 1519053, 1556367, 1599218, 1647283, 1700836, 1760516, 1826334, 1897133, 1970968, 2045892, 2120428, 2193517, 2264211, 2331500, 2394454, 2452389, 2504709, 2550389, 2587569, 2613724, 2626460, 2624424, 2607608, 2576747, 2532534, 2475587, 2407193, 2329868, 2246996, 2162006, 2077939, 1997456, 1922886, 1856073, 1798256, 1750069, 1711669, 1683037, 1664299, 1655601, 1656576, 1666091, 1682642, 1704769, 1730790]
50372A730790K7414K5432J9743J0654r46j3557k5449l5538m3713n0098n4289n5700
50360A534743n4413n1290m7242m2757l8083l3580k9705k6902k5590k6139k8589
50349A130453l2285l5851l7693l6899l3794k9574k5382k1664j8288j5008j1798
50338H32217q879o516m706l122j536j85N88R91J705L039M498N319N227M605M179
50323H37424M503N487O334O339N764N546N994O357N867M796M017L917M107M017
50309I10469L466K800K686L483M639N119M680M309M960O363P603Q413R201J0108
50295I88299J0905J1744J3169J5196J7210J9010K1153K3532K4131K0125J0607
50284A175081j963j3237k0006k1938k0774j8200j4785j0681o625l613j821m41
$$ y = [1730790, 1758204, 1783636, 1803379, 1814033, 1813087, 1799530, 1774081, 1738543, 1694830, 1644732, 1590443, 1534743, 1480330, 1429040, 1381798, 1339041, 1300958, 1267378, 1237673, 1210771, 1185181, 1159042, 1130453, 1098168, 1062317, 1024624, 987725, 953931, 924357, 898975, 877311, 859023, 844015, 832217, 823338, 816822, 812116, 808994, 807458, 807273, 807861, 808852, 810557, 813596, 818094, 823413, 828640, 833245, 837424, 841927, 847414, 853748, 860087, 865851, 871397, 877391, 883748, 889615, 894411, 898428, 902345, 906452, 910469, 913935, 916735, 919421, 922904, 927543, 932662, 937342, 941651, 946611, 952974, 960577, 968990, 978191, 988299, 999204, 1010948, 1024117, 1039313, 1056523, 1075533, 1096686, 1120218, 1144349, 1164474, 1175081, 1173118, 1159881, 1139875, 1117937, 1097163, 1078963, 1064178, 1053497, 1046872, 1043259, 1041438, 1040997]
50272A040997J320L397N138O103O497P063Q601J1304J4450J7015J8766K0493K2962
50259A184106K5828K7904K8355K7307K5316K2739J9921J7641J6745J7195J7908
50248A430965J7746J6249J3239Q317J487o050j2704j8103k3030k7570l0313k9947
50236A340286k6957k2988j9130j5646j3037j2373j4436j9009k4947l0520l4068
50225A107175l4999l4172l2837l1332k9313k6905k4749k2970k1057j8844j6854
50214H13143j5359j3889j2017j0038q447p309o485o014n830n562m996m378l905
50201G08914l385k728k303k318k251j534n23j77q36j928k808l378l798m075m126
50186F72746l961l630l178k680k231j822j422j140j173j496j768j596q41L13J515
$$ y = [1040997, 1042317, 1045714, 1050852, 1056955, 1063452, 1070515, 1079116, 1090420, 1104870, 1121885, 1140651, 1161144, 1184106, 1209934, 1237838, 1266193, 1293500, 1318816, 1341555, 1361476, 1379117, 1395862, 1413057, 1430965, 1448711, 1464960, 1478199, 1486516, 1488003, 1481953, 1469249, 1451146, 1428116, 1400546, 1370233, 1340286, 1313329, 1290341, 1271211, 1255565, 1242528, 1230155, 1215719, 1196710, 1171763, 1141243, 1107175, 1072176, 1038004, 1005167, 973835, 944522, 917617, 892868, 869898, 848841, 829997, 813143, 797784, 783895, 771878, 761840, 753393, 746084, 739599, 733585, 727755, 722193, 717197, 712819, 708914, 705529, 702801, 700498, 698180, 695929, 694395, 693872, 693695, 692859, 690931, 688123, 684745, 680947, 676872, 672746, 668785, 665155, 661977, 659297, 657066, 655244, 653822, 652682, 651509, 650013, 648245, 646649, 645808, 646121, 647636]
50171F47636K427K912L085L208L495L972M518N043N585O193O749P109P524Q622
50157G18078J0700J3235J5489J7427J9617K2265K4924K7249K9503L2082L5000
50146I65569L8178M1757M5715M9457N2274N4021N4875N4641N2870M9811M6794
50135A505962M5388M6146M8157M9592M8670M4332L6320K4933J0929m333j9122
50124A836974l2070m2696n1152n7569o1906o4235o4876o4090o1732n7465n1448
50113A227735m4790l9037l4977l2110k9576k7377k6159k5881k5417k3841k1484
50102H97086j9298j7578j5872j3903j1922j0210q713p260n794m330k906j580l34
50089G77386Q94J945K441K399K519L387M568N104M825M597N071N834O083N683
$$ y = [647636, 650063, 652975, 656060, 659268, 662763, 666735, 671253, 676296, 681881, 688074, 694823, 701932, 709456, 718078, 728778, 742013, 757502, 774929, 794546, 816811, 841735, 868984, 898487, 930569, 965569, 1003747, 1045504, 1091219, 1140676, 1192950, 1246971, 1301846, 1356487, 1409357, 1459168, 1505962, 1551350, 1597496, 1645653, 1695245, 1743915, 1788247, 1824567, 1849500, 1860429, 1856096, 1836974, 1804904, 1762208, 1711056, 1653487, 1591581, 1527346, 1462470, 1398380, 1336648, 1279183, 1227735, 1182945, 1143908, 1108931, 1076821, 1047245, 1019868, 993709, 967828, 942411, 918570, 897086, 877788, 860210, 844338, 830435, 818513, 808303, 799590, 792330, 786536, 782206, 779300, 777720, 777386, 778280, 780225, 782666, 785065, 787584, 790971, 795539, 800643, 805468, 810065, 815136, 820970, 827053, 832736]
50075H32736N112M660M200L612K989K370J580N64m04r93j271j674k408l116l304
50060H44653l032k889l221l692l804l587l399l255k700j500p1R08J252J509K433
50045H19605M293O622Q744J0487J2205J4040J5463J5896J5569J5387J5948J7007
50033I71266J7997J8714J9386K0291K1501K2868K4195K5488K6976K8770L0473
50022A227925L1355L0968K9390K6939K3891K0515J7114J3940J1246R473Q992R424
50010A461172R368P136J757o692j7297k8510l8388m5292m8688m9228m7998m5770
49998A151570m2854l9337l5310l1049k7101k4037k1917k0192j8407j6804j5967
49987H58595j5934j6221j6626j7393j8301j8306j6749j4434j2722j1787j0683
$$ y = [832736, 837848, 842508, 846708, 850320, 853309, 855679, 857259, 857823, 857419, 856426, 855155, 853481, 851073, 847957, 844653, 841621, 838732, 835511, 831819, 828015, 824428, 821029, 817774, 815074, 813574, 813503, 814411, 815663, 817172, 819605, 823898, 830520, 839264, 849751, 861956, 875996, 891459, 907355, 922924, 938311, 954259, 971266, 989263, 1007977, 1027363, 1047654, 1069155, 1092023, 1116218, 1141706, 1168682, 1197452, 1227925, 1259280, 1290248, 1319638, 1346577, 1370468, 1390983, 1408097, 1422037, 1433283, 1442756, 1451748, 1461172, 1470540, 1477676, 1479433, 1472741, 1455444, 1426934, 1388546, 1343254, 1294566, 1245338, 1197340, 1151570, 1108716, 1069379, 1034069, 1003020, 975919, 951882, 929965, 909773, 891366, 874562, 858595, 842661, 826440, 809814, 792421, 774120, 755814, 739065, 724631, 711909, 700122, 689439]
49976F89439r112p998p979q288p832o708n825n513n324m924m384l695k778j894
49962F07185j433j238p68R6J062K162L765N775P568Q902J0074J0968J0805R290
49948F74213P237N469L782J768j1o45l76m55j537l049m285n332o625q244j0001
49933F51909j1714j3071j3596j3128j2038j0678q987o965n206m301l921l051j280
49920E43973P01K061K851L584M171L955K881J984K317L725N140N953O487P168
49906E96951P815Q126Q409R217J0360J0892J0193Q712P313O249N084L502J729
49893F94552O2j594l523n671p573q812r339r421r397r460r570r527r256q925q682
49878E83864q370p730o840o027n366m605l662k904k585k379j690k88J586L531
$$ y = [689439, 680327, 672329, 664350, 656062, 648230, 641522, 635697, 630184, 624860, 619936, 615552, 611857, 609079, 607185, 605752, 604514, 603746, 603842, 604904, 607066, 610831, 616606, 624174, 633076, 643150, 654118, 664923, 674213, 681450, 686919, 690701, 692469, 692458, 691813, 691437, 690982, 689445, 686396, 682111, 676779, 670154, 661910, 651909, 640195, 627124, 613528, 600400, 588362, 577684, 568697, 561732, 556526, 552225, 548304, 545253, 543973, 544674, 546735, 549586, 553170, 557341, 561296, 564177, 566161, 568478, 572203, 577343, 583296, 589783, 596951, 604766, 612892, 621301, 630518, 640878, 651770, 661963, 670675, 677988, 684237, 689321, 692823, 694552, 694614, 693020, 689497, 683826, 676253, 667441, 658102, 648681, 639284, 629824, 620254, 610727, 601471, 592546, 583864, 575494, 567764, 560924, 554897, 549531, 544926, 541264, 538360, 535775, 533396, 531706, 531418, 533004, 536535]
49864E36535N154O156O617P050P840Q796R600J0424J1624J2950J3513J2675J0529
49851F59463P605M576K240J164J066R01j82k197m604o829q407r136r342r596r918
49836F16804r648q355o492m831l662k834k207j607o81O76J915K388K200K189L108
$$ y = [536535, 541689, 547845, 554462, 561512, 569352, 578148, 587748, 598172, 609796, 622746, 636259, 648934, 659463, 667068, 671644, 673884, 675048, 676114, 677015, 676833, 674636, 670032, 663203, 654796, 645660, 636318, 626722, 616804, 607156, 598801, 592309, 587478, 583816, 580982, 578775, 577168, 576487, 577163, 579078, 581466, 583666, 585855, 588963]
$$ [...]
##END NTUPLES=NMR SPECTRUM
##END=
