##TITLE=AC1460_TOLI013266_7819265_mAeKoEVHjr
##JCAMPDX= 6.0         $$ Bruker NMR JCAMP-DX V2.0
##DATA TYPE= NMR SPECTRUM
##DATA CLASS= NTUPLES
##ORIGIN= BRUKER
##OWNER= Administrator
$$ 1.72 TOPSPIN		Version 2.1
$$ 2013-04-30 21:55:00.241 -0700  Administrator@X
$$ Compression mode = diff/dup
##.OBSERVE FREQUENCY= 400.02188249412
##.OBSERVE NUCLEUS= ^1H
##.ACQUISITION MODE= SIMULTANEOUS (DQD)
##.ACQUISITION SCHEME= undefined
##.AVERAGES= 8
##.DIGITISER RES= 22
##SPECTROMETER/DATA SYSTEM= spect
##.PULSE SEQUENCE= zg30
##.SOLVENT NAME= COFFEE_meoh
##.SHIFT REFERENCE= INTERNAL, COFFEE_meoh, 1, 14.98509
##AUDIT TRAIL= $$ (NUMBER, WHEN, WHO, WHERE, PROCESS, VERSION, WHAT)
$$ ##TITLE= Audit trail, TOPSPIN		Version 2.1
$$ ##JCAMPDX= 5.01
$$ ##ORIGIN= Bruker BioSpin GmbH
$$ ##OWNER= Administrator
$$ $$ E:\/data/COFFEE/nmr/AC1460_TOLI013266_7819265_mAeKoEVHjr/10/pdata/1/auditp.txt
$$ ##AUDIT TRAIL=  $$ (NUMBER, WHEN, WHO, WHERE, PROCESS, VERSION, WHAT)
(   1,<2013-04-30 21:54:53.397 -0700>,<Administrator>,<X>,<go>,<TOPSPIN 2.1>,
      <created by zg
	started at 2013-04-30 21:53:47.303 -0700,
	POWCHK enabled, PULCHK disabled,
       configuration hash MD5:
       F7 49 AB AC A2 8D 51 76 73 8D C1 9A A6 38 9F DE
       data hash MD5: 64K
       73 9A D2 6B 5C 4C CA 75 5E 27 D7 75 08 9D 0C 11>)
(   2,<2013-04-30 21:54:56.428 -0700>,<Administrator>,<X>,<proc1d>,<TOPSPIN 2.1>,
      <Start of raw data processing
       efp LB = 0 FT_mod = 6 PKNL = 1 PHC0 = 0 PHC1 = 0 SI = 32K 
       data hash MD5: 32K
       0C 76 7E F8 8E CD 08 67 46 5F 4E F3 96 E9 30 17>)
(   3,<2013-04-30 21:54:56.741 -0700>,<Administrator>,<X>,<proc1d>,<TOPSPIN 2.1>,
      <pk PHC0 = 97.54761 PHC1 = 0 
       data hash MD5: 32K
       1F 13 2D C8 54 0E 38 5D 53 8D 42 F5 F4 64 17 E8>)
(   4,<2013-04-30 21:54:56.835 -0700>,<Administrator>,<X>,<proc1d>,<TOPSPIN 2.1>,
      <abs ABSG = 1 
       data hash MD5: 32K
       F3 64 AE 40 F1 94 1C FE 8D 3F 9C 54 A3 53 72 16>)
(   5,<2013-04-30 21:54:56.928 -0700>,<Administrator>,<X>,<proc1d>,<TOPSPIN 2.1>,
      <abs ABSG = 2 
       data hash MD5: 32K
       70 29 39 E8 AD 80 2C 52 76 31 E4 D7 FD 7E BE A6>)
(   6,<2013-04-30 21:54:56.991 -0700>,<Administrator>,<X>,<proc1d>,<TOPSPIN 2.1>,
      <abs ABSG = 3 
       data hash MD5: 32K
       7D 92 F9 A3 27 7E 75 01 73 0C E3 CE 7E B1 45 86>)
(   7,<2013-04-30 21:54:57.053 -0700>,<Administrator>,<X>,<proc1d>,<TOPSPIN 2.1>,
      <abs ABSG = 4 
       data hash MD5: 32K
       62 8B 9D 36 14 6A 57 E8 28 1E 61 76 55 34 FF 09>)
(   8,<2013-04-30 21:54:57.100 -0700>,<Administrator>,<X>,<proc1d>,<TOPSPIN 2.1>,
      <abs ABSG = 5 
       data hash MD5: 32K
       8E 73 F5 71 45 67 BF 2E 02 75 22 BB 33 C4 D5 D8>)
$$ ##END=
$$ 
$$ $$ hash MD5
$$ $$ CE A6 8D CC 70 8C 62 39 D7 5A CF 2E 3B A6 7E A0
##$RELAX= 
##$RELAX= 
##$RELAX= 
##$RELAX= 
##$RELAX= 
##$RELAX= 
##$RELAX= 
$$ Bruker specific parameters
$$ --------------------------
##$DU= <E:\>
##$EXPNO= 10
##$NAME= <AC1460_TOLI013266_7819265_mAeKoEVHjr>
$$ [...]
150 150 150 150 150 150 150 150
##$TP07= 0
##$TPNAME0= <>
##$TPNAME1= <>
##$TPNAME2= <>
##$TPNAME3= <>
##$TPNAME4= <>
##$TPNAME5= <>
##$TPNAME6= <>
##$TPNAME7= <>
##$TPOAL= (0..7)
0.5 0.5 0.5 0.5 0.5 0.5 0.5 0.5
##$TPOFFS= (0..7)
0 0 0 0 0 0 0 0
##$TUNHIN= 0
##$TUNHOUT= 0
##$TUNXOUT= 0
##$USERA1= <user>
##$USERA2= <user>
##$USERA3= <user>
##$USERA4= <user>
##$USERA5= <user>
##$V9= 5
##$VALIST= <valist>
##$VCLIST= <CCCCCCCCCCCCCCC>
##$VD= 0
##$VDLIST= <DDDDDDDDDDDDDDD>
##$VPLIST= <PPPPPPPPPPPPPPP>
##$VTLIST= <TTTTTTTTTTTTTTT>
##$WBST= 1024
##$WBSW= 4
##$XGAIN= (0..3)
0 0 0 0
##$XL= 0
##$YL= 0
##$YMAX_a= 608579
##$YMIN_a= -518261
##$ZGOPTNS= <>
##$ZL1= 120
##$ZL2= 120
##$ZL3= 120
##$ZL4= 120
##$ABSF1= 14.98509
##$ABSF2= -5.573092
##$ABSG= 5
##$ABSL= 3
##$ALPHA= 0
##$AQORDER= 0
##$ASSFAC= 0
##$ASSFACI= 0
##$ASSFACX= 0
##$ASSWID= 0
##$AUNMP= <proc_prof1d_extract_pilot.lims>
##$AXLEFT= 0
##$AXNAME= <>
##$AXNUC= <1H>
##$AXRIGHT= 0
##$AXTYPE= 0
##$AXUNIT= <>
##$AZFE= 0.1
##$AZFW= 0.1
##$BCFW= 0
##$BC_mod= 0
##$BYTORDP= 0
##$COROFFS= 0
##$CY= 15
##$DATMOD= 1
##$DC= 0
##$DFILT= <>
##$DTYPP= 0
##$F1P= 0
##$F2P= 0
##$FCOR= 0.5
##$FTSIZE= 32768
##$FT_mod= 6
##$GAMMA= 0
##$GB= 0
##$INTBC= 1
##$INTSCL= 1
##$ISEN= 128
##$LB= 0
##$LEV0= 0
##$LPBIN= 0
##$MAXI= 10000
##$MC2= 0
##$MEAN= 0
##$ME_mod= 0
##$MI= 0
##$NCOEF= 0
##$NC_proc= -8
##$NLEV= 6
##$NOISF1= 0
##$NOISF2= 0
##$NSP= 0
##$NTH_PI= 0
##$NZP= 0
##$OFFSET= 14.98509
##$PC= 1
##$PHC0= 97.54761
##$PHC1= 0
##$PH_mod= 1
##$PKNL= yes
##$PPARMOD= 0
##$PPDIAG= 0
##$PPIPTYP= 0
##$PPMPNUM= 2147483647
##$PPRESOL= 1
##$PSCAL= 4
##$PSIGN= 0
##$PYNMP= <proc.py>
##$REVERSE= no
##$SF= 400.02
##$SI= 32768
##$SIGF1= 0
##$SIGF2= 0
##$SINO= 400
##$SIOLD= 32768
##$SPECTYP= <>
##$SREGLST= <1H.CDCl3>
##$SSB= 0
##$STSI= 32768
##$STSR= 0
##$SW_p= 8223.68421052631
##$SYMM= 0
##$S_DEV= 0
##$TDeff= 65536
##$TDoff= 0
##$TI= <>
##$TILT= no
##$TM1= 0
##$TM2= 0
##$TOPLEV= 0
##$USERP1= <user>
##$USERP2= <user>
##$USERP3= <user>
##$USERP4= <user>
##$USERP5= <user>
##$WDW= 1
##$XDIM= 32768
##$YMAX_p= 465367790
##$YMIN_p= -731770
##$CURPLOT= <Network HP LaserJet P1505>
##$CURPRIN= <$Network HP LaserJet P1505>
##$DFORMAT= <normdp>
##$LAYOUT= <+/1D_H.xwp>
##$LFORMAT= <normlp>
##$PFORMAT= <normpl>
##$SURQMSG= 1
$$ End of Bruker specific parameters
$$ ---------------------------------
##NTUPLES= NMR SPECTRUM
##VAR_NAME=  FREQUENCY,     SPECTRUM/REAL,   SPECTRUM/IMAG
##SYMBOL=    X,             R,               I
##VAR_TYPE=  INDEPENDENT,   DEPENDENT,       DEPENDENT
##VAR_FORM=  AFFN,          ASDF,            ASDF
##VAR_DIM=   32768,         32768,           32768
##UNITS=     HZ,            ARBITRARY UNITS, ARBITRARY UNITS
##FACTOR=    0.250966925370066, 1,           1
##FIRST=     8223.43324360094, 62481,        -83744
##LAST=      0,             -105521,         -112248
##MIN=       0,             -731770,         0
##MAX=       8223.43324360094, 465367790,    0
$$ Real data points
##PAGE= N=1
##DATA TABLE= (X++(R..R)), XYDATA
$$ [...]
19577i1844F0050b81819Q5967i3055j7550m4326k03612E3297i4205J8478j05157
19566a80884A7318a39066C6622J16433g2782r7722h2906B71641e92672a34826
19555B93283g2431A73351q1358a6333j04160M9612b0275L400b769l12850d2747
19543b7150j89341n256A05497M5784N3713l6859f2503k1582j53018A77492b18435
19531C8558d8578C1244b76536J02751A50551K9057b48857O6849h5119n0402F6783
19519D1395b16816A32460a11878E9372a67619c9166o3465D7241J01543c06874
19508h181j14836B82Q4220N4853a07732e0325k13339j29903F5495L0843d521p5374
19496g9895m8161k15706j68546b10308f7708j09012A31157P7957d17591G5627
$$ y = [-91844, 60050, -281819, -195852, -93055, -110605, -154931, -358543, 53297, -94205, -75727, -180884, 17318, -139066, 36622, 153055, -72782, -170504, -82906, 271641, -592672, -134826, 293283, -72431, 173351, 91993, -16333, -120493, -70881, -20275, -16875, -2769, -315619, -42747, -27150, -216491, -221747, 105497, 151281, 204994, 168135, -62503, -84085, -237103, 177492, -218435, 38558, -48578, 31244, -276536, -173785, 150551, 179608, -248857, -182008, -85119, -135521, 66783, 41395, -216816, 132460, -111878, 59372, -167619, -39166, -102631, 47241, 148784, -306874, -8181, -123017, 282, 84502, 139355, -107732, -50325, -263664, -393567, 65495, 96338, -4521, -79895, -128056, -343762, -512308, -210308, -67708, -176720, 131157, 209114, -417591, 75627]
19485a59565e5458r5372j37221D5597d0685J0631j92582n6205d926j65849M317
19474a66458A71473J09944h494E6447K9863c6241A26929h0980p6519F2761d47733
19462a03598A81104E1836g5078A4027b20874a09108n7821B0318b07929C5765a11235
19450a50051n1160B52135j15507a56877M7957q6147I2054b5339A7307a98381c4654
19438A40966b34873A64864d8168A94678A6528J86257D98N7682a9107A04103b9497
19426g9905K9012o4765E1444K04494d7466j7063k15404O3559b8051j7921j1616
19415e7588n6566j26947L7575E4215R9899f8749B28316A13506a99768A03382a17000
19403a50928n45388A43402a44658C01602b07211j56805J34980d0521A73667a88224
$$ y = [-159565, -55458, -150830, -288051, 45597, -40685, -30054, -222636, -278841, -4926, -170775, -166458, 171473, 281417, -8494, 56447, 86310, -36241, 126929, -80980, -157499, 62761, -447733, -103598, 181104, 51836, -75078, 14027, -220874, -109108, -166929, 20318, -207929, 35765, -111235, -150051, -201211, 252135, 136628, -156877, -108920, -195067, 92054, -25339, 17307, -198381, -34654, 140966, -234873, 164864, -48168, 194678, 16528, 202785, 498, 58180, -19107, 104103, -29497, -79905, -50893, -115658, 51444, 255938, -47466, -64529, -279933, -216374, -28051, -45972, -57588, -114154, -241101, -203526, 54215, 154114, -68749, 228316, 113506, -199768, 103382, -117000, -150928, -696316, 143402, -144658, 301602, -207211, -364016, -229036, -40521, 173667, -188224]
19392a22665B73159c51611J53285E7175D496K6021a32004q3165r8607d060F4983
19380A55451k4976C2412h9230k41038B25191a94357P1287r7302C00302j26493
19370A73809a71935f582B74604H1015i302k06703j8321l5482j12802A55053Q8800
19359B43853b6709j27941p9880c9335H5677k9521O1349J72549A38621j7265a01825
19347a40399o8479j67377D740a57017O9098A83236R8497A7139O5937e869p39D2506
19334c0130m9497j52662d041I1227l8405K81493a47076N5698E742a8223l01756
19323c19979R5191k9992J26713M5763A25899j4289a50383O9034a5849A97732r4399
19312A03333K20181H2392I000b17084A91130a45613r4452B9181e8775B75262a46816
$$ y = [-122665, 273159, -351611, -198326, 57175, 4496, 30517, -132004, -215169, -313776, -4060, 64983, 155451, 130475, 32412, -89230, -330268, 225191, -194357, -123070, -220372, 300302, 173809, -171935, -6582, 274604, 81015, -9302, -216005, -234326, -269808, -382610, 155053, 243853, -26709, -154650, -234530, -39335, 85677, 56156, 117505, 290054, 138621, 121356, -101825, -140399, -208878, -376255, 4740, -157017, -87919, 183236, 281733, 17139, 83076, -5869, -6608, 42506, -30130, -79627, -232289, -4041, 91227, 52822, 334315, -147076, -91378, 5742, -18223, -319979, -224788, -254780, -128067, -82304, 125899, 111610, -150383, -81349, -15849, 197732, 103333, 323514, 82392, 9000, -217084, 191130, -145613, -240065, 29181, -58775, 275262, -146816]
19300f2223A01818a7241o3132j57991P3623j6933P0572M9436G2932c47260a40424
19288b46064A45467k2511a43667A2866n013c9390p487m5795j1418D7058l915J10736
19276A53879c5241A10550b42652k3911c2674l2639H8024a88034H4145a58660f5752
19264h2285A38336a19393l2629I652P076R857K90451b06796k4381O5779c3845
19252e3386j70498N2959r9183b388j61465B14154a25737B09831e5002B16110h4140
19240g8356A15497a52235j21458g0839A58902f2347j3119B42513E6496M5401J2820
19229A14717d2241A22009e0143A38423a98896j42893A32759B1272J7841b43874
19218b47688I7105g5564l3525j0088b1731k63204A43383J25151a6674l53310A62510
$$ y = [-62223, 101818, -17241, -80373, -238364, -164741, -181674, -111102, -61666, 72932, -347260, -140424, -246064, 145467, 122956, -143667, 12866, 7853, -39390, -46877, -92672, -104090, 47058, 43143, 153879, -35241, 110550, -242652, -266563, -32674, -65313, 88024, -188034, 84145, -158660, -65752, -82285, 138336, -119393, -152022, 9652, 16728, 26585, 317036, -206796, -231177, -165398, -33845, -53386, -223884, -170925, -270108, -2388, -163853, 214154, -125737, 209831, -55002, 216110, -84140, -78356, 115497, -152235, -273693, -70839, 158902, -62347, -75466, 242513, 56496, 101897, 114717, -42241, 122009, -50143, 138423, -198896, -341789, 132759, 21272, 39113, -243874, -247688, 97105, -75564, -109089, -119177, -21731, -284935, 143383, 268534, -16674, -369984, 162510]
19206a45555j43134b4285A92125H4681J7152c5261A7681M33374c9510D25767c44729
19194a14071l00830l3398b04636R6633j07529R0173d93k85322a666A97806C7677
19182b36327A67634b27022B49128f2608b359k74586A58719b05359N1415j10397
19172b64341j19838f6910n4226L4718K348A93104a85631C210a05877k51466c6318
19160B74910d20471A7021a56552E7248K67171D0616a67704j4707P7821A78508
19149I176b47710m7804F6367L00314c88535h8091j00468l5065L9683j277O5193
19138a20025o0878n4136L3545P7132D6472a31194A0142a8486l35717a21004A50906
19126I7168c27735a58816H9455a80825l42720c7104j90628B61154b28969g7885
$$ y = [-145555, -288689, -24285, 192125, 84681, 101833, -35261, 17681, 451055, -39510, 425767, -344729, -114071, -414901, -448299, -204636, -108003, -215532, -125359, -493, -285815, -1666, 197806, 37677, -236327, 167634, -227022, 249128, -62608, -2359, -276945, 158719, -205359, -153944, -264341, -384179, -66910, -121136, -86418, -84070, 193104, -185631, 3210, -105877, -357343, -36318, 274910, -420471, 17021, -156552, 57248, 324419, 40616, -167704, -182411, -104590, 178508, 9176, -247710, -295514, 66367, 366681, -388535, -88091, -188559, -223624, -183941, -185218, -120025, -180903, -235039, -201494, -124362, 46472, -131194, 10142, -18486, -354203, -121004, 150906, 97168, -327735, -158816, 89455, -180825, -523545, -37104, -227732, 261154, -228969, -77885]
19115a63812O8405A9762M8838K578a00267A31408a05898r3223o204j88814C00739
19103B3618a62330C0366g4473B50680d12631a19009a578B49293d37503A78382
19092b8598j16592o7642E2537N5193f7573k52236b258j35150j18121j00143G50
19080B47669b85073C0648i1895o0032o1088c4360C9792J52102I113J08720b40853
19068g109A67719b0001A389J12874a56712P1666p814j00658C42599B3162P7336
19057A00498C941c03252G1019J00007a3952k25064B3129J17190k6394N4192O3624
19046B31741F779Q6673A6739J52080a69752A447K23469i2402q9742J7560P5846
19035h8738q3395C8723A7472L03039A27825J7833a1709E1576O9394g9712b7891
$$ y = [-163812, -95407, 19762, 68600, 71178, -100267, 131408, -105898, -199121, -205325, -394139, 300739, 23618, -162330, 30366, -74473, 250680, -412631, -119009, -1578, 249293, -437503, 178382, -28598, -145190, -212832, 52537, 107730, -67573, -319809, -2258, -137408, -255529, -355672, 750, 247669, -285073, 30648, -91895, -151927, -213015, -34360, 39792, 191894, 9113, 117833, -240853, -7109, 167719, -20001, 1389, 114263, -156712, -85046, -92860, -193518, 342599, 23162, 100498, 3941, -303252, 71019, 171026, -13952, -239016, 23129, 140319, 113925, 168117, 231741, 6779, 93452, 16739, 168819, -169752, 1447, 224916, -92402, -182144, -164584, -88738, -172133, 38723, 17472, 320511, 127825, 145658, -11709, 51576, 120970, -79712, -27891]
19023a18695E7619c44805f7734B33598a81395c2192j21562a2579p3659J2394A46064
19011G9967f2728a665l06759F6628J28226a39585b6552j3015j44473M0843B3532
18999c54026A49532b3627H2777a75416H5019d0296k37081g0123K7037B14196j5926
18988A98270J25650o0131a42693A02462c8506C0882b7254l4266A89071r0520M7663
18977A46214f0780j11701k1301C049a02117C0706O1161m3218R5899a66651B97451
18965I5713a80120M9729D0440a53254A98997e9349q4955M3138j94324C27444A6192
18953C5632c35515P6864J15592b0071l43977J27796A99494H6404R9871a77279
18942a79175A90468e4787A85645c30589D2083b49693G8520a83315A2754O6167
$$ y = [-118695, 57619, -344805, -67734, 233598, -181395, -32192, -153754, -12579, -86238, -73844, 146064, 79967, -62728, -1665, -308424, 66628, 194854, -139585, -26552, -39567, -184040, -143197, 23532, -354026, 149532, -23627, 82777, -175416, 85019, -40296, -277377, -70123, -43086, 214196, 198270, 323920, 263789, -142693, 102462, -38506, 30882, -27254, -61520, 189071, 98551, 146214, -60780, -172481, -193782, 3049, -102117, 30706, 91867, 48649, 144548, -166651, 297451, 95713, -180120, -130391, 40440, -153254, 198997, -59349, -144304, -101166, -295490, 327444, 16192, 35632, -335515, -258651, -143059, -20071, -364048, -236252, 199494, 86404, 186275, -177279, -179175, 190468, -54787, 185645, -330589, 42083, -249693, 78520, -183315, 12754, 78921]
18932G8921a3031j33406L211A91597a64471L9802q6927C2508b14928L2083M5074
18921a37771P603B45112F4889b43361A26557a68985O257k01122f3423m6373B06283
18909I0558M0304Q1340f9797C5384a27505F0874a65315A2076M04508a73125b4398
18897G0715J20068a1709j30039D9951b564A1842g1884p5038l3426f0855q8837
18886a49692P1705l59870J06025B65820j17511a17239p0408f3503A12807E0698
18875H6219N8529a29841F244h3005D6398d09060a19035B56300a663j03687j1153
18864a16503L0310j00273E0334h6125H0049c48027A36623A0939L94141g1776j6042
18853h7818k9037J7637A90396h0369k3331j9809F9248a42698C665i0127c1634
$$ y = [78921, -13031, -146437, -143226, 191597, -164471, -124669, -211596, 32508, -214928, -182845, -137771, -130168, 245112, 64889, -243361, 126557, -168985, -162728, -363850, -63423, -109796, 206283, 90558, 130862, 212202, -69797, 35384, -127505, 60874, -165315, 12076, 416584, -173125, -24398, 70715, 190783, -11709, -141748, 49951, -2564, 11842, -71884, -146922, -180348, -60855, -149692, -77987, -437857, -331832, 265820, 148309, -117239, -187647, -63503, 112807, 50698, 86219, 144748, -129841, 6244, -83005, 46398, -409060, -119035, 256300, -1663, -105350, -116503, -86193, -186466, 50334, -86125, 80049, -348027, 136623, 10939, 405080, -71776, -87818, -116855, -99218, 190396, -80369, -103700, -123509, 69248, -142698, 3665, -90127, -31634]
18841a77639A64788a8323q0822a003A50421a07185A28005J11733a92951N2013
18831a40938E6823B0724a69278E5161f7770n6659M200A29132J82273a0008l5815
18820d5823j3870B95109J1764K1032A27265J28204a55642H0780c9715A18033K87104
18809D05137j49390J30705r6906a42635r7413I5091m0225e1602k0712E3184a79908
18797a7494m4260j37495C8385c1169A52548b61259e0666j85535E9497c63190A5225
18785h7356l73136A44165J51675a60964O0636j82208O6733A35866j4451e1819
18774B03095a76702A784a5080r0271H7528a40014a6525C0180a50849D5112J8118
18763F3230K32727b8273j06740j56017O1235n660N7338N2756A63090F3637b36632
$$ y = [-177639, 164788, -18323, -99145, -1003, 150421, -107185, 128005, 239738, -192951, -140938, 56823, 20724, -169278, 55161, -67770, -124429, -120229, 129132, 311405, -10008, -45823, -59693, 295109, 306873, 327905, 127265, 255469, -155642, 80780, -39715, 118033, 405137, 255747, 386452, 289546, -142635, -240048, 95091, 54866, -51602, -72314, 53184, -179908, -17494, -61754, -199249, 38385, -31169, 152548, -261259, -50666, -236201, 59497, -363190, 15225, -87356, -460492, 144165, 295840, -160964, -100328, -282536, -215803, 135866, 121415, -51819, 203095, -176702, 1784, -15080, -105351, 87528, -140014, -16525, 30180, -150849, 45112, 63230, 295957, -28273, -135013, -291030, -229795, -235455, -178117, -125361, 163090, 63637, -236632]
18751a33196M6853L0262B76398n3658a80619K8278a0946l90608Q5093A07787a03508
18739a94969B86599a48563A20337d5580j32486C5823a18643p9238A62251b982
18728A68856a50524l109G4578a15296C4962N8832C928J3594a67520E8213a93820
18716d8142j17306l1770a6305q1504I7832g812A53410e210j28365F4433B6808
18704b48470a05370j59783j687R020k01625e0879B42070a87384g4112A32695L2881
18693A65576a30391r3327j28101a35394L6074D7526b03828L3977A50800a74455
18682b52934c4937k20372B89941E8185a36938c4781A07964O6931G6800J95931
18672B72731d37369D1848J91170a76139A1027a1083H3172d7866A07758m516d5669
$$ y = [-133196, -86343, -56081, 276398, 222740, -180619, -152341, -10946, -401554, -316461, 107787, -103508, -194969, 286599, -148563, 120337, -45580, -178066, 35823, -118643, -197881, 162251, -2982, 168856, -150524, -153633, 74578, -115296, 34962, 93794, 3928, 17522, -167520, 58213, -193820, -48142, -165448, -197218, -16305, -97809, 97832, -7812, 153410, -5210, -133575, 64433, 26808, -248470, -105370, -265153, -266840, -257820, -459445, -50879, 242070, -187384, -74112, 132695, 165576, -130391, -223718, -351819, -135394, -99320, 47526, -203828, -169851, 150800, -174455, -252934, -34937, -255309, 289941, 58185, -136938, -34781, 107964, 174895, 76800, 272731, -437369, 41848, 233018, -176139, 11027, -11083, 83172, -47866, 107758, 103242, -45669]
18660E4469a76228p6949l1073A85166g8646j58285c129I8147K33168a82521O8688
18649a13833k61039J61320C72418b57357A10935c5865D617c01314a37949D3374
18638e2346M071D6324b07088O3045A17686c5328j68241h0620q5490B88546r932
18627B78614r7231a28153K6937K6152C6899e0304j32485I2328M837a37855A25693
18615i2850M750k45539B3061b4912C14064j22006D3481b05509M1862C29348a51683
18603c60961B1040b63020B12808i0942E6137a2250C99525a49966N5981o5557E1287
18591C2886a57900B06646B4878c25677D9360h8862L5101p9532E5003a4509A47538
18579a54340k3369C0770b60855k1225O5789B52181A8432J70242h1339B61121I7669
$$ y = [54469, -176228, -253177, -284250, 185166, -78646, -236931, -3129, 98147, 331315, -182521, -113833, -374872, -213552, 372418, -257357, 110935, -35865, 4617, -301314, -137949, 43374, -52346, -48275, 46324, -207088, -144043, 117686, -35328, -203569, -80620, -166110, 288546, 278614, 181383, -128153, -101216, -75064, 36899, -50304, -182789, 92328, 97165, -137855, 125693, -92850, -88100, -333639, 23061, -24912, 314064, 192058, 43481, -205509, -163647, 329348, -151683, -360961, 21040, -263020, 212808, -90942, 56137, -12250, 399525, -149966, -93985, -159542, 51287, 32886, -157900, 206646, 24878, -325677, 49360, -88862, -53761, -133293, 55003, -14509, 147538, -154340, -177709, 30770, -260855, -282080, -216291, 252181, 18432, 188674, -81339, 261121, 97669]
18567b05903A17465b1961j99618O2113e0090A25397k3784N1415a02394d0069I3283
18555a91482L9940e0760j61289A50817i0262j30908H4261A0399Q5024a32691e8752
18543a43862m0460d1415A68781D7424b28827n1798j846O5542J03625p6247b8860
18531A83944L961b5452r9996A38671R1208A7052a11192A94954a86869C75313E7961
18519b9467j33435j22388A50862i1284G1327b53476J22608C2156b74063L8516
18509b35547g3066j05312A48397Q7286G9688c39886a07416B99578E0440a41012
18498A84688o7772b74546d1946G2258a72225O7697A15879K9818e8172j07101A41565
18486b2287n8397l19227A08571b81595I1733b998l73149b2323I0898d5161j21582
$$ y = [-205903, 117465, -21961, -221579, -159466, -50090, 125397, 101613, 153028, -102394, -40069, 93283, -191482, -151542, -50760, -212049, 150817, -90262, -221170, 84261, 10399, 95423, -132691, -58752, -143862, -184322, -41415, 168781, 47424, -228827, -280625, -282471, -216929, -113304, -189551, -28860, 183944, 187905, -25452, -125448, 138671, 229879, 17052, -111192, 194954, -186869, 375313, 57961, -29467, -162902, -285290, 150862, -91284, 71327, -253476, -130868, 32156, -274063, -235547, -73066, -178378, 148397, 235683, 79688, -339886, -107416, 299578, 50440, -141012, 184688, 116916, -274546, -41946, 72258, -172225, -104528, 115879, 145697, -58172, -165273, 141565, -22287, -80684, -399911, 108571, -281595, 91733, -2998, -376147, -22323, 90898, -45161, -166743]
18475a66743j16703J28529I6925h0939I3309J6001c78037F9101a81180O6646A15775
18463i549a498H2019j7520J86410h1063K7302k7626j22501j29662B00832c1036
18451a77654j53607J20394j4884l3467A49258a05772d4942J9609G7402b02358
18440i4009j00644g4097j71013A09392a5901j76561j1822B79668j31365f8469
18429g4489j40066B4861d2666J2821C95860D5782a79190D3886K1734a51691N2486
18418i9205F2644J72907b53017M2989p7036g0921C08500i7374c3747C71446c33985
18406b71284A98791R7079H0707K24042d12032J09591A39262i7842c4400j77235
18396b11635h2145d631G3897a10686A7631K1904a05804J2550n1169o7311k5268
$$ y = [-166743, -283446, -154917, 96925, -80939, 93309, 109310, -378037, 69101, -181180, -114534, 115775, -9549, -1498, 82019, 64499, 250909, -81063, -53761, -81387, -203888, -333550, 200832, -31036, -177654, -331261, -210867, -225751, -259218, 149258, -105772, -44942, -25333, 77402, -202358, -94009, -194653, -74097, -245110, 109392, -15901, -192462, -204284, 279668, 148303, -68469, -74489, -214555, 24861, -42666, -29845, 395860, 45782, -179190, 43886, 65620, -151691, -99205, 62644, 235551, -253017, -210028, -287064, -70921, 308500, -97374, -33747, 371446, -333985, -271284, 198791, 295870, 80707, 304749, -412032, -302441, 139262, -97842, -34400, -211635, -82145, -4631, 73897, -110686, 17631, 39535, -105804, -93254, -144423, -211734, -237002]
18385b37002G8155K4413e6895c753j57681o553I627K70257a54624A64534a24037
18373F0418k2265a12058m151B14830E013K58813f2559J8308G2164d268A23922
18361a39244b0893B64822a43884D55433a03138j55561O4369k91355d2406D4464
18350c1744j39393e6717k01123F441a85848G716J00389C9585N3180a84089B8697
18338F0577c5902A37233L8614p3517K09545a09284B490i0785l0287q5184i0217
18326a11011J1794C573L29467j59040a0857I094b55117N0233A98802a29842a8901
18314b86090g4360B1881a23226n2927P027B28968b0357A50180d4852j16179c5495
18302d793j68992q7865C28639q3232h50j74490C6575b6056A72678e8692k3567
$$ y = [-237002, 78155, 102568, -56895, -3753, -161434, -167987, 9627, 279884, -154624, 164534, -124037, 60418, 38153, -112058, -116209, 214830, 5013, 263826, -62559, -44251, 72164, -4268, 123922, -139244, -20893, 264822, -143884, 455433, -103138, -258699, -194330, -485685, -42406, 44464, -31744, -171137, -56717, -257840, 6441, -185848, 7716, 108105, 39585, 92765, -184089, 28697, 60577, -35902, 137233, 175847, 102330, 311875, -109284, 2490, -90785, -121072, -206256, -90217, -111011, -99217, 3573, 333040, 174000, -10857, 9094, -255117, -204884, 198802, -129842, -18901, -286090, -74360, 21881, -123226, -176153, -169126, 228968, -20357, 150180, -44852, -161031, -35495, -4793, -173785, -261650, 328639, 245407, -850, -175340, 36575, -26056, 172678, -58692, -82259]
18291h2259J4051J1763F3326g1670m1345A05814e7992k75221C33674a13704E3349
18279a97156b9213j22204E3925B4204Q2719A0058J2013a79411e3618o7050H2672
18267c24325a14901j60697A27541a98513A04180i8486B75974c1333j70943C09073
18256a0313l12953g3207l1862b0557A32331a35205m9844J6163I5525k7077J08333
18245A76781b65149e9932q8687A43009a05442m0519O438A56142c21521Q8713A57483
18233A72914g494l50052I4498f2209l79228I5375K06107a0030l4932j55064j77201
18222c77227c2783j06819d1757l9253a9677B105M5768b60130A33548b78075C05879
18210A03220J99199c01943h9186b112l48432a48205o4671O7072N5802c8569q438
$$ y = [-82259, -68208, -56445, 63326, -71670, -113015, 105814, -57992, -333213, 333674, -113704, 53349, -197156, -29213, -151417, 53925, 24204, 106923, 10058, 22071, -179411, -53618, -120668, 82672, -324325, -114901, -275598, 127541, -198513, 104180, -98486, 275974, -31333, -202276, 309073, -10313, -323266, -73207, -105069, -20557, 132331, -135205, -185049, -168886, 95525, 68448, 176781, -265149, -59932, -148619, 143009, -105442, -145961, -139523, 156142, -321521, -232808, 157483, 172914, -7494, -357546, 94498, -62209, -441437, 95375, 301482, -10030, -44962, -200026, -377227, -32783, -139602, -41757, -81010, -19677, 2105, 47873, -260130, 133548, -278075, 305879, 103220, 302419, -301943, -89186, -2112, -350544, -148205, -212876, -145804, -90002, -38569, -47007]
18199d7007r9326B31684B3355b36676Q4773A68797b00707B45363f0329B9228K04129
18188B33357g7117A76544b92722J13901p9688F1240F694J5791L67011G5208a06291
18176h0825C6419c57169g4824H0541c71976B90968c8220I5881h9296k63894a02543
18164A63794c59481J19242H324a11238B3118a06929o1418o9687A08129J37738
18154B45867D278K090b62391k955i2310K4670B82663i2254A33616a01096j50292
18143b51388H2219a57997B83066a67079e3102C6257J50372J04898b47088B41037
18132F3338P3353a85349A6565i2038G374h6045F8789a40669D7037b2193j88301
18121b10494R9186r0695b2898o5945a9632j86489i3357l8849A38036e582j51110
$$ y = [-47007, -146333, 231684, 23355, -236676, -151903, 168797, -200707, 245363, -60329, 29228, 233357, -77117, 176544, -292722, -178821, -258509, 61240, 6694, 22485, 389496, 75208, -106291, -80825, 36419, -357169, -74824, 80541, -371976, 290968, -38220, 95881, -89296, -353190, -102543, 163794, -359481, -240239, 8324, -111238, 23118, -106929, -168347, -238034, 108129, 245867, 4278, 6368, -262391, -265346, -92310, -67640, 282663, -92254, 133616, -101096, -251388, 82219, -157997, 283066, -167079, -53102, 36257, 186629, 291527, -247088, 241037, 63338, 136691, -185349, 16565, -92038, 7374, -86045, 68789, -140669, 47037, -22193, -210494, -111308, -202003, -22898, -88843, -19632, -206121, -93357, -132206, 138036, -5582, -156692]
18110a56692j39062A52791b11903P1456K9641F7707I15a02372a9032j47172j78937
18099c45141A89017I0852L2256b57538h5768r8003A78827D6686P8121c49072H2143
18087b38731e3498A07061h9896B2401L19880b01995B9124a48728E229J43420P1496
18076B20145I4660a15534j4405d3087a4645A56889g7943c4243l76265E9097J73728
18065B32825b4272j07956A84296a47707B68395j25118f5770l78689G6743a31231
18054A28351k7056J60162r6563b62983d41j98072Q308A13783J22359A14917M7910
18043A62827b8709A82275e6561A71559C2473J99522p9810F1989N4192a91650j04427
18032b96077G0225K0010b99920A49071h332A35295g7896I4187R6688O591e7060
$$ y = [-156692, -295754, 152791, -211903, -140447, -110806, 67707, 915, -102372, -19032, -166204, -345141, 189017, 90852, 123108, -257538, -85768, -183771, 178827, 46686, 124807, -349072, 82143, -238731, -53498, 107061, -89896, 22401, 342281, -201995, 29124, -148728, 5229, 148649, 220145, 94660, -115534, -129939, -43087, -14645, 156889, -77943, -34243, -410508, 59097, 232825, -24272, -132228, 184296, -147707, 268395, 143277, -65770, -444459, 76743, -131231, 128351, 101295, 261457, 164894, -262983, -441, -198513, -190205, 113783, 236142, 114917, 162827, -28709, 182275, -56561, 171559, 32473, 231995, 152185, 61989, 116181, -191650, -296077, 70225, 90235, -299920, 149071, -8332, 135295, -77896, 94187, 190875, 197466, -57060]
18020b9207o9190j51568E7120e350D5974i9629D0617e1785B84969F3012O538K9225
18008I8775k0753R5904b18865j11431B80430b2788D3256a66123K0282B86785b19462
17996D407g5749j34895A33919a06577j47138L6170c9192e181l31732A12000c16282
17984i6489A92090d9247l47858c5067C34577a3429m5269B48310I2115e1763H4613
17972I9294m0616B569J3147a03046A82666c5402k7575K5041q5855B10739c08310
17960B41491c28422b5489B31027J0806p5731C5958J84302F082R1702d6248r2741
17949a38989A35589E0444h5458r0087c6060r5040K0105M7317J7721C7703A8363
17937B05475d06520D9721L4466b28157a11085n2892g6223j46590d7156m628h888
$$ y = [-29207, -98397, -249965, 57120, -5350, 45974, -99629, 40617, -51785, 284969, 63012, 69550, 98775, 78022, 173926, -218865, -330296, 280430, -22788, 43256, -166123, -145841, 286785, -219462, 4407, -75749, -210644, 133919, -106577, -253715, -217545, -39192, -5181, -336913, 112000, -316282, -96489, 192090, -49247, -397105, -35067, 334577, -13429, -58698, 248310, 92115, -51763, 84613, 99294, 58678, 2569, 15716, -103046, 182666, -35402, -62977, -37936, -123791, 210739, -308310, 241491, -328422, -25489, 231027, 241833, 166102, 35958, 220260, 6082, 97784, -46248, -138989, 135589, 50444, -85458, -175545, -36060, -131100, -110995, -63678, -45957, 37703, 18363, 205475, -406520, 49721, 84187, -228157, -111085, -163977, -76223, -222813, -47156, -51784, -8888]
17925A29675a44988c6254A23718e5991E8607a30748A64339b69576i0024a7526
17914D4176J00976J42121r3545a68016F194c16046m7913A07144j8371A2993K15077
17903B28070b51988B94581g2851j33935O8584b7231k96055a4374k1241A73059
17892b23227L867A02269f0296k42058A23520n0462b08327j5057N884b4623B1129
17880G1029O8604m5509l882K4998C8617K38595A17295i856l66783H3089L82552
17869D65641d8370j08725L5150c5508j00648G1848d28487d4381A80510F7701K34351
17858C02052q4134i99k42118M9627I8270k9040e3827A96981o2317c9475j06041
17847a45516B29036B1762N7737J24427j6078B9907P130L8683L80185k25256B6130
$$ y = [129675, -144988, -36254, 123718, -55991, 58607, -130748, 164339, -269576, -90024, -17526, 44176, 145152, 287273, 193728, -168016, 6194, -316046, -363959, 107144, 88773, 12993, 228070, -251988, 294581, -72851, -206786, -138202, -27231, -323286, -14374, -35615, 173059, -223227, -219360, 102269, -60296, -302354, 123520, 73058, -208327, -223384, -217500, -24623, 21129, 71029, 139633, 94124, 90242, 115240, 38617, 277212, 117295, -9856, -376639, 83089, 465641, -48370, -157095, -121945, -35508, -136156, 71848, -428487, -44381, 180510, 67701, 302052, 217918, -999, -243117, -193490, 98270, 69230, -53827, 196981, 134664, -39475, -145516, 229036, 21762, 79499, 203926, 187848, 29907, 37037, 75720, 455905, 230649, 26130]
17835f4286D5335i1077j158A01468R8619K10973a63283d5899O01C3595c82656
17823a6469l85741g0450p8600d1755C48216o9392C4210g3740D50829b13312f0950
17811a7960j52774P5427D692a27842C4790A2970i0993A4608h107B90961b16493
17799D8712J89267I8280a85509j75362h1645E3566J77847G167J93787d1711k01654
17788b43365F6440i5133E7685c18704e9143A47605B5226F921Q2112J54553b9708
17776G7979h8157A80593h6605A54143a66893K6319H718N0114e1264j16484B6224
17764H0702N7906n3278k3318d8100j22863a8716I9075a2491A94094a71643B24891
17752a92224l472i7776F612a08515F1976R6445b14886D37183i603k4431k28343
$$ y = [-64286, 45335, -91077, -92235, 101468, 200087, 411060, -163283, -45899, -45298, 33595, -382656, -16469, -402210, -70450, -149050, -41755, 348216, 278824, 34210, -73740, 450829, -213312, -60950, -17960, -170734, -95307, 4692, -127842, 34790, 12970, -90993, 14608, -8107, 290961, -216493, 48712, 237979, 98280, -185509, -360871, -81645, 53566, 231413, 7167, 200954, -41711, -243365, 66440, -95133, 57685, -318704, -59143, 147605, 25226, 6921, 89033, 243586, -29708, 77979, -88157, 180593, -86605, 154143, -166893, -140574, 8718, 58832, -51264, -167748, 26224, 80702, 138608, 85330, 62012, -48100, -170963, -18716, 99075, -12491, 194094, -171643, 224891, -192224, -195696, -97776, 6612, -108515, 61976, 158421, -214886, 437183, -9603, -34034, -262377]
17741b62377A5953r48P0246J31850p5190J18219c29253b8669l5384B77061H7584
17729b56034h0140j17940r8107a19949C93924g1822A35604m9761J02843a4239
17718c4834B11836d2651j9713D7034f9266k74587J34727B23932r4079F1782M5624
17707A07406A4948O1480J92666A9646a00100b949l130A79007E3861a2256C42067
17695G8482a35388e6617j56206e1506H2773E6h6048B84185a53990H0473a79162
17683a6167p1769A71852C3143e2094O15C62325b77017a9089j55953L0835e1233
17671h1928l1984D6870a96616C50111b85066D55007F0905J22051b0321H9009B6332
17659A25494n3059j6226f550k89648a33760D3211J63273E8120B3354K61791c12943
$$ y = [-262377, 15953, 15005, 85251, 217101, 141911, 260130, -329253, -28669, -64053, 277061, 87584, -256034, -80140, -198080, -296187, -119949, 393924, -71822, 135604, 85843, 188686, -14239, -34834, 211836, -42651, -62364, 47034, -69266, -343853, -209126, 223932, 129853, 61782, 107406, 14948, 76428, 269094, 19646, -100100, -2949, -6079, 179007, 53861, -12256, 342067, 78482, -135388, -56617, -212823, -51506, 82773, 56, -86048, 284185, -153990, 80473, -179162, -16167, -87936, 171852, 33143, -52094, -51479, 362325, -277017, -19089, -175042, -144207, -51233, -81928, -113912, 46870, -196616, 350111, -285066, 455007, 60905, 182956, -20321, 89009, 26332, 125494, 72435, 56209, -6550, -296198, -133760, 43211, 206484, 58120, 23354, 285145, -312943]
17647c12846i6111A62500a78702I4935L19182c34987i971E4905a49118p0979A11047
17635B78505j31349Q5033e6143B91068A13109b49043A84646J54169o1898a43622
17624i6344H8945K09373a01109A49680K480b38903J03133A64534E5482a85362
17613A02361b91085A66624J93303b04936k6764A79476b8423n5889p218L2454n3507
17602a12583j25414A93545M694L3330c4627J0208j22419A57520b90067G1220b6969
17590d48131F4714H424O6708h6606m3718K9608j19290B41407b51124M1806Q4620
17579a24698B82429P1226a79464g0665C82511j04263E8413b04893K5280F3371
17568A35837r430L2168g3288A698J93449C8214R3500R7451k7116b6096A86470
$$ y = [-312846, -96111, 162500, -178702, 94935, 414117, -334987, -9971, 54905, -149118, -220097, 111047, 278505, 147156, 232189, -56143, 291068, 113109, -249043, 184646, 338815, 276917, -143622, -96344, 88945, 298318, -101109, 149680, 152160, -238903, -135770, 164534, 55482, -185362, 102361, -291085, 166624, 359927, -204936, -231700, 179476, -28423, -84312, -91530, -59076, -112583, -237997, 193545, 198239, 231569, -34627, -24419, -146838, 157520, -290067, 71220, -26969, -448131, 64714, 8424, 75132, -86606, -130324, -100716, -220006, 241407, -251124, -209318, -124698, 282429, 353655, -179464, -70665, 382511, 278248, 58413, -204893, -179613, 63371, 135837, 126407, 158575, -73288, 1698, 195147, 38214, 131714, 229165, 202049, -26096, 186470]
17556G7131J3478K81124A56573a29326A27333q201f9242f918q3562j00310a4261
17544c46511D0757J13417J07563H030K6470f143k27505F6915j431P1049b3814
17532A83638d6846A95239a49247B25528B1359K46107B8233J03924a38095B62569
17521B57163F6942a16869j25967A85986R900I346e5261D08681f1174A41931J6834
17510A58765a2466B82645j7525N4866G5490F594M00286j6293A86273b8425G6513
17498E7978a30353B75117n9375a35526B96511C7006g904j26880C90907a59347
17487B12557O5544F0049J19438C371a6195j16124B58510j25087c9658D1653J7987
17476E9640K63700j34074a7739A95379Q3371j01664k5879Q830K23766b07728B28029
$$ y = [77131, 90609, 371733, 156573, -129326, 127333, 119132, -69242, -6918, -90480, -190790, -14261, -346511, 40757, 154174, 261737, 8030, 34500, -6143, -233648, 66915, 65484, 136533, -23814, 183638, -46846, 195239, -149247, 225528, 21359, 267466, 28233, 132157, -138095, 262569, 257163, 66942, -116869, -242836, 185986, 195886, 9346, -55261, 408681, -61174, 141931, 158765, -12466, 282645, 265120, 319986, 75490, 6594, 406880, 390587, 186273, -28425, 76513, 57978, -130353, 275117, 215742, -135526, 296511, 37006, -7904, -134784, 390907, -159347, 212557, 278101, 60049, 179487, 3371, -16195, -132319, 258510, 133423, -39658, 41653, 59640, 323340, 189266, -17739, 195379, 278750, 177086, 151207, 160037, 383803, -207728, 228029]
17464d496A92311F9699K3384l2982c65259e6024C33345j54234O0611r8122J02854
17453B44454a43141C29496j51566q4853K10367J09822J90401j16962j03180o8651
17443C14874P225A40610R2594J86928j60802n8839q5386r059K47465j14375H8514
17431d3909A95249K4646K49597A46632K6850j837g8130A95084Q0550M2726o1718
17420B56642J33337A74575K10891K35777k73679h8229C60986j05917A15353J74190
17410B89543a78887I454J69788J47300n8713a15956D90283E9055A2222M71256
17400D83478A77905J13159G5286B4057O4515J9858A2958a15297B01983J47984
17390C49967A18659D8099J57918K49850R3988a029D44900A28469B707J26406m7657
$$ y = [-4496, 192311, 69699, 93083, 60101, -365259, -56024, 333345, 179111, 239722, 141600, 244454, -143141, 329496, 177930, 93077, 303444, 413266, 603667, 486705, 383525, 314874, 322099, 140610, 233204, 420132, 259330, 200491, 115105, 106046, 353511, 239136, 88514, -43909, 195249, 219895, 469492, 146632, 173482, 171645, -78130, 195084, 275634, 318360, 256642, 389979, 174575, 385466, 621243, 347564, -88229, 360986, 255069, 115353, 289543, -178887, 9454, 179242, 326542, 267829, -115956, 490283, 59055, 12222, 483478, 177905, 291064, 75286, 24057, 88572, 108430, 12958, -115297, 201983, 349967, 118659, 48099, 206017, 455867, 549855, -1029, 444900, 128469, 2707, 129113, 81456]
17379H1456M82873j82792A31152D7113J15697E0302N2985J42766I6532g5896j0999
17368h6895F8722h9336j48111G2691h5317A33616C9416f6923A79057A6807a00798
17356e8774b44B35782O8343A5817J43821K46333A49699F3025L02842j82233J8673
17345B02307h2126D0395A7873K55719j21086C0443J89324o5440c65767A75964
17334B01424q9655J82615b30803B26470l1584L9336N7379A36108J28385o5974
17324A98519G6909c9121B90438n3677a33112A66801A0598J04688O423K3091K6366
17313A71166e4433A32811e9363B27178R4678l1127L37130A42183j290O3790k8388
17302A76295J94818j48313o2741L3030M8273R2044I436J18263B6353a09087F6254
$$ y = [81456, 564329, 381537, 131152, 47113, 162810, 50302, 103287, 246053, 96532, -75896, -86895, 68722, -89336, -237447, 72691, -85317, 133616, 39416, -66923, 179057, 16807, -100798, -58774, -244, 235782, 304125, 15817, 159638, 405971, 149699, 63025, 365867, 183634, 202307, -82126, 40395, 17873, 273592, 152506, 30443, 219767, 154327, -365767, 175964, 201424, 111769, 294384, -230803, 226470, 194886, 234222, 291601, 136108, 264493, 198519, 76909, -39121, 290438, 236761, -133112, 166801, 10598, 115286, 121709, 144800, 171166, -54433, 132811, -59363, 227178, 321856, 290729, 627859, 142183, 140893, 204683, 176295, 371113, 222800, 160059, 193089, 241362, 333406, 9436, 127699, 26353, -109087, 66254]
17290h116A53887m635l1384d6659A58726J93178D9156A2895K18301a07856D7152
17278D5374d535C22121h492C22972k656q4364a95154a4093B72604q0456E7399
17266D9871c19222A4750J47430J76968i573H5077c7696A25709g2333B70699n7708
17255B12991J40645a49476A31535B1751L40928I1908K01236A33939n686J08535
17245B36788K3373j21946j2275a38394f0806A78651K13593j39427h5735C59853
17234C78792d9970B61690j06868H784M03023A19024L49900a76968H0836J33801
17224B14637j3010j9885K05338J8026c6535a0845B28135N8280J18033A49685P8284
17213B27969m6651J15025J02762F3822J58969i5456D69642A91941G2746K40809
$$ y = [-8116, 153887, 149252, 117868, -46659, 158726, 351904, 49156, 12895, 231196, -107856, 47152, 45374, -4535, 322121, -8492, 322972, 320316, 235952, -195154, -14093, 272604, 192148, 57399, 49871, -319222, 14750, 162180, 339148, -9573, 85077, -37696, 125709, -72333, 270699, 212991, 353636, -149476, 131535, 21751, 362679, 91908, 293144, 133939, 128253, 236788, 260161, 138215, 125940, -138394, -60806, 178651, 392244, 252817, -85735, 359853, 378792, -49970, 261690, 154822, 8784, 411807, 119024, 468924, -176968, 80836, 214637, 201627, 181742, 387080, 405106, -36535, -10845, 228135, 286415, 404448, 149685, 227969, 181318, 296343, 399105, 63822, 222791, -95456, 469642, 191941, 72746, 313555]
17203C13555J35814A56256J04020A29067E7071l006M9784J84595K19525c702A12885
17191A9472a1223C52374L16019G9025e724A59155J27772H5098M3454J47648J99781
17180D75981C0614L69691C9063J09867K41318J45888C4940j3706m9K44738r8840
17169A67083Q4740E0131N61994p4271A77297N3565c4069j10302a4851A81234M32876
17158F14110B63476K05757j62908Q9172A28471J45840j25636a9008A82726B7679
17147C13474B3304K7318b764C9778M91319B31633j05011M7289E618L04573q2229
17136B27962J28562J02474m3687A99025K95581j5061q1413E1394K83608P21M8212
17125C83935J40360N7671A42897R7398J6311F123J48228K91923o1837M1116j94795
$$ y = [313555, 449369, 156256, 260276, 129067, 57071, 54065, 103849, 288444, 507969, -3702, 112885, 19472, -11223, 352374, 668393, 79025, -5724, 159155, 286927, 85098, 128552, 276200, 475981, 30614, 400305, 39063, 148930, 390248, 536136, 34940, 21234, 21185, 265923, 167083, 251823, 50131, 612125, 537854, 177297, 230862, -34069, -144371, -14851, 181234, 614110, 263476, 469233, 306325, 395497, 128471, 274311, 148675, -19008, 182726, 27679, 313474, 23304, 50622, -2764, 39778, 531097, 231633, 126622, 173911, 5618, 310191, 227962, 356524, 458998, 415311, 199025, 494606, 479545, 398132, 51394, 335002, 335723, 383935, 524295, 581966, 142897, 240295, 256606, 6123, 154351, 446274, 384437, 425553, 230758]
17114B30758p9N0894L42948j24383n0363j66116D1275J30583J91370j7324K32916
17103E78820D5862K32664M9851J41500R2685k42563L30097A01424M30831n7187
17093D75068B35586L12362m3467j88659I6354J45682J28272J19106A93104M34288
17083F27392R0184k98791j64553J6095L00954B81535K9235L30499k70706J36777
17073E07340j45754J46758o8976j65984L64538j41735B08227L905M6507J09353
17063C67992Q5904p3599Q0858K0117k5131J92985k97231L8073K47341j11262J55756
17052F81803k94745K10581O2568k24519P4116q6382j1949j9949J64914M0699k92719
17041C04418L60022j51997K64433k94660N666K94899l71728L36712K6965l17467
$$ y = [230758, 230679, 281573, 624521, 500138, 449775, 283659, 41275, 171858, 363228, 345904, 578820, 45862, 278526, 328377, 469877, 562562, 319999, 650096, 101424, 532255, 475068, 235586, 547948, 504481, 315822, 96354, 242036, 370308, 489414, 193104, 627392, 717576, 418785, 254232, 270327, 571281, 281535, 310770, 641269, 370563, 507340, 361586, 508344, 439368, 273384, 637922, 496187, 208227, 212132, 258639, 367992, 453896, 380297, 461155, 481272, 456141, 649126, 351895, 389968, 637309, 526047, 681803, 387058, 597639, 660207, 435688, 509804, 423422, 411473, 391524, 556438, 597137, 304418, 664440, 512443, 776876, 482216, 487882, 782781, 411053, 747765, 774730, 457263]
17031D57263L04103j46346L3202P7148C38503N9116J7078J99858n1862R3527K17895
17020H74115l79818k25230L64648j71723L2216J94290j52116j7700J55125k69309
17010D04498L03051k07733L4745J79102l52644O9693L01382m3076L1836J08499
17000H29353J41458D47213R8694Q7031l0806j25486P5742K25186K39669j92878
16990H24365l1292k99407J54205J88974n8336l24442J79334J92625j14557K33145
16980I44614j17032J1837k07043k66157M79563j51309j03872J57746m1712J29734
16970H36369l8438j8569j6402o3627q2798L73174K33438n52158R4305K13095J58580
16959A136969D37496N53953m21172M71250m53263M94790j79488j67232K28350
$$ y = [457263, 761366, 615020, 648222, 725370, 338503, 397619, 414697, 614555, 562693, 656220, 874115, 494297, 269067, 633715, 461992, 494208, 688498, 536382, 518682, 673807, 404498, 707549, 499816, 534561, 713663, 361019, 430712, 732094, 689018, 720854, 829353, 970811, 447213, 545907, 632938, 602132, 476646, 552388, 777574, 1017243, 824365, 793073, 493666, 647871, 836845, 778509, 454067, 633401, 826026, 711469, 944614, 827582, 839419, 632376, 366219, 845782, 694473, 590601, 748347, 706635, 836369, 797931, 779362, 762960, 699333, 616535, 989709, 1223147, 670989, 765294, 978389, 1136969, 437496, 991449, 570277, 1041527, 588264, 1083054, 903566, 736334, 964684]
16950I64684J66740k61959N6923k59165K93371K20933k82508J51834k5235q9146
16940I36472O2372j28144J47340K92105n4896n6573k17320J50824m18792M94483
16930A207871O3635j11881j40244O5322L0990r5822M30993m22136L48416n4427
16920A322717K40647k23496l7900k3948M772o2202N9782k05511M94591j41657
16910A427795l31246N06026k41912k02238J07408J20500L05819j87622j91140
16901A313390L10148K59185j02328k31992o2705M57371j85809L8283J2607J80414
16891A988564l31103j34875K32617j86462L26700J50492m72576L29253M7663L61830
16881B312103l11099L1766o0055L54162k68893q1757K23003j06956J00197l3321
$$ y = [964684, 1131424, 869465, 926388, 667223, 960594, 1181527, 899019, 1050853, 1025618, 936472, 998844, 870700, 1018040, 1310145, 1255249, 1198676, 981356, 1132180, 713388, 1207871, 1271506, 1159625, 1019381, 1084703, 1115693, 1019871, 1450864, 1028728, 1377144, 1322717, 1563364, 1339868, 1301968, 1278020, 1282792, 1220590, 1280372, 1074861, 1569452, 1427795, 1096549, 1602575, 1360663, 1158425, 1265833, 1386333, 1692152, 1504530, 1313390, 1623538, 1882723, 1780395, 1548403, 1485698, 1943069, 1757260, 1795543, 1808150, 1988564, 1657461, 1522586, 1755203, 1568741, 1895441, 2045933, 1573357, 1902610, 1950273, 2312103, 2001004, 2032770, 1972715, 2326877, 2057984, 1976227, 2199230, 2092274, 2192471, 2159150]
16871B159150j46080Q3268m7234K89044k3450l7375Q4576n727k59055K62114j37237
16860B221994K71181m8920L1360N0957J90869k11405j79073O53877n53497K81770
16850B709113L43550K7120m64319M39763j59323K25665n2853K27478j04835j42695
16840C048664N53566k38954K33574k71481K79303o2245p1367J62544Q4263K12132
16830C929999j2458K5726O7872J73158K11719m21719L40645k719K96545L39383
16820D948151k08922j28309L32498J84172j17147J53239k93839K28593J17161
16811E215597j08234N35029J65387j6660j6187L45630M51899l24663j71068K51363
16801F328093M98283k2444K33318K80731j1447K68872K28558L41967j30901L10991
$$ y = [2159150, 2013070, 2096338, 2049104, 2338148, 2314698, 2277323, 2361899, 2356172, 2097117, 2359231, 2221994, 2493175, 2444255, 2475615, 2526572, 2717441, 2506036, 2326963, 2980840, 2427343, 2709113, 3052663, 3079783, 2615464, 3055227, 2895904, 3121569, 3068716, 3296194, 3191359, 3048664, 3602230, 3363276, 3596850, 3325369, 3604672, 3542427, 3471060, 3633604, 3717867, 3929999, 3917541, 3943267, 4011139, 4184297, 4396016, 3974297, 4314942, 4312223, 4608768, 4948151, 4739229, 4610920, 4943418, 5127590, 5010443, 5163682, 4869843, 5098436, 5215597, 5107363, 5642392, 5807779, 5791119, 5774932, 6120562, 6572461, 6247798, 6076730, 6328093, 6826376, 6803932, 7037250, 7317981, 7306534, 7575406, 7803964, 8145931, 8015030, 8326021]
16791H326021K46600k0346N35738K1551M95397j8419M36627J30380O02953O1823
16781A0818325J94400O25669j57841O50427R1310P05377P734M51578O62891L08845
16771A4358715L54996O47292M44644N66244P15168N60725P24156O16527N36890
16762A9525357P64039J017735P96737R66241J117188O13136J010920J193411R87140
16753B7991904J164924J721099J115060J446946J650622J961927J781277K031364
16745D0865123J841328J907388K947004K621743K825093L058183K937380L316685
16737F2319927L543560M402219M222680M392837N100478N281365N340469N876184
16729A00479719O342107O451745O945516P234207P771975P564988O772517P615960
$$ y = [8326021, 8572621, 8552275, 9088013, 9109564, 9604961, 9586542, 10023169, 10153549, 10756502, 10818325, 11012725, 11638394, 11480553, 12130980, 12222290, 12927667, 12935401, 13386979, 14049870, 14358715, 14713711, 15361003, 15805647, 16371891, 17087059, 17647784, 18371940, 18988467, 19525357, 20289396, 21307131, 22103868, 23070109, 24187297, 24800433, 25811353, 27004764, 27991904, 29156828, 30877927, 31992987, 33439933, 35090555, 37052482, 38833759, 40865123, 42706451, 44613839, 47560843, 50182586, 53007679, 56065862, 59003242, 62319927, 65863487, 70265706, 74488386, 78881223, 83981701, 89263066, 94603535, 100479719, 106821826, 113273571, 120219087, 127453294, 135225269, 142790257, 149562774, 157178734]
16721A57178734O950004O155793N723783M822862L783017K518422J288973k370
16713A88419218j818922k671272l934667m911726n612803o655557p452227p351552
16705A48010492p157649p769544p404330p521573o866347o534716o308251o265427
16697I2182655n488142n096262n083507m818107l834452l915885l931863l115187
16689E6899250l458377k916968k715313k817491j838069k488215j895018k029153
16681C6740646j684261j834669j294440j745500q47475j941744q14161j124035
16673B5454361j170103r65142j248488n84879j108217o93948q22962q88510m55114
16664A7516998q35958m10027n32424m48728o83774p84956l14956O6528p03208
$$ y = [157178734, 164128738, 170284531, 176008314, 180831176, 184614193, 187132615, 188421588, 188419218, 186600296, 183929024, 179994357, 175082631, 169469828, 162814271, 155362044, 148010492, 140852843, 133083299, 125678969, 118157396, 111291049, 104756333, 98448082, 92182655, 86694513, 81598251, 76514744, 71696637, 67862185, 63946300, 60014437, 56899250, 53440873, 50523905, 47808592, 44991101, 43153032, 40664817, 38769799, 36740646, 35056385, 33221716, 31927276, 30181776, 29334301, 27392557, 26578396, 25454361, 24284258, 23319116, 22070628, 21485749, 20377532, 19683584, 18860622, 17972112, 17516998, 16681040, 16271013, 15738589, 15289861, 14606087, 13821131, 13506175, 13572703, 12869495]
16655A2869495m10253p75145p7218n56245n1526o16412l11843L0343k82935k80304
16645I537957j30070m90143m34755j8902m06641Q9222n34802N0389k08796n00802
16635F952657o0994j4549j98915j03793j3121m14068j46431m5227p2512j94042
16625E689005k72569l20221K00963k89882J5331l89449q8654l27294J55223K20909
16615D593362j70679J08852m16318j5594j31947p5012m7103l5375N7045l4393
16605C832838o10965K39670k65543J42476R1810j20157k03898L06171l67999o06658
16595B437745P65236Q0496l29847j05365l66632M40035k24232k169n2784N9878
16585B702361j40759j66644R3576R6388j57410j27970J02340k77168k6491K95944
$$ y = [12869495, 12459242, 11684097, 11606879, 11050634, 10999108, 10382696, 10070853, 10101196, 9818261, 9537957, 9407887, 8917744, 8482989, 8464087, 8057446, 8146668, 7611866, 7662255, 7453459, 6952657, 6891663, 6877114, 6678199, 6574406, 6561285, 6147217, 6000786, 5955559, 5883047, 5689005, 5416436, 5096215, 5297178, 5007296, 5022627, 4633178, 4544524, 4217230, 4372453, 4593362, 4422683, 4531535, 4115217, 4099623, 3967676, 3892664, 3845561, 3810186, 3867231, 3832838, 3221873, 3461543, 3196000, 3338476, 3430286, 3310129, 3106231, 3412402, 3044403, 2437745, 3202981, 3283477, 2953630, 2848265, 2481633, 2921668, 2697436, 2695267, 2642483, 2702361, 2561602, 2394958, 2488534, 2584922, 2427512, 2299542, 2401882, 2124714, 2098223, 2394167]
16575B394167l79973J30730r5966J01871m78586q7831K73055K41657l63157R9654
16565A835621K16693k59744j07298J86624k21266P0183j06916o7238J64292Q9843
16555A800794l99580M31382m08436K78049n77573M35169j53407O8611j54856l7046
16545A283107K95223k57914J66971l47958l47038M78101l07807N45514l8800m7254
16535A422145l54715L14384j2137l77416n9374K24970j68494j13503M0085K02383
16525A118328J5666n2082O0078j15361K47785m05632J6385L46554l5809K13320
16515A409232n60660N7198J43709j55809q985m284K37261l56880K26548j13237
16505H74093m8181L39456k85557J52983m62713J07785J03194J96703q3377k18683
$$ y = [2394167, 2014194, 2144924, 2048958, 2150829, 1672243, 1584412, 1857467, 2099124, 1735967, 1835621, 2052314, 1792570, 1685272, 1871896, 1650630, 1720813, 1613897, 1546659, 1710951, 1800794, 1401214, 1832596, 1424160, 1702209, 1124636, 1559805, 1406398, 1475009, 1320153, 1283107, 1578330, 1320416, 1487387, 1139429, 792391, 1270492, 962685, 1508199, 1469399, 1422145, 1067430, 1381814, 1369677, 992261, 932887, 1157857, 989363, 875860, 915945, 1118328, 1133994, 1081912, 1141990, 1026629, 1274414, 868782, 885167, 1231721, 1195912, 1409232, 848572, 905770, 1049479, 893670, 884685, 880401, 1117662, 760782, 987330, 874093, 825912, 1165368, 879811, 1032794, 570081, 677866, 781060, 977763, 894386, 675703]
16495F75703N6697j96108L03396j08775J61224p285j63840K87773j90903N4767
16485H72649j59626J19189l24519L36011k27946j09661J5948J08225O2832K6358
16475G19460j09194l1658N2937m2057K8611K99183n8167k10445j52988k7896K89715
16464G57501j62066m4012j09899L77216j35141M4008A82476L05118P7596j55737
16454D09453m2623N0155K62529j97601L44872q8496J17132B21266K19336j12887
16444C27715L073K6897J94637p2687k29243r1924L51504k18978L57956M564o7935
16433E85579j47095j2226p7888A32901J77703A39052K94391K14989k16614J15950
16423E47768k18261O0922K31868A09675K20558j9562K48300l8472j95185G892
$$ y = [675703, 732400, 536292, 839688, 730913, 892137, 884852, 721012, 1008785, 817882, 872649, 713023, 832212, 507693, 843704, 615758, 506097, 522045, 630270, 693102, 719460, 610266, 578608, 631545, 589488, 618099, 917282, 859115, 648670, 495682, 467786, 757501, 595435, 551423, 441524, 818740, 683599, 727607, 182476, 487594, 565190, 409453, 366830, 416985, 679514, 481913, 826785, 738289, 855421, 221266, 440602, 327715, 330788, 357685, 552322, 479635, 250392, 158468, 509972, 290994, 648950, 653514, 585579, 438484, 426258, 348370, 132901, 310604, 139052, 433443, 648432, 431818, 547768, 329507, 390429, 622297, 109675, 330233, 310671, 558971, 520499, 325314, 7892]
16412F84982k87524J55591r8877O2965n3790B20334J59691e6618B60804M1641
16402C02445L77073B78426j0941q484K46779a0947D51258B3484J22784J56436
16392C02704j09756K27084J5338A66746N0889b1943A09747E3047J63847R1511
16382C08405J05555A93439q2266K217J83090j43809M93308E9362M36170j07021
16372C88511A26838J65737K5326j24133O3206J72087G4210M7915K11344j09702
16362B23767J11245J81993A10191J69177j7471j03725J32159a38342D51033e9711
16351C29307p670q3240k4230J65199F1820M01114A67368J44762b7497B14177p0675
16340A43502K87264A24598o1535B0643K56085R8882J74342A10112h924A12710
$$ y = [684982, 397458, 553049, 454172, 517137, 463347, 220334, 380025, -56618, 260804, 302445, 679518, 278426, 267485, 259001, 505780, -10947, 451258, 23484, 146268, 302704, 192948, 420032, 435370, 166746, 217635, -21943, 109747, 53047, 216894, 308405, 413960, 193439, 111173, 113390, 296480, 152671, 645979, 59362, 495532, 388511, 126838, 292575, 317901, 193768, 256974, 429061, 74210, 122125, 333469, 223767, 335012, 517005, 110191, 279368, 261897, 158172, 290331, -138342, 451033, -59711, 329307, 321637, 238397, 214167, 379366, 61820, 462934, 167368, 312130, -27497, 214177, 143502, 430766, 124598, 63063, 20643, 276728, 375610, 549952, 110112, -8924, 112710]
16329B08740C7083J02500J19001m4832f7335A57650Q8064a7784A20761R5319L4867
16318B50947f0989r1744D04541m3104I1020k9752M245K56070n5805J88668B02867
16306A20875P8342p0025h417D3679i8196G2265k1038Q248L27651M1225A74478
16294C2874K78460P2540j2435A50931J80637j58417p1862k8195J58421l1621K9701
16283B29595Q6410h4947B82965o4831l1184D6857h8789a8243E11245I7185J13418
16272B10603m7925G5157a18388D7024M6450J7469j3995R5123O3001A23755h7960
16260A88372K70471A17555B634a33687I6474N0475D8002M8021L9810a58911B41761
16248a22081C1051a6672B03992L16073a12131A30781b24576H7948q287C9013J77768
$$ y = [208740, 37083, 139583, 258584, 213752, -67335, 157650, 245714, -17784, 120761, 216080, 250947, -60989, -152733, 404541, 361437, 91020, 61268, 65513, 321583, 265778, 454446, 202867, 120875, 199217, 129192, -8417, 43679, -98196, 72265, 51227, 59475, 387126, 428351, 174478, 32874, 311334, 383874, 371439, 150931, 331568, 173151, 101289, 73094, 231515, 199894, 229595, 316005, -84947, 282965, 218134, 186950, 46857, -88789, -18243, 511245, 97185, 210603, 162678, 75157, -118388, 47024, 93474, 110943, 96948, 192071, 255072, 123755, -87960, 188372, 458843, 117555, 2634, -133687, 96474, 146949, 48002, 96023, 135833, -158911, 241761, -122081, 31051, -16672, 203992, 520065, -112131, 130781, -224576, 87948, 79661, 39013, 216781]
16237B16781K26349A58080K30384B7367a4499r7032G8328b07688C26159A13470
16226F3556c6169C2904R2777c3912D0421a4266C15523G7988N8957n374d4617A05974
16213b48154A16947h1891F0723h6300b2371C5861O2693b9262l45229A63405A37
16201A12376J5231m1994n773c8985A09196D67L09269c2336p859B9696E164g2199
16188a98249F3798K72622A00423N7638o20K19487j01168G344M3282c28B65857
16176h592m0034B44404j6493A08533J34595B9629K36727C8592L5707k3667f3047
16164a78266A51932c4352A57918B2077a48363c8319D2729b37630h1340A26254
16153B8681L15241b02971i4138B01837J52295n0998a71711G5183e1569m4603A18964
$$ y = [216781, 443130, 158080, 388464, 27367, -14499, -111531, 78328, -207688, 326159, 113470, 63556, -36169, 32904, 125681, -33912, 40421, -14266, 315523, 77988, 136945, 131571, -44617, 105974, -248154, 116947, -81891, 60723, -86300, -22371, 35861, 98554, -29262, -374491, 163405, 137, 112376, 127607, 85613, 79840, -38985, 109196, 467, 309736, -32336, -40195, 29696, 5164, -72199, -198249, 63798, 336420, 100423, 158061, 157441, 376928, 275760, 7344, 50626, -328, 265857, -8592, -48626, 244404, 227911, 108533, 243128, 29629, 266356, 38592, 74299, 50632, -63047, -178266, 151932, -34352, 157918, 22077, -148363, -38319, 42729, -237630, -81340, 126254, 28681, 343922, -202971, -94138, 201837, 354132, 303134, -171711, 75183, -51569, -96172, 118964]
16141I7472J22951f4074m9189m8261C19350j2257A8365b19699p5816J36409D96643
16129a29694A45105a35633j8767B06078a23124l0912H9672c04596H0218c7929
16118A67982d8971E0971c30147B58905a22638N9611A18934a47219H5604a80537
16107b1890k09139h8021D862J6688J22745G1006a31973C28443D5716A3464d9550
16095A38686f5986A5184b6210r3516E1619J60802q6241b23308B3330K37323a6921
16083d6607a4754j84748B27222A03984A0623h6100k42164G657f5722k9143k47129
16072c41994q15A26152o1385a65728d8165D1789A6414g0507j74146D4321i6768
16060c8409A83269c28023A4095J86033m1915B0291P195d4913n2014k25939a18700
$$ y = [97472, 220423, -64074, -113263, -161524, 319350, 307093, 18365, -219699, -295515, -159106, 496643, -129694, 145105, -135633, -154400, 206078, -123124, -154036, 89672, -304596, 80218, -37929, 167982, -48971, 50971, -330147, 258905, -122638, -63027, 118934, -147219, 85604, -180537, -21890, -231029, -88021, 4862, 21550, 144295, 71006, -131973, 328443, 45716, 13464, -49550, 138686, -65986, 15184, -26210, -119726, 51619, 212421, 126180, -223308, 23330, 260653, -16921, -46607, -14754, -199502, 227222, 103984, 10623, -86100, -328264, 7657, -65722, -94865, -341994, -342809, 126152, 64767, -165728, -48165, 41789, 16414, -70507, -244653, 44321, -96768, -38409, 183269, -328023, 14095, 200128, 158213, 20291, 27486, -44913, -96927, -322866, -118700]
16048G3111j7038J44532c9097l79438C03390b3408B89349c45456e3718j31708
16038a85426g094I1218M4239g7778q1623f3808k86494A74395a21353A05680K52070
16027C57750d8331r0796C14669a96560j35395D6605M53351c02691a25163A06771
16016g4668m3266D5096i3488I6299l7969a91368A67433H3521m567K47870B080
16004a89665J5173D1434Q6677a87062P1818j72813A83518a14473b6941k85639
15994c12580a7550j4987j56896a2655A71960i6650A28584p811D2736f9516C98247
15982C29312A50432P7083I4120J1733h3180D8315h3904D32842A04369a1975j60975
15971a72950g2248C40122a98036C0172a10138L3811c3466q2753G4434P9503m7620
$$ y = [73111, 56073, 200605, -39097, -418535, 303390, -23408, 289349, -345456, -53718, -185426, -7094, 91218, 135457, -77778, -159401, -63808, -350302, 174395, -121353, 105680, 357750, -48331, -139127, 314669, -196560, -331955, 46605, 499956, -302691, -125163, 106771, -74668, -117934, 45096, -93488, 96299, 58330, -191368, 167433, 83521, 78954, 326824, 2080, -189665, -174492, 41434, 128111, -187062, -115244, -288057, 183518, -114473, -26941, -312580, -17550, -32537, -189433, -12655, 171960, -96650, 128584, 120773, 42736, -69516, 398247, 329312, 150432, 227515, 94120, 105853, -83180, 48315, -83904, 432842, 104369, -11975, -172950, -72248, 340122, -198036, 30172, -110138, -76327, -33466, -116219, 74434, 153937, 106317]
15960A06317a9079B57781a03387E7891b22062A34783P1148E6687c67990a43165
15949a46750M2358l07491D5575b09145K1878h268j31991j6168L2884A48068a84000
15937C7197a44640e6166j866E0395a36866j22169a14250j30159J07717C21213
15926g9620o1651p0613A30945a68385B08044b7868j1948D8429J36910h3948H0808
15914A1179b08313B00551P985a52760d2989H0773I878J12090m6310c6849H4679
15902F4338a74460A11646M7897b92628j5788L7227C1649a32709j60873i9281D7912
15890a40588B0280b7399A16037R653a39194f1296a0379B1103a86392b8550I1394
15878a36830C2051M6842A0148b34446A74342a41598B66230a92503C92898D1118
$$ y = [106317, -19079, 257781, -103387, 57891, -222062, 134783, 205931, 56687, -367990, -143165, -146750, -104392, -411883, 45575, -209145, -187267, -8268, -140259, -156427, -123543, 148068, -184000, 37197, -144640, -56166, -58032, 50395, -136866, -259035, -114250, -244409, -136692, 321213, -79620, -141271, -211884, 130945, -168385, 208044, -27868, -39816, 48429, 185339, -83948, 80808, 11179, -208313, 200551, 208536, -152760, -42989, 80773, 9878, 121968, 75658, -36849, 84679, 64338, -174460, 111646, 159543, -292628, -308416, -271189, 31649, -132709, -293582, -99281, 47912, -140588, 20280, -27399, 116037, 125690, -139194, -61296, -10379, 21103, -186392, -28550, 91394, -136830, 32051, 78893, 10148, -234446, 174342, -141598, 266230, -192503, 392898, 41118]
15867a03204B2943J7407J03698a13875B55766c00558g0614a8617B8048K28660
15857B56708f0334H4713B6239L84330c03649C400J85750C0525a3839k45176C62086
15845b4586e4m65783A16508B6274b812l69173A55519B0978e4298A4106J03069
15834A17175K19443i8761G563a43334m2660F5605b02795q3290F7723b49452d2638
15822a12624l24150a13546A42041a04985l41063F4293b28832B5915a96958c2837
15811B4021L8705R189a48424A97706c19400C78586A23409a99408e9717A46884
15800e01136A1117K54499b81349J25068M9020n3275M939e1477k6032A77105c44369
15788d9389j67237J04945D10349e6612a1844A03042a41028B0702b90380a12485
$$ y = [-103204, 22943, 40350, 144048, -113875, 255766, -300558, -70614, -18617, 28048, 256708, -60334, 84713, 26239, 410569, -303649, 3400, 189150, 30525, -13839, -259015, 362086, -24586, -54, -465837, 116508, 26274, -2812, -371985, 155519, 20978, -54298, 14106, 117175, 336618, -98761, 7563, -143334, -185994, 65605, -202795, -286085, 67723, -249452, -42638, -112624, -436774, -113546, 142041, -104985, -446048, 64293, -228832, 25915, -196958, -32837, 24021, 62726, 71915, -148424, 197706, -319400, 378586, 123409, -199408, -59717, 146884, -501136, 11117, 265616, -281349, -156281, -107261, -160536, -155597, -51477, -77509, 177105, -344369, -49389, -216626, -111681, 410349, -56612, -11844, 103042, -141028, 20702, -290380, -112485]
15777c24727c933r37D0801a05872B91132b97202b4969C09363c0655A4696b88023
15765C853J11797f6042p8948o908A57365B4641a8592q9135E8492K5221J36558
15754B20271a15225B026d1674I9431J03084I3465C3037h6258A10804a55675B52811
15742a08090q8124j97050a66354h544n9762D8492a18053H8513m4005a47666G3147
15730i3518n6557j811A6023a93605b5559k3915B34949c41034A22646C8323a91127
15718A6745J10443K1659c14132J33392j25436P1722c212j53214o2448B04141L31000
15707E35141c4662C4876a96006q1177C12397A44863L4990i5861M142p557k9607
15696a28883B91277a47665F9440J28787n941j5649E9418L0873Q4534K8775d7483
$$ y = [-324727, -3933, -4870, 40801, -105872, 291132, -297202, -24969, 309363, -30655, 14696, -288023, 3853, 115650, -66042, -144990, -151898, 157365, 24641, -18592, -107727, 58492, 83713, 220271, -115225, 2026, -41674, 99431, 202515, 93465, 33037, -86258, 110804, -155675, 252811, -108090, -196214, -393264, -166354, -8544, -68306, 48492, -118053, 88513, 44508, -147666, 73147, -93518, -150075, -151886, 16023, -193605, -25559, -49474, 234949, -341034, 122646, 38323, -191127, 16745, 127188, 148847, -314132, -180740, -306176, -234454, -3212, -156426, -218874, 204141, 535141, -34662, 34876, -196006, -277183, 312397, 144863, 179853, -95861, -91719, -99276, -128883, 291277, -147665, 69440, 198227, 192286, 176637, 59418, 90291, 174825, 203600, -47483]
15684a27804j52458b5783C0334K73107b77178D3294i7106n2291k01887a9642l98233
15673d17875A52930C7629k729a4862A21509d37064B12222K0495a75498A0567a80859
15661A31713a07962l2352N7170A55676o2815g2411j23011A24141a12956B7916
15650A3985a84555B7992a5848j85603P0743A54651J02609d7053A11366f3935A37063
15638c12115C74944b22433k7356A2497M7245b132A2374R8648Q8125h1958j31239
15627b13197e6749h69B41423j05338A8099J26645a57637m5863A79645F1653b30826
15615a55524A22838a62148A07228l56P5443J36948h76B6098a934o7929E9495g371
15602h3112n5679f4258p7184E9709A7080O5933h7720j48691A15089J11546d27725
$$ y = [-127804, -280262, -25783, 30334, 303441, -277178, 43294, -97106, -149397, -351284, -19642, -417875, 152930, 37629, 34900, -14862, 121509, -437064, 212222, 232717, -175498, 10567, -180859, 131713, -107962, -140314, -83144, 155676, 92861, -72411, -195422, 124141, -112956, 27916, 13985, -184555, 27992, -15848, -201451, -130708, 154651, 257260, -47053, 111366, -63935, 137063, -312115, 374944, -222433, -249789, 12497, 59742, -2132, 12374, 111022, 199147, -81958, -213197, -56749, -869, 241423, 136085, 18099, 144744, -157637, -203500, 179645, 61653, -230826, -155524, 122838, -162148, 107228, 106872, 182315, 319263, -876, 26098, -1934, -69863, 59495, -7371, -83112, -138791, -64258, -141442, 59709, 17080, 83013, -87720, -236411, 115089, 226635, -427725]
15590B38003r3879b9636B05346h5585A56143f53k335A5045a54648G390a63968
15578A6594R4268a48484B29480C6574K0594K46192a15051k3151n7712A25624b80410
15566a5382j21890g098E4556J19740g1134A31786l9115c48130I0654L305b55427
15554a75660M7034d3125a1284A30402m954c19892J27103E6276e7538i608j21229
15543a30837c3692j37794D9566n454L21368B3685K7613J57655n2502a55141e6273
15531G8259K3144a79021N4926A26447D6548M7648C7761O7414K31827b36966p7321
15520c14287B16740P7190a64926K6160b0315m8285E170K88181a35043F7895J32774
15509B00669a28944B29222i1400D34637E7709i9423b6021A76016d8215j71120
$$ y = [238003, 144124, -29636, 205346, -85585, 156143, -653, -2988, 15045, -154648, 7390, -163968, 16594, 110862, -148484, 229480, 36574, 57168, 303360, -115051, -138202, -195914, 125624, -280410, -15382, -137272, -7098, 54556, 174296, -71134, 131786, 92671, -348130, 90654, 93959, -255427, -175660, -128626, -43125, -11284, 130402, 125448, -319892, -192789, 56276, -57538, -9608, -130837, -33692, -171486, 49566, 44112, 365480, 23685, 51298, 208953, 156451, -155141, -56273, 78259, 101403, -179021, -124095, 126447, 46548, 94196, 37761, 105175, 337002, -236966, -314287, 216740, 293930, -164926, -138766, -20315, -68600, 5170, 293351, -135043, 67895, 200669, -128944, 229222, -91400, 434637, 57709, -99423, -26021, 176016, -48215, -219335]
15499b19335l1850j7782C1712a09947A34376b49246A96842n7516f6613A58703
15488c05784L5166B62278a39368B48237C4056d0178B0153d7645F1018e2839B61960
15476a84170c7369e03k6667I3500J4102J14107f0696b2884A46756b0710D3110
15464f973k5928F0503J77637Q8167a11144L7553a2869A7129J48066b4860j3418
15453c8278A51181o9552a81770E1345a91939j14587A11492D2361i1504A17194
15442a37864N0784k69179e5010r173A70350g6945o1392J2469A55370b54867F0710
15430a1534F1866B3152b63220C7129M266O0584c11381D8156k1661K6097J0934
15419F3526b33905F5557e5317f297F3463b28895m06O0729O8978K9800H8449A2709
$$ y = [-219335, -251185, -268967, 31712, -109947, 134376, -249246, 196842, 139326, -66613, 158703, -305784, -270618, 262278, -139368, 248237, 34056, -40178, 20153, -47645, 61018, -52839, 261960, -184170, -37369, -503, -27170, 93500, 107602, 221709, -60696, -22884, 146756, -20710, 43110, -6973, -32901, 60503, 238140, 326307, -111144, -73591, -12869, 17129, 165195, -24860, -38278, 151181, 81629, -181770, 51345, -191939, -306526, 111492, 42361, -91504, 117194, -137864, -87080, -356259, -55010, -64183, 170350, -76945, -138337, -125868, 155370, -254867, 60710, -11534, 61866, 23152, -263220, 37129, 41395, 101979, -311381, 48156, 26495, 52592, 63526, -233905, 65557, -55317, -6297, 63463, -228895, -229301, -168572, -99594, -69794, 88449, 12709]
15406B63447b91990B28485H1909J78619a06992E4700d4125j7689o1820L8610C81908
15394a05745n2786f6864k1127k01086I5926a02950a6005j0287G1143a89802A21527
15382c42976d3349j84391A46660b5650p225A61726d0290B55773a24892e8240q5732
15371a43972C1199a99240R7094A69576F2345b38695a3280A36391f9955H4955J17018
15360B01973D7535e71626i1456H4549J54735d2414o5591A67662h1688A28383a54617
15348g910A98587q2619c7422l75710a40236m6604C00505A48897M8564C2869K6222
15337E9091a93925g5403j27522e4811B20711j2671I6786l6644a00357k40262B20472
15325b17176i3047j06770A52042a20499F7238a72812d3795C0766L34960q4433
$$ y = [263447, -291990, 228485, 81909, 260528, -106992, 54700, -44125, -61814, -123634, -85024, 381908, -105745, -158531, -66864, -87991, -289077, 95926, -102950, -16005, -26292, 71143, -189802, 121527, -342976, -43349, -227740, 146660, -25650, -32875, 161726, -40290, 255773, -124892, -58240, -143972, 31199, -199240, -102146, 169576, 62345, -238695, -13280, 136391, -69955, 84955, 201973, 47535, -571626, -91456, 84549, 239284, -42414, -108005, 167662, -81688, 128383, -154617, -7910, 198587, 115968, -37422, -413132, -140236, -186840, 300505, 148897, 197461, 32869, 59091, -193925, -75403, -202925, -54811, 220711, 208040, 96786, 60142, -100357, -340619, 220472, -217176, -93047, -199817, 152042, -120499, 67238, -172812, -43795, 30766, 365726, 281293]
15315B81293M8148b32905A87568b2137l4784b2081k1286A54514l6414E7437K5744
15304H3181b55929E2329a39598A312a66783c6604m840A48838J07875m6995n1709
15293A58009A0177J96156h0705k19972H80O749Q5062c9217G2173c42990F1457
15281B39487b61890B79378c4065H6022a7737G5962c549B70176n2925J04532A9836
15269b87045G1248B4354a60802r7950B72350L009A21295f4403I916N93274A04142
15257a17094E6461R8674K25005I0447l3185B8411L6414L26201L82255N07798p7842
15246A203237j83672N08154o18471k78661B57050B3975P1647j5941a82428B5962
15235I678J25822Q6787E847J13742C499n0J37168g2817B90081G930J47655D6791
$$ y = [281293, 329441, -232905, 187568, -22137, -56921, -22081, -43367, 154514, 118100, 57437, 83181, -255929, 52329, -139598, 1312, -166783, -36604, -41444, 148838, 256713, 209718, 158009, 10177, 206333, -80705, -300677, 880, 7629, 92691, -39217, 72173, -342990, 61457, 239487, -261890, 279378, -34065, 86022, -17737, 75962, -3549, 270176, 217251, 321783, 19836, -287045, 71248, 24354, -160802, -258752, 272350, 275359, 121295, -64403, 9916, 603190, 104142, -117094, 56461, 155135, 380140, 90447, 57262, 28411, 64825, 391026, 773281, 1281079, 1203237, 1019565, 1527719, 909248, 630587, 257050, 23975, 95622, 79681, -182428, 25962, 9678, 135500, 222287, 5847, 119589, 3499, 3449, 140617, -72817, 290081, 7930, 155585, 46791]
15222b33082G0691a41765A07836m7468Q6961f3040A50608b8498A06239O8694K04594
15211C79527D2173N6364K03084h8047B91190e0201r3860A62946L2184m9301b2936
15199h961m213b338I0095J39870A00248K13308g2378j62903B17352K01257B386
15187G2698J14765a86466C4221K6000a8474A55116P8552H4665K7456a3049o7869
15176h0918J0268C13862r7593I0733K30809f5048n627B23281A6885K48416J4505
15165B79806P4287f4243l4102C53050j54286D4311b8378B57037G9609J2059K60651
15154C52319J05453j50720A02986P8264J55591E2520M0810J19379a2496E137j442
15143C695a81330K0265d2480c496r0984j7627C43107q8664m4005a63324B55320
$$ y = [-233082, 70691, -141765, 107836, 60368, 147329, -63040, 150608, -28498, 106239, 174933, 379527, 42173, 98537, 301621, -88047, 291190, -50201, -144061, 162946, 195130, 145829, -22936, -8961, -13174, -2338, 90095, 229965, 100248, 313556, -72378, -235281, 217352, 418609, 2386, 72698, 187463, -186466, 34221, 60221, -18474, 155116, 233668, 84665, 112121, -13049, -80918, -70650, 313862, 216269, 90733, 321542, -65048, -70675, 223281, 16885, 265301, 279806, 354093, -64243, -98345, 353050, 198764, 44311, -28378, 257037, 79609, 91668, 352319, 457772, 307052, 102986, 181250, 336841, 52520, 93330, 212709, -12496, 5137, 3695, -181330, -161065, -42480, -3496, -94480, -112107, 343107, 254443, 210438, -163324, 255320]
15131I2446b36382C16940a453C58537C030J12494K4476L2516O6124F1499K56752
15120C18251a27492B15065G0475K28483H2412P6522b57363d6847j0876B6316b56681
15108B02442J38676A27506j3277a062j57006A29525n8117P9564a22405A39698
15097B00889r4078J14155K00673C5341f3623D2074e9395B00337M9960d9547j86546
15086b36093C75135r1456A6031J28288B5181K29309h5878C32640a15339B26113
15075d44594A33943l62F4374m501J73010m4107a28699C57546a3458e209C28258
15063D58514A39221f7228B99611O5391J4057c5971E7693R9468a98861C8123G483
15051A77388a42769A28736K90278J31044A63740k4058h7326B36411B5372a35140
$$ y = [92446, -236382, 316940, -1453, 358537, 3030, 115524, 140000, 172516, 238640, 61499, 318251, -127492, 215065, 70475, 298958, 82412, 158934, -257363, -46847, -57723, 26316, -256681, 202442, 341118, 127506, 114229, -1062, -158068, 129525, 71408, 150972, -122405, 139698, 200889, 106811, 220966, 421639, 35341, -63623, 42074, -59395, 200337, 250297, -49547, -236093, 375135, 283679, 16031, 144319, 25181, 254490, -85878, 332640, -115339, 226113, -444594, 133943, 133581, 64374, 59873, 232883, 188776, -128699, 357546, -13458, -5209, 328258, 458514, 139221, -67228, 299611, 365002, 379059, -35971, 57693, 157161, -198861, 38123, 7483, 177388, -142769, 128736, 419014, 550058, 163740, 139682, -87326, 236411, 25372, -135140]
15040C34544d0698j81423B20763O6911a89765d5605C70465a91668I9598j4925
15030H4673J51537l1963l5225i6087L0963A90786K00389j14752B8653M2772b2086
15018D87054A34198J24271N8351j53452L0444a07589D01264j93433J35653A20973
15007A31033L24265j56904l3507N794C8485N89336B56032G12L54756C7902J16594
14996A54496l9406J89021A29739P2231P7993D0644K04780E4730a96073G9647J52879
14985B32526a40106B60343a0385B26247n7917c3847C10651A37717d4382B11060
14974b25463C27371j39501D4000g3483C92238b4513C55805A67122L24827M2559
14964E34508B11020R5731j1521A18330k393J43353f9037B07369K8535J69047g0143
$$ y = [334544, -40698, -222121, 220763, 287674, -189765, -45605, 370465, -191668, 99598, 84673, 236210, 204247, 169022, -96087, -65124, 190786, 391175, 276423, 28653, 71425, -22086, 487054, 134198, 258469, 316820, 163368, 193812, -107589, 401264, 207831, 343484, 120973, 131033, 455298, 298394, 264887, 270681, 38485, 627821, 256032, 712, 355468, 37902, 154496, 115090, 304111, 129739, 201970, 279963, 40644, 245424, 54730, -196073, 79647, 232526, -140106, 260343, -10385, 226247, 168330, -33847, 310651, 137717, -44382, 211060, -225463, 327371, 187870, 44000, -73483, 392238, -24513, 355805, 167122, 491949, 534508, 211020, 306751, 295230, 118330, 115937, 259290, -69037, 207369, 235904, 404951, -70143]
14952D71152l0775k04661J18985j00708q037K8398a02929C35652L1025A77485
14941A36965K20731P0519p1696p4716j36526o721b0397A32413J41762L6887p4069
14930B36993C6558L13696j73457L9707J43497K9293a05650C05553j46242R9043
14920B58354J21806P0952J33635B31928P4174I8034L8726K89812o6876A77012
14909C42455K3602K48943k82365J23257G7673K08995J71052j85526b715C75292
14898F74901k77291j17727n33K21114B27819Q5670Q5082G0003R3430M4743K6065
14887B34241L4442j2993N7397R6215j30422o6054J7903L9998l7021K66494j41212
14876C58988a35455A69279c3630E55761L6930k13029A05511M54210k79181K14568
$$ y = [471152, 440377, 235716, 354701, 253993, 245956, 274354, -102929, 335652, 366677, 177485, 136965, 357696, 428215, 356519, 281803, 145277, 138556, -20397, 132413, 274175, 311062, 236993, 36558, 350254, 176797, 216504, 360001, 389294, -105650, 305553, 159311, 258354, 380160, 451112, 584747, 231928, 306102, 98034, 136760, 426572, 359696, 177012, 342455, 366057, 615000, 332635, 455892, 77673, 286668, 457720, 272194, -2715, 375292, 674901, 397610, 279883, 279350, 500464, 227819, 313489, 398571, 70003, 163433, 208176, 234241, 268683, 255690, 313087, 409302, 278880, 212826, 230729, 270727, 233706, 500200, 358988, -135455, 169279, -33630, 555761, 592691, 379662, 105511, 559721, 280540, 495108]
14866D95108E8456J17196J30736J13245G5907M22697a03985E29610j11925A27529
14855D92152J80323B08411J2578K89853K1467k51553J63662j12848G7861J31033
14845B08894J96294J77591B01119Q7204j14505L77781j26770n1545J10387j59062
14835C24609L45101B65523J46608l1285A29148M04018B59878d8569C81124J82947
14825E64071j47447q7684O1715j52022J09351B7055M18193L96547l52950B05283
14814B47213J48762j43698N05519k61855p1753J1722l1329L473L46502l70518
14804C84038J10559L06851O9499D31416M9334M4611P5171k33372j60086J43996
14794C51070Q0686L55536k2596j77055k11150J82785B42711A20619K91597N5844
$$ y = [495108, 58456, 175652, 306388, 419633, 75907, 498604, -103985, 529610, 417685, 127529, 492152, 672475, 208411, 220989, 510842, 532309, 280756, 444418, 331570, 77861, 208894, 405188, 582779, 201119, 288323, 173818, 551599, 424829, 373284, 483671, 324609, 669710, 265523, 412131, 380846, 129148, 533166, 259878, -48569, 381124, 564071, 416624, 328940, 390655, 238633, 347984, 27055, 445248, 841795, 488845, 205283, 247213, 395975, 252277, 757796, 495941, 424188, 435910, 404581, 408054, 754556, 384038, 494597, 801448, 870947, 431416, 480750, 525361, 600532, 367160, 207074, 351070, 431756, 787292, 764696, 587641, 376491, 559276, 242711, 120619, 412216, 468060]
14784D68060K12662B59153J17077K13096j07109M29141B79997M07959L7651o1336
14774F64271j69879j32818q6168M64619A53154M02865k05217L5071J33445N3605
14764E72923Q0272N7201L0298k74181j10170l7431M23747k80243J20207r6663
14754D85960r619j9204j53289N49099l61409j00467K26413Q6559k32576K78363
14744G49830J9327B27757M29937r5309J51556r5143j12224j00701L82845J46247
14734I34965k65738J81452q5138K8951j76107J575k8155K18454C30154L77598
14724G07752m7107k09806K15134j85797K61597M3970k61503L36304m0454k96520
14714E23570j18530N25785l16879M23462k30944o0186o1484L6694j71912L64430
$$ y = [468060, 680722, 259153, 376230, 589326, 482217, 911358, 279997, 687956, 725607, 664271, 494392, 361574, 275406, 740025, 153154, 556019, 350802, 385873, 519318, 572923, 653195, 710396, 740694, 466513, 356343, 318912, 742659, 462416, 582623, 485960, 476341, 457137, 303848, 852947, 491538, 391071, 617484, 704043, 471467, 749830, 769157, 227757, 657694, 562385, 713941, 618798, 506574, 405873, 788718, 934965, 669227, 850679, 765541, 794492, 618385, 619960, 591805, 810259, 330154, 707752, 660645, 450839, 665973, 480176, 741773, 785743, 524240, 860544, 820090, 523570, 405040, 930825, 613946, 1037408, 806464, 746278, 684794, 721488, 549576, 914006]
14704I14006j35165K52355k64417K62888l08157J32333K0290q6093K09838j93707
14694H04171k51373L9097J90397L8978j82815k99868Q19113m22689k5749l4736
14684F74526L5819K71778p1896j09645j49813J53459M8035k55009L94117k51022
14674G40349J79598j12884K02418k06533k00243N85673m54447J44969k22490M89086
14664A145496n50832K73671p9603J23748J60165n10701K36601J27029J92502j24976
14654I93100L72351m40649L03777k07861j64060K485O5675M12385k44096L16982
14644A410089l26898j55619Q9390J85842k40291N7555J43889L150L39370j66051
14634A340426M6122k47573J24806R0971r6956r7076k69796L60021J02180l29880
$$ y = [914006, 778841, 1031196, 766779, 1029667, 721510, 853843, 874133, 788040, 997878, 804171, 552798, 591895, 782292, 821270, 638455, 338587, 1157700, 735011, 709262, 674526, 710345, 982123, 910227, 800582, 650769, 804228, 852263, 597254, 991371, 740349, 919947, 807063, 1009481, 802948, 602705, 1188378, 733931, 878900, 656410, 1145496, 594664, 868335, 788732, 912480, 1072645, 561944, 798545, 925574, 1118076, 993100, 1365451, 924802, 1228579, 1020718, 856658, 859143, 924818, 1337203, 1093107, 1410089, 1083191, 927572, 1016962, 1202804, 962513, 1020068, 1163957, 1167107, 1506477, 1340426, 1386548, 1138975, 1263781, 1354752, 1257796, 1160720, 890924, 1250945, 1353125, 1023245]
14624A023245K36650q4871l190n5708j8858O1786Q6577j29448L62592l58241K00807
14613A321341l9628L94611l90463l75057L46011N86817m61604m6259P9845N8226
14603A473840m9183J13899r8640L8505K33375j91824k6690J41700j09284K32041
14593A757739j1566o7335J76294l27085k73618L01565r918o0477K85812N3817
14583A825228j40742j3391m9096K67362J04085J25747m90628J84532l03192P7166
14573A587071M15249j92171K71329q3437l7476J64490j71725J64902n8378J79631
14563B239485P5059o1867k13904p8236L75054R1768Q5867L54825l64389M57371
14553B961033L22416J73137N47916L19752J496584L589751R823720J8710693M795832
$$ y = [1023245, 1259895, 1175024, 1171834, 1116126, 1097268, 1159054, 1245631, 1116183, 1478775, 1120534, 1321341, 1281713, 1676324, 1285861, 910804, 1256815, 1843632, 1382028, 1335769, 1415614, 1473840, 1424657, 1538556, 1439916, 1478421, 1711796, 1519972, 1493282, 1634982, 1525698, 1757739, 1746173, 1678838, 1855132, 1528047, 1254429, 1555994, 1546076, 1485599, 1771411, 1825228, 1684486, 1671095, 1621999, 1889361, 1993446, 2119193, 1628565, 1813097, 1509905, 1587071, 2002320, 1810149, 2081478, 1998041, 1960565, 2125055, 1953330, 2118232, 2059854, 2239485, 2314544, 2252677, 2038773, 1960537, 2335591, 2427359, 2513226, 2868051, 2503662, 2961033, 3283449, 3456586, 4004502, 4324254, 5820838, 9410589, 19234309, 37945002, 42740834]
14544D2740834j9732593A0978294E277271j895316j429224j71349r5404K2906
14536A708884J28206L4468j45981L76769m13141O190L13898J44003q6463J106
14526B067939n9799M8854M62849p35743J90765K48482m7657j9299l11346K27734
14516B072779Q267k40428N54554Q9487j17783L48720j80893j10800K2329k5843
14506B420389o2823k0409K15377N86165k50845M4459l20868K43756k7467k4154
14496B803580J1252N4053m9905M12308n61042K29553J97432J89875j57249k22319
14486B907538M07417j15842M0042p160J16390j49701L56589l79925J57435K04417
14476C537200K67473n438K577j44074l7053L24638k44580o0206K83575j23302
$$ y = [42740834, 23008241, 10978294, 5277271, 3381955, 1952731, 1781382, 1685978, 1708884, 1837090, 1871558, 1725577, 2102346, 1689205, 1695395, 2009293, 2153296, 2066833, 2067939, 2008140, 2056994, 2519843, 1784100, 1974865, 2223347, 2175690, 2156391, 1845045, 2072779, 2081046, 1840618, 2395172, 2484659, 2366876, 2715596, 2534703, 2423903, 2446232, 2420389, 2357566, 2337157, 2552534, 3138699, 2887854, 2932313, 2611445, 2855201, 2827734, 2803580, 2814832, 2868885, 2818980, 3231288, 2670246, 2899799, 3097231, 3287106, 3129857, 2907538, 3314955, 3199113, 3239155, 3231995, 3348385, 3198684, 3555273, 3175348, 3332783, 3537200, 3804673, 3799235, 3801812, 3657738, 3620685, 3945323, 3700743, 3640537, 3924112, 3800810]
14466C800810J4365K41168r8038L53632l56231j25027L01687K50254n2853o850
14456D322917k71565N40318J71880P3694q9694l56258N28050J15782k9492J8903
14446E024535j1547N4374o039K67824q7659N0368K51024j79776K62483j39671
14436E485916K53990O3432k48859K79818J87291J06965k13576M54126j32140J32486
14426F369449N167J51326J63718j67658L87076j54319R8821j54259O48046Q8241
14416G435608k41822K2952M49518l8468J01356J63664J38502J75028R3567J62197
14406H462102k20950L56708K06838K37505O7095J383K39410J72220R309K22481
14396I754101N0427J93237K31669P7322P87368q04438P80910k15339Q2971N05672
$$ y = [3800810, 3815175, 4056343, 3958305, 4311937, 3955706, 3830679, 4132366, 4382620, 4329767, 4322917, 4051352, 4591670, 4763550, 4837244, 4747550, 4391292, 4919342, 5035124, 5005632, 5024535, 5012988, 5067362, 5061323, 5329147, 5241488, 5291856, 5542880, 5363104, 5625587, 5485916, 5739906, 5803338, 5554479, 5834297, 6021588, 6128553, 5914977, 6369103, 6236963, 6369449, 6374616, 6525942, 6689660, 6522002, 6909078, 6754759, 6853580, 6699321, 7347367, 7435608, 7193786, 7216738, 7666256, 7627788, 7729144, 7892808, 8031310, 8206338, 8299905, 8462102, 8241152, 8597860, 8804698, 9042203, 9109298, 9110681, 9350091, 9522311, 9531620, 9754101, 9804528, 9997765, 10229434, 10306756, 11094124, 10289686, 11070596, 10855257, 10938228, 11443900]
14386A1443900M73661N9381q3369L51971K01701N2294O22519J87771P7803l7630
14376A3350002M48145L54374O20131K51477J23013J10034O18542O2611N57421
14367A6495750J26930O09120K30885J94638K05405N87261O75909o1059M28587
14358A9493426R60560L27046K0258L38595R20890K77958M51408N50153N44525
14349B3884819N58920J025164K90760P34464N98733O85532R71602P68644M45662
14340B9964300Q40464Q88216P46975J134878P96239J184852P36381J203887J267618
14331C8763810P19381J680943J535217J365933J286981R29398J793625J959443
14323E0034731J247893J928415K135364J922031J934212K160712K229878K376063
$$ y = [11443900, 11917561, 11976942, 11893573, 12245544, 12447245, 12499539, 13122058, 13309829, 13387632, 13350002, 13798147, 14152521, 14772652, 15024129, 15147142, 15257176, 15875718, 15938329, 16495750, 16622680, 17231800, 17462685, 17657323, 17862728, 18449989, 19125898, 19064839, 19493426, 20453986, 20781032, 20801290, 21139885, 22060775, 22338733, 22790141, 23340294, 23884819, 24443739, 25468903, 25759663, 26494127, 27092860, 27778392, 28749994, 29518638, 29964300, 30804764, 31692980, 32439955, 33574833, 34371072, 35555924, 36292305, 37496192, 38763810, 39483191, 41164134, 42699351, 44065284, 45352265, 46281663, 48075288, 50034731, 51282624, 53211039, 55346403, 57268434, 59202646, 61363358, 63593236, 65969299]
14315F5969299K699602K805683K974155K715684L202777L623895L098559L779402
14307I0869056M092869L969276M830740M915813M920760N463352N364230O593351
14299A31019447O182173P152467P322668Q028802Q038485Q969102R969432J0045672
14291A96728248J0608816J1546023J2104529J2808677J3448406J4183889J5077204
14284B86505792J5078366J5744217J6576961J6346376J6650144J6364911J5948535
14277C99215302J5370736J4286310J2621460J0770835Q655187M447960j757344
14270D63610446k033567j704300m373341l098011m039827o976448j0657707j2965743
14262D17761502j5036706j5782455j6469950j6827244j6722198j6421373j6281202
$$ y = [65969299, 68668901, 71474584, 74448739, 77164423, 80367200, 83991095, 87089654, 90869056, 94961925, 98931201, 103761941, 108677754, 113598514, 119061866, 124426096, 131019447, 137201620, 144354087, 151676755, 159705557, 167744042, 176713144, 186682576, 196728248, 207337064, 218883087, 230987616, 243796293, 257244699, 271428588, 286505792, 301584158, 317328375, 333905336, 350251712, 366901856, 383266767, 399215302, 414586038, 428872348, 441493808, 452264643, 460919830, 465367790, 463610446, 461576879, 459872579, 455499238, 452401227, 448361400, 441384952, 430727245, 417761502, 402724796, 386942341, 370472391, 353645147, 336922949, 320501576, 304220374]
14255C04220374j5400729j4475996j4065773j3897013j3045058j2682243j1574619
14248B09078943j0973894j0040085j0100509q971646q023278q113553p774786
14241A45081192o976173o853722o053016n410493m978992n465335n294342m303626
14233I9745493m528696l944088l254521l748655l370327l304690l287456k858047
14225G1449013k410631k755313k423457k337525k398815j781605j770397k095233
14217E3476037k123901j475144j643227j048530j624086j329293j367130j555676
14209D1309050j280114r84666l95980j414573j486362j163513q33148j051089
14201C2699605p41973k61797j153943j005702n99502r10962p13348l27409q75345
$$ y = [304220374, 288819645, 274343649, 260277876, 246380863, 233335805, 220653562, 209078943, 198105049, 188064964, 177964455, 168992809, 160969531, 152855978, 145081192, 138105019, 131251297, 125198281, 119787788, 114808796, 109343461, 104049119, 99745493, 95216797, 91272709, 88018188, 84269533, 80899206, 77594516, 74307060, 71449013, 69038382, 66283069, 63859612, 61522087, 59123272, 57341667, 55571270, 53476037, 51352136, 49876992, 48233765, 47185235, 45561149, 44231856, 42864726, 41309050, 40028936, 39044270, 38648290, 37233717, 35747355, 34583842, 33750694, 32699605, 31957632, 31695835, 30541892, 29536190, 28936688, 28025726, 27312378, 26984969, 26109624]
14192B6109624o66271o80354o70001p83332m70759q05722l08572m64429m50753
14183B0809431o67366r4027n95709k95384m68576n18891l73341n61047k96033
14174A6939057R7875m39322l72825o55475k44649k28250l09145j79327l53067
14165A4254872q185k58365m28339Q3287q18386j85964p3560k26312j13511k16740
14155A2008797m47845j80750q4862j07774j57170m96000K13036k65942k06934
14146A0274556j53106l5922j14164l47865l7615l11393K38836m32504P8829k57688
14136H901964K24139m14194j75620r6848j95130m60358K26315l2818o4722M6632
14126G959360l37369j88624j6022m70790J96712j82514J70723k41848J68323m79883
$$ y = [26109624, 25443353, 24762999, 24092998, 23309666, 22838907, 22033185, 21724613, 21260184, 20809431, 20142065, 20048038, 19452329, 19156945, 18688369, 18169478, 17796137, 17235090, 16939057, 17036932, 16597610, 16224785, 15569310, 15324661, 15096411, 14787266, 14607939, 14254872, 14246687, 13988322, 13559983, 13643270, 12824884, 12638920, 12565360, 12339048, 12225537, 12008797, 11560952, 11380202, 11295340, 11187566, 11030396, 10534396, 10747432, 10481490, 10274556, 10121450, 10085528, 9971364, 9623499, 9585884, 9274491, 9513327, 9080823, 9159652, 8901964, 9126103, 8711909, 8536289, 8439441, 8244311, 7783953, 8010268, 7977450, 7912728, 7959360, 7621991, 7433367, 7417345, 6946555, 7143267, 6960753, 7131476, 6889628, 7057951, 6578068]
14116F578068j14625J79819m22589J98126l22051O9443l40649J74466J20555m45401
14106E675162p9919L61774j51388l80266k41410K69661j55169K57132j68019k12306
14096E175252n6774j56511J10724l749n8503l86402J5980K53408r984k24692L30273
14085D989022m28967Q5133k01244J98127J1697j03387l53162J18892r9274j62591
14075D054246Q8073J39662j12319p5024j39091p1265j57737P960k42875m784K14674
14064C701520K7121l07923L82419m53733L99122k94173L07170J3276j16202p2999
14054C585598l11109P387j36694p6129l94165O24805j96873k0442J02479J2533
14044C197390j79157j88159j61350L77217l0780l84117l3210J90624N0399J60222
$$ y = [6578068, 6463443, 6643262, 6220673, 6418799, 6096748, 6166191, 5825542, 6000008, 6120563, 5675162, 5595243, 5957017, 5805629, 5425363, 5183953, 5453614, 5298445, 5555577, 5387558, 5175252, 5118478, 4961967, 5072691, 5068942, 5010439, 4624037, 4640017, 4893425, 4883441, 4658749, 4989022, 4560055, 4645188, 4443944, 4642071, 4653768, 4550381, 4197219, 4316111, 4216837, 4054246, 4142319, 4281981, 4169662, 4094638, 3955547, 3884282, 3726545, 3734505, 3491630, 3486846, 3701520, 3728641, 3420718, 3803137, 3349404, 3748526, 3454353, 3761523, 3774799, 3658597, 3585598, 3274489, 3281876, 3145182, 3069053, 2674888, 3299693, 3102820, 3082378, 3184857, 3197390, 3018233, 2830074, 2668724, 3045941, 3015161, 2631044, 2597834, 2788458, 2838857, 2999079]
14034B999079k91306Q5445K62196q6778n57136K17373j18063J63676N5859l27056
14024B403289j97136M44373p3516j82357L43968p63374M42693j31711Q8913j73136
14014B202006L32420l70901k62303Q7486J17825l6405j17891L19031l96614J26471
14004B001125n7936K26747k56975k64831K48188k56123j40083J42519L22550o2702
13994A902479l03287L42692J85176j89838l7010M37922K287574P730116J9055306
13985C1411130J2268869j7673207j1560402n846351k655722j471338q66109k81173
13977C325697l14046l76651J17329j68557j55669j73152j65479J51104r9092N9381
13967B200865m50351K55541R0552k6320k27468r542O0301O8990k77635K90695
$$ y = [2999079, 2707773, 2793218, 3055414, 2968636, 2411500, 2628873, 2510810, 2674486, 2730345, 2403289, 2206153, 2650526, 2577010, 2394653, 2738621, 1975247, 2417940, 2286229, 2375142, 2202006, 2534426, 2163525, 1901222, 1988708, 2106533, 2070128, 1952237, 2271268, 1874654, 2001125, 1943189, 2169936, 1912961, 1648130, 1896318, 1640195, 1500112, 1642631, 1965181, 1902479, 1599192, 1941884, 2127060, 1937222, 1900212, 2338134, 4625708, 12355824, 31411130, 43679999, 26006792, 14446390, 8600039, 5944317, 4472979, 3606870, 3325697, 3011651, 2635000, 2752329, 2583772, 2428103, 2254951, 2089472, 2240576, 2141484, 2200865, 1750514, 2006055, 2096607, 2070287, 1842819, 1833277, 1893578, 1962568, 1684933, 1975628]
13957A975628r1815k59441N2533J5365R8608J12455k32276j24658L84090k33451
13947A697038j25197K30448j04604j72901l4363M59580k84633n44P4009m78781
13937A260052K85327r5485j05458L12432n61939J57859N5784j21578L45295l31839
13927A200450K06823J40987m56407M13637l92549M03641Q7195n3757l34140J95664
13917A411544K62571m79232K01076j24163k26115J70960J77422j77749j63349
13908A052965M95997n06380o3470K19681j82987J59198l33150K70479J92785J68958
13898A474076j94231r8676m65629L06655l8560O8715J67087k75481M507M13032
13888A361495l94449K67305j81437j86042K66951k76956j4085L37975J89113m66861
$$ y = [1975628, 1883813, 1624372, 1676905, 1692270, 1790878, 1903333, 1671057, 1546399, 1930489, 1697038, 1571841, 1802289, 1697685, 1524784, 1490421, 1950001, 1665368, 1664824, 1738833, 1260052, 1545379, 1449894, 1344436, 1656868, 1094929, 1252788, 1308572, 1186994, 1532289, 1200450, 1407273, 1548260, 1091853, 1505490, 1112941, 1516582, 1603777, 1550020, 1215880, 1411544, 1674115, 1194883, 1395959, 1271796, 1045681, 1216641, 1394063, 1216314, 1052965, 1548962, 1042582, 979112, 1198793, 1015806, 1175004, 841854, 1112333, 1305118, 1474076, 1279845, 1181169, 715540, 1022195, 983635, 1052350, 1219437, 943956, 948463, 1361495, 967046, 1234351, 1052914, 866872, 1133823, 856867, 842782, 1180757, 1369870, 903009]
13878I03009K74921Q7549n00052J46079M45551l94298j74880J82839m2385J76346
13868A104679r0419J54283J46543E20778N86738j53843j78305L78141L3029l55242
13858H31296K05574r6479o5551N6726k80314K19512k97695O39631k68729k15963
13848G28008O8522J34600j90151K34185j09994l73424M57365j71012Q4J01762
13838H79945L6026j1062j25360j70340K24815L3128k85878L12179j56573K69916
13828A006796j64721k8400K1381K03803j24837m14789K80812k50599O98289m74022
13818G53713k18001J94568K62998m03683K07530q1393R8211R7029j11735l07309
13808D91928n644L41730j42679J28595l49898L05601m6036J1726k05045J7804
$$ y = [903009, 1177930, 1265479, 765427, 911506, 1357057, 962759, 787879, 970718, 928333, 1104679, 1014260, 1168543, 1315086, 520778, 1107516, 953673, 775368, 1153509, 1186538, 831296, 1036870, 940391, 874840, 931566, 651252, 870764, 573069, 1212700, 943971, 728008, 796530, 931130, 740979, 975164, 865170, 491746, 949111, 778099, 778183, 879945, 915971, 904909, 779549, 609209, 834024, 867152, 581274, 893453, 736880, 1006796, 842075, 813675, 835056, 1038859, 914022, 499233, 780045, 529446, 1227735, 753713, 535712, 730280, 993278, 589595, 797125, 715732, 813943, 910972, 799237, 491928, 486284, 828014, 685335, 813930, 464032, 769633, 723597, 735323, 530278, 548082]
13798E48082M33799k20206k05075J0013K66055J55572m20035J93007j2988L81103
13788A129327D43662J68097m1361K68295C99980K12547j48958K89611j77243K74383
13778H50320j38245K06691m39343P8960L22121m32867n8995K36563B96608N56990
13768H53598j60161o6250K02815C78861L09765J2297k03033j01054L79825C71081
13757D87592L51140k99402J74852l08131J32474R7609j05074m6069J16563K53400
13747H54954k59584j15987r9681K05118j28393m5582M94910A79637K89216O3338
13737E32191B34819M49410k40241R6975m6096K22089C26132M98714C70337J24698
13727D95035N3384j61633K66464C10952L83460r2077J00386l18929m2186J71618
$$ y = [548082, 981881, 761675, 556600, 566613, 832668, 988240, 568205, 761212, 748224, 1129327, 443662, 611759, 570398, 838693, 399980, 612527, 463569, 753180, 575937, 850320, 712075, 918766, 479423, 558383, 880504, 447637, 388642, 625205, 296608, 853598, 693437, 627187, 830002, 378861, 688626, 700923, 497890, 396836, 776661, 371081, 487592, 838732, 539330, 714182, 406051, 538525, 636134, 531060, 484991, 601554, 854954, 595370, 479383, 379702, 584820, 456427, 410845, 905755, 179637, 468853, 532191, 234819, 684229, 443988, 540963, 494867, 716956, 326132, 824846, 370337, 495035, 548419, 386786, 653250, 310952, 694412, 602335, 702721, 383792, 341606, 513224]
13717E13224j83260J11580j40352J30766K2680B06323q304P2656K57729k55723
13707B72681J98151H1758N37258j18642j69451q4253q444K79940K9861j92222
13697C55805L66856l03408O498K61621m3297q4180A20109L76168B46000L55183
13687F01183l4373J87035F2378N93477q6117j40821n9977n33J21725j32642K22954
13676E80444j69297K02336j84903k14104L57687A03858J58818J77863A36958N07060
13666F44018j5929A26081M56949J6311r1337c6583C63472P8181j47742l7076K09441
13655D66276K46781k26528j5264K89340C23206K24016L2359M305n7063j53553
13645C73270I79M94033B26195P08157C27862A25414J81085A48723M25715B28417
$$ y = [513224, 329964, 441544, 301192, 431958, 454638, 206323, 198019, 270675, 528404, 272681, 470832, 81758, 619016, 500374, 330923, 246670, 238226, 518166, 548027, 355805, 722661, 419253, 425751, 687372, 644075, 559895, 120109, 496277, 246000, 601183, 566810, 753845, 62378, 655855, 569738, 428917, 368940, 368407, 490132, 357490, 580444, 411147, 613483, 428580, 214476, 572163, 103858, 262676, 440539, 136958, 644018, 628089, 126081, 583030, 599341, 508004, -36583, 363472, 441653, 293911, 256835, 466276, 713057, 486529, 471265, 760605, 323206, 547222, 579581, 583886, 526823, 373270, 979, 495012, 226195, 934352, 327862, 125414, 306499, 148723, 574438, 228417]
13634A34625K9998L54203A05282M30739K00683k16972A62847M92475q1671A91776
13623C91505o6519L8469L59409j79461r7009l8265G0534L30875I7615J12461M58344
13612F68420l15707j73120L11379N4587B49719I9558Q9114J30324r6859m989A07783
13600D33610j44493K52630B64802J82173P2607r5711k6090o3129C2397L04494
13590C36891q5247J59396L4651j68215K00523k5499J09999A26936j7123J97041
13580C06854J723j28352J79562j04501B0772L64338j23207i480k48278B20640
13569D86647j28379J56068B54483K7105J26380j17792A16856N50281l03198B0368
13558H1837Q9592L2482L45356f6103B23629G4866k8387B319J10350J52621o6885
$$ y = [134625, 164623, 518826, 105282, 536021, 736704, 519732, 162847, 655322, 573651, 191776, 391505, 324986, 363455, 722864, 543403, 446394, 408129, 70534, 401409, 97615, 210076, 668420, 352713, 179593, 490972, 545559, 249719, 99558, 188672, 318996, 222137, 217148, 107783, 433610, 289117, 541747, 264802, 446975, 519582, 423871, 397781, 334652, 32397, 336891, 251644, 411040, 445691, 277476, 477999, 452500, 562499, 126936, 109813, 306854, 308577, 180225, 359787, 255286, 20772, 385110, 261903, -9480, -257758, 220640, 486647, 358268, 514336, 254483, 281588, 407968, 290176, 116856, 667137, 363939, 20368, 81837, 171429, 203911, 549267, -66103, 223629, 74866, 46479, 2319, 112669, 265290, 198405]
13547A98405k7012J4830o9541R1093K24935B2751M64911A90326J71812P1891a00621
13535B82671J09192j44191j22093I953M19096d0936B13118j7285Q9854J06823
13525C92510o0212O5160I4976g8267F32385r8841j21437A49141e4219B23485q4437
13514A39048A6323J24945L39031k34174N6878n7769A20789J07883l731K29835
13504D54776A86301L68826k08933H3230K51811O8326J02747b87643D93535m7912
13494D45623L2608A00160O551L17661A47400K68271A58811L27518j64784N258
13484C26803J84950j90882O7430A84865A1156a23366M2052A66109a15153B41175
13473E08187b25918B33894q6643L47911k08359Q6230a05225G822J23421K53947
$$ y = [198405, 171393, 186223, 116682, 207775, 432710, 22751, 487662, 190326, 362138, 434029, -100621, 282671, 391863, 247672, 125579, 9953, 429049, -40936, 213118, 195833, 285687, 392510, 332298, 397458, 94976, -78267, 632385, 533544, 412107, 149141, -54219, 223485, 139048, 16323, 141268, 480299, 246125, 303003, 245234, 120789, 228672, 224941, 454776, 186301, 555127, 346194, 83230, 335041, 403367, 506114, -287643, 493535, 445623, 478231, 100160, 106711, 424372, 147400, 415671, 158811, 486329, 321545, 326803, 511753, 320871, 388301, 184865, 11156, -123366, -81314, 166109, -115153, 241175, 508187, -225918, 233894, 147251, 495162, 286803, 373033, -105225, 7822, 131243, 385190]
13463C85190L6906c71A10990J53487j11610I254J71927d0951l2577C9211c6983
13451g8023C12279A35783Q1958o6969K04318j37113p4655O41548H3651L8381J36080
13440B58112A08443O1469F891K24273R8234a0793B57813K1650m7995A08320M49532
13429E57852k07222d5499D29348j07338a0150I8966J35353l0723G5482c15992
13418B27344n3109a63880B16458N1854f2403G618O9207L41431A84139D2140P366
13407D9506K83446G4126N4472O8019a19730B38238b03712f464H8306C5085P1961
13396A07046k5991d4220Q472B96674n583J21208A57366a39515B14805R6767a56146
13384B63600j14899a19043C00570A40449a3049B04049J4318e076q6474B35082
$$ y = [385190, 422096, -371, 110990, 264477, 152867, 9254, 181181, -40951, -73528, 39211, -36983, -78023, 312279, 135783, 217741, 150772, 355090, 217977, 143322, 784870, 83651, 122032, 258112, 108443, 169912, 6891, 231164, 329398, -10793, 257813, 279463, 231468, 108320, 557852, 350630, -45499, 429348, 322010, -10150, 98966, 234319, 203596, 75482, -315992, 227344, 174235, -163880, 216458, 268312, -62403, 7618, 76825, 418256, 184139, 42140, 49506, 332952, 74126, 128598, 196617, -119730, 238238, -203712, -6464, 88306, 35085, 107046, 81055, -44220, -35748, 296674, 291091, 412299, 157366, -139515, 214805, 311572, -156146, 263600, 148701, -119043, 300570, 140449, -13049, 204049, 218367, -5076, -91550, 235082]
13373E79550j18769j12006H2925O3869A0178J47193K46764j99429O6679b58A06220
13361a09506A37655R4757q2964R5124J27131j80014P9568k3243G0730J27368J43227
13350C41325J5014m1622J54444c4680A31144J68790L05277B81691j16738a10489
13339C24547j55739L09616J67431B35135j17291J37188p3074m1123J75753J73180
13329D89768F3339J81982J3944O4599j29146J77671L7119B437J38873B8142K99544
13318C27686o3248j9019j8864Q913H5998R3198H6721N64464A31147c0839m4867
13307g5706C47943b2519A11531M9933a84963k3337B44118J32103b00428A05222
13296F8113O4605m2552J67027E0921d1472B45301l4532P9925E2593M1565b1163
$$ y = [579550, 460781, 348775, 82925, 146794, 10178, 157371, 404135, 204706, 271385, -258, 106220, -109506, 137655, 232412, 149448, 244572, 371703, 191689, 271257, 248014, 70730, 198098, 341325, 356339, 314717, 469161, -34680, 131144, 299934, 605211, 281691, 164953, -110489, 324547, 168808, 478424, 645855, 235135, 117844, 255032, 181958, 140835, 316588, 489768, 63339, 245321, 259265, 323864, 194718, 372389, 409508, 2437, 141310, 28142, 327686, 264438, 245419, 226555, 235468, 85998, 179196, 86721, 651185, 131147, -30839, -75706, 347943, -22519, 111531, 161464, -184963, -208300, 244118, 376221, -200428, 105222, 68113, 132718, 90166, 257193, 50921, -41472, 245301, 210769, 290694, 52593, 94158, -21163]
13284b10406B23552b32902G5598J11108c0876A28171A7487Q8090J32270a7402
13273A95793L55759B53615E0174J67622J4372a19864A51531b1114C8724A3967
13262a26596J2533C00703M26352A13461J06031f5128k02087f9296h827G3411K22963
13251B96374e717C0255L43079a28051n0442i630A07628D0147a8287G6237J10266
13240A86503j0196a70981A92052c44411e5160B26572c42630C2459J42086K24193
13230C98738A81591e1151m5065C3844h5178K7498n7663A06349a6196A35456a88931
13218B11332g5011A19022J34722J07595a05169A50995J19436a9713k55230E7028
13207a12721C8021c3396C6643i6281j60152F3273J56125C6224K92781j09123I5417
$$ y = [-210406, 223552, -232902, 75598, 186706, -30876, 128171, 17487, 105577, 237847, -17402, 195793, 551552, 253615, 50174, 217796, 232168, -119864, 151531, -21114, 38724, 13967, -126596, -114063, 300703, 727055, 113461, 219492, -65128, -267215, -69296, -8827, 73411, 296374, -5717, 30255, 373334, -128051, -178493, -9630, 107628, 40147, -18287, 76237, 186503, 176307, -170981, 192052, -344411, -55160, 226572, -342630, 32459, 174545, 398738, 181591, -51151, -96216, 33844, -85178, -57680, -115343, 106349, -16196, 135456, -188931, 211332, -75011, 119022, 253744, 361339, -105169, 150995, 270431, -19713, -274943, 57028, -112721, 38021, -33396, 36643, -96281, -256433, 63273, 219398, 36224, 329005, 219882, 95417]
13195d6362A11016C2139J96687b89999g6435D7251g7013G8015a34900E3103c4100
13183B70648o2963L02409B05085o6367F3695a66735A07527b745n9061p2708A01405
13171B7891L4760K11087b06370g1354A56677p0313L96749E8140b7320j09236A28553
13159A4804M0691a51747A30837J22092e9245D3103d79364g9256F6091k1004J98187
13148B43274j09747C6338j7691K75190j29152o2069J08522J78390a28937B03319
13137A8000a65415L0446d886D4789A5130K1919M0290N0847b18316A90279k541
13126A87738b07889O5131A77631j1954p6606c398B37824F6666J38430p1391a96496
13114B13330L1429O1939b86281B42498F168R2209K23508C5754P018a80807e7676
$$ y = [-46362, 111016, 32139, 228826, -289999, -76435, 47251, -77013, 78015, -134900, 53103, -34100, 270648, 207685, 510094, 205085, 138718, 63695, -166735, 107527, -2745, -61806, -134514, 101405, 27891, 62651, 273738, -206370, -71354, 156677, 86364, 483113, 58140, -27320, -136556, 128553, 14804, 55495, -151747, 130837, 252929, -59245, 43103, -479364, -79256, 66091, 45087, 243274, 133527, 36338, 18647, 293837, 164685, 102616, 211138, 389528, -128937, 203319, 18000, -165415, -134969, -4886, 44789, 15130, 37049, 77339, 128186, -218316, 190279, 187738, -207889, -142758, 177631, 165677, 89071, -3398, 237824, 66666, 205096, 133705, -196496, 213330, 244759, 306698, -286281, 242498, 6168, 98377, 321885, 35754, 42772, -180807, -57676]
13102e2216A93317f3711E9292b48718A38490C8470K94394j11982a71969C44559
13091H989J06410a85147L679A69863c8951C43384H3587a40280B79420c8746B0035
13079a6763p5085n0566A06965J63474d0051q0076A55277g1839E4725A5453Q5616
13068A01069C0886a73585G9872c231j43281H2611d5663B19404F9622p557a7530
13056C07712L9256e3261j00473b0769A13911g8523C8158R9768c9426A67823Q6300
13045B54123C2649J06486a31445A56440a08494b2446A98961e5495D7252J95700
13035B42952b6915k6498B19018c7930C71731A68454D6139j5992a31710B00041
13024B50435r1204c72430A56L36650B6032A0357e2191k35080C03482J34284a62995
$$ y = [-52216, 193317, -63711, 59292, -248718, 138490, 38470, 332864, 220882, -171969, 344559, 8989, 115399, -185147, -181468, 169863, -38951, 343384, 83587, -140280, 279420, -38746, 20035, -16763, -91848, -142414, 106965, 270439, -40051, -120127, 155277, -71839, 54725, 15453, 101069, 30886, -173585, 79872, -3231, -146512, 82611, -45663, 219404, 69622, 62065, -17530, 307712, 346968, -53261, -153734, -20769, 113911, -78523, 38158, 137926, -39426, 167823, 254123, 32649, 139135, -131445, 156440, -108494, -22446, 198961, -55495, 47252, 242952, -26915, -53413, 219018, -37930, 371731, 168454, 46139, 30147, -131710, 200041, 250435, 159231, -372430, 156, 336806, 26032, 10357, -52191, -287271, 303482, 437766, -162995]
13012i2486L7945A99560a17648l4581A16283K0102M08749A00175B9089a79296
13001c13327E0633i0569A39154a08773A28235J5475a57535G2099J75196G235J40862
12990A48097n1973i669k2084B27824a60494p1806B37564A04280b45540A53044
12979A14770o276a83331B2966N6940J968J70908F7759a31850r9479B1781g1838
12967A46312o5721h3135B37187E2109L08891A34755i7463j75797C7654b4301H1615
12955A20811K32461A68806b96434C11706i0199C73073G8517K54744b0770k8977
12945d9747B42633A05535n1645M4354a24119K3436B42103A16209K05307A03635
12934b74074J27779a0150n4647a3532B82263a48406a9806A62266m3083J3280b223
$$ y = [-92486, -54541, 199560, -117648, -152229, 116283, 136385, 545134, 100175, 29089, -179296, -313327, 50633, -90569, 139154, -108773, 128235, 143710, -157535, 72099, 247295, 7235, 148097, 96124, -9669, -31753, 227824, -160494, -232300, 237564, 104280, -245540, 153044, 114770, 108494, -183331, 22966, 79906, 81874, 252782, 67759, -131850, -231329, 21781, -71838, 146312, 80591, -83135, 237187, 52109, 361000, 134755, -97463, -273260, 37654, -24301, 81615, 120811, 353272, 168806, -296434, 311706, -90199, 373073, 78517, 333261, -20770, -49747, 242633, 105535, 53890, 98244, -124119, -100683, 242103, 116209, 321516, 103635, -274074, -146295, -10150, -64797, -13532, 282263, -148406, -19806, 162266, 119183, 132463, -2223]
12922C54306E725N2696c16369O5465C2083O6433J5037b9409k3846A16272c10104
12910I4375a19092q2698A4257L14608a2574k44167e6555j78044E07278A71917
12899c1186p9520J7820D9061M5591a14286D21246H379N9949f4840A32527A4938
12887B02613i0240j3203A8038J26740R2339b36633P3034o5037m7293J19538B4721
12875A72770c832I7688j5068J87377c17938a46264j6592k6781C92553A44569C3233
12863A59271a77199j34381g936B37973I9221a20666L8654B11887a95106A67213
12852D07908a44492H074b3472A19873L78793h7948B15309a83562I464L51740a30951
12840B78397J0454n647B3453d62902A64658b3033k76C3200P9912d6990n2491q4919
$$ y = [354306, 5725, 58421, -316369, -250904, 32083, 98516, 113553, -29409, -53255, 116272, -310104, 94375, -119092, -201790, 14257, 328865, -12574, -256741, -56555, -234599, 507278, 171917, -31186, -110706, -92886, 49061, 94652, -114286, 421246, 8379, 68328, -64840, 132527, 14938, 202613, -90240, -103443, 18038, 144778, 237117, -236633, -163599, -228636, -275929, -156391, 24721, 172770, -3832, 97688, 82620, 269997, -317938, -146264, -162856, -189637, 392553, 144569, 33233, 159271, -177199, -311580, -7936, 237973, 99221, -120666, -82012, 211887, -195106, 167213, 407908, -144492, 8074, -23472, 119873, 498666, -87948, 215309, -183562, 9464, 361204, -130951, 278397, 288851, 283204, 23453, -462902, 164658, -23033, -23309, 33200, 113112, -46990, -99481, -184400]
12828a84400E3018M9846c63175a49730B20817E5975K49917b7391j27132J4463
12818a40060A17206d0203j36414h3685B00275F7526a36551O4577k05550J9402
12808b58122a20391K4337k99833A13246i5001B86156q8650H9325M4440b51325
12797a74550b5037r7197d4780A80622o0916D2870A3565b09730B21309N284b28275
12785i4115o184i120C813a78764e6284n8491b6161N511F0153e6495j81607Q3714
12773a54388N0013B49141g512l11484G9526N7119K11955A08413J05864a76502
12762A37927a98197C9331a80090A11294J30687c3385j37A8700R9484l8867a84689
12750F5772d7760j4649o8766A0921N5814O9065P3828a50132A90123B197J59898
$$ y = [-184400, 53018, 102864, -363175, -149730, 220817, 55975, 305892, -27391, -154523, -140060, 117206, -40203, -176617, -83685, 200275, 67526, -136551, -71974, -277524, -258122, -120391, -96054, -395887, 113246, -95001, 286156, 197506, 89325, 133765, -251325, -174550, -25037, -122234, -44780, 180622, 119706, 42870, 13565, -209730, 221309, 226593, -228275, -94115, -100299, -9120, 3813, -178764, -56284, -114775, -26161, -20650, 60153, -56495, -238102, -154388, -104375, 249141, -7512, -318996, 79526, 136645, 348600, 108413, 214277, -176502, 137927, -198197, 39331, -180090, 111294, 241981, -33385, -33522, 18700, 118184, 79317, -184689, 65772, -47760, -62409, -131175, 10921, 66735, 135800, 209628, -150132, 190123, 2197, 162095]
12739A62095a22404B21268D2856a89106C40395f355j23802B21572b99047A32555
12728C1282h9107j51344F3466b16789e4469A79816o0289J25281f3708b62o4438
12717f4700F1980l0414f5996C7399J57010b25497i905C16030f9908k5046B5650
12705d8983C52468j72609A3216N31643F3551g896A94806r256q4992L3026P9045
12694B12629B0718J65309E4845j2549J08144A7160K11585r4483E5817d9193E0038
12682a3652E3190M48112A31014b34351A44201D4812N63970a84843F0420P7677
12672A38097L8553q1012K36115l3887k273A24106a05086E4861q435J78995l3318
12661A92103l9425d9575A41090J77019C0767J84422g8118D23870G5312a21687
$$ y = [162095, -122404, 221268, 42856, -189106, 340395, -6355, -130157, 221572, -299047, 132555, 31282, -89107, -240451, 63466, -216789, -54469, 179816, 119527, 244808, -63708, -262, -64700, 61980, 31566, -65996, 37399, 194409, -225497, -9905, 316030, -69908, -94954, 25650, -48983, 352468, 179859, 13216, 544859, 63551, -7896, 194806, 185550, 100558, 133584, 212629, 20718, 186027, 54845, 42296, 150440, 17160, 228745, 134262, 55817, -49193, 50038, -13652, 53190, 501302, 131014, -234351, 144201, 44812, 608782, -184843, 60420, 138097, 176650, 95638, 331753, 297866, 295593, 124106, -105086, 54861, 46426, 225421, 192103, 152678, -49575, 141090, 318109, 30767, 215189, -78118, 423870, 75312, -121687]
12650A13243e600B37485B5412A1649N0407J85576E0397a52977C5765g3102J8954
12639e4148a1238A04692D2250K39010E4035a43436G5049J44889f065B87803p3315
12628B14488J14476I4110K01194a16763C69760k585C9568J54541H6127K5283a84680
12616A70792j1469c2297k12772a21452B9150K94123C0510A4744J96277q6849K9991
12605A54163n6761Q4689H4798J54102H3178K30040A07140R203j2378b01477A37251
12593A34100a30813j04650A60017f6331l143r7405P7139A81967d7985B23821a68423
12581a42729d8396A48990b66494n571E876K02152K8162J18543b19429L4169B32586
12569g8543D6961a67373f107p6697l25455a00717m549A54733m940c09247C35504
$$ y = [113243, -5600, 237485, 25412, 11649, 62056, 247632, 50397, -152977, 35765, -73102, -54148, -11238, 104692, 42250, 281260, 54035, -143436, 75049, 219938, -6065, 287803, 214488, 328964, 94110, 295304, -116763, 369760, 367175, 39568, 194109, 86127, 111410, -184680, 170792, 159323, -32297, -245069, -121452, 29150, 323273, 30510, 14744, 211021, 124172, 154163, 97402, 182091, 84798, 238900, 83178, 313218, 107140, 116343, 103965, -201477, 137251, 134100, -130813, -235463, 160017, -66331, -69474, -166879, -89740, 181967, -47985, 223821, -168423, -142729, -48396, 148990, -266494, -272065, 5876, 208028, 236190, 354733, -219429, -185260, 232586, -78543, 46961, -167373, -6107, -82804, -408259, -100717, -105266, 154733, 149793, -309247, 335504]
12557F9260L92687e8609A47345K28921a9047j12805k502d3240o5096q1884M2039
12546a48181B12381a33551G8374b24497I7066J41178C5519J01067a34901n7657
12536a92558d5488C05164B815i7308a7436B3220J84199b83245A63682p4178g8829
12524b36710h3266A72550J09711j07270c3583A07348M8952G6261k509c4802J3488
12513b1314k55091B5321N5584L2270B9056a37467F3001P2982e084p0369A37732
12501b43461A15451Q4491e5553E5015K3883j6753l0569J21057f3779n4399c2382
12489B36488n3671G1009a34692A27199M3791a65611a6512j75877A43865J8000
12479A61865n4873a9019B25876l794I0313a04310B28362b608m4735J5184F2552
$$ y = [69260, 461947, -58609, 147345, 376266, -19047, -131852, -134354, -43240, -108336, -190220, -148181, 212381, -133551, 78374, -224497, 97066, 238244, 35519, 136586, -134901, -192558, -45488, 305164, 2815, -97308, -17436, 23220, 207419, -283245, 163682, 89504, -78829, -236710, -83266, 172550, 282261, 174991, -33583, 107348, 156300, 76261, 73752, -34802, -21314, -276405, 25321, 80905, 113175, 29056, -137467, 63001, 135983, -5084, -75453, 137732, -243461, 115451, 199942, -55553, 55015, 78898, 62145, 31576, 152633, -63779, -118178, -32382, 236488, 182817, 71009, -134692, 127199, 170990, -165611, -16512, -192389, 143865, 161865, 106992, -19019, 225876, 222082, 90313, -104310, 228362, -2608, -47343, -32159, 62552]
12467a05190A73544K1795d5857B71254J2494e0409j49301b0934k21077h7078I1916
12455B0431J51724M17769i9652k3903D1786L3686B8506g1109E0984a49372a0151
12443C29404b50519A59817d2185D145K93917a01544A01755b13147M0491B46732
12432A81060C163J35729i8550M1746G4235J5570B1407a30454B61966I2368c99
12420d2592J7355l33861N9002E51628G512a23254q4407G9924c77918A52465M4718
12409A97183a35706B10363d8402j42886j84465J44606B95082a28417A60355a30698
12398a18005p5862P3138M4796j0222c869l48755J62584e2482C19761g0461E8740
12386H8411L6409e5732j85144b813B89310b9021k56105A17835J4016e7650j33024
$$ y = [-105190, 173544, 195339, -45857, 271254, 283748, -50409, -199710, -20934, -242011, -87078, 91916, 20431, 172155, 589924, -99652, -123555, 41786, 75472, 28506, -71109, 50984, -149372, -10151, 329404, -250519, 159817, -42185, 4145, 298062, -101544, 101755, -213147, -172656, 246732, 181060, 3163, 138892, -98550, -56804, 74235, 89805, 21407, -130454, 261966, 92368, -399, -42592, -25237, -359098, -300096, 551628, 7512, -123254, -207661, 79924, -377918, 152465, 197183, -135706, 210363, -48402, -191288, -375753, -231147, 295082, -128417, 160355, -130698, -118005, -193867, -120729, -75933, -86155, -3869, -352624, -190040, -52482, 319761, -70461, 58740, 88411, 124820, -55732, -240876, -2813, 289310, -29021, -285126, 117835, 131851, -57650, -190674]
12375a90674K0709J971m9647h2253A30741c4168j20522p4330A09929D7686L57422
12364D05108c39106a0092j54146M6824B42483I240b28816A31322a14695G4873
12353c60048J8538A93303a00746C3300a33345b6080B69096a10463A95132b4301
12342A72678a48474A52803a51188c3196B22020a17520j35161F2941a71781c1012
12331h3809A11338h6628L2625G1694J16031a23541j28502j3230n8140a7098A0582
12319a64624B39941d1750D629J21733a73364A96878D416R5047b15964B24722D1574
12307a2279B29535G2258a96274k62209h8900l8504e1142A04868L38622a89643
12296b5994A9683P331K62975C5534L58456L4420A89062i9887B04881J70454b20628
$$ y = [-190674, -169965, -167994, -217641, -82253, 130741, -34168, -154690, -229020, 109929, 47686, 405108, -339106, -10092, -164238, -117414, 242483, 9240, -228816, 131322, -114695, 74873, -360048, -341510, 193303, -100746, 33300, -133345, -26080, 269096, -110463, 195132, -24301, 172678, -148474, 152803, -151188, -33196, 222020, -117520, -252681, 62941, -171781, -31012, -83809, 111338, -86628, -54003, 71694, 187725, -123541, -252043, -265273, -323413, -17098, 10582, -164624, 239941, -41750, 4629, 126362, -173364, 196878, 4416, 99463, -215964, 224722, 41574, -12279, 229535, 72258, -196274, -458483, -88900, -127404, -51142, 104868, 443490, -189643, -25994, 19683, 27014, 289989, 35534, 393990, 428410, 189062, -99887, 204881, 375335, -220628]
12284A54739b34521A34529b06853A53992j2555P2978d8926m5806B96062j33959
12274A62103K93637n6769a25756D99980F9917a6072A77740a36571G7741C4494
12263a14730A05745k642a49707I6333N4341i0581c9090B09008D999J31310d509
12251a83349A38935i396C3503J43954p2154R377J9118C1473R7091m8095a6982
12239B68509b50689O9597A38012Q8132c5873p8326D8762b46555A44742J5906N0970
12228B11618J813g551A04929K5679R4260J06177j37809e8100D92712j70249a93308
12216B24744H2488O5782B3021M488e0433D3976J80278p5652Q6615j6760J95955
12205D14412A6286O42153A84156J230C7814J99823J5313J34018c5375A04301J27877
$$ y = [154739, -234521, 134529, -206853, 153992, 141437, 214415, -48926, -94732, 296062, 162103, 455740, 398971, -125756, 499980, 69917, -16072, 177740, -136571, 77741, 34494, -114730, 105745, 103103, -149707, 96333, 150674, -90581, -39090, 209008, 4999, 136309, -4509, -183349, 138935, -9396, 33503, 177457, 105303, 114680, 133798, 31473, 128564, 80469, -16982, 268509, -250689, -181092, 138012, 226144, -35873, -114199, 48762, -246555, 144742, 160648, 211618, 213431, -7551, 104929, 130608, 224868, 331045, 193236, -58100, 492712, 322463, -193308, 224744, 82488, 148270, 23021, 27509, -50433, 43976, 224254, 148602, 235217, 218457, 414412, 16286, 658439, 184156, 185386, 37814, 237637, 252950, 386968, -35375, 104301, 232178]
12194B32178K3909i5665F7271K62759j35980l0738c935p4489B88836D1251a5935
12182a25523B31909C3785J86310o6075K59247A30476P364N2733E1205J10818a27620
12170e341G9008n093M4700E3428d9584A27289K28373i2636B79874L3891L9739
12159C53504A68656J92327C458K97177A38695K4323K9334K9192J07215I5865J46220
12148B42085a31816L9952A26366J18887b9147A28280h6070A42032a23727A31728
12137a58679n0474L3832b5830G1601c7475B25305a31255G986a09332D4632a96576
12125A86279p4785n2729a91107A5528K31349b11966A54510i6272A4598K18162
12115B32760m884L4999a33269J5790c7486C38546a23340j27723B64909H8363b77880
$$ y = [232178, 256087, -95665, 67271, 330030, 194050, 163312, -3935, -78424, 288836, 41251, -15935, -125523, 231909, 33785, 220095, 154020, 413267, 130476, 137840, 190573, 51205, 162023, -127620, -5341, 79008, 73915, 118615, 53428, -49584, 127289, 355662, -92636, 279874, 313765, 353504, 168656, 360983, 3458, 300635, 138695, 163018, 192352, 221544, 328759, 95865, 242085, -131816, -91864, 126366, 245253, -29147, 128280, -86070, 142032, -123727, 131728, -158679, -209153, -175321, -25830, 71601, -37475, 225305, -131255, 7986, -109332, 44632, -196576, 186279, 111494, 58765, -191107, 15528, 246877, -211966, 154510, -96272, 14598, 232760, 227876, 262875, -133269, -117479, -37486, 338546, -123340, -251063, 264909, 88363, -277880]
12103A34180m6706J09705c89710A10034J43076a04676E8116R0272c76077D4518
12092c58788B36127J1198j08042K57360b03286K9596B0114e7693j84575b7249
12081B33690a31276e596A29153b18761D66629O17898R68383I59888D66547j78772
12071B87775c69215A97264b84950a41495C37356F4023b98708R275H738d5794A02235
12059F6944h315A98548a27649F2910J51625H0063j1199i3363p347B8550c6538
12047a26891k9634m1827I4541J3215O6053a31623B59972a34676b9914A20704k0777
12036I9927L7662a85654A28939c30375A37252M7202C5391f3124j0897F5366g9613
12024G6029K39512b51323F7553f2029A40343I503d7781A3372i7112A40526d2730
$$ y = [134180, 87474, 197179, -389710, 110034, 253110, -104676, 58116, 148388, -376077, 44518, -358788, 236127, 247325, 139283, 396643, -203286, -173690, 20114, -57693, -242268, -27249, 233690, -131276, -5596, 129153, -218761, 466629, 1084527, 2052910, 959888, 466547, 287775, -369215, 197264, -284950, -141495, 337356, 64023, -298708, -289433, 8738, -45794, 102235, 66944, -8315, 198548, -127649, 62910, 214535, 80063, 68864, -93363, -100710, 28550, -36538, -126891, -156525, -198352, 94541, 107756, 173809, -131623, 259972, -134676, -29914, 120704, 99927, 137589, -185654, 128939, -330375, 137252, 184454, 35391, -63124, -74021, 65366, -79613, 76029, 315541, -251323, 67553, -62029, 140343, 9503, -47781, 13372, -97112, 140526, -42730]
12012a9255D97a52119m6888A0961d9509a9615q061C05364e4525C1204J26614b04196
11999D3134c43205B2389d59989A44980b56323G4412a56551a3377q9280A17305
11988A9011a84719C11734r7199o8036f3823I9691d0928F9516a24182e6389A10732
11976a3895r4433d0784C609J08321a09398F8523d45361F3187L35905A41650c2199
11964A09056i8491A06809a81341J7685A24226a5054C2598d7286O873D2644j378
11953D1266c05703a43541J4641D4582O1082a08963A54274a79804A67686a18343
11942D6436a77145e0975l655B58549b35705O7422b5572j38591G4340J1712K4875
11931A10927e66468A28868n0596b71295B87951A6743P0897l2847b73231h3425
$$ y = [-19255, 497, -152119, -199007, 10961, -49509, -19615, -27676, 305364, -54525, 31204, 157818, -204196, 43134, -343205, 22389, -459989, 144980, -256323, 74412, -156551, -13377, -102657, 117305, 19011, -184719, 311734, 214535, 146499, -63823, 99691, -40928, 69516, -124182, -56389, 110732, -13895, -108328, -40784, 3609, 111930, -109398, 68523, -445361, 63187, 399092, 141650, -32199, 109056, -98491, 106809, -181341, -163656, 124226, -15054, 32598, -47286, -40413, 42644, 41266, -305703, -143541, -128900, 44582, 105664, -108963, 154274, -179804, 167686, -118343, 46436, -177145, -50975, -54630, 258549, -235705, -168283, -25572, -164163, 74340, 86052, 110927, -566468, 128868, 78272, -271295, 287951, 16743, 87640, 54793, -273231, -83425]
11920A36666g4302l03715J23328b7310I5181b4843m1412l26538F8985b3120j15867
11909a38987G3875L6340J5835j36J39235G1771a77485A14626a9855m5989G3649
11897B28149k0394n5694a89686k25778J44224A24504c67580B62701A07569M1683
11887A49252i9143A63734a07431H984d6096j43825c6719B5205L48329b370j43378
11876a45748B09727F7805R313P7083p1328a83900o1172a4461F9461B7019c1104
11864C69740B9995b22101H8544A7708h4190B4209J3068a90546k13204A44135e5297
11852A83921b9446F0969j4797a80177F1261f2154a1958l27855g9808j76749c380
11840f7366H4073g3537k377B49994G8208M1306d35358a41791O2534A84616b03666
$$ y = [136666, -74302, -378017, -254689, -27310, 95181, -24843, -66255, -392793, 68985, -23120, -138987, 73875, 110215, 126050, 125914, 265149, 71771, -177485, 114626, -19855, -65844, 73649, 228149, 207755, 152061, -189686, -415464, -271240, 124504, -367580, 262701, 107569, 149252, -99143, 163734, -107431, 8984, -46096, -189921, -36719, 25205, 373534, -2370, -145748, 209727, 67805, 77118, 154201, 82873, -183900, -245072, -14461, 69461, 27019, -31104, 369740, 29995, -222101, 88544, 17708, -84190, 24209, 37277, -190546, -403750, 144135, -55297, 183921, -29446, 60969, 46172, -180177, 61261, -62154, -11958, -339813, -79808, -256557, -3380, -67366, 84073, -73537, -75914, 249994, 78208, 119514, -435358, -141791, -79257, 184616, -203666]
11828h1935J1155A98811a08765F4837h0284A91038C7005e1015j48518B20579c27011
11816b53304F3743c27657D6838b58795j586k606a0077m29113B15O1522i6977l08419
11804d05396a78457A92218a6030A138O6044R0596G6953e7508p235o7689A54392
11792E455L0037J4228a98471A08568N1960L4231K8075F6337a78596J3780H2048
11780I7429B042c07427C22470b4123D72176f7184F6754a61001g1490r8A02697
11768a60890G018J10930C6012c48262L6838b1271m7660M516r2168b0599k8323
11757d8922j91768R926C01061A071J56660B6918k024b04274A32277b47247h5199
11745d43379C2388F476a39305e4982k36876J34362P315D3384B0451J74071a73531
$$ y = [-81935, -70780, 198811, -108765, 64837, -80284, 191038, 37005, -51015, -199533, 220579, -327011, -253304, 63743, -327657, 46838, -258795, -260381, -262987, -10077, -439190, 215, 61737, -96977, -405396, -178457, 192218, -16030, 1138, 67182, 157778, 76953, -57508, -64743, -132432, 154392, 5455, 35492, 49720, -198471, 108568, 160528, 194759, 222834, 66337, -178596, -164816, 82048, 97429, 2042, -307427, 322470, -24123, 472176, -67184, 66754, -161001, -71490, -71588, 102697, -160890, 7018, 117948, 36012, -348262, -311424, -21271, -68931, -64415, -156583, -20599, -48922, -240690, -230764, 301061, 1071, 157731, 26918, 24894, -204274, 132277, -247247, -85199, -443379, 32388, 6476, -139305, -54982, -291858, -157496, -150181, 43384, 20451, 194522, -173531]
11733g9873A63595a62188M8761k34759a2494k05501g0067j14090j42070A46971
11722a76324A61032Q9688e1143o770R23m5959B19421b61894b1791D1375J47192
11711A88567P435d2807A25216E7028g8636j43649I3404K82461a7269k93037B77753
11699E57473F5404a90450i4535o3280A04641J15362i4561j57291B24549e554B89214
11687a69818B14863G2947k0090i7874N172k6011A09567e4075r5116B7684I467
11675a93510I3180J8010j5095b64497A07373b24998I6946P1978K4466p1485N2500
11664A74405b48555f298A09016h460l8066q4356A87669a13430B63140g2953C32259
11652D0641e8808A19633a399I2687a92939l2556F7098a13559C32126J56472b71197
$$ y = [-79873, 163595, -162188, -113427, -348186, -12494, -217995, -70067, -184157, -326227, 146971, -176324, 161032, 250720, -51143, -57913, -56990, -102949, 219421, -261894, -21791, 41375, 188567, 196002, -42807, 125216, 57028, -78636, -222285, 93404, 375865, -17269, -310306, 277753, 557473, 65404, -190450, -94535, -157815, 104641, 220003, -94561, -251852, 224549, -5554, 289214, -169818, 214863, 72947, 52857, -97874, -92702, -118713, 109567, -54075, -149191, 27684, 9467, -193510, 93180, 111190, 96095, -264497, 107373, -224998, 96946, 168924, 193390, 121905, 174405, -248555, -6298, 109016, -8460, -46526, -130882, 187669, -113430, 263140, -72953, 332259, 40641, -58808, 119633, -1399, 92687, -192939, -225495, 67098, -113559, 332126, 488598, -271197]
11640b11854A38341a73470A14952l6243b05784A66940a33878j33557F0944L964
11630F4908g0554C4365L31969a63407A04846J70663K2080H3117J68126m5334J51988
11619C57897A45666B0354a39824I2886C8779J52809q4011J69944j4627A12442
11608A13485a88476D22317j10827n3584L3908r8058L8160q1448E3915O8045K21051
11597C43011F4933g537A67982M7102G0586Q706a31698l0496O3458B39135F7934
11585a37696B6422g0032G4034j8272L04826j77550d3308H6735K9408a65079f2575
11573f5535H6413j9051I336K18332j05855R7019c22682O7087K1225F3638O5274
11562A28912a0880D44545j95293O9926H0968a08090A59101e3940C81219d11154
$$ y = [-211854, 138341, -173470, 114952, 78709, -205784, 166940, -133878, -267435, 60944, 64908, -70554, 34365, 366334, -163407, 104846, 275509, 297589, 83117, 251243, 205909, 357897, 145666, 20354, -139824, 92886, 38779, 191588, 107577, 277521, 262894, 112442, 113485, -188476, 422317, 311490, 257906, 291814, 193756, 231916, 150468, 53915, 121960, 343011, 64933, -7537, 167982, 215084, 70586, 79292, -131698, -162194, -98736, 239135, 67934, -137696, 26422, -70032, 74034, 55762, 360588, 183038, -43308, 86735, 116143, -165079, -62575, -65535, 86413, 67362, 9336, 227668, 121813, 218832, -322682, -255595, -234370, 63638, 128912, -10880, 444545, 249252, 319178, 80968, -108090, 159101, -53940, 381219, -411154]
11551A0116J19193L78822b66934A56383M1044L7561E341d98788a2496A70991d9173
11539B23177f8746C00326J1994a28311N9502b342G7104K32223E1193J21295f5098
11527D1214g3627C6250F00N92872B45896A13335J6725L8057a20318c3572n3862
11516h7434A50134c29358b5833C89424I492K6022J12041j8596j6724a42231a3649
11504A95276a80344B42958F148a42818C69561K6776a81821A60503K8155m2891
11494A45767a13425B42735H5418K91969I0955K3897K09201a20914p251A08950
11483B93252E2743J81247j10726B1255J63039I315J27890k3843i3927E6757J55813
11472B12570K11172A13740d4163B03928J37541N468b29059A60230K48135C7054
$$ y = [10116, 129309, 508131, -266934, 156383, 197427, 234988, 5341, -498788, -12496, 170991, -49173, 223177, -68746, 300326, 312320, -128311, -68809, -2342, 77104, 309327, 51193, 172488, -65098, 41214, -73627, 36250, 600, 593472, 245896, 113335, 130060, 168117, -120318, -33572, -87434, 150134, -329358, -25833, 389424, 9492, 35514, 147555, 128959, 112235, -142231, -13649, 195276, -180344, 242958, 6148, -142818, 369561, 396337, -181821, 160503, 188658, 145767, -113425, 242735, 85418, 377387, 90955, 114852, 324053, -120914, -128165, 108950, 293252, 52743, 233990, 123264, 21255, 184294, 9315, 137205, 113362, -93927, 56757, 212570, 423742, 113740, -44163, 203928, 341469, 346937, -229059, 160230, 408365, 37054]
11461D05853g0978A40294k0415b93209D45234D1807c1030o1875d0939B4614J86117
11450B10731b92632A56247g122A34535K14336a0021j16160A67701p2431J18717
11440B13987j569j02834m2549B1694J9400K19206K671j29990a32922k19323D05476
11428a91616B05936I5234N8729J79982i7929C32149o9988A25785C7652b4560C92301
11416b2371C33736d9136D0250a7609A12195N1657a22331B59420i8236F3775K5702
11405H9477N8981M9279h636m28665A18959i3045b9812q2751K2109A36970b9069
11393c98336J98750F8483j4727a57142A24590a74616D8222c36908n839A77946
11382B42193a31061e4372r897o9047C43587o8538a39895B00538o710a62646B73559
$$ y = [405853, -70978, 140294, 119879, -293209, 445234, 41807, -31030, -92905, -40939, 24614, 210731, -292632, 156247, -7122, 134535, 348871, -10021, -126181, 167701, 95270, 213987, 212418, 109584, 67035, 21694, 41094, 260300, 262971, 132981, -132922, -352245, 405476, -191616, 205936, 95234, 153963, 333945, -97929, 332149, 262161, 125785, 37652, -24560, 392301, -22371, 333736, -49136, 40250, -17609, 112195, 163852, -122331, 259420, -98236, 63775, 89477, 148458, 197737, -8636, -437301, 118959, -93045, -29812, -112563, -90454, 136970, -29069, -398336, -199586, 68483, 53756, -157142, 124590, -174616, 48222, -336908, -342747, 177946, 242193, -131061, -54372, -64269, -133316, 343587, 275049, -139895, 200538, 193828, -162646, 273559]
11370C59915D5363O5281D1844g886l67241J83798A0987M4282a3996j1520j77677
11359b03193c6514j96221j50488K270j0001B56642l1748b6120m6076C5305M8101
11348H3406h4472A15076a03940A09717N9158o616F0229J84440E8663J77152j7498
11337B18317c5030E621P2834C2880K8059J96523D8038c69206a06367G3593a74912
11325D4063K74138G4586c53359I5000R0146b4536r9086k050A2080J4762N0365
11314G7207b52703p2414B08687c8488l27595A20463B0451b17346f8108J426C24826
11302B36634a29931q2549A37864O3863o7918A8965J73878b60536A27231L6940
11292A64171b58997A8569g0628j44346e7922E1684N665c02639g328k18851C799
$$ y = [359915, 45363, 110644, 41844, -7886, -375127, -191329, 10987, 55269, -13996, -25516, -203193, -36514, -232735, -383223, -380953, -390954, 256642, 224894, -26120, -72196, 35305, 83406, -84472, 115076, -103940, 109717, 168875, 162259, 60229, 244669, 58663, 235815, 218317, -35030, 5621, 78455, 32880, 60939, 257462, 48038, -369206, -106367, 73593, -174912, 44063, 318201, 74586, -353359, 95000, 185146, -24536, -123622, -125672, 12080, 26842, 77207, -252703, -325117, 208687, -38488, -366083, 120463, 20451, -217346, -68108, -66682, 324826, 236634, -129931, -212480, 137864, 201727, 133809, 18965, 192843, -260536, 127231, 164171, -258997, 18569, -70628, -214974, -57922, 51684, 57349, -302639, -7328, -226179, 3799]
11280A19310a87033C06298b0747l29064B06034a34510j5326j64754d1878F6812
11269C05319a71133D2098B713K49994d08960F294Q6703R4235b92393A99862a74206
11257G7405C0324M501A663c05288j2011A9182J37963a90274A48779o3180q041
11246G7558i9004H295J3931c75484A58264a27667A15885K80124a6142l81694a11238
11234g8907C6389a44983C20776D4282a7218A470L1448L735l677J2700a18551j3720
11222a32271D8480a22757l4221B46144A12316Q4236E4988M2914b41636A4962L4895
11211D9857b54098A50542c43426g9342q1660p0331A73016a60036f5669A02674
11200I5085a03725A31757i4182K855e448l26796M111a58977A00755a49607o4146
$$ y = [119310, -187033, 306298, -20747, -349811, 206034, -134510, -149836, -314590, -41878, 66812, 305319, -171133, 42098, 2713, 252707, -408960, 6294, 92997, 187232, -292393, 199862, -174206, 77405, 30324, 34825, 1663, -305288, -317299, 19182, 157145, -190274, 148779, 85599, 77558, -99004, 8295, 22226, -375484, 158264, -127667, 115885, 396009, -16142, -397836, -111238, -78907, 36389, -144983, 320776, 44282, -17218, 1470, 32918, 36653, 32976, 45676, -118551, -132271, 48480, -122757, -156978, 246144, 112316, 196552, 54988, 97902, -241636, 14962, 49857, -254098, 150542, -343426, -79342, -161002, -231333, 173016, -160036, -65669, 102674, 95085, -103725, 131757, -94182, -91327, -5448, -332244, -328133, -158977, 100755, -149607, -213753]
11189b13753B68180a90803c1106p6460A20292d9935j34801A33596J25575A13175
11178a2681m6451J3482D6267J84917a43433M2718K1402k62588B45085D2130G995
11166B26689J0048b5226E6756b09403P1556G8336a13303h027m9418A47551a57632
11154A07556c44448a5295q534j35213o8331e4142I7925f5328D7479c47317O2956
11143b84361B48918f3370j20715m0779Q0758p8266f3954A74846c6847j08336N9999
11132h5184n2961G7745K42240K8268n9630j40772c14145A13022J51548G6074K34352
11121C10426h632B34870J6119c6644G2526J09545L2444D0272J28846J8214n8279
11110A29053d3796j30149q9938D69481d8036F9120J03883J33552j07091o2040
$$ y = [-213753, 268180, -190803, -31106, -107566, 120292, -49935, -184736, 133596, 259171, 113175, -12681, -59132, -45650, 46267, 231184, -143433, -100715, -79313, -341901, 245085, 42130, 7995, 226689, 236737, -25226, 56756, -209403, -137847, 78336, -113303, -8027, -57445, 147551, -157632, 107556, -344448, -15295, -23829, -159042, -227373, -54142, 97925, -65328, 47479, -347317, -284361, 248918, -63370, -184085, -224864, -144106, -222372, -63954, 174846, -36847, -145183, -85184, -138145, 77745, 319985, 348253, 288623, 147851, -314145, 113022, 264570, 76074, 310426, -8632, 234870, 250989, -36644, 72526, 182071, 214515, 40272, 169118, 187332, 129053, -43796, -173945, -263883, 469481, -48036, 69120, 173003, 306555, 199464, 137424]
11100A37424J39084E9840J07752o7773K45976I8863b54119C63220d2005D1936
11089A32783K83256j39696I4664p709J75022j27383K21890j35307J7333F5949
11078B82051K46093B48936L64604n9898m0846A11252M04440J85808k57328H839
11067B39607L86967k76508L06949A05316J20941N37949l01886J24772J40313k67805
11057D59600L10196k82164l5825J6986K22726j07016k6775k449M1154q3948J71221
11046F83706j43947K83897j41498n7002p514K8341K23467j81087K57670j16282
11036H29751N4831k57043L49443k99032B87235L88670k49076m711M00214j21876
11026G00456J72299n5633p1199L91705E37383L93611j99401C55502L40095M1748
$$ y = [137424, 276508, 59840, 167592, 99819, 345795, 98863, -254119, 363220, -42005, 41936, 132783, 416039, 276343, 94664, 86955, 261977, 134594, 356484, 221177, 238510, 65949, 282051, 528144, 248936, 613540, 553642, 512796, 111252, 515692, 701500, 444172, 8839, 239607, 626574, 350066, 657015, 105316, 226257, 764206, 462320, 587092, 727405, 459600, 769796, 487632, 451807, 468793, 691519, 584503, 557728, 555279, 596433, 512485, 683706, 539759, 823656, 682158, 625156, 617642, 645983, 869450, 688363, 946033, 829751, 884582, 627539, 976982, 677950, 287235, 675905, 426829, 422118, 822332, 700456, 872755, 817122, 745923, 1137628, 537383, 930994, 731593, 355502, 695597, 737345]
11016G37345k42727k08160L82760k78444K53398j92320N0438K066L96744C95398
11005E86567k51220K19190M06769J53434l93310j95989K09026L3328Q79l67164
10995D01510L44326Q0307C47544O12868j87975m50R6675J14382m70656K30226
10985G42614N3818j60645M23451n9200K08948j29319K01230K04417J56869q1451
10975A560732O17919n252N48659K85276J01062m38047k0584j20020k51840n36274
10965A741631N93378p33847R3287o51892P36486l01356k4603M9076K90673L9823
10955A832656j31299l44194k78128L5983j9923o9680j46314l96178r0627D4343
10944F05885k38791A59746J23725A3449L12840K48046c4534I9643K22211A16478
$$ y = [737345, 494618, 286458, 669218, 390774, 644172, 451852, 502290, 504356, 901100, 395398, 586567, 335347, 554537, 961306, 1114740, 721430, 525441, 734467, 767795, 768674, 401510, 745836, 826143, 347544, 960412, 772437, 771987, 868662, 983044, 512388, 742614, 796432, 635787, 1059238, 1000038, 1208986, 1079667, 1280897, 1485314, 1642183, 1560732, 2178651, 2173399, 2722058, 3007334, 3108396, 2670349, 2649765, 2529745, 2277905, 1741631, 2335009, 1601162, 1694449, 1042557, 1779043, 1477687, 1453084, 1502160, 1792833, 1832656, 1701357, 1357163, 1079035, 1115018, 1095095, 1025415, 879101, 482923, 392296, 44343, 605885, 367094, 159746, 283471, 13449, 326289, 574335, -34534, 99643, 321854, 116478]
10933A07347J1438P8064O9465f2899B5535L5826a59764A50796m3902K61456I4994
10921d1059A26618a11494C4517b82766E8999g9705P623A26907a40295j2463j17075
10910b69833a22416j14567B26808a64837k8083G0251M738J61734I7451k3338J98678
10899B72791J8050g2975m546G504J64560C7793a4406E7246a2496C4634J72380
10888B07014H0489j4750k6773h4658A73289R6012a30756M4888C22063a25298A32259
10876B17279p3376a99761P3134B44614g9986c3243E5214K53284e7983B09029d0213
10864b1308A851K18938k3437r7518b89178D8976b54955b2457l40546A68871d5137
10852A49641k5179C4432b09763A3703b15540e1133j05542I4948e9026G9934J30670
$$ y = [107347, 118785, 196849, 266314, -62899, 25535, 61361, -159764, 150796, 106894, 368350, 94994, -41059, 126618, -111494, 34517, -282766, 58999, -79705, -72082, 126907, -140295, -152758, -269833, -122416, -236983, 226808, -164837, -192920, 70251, 74989, 236723, 97451, 74113, 272791, 290841, -72975, -77521, 7504, 172064, 37793, -14406, 57246, -12496, 34634, 207014, 80489, 65739, 38966, -84658, 173289, 269301, -130756, -85868, 322063, -125298, 132259, 217279, 143903, -199761, -126627, 244614, -79986, -33243, 55214, 308498, -57983, 209029, -40213, -21308, 1851, 220789, 197352, 99834, -289178, 48976, -254955, -22457, -363003, 168871, -45137, 149641, 124462, 34432, -209763, 13703, -215540, -51133, -156675, 94948, -59026, 79934, 210604]
10841B10604a60169B893a64247l5858D103d406A94952B1558f2607j99556C1957
10829F4995a0423j21356G245a35691A37175K5912Q8636p1884A1232c2105A08631
10817d7821l4296A3357f8188q2696a1916o6523B65261n1293b10733k6691A46695
10805E9773f9006j91392b6864j20714C9867c95047B8437a31460j04482R2044F1481
10793B6444E417a83980n5360L0434d8108o3046I4993k8209a09856f4j33631O1955
10781g1740A65441a50771a4797A03982h771C8564e6660A42639a81026K4343B7915
10769A03982Q1765b62612a30875b8766j62912R976A16031a37585c5124D25448
10758H3007b09352N1886C75804a75140D6541f9126A80228b44084J19677A75498
$$ y = [210604, -160169, 2893, -164247, -200105, 4103, -4406, 194952, 21558, -62607, -262163, 31957, 64995, -10423, -131779, 7245, -135691, 137175, 163087, 251723, 179839, 11232, -32105, 108631, -47821, -82117, 13357, -68188, -150884, -11916, -78439, 265261, 213968, -210733, -237424, 146695, 59773, -69006, -260398, -26864, -147578, 39867, -395047, 28437, -131460, -235942, -143898, 61481, 26444, 5417, -183980, -239340, -208906, -48108, -111154, 94993, 66784, -109856, -64, -133695, -71740, 165441, -150771, -14797, 103982, -8771, 38564, -56660, 142639, -181026, -156683, 27915, 103982, 185747, -262612, -130875, -28766, -191678, -181702, 116031, -137585, -35124, 425448, 83007, -209352, -157466, 375804, -175140, 46541, -69126, 180228, -244084, -124407, 175498]
10747h7518n4555E2496a15706B00364n6409p789B5691a45847l1422A52823a30956
10735H169J09202a15647j43715g6534m1622B40022r5998b12062B90993b16452
10724h6299j66816p4872B03878m3384p3039k305b767A61329a22571I9931J37094
10713B37025a6248A92793a01078l5047L4021A3810b36490I8239d2620C71180c8892
10701B9277b56497a1359r9528A43070e734j04774I2806a44491B42608a12663j36104
10690b48767g3075C4675i6043B36053A09638a9300k82204g260E8935j1660b31292
10678b68971E5266B6685b84241C15179H6640d6819G0378j4743c15110J51958E2709
10666a37083I1612a9681k17020A66867b12918J8785m0657M0917e3983l26170A58254
$$ y = [-87518, -142073, 52496, -115706, 200364, 143955, 136166, 25691, -145847, -177269, 152823, -130956, 8169, 117371, -115647, -259362, -76534, -118156, 240022, 144024, -212062, 290993, -216452, -86299, -253115, -327987, 203878, 160494, 87455, 85150, -2767, 161329, -122571, 99931, 237025, -16248, 192793, -101078, -136125, -102104, 13810, -236490, 98239, -42620, 371180, -38892, 29277, -256497, -11359, -110887, 143070, -5734, -110508, 92806, -144491, 242608, -112663, -248767, -73075, 34675, -96043, 236053, 109638, -19300, -301504, -7260, 58935, 47275, -231292, -268971, 55266, 26685, -284241, 315179, 86640, -46819, 70378, 55635, -315110, -163152, 52709, -137083, 91612, -19681, -236701, 166867, -212918, -194133, -234790, -193873, -53983, -380153, 158254]
10654d03613R2476a02277L2180G1265a47019L4480r1521A04016b5884A2587N3684
10643F6271j8354i25B8333a59057m2861f3035j62356h9931A99136J74032E5821
10631A4020a51073e6935j26474L6644L0398B843e7042b8047B4705a87103C10250
10619B8187L2176c01675Q546B82783d3532A99659E996J92439d66447c1794A16649
10607b46172b8311E4304J23583b69156A54965b52447A59496a10358B45892a16341
10596f2713K811k19554J06488j42419a03398A80031a49530a8107o1681L8578A49199
10584C77014c3660C2907d8858c094D3749a02396A39667b52042E8609e6609l4182
10573i0791C558J58695A0234b6213j65324g7318A37357e1213l64435A8247K2776
$$ y = [-403613, -311137, -102277, -70097, 71265, -147019, -112539, -204060, 104016, -25884, 12587, 66271, 47917, -925, 28333, -159057, -201918, -63035, -225391, -89931, 199136, 373168, 55821, 14020, -151073, -56935, -183409, -146765, -116367, 2843, -57042, -28047, 24705, -187103, 310250, 28187, 60363, -301675, -293129, 282783, -43532, 199659, 5996, 198435, -466447, -31794, 116649, -246172, -28311, 54304, 177887, -269156, 154965, -252447, 159496, -110358, 245892, -116341, -62713, -59902, -279456, -172968, -315387, -103398, 180031, -149530, -18107, -79788, -41210, 149199, 377014, -33660, 32907, -48858, -3094, 43749, -102396, 139667, -252042, 58609, -56609, -90791, 3558, 162253, 10234, -26213, -191537, -77318, 137357, -51213, -415648, 18247, 41023]
10562D1023a06683q1949g711j65175m3643c6303A94208M1360l2507b19525O5436
10551a54089B09302A2426c25114a08906k12611d5332k8794l2680B18884a81043
10540A22690m1335a33748j08743a09864D4363n496J58681d47805B876L69141a04263
10528b16833j25679b1915B18291m1169C9849J56482c4047m1398r2679A12787c42757
10516e6152r7767A3583O3639a46060O1591L1847j41763i435j21780A20949P4995
10505A95944d5166j7294A12014D0793N6347c026A17878d9339n50368a0026l02378
10494c12404J54366A10529b57107E0896A788a33144C2309J2908K46114c00663
10483G0763i0772D3689M33684k03871K57331k36232e6697A35649J14787q4854
$$ y = [41023, -106683, -188632, -7711, -172886, -216529, -36303, 194208, 235568, 203061, -219525, -154089, 209302, 12426, -325114, -108906, -321517, -45332, -74126, -106806, 218884, -181043, 122690, 81355, -133748, -242491, -109864, 44363, 38867, 197548, -447805, 2876, 372017, -104263, -216833, -342512, -21915, 218291, 177122, 39849, 196331, -34047, -75445, -168124, 112787, -342757, -56152, -153919, 13583, 77222, -146060, -84469, -52622, -194385, -9435, -131215, 120949, 195944, -45166, -62460, 112014, 40793, 97140, -3026, 117878, -49339, -599707, -10026, -312404, -158038, 110529, -257107, 50896, 1788, -133144, 32309, 45217, 291331, -300663, 70763, -90772, 43689, 477373, 273502, 530833, 294601, -56697, 135649, 250436, 165582]
10473A65582J02974e3910A99400a39505j53147A99294H1199l8856J23221C4011
10462A97116J57486C3039e2567B09732A9500J64113G662g6278n4319A66772b8391
10450e8932k152P347A30345a05849c3004B15464G8253a70078C45539c554j68529
10439a72083A1899h059j53577L0393A15916d64020a06358A83974f0434j43580
10429b04014P4381A32836B2920g8429A27144a23156H0620J75334a01398c9069
10418b04680c1319j2366m61121a99756d2354A18455b24965B66781a36907A56005
10407A2871b4006a0623j1944C89506A1347L41931H6570b42828H4687b5924k9098
10396e5022D068g6580A60953B4003f060A91910H3598R7974F3929A2406J31362
$$ y = [165582, 268556, -53910, 199400, -139505, -292652, 199294, 81199, 42343, 165564, 34011, 197116, 354602, 33039, -52567, 209732, 19500, 183613, 7662, -76278, -130597, 166772, -28391, -58932, -61084, -53737, 130345, -105849, -33004, 215464, 78253, -170078, 345539, -3554, -172083, 11899, -8059, -161636, -131243, 115916, -464020, -106358, 183974, -60434, -204014, -129633, 132836, 22920, -78429, 127144, -123156, 80620, 255954, -101398, -39069, -204680, -31319, -43685, -504806, -199756, -42354, 118455, -224965, 266781, -136907, 156005, 12871, -24006, -10623, -22567, 389506, 11347, 353278, 86570, -242828, 84687, -25924, -55022, 4068, -76580, 160953, 24003, -6060, 191910, 83598, 181572, 63929, 12406, 143768]
10385A43768a03765A02125K9574N4940k6576o1944l2355k7178J20034J42441m5846
10374B55215N639A15868K1371K45535j58788j9207K53532j01886K64189K5372
10364F45986B59750K25452j74480J10961a85912Q6871r072B07382L37522A51950
10353E36593B23292J84326K35516k36533J37827K08030k64052k00290n0184N2241
10343B90173K59306D5756K37169m1016a27663F7190J47922a3650o7446J6944j10650
10332a74802C19197i6j29640E9609a42189k5203A28663P1921j5114P6722c4859
10320C61025b4282r8124A47232E7478J76803I476N4938r520J15989m9245f9382
10308A93976d6383m0893M1649A21659a36784C24187a23969k17768C4226J90346
$$ y = [143768, -103765, 102125, 131699, 186639, 160063, 98119, 65764, 38586, 158620, 301061, 255215, 260854, 115868, 137239, 382774, 223986, 204779, 458311, 356425, 620614, 645986, 259750, 485202, 310722, 421683, -185912, -99041, -108113, 207382, 544904, 151950, 536593, 223292, 407618, 643134, 406601, 544428, 752458, 488406, 288116, 237932, 290173, 549479, 45756, 282925, 241909, -127663, 67190, 215112, -13650, -81096, -64152, -174802, 319197, -96, -129736, 59609, -142189, -167392, 128663, 200584, 185470, 262192, -34859, 361025, -24282, -122406, 147232, 57478, 234281, 9476, 64414, 54894, 170883, 121638, -69382, 193976, -46383, -87276, -45627, 121659, -136784, 324187, -123969, -341737, 34226, 224572]
10298B24572L5601A27173g8883k7688h879j13886A88063b3222p6926E9579c7940
10286c38488I2013b12595A16813b47770h1265B36658q9777c54095J08911N2848
10276a92336n9604a324j43352F3137c35650B49775A02880b2726F2245a21397e1646
10264B45948J5676m4583h8287B75015J9444A05807L74840B35363p2400D7564f2065
10252B2467a69666j07790K812B86959B8905Q1176A0760O240Q3667d6948j59576
10241b06524b8877k57980B06680b00151r4896e4919G2485b842C18291j09488c62339
10229b34428j72194A37102K93365A90754d120r5129k35090a18527A3759O0514
10219G4273a99378B44672g7508p0100A49618b53242B29711F1359J9377a56207
$$ y = [224572, 260173, 127173, -78883, -106571, -8879, -122765, 188063, -23222, -100148, 59579, -37940, -338488, 92013, -212595, 116813, -247770, -81265, 236658, 146881, -354095, -245184, -192336, -251940, -1324, -144676, 63137, -335650, 249775, 102880, -22726, 62245, -121397, -51646, 245948, 261624, 217041, -88287, 275015, 294459, 105807, 480647, 235363, 162963, 47564, -62065, 22467, -169666, -277456, -274644, 286959, 28905, 110081, 10760, 17000, 100667, -46948, -206524, -28877, -286857, 206680, -200151, -295047, -54919, 72485, -2842, 318291, 208803, -362339, -234428, -406622, 137102, 430467, 190754, -4120, -99249, -334339, -118527, 13759, 74273, -199378, 244672, -77508, -147608, 149618, -253242, 229711, 61359, 80736, -156207]
10208A47184d825r3775c5741A70751C9197a27472B51005b33416I7163L8417b65164
10196c00493N1748a15382k53477A29684c28622C4311K3596e359B91522F3259i3224
10184a83980A2874R6985h4530L7577j46280A55675b69334P7656H471M466L83318
10173C96255d646o9416j84546P7185I4870c45307a31308B34331F2740a52188P4664
10162g7524a6630q7217h808j4460k02572o8045O7310j5246f7215o058B25028b38691
10149d3487j16568J5841c8965A39113E9040J03360a51278j18048B2951a88449
10138D5706a56440A81213a46175A84995A0712L2035a16891C09571H6392J64528
10128B50920B130J68642b50092A40235i0316j57366N6336b681k21850q1198a8812
$$ y = [147184, -4825, -98600, -35741, 170751, 39197, -127472, 251005, -233416, 97163, 135580, -265164, -300493, -248745, -115382, -368859, 129684, -328622, 34311, 57907, -5359, 291522, 63259, -93224, -183980, 12874, 109859, -84530, -46953, -193233, 155675, -269334, -191678, 8471, 12937, 396255, -4646, -74062, -258608, -181423, 94870, -345307, -131308, 234331, 62740, -152188, -77524, -16630, -103847, -8808, -23268, -225840, -293885, -226575, -241821, -67215, -73273, 225028, -238691, -43487, -160055, -144214, -38965, 139113, 59040, 162400, -151278, -269326, 22951, -188449, 45706, -156440, 181213, -146175, 184995, 10712, 42747, -116891, 309571, 86392, 250920, 2130, 170772, -250092, 140235, -90316, -247682, -191346, -2681, -224531, -305729, -18812]
10116A41853a19282A65964D454a03972q4282m9751k66967a56449B6447Q3427h5017
10104b66585a7416B37571F3281a24164q9870I7852c9983B70379a16482n8212B02280
10092B85546H8203i7477M8102E0626d633A0960c76199a64724j19481D84911a88896
10080A24405M6915b79175G6917a56360j01691q3500B46442a29821n9571D9468
10069E9656J01398a55890k69897J12752a01506B40436G7160a16749e1484E4507
10058C3632a22089A71944K04727a29571A51238a17877e8590q1284C3061a49683
10047H4308N0312N6636f9762b7884j91346A22776A5045K24696c71828A45991b86350
10035c2418l58806F9641b07495i4844o2130j85766H7102a46925j86976a86k6614
$$ y = [141853, -119282, 165964, 4454, -103972, -188254, -238005, -504972, -156449, 26447, 109874, -85017, -266585, -17416, 237571, 63281, -124164, -214034, 97852, -39983, 270379, -116482, -174694, 202280, 285546, 88203, -97477, -49375, 50626, -4633, 10960, -376199, -164724, -284205, 484911, -188896, 124405, 171320, -279175, 76917, -156360, -258051, -341551, 246442, -129821, -189392, 49468, 59656, 161054, -155890, -425787, -313035, -101506, 240436, 77160, -116749, -51484, 54507, 33632, -122089, 171944, 376671, -129571, 151238, -117877, -58590, -139874, 33061, -149683, 84308, 134620, 191256, -69762, -27884, -219230, 122776, 15045, 239741, -371828, 145991, -286350, -32418, -391224, 69641, -207495, -94844, -156974, -342740, 87102, -146925, -333901, -186, -26800]
10024b6800j43077l0286B1102c2818Q759j57291B3720R0793b51711H8131K9659
10013A17790a5083A83383Q451O5923a50424b0997A51530a3907A78203b42311Q9673
10002a52638d7939K0828A3668h1646A18872a29675A08607b20809K6549M908C6485
9990B6261i0099C5292K92565A44081a3009k8835A3761a7830l75352g9457k01113
9979b80570c2195l7660A5232N5638c58321a05197A8485b61447c5138F3050a60667
9967A97809a89888A04455K07764d490B43437a00470j2968A03675a1945j78270
9957a90215O3719K9776o4406d6011A16712C2466e2410B49628c55126f6940C1574
9945h6465o0773B03420B2599b81644d3192l48667c850l14611J45703o6388r4654
$$ y = [-26800, -169877, -200163, 21102, -32818, -24059, -181350, 23720, 114513, -251711, 88131, 117790, -15083, 183383, 191834, 257757, -150424, -20997, 151530, -13907, 178203, -242311, -152638, -47939, -27111, 13668, -81646, 118872, -129675, 108607, -220809, -194260, -189352, 36485, 26261, -90099, 35292, 327857, 144081, -13009, -41844, 13761, -17830, -393182, -79457, -280570, -32195, -69855, 15232, 70870, -358321, -105197, 18485, -261447, -35138, 63050, -160667, 197809, -189888, 104455, 312219, -4490, 243437, -100470, -113438, 103675, -11945, -190215, -126496, -96720, -161126, -46011, 116712, 32466, -52410, 249628, -355126, -66940, 31574, -86465, -147238, 203420, 22599, -281644, -43192, -391859, -3850, -318461, -172758, -239146, -333800]
9934c33800e4468B74216n8557b27961f4684b049o3083F0566k9463J11497h7928
9922D0356f0569A50712G0897c24373a05999n6547d6824l13213A45105g084C9183
9910a10178j63415c1632k31701R1465B69266f3943B04114q5719m6690B1649J46550
9899A68199a87150I2344a62766O1227j07237R5488A2311b68470A5140G437c8501
9887d6073A208J23505e4588p6437E9954D109i2267d3284o1175j01203l33207e6074
9874A58473A7574O1583a84427L3139e0507J3780l1562A01035d6972j38318D9233
9862c36372p0768D3290H125e9986k15086d9797j97197A50984C6670c46511J405
9851c45106a34448c6620i842n4922B55022b02513O6934j7137r9816D0246K62700
$$ y = [-333800, -54468, 274216, 215659, -227961, -64684, -2049, -65132, 60566, 31103, 142600, -87928, 40356, -60569, 150712, 70897, -324373, -105999, -162546, -46824, -360037, 145105, -7084, 39183, -110178, -273593, -31632, -263333, -171868, 269266, -63943, 204114, 118395, 71705, 21649, 168199, -187150, 92344, -162766, -101539, -208776, -113288, 12311, -268470, 15140, 7437, -38501, -46073, 1208, 124713, -54588, -131025, 59954, 4109, -92267, -43284, -104459, -205662, -538869, -56074, 158473, 17574, 79157, -184427, -151288, -50507, -36727, -68289, 101035, -46972, -185290, 49233, -336372, -407140, 43290, 8125, -59986, -275072, -49797, -246994, 150984, 36670, -346511, -345106, -134448, -36620, -9842, -64764, 255022, -202513, -135579, -152716, -252532, 40246, 302946]
9840C02946h5833p515j6682j62679B76039a80295A36918a60081r1476a8497k24388
9829b42885F5555c4389k09699e3447A20205h9327F8861A8729b77179N7001g9673
9817G9384j23b88826A0119b98935d9634G7064b37117A92411a7948j25638L8197
9806a05389j61041C62741A32427a38008r1465A15857a1099j15723d1745q9846
9796a31591b3489k42307a02742o2993r4519Q0981d7901A4600J77083F0647a93740
9784a5295F8584f1082J7634A33394J8861d49559a87053D9011f0673I8517c17939
9772E1204d00867d6078b0696n67465b5954j17759L0630R686b2460q7508a3143
9760F0959b22816l5353A39717R7967h6833n7984K406c6029j79337A51423c00046
$$ y = [302946, -85833, -93348, -110030, -272709, 276039, -180295, 136918, -160081, -251557, -18497, -242885, 65555, -34389, -244088, -53447, 120205, -89327, 68861, 18729, -277179, -220178, -79673, 79384, 79261, -288826, 10119, -298935, -49634, 77064, -237117, 192411, -17948, -143586, -105389, -266430, 362741, 132427, -138008, -229473, 115857, -11099, -126822, -41745, -131591, -23489, -265796, -102742, -165735, -260254, -179273, -47901, 14600, 191683, 60647, -193740, -15295, 68584, -61082, -43448, 133394, 152255, -449559, -187053, 49011, -60673, 98517, -317939, 51204, -400867, -46078, -20696, -588161, -25954, -143713, -113083, -103397, -22460, -109968, -13143, 60959, -222816, -258169, 139717, 237684, -86833, -144817, -142411, -36029, -215366, 151423, -300046]
9748A09772J65972a24343f0082D13891b22778B23600a47901g3775A51236a1215
9737A77424i1127k31629g8898j6988k8206j2099e1780k16355A16368J75773h2540
9725b37884n8039c4719j8488k1092j25049R0221j85251N7360B21585a02785l3759
9714a36544N9434l98538B71477c4650k82762N0849M3437j03924l4413a78307b4743
9702B84582a82756I7088a98669A2944b82108F8124i6708B8150e8329q9931n6377
9691b04637c060A32036h0735k73329a25533k36556a35271B80604a60966b7033
9680a96330D6183j2222G51K88620p5459h6266k82476a52430M4539B7426b46524
9668A03606Q2538b19399A4327c08907C9541e9905B17765d7368j29753k0972H1971
$$ y = [109772, 275744, -124343, -60082, 413891, -222778, 223600, -147901, -73775, 151236, -11215, 177424, -91127, -322756, -78898, -95886, -124092, -136191, -51780, -268135, 116368, 292141, -82540, -237884, -295923, -34719, -53207, -74299, -199348, -109127, -294378, -237018, 221585, -102785, -136544, -77110, -475648, 271477, -34650, -317412, -266563, -223126, -327050, -361463, -178307, -24743, 284582, -182756, 97088, -198669, 12944, -282108, 68124, -96708, 28150, -58329, -148260, -204637, -3060, 132036, -80735, -354064, -125533, -362089, -135271, 280604, -160966, -27033, -196330, 46183, 33961, 751, 289371, 213912, -86266, -368742, -152430, -107891, 27426, -246524, 103606, 186144, -219399, 14327, -308907, 39541, -59905, 217765, -47368, -177121, -198093, 81971]
9656a60839A21970d3852o2877A35774o7115d027j46795j0248A92856E7766c3807
9644B003J17622c18286f6275a9212c454A44520a5607k09528E6411d14922h0373
9632B46024b65450a6783m8390k48169J03912Q0447j98816e0572j75474k4963J20000
9621a31009r5984h7895l15774f0098E2307a28515k6957G9065g1196C0160P6263
9610A06423c0909j60712A38149b19147H6611N9247N5053G0695J44806j01498a51399
9598d09652J98952A2758Q3339c83917d6723P09A85810c24204b3659j82210Q6664
9587a19205D9800i5864m6743A97694a05179k9897H981Q0364D2219q44b55393B07001
9574a78679h2130k82923J68656D4164f2138B8101d369B27899b41203b1175l06905
$$ y = [-160839, 121970, -43852, -106729, 135774, 68659, -4027, -150822, -161070, 192856, 57766, -33807, 2003, 119625, -318286, -66275, -19212, -3454, 144520, -15607, -225135, 56411, -414922, -80373, 246024, -265450, -16783, -65173, -313342, -209430, -128983, -327799, -50572, -226046, -251009, -131009, -226993, -87895, -403669, -60098, 52307, -128515, -155472, 79065, -71196, 30160, 106423, -30909, -191621, 138149, -219147, 86611, 145858, 200911, 70695, 215501, 114003, -151399, -409652, -210700, 12758, 96097, -383917, -46723, -46014, 185810, -324204, -23659, -205869, -119205, 49800, -95864, -142607, 197694, -105179, -135076, 8981, 89345, 42219, 41375, -255393, 207001, -178679, -82130, -365053, -196397, 44164, -62138, 28101, -4369, 227899, -241203, -21175, -328080]
9563c28080a4794A65467J45527c2291C07331i6307k0062B11366I8379b86126j8087
9552c04213a51423G3513a05384j50657L1096B73542I0439M6835b70950a1303p0783
9541h2086b6393B22532c87119C56685a93214N3775k56189F1469b61185B98922
9530c04544a30126B93141a33646c6403C8542a67221A5848b52752J12761J5424
9520a24567j53097A09268m3177a16726B9047a53218A29354a72286l5201j5569
9510b23056G6138g3951j89918K2145Q3453G6516L1439B8259h8495j91903e282
9498b35340B4299a10267j37636a4590j9469k93824a12047d7862k88j41098b3371
9486A03153d56308e0114q999A96374b58260B61429b62374g4259F4804g7286J0310
$$ y = [-328080, -14794, 165467, 310994, -32291, 307331, -96307, -116369, 211366, 98379, -286126, -304213, -151423, 73513, -105384, -256041, -224945, 273542, 90439, 137274, -270950, -11303, -82086, -26393, 222532, -387119, 356685, -193214, -139439, -395628, 61469, -261185, 298922, -304544, -130126, 293141, -133646, -36403, 38542, -167221, 15848, -252752, -139991, -124567, -277664, 109268, 66091, -116726, 29047, -153218, 129354, -172286, -207487, -223056, 76138, -73951, -263869, -241724, -158271, 76516, 107955, 28259, -88495, -280398, -5282, -235340, 24299, -110267, -247903, -14590, -34059, -327883, -112047, -47862, -48150, -189248, -23371, 103153, -456308, -50114, -59113, 196374, -258260, 261429, -262374, -74259, 64804, -77286, -66976]
9475f6976k1543l73195A11541K56783A06896l166b32508B77445i752l55879a48749
9463C8278a20332B5577a2755A94164p4859J47584b9082n5396E8235a26617C8343
9451a52976A15607c28581B56557F7946g8062o2853C876P3805j0453f0554j65554
9440b26108K2631j50114B3624M2448L31969i1050r0957F979Q2111h6033A97174
9428F05317C6894b43370H4728C7100J2149d9604m0234j32385A13820b53900a09754
9416B90606D5747b99303b077G4896c67156B33271a07331D0033c39086A78676C9425
9404a74066F3462J68701b71830a03261C8691L9267b01240m3910i7855F21900a24653
9392f0393D9543M1303J56838C3715d86368K34132j8351A3471J1137a00540a0474
$$ y = [-66976, -88519, -461714, 111541, 368324, 106896, 103730, -232508, 277445, -9752, -365631, -148749, 38278, -120332, 25577, -12755, 194164, 119305, 266889, -29082, -84478, 58235, -126617, 38343, -152976, 115607, -328581, 256557, 67946, -78062, -140915, 3876, 77681, 67228, -60554, -226108, -203477, -353591, 23624, 66072, 398041, -91050, -182007, 6979, 89090, -86033, 197174, 605317, 36894, -243370, 84728, 37100, 49249, -49604, -89838, -222223, 113820, -253900, -109754, 290606, 45747, -299303, -2077, 74896, -367156, 233271, -107331, 40033, -339086, 178676, 39425, -174066, 63462, 232163, -271830, -103261, 38691, 77958, -201240, -245150, -97855, 621900, -124653, -60393, 49543, 90846, 247684, 33715, -486368, -252236, -270587, 13471, 24608, -100540, -10474]
9380b01286A04275J26853d6828G2629c69737J05500A00584d28526J56078a08748
9369I0022h0030j50079b6117C1709a86442A07510i2388J158B0625K52892j20193
9358A53324h7580d963k10805K0978N0608O8710b4681k99094g732l480F9658d95466
9345b75886a05585l54905D6933d3761A20312b22436A20776e5904k62128B14520
9334d6217a2749C6632b62816g5220j24241e5368j84573D2608j3579j1809M6172
9323F3392B6150C431h8168D5905a57963g8902r0628a0380m3624j432d258B8923
9310f9854B76972h1776K2203k29073D0745a81067c4342a2107l05284J09962e9615
9298a08639o0525m3443P7212f1400j67201a10362A07430a79086m1568C03206a00926
$$ y = [-201286, 104275, 231128, -46828, 72629, -369737, -264237, 100584, -428526, -272448, -108748, 90022, -80030, -230109, -26117, 31709, -186442, 107510, -92388, -91230, 20625, 273517, 153324, -87580, -4963, -215768, -194790, -144182, -75472, -24681, -323775, -7732, -11212, 69658, -495466, -275886, -105585, -460490, 46933, -43761, 120312, -222436, 120776, -55904, -318032, 214520, -46217, -12749, 36632, -262816, -75220, -199461, -55368, -239941, 42608, 29029, 17220, 63392, 26150, 3431, -88168, 45905, -157963, -78902, -169530, -10380, -54004, -55436, -4258, 28923, -69854, 276972, -81776, -59573, -288646, 40745, -181067, -34342, -12107, -317391, -207429, -59615, -108639, -169164, -212607, -135395, -61400, -228601, -110362, 107430, -179086, -220654, 303206, -100926]
9286a41371f5213j47067R1035j94777A2142g9499H3396a5953q5791C20105j12667
9275B07438c7947r9996E4585c27683E4092A6447a34656m1551d3917a2736k12213
9264b24949L1246A0813P59a5904B8419d3974B8485O9446b79507a7032l69901J43452
9252b43481H3762K08821B8852j0695f6017i468k98200I6627f2162k49809J50616
9241a61355j7663M2585K6871H0020a78762c8222m02108f2883D6787K1372m248
9230F3911J13292d53026A9646J679c1472k14763A11221a36114F0784L0067b35510
9218h105j7269j33162B26641a77512m2511g6416n9923m4435o2041L3636i8151
9206e5736a5577n6570l5763c7791C9029K2881a32142k41200a32598j84090A0586
$$ y = [-141371, -65213, -212280, -121245, -316022, 12142, -79499, 83396, -15953, -101744, 320105, 207438, -37947, -137943, 54585, -327683, 54092, 16447, -134656, -176207, -43917, -12736, -224949, -193703, 10813, 11572, -15904, 28419, -43974, 28485, 97931, -279507, -17032, -386933, -243481, 83762, 292583, 28852, 18157, -66017, -9468, -307668, 96627, -62162, -311971, -161355, -179018, -136433, -109562, 80020, -178762, -38222, -440330, -62883, 46787, 68159, 63911, 177203, -453026, 19646, 21325, -31472, -246235, 111221, -136114, 60784, 90851, -235510, -8105, -25374, -158536, 226641, -177512, -220023, -76416, -136339, -180774, -242815, -209179, -98151, -55736, -15577, -72147, -107910, -37791, 39029, 61910, -132142, -373342, -132598, -316688, 10586]
9194A51646m3711b38745J08609k49561A33254J8249R3738B9508a2525q953I542
9182b94610B04121b66341J0400a18220B6490d5331I7972c1920I9295i0999b9710
9170b30325j20502a07631L9684o3333r1691e7280o0952A70160J43350a63105A88714
9158a774m6378a031n6419m40100A3788O3133a49905b8753j87960K4873A62994
9146A39035c65478F709J69892h6262k49375h7857k2567B66185j04429J5648R5329
9135B72733a464j04186a8700A17688m0636J15880J8085a50471G5988J37125h1471
9123A16426b33899J06700I8660B8177e6858j61633j19137D4668c5640j22853A80810
9111a68724C2150a45519f1642j74612R5631j7068K5672A78005C6493a35818C9887
$$ y = [151646, 107935, -238745, -130136, -379697, 133254, 151503, 245241, 29508, -12525, -21478, 9542, -294610, 204121, -266341, -255941, -118220, 26490, -45331, 97972, -31920, 99295, -90999, -29710, -230325, -350827, -107631, -67947, -131280, -222971, -57280, -118232, 170160, 313510, -163105, 188714, -1774, -48152, -1031, -57450, -497550, 13788, 76921, -149905, -28753, -216713, -191840, 162994, 139035, -365478, 6709, 176601, -86262, -335637, -87857, -110424, 266185, 161756, 177404, 272733, -1464, -105650, -18700, 117688, 77052, 192932, 211017, -150471, 75988, 213113, -81471, 116426, -233899, -127199, 98660, 28177, -56858, -218491, -337628, 44668, -35640, -158493, 180810, -168724, 32150, -145519, -61642, -236254, -140623, -157691, -132019, 178005, 36493, -135818, 39887]
9099C8882a76730N7769k93499a60684D1627i6211K6298f91j9601k36491K6851
9088b29932A34662l1037M3374b85843f9375A071K35900c07302g035j64054e2851
9076A69652H0078C1817J0337J23124l6253a11232J8042d5393B12705e215A04456
9064a20223d4902C7899r442b05825q0030D6298D415d9155b2679j11736k0413N6864
9052i7964k61747G2590c15268b0259j79868D9427e8863A72993a81581j22225M7389
9041b56417K0632c8973B5622i6672B11747b85440N3920A97393f7278j308K2022
9030d6564o0867A53320i2031l7147j48754J19929C755b83390a00424d6815B65729
9018b2971D2373J8132b09629R3492D0732a17320p4964L258l9182i4252B30162
$$ y = [38882, -176730, -118961, -412460, -160684, 41627, -96211, -69913, -691, -20292, -256783, -229932, 134662, 103625, 146999, -285843, -69375, 1071, 236971, -307302, -7035, -171089, -52851, 169652, 80078, 31817, 42154, 165278, 129025, -111232, -93190, -45393, 212705, -5215, 104456, -120223, -44902, 37899, 28457, -205825, -285855, 46298, 4415, -49155, -22679, -134415, -154828, -97964, -359711, 72590, -315268, -20259, -200127, 49427, -58863, 172993, -181581, -303806, -256417, -235785, -38973, 25622, -96672, 211747, -285440, -231520, 197393, -67278, -68586, -46564, -107431, 153320, -92031, -129178, -277932, -158003, 3755, -283390, -100424, -46815, 265729, -22971, 42373, 60505, -209629, -116137, 40732, -117320, -192284, -189026, -228208, -94252, 230162]
9006A9L7869b67670L9486B580a66813P0092C0624d60766G5015a8199k77906B3767
8993a65062r6056L1767N8849F5735C0808J5791h3442B1918n899P6049c5754n7010
8981i2764H5048C0857K4273a32390O2816j15599k23608A37820a42526e2892E8756
8969a83743q4365b5175k8862n64m5037J5899A0994J95471r9851a29584A52100
8957b29155H1527a06408j0152k18273h6243K3226H2560C9137a21043k6882A68510
8945A06962i1445j36024D0689h5123l4639a6148A92925q0246a49288g093m4492
8934e1585j01073A42660G0367J20992h4473o9761q4471G7248b07188A51382J33080
8923B84462K16997J039894m69004B43116b51447f888C75891j51314a67264A6679
$$ y = [19, 37888, -267670, -228184, 2580, -166813, -96721, 30624, -460766, 75015, -18199, -296105, 23767, -165062, -261118, -229351, -170502, 65735, 30808, 46599, -83442, 21918, 16019, 92068, -35754, -92764, 85048, 30857, 55130, -132390, -69574, -185173, -408781, 137820, -142526, -52892, 58756, -183743, -268108, -25175, -54037, -54601, -99638, -83739, 10994, 206465, 106614, -129584, 152100, -229155, 81527, -106408, -116560, -334833, -86243, -63017, 82560, 39137, -121043, -147925, 168510, 106962, -91445, -227469, 40689, -85123, -119762, -16148, 192925, 112679, -149288, -7093, -51585, -152658, 142660, 70367, 191359, -84473, -154234, -238705, 77248, -207188, 151382, 284462, 501459, 1541353, 1072349, 243116, -251447, -6888, 375891, 224577, -167264, 16679]
8912f2361j1417I1085Q2838K33552A40869a53505c0108A1168a87058A65772C1272
8900a14607A18111a14955N0567A29295F1742D767O1825c19807B60466b7195r0545
8889a17740G224a63424k767K4241c334l24579a57818f1862E1162c73050J47326
8878b25724k975J9199i2541n1671e7712F0714h9222k19567J5042P9550o5170a22106
8865c3613B3527g9744o6694j28051a26559B25851B3144a41392A93466h8547I0757
$$ y = [-62361, -73778, 91085, 173923, 407475, 140869, -153505, -30108, 11168, -187058, 165772, 31272, -114607, 118111, -114955, -64388, 129295, 61742, 4767, 66592, -319807, 260466, -27195, -117740, 7224, -163424, -166191, -141950, -3334, -327913, -157818, -61862, 51162, -373050, -225724, -228699, -209500, -92541, -144212, -57712, 60714, -89222, -308789, -293747, -214197, -279367, -122106, -33613, 23527, -79744, -146438, -274489, -126559, 225851, 23144, -141392, 193466, -88547, 90757]
$$ [...]
##END NTUPLES=NMR SPECTRUM
##END=
