##TITLE=AC1460_TOLI013266_7819265_mAeKoEVHjr
##JCAMPDX= 6.0         $$ Bruker NMR JCAMP-DX V2.0
##DATA TYPE= NMR SPECTRUM
##DATA CLASS= NTUPLES
##ORIGIN= BRUKER
##OWNER= Administrator
$$ 1.72 TOPSPIN		Version 2.1
$$ 2013-04-30 22:07:59.397 -0700  Administrator@X
$$ Compression mode = diff/dup
##.OBSERVE FREQUENCY= 400.02188249412
##.OBSERVE NUCLEUS= ^1H
##.ACQUISITION MODE= SIMULTANEOUS (DQD)
##.ACQUISITION SCHEME= undefined
##.AVERAGES= 64
##.DIGITISER RES= 22
##SPECTROMETER/DATA SYSTEM= spect
##.PULSE SEQUENCE= noesygpps1d.comp
##.SOLVENT NAME= COFFEE_meoh
##.SHIFT REFERENCE= INTERNAL, COFFEE_meoh, 1, 14.96078
##AUDIT TRAIL= $$ (NUMBER, WHEN, WHO, WHERE, PROCESS, VERSION, WHAT)
$$ ##TITLE= Audit trail, TOPSPIN		Version 2.1
$$ ##JCAMPDX= 5.01
$$ ##ORIGIN= Bruker BioSpin GmbH
$$ ##OWNER= Administrator
$$ $$ E:\/data/COFFEE/nmr/AC1460_TOLI013266_7819265_mAeKoEVHjr/12/pdata/1/auditp.txt
$$ ##AUDIT TRAIL=  $$ (NUMBER, WHEN, WHO, WHERE, PROCESS, VERSION, WHAT)
(   1,<2013-04-30 22:07:54.303 -0700>,<Administrator>,<X>,<go>,<TOPSPIN 2.1>,
      <created by zg
	started at 2013-04-30 21:56:24.272 -0700,
	POWCHK enabled, PULCHK disabled,
       configuration hash MD5:
       F7 49 AB AC A2 8D 51 76 73 8D C1 9A A6 38 9F DE
       data hash MD5: 64K
       EE AA EF 51 63 6C A6 24 1D BB AE 44 D7 77 3B AC>)
(   2,<2013-04-30 22:07:57.350 -0700>,<Administrator>,<X>,<proc1d>,<TOPSPIN 2.1>,
      <Start of raw data processing
       efp LB = 0.3 FT_mod = 6 PKNL = 1 PHC0 = 0 PHC1 = 0 SI = 128K 
       data hash MD5: 128K
       19 08 15 9D 15 FE 3A FD 5B 40 AF 0E 17 01 79 B1>)
(   3,<2013-04-30 22:07:58.413 -0700>,<Administrator>,<X>,<proc1d>,<TOPSPIN 2.1>,
      <pk PHC0 = -80.15076 PHC1 = 0 
       data hash MD5: 128K
       5C 61 E2 B0 C2 18 DD E2 B2 29 2D C1 2B 67 8F F2>)
(   4,<2013-04-30 22:07:58.835 -0700>,<Administrator>,<X>,<proc1d>,<TOPSPIN 2.1>,
      <abs ABSG = 1 
       data hash MD5: 128K
       7E 1C 78 D7 39 72 D0 F4 38 17 2D A6 26 C9 60 CE>)
(   5,<2013-04-30 22:07:58.928 -0700>,<Administrator>,<X>,<proc1d>,<TOPSPIN 2.1>,
      <abs ABSG = 2 
       data hash MD5: 128K
       5A 25 64 87 65 3C 0D D4 2F D6 89 D2 6B 94 47 39>)
(   6,<2013-04-30 22:07:59.006 -0700>,<Administrator>,<X>,<proc1d>,<TOPSPIN 2.1>,
      <abs ABSG = 3 
       data hash MD5: 128K
       14 94 9B D5 5C EB C5 A5 A2 51 F9 18 16 3E C9 B4>)
(   7,<2013-04-30 22:07:59.100 -0700>,<Administrator>,<X>,<proc1d>,<TOPSPIN 2.1>,
      <abs ABSG = 4 
       data hash MD5: 128K
       D0 CC 1D 84 0A BD 6E 7C F1 62 EA 00 F9 6E CD 81>)
(   8,<2013-04-30 22:07:59.178 -0700>,<Administrator>,<X>,<proc1d>,<TOPSPIN 2.1>,
      <abs ABSG = 5 
       data hash MD5: 128K
       70 CB 0B F9 D0 69 7D B4 DB 74 A3 53 01 55 74 47>)
$$ ##END=
$$ 
$$ $$ hash MD5
$$ $$ C6 F0 A2 85 68 97 D2 2C 91 EA F8 B9 CE 63 6C B0
##$RELAX= 
##$RELAX= 
##$RELAX= 
##$RELAX= 
##$RELAX= 
##$RELAX= 
##$RELAX= 
##$RELAX= 
$$ Bruker specific parameters
$$ --------------------------
##$DU= <E:\>
##$EXPNO= 12
$$ [...]
##$TP07= 0
##$TPNAME0= <>
##$TPNAME1= <>
##$TPNAME2= <>
##$TPNAME3= <>
##$TPNAME4= <>
##$TPNAME5= <>
##$TPNAME6= <>
##$TPNAME7= <>
##$TPOAL= (0..7)
0.5 0.5 0.5 0.5 0.5 0.5 0.5 0.5
##$TPOFFS= (0..7)
0 0 0 0 0 0 0 0
##$TUNHIN= 0
##$TUNHOUT= 0
##$TUNXOUT= 0
##$USERA1= <user>
##$USERA2= <user>
##$USERA3= <user>
##$USERA4= <user>
##$USERA5= <user>
##$V9= 5
##$VALIST= <valist>
##$VCLIST= <CCCCCCCCCCCCCCC>
##$VD= 0
##$VDLIST= <DDDDDDDDDDDDDDD>
##$VPLIST= <PPPPPPPPPPPPPPP>
##$VTLIST= <TTTTTTTTTTTTTTT>
##$WBST= 1024
##$WBSW= 4
##$XGAIN= (0..3)
0 0 0 0
##$XL= 0
##$YL= 0
##$YMAX_a= 6177037
##$YMIN_a= -12523045
##$ZGOPTNS= <>
##$ZL1= 120
##$ZL2= 120
##$ZL3= 120
##$ZL4= 120
##$ABSF1= 14.96078
##$ABSF2= -5.597402
##$ABSG= 5
##$ABSL= 3
##$ALPHA= 0
##$AQORDER= 0
##$ASSFAC= 0
##$ASSFACI= 0
##$ASSFACX= 0
##$ASSWID= 0
##$AUNMP= <proc_prof1d_extract.lims>
##$AXLEFT= 0
##$AXNAME= <>
##$AXNUC= <1H>
##$AXRIGHT= 0
##$AXTYPE= 0
##$AXUNIT= <>
##$AZFE= 0.1
##$AZFW= 0.1
##$BCFW= 0
##$BC_mod= 0
##$BYTORDP= 0
##$COROFFS= 0
##$CY= 15
##$DATMOD= 1
##$DC= 0
##$DFILT= <>
##$DTYPP= 0
##$F1P= 0
##$F2P= 0
##$FCOR= 0.5
##$FTSIZE= 131072
##$FT_mod= 6
##$GAMMA= 0
##$GB= 0
##$INTBC= 1
##$INTSCL= 1
##$ISEN= 128
##$LB= 0.3
##$LEV0= 0
##$LPBIN= 0
##$MAXI= 10000
##$MC2= 0
##$MEAN= 0
##$ME_mod= 0
##$MI= 0
##$NCOEF= 0
##$NC_proc= -2
##$NLEV= 6
##$NOISF1= 0
##$NOISF2= 0
##$NSP= 0
##$NTH_PI= 0
##$NZP= 0
##$OFFSET= 14.96078
##$PC= 1
##$PHC0= -80.15076
##$PHC1= 0
##$PH_mod= 1
##$PKNL= yes
##$PPARMOD= 0
##$PPDIAG= 0
##$PPIPTYP= 0
##$PPMPNUM= 2147483647
##$PPRESOL= 1
##$PSCAL= 4
##$PSIGN= 0
##$PYNMP= <proc.py>
##$REVERSE= no
##$SF= 400.020009723494
##$SI= 131072
##$SIGF1= 0
##$SIGF2= 0
##$SINO= 400
##$SIOLD= 131072
##$SPECTYP= <>
##$SREGLST= <1H.CDCl3>
##$SSB= 0
##$STSI= 131072
##$STSR= 0
##$SW_p= 8223.68421052631
##$SYMM= 0
##$S_DEV= 0
##$TDeff= 65536
##$TDoff= 0
##$TI= <>
##$TILT= no
##$TM1= 0
##$TM2= 0
##$TOPLEV= 0
##$USERP1= <user>
##$USERP2= <user>
##$USERP3= <user>
##$USERP4= <user>
##$USERP5= <user>
##$WDW= 1
##$XDIM= 131072
##$YMAX_p= 391236193
##$YMIN_p= -44212
##$CURPLOT= <Network HP LaserJet P1505>
##$CURPRIN= <$Network HP LaserJet P1505>
##$DFORMAT= <normdp>
##$LAYOUT= <+/1D_H.xwp>
##$LFORMAT= <normlp>
##$PFORMAT= <normpl>
##$SURQMSG= 1
$$ End of Bruker specific parameters
$$ ---------------------------------
##NTUPLES= NMR SPECTRUM
##VAR_NAME=  FREQUENCY,     SPECTRUM/REAL,   SPECTRUM/IMAG
##SYMBOL=    X,             R,               I
##VAR_TYPE=  INDEPENDENT,   DEPENDENT,       DEPENDENT
##VAR_FORM=  AFFN,          ASDF,            ASDF
##VAR_DIM=   131072,        131072,          131072
##UNITS=     HZ,            ARBITRARY UNITS, ARBITRARY UNITS
##FACTOR=    0.0627417313425164, 1,          1
##FIRST=     8223.62146879497, 3756,         -59049
##LAST=      0,             6039,            -58790
##MIN=       0,             -44212,          0
##MAX=       8223.62146879497, 391236193,    0
$$ Real data points
##PAGE= N=1
##DATA TABLE= (X++(R..R)), XYDATA
$$ [...]
61732D59786q10k61k59n30l70M29J241J494J405J509J842K083K153K190K173K107
$$ 459786 458976 458715 458456 457926 457556 457985 459226 460720 462125 463634 465476 467559 469712 471902 474075 476182
61716D76182K368L186L948L739K592J524J032M44q79k333k895k682k797l711m647
$$ 476182 478550 481736 485684 489423 492015 493539 494571 495015 494136 491803 488908 486226 483429 479718 475071
61701D75071m831m503m238l945l222k428k423l308m106m039l437l028k976l049
$$ 475071 470240 465737 461499 457554 454332 451904 449481 446173 442067 438028 434591 431563 428587 425538
61687D25538l222l422l152k199j381j717k910l625l337k882k989l225k912k236
$$ 425538 422316 418894 415742 413543 412162 410445 407535 403910 400573 397691 394702 391477 388565 386329
61673C86329j765j496j108o16k22J10L45J30n49r69n92M4J18k35k53K30P69J265
$$ 386329 384564 383068 381960 381344 381122 381232 381577 381707 381158 380189 379597 379641 379759 379524 379271 379501 380270 381535
61655C81535K003K858L353L458L499L339K588J602J298J827K302K193K017K306
$$ 381535 383538 386396 389749 393207 396706 400045 402633 404235 405533 407360 409662 411855 413872 416178
61641D16178K688K513J786R66L99L12Q04J468J527P38k96j036j698k575l333l478
$$ 416178 418866 421379 423165 424131 424530 424842 425646 427114 428641 429379 429083 428047 426349 423774 420441 416963
61625D16963l157k857k691k521k451k641k812k515j784j079o63m23k82l71q59
$$ 416963 413806 410949 408258 405737 403286 400645 397833 395318 393534 392455 391792 391369 391087 390716 389857
61610C89857j800l068m290m992n010m661m351m239m306m501m581m241l538k900
$$ 389857 388057 384989 380699 375707 370697 366036 361685 357446 353140 348639 344058 339817 336279 333379
61596C33379k504k094j680j828k820l965m329l821k983k107j181n25o47j451k195
$$ 333379 330875 328781 327101 325273 322453 318488 314159 310338 307355 305248 304067 303542 302895 301444 299249
61581B99249k357k084j625r42p5N19L49n38j581k196k163j675j093n87n9N51J017
$$ 299249 296892 294808 293183 292241 292166 292685 293034 292496 290915 288719 286556 284881 283788 283201 283142 283693 284710
61564B84710J096R49J008J366J585J255N54J50N22J484K383K717K445J807J067
$$ 284710 285806 286755 287763 289129 290714 291969 292523 292673 293195 294679 297062 299779 302224 304031 305098
61549C05098N72O79J261J521P89n13j253r33q2P12J467K252K681K494K090J972
$$ 305098 305670 306349 307610 309131 309920 309407 308154 307221 307139 307851 309318 311570 314251 316745 318835 320807
61533C20807K069K095K092K084J651N46o29j146j243j642k207k076j182o19j135
$$ 320807 322876 324971 327063 329147 330798 331344 330715 329569 328326 326684 324477 322401 321219 320600 319465
61518C19465k056k201j332j72N93Q49Q09O52M29Q5l49o66o89n35l96j24M90J060
$$ 319465 317409 315208 313876 313704 314297 315146 315955 316607 317036 317121 316772 316106 315417 314882 314486 314362 314852 315912
61500C15912P54n89j957k123q96Q37K040K203J412K48m97l83K50P11P55P28R01
$$ 315912 316666 316077 314120 311997 311101 311938 313978 316181 317593 317841 317344 316961 317211 317922 318677 319405 320306
61483C20306J042Q55N73O98J267J724J693J545J898K719L295L058K162J146L78
$$ 320306 321348 322203 322776 323474 324741 326465 328158 329703 331601 334320 337615 340673 342835 343981 344359
61468C44359k8j00J0O1nJJ88L30J97q7k17j02J46M53P88J047J132J091R64O08
$$ 344359 344331 344231 344241 344302 344297 344298 344486 344816 345013 344926 344709 344607 344753 345206 345994 347041 348173 349264 350228 350836
61448C50836m5o72p80l04K31K79j12l05K76J469K444K524J872J169P50N19N16
$$ 350836 350791 350119 349339 349035 349266 349545 349433 349128 349404 350873 353317 355841 357713 358882 359632 360151 360667
61431C60667J001J763J989J256J72l60j93J73M12O02Q48J157J493J687J444P21
$$ 360667 361668 363431 365420 366676 366848 366488 366295 366468 366880 367482 368330 369487 370980 372667 374111 374832
61415C74832r0o06p80o20p4N70P75N38M62O18J98j065k018j638o48m07q34q37
$$ 374832 374742 374136 373356 372736 372662 373232 374007 374545 375007 375625 375823 374758 372740 371102 370454 370047 369213 368376
61397C68376l19j61m20k55K52m6j291j974j127K59Q80R03J104J317R41K73J25
$$ 368376 368057 367896 367476 367221 367473 367427 366136 364162 363035 363294 364174 365077 366181 367498 368439 368712 368837
61380C68837N75J062J361J573J603J431J517K130K605K205J366J217J975K713
$$ 368837 369412 370474 371835 373408 375011 376442 377959 380089 382694 384899 386265 387482 389457 392170
61366C92170K707K178J651J311J144J191J401J630J842K068K249K407K858L847
$$ 392170 394877 397055 398706 400017 401161 402352 403753 405383 407225 409293 411542 413949 416807 420654
61352D20654N102O125O766P203P532P740P857P743O921N148K963J270N16O36J450
$$ 420654 425756 431881 438647 445850 453382 461122 468979 476722 483643 488791 491754 493024 493540 494176 495626
61337D95626K597L386L347K774K129J231k20j622j979j478j537k931m746n575
$$ 495626 498223 501609 504956 507730 509859 511090 510870 509248 507269 505791 504254 501323 496577 491002
61323D91002n087l930k751j886j554j658j640r74K24J451K442L196L675L921M402
$$ 491002 485915 481985 479234 477348 475794 474136 472496 471522 471746 473197 475639 478835 482510 486431 490833
61308D90833N765Q114J0773J2842J3845J3909J3419J2613J1369R441O933M435
$$ 490833 496598 504712 515485 528327 542172 556081 569500 582113 593482 602923 609856 614291
61296F14291K513J107l58k222m093n267n562n502n705o249o844p375p913q238
$$ 614291 616804 617911 617553 615331 611238 605971 600409 594907 589202 582953 576109 568734 560821 552583
61282E52583p896o895n941n513n046l580j214P14J111M18O5Q44K178K945K761
$$ 552583 544687 537792 531851 526338 521292 517712 516498 517212 518323 518741 518806 519650 521828 524773 527534
61267E27534K208J987K133K268K384K952M163N506O413P006P738Q445Q356P136
$$ 527534 529742 531729 533862 536130 538514 541466 545629 551135 557548 564554 572292 580737 589093 596229
61253E96229N446M195L546K998K239J482R69N20k42j369k497l220l446l396l436
$$ 596229 601675 605870 609416 612414 614653 616135 617104 617624 617382 616013 613516 610296 606850 603454 600018
61238F00018l842m546n075m933m212l538l277l092k506j645q89j18J122K711L953
$$ 600018 596176 591630 586555 581622 577410 573872 570595 567503 564997 563352 562463 562345 563467 566178 570131
61223E70131M546M878N173N077M546M347N065O150O656O553O505O607O229N123
$$ 570131 574677 579555 584728 589805 594351 598698 603763 609913 616569 623122 629627 636234 642463 647586
61209F47586L829K832J997J099L72K23P04J547K454L272M104N386P480J0110J2450
$$ 647586 651415 654247 656244 657343 657715 657938 658642 660189 662643 665915 670019 675405 682885 692995 705445
61194G05445J3924J4670J5125J5420J5324J4570J3085J1010Q631O196L853J842
$$ 705445 719369 734039 749164 764584 779908 794478 807563 818573 827204 833400 837253 839095
61182H39095O03L53N52J86j244l186m673n350n736o457p441q042q024q095r075
$$ 839095 839698 840051 840603 840789 839545 836359 831686 826336 820600 814143 806702 798660 790636 782541 773466
61167G73466j0678j1742j1753j1482j1741j2194j2056j1432j1139j1472j1881
$$ 773466 762788 751046 739293 727811 716070 703876 691820 680388 669249 657777 645896
61156F45896j1820j1145r780p755n572l829k458j000L51Q08J99p72j623k696m249
$$ 645896 634076 622931 613151 605396 599824 595995 593537 592537 592888 593696 593895 593123 591500 588804 584555
61141E84555n778o678o977o928o519n789n090m530l689k299p57N55J868L419M815
$$ 584555 578777 572099 565122 558194 551675 545886 540796 536266 532577 530278 529521 530076 531944 535363 540178
61126E40178N640O300P524R371J1271J2850J4124J5144J6061J7321J9232K1409
$$ 540178 545818 552118 559642 569013 580284 593134 607258 622402 638463 655784 675016 696425
61114F96425K3159K4188K4639K4688K4585K4677K4862K4357K2731K0722J9301
$$ 696425 719584 743772 768411 793099 817684 842361 867223 891580 914311 935033 954334
61103I54334J8202J6307J3317J0042P007L816J96l321o200q799j1792j5119j7977
$$ 954334 972536 988843 1002160 1012202 1019209 1023025 1023221 1019900 1013700 1004901 993109 977990 960013
61090I60013j9696k0362k0683k1297k2056k2074k0797j8864j7448j6840j6320
$$ 960013 940317 919955 899272 877975 855919 833845 813048 794184 776736 759896 743576
61079G43576j5364j4240j3271j2208j0763r163p828o781n745m438k725q27N45
$$ 743576 728212 713972 700701 688493 677730 668567 660739 653958 648213 643775 641050 640223 640768
61066F40768Q18M98Q73K516M677O429P727Q920R910J0464J0867J1557J2453J3261
$$ 640768 641586 642084 642957 645473 650150 656579 664306 673226 683136 693600 704467 716024 728477 741738
61052G41738J4118J5344J6792J8051J9132K0392K1964K3676K5453K7255K8897
$$ 741738 755856 771200 787992 806043 825175 845567 867531 891207 916660 943915 972812
61041I72812L0269L1558L2813L3632L3833L4105L5369L7619M0019M1977M3552
$$ 972812 1003081 1034639 1067452 1101084 1134917 1169022 1204391 1242010 1282029 1324006 1367558
61030A367558M5019M6610M8538N0642N2177N2537N2048N1450N1012N0852N1629
$$ 1367558 1412577 1459187 1507725 1558367 1610544 1663081 1715129 1766579 1817591 1868443 1920072
61019A920072N3940N7301O0903O5033P0422P6344Q1059Q4507Q9071R7255J10123
$$ 1920072 1974012 2031313 2092216 2157249 2227671 2304015 2385074 2469581 2558652 2655907 2766030
61008B766030J28580J54527J89812K35728K94919L72848M76472O12499P86785
$$ 2766030 2894610 3049137 3238949 3474677 3769596 4142444 4618916 5231415 6018200
60999F018200J001700J250778J516569J772860J981776K083579K001693J685993
$$ 6018200 7019900 8270678 9787247 11560107 13541883 15625462 17627155 19313148
60991A9313148J172666N98507J36317j01883j10922L8393K53132M36833M83749
$$ 19313148 20485814 21084321 21220638 21118755 21007833 21046226 21299358 21736191 22219940
60982B2219940L01543j28768p14915j291898j714103j923489j947033j848064
$$ 22219940 22521483 22392715 21677800 20385902 18671799 16748310 14801277 12953213
60974A2953213j684411j495867j307136j130739r69835q24081o94172n81080m83858
$$ 12953213 11268802 9772935 8465799 7335060 6365225 5541144 4846972 4265892 3782034
60965C782034m00730l31269k75657k32392j98338j70839j48600j30645j15549
$$ 3782034 3381304 3050035 2774378 2541986 2343648 2172809 2024209 1893564 1778015
60956A778015j01964q9263p7517o7157n8462n1112m4456l8451l3861l1269l0333
$$ 1778015 1676051 1586788 1509271 1442114 1383652 1332540 1288084 1249633 1215772 1184503 1154170
60945A154170l0347l0896l1512l1352l0027k8217k6833k5911k5048k4408k4386
$$ 1154170 1123823 1092927 1061415 1030063 1000036 971819 944986 919075 894027 869619 845233
60934H45233k4574k4007k2392k0410j8764j7587j6702j5793j4390j2348j0334
$$ 845233 820659 796652 774260 753850 735086 717499 700797 685004 670614 658266 647932
60923F47932r223q996q780p985o833n781n023m579m287l723k620j399p09n12k58
$$ 647932 638709 629713 620933 612948 606115 600334 595311 590732 586445 582722 580102 578703 577994 577482 577224
60908E77224J56L18K17M54J321K373L093L354L080K197J137O44O98L14j136l059
$$ 577224 577380 577698 577915 578369 579690 582063 585156 588510 591590 593787 594924 595568 596266 596580 595444 592385
60892E92385m527n359n843o000n817n723o110o694o989p125p571q233q527q304
$$ 592385 587858 582499 576656 570656 564839 559116 553006 546312 539323 532198 524627 516394 507867 499563
60878D99563q103q384q945r176q592p212n620m583m269l987l002j439o1O28O58
$$ 499563 491460 483076 474131 464955 456363 449151 443531 438948 434679 430692 427690 426251 426190 426818 427476
60863D27476K32k74j33J168L089M373M474M124M134M250L688K429J309R96J375
$$ 427476 427708 427434 427301 428469 431558 435931 440405 444529 448663 452913 456601 459030 460339 461335 462710
60848D62710K032K763L427L736L508K935K319J663Q02j91j038j707k480l453m255
$$ 462710 464742 467505 470932 474668 478176 481111 483430 485093 485895 485704 484666 482959 480479 477026 472771
60833D72771m435m011l417k989k753k608k521k440k238j897j671j845k354k730
$$ 472771 468336 464325 460908 457919 455166 452558 450037 447597 445359 443462 441791 439946 437592 434862
60819D34862k650k380k446k837k931k437k064k716m194n294n252m496l836l513
$$ 434862 432212 429832 427386 424549 421618 419181 417117 414401 410207 404913 399661 395165 391329 387816
60805C87816l343l242l174k985k746k827l219l275k583j735j531j857k009j841
$$ 387816 384473 381231 378057 375072 372326 369499 366280 363005 360422 358687 357156 355299 353290 351449
60791C51449j734j679j265n43J4M25J245K494L321L044J891N78k93k85O54J839
$$ 351449 349715 348036 346771 346228 346242 346667 347912 350406 353727 356771 358662 359240 358947 358662 359316 361155
60775C61155K404K414K712L487L929L578L073K927K565J417J95O5R31J577J291
$$ 361155 363559 365973 368685 372172 376101 379679 382752 385679 388244 389661 389856 389921 390852 392429 393720
60760C93720N12m9j93j20j45n31j196j668j700j705k132k674k663k046j355q52
$$ 393720 394232 394183 393990 393870 393725 393194 391998 390330 388630 386925 384793 382119 379456 377410 376055 375203
60744C75203l36K34N33L65j64j004k242l661m709n016m721m170l598l152k867
$$ 375203 374867 375101 375634 375999 375835 374831 372589 368928 364219 359203 354482 350312 346714 343562 340695
60729C40695k633k357k128k010j777j197m78r2j14j04L38J147J894K122J660Q34
$$ 340695 338062 335705 333577 331567 329790 328593 328115 328023 327909 327805 328143 329290 331184 333306 334966 335800
60713C35800K79K60L79J82j10R7R56K005K778L086K881K290J750J667J910K048
$$ 335800 336079 336339 336718 336900 336790 336887 337843 339848 342626 345712 348593 350883 352633 354300 356210 358258
60697C58258J988J977K010J821J472J413J782K101J908J325Q42Q13J231J687J567
$$ 358258 360246 362223 364233 366054 367526 368939 370721 372822 374730 376055 376897 377710 378941 380628 382195
60682C82195P16j52j84M40O69Q5m69j16Q25J355J147P42O25P13O20L2j124k494
$$ 382195 382911 382759 382575 383015 383684 383769 383300 383184 384009 385364 386511 387253 387878 388591 389211 389243 388119 385625
60664C85625l392l448l096l010l180l031k413j876j759j630r88j25K55P4k9L86
$$ 385625 382233 378785 375689 372679 369499 366468 364055 362179 360420 358790 357802 357677 357932 358006 357977 358363
60648C58363J089J701K156K424K194J306K02m80o89q85j286j624j624j315q46
$$ 358363 359452 361153 363309 365733 367927 369233 369435 368955 368266 367381 366095 364471 362847 361532 360686
60633C60686l95l27r19j813k211j851j282r54n41L72J422J864J506P81Q4m23n77
$$ 360686 360291 359964 359045 357232 355021 353170 351888 350934 350393 350765 352187 354051 355557 356338 356422 355999 355422
60616C55422l72k14m66q39p08NP66J148J125P78K52m2K09O01M39k30o33m11j1
$$ 355422 355050 354836 354370 353531 352823 352828 353594 354742 355867 356645 356897 356855 357064 357665 358104 357874 357241 356830 356819
60597C56819L12J012K287L317L188K118J132P60P59Q65J077J218R15J76m88p10
$$ 356819 357131 358143 360430 363747 366935 369053 370185 370945 371704 372569 373646 374864 375779 375955 375467 374757
60581C74757o26m74k27J47M68O65J006J710K622L575M779O331P600P787P189P165
$$ 374757 374131 373657 373430 373577 374045 374710 375716 377426 380048 383623 388402 394733 402333 410120 417309 424474
60565D24474Q515J0477J1741J1933J1415J0175P809M566J480p64k401l842n034
$$ 424474 432989 443466 455207 467140 478555 488730 496539 501105 502585 501821 499420 495578 490544
60552D90544n856o436o662n996m297k277n99R09K615M211N244O091P538R619J1667
$$ 490544 484688 478252 471590 465594 461297 459020 458421 459330 461945 466156 471400 477491 485029 494648 506315
60537E06315J3394J5098J6877J8355J9207J9345J8500J6364J3157R503N748J916
$$ 506315 519709 534807 551684 570039 589246 608591 627091 643455 656612 666115 671863 673779
60525F73779j737m810p292r294j0403j0181r257q884r219r091p838o254n208m393
$$ 673779 672042 667232 659940 650646 640243 630062 620805 611921 602702 593611 585773 579519 574311 569918
60511E69918l211k019j536j619j482p19O26K592N112P780J0541J4119J8919K3985
$$ 569918 566707 564688 563152 561533 560051 559332 559958 562550 567662 575442 585983 600102 619021 643006
60497F43006K8108L1507L5264L9303M2312M3735M4411M4856M4194M1582L7525
$$ 643006 671114 702621 737885 777188 819500 863235 907646 952502 996696 1038278 1075803
60486A075803L2893K7441K0408J2042L398n114j3901k2985l1559l8848m4552m8358
$$ 1075803 1108696 1136137 1156545 1168587 1171985 1166871 1152970 1129985 1098426 1059578 1015026 966668
60474I66668m9826m9125m7157m4596m1398l7570l3717l0343k7261k4281k1788
$$ 966668 916842 867717 820560 775964 734566 696996 663279 632936 605675 581394 559606
60463E59606j9923j7886j5076j2380j1099j0763r555o985m715m161m652m789m467
$$ 559606 539683 521797 506721 494341 483242 472479 462924 455939 451224 447063 442411 437622 433155
60450D33155m398m482m057l256k859k906k616j696p45k65j52k17m17n13k76j33
$$ 433155 428757 424275 420218 416962 414103 411197 408581 406885 406140 405875 405723 405506 405089 404576 404300 404167
60434D04167p68j975k692k407j672j069n31p9k76j323k394k542j815q94p8P63
$$ 404167 403399 401424 398732 396325 394653 393584 393053 392974 392698 391375 388981 386439 384624 383730 383652 384415
60418C84415J612K231K461K225J478M93q0J41P92J299J547J713J748J503J130
$$ 384415 386027 388258 390719 392944 394422 394915 394835 394976 395768 397067 398614 400327 402075 403578 404708
60403D04708R29R64J172J630K329K880K899K559K382K530K726K796K935L331L805
$$ 404708 405637 406601 407773 409403 411732 414612 417511 420070 422452 424982 427708 430504 433439 436770 440575
60388D40575L963L614K948K347K003J848J871K291L097L712L571K976K754L025
$$ 440575 444538 448152 451100 453447 455450 457298 459169 461460 464557 468269 471840 474816 477570 480595
60374D80595L016K293J536J529K013K121J612J020P54O89N76L93K59L21P48J571
$$ 480595 483611 485904 487440 488969 490982 493103 494715 495735 496489 497178 497754 498147 498406 498727 499475 501046
60358E01046K520L250L709M150M863O068P848R937J1719J2652J2679J2075J0992
$$ 501046 503566 506816 510525 514675 519538 525606 533454 543391 555110 567762 580441 592516 603508
60345F03508R343P062M289J261j861m950p662r350r533q564p471o909o601o157
$$ 603508 612851 619913 624202 625463 623602 618652 610990 601640 592107 583543 576072 569163 562562 556405
60331E56405n923o317o810o420n179m117l844m011m261m677n016m562l207j801
$$ 556405 550482 544165 537355 530935 525756 521639 517795 513784 509523 504846 499830 495268 492061 490260
60317D90260r17j71R00K097L326N096P542R765J1010J1778J2886J4205J5170J5852
$$ 490260 489343 489172 490072 492169 495495 500591 508133 517898 528908 540686 553572 567777 582947 598799
60303E98799J6521J6708J5764J3847J1394Q125L707j055m961q136j1665j5590
$$ 598799 615320 632028 647792 661639 673033 681158 684865 683810 678849 670713 659048 643458
60291F43458j8489j9215j8039j5882j3390j0942q769o779m906l646l525m076m234
$$ 643458 624969 605754 587715 571833 558443 547501 538732 531953 527047 523401 519876 515800 511566
60278E11566l720l210l055k884k593k674l240l651l525l317l432l596l556l646
$$ 511566 507846 504636 501581 498697 496104 493430 490190 486539 483014 479697 476265 472669 469113 465467
60264D65467m047m204l661k913k680k734k167p29O85J009J00j178j820j514o90
$$ 465467 461420 457216 453555 450642 447962 445228 443061 442332 443017 444026 444126 442948 441128 439614 438924
60249D38924J98J100K026K692K933L084L400L369K395R41Q4K3j07p65j344j267
$$ 438924 439122 440222 442248 444940 447873 450957 454357 457726 460121 461062 461146 461169 461062 460297 458953 457686
60233D57686q15l98J21Q80J469J590J674K198K847L056K882K711K506K081J817
$$ 457686 456871 456473 456594 457474 458943 460533 462207 464405 467252 470308 473190 475901 478407 480488 482305
60218D82305K293L303M046M368M999O305P502P645P005O819P689Q862R233Q671
$$ 482305 484598 487901 491947 496315 501314 507619 515121 522766 529771 536590 544279 553141 562374 571045
60204E71045P903P423P121O911O982P252P189O559N817N315M677L572K510K065
$$ 571045 578948 586371 593492 600403 607385 614637 621826 628385 634202 639517 644194 647766 650276 652341
60190F52341J778Q04o64j619j802j975k602l337l959m779n727o098n655n185n381
$$ 652341 654119 654923 654259 652640 650838 648863 646261 642924 638965 634186 628459 622361 616706 611521 606140
60175F06140n873n949n589n206m897m499l937l162k156j365j438k170k410j570
$$ 606140 600267 594318 588729 583523 578626 574127 570190 567028 564872 563507 562069 559899 557489 555919
60161E55919n35m25j087j525j308p01N9Q01J035M80k70l87M0L07L16O08J254J658
$$ 555919 555384 554959 553872 552347 551039 550338 550397 551198 552233 552713 552443 552056 552096 552403 552719 553327 554581 556239
60143E56239J647J849K608L331L422L258L708N009O637Q000Q807Q884Q262P431
$$ 556239 557886 559735 562343 565674 569096 572354 576062 581071 587708 595708 604515 613399 621661 629092
60129F29092P012O940O363M702K576J217J005J136Q50M09M99J161J877K436L009
$$ 629092 636104 643044 649407 654109 656685 657902 658907 660043 660893 661302 661801 662962 664839 667275 670284
60114F70284L450L299K539J738J261Q78L71j35o17j370k431l328l747m019m517
$$ 670284 673734 677033 679572 681310 682571 683449 683820 683685 683068 681698 679267 675939 672192 668173 663656
60099F63656n004n013m559m024l608l271k960k551j849r37k72j11j39O4M82Q96
$$ 663656 658652 653639 649080 645056 641448 638177 635217 632666 630817 629880 629608 629497 629358 629422 629904 630800
60083F30800J290J673J817J574J205J003Q76O33L95K31k79j632l658n681p284
$$ 630800 632090 633763 635580 637154 638359 639362 640238 640871 641266 641497 641218 639586 635928 630247 622963
60068F22963q481r261r438r017q319p684p198o800o468o255o186o088n647m810
$$ 622963 614482 605221 595783 586766 578447 570763 563565 556765 550297 544042 537856 531768 526121 521311
60054E21311m013l637l381k629j368j28R67K312L847M855N093N246N747N995N461
$$ 521311 517298 513661 510280 507651 506283 506155 507122 509434 513281 518136 523229 528475 534222 540217 545678
60039E45678M758M725N073M946M327L852L532K776J611Q39Q05Q78K68j184l086
$$ 545678 550436 555161 560234 565180 569507 573359 576891 579667 581278 582117 582922 583800 584068 582884 579798
60024E79798m810n741n818n799o436p478q122q244q389q685q657q197p738p298
$$ 579798 574988 569247 563429 557630 551194 543716 535594 527350 518961 510276 501619 493422 485684 478386
60010D78386o242m430k861k578l400m157l904k577q95K00K89j07j74J34J85j63
$$ 478386 472144 467714 464853 462275 458875 454718 450814 448237 447342 447542 447831 447724 447550 447684 447869 447706
59994D47706k01N15J422J837J989K512L318L731L591L481L794M194M181L757L227
$$ 447706 447505 448020 449442 451279 453268 455780 459098 462829 466420 469901 473695 477889 482070 485827 489054
59979D89054K592J584K03j073j786k058k410l064l627l583k956k266j909j746
$$ 489054 491646 493230 493433 492360 490574 488516 486106 483042 479415 475832 472876 470610 468701 466955
59965D66955j362n69L94J230K052L228M658N486M996L655K663K446K213J271N0
$$ 466955 465593 465024 465418 466648 468700 471928 476586 482072 487068 490723 493386 495832 498045 499316 499366
59950D99366o84r77j357j789j824j558j561j844j750r95k06r0o12j274j827k314
$$ 499366 498682 497705 496348 494559 492735 491177 489616 487772 486022 485027 484821 484731 484119 482845 481018 478704
59934D78704k720k879k702k267j666q02N68K420M176N197N583O042O776P054O288
$$ 478704 475984 473105 470403 468136 466470 465668 466236 468656 472832 478029 483612 489654 496430 503484 509772
59919E09772M948L828K931J751L09q89j614j828j158N97K622L805M245M896N746
$$ 509772 514720 518548 521479 523230 523539 522650 521036 519208 518050 518647 521269 525074 529319 534215 539961
59904E39961N648M268K876K519K578K064J331J289J642J243k4r65p83k2M77P75
$$ 539961 545609 549877 552753 555272 557850 559914 561245 562534 564176 565419 565395 564430 563647 563625 564102 564877
59888E64877J495K835M367N589O308O599O702O930P471Q214Q776Q816Q334P642
$$ 564877 566372 569207 573574 579163 585471 592070 598772 605702 613173 621387 630163 638979 647313 654955
59874F54955P027O414N410L709J446p71k295k990l406m175n176n612n057m058
$$ 654955 661982 668396 673806 677515 678961 678190 675895 672905 669499 665324 660148 654536 649479 645421
59860F45421l435l378l638m166m931n385m864l526k108p96Q83K898M355M735M710
$$ 645421 641986 638608 634970 630804 625873 620488 615624 612098 609990 609194 610077 612975 617330 622065 626775
59845F26775N175N937N985M739K550K78j198j296j91J191J994K207K291K249J492
$$ 626775 631950 637887 643872 648611 651161 651439 650241 648945 648754 649945 651939 654146 656437 658686 660178
59830F60178l56k840m920n723n151l973l234l360l893m199m223m369m844n396
$$ 660178 659822 656982 652062 646339 641188 637215 633981 630621 626728 622529 618306 613937 609093 603697
59816F03697n691n691n658n859o191o138n278l917k959k973l598m045l924l353
$$ 603697 598006 592315 586657 580798 574607 568469 563191 559274 556315 553342 549744 545699 541775 538422
59802E38422k535j633r71r05j341j701j516r74p06j065j697j898j358m70J43K81
$$ 538422 535887 534254 533283 532378 531037 529336 527820 526846 526140 525075 523378 521480 520122 519652 519795 520076
59786E20076K07J84J92J12p8l29n83p29o67m46j91J33O27J144J324J088Q61J110
$$ 520076 520283 520467 520659 520771 520693 520364 519781 519052 518385 517939 517748 517881 518508 519652 520976 522064 522925 524035
59768E24035J817K550K988L157L242L314L313L258L340L758M406M884M921M760
$$ 524035 525852 528402 531390 534547 537789 541103 544416 547674 551014 554772 559178 564062 568983 573743
59754E73743M973N903P338Q677R434R641R756J0064J0251R901R263R047R336R325
$$ 573743 578716 584619 591957 600634 610068 619709 629465 639529 649780 659681 668944 677991 687327 696652
59740F96652Q439P074N821M511K737Q49l76q26j015j131r57o53p87j460k099k254
$$ 696652 705091 712165 717986 722497 725234 726083 725707 724881 723866 722735 721778 721125 720338 718878 716779 714525
59724G14525k024j648j322j443k271l288l656l423l465m082m581m529m432m655
$$ 714525 712501 710853 709531 708088 705817 702529 698873 695450 691985 687903 683322 678793 674361 669706
59710F69706m613l736k586k127k355k441j922j019KJ103K122K750K900K829K889
$$ 669706 665093 661357 658771 656644 654289 651848 649926 648907 648909 650012 652134 654884 657784 660613 663502
59695F63502L300M031M645M595L781K693J775J008K11n81j234j698j879j813j943
$$ 663502 666802 670833 675478 680073 683854 686547 688322 689330 689541 688960 687726 686028 684149 682336 680393
59680F80393k763l960m571m286l970m443n348n811n660n426n497n856o344o597
$$ 680393 677630 673670 669099 664813 660843 656400 651052 645241 639581 634155 628658 622802 616458 609861
59666F09861o073m675l096k042j456r48n80n65n62l4R35J846K627L528M364M641
$$ 609861 603788 599113 596017 593975 592519 591571 590991 590426 589864 589830 590765 592611 595238 598766 603130 607771
59650F07771M425M361M681M803M161K910J566L17j061k798m784o515p451p522
$$ 607771 612196 616557 621238 626041 630202 633112 634678 634995 633934 631136 626352 619837 612386 604864
59636F04864p166o692n951m873l939l656l743l514k876k444k592l002l266l459
$$ 604864 597698 591006 585055 580182 576243 572587 568844 565330 562454 560010 557418 554416 551150 547691
59622E47691l897m604n226n338m847m170l939m296m600m090k786j486q67p91n16
$$ 547691 543794 539190 533964 528626 523779 519609 515670 511374 506774 502684 499898 498412 497545 496754 496238
59607D96238N07K069L328L658L238K686K211J583Q64N05N79N94L71M26J072J780
$$ 496238 496745 498814 502142 505800 509038 511724 513935 515518 516382 516887 517466 518060 518431 518857 519929 521709
59591E21709J959J764J526R97j3q51p80k04j75r45j891k653l286l468k660j288
$$ 521709 523668 525432 526958 527955 527942 527091 526311 526107 525932 524987 523096 520443 517157 513689 511029 509741
59575E09741o78j430k611k962k325j479j135j415j980k281k026j475j074q17m04
$$ 509741 509063 507633 505022 502060 499735 498256 497121 495706 493726 491445 489419 487944 486870 486053 485649
59560D85649O1J34k09m85m67m15m58l16J52O86J124J582J976J956J529J224J413
$$ 485649 485710 485844 485635 485150 484683 484268 483810 483494 483646 484332 485456 487038 489014 490970 492499 493723 495136
59543D95136K029L132N011P405R398J0621J2025J4641J7922J9833J8524J3695
$$ 495136 497165 500297 505308 512713 522111 532732 544757 559398 577320 597153 615677 629372
59531F29372O727l8m581o422o530n891m500k114N98K468L113L083K812K148R98
$$ 629372 636099 636061 631480 625058 618528 612637 608137 606023 606621 609089 612202 615285 618097 620245 621243
59516F21243l28j589k906m288n384o013o487p073p512p508p385p677q227q263
$$ 621243 620915 619326 616420 612132 606748 600735 594248 587175 579663 572155 564770 557093 548866 540603
59502E40603p407o086m876l961l399l352l631l540k694j614r70n56K75J431K168
$$ 540603 533196 527110 522234 518273 514874 511522 507891 504351 501657 500043 499073 498517 498792 500223 502391
59487E02391K309K466K863K977K672K741L660M615M651M193M405N457O357O445
$$ 502391 504700 507166 510029 513006 515678 518419 522079 526694 531345 535538 539943 545400 551757 558202
59473E58202O044N651N237M561L586K421J268M26l7n23j298j890j679r01k89K05
$$ 558202 564246 569897 575134 579695 583281 585702 586970 587396 587359 586836 585538 583648 581969 581068 580779 580984
59457E80984J331L163M775N613O269P362Q471Q897Q814Q892R099Q720P394N480
$$ 580984 582315 585478 590253 595866 602135 609497 617968 626865 635679 644571 653670 662390 669784 675264
59443F75264L432J305j021l556o137q357r636r659q777p666o693n792m974m440
$$ 675264 678696 680001 678980 675424 669287 660930 651294 641635 632858 625192 618499 612707 607733 603293
59429F03293m175l776k939j839p91K85J694L435N232P093R335J1918J4310J6325
$$ 603293 599118 595342 592403 590564 589773 590058 591752 595187 600419 607512 616847 628765 643075 659400
59415F59400J8589K1510K4318K6015K6914K7904K8060K4471J5495L365p434j3921
$$ 659400 677989 699499 723817 749832 776746 804650 832710 857181 872676 876041 868607 854686
59403H54686j5985j4843j1567p049k106K847P526J0809J0707N867k879j2578j9755
$$ 854686 838701 823858 812291 805242 803136 805983 813509 824318 835025 840892 838013 825435 805680
59390H05680k2473k1429j8985j6854j4878j2220r015o121l823j851l93pm87q62
$$ 805680 783207 761778 742793 725939 711061 698841 689826 683705 679882 678031 677638 677631 677144 676282
59376F76282o58k60R3P05J618K286K328J860R07n71j926k136j239m25l05p1J005
$$ 676282 675624 675364 675457 676162 677780 680066 682394 684254 685161 684590 682664 680528 679289 678864 678559 678488 679493
59359F79493K316K972L194L698M459N061N721O926Q403R503J0380J1795J3833
$$ 679493 681809 684781 687975 691673 696132 701193 706914 713840 722243 731746 742126 753921 767754
59346G67754J5651J6593J6802J6673J6348J5884J5354J4598J3242J1165Q663O040
$$ 767754 783405 799998 816800 833473 849821 865705 881059 895657 908899 920064 928727 934767
59334I34767L327L66k879o153q919j0725j1647j2201j2716j3083j3298j3721j4477
$$ 934767 938094 938460 935581 929428 920509 909784 898137 885936 873220 860137 846839 833118 818641
59321H18641j4994j4605j3396j2023j0948j0212r716r281q606p651o910o855p211
$$ 818641 803647 789042 775646 763623 752675 742463 732747 723466 714860 707209 700299 693444 686233
59308F86233p265o758n956m961l480j444P28K734M815P291R888J1863J2582J1681
$$ 686233 678968 672210 666254 661293 657813 656369 657097 659831 664646 671937 681825 693688 706270 717951
59294G17951Q761L504l542j0500j5132j6521j5656j4130j2697j1271r825q535
$$ 717951 726712 730216 726674 716174 701042 684521 668865 654735 642038 630767 620942 612407
59282F12407p169n208k716m78R63J821K544L344M564O716R696J2503J4266J5152
$$ 612407 605238 600030 597314 596836 597799 599620 602164 605508 610072 616788 626484 638987 653253 668405
59268F68405J5746J6027J5563J4387J2933J1310R259O764M157J609r73l520n699
$$ 668405 684151 700178 715741 730128 743061 754371 763630 770394 774551 776160 775187 771667 765968
59255G65968p241q086q260p928p468p144o731n797m295k637j238k74K77O74J322
$$ 765968 758727 750641 742381 734453 726985 719841 713110 707313 703018 700381 699143 698869 699146 699820 701142
59240G01142K352L425M320N418P031Q447Q425O799M828L695L184K319P74r68k532
$$ 701142 703494 706919 711239 716657 723688 732135 740560 747359 752187 755882 759066 761385 762159 761191 758659
59225G58659l991n338o324p025p969r300j0262j0046q935q103q241q882r144q663
$$ 758659 754668 749330 743006 735981 728012 718712 708450 698404 689469 681366 673125 664243 655099 646436
59211F46436p690o656n918n572n302m656l606k585j889j469j390j778k121j406
$$ 646436 638746 632090 626172 620600 615298 610642 607036 604451 602562 601093 599703 597925 595804 594398
59197E94398M13J900J861J004R19J881K823L129L205L329L238L090L629M986O312
$$ 594398 594811 596711 598572 599576 600495 602376 605199 608328 611533 614862 618100 621190 624819 629805 636117
59182F36117O987P323P620P462O554N514N136N366N550N323M793M218L815L551
$$ 636117 643104 650427 658047 665509 672063 677577 682713 688079 693629 698952 703745 707963 711778 715329
59168G15329K999J842N77R5N18J123J476J637J304j50k429m293n281o293p899
$$ 715329 718328 720170 720747 720842 721360 722483 723959 725596 726900 726750 724321 720028 714747 708454 700555
59153G00555r245r504r304r635j0278j0456j0184r875r277q099p057p030p533
$$ 700555 691310 681806 672502 662867 652589 642133 631949 622074 612797 604698 597641 590611 583078
59140E83078p291o116n040m709m806m954n083m888l939k454j156k28P81K022L081
$$ 583078 575787 569671 564631 559922 555116 550162 545079 540191 536252 533798 532642 532414 533195 535217 538298
59125E38298L727M187M594M839N050N605O597P740Q811R651R876R223Q214P814
$$ 538298 542025 546212 550806 555645 560695 566300 572897 580637 589448 599099 608975 618198 626412 634226
59111F34226Q407R495J0289J0242R197P612O399O008N868N226M157L113J945K92
$$ 634226 642633 652128 662417 672659 681856 689468 695867 701875 707743 712969 717126 720239 722184 722476
59097G22476j335j968j605j234j367j500j241j046j401j995k103j535q37p74j622
$$ 722476 721141 719173 717568 716334 714967 713467 712226 711180 709779 707784 705681 704146 703309 702535 700913
59082G00913k836l590l849m475n864p093p172o630o741p500p601o443m946m107
$$ 700913 698077 694487 690638 686163 680299 673206 666034 659404 652663 645163 637562 631119 626173 622066
59068F22066l830l608l470l608l771l631l347l304l588m052m506m619m007k727
$$ 622066 618236 614628 611158 607550 603779 600148 596801 593497 589909 585857 581351 576732 572725 569998
59054E69998j459r59j417k391l123l043k205j267p61n37k37l4l60j077j482j144
$$ 569998 568539 567580 566163 563772 560649 557606 555401 554134 553373 552836 552599 552565 552205 551128 549646 548502
59038E48502l12M88R28R97J009J369J988K273K034K015K931M435N750O989Q971
$$ 548502 548190 548678 549606 550603 551612 552981 554969 557242 559276 561291 564222 568657 574407 581396 590367
59023E90367J1819J4595J6380J7075J7104J6972J6995J6872J5621J2518Q001L186
$$ 590367 602186 616781 633161 650236 667340 684312 701307 718179 733800 746318 754319 757505
59011G57505j204m836p166p805p301o679o285n760m873l622j840L43K023K533
$$ 757505 756301 751465 744299 736494 729193 722514 716229 710469 705596 701974 700134 700477 702500 705033
58997G05033K620L423M561M591L236J721Q10L5q98j403j264j303k160l450m627
$$ 705033 707653 711076 715637 720228 723464 725185 725995 726030 725132 723729 722465 721162 719002 715552 710925
58982G10925n620o167n581l789j691kJ419K699L559M199N453P449R204J0141J0908
$$ 710925 705305 699138 693557 689768 688077 688075 689494 692193 695752 699951 705404 712853 722057 732198 743106
58967G43106J1925J2384J1698J0843J1038J1845J1806J0480Q671O954N081K716
$$ 743106 755031 767415 779113 789956 800994 812839 824645 835125 843796 850750 855831 858547
58955H58547J8k614m837o625q464j0955j3788j5722j6033j5410j4866j4439j3619
$$ 858547 858565 855951 851114 844489 836025 825070 811282 795560 779527 764117 749251 734812 721193
58942G21193j2464j1410j0325q698o576m624l319k619k242j846j098j5Q99J228
$$ 721193 708729 697319 686994 678296 671720 667096 663777 661158 658916 657070 655972 655957 656856 658084
58928F58084J140J064J121J197J223J039L69p29j684k094k237k625l333m053m472
$$ 658084 659224 660288 661409 662606 663829 664868 665237 664508 662824 660730 658493 655868 652535 648482 644010
58913F44010m338l506k202r27J15J141K243L183L981N146P023R274J1211J2360
$$ 644010 639672 636166 633964 633037 633152 634293 636536 639719 643700 648846 655869 665143 676354 688714
58899F88714J2639J2442J2499J3025J3167J2070J0460J0056J1307J2908J3891
$$ 688714 701353 713795 726294 739319 752486 764556 775016 785072 796379 809287 823178
58888H23178J4919J6800J9021K0577K1331K1418K0210J7179J3222R942P790N797
$$ 823178 838097 854897 873918 894495 915826 937244 957454 974633 987855 997797 1005587 1011384
58876A011384L065l41l758o553q445r676j0676j1327j1018r769q616q296q217
$$ 1011384 1014449 1014108 1010350 1003797 995352 985676 975000 963673 952655 942886 934270 925974 917757
58863I17757p502o443n999o301o623o697p124q447j0468j2467j3698j3708j2591
$$ 917757 910255 903812 897813 891512 884889 878192 871068 862621 852153 839686 825988 812280 799689
58850G99689j0899r065p257n852n452o032o707o891p087p951r150r929j0301j0828
$$ 799689 788790 779725 772468 766616 761164 755132 748425 741534 734447 726496 717346 707417 697116 686288
58836F86288j1467j1541j0755r545q387p397o522n700m823l863k964k169j252
$$ 686288 674821 663280 652525 642980 634593 627196 620674 614974 610151 606288 603324 601155 599903
58823E99903j41Q20J308J492J728K064K346K599L010L699M544N127M855L657K336
$$ 599903 599762 600582 601890 603382 605110 607174 609520 612119 615129 618828 623372 628499 633354 637011 639347
58808F39347J721J536R12j32p25p35j090k211l300l718l937m447m808m574m255
$$ 639347 641068 642604 643516 643384 642659 641924 640834 638623 635323 631605 627668 623221 618413 613839 609584
58793F09584m518n163n656n903n786m815l018j394o36j39R22K340L435M139M684
$$ 609584 605066 599903 594247 588344 582558 577743 574725 573331 572695 572556 573478 575818 579253 583392 588076
58778E88076N037N467O709Q602R497Q110N228K515L83j797m104n969p149p672
$$ 588076 593113 598580 605289 613891 623388 631498 636726 639241 639624 637827 633723 627754 620605 612933
58764F12933p342o333n620n755n830m760k956j577p84k7N84N45J81K85Q39J287
$$ 612933 605591 599258 593638 587883 582053 577293 574337 572760 571976 571949 572533 573078 573259 573544 574383 575670
58748E75670J596J951J867R39l9RQ38J507K086L332N084O397O997P228P004O212
$$ 575670 577266 579217 581084 582023 581984 581993 582831 584338 586424 589756 594840 601237 608234 615462 622466 628678
58732F28678N715O388P420P292O191N746O418O931O413N458M769M330M215M852
$$ 628678 634393 640781 648201 655493 661684 667430 673848 680779 687192 692650 697419 701749 705964 710816
58718G10816O029O975P643Q684R954J0374R594Q523P767O823N188L139R76j480
$$ 710816 716845 723820 731463 740147 750101 760475 770069 778592 786359 793182 798370 801509 802485 801005
58704H01005m269p069r854j2858j5711j7626j8581j9360k0249k0719k0502j9938
$$ 801005 796736 789667 779813 766955 751244 733618 715037 695677 675428 654709 634207 614269
58692F14269j9066j7369j4708j1614q679o371n383n954p031p169o254n254m529
$$ 614269 595203 577834 563126 551512 542833 536462 531079 525125 518094 510925 504671 499417 494888
58679D94888l721l083l273l829l490k208j265j023l56J302K954L798M449N625
$$ 494888 491167 488084 484811 480982 477492 475284 474019 472996 472640 473942 476896 480694 485143 490768
58665D90768O995Q132R353J0778J1642J1342J0201Q522N968K601n34k678m323
$$ 490768 497763 505895 515248 526026 537668 549010 559211 567733 573701 576302 575768 573090 568767
58652E68767o063p416p632p014o536o656p132p508p290o130m323k685j647r19
$$ 568767 562704 555288 547656 540642 534106 527450 520318 512810 505520 499390 495067 492382 490735 489816
58638D89816j72N73J389K501L718M477M581M315L787K902J887J062J99r42j744
$$ 489816 489644 490217 491606 494107 497825 502302 506883 511198 514985 517887 519774 520836 521035 520093 518349
58623E18349j479p15o86j365j590j049n45j79R58K916M343M531M420M890N413
$$ 518349 516870 516155 515469 514104 512514 511465 510920 510741 511699 514615 518958 523489 527909 532799 538212
58608E38212N261M690M103L236K012J167J115J177P05P9j71l09p82j382j750j907
$$ 538212 543473 548163 552266 555502 557514 558681 559796 560973 561678 561757 561586 561277 560495 559113 557363 555456
58592E55456j881j506r75p17m11Q81L277N754P589R017J0166J0619J0442J0385
$$ 555456 553575 552069 551094 550377 549966 550847 554124 559878 567467 576484 586650 597269 607711 618096
58578F18096J0535J0022Q635P473P339P674P754P762Q050Q516R321J1100J3832
$$ 618096 628631 638653 647288 654761 662100 669774 677528 685290 693340 701856 711177 722277 736109
58565G36109J6556J8892K1590K4987K8156L0214L1306L1571L0398K7481K3521
$$ 736109 752665 771557 793147 818134 846290 876504 907810 939381 969779 997260 1020781
58554A020781J9118J4158Q761L698p48m991q605j0086r039p258o632p212q215
$$ 1020781 1039899 1054057 1062818 1066516 1065768 1060777 1052172 1042086 1033047 1025789 1019157 1011945 1003730
58541A003730r691j2065j5122j8357k1551k4304k6021k6824k7291k6963k4663
$$ 1003730 994039 981974 966852 948495 926944 902640 876619 849795 822504 795541 770878
58530G70878k0731j7207j5034j2964j0173p896p248p231o465n305m627m054k970
$$ 770878 750147 732940 717906 704942 694769 686873 679625 672394 665929 660624 655997 651943 648973
58517F48973k085k303l128l623l889m214l926k544j038n04m99o4O61R46O85k1
$$ 648973 646888 644585 641457 637834 633945 629731 625805 623261 622223 621719 621220 621156 621817 622763 623448 623427
58501F23427j323k697k859j695q17j095j282l63N68L95J20J040K407K982L381
$$ 623427 622104 619407 616548 614853 614036 612941 611659 611296 611864 612259 612379 613419 615826 618808 622189
58486F22189M714O206O578O650Q184J0921J3132J4433J5867J7690J9147J9989
$$ 622189 626903 633109 639687 646337 654521 665442 678574 693007 708874 726564 745711 765700
58474G65700K0331J9416J6434J2087P687L257j785o703j0051j1734j2714j3187
$$ 765700 786031 805447 821881 833968 841655 844912 843127 836424 826373 814639 801925 788738
58462G88738j2656j1297r558p021l300N95L405N481P892J0423J2180J3322J4310
$$ 788738 776082 764785 755227 748206 744906 745501 748906 754387 762279 772702 784882 798204 812514
58449H12514J4193J1696P448L177p13m903r046j1951j3447j4133j3769j1838r346
$$ 812514 826707 838403 845851 849028 848315 843412 834366 822415 808968 794835 781066 769228 759882
58436G59882p969p675o989n414l768k412q78R01K695M878P768J0513J2254J3657
$$ 759882 751913 744238 737249 731835 728067 725655 724777 725678 728373 733251 741019 751532 763786 777443
58422G77443J5562J6798J5431J1584P061K723j687n630q033r230j0565j2086j2599
$$ 777443 793005 809803 825234 836818 843879 846602 844915 839285 831252 822022 811457 799371 786772
58409G86772j1896j1007j0363r572q810q598q363p113n355m517m508l758j694
$$ 786772 774876 763869 753506 743934 735124 726526 718163 711050 705695 701178 696670 692912 691218
58396F91218M77J627J877J925K343L333M149L445J267k81L46J967K634K447K533
$$ 691218 691695 693322 695199 697124 699467 702800 706949 710394 711661 711380 711726 713693 716327 718774 721307
58381G21307K614J821Q81J174K410L463M497O098P303O939N960O068O914P136
$$ 721307 723921 725742 726623 727797 730207 733670 738167 744265 751568 758507 764467 770535 777449 784585
58367G84585P127Q105R509J0043J0364J1803J3435J3451J2598J2987J4214J3981
$$ 784585 791712 799817 809326 819369 829733 841536 854971 868422 881020 894007 908221 922202
58355I22202J2059J0278Q920O617L575J599Q84m5j216j203j23M56N54J601L395
$$ 922202 934261 944539 953459 960076 963651 965250 966134 966089 964873 963670 963547 964003 964557 966158 969553
58340I69553M302M417N348P119Q412R611J2153J5161J6332J5976J6489J7836J7463
$$ 969553 973855 978272 983620 990739 999151 1008762 1020915 1036076 1052408 1068384 1084873 1102709 1120172
58327A120172J4864J2342J0799Q677N637L516K866K091O91J2K26j9n25M06K489
$$ 1120172 1135036 1147378 1158177 1166854 1172491 1176007 1178873 1180964 1181655 1181667 1181893 1181874 1181349 1181755 1184244
58312A184244L625L802N155P779R358R415R940J1310J1609J0700J0900J2713J3901
$$ 1184244 1187869 1191671 1196826 1204605 1213963 1223378 1233318 1244628 1256237 1266937 1277837 1290550 1304451
58299A304451J3616J3562J4224J3923J2465J1826J2419J2543J2144J3151J5435
$$ 1304451 1318067 1331629 1345853 1359776 1372241 1384067 1396486 1409029 1421173 1434324 1449759
58288A449759J6651J6626J7634J9792K0761K0526K1743K4562K6049K5589K5934
$$ 1449759 1466410 1483036 1500670 1520462 1541223 1561749 1583492 1608054 1634103 1659692 1685626
58277A685626K7987K9492K9866L1193L3489L4194L3376L4062L6482L7549L6979
$$ 1685626 1713613 1743105 1772971 1804164 1837653 1871847 1905223 1939285 1975767 2013316 2050295
58266B050295L8032M1100M2836M2866M4834M9238N1964N1763N2295N4724N5356
$$ 2050295 2088327 2129427 2172263 2215129 2259963 2309201 2361165 2412928 2465223 2519947 2575303
58255B575303N3029N1669N2858N3045N1063N1114N5044N8925O0626O3554O9345
$$ 2575303 2628332 2680001 2732859 2785904 2836967 2888081 2943125 3002050 3062676 3126230 3195575
58244C195575P4210P6350P9654Q6264R2735R7310J03505J12620J20518J25663
$$ 3195575 3269785 3346135 3425789 3512053 3604788 3702098 3805603 3918223 4038741 4164404
58234D164404J32341J42121J50631J56830J66259J80621J93694K02639K13552
$$ 4164404 4296745 4438866 4589497 4746327 4912586 5093207 5286901 5489540 5703092
58225E703092K30404K48557K65066K84970L11059L37918L62879L92164M29402
$$ 5703092 5933496 6182053 6447119 6732089 7043148 7381066 7743945 8136109 8565511
58216H565511M69102N08461N53914O08921O67860P29662Q04024Q96135R99799
$$ 8565511 9034613 9543074 10096988 10705909 11373769 12103431 12907455 13803590 14803389
58207A4803389J114289J252338J422130J618957J845304K120831K461839K873211
$$ 14803389 15917678 17170016 18592146 20211103 22056407 24177238 26639077 29512288
58199B9512288L375518M018594M854934N927592P305076R102391J1444052J4420834
$$ 29512288 32887806 36906400 41761334 47688926 54994002 64096393 75540445 89961279
58191H9961279J8072760K2343882K7012309L1699790L5923273L8959599L9564587
$$ 89961279 108034039 130377921 157390230 189090020 225013293 263972892 303537479
58184C03537479L6117094K7597081J4765038K74381j2680044k2060652k7609387
$$ 303537479 339654573 367251654 382016692 382291073 369611029 347550377 319940990
58177C19940990l0186450l0787157l0082027k8472753k6249240k3655597k0910336
$$ 319940990 289754540 258967383 228885356 200412603 174163363 150507766 129597430
58170A29597430j8206370j5679998j3392882j1362959r598884q094883o820802
$$ 129597430 111391060 95711062 82318180 70955221 61356337 53261454 46440652
58163D6440652n742851m842109m100040l484288k964833k529962k173047j877629
$$ 46440652 40697801 35855692 31755652 28271364 25306531 22776569 20603522 18725893
58155A8725893j627947j420494j252667j112041r87971q82211p97125p24247o54752
$$ 18725893 17097946 15677452 14424785 13312744 12324773 11442562 10645437 9921190 9266438
58146I266438n90873n36890m88544m41045l98316l64616l35256l04817k76744
$$ 9266438 8675565 8138675 7650131 7209086 6810770 6446154 6110898 5806081 5529337
58137E529337k56207k40768k26316k14915k08557k01977j89883j75424j63925
$$ 5529337 5273130 5032362 4806046 4591131 4382574 4180597 3990714 3815290 3651365
58128C651365j54077j42560j31586j24498j18979j11559j04049r9162r4610q7725
$$ 3651365 3497288 3354728 3223142 3098644 2979665 2868106 2764057 2664895 2570285 2482560
58118B482560q1103p7575p4407o8569o2949o1077o0269n6383n1221m8827m8218
$$ 2482560 2401457 2323882 2249475 2180906 2117957 2056880 1996611 1940228 1889007 1840180 1791962
58107A791962m6080m3347m2889m3576m2458m0341l9721l9666l7880l5525l5062
$$ 1791962 1745882 1702535 1659646 1616070 1573612 1533271 1493550 1453884 1416004 1380479 1345417
58096A345417l5422l3948l1014k8549k6157k2777j9872j9026j8573j6426j3921
$$ 1345417 1309995 1276047 1245033 1216484 1190327 1167550 1147678 1128652 1110079 1093653 1079732
58085A079732j3243j3494j2859j2174j2779j3402j2760j2578j4416j6253j5908
$$ 1079732 1066489 1052995 1040136 1027962 1015183 1001781 989021 976443 962027 945774 929866
58074I29866j5039j5973j7350j6901j5832j6274j6901j5403j3067j2543j3031
$$ 929866 914827 898854 881504 864603 848771 832497 815596 800193 787126 774583 761552
58063G61552j2019r978r106q972p623n706n451o657p407p667q692r928r963r470
$$ 761552 749533 739555 730449 721477 713854 708148 702697 696040 688633 680966 672274 662346 652383 642913
58049F42913r862j0218q782o426n352n407m864l799l623m207m389m363m759m608
$$ 642913 633051 622833 614051 607625 602273 596866 592002 588203 584580 580373 575984 571621 566862 562254
58035E62254k967j404j902l588m326m339n261o830p543p554p982q409p842p094
$$ 562254 559287 557883 555981 552393 548067 543728 538467 531637 524094 516540 508558 500149 492307 485213
58021D85213p356p601o224m139l368l644l343k681k951l691l552l086l598m221
$$ 485213 477857 470256 464032 459893 456525 452881 449538 446857 443906 440215 436663 433577 429979 425758
58007D25758l162j047k2k60l03q2n91j254o41P05R78K15m1M04N48N19J082J544
$$ 425758 422596 421549 421527 421267 420964 420882 420291 419037 418396 419101 420079 420294 420253 420657 421205 421724 422806 424350
57989D24350Q93K01J030K263J597n02j478q33l71p90j161j560k994m750m984l979
$$ 424350 425243 425444 426474 428737 430334 429832 428354 427521 427150 426360 425199 423639 420645 415895 410911 406932
57973D06932l798m658m631l171j861j393p60J25o2j278j626l46J086J504J413
$$ 406932 403134 398476 393845 390674 388813 387420 386660 386785 386723 385445 383819 383473 384559 386063 387476
57958C87476J291P72K0j69p7q07k106k572k216k463l347l189j550j07J07J42J094
$$ 387476 388767 389539 389559 389390 389313 388506 386400 383828 381612 379149 375802 372613 371063 370956 371063 371205 372299
57941C72299K614M112N579O600O374N300M837N435O220O897P952Q806P950N411
$$ 372299 374913 379025 384604 391204 397578 402878 407715 413150 419370 426267 434219 443025 450975 456386
57927D56386L047J804N68j653m271o481q327r705r996r279q535q144p536o630
$$ 456386 459433 461237 461805 460152 455881 449400 441073 431368 421372 412093 403558 395414 387878 381248
57913C81248o080n913n416m516l703k675q04J104J540P43M34R74J087M83L62R06
$$ 381248 375168 369255 363839 359323 355620 352945 352141 353245 354785 355528 355962 356936 358023 358506 358868 359774
57897C59774P90j45k52J065K212K222K376L663M797M393L270K958L312L263K698
$$ 359774 360564 360419 360167 361232 363444 365666 368042 371705 376502 380895 384165 387123 390435 393698 396396
57882C96396K195J732R96J67n64j471k550l180l150l092l320l270k673k139k050
$$ 396396 398591 400323 401319 401486 400922 399451 396901 393721 390571 387479 384159 380889 378216 376077 374027
57867C74027j932j530j319j462j405j012q69j001n84N07J241J197J465K907M751
$$ 374027 372095 370565 369246 367784 366379 365367 364498 363497 362913 363420 364661 365858 367323 370230 374981
57852C74981N785N852N383M477L238K237J801J608J370J241J186R03N42N59O18
$$ 374981 380766 386618 392001 396478 399716 401953 403754 405362 406732 407973 409159 410062 410604 411163 411781
57837D11781j29j512k299j953j208n91J51Q53O97l26j063r61p35q13n42L42Q73
$$ 411781 411652 410140 407841 405888 404680 404089 404240 405093 405790 405464 404401 403440 402705 401892 401350 401692 402565
57820D02565L22p28j466j847j907j306l28j18j161k630l777m903o334p647q488
$$ 402565 402887 402159 400693 398846 396939 395633 395305 395187 394026 391396 387619 382716 376382 368735 360247
57805C60247r071r336q754p464o404n888n319m591m317m287l410j704o69r05j178
$$ 360247 351176 341840 333086 325622 319218 313330 308011 303420 299103 294816 291406 289702 289033 288128 286950
57790B86950o27j12l59m81L86J584K285K968M224N445N932O117O470O463N819
$$ 286950 286323 286211 285852 285371 285757 287341 289626 292594 296818 302263 308195 314312 320782 327245 333064
57775C33064N478O054O558N912M621L641K825J748R27P37K77j203k748l025k318
$$ 333064 338542 344596 351154 357066 361687 365328 368153 369901 370828 371565 371842 370639 367891 364866 362548
57760C62548j801j677j492j435j892k360k142j563j306j259j092j162j659j751
$$ 362548 360747 359070 357578 356143 354251 351891 349749 348186 346880 345621 344529 343367 341708 339957
57746C39957q44J48O4p69j313j455j601j494q67m25o89p10N32K182K622J848J168
$$ 339957 339113 339261 339325 338556 337243 335788 334187 332693 331826 331401 330712 330002 330534 332716 335338 337186 338354
57729C38354J074J081J213J941K865L104K790K729K849K450J695J381J384R14
$$ 338354 339428 340509 341722 343663 346528 349632 352422 355151 358000 360450 362145 363526 364910 365824
57715C65824J63J73J019J645J550J270J082N98j51n83p45j400k548l069k277q94
$$ 365824 365987 366160 367179 368824 370374 371644 372726 373324 373173 372590 371845 370445 367897 364828 362551 361657
57699C61657kJ65J9j19j78l02q66k088l588m747n401n722n597m813l681k821k380
$$ 361657 361655 361820 361839 361720 361542 361240 360374 358286 354698 349951 344550 338828 333231 328418 324737 321916 319536
57682C19536k032j594j015L3J855M094O052P607R376J2108J6343K2407L0065L8356
$$ 319536 317504 315910 314895 314928 316783 320877 326929 334536 343912 356020 372363 394770 424835 463191
57668D63191M6230N3176N8663O1152N8176M7649K9399O134j7016l4989m5685n0274
$$ 463191 509421 562597 621260 682412 740588 788237 817636 823770 806754 771765 726080 675806
57656F75806n0765m8254m3663l8519l3894k9454k4668k0151j6794j4342j1938
$$ 675806 625041 576787 533124 494605 460711 431257 406589 386438 369644 355302 343364
57645C43364r444p226n319l768l059l129k804j371Q0K13m38m06L05M39k89r06
$$ 343364 333920 326694 321375 317607 314548 311419 308615 307244 307324 307537 307099 306693 306998 307437 307148 306242
57629C06242r65j034j302j243q18p72j372j967k031j775j495j215j079j354j945
$$ 306242 305277 304243 302941 301698 300880 300108 298736 296769 294738 292963 291468 290253 289174 287820 285875
57614B85875k519k983l303l113k198j039j89M31Q79M77j133k815k988j649k10
$$ 285875 283356 280373 277070 273957 271759 270720 270531 270962 271841 272318 271185 268370 265382 263733 263523
57599B63523M04L97J16m35j101j567j793j803j360o24m51j148j592p89M04M43
$$ 263523 263927 264324 264440 264005 262904 261337 259544 257741 256381 255757 255306 254158 252566 251777 252181 252624
57583B52624n30j002m40K05J29n26j442k346k617j910j014q94j216j076p72j278
$$ 252624 252094 251092 250652 250857 250986 250460 249018 246672 244055 242145 241131 240237 239021 237945 237173 235895
57567B35895k299k527j787j232j370j470j046m64Q8Q03J345J146O57Q76J631J844
$$ 235895 233596 231069 229282 228050 226680 225210 224164 223700 223788 224591 225936 227082 227739 228615 230246 232090
57551B32090J510J717K623L122K831K578K563J781m4j590j719p98L76J586K572
$$ 232090 233600 235317 237940 241062 243893 246471 249034 250815 250771 249181 247462 246664 247040 248626 251198
57536B51198K764K303K143K561K705K144J558J369J015J76m90m58k6N74J534K443
$$ 251198 253962 256265 258408 260969 263674 265818 267376 268745 269760 269936 269446 268988 268962 269536 271070 273513
57520B73513K309J162L77O97J189R23L54K29K95lm87o86n45j47M21N88k18j352
$$ 273513 275822 276984 277361 278058 279247 280170 280524 280753 281048 281045 280558 279872 279327 279180 279601 280189 279971 278619
57502B78619j494p21n43j436k043j534j013j494k140j798r40o33p75p30o78r96
$$ 278619 277125 276404 275861 274425 272382 270848 269835 268341 266201 264403 263463 262830 262055 261325 260647 259651
57486B59651j204q66o62j290k063j890j000l86k10K8K52J7m61o58p54j218j746
$$ 259651 258447 257581 256919 255629 253566 251676 250676 250290 250080 250108 250360 250377 249916 249258 248504 247286 245540
57469B45540j609q65k10O0K21M47O76R36J117Q17j8o88n15L19J194J776J892J269
$$ 245540 243931 243066 242856 242916 243137 243584 244260 245196 246313 247130 247112 246424 245909 246228 247422 249198 251090 252359
57451B52359M7j008j327j118p24j13N92Q74O58N82R14J060O76M27Q69J527J783
$$ 252359 252406 251398 250071 248953 248229 248116 248708 249582 250240 250822 251736 252796 253472 253899 254768 256295 258078
57434B58078J803J817J443N84L4L33Q31Q80R20J390J521N65o32o66L54J121J081
$$ 258078 259881 261698 263141 263725 263759 264092 264923 265803 266723 268113 269634 270199 269567 268901 269255 270376 271457
57417B71457P53M61R9q3L53J067J222P48M42Q33J671K438K683K092Q66j55l88
$$ 271457 272210 272671 272770 272687 273040 274107 275329 276077 276519 277352 279023 281461 284144 286236 287102 286947 286559
57400B86559k51m84j043j297r59k20O46J293J315Q66P79J504K439K815K691K520
$$ 286559 286308 285824 284781 283484 282525 282305 282951 284244 285559 286425 287204 288708 291147 293962 296653 299173
57384B99173K441K528L022L625L431K301J393J465J570N62r61j481p63Q6K99L6
$$ 299173 301614 304142 307164 310789 314220 316521 317914 319379 320949 321511 320550 319069 318306 318392 318691 318727
57368C18727m14q56q77l49L2l71j072j115m59K37P27J156J378J309J467K179K685
$$ 318727 318313 317457 316580 316231 316263 315892 314820 313705 313246 313483 314210 315366 316744 318053 319520 321699 324384
57351C24384K149J105P26R81Q42O9m45j30O09J225J556J543J210R66J177J528
$$ 324384 326533 327638 328364 329345 330187 330256 329811 329681 330290 331515 333071 334614 335824 336790 337967 339495
57335C39495J538J418J645J891J334p8j413j826j224j18O99O59R5P4R16J587J125
$$ 339495 341033 342451 344096 345987 347321 347243 345830 344004 342780 342662 343361 344020 344115 344189 345105 346692 347817
57318C47817N5m81k19M02J240K205K670K236J567J497J803J849J722J698J328
$$ 347817 347872 347391 347172 347574 348814 351019 353689 355925 357492 358989 360792 362641 364363 366061 367389
57303C67389K79n69k31P82J338J512K100K893K977K471K281K447K259J789J768
$$ 367389 367668 367099 366868 367650 368988 370500 372600 375493 378470 380941 383222 385669 387928 389717 391485
57288C91485K114K079J750J790J853R18p77j738j350n01P5N49Q49L62q12j602
$$ 391485 393599 395678 397428 399218 401071 401989 401212 399474 398124 397623 397698 398247 399096 399458 398646 397044
57272C97044j451r42n91j27O47J404K067L032M287N197N446N383N312N192N151
$$ 397044 395593 394651 394060 393933 394580 395984 398051 401083 405370 410567 416013 421396 426708 431900 437051
57257D37051N466O002O397O655O804O358N064L787L549M048M331M458N077N817
$$ 437051 442517 448519 454916 461571 468375 474733 479797 483584 487133 491181 495512 499970 505047 510864
57243E10864N624M581L812L669L602L682M535N678N750M687M034M579N280N143
$$ 510864 516488 521069 524881 528550 532152 535834 540369 546047 551797 556484 560518 565097 570377 575520
57229E75520M682M786N235N142M124K594J429J514K853M209M429L898L813M479
$$ 575520 580202 584988 590223 595365 599489 602083 603512 605026 607879 612088 616517 620415 624228 628707
57215F28707N381O367P462P986P390O597O865P741P837P278P384Q212Q456P824
$$ 628707 634088 640455 647917 655903 663293 669890 676755 684496 692333 699611 706995 715207 723663 731487
57201G31487P447P753P971P953Q460R287R177Q015P279P788Q779R597J0455J1183
$$ 731487 738934 746687 754658 762611 771071 780358 789535 797550 804829 812617 821396 830993 841448 852631
57187H52631J1052J0298J0039J0418J0594J0667J1607J3093J3677J3383J3753
$$ 852631 863683 873981 884020 894438 905032 915699 927306 940399 954076 967459 981212
57176I81212J4916J5210J4308J4156J5711J7272J7230J6332J5963J6169J6502
$$ 981212 996128 1011338 1025646 1039802 1055513 1072785 1090015 1106347 1122310 1138479 1154981
57165A154981J6995J7298J6722J5902J6407J8103J9112J9036J9717K1870K3741
$$ 1154981 1171976 1189274 1205996 1221898 1238305 1256408 1275520 1294556 1314273 1336143 1359884
57154A359884K4279K4887K6620K8285K8919K9624L1256L2714L3292L4326L6700
$$ 1359884 1384163 1409050 1435670 1463955 1492874 1522498 1553754 1586468 1619760 1654086 1690786
57143A690786L9026M0202M1456M3941M6537M8002M9166N0979N2629N3573N5248
$$ 1690786 1729812 1770014 1811470 1855411 1901948 1949950 1999116 2050095 2102724 2156297 2211545
57132B211545N8695O2545O5411O8157P1849P5599P8571Q1864Q6375R1051R5278
$$ 2211545 2270240 2332785 2398196 2466353 2538202 2613801 2692372 2774236 2860611 2951662 3046940
57121C046940J00590J07905J15608J22624J30695J41344J53269J65296J78986
$$ 3046940 3147530 3255435 3371043 3493667 3624362 3765706 3918975 4084271 4263257
57112D263257J95724K14177K33499K56044K83967L16265L52268L94706M45951
$$ 4263257 4458981 4673158 4906657 5162701 5446668 5762933 6115201 6509907 6955858
57103F955858N04760N70549O47629P41748Q56400R96724J173048J396049J672663
$$ 6955858 7460618 8031167 8678796 9420544 10276944 11273668 12446716 13842765 15515428
57094A5515428K011066K424233K922097L503932M162065M884366N644298O395951
$$ 15515428 17526494 19950727 22872824 26376756 30538821 35423187 41067485 47463436
57086D7463436P090135P691435Q173757Q512874Q696340Q716697Q513375P924216
$$ 47463436 54553571 62245006 70418763 78931637 87627977 96344674 104858049 112782265
57078A12782265O752694M934713K641326K00503k081093m026118n570597o707739
$$ 112782265 119534959 124469672 127110998 127311501 125230408 121204290 115633693 108925954
57070A08925954p464990p900164q082620q069420p899368p599563p189709o686573
$$ 108925954 101460964 93560800 85478180 77408760 69509392 61909829 54720120 48033547
57062D8033547o112771n499912m879971m276698l707085l185422k721118k315739
$$ 48033547 41920776 36420864 31540893 27264195 23557110 20371688 17650570 15334831
57054A5334831j966104j668485j417997j207316j029503q80428p56528o52591
$$ 15334831 13368727 11700242 10282245 9074929 8045426 7164998 6408470 5755879
57046E755879n63919m88616m25597l72146l25515k85217k51795k24403k01159
$$ 5755879 5191960 4703344 4277747 3905601 3580086 3294869 3043074 2818671 2617512
57037B617512j80744j62425j45484j29687j15275j01806q7999p3084n6960l8920
$$ 2617512 2436768 2274343 2128859 1999172 1883897 1782091 1694092 1621008 1564048 1525128
57027A525128j7981N014K7233M5724N7148N5708L5411k943m8822q8474j13933
$$ 1525128 1507147 1512161 1539394 1585118 1642266 1697974 1733385 1730442 1681620 1593146 1479213
57016A479213j25125j25749j19730j10402j00063q9532p9049o9348o1016n3565
$$ 1479213 1354088 1228339 1108609 998207 898144 808612 729563 660215 599199 545634
57006E45634m6286l9604l4436l0743k7708k4971k2600k0367j8136j6631j6667
$$ 545634 499348 459744 425308 394565 366857 341886 319286 298919 280783 264152 247485
56995B47485j7683j8054j6875j4657j2239r764o932l723n75K031M130O474R713
$$ 247485 229802 211748 194873 180216 167977 158213 151281 147558 146983 149014 153144 159618 169331
56982A69331J3097J4453J2037O233r46p709j3313j7408j9540j9624j8356j6653
$$ 169331 182428 196881 208918 215151 214205 206496 193183 175775 156235 136611 118255 101602
56970A01602j4882j2864j0466p851n142k246Q12L668O168Q926J2786J7571K1963
$$ 101602 86720 73856 63390 55539 50397 48151 48963 52631 58799 67725 80511 98082 120045
56957A20045K4834K6015K5388K1947J4806M845n479j4006j9908k3114k3763k2489
$$ 120045 144879 170894 196282 218229 233035 237880 232401 218395 198487 175373 151610 129121
56945A29121k0394j8184j5773j3013j0319q096n958l024J111O080J1301J6559
$$ 129121 108727 90543 74770 61757 51438 43342 37384 34360 35471 41551 52852 69411
56933F9411K2013K7766L3438L7941L9611L6688K8158J4725q69j4950k4869l0120
$$ 69411 91424 119190 152628 190569 230180 266868 295026 309751 308882 293932 269063 238943
56921B38943l1730l1031k9125k6883k4704k2432j9904j7427j5349F950d174q710
$$ 238943 207213 176182 147057 120174 95470 73038 53134 35707 20358 6950 -4174 -12884
56909a2884o900n933n281m461l559k763j861n70R73K359L420M384N601P190Q938
$$ -12884 -19784 -25717 -30998 -35459 -39018 -41781 -43642 -44212 -43239 -40880 -37460 -33076 -27475 -20285 -11347
56894a1347h54A0891J2951J4469J6498J9066K2089K5304K8271L0488L1212K9168
$$ -11347 -854 10891 23842 38311 54809 73875 95964 121268 149539 180027 211239 240407
56882B40407K3142J3441K382p181j3839j7843j9889k0347j9489j7684j5133j1920
$$ 240407 263549 276990 279372 272191 258352 240509 220620 200273 180784 163100 147967 136047
56870A36047q350m805j172L162Q582J4898K1839K9469L7844M6545N4746O1366
$$ 136047 127697 122892 121720 124882 133464 148362 170201 199670 237514 284059 338805 400171
56858D00171O4788O2728N3174L6038J4020q376k6966l9425m5412m5893m2547l7264
$$ 400171 464959 527687 580861 616899 630919 622543 595577 556152 510740 464847 422300 385036
56846C85036l1446k5594j9646j3444o617J560J1508K2685L4290M6487O0089P4943
$$ 385036 353590 327996 308350 294906 288289 289849 301357 324042 358332 404819 464908 539851
56834E39851Q9416J01313J08073J05966R1067O2770K5924j1549m3091o5521p8302
$$ 539851 629267 730580 838653 944619 1035686 1098456 1124380 1112831 1069740 1004219 925917
56823I25917q2699q1330p6824p0269o1582n1322m1048l1805k3159j4122m311O171
$$ 925917 843218 761888 685064 614795 553213 501891 460843 429038 405879 391757 387446 393617
56811C93617J7353K9380M2059N4589O5463P2479P3047O4907M7096K1270p677l3342
$$ 393617 410970 440350 482409 536998 602461 674940 747987 812894 859990 881260 873583 840241
56799H40241n1498o2085o7256o8199o4955n8539n1284m4634l8076l0829k3412
$$ 840241 788743 726658 659402 591203 526248 467709 416425 371791 333715 302886 279474
56788B79474j6696j0410l563M116J2060J9711K6770L2806L7081L8544L5690K7116
$$ 279474 262778 252368 248805 252921 264981 284692 311462 344268 381349 419893 455583 482699
56776D82699J3164l200j8020k8967l6000l9895m1040l9819l7133l3948l0618k7103
$$ 482699 495863 492663 474643 445676 409676 369781 328741 288922 251789 217841 187223 160120
56764A60120k3565k0428j7945j6008j4306j2508j0465q463p062o398n858m773
$$ 160120 136555 116127 98182 82174 67868 55360 44895 36432 29370 22972 17114 12341
56752A2341l338k374k206B155A69a350j394j687k061k190j906j168k86J60K3p8
$$ 12341 9003 6629 4423 2155 169 -1350 -2744 -4431 -6492 -8682 -10588 -11756 -12042 -11882 -11859 -11937
56736a1937M03J086J238R23Q18J053J065P32O71J202i85G87J428J164R64O57M77
$$ -11937 -11534 -10448 -9210 -8287 -7469 -6416 -5351 -4619 -3948 -2746 -985 787 2215 3379 4343 5000 5477
56719E477P63J353J798J944J944J835J456P54l4m50j25Q56J922K565K798K826
$$ 5477 6240 7593 9391 11335 13279 15114 16570 17324 17290 16840 16715 17571 19493 22058 24856 27682
56703B7682K593K102J802J940J879R78p4K5J161J788J147K06r4j66o52j151j017
$$ 27682 30275 32377 34179 36119 37998 38976 38902 38927 40088 41876 43023 43229 43135 42969 42317 41166 40149
56686D0149n31k63p0L29N08M4m68j09J049K125K549K263J344J27o82p86p14q98
$$ 40149 39618 39355 39285 39614 40122 40166 39698 39589 40638 42763 45312 47575 48919 49046 48364 47578 46864 45966
56668D5966r04k71N64R07P70M70q2q29j026k22Q54J275J181J136R74L69j44P6
$$ 45966 45062 44791 45355 46262 47032 47502 47420 46591 45565 45343 46197 47472 48653 49789 50763 51132 50988 51064
56650E1064O12P53P52J135J368O22o41j324j441j695j821j036J80N49J15J49Q62
$$ 51064 51676 52429 53181 54316 55684 56306 55665 54341 52900 51205 49384 48348 48528 49077 49192 49341 50203
56633E0203J055K50n20m54Q0P21J648K450K108P58n1M07R42M35m56o37l56m98
$$ 50203 51258 51508 50988 50534 50614 51335 52983 55433 57541 58299 58248 58655 59597 60032 59576 58939 58583 58085
56615E8085r26q42k47N4l00q17q34j56P58J088M81l07k12O51J105P21M51J028
$$ 58085 57159 56317 56070 56124 55824 55007 54173 54017 54775 55863 56344 56037 55825 56476 57581 58302 58753 59781
56597E9781J716J423K97n78n63R3Q30J142P40j47q32r03o23m33l30K0Q29J933
$$ 59781 61497 62920 63217 62639 62076 62169 62999 64141 64881 64734 63902 62999 62376 61943 61613 61633 62462 64395
56579F4395K734K514J284O3k43j4j00k64M69J955K863K739K727L714N050N884
$$ 64395 67129 69643 70927 70990 70747 70733 70633 70369 70838 72793 75656 78395 81122 84836 89886 95770
56563I5770O619P991R630J0678J1284J2355J3962J4894J3779J0203M977k38l739
$$ 95770 102389 110380 120010 130688 141972 154327 168289 183183 196962 207165 212142 211904 208165
56550B08165m818m070k746j890j977k758l403l289k817k842l372l573l127k696
$$ 208165 203347 199277 196531 194641 192664 189906 186503 183214 180397 177555 174183 170610 167483 164787
56536A64787k765l006l070l139l216k802j869j313j691k233j872p12K50M59J61
$$ 164787 162022 159016 155946 152807 149591 146789 144920 143607 141916 139683 137811 137099 137349 137808 137969
56521A37969k14m15l82l98r94k271l581m210m067l549l009k655k573k543k224
$$ 137969 137755 137340 136958 136560 135566 133295 129714 125504 121437 117888 114879 112224 109651 107108 104884
56506A04884j682j338j364j566j885k368k616k075j041n49j008j698j920j720
$$ 104884 103202 101864 100500 98934 97049 94681 92065 89990 88949 88400 87392 85694 83774 82054
56492H2054j226k26J034J646J281Q09J037J557J582J165P60L03l82p99l86M69
$$ 82054 80828 80602 81636 83282 84563 85372 86409 87966 89548 90713 91473 91776 91394 90595 90209 90678
56476I0678R29R13J061J602K021J818J036P6n79n69J5O02P28M64R3k75n50m59
$$ 90678 91607 92520 93581 95183 97204 99022 100058 100134 99555 98986 99001 99603 100331 100795 100888 100613 100063 99604
56458I9604Q6P30J100J218J235J004L38n58j128r11Q4J333K183K545K983L758
$$ 99604 99690 100420 101520 102738 103973 104977 105315 104757 103629 102718 102802 104135 106318 108863 111846 115604
56442A15604M140L278J559K40r8L7P4n8l82r26j315j156q87j231j845j673p09
$$ 115604 119744 123022 124581 124821 124723 124760 124834 124776 124394 123468 122153 120997 120110 118879 117034 115361 114652
56425A14652j79o65j335j410j110o93J30J223J704J389J354K192K836K119N37
$$ 114652 114473 113808 112473 111063 109953 109260 109390 110613 112317 113706 115060 117252 120088 122207 122744
56410A22744n61p77o46m47r2K25J85j12l91n65m68K50J474K429K568K182J820
$$ 122744 122183 121406 120760 120313 120221 120446 120631 120519 120128 119563 119095 119345 120819 123248 125816 127998 129818
56393A29818J773K273L327M150L715K273J242J241J407J077Q24J077J121M16k78
$$ 129818 131591 133864 137191 141341 145056 147329 148571 149812 151219 152296 153120 154197 155318 155734 155456
56378A55456j39M27P16Q97J168Q93k89j340j141j35N33P75J190J634J487Q89N43
$$ 155456 155317 155744 156460 157357 158525 159418 159129 157789 156648 156513 157046 157821 159011 160645 162132 163021 163564
56361A63564N79O46P60J127J506J631J761K024J812P16m15m32N31J332J365R49
$$ 163564 164143 164789 165549 166676 168182 169813 171574 173598 175410 176126 175711 175279 175810 177142 178507 179456
56345A79456M62l9m79o23k52Q23K489L927M125L118K015J617J818K488L714M875
$$ 179456 179918 179879 179400 178777 178525 179348 181837 185764 189889 193007 195022 196639 198457 200945 204659 209534
56329B09534M813L555K547K558K628J904J034Q36R35P69P16J053J025J14r20j309
$$ 209534 214347 217902 220449 223007 225635 227539 228573 229409 230344 231113 231829 232882 233907 234021 233101 231792
56313B31792j437j669j390l79K36k38o43K33J758K802L642M917N948N877N361
$$ 231792 230355 228686 227296 226917 227153 226915 226272 226505 228263 231065 234707 239624 245572 251449 256810
56298B56810N460N713N156M170L679L420K745K211K602L271L284L256M218N550
$$ 256810 262270 267983 273139 277309 280988 284408 287153 289364 291966 295237 298521 301777 305995 311545
56284C11545N942N657N875O541O825P014P938R119R500R420R920J0702J0815J0786
$$ 311545 317487 323144 329019 335560 342385 349399 357337 366456 375956 385376 395296 405998 416813 427599
56270D27599J1915J3827J4909J4936J5279J6605J8326K0156K2353K4608K6407
$$ 427599 439514 453341 468250 483186 498465 515070 533396 553552 575905 600513 626920
56259F26920K8411L1827L6625M1930M7776N4872O2997P1323P9897Q9296R9206
$$ 626920 655331 687158 723783 765713 813489 868361 931358 1002681 1082578 1171874 1271080
56248A271080J08891J18420J27919J36366J42798J47742J51626J52813J49403
$$ 1271080 1379971 1498391 1626310 1762676 1905474 2053216 2204842 2357655 2507058
56239B507058J41974J32142J19360J01828P9936N6177L1973P213j7362l9955n9925
$$ 2507058 2649032 2781174 2900534 3002362 3082298 3138475 3170448 3177661 3160299 3120344 3060419
56228C060419p7811r3324j05516j14639j21596j25918j26706j25069j23062j20630
$$ 3060419 2982608 2889284 2783768 2669129 2547533 2421615 2294909 2169840 2046778 1926148
56218A926148j16269j10307j04592r9247r2790q5420p9026p3841o8234o2100n7272
$$ 1926148 1809879 1699572 1594980 1495733 1402943 1317523 1238497 1164656 1096422 1034322 977050
56207I77050n4065n0531m5808m1307l7741l3962k9587k6073k4144k2630k0699
$$ 977050 922985 872454 826646 785339 747598 713636 684049 657976 633832 611202 590503
56196E90503j8856j7072j4398j1196r253q982q899q308q008p855o516m291l231
$$ 590503 571647 554575 540177 528981 519728 510746 501847 493539 485531 477676 471160 466869 463638
56183D63638l685l663k477j947k851l283j965l11L43Q58K019K763K345J959K527
$$ 463638 459953 456290 453813 451866 449015 445732 443767 443456 443799 444657 446676 449439 451784 453743 456270
56168D56270L136L119L455M598N221M668M450N635O903O856O291O522P324Q131
$$ 456270 459406 462525 465980 470578 475799 480467 484917 490552 497455 504311 510602 517124 524448 532579
56154E32579R446J1522J3321J4280J5508J8012K1333K5037K9813L5989M2837N0362
$$ 532579 542025 553547 566868 581148 596656 614668 636001 661038 690851 726840 769677 820039
56142H20039N9898P1738Q4020R4936J04123J10864J13138J09839J02167R1746
$$ 820039 879937 951675 1035695 1130631 1234754 1345618 1458756 1568595 1670762 1762508
56132A762508P9361O6480N5927M9413M5915M3323M0015L4431K5488J4489M529
$$ 1762508 1841869 1908349 1964276 2013689 2059604 2102927 2142942 2177373 2202861 2217350 2221879
56121B221879k923q995j4690j9876k5645l4748m8227o3820p8701r1568j01292
$$ 2221879 2218956 2209961 2195271 2175395 2149750 2115002 2066775 2002955 1924254 1832686 1731394
56110A731394j06333j06586j03472r7373q7564p5337o4111n5394m7578l9666l3004
$$ 1731394 1625061 1518475 1415003 1317630 1230066 1154729 1090618 1035224 987646 947980 914976
56099I14976k8248k3900j9241j5556j3194j0551p278n126m346k737L16K454K581
$$ 914976 886728 862828 843587 828031 814837 804286 797008 791882 787536 784799 785115 787569 790150
56086G90150K764M181N057M510M576O235P241O233N314O076O866O468O763Q998
$$ 790150 792914 797095 802152 806662 811238 817473 824714 830947 836261 842337 849203 855671 862434 871432
56072H71432J1053J1197J1043J2007J2438J1157J0324J1719J3524J3810J3846
$$ 871432 882485 893682 904725 916732 929170 940327 950651 962370 975894 989704 1003550
56061A003550J5003J5795J5028J4470J5351J5681J4059J2600J2997J3305J1885
$$ 1003550 1018553 1034348 1049376 1063846 1079197 1094878 1108937 1121537 1134534 1147839 1159724
56050A159724J0827J2055J3657J3612J3564J5362J7336J7640J7841J9644K1531
$$ 1159724 1170551 1182606 1196263 1209875 1223439 1238801 1256137 1273777 1291618 1311262 1332793
56039A332793K2087K3143K6113K8898K9761L0483L2300L2966L1383L0721L3120
$$ 1332793 1354880 1378023 1404136 1433034 1462795 1493278 1525578 1558544 1589927 1620648 1653768
56028A653768L5687L5731L5387L6855L7875L6381L4981L6155L7729L7757L8985
$$ 1653768 1689455 1725186 1760573 1797428 1835303 1871684 1906665 1942820 1980549 2018306 2057291
56017B057291M3436M7656M8502M8765N1730N5281N6896N9196O4626O9881P1633
$$ 2057291 2100727 2148383 2196885 2245650 2297380 2352661 2409557 2468753 2533379 2603260 2674893
56006B674893P2736P6590Q0760Q2439Q4751R1021R8242J02915J07782J15961J24303
$$ 2674893 2747629 2824219 2904979 2987418 3072169 3163190 3261432 3364347 3472129 3588090 3712393
55995C712393J29579J35147J44318J53527J59607J66869J79084J91716K00653
$$ 3712393 3841972 3977119 4121437 4274964 4434571 4601440 4780524 4972240 5172893
55986E172893K10972K27966K47362K64165K82955L09006L37562L63029L90385
$$ 5172893 5383865 5611831 5859193 6123358 6406313 6715319 7052881 7415910 7806295
55977G806295M25837M65013N02664N44751N98069O57576P17946P87327Q74969
$$ 7806295 8232132 8697145 9199809 9744560 10342629 11000205 11718151 12505478 13380447
55968A3380447R76256J085932J214488J374556J564084J782138K048054K384975
$$ 13380447 14356703 15442635 16657123 18031679 19595763 21377901 23425955 25810930
55960B5810930K800367L306954L948147M779020N842755P198692Q957979J1257494
$$ 25810930 28611297 31918251 35866398 40645418 46488173 53686865 62644844 73902338
55952G3902338J4205167J7854859K2171942K6961058L1852194L6362760L9813484
$$ 73902338 88107505 105962364 128134306 155095364 186947558 223310318 263123802
55945B63123802M1024010L8292133L0238821J7137739J419688j3413630k4630847
$$ 263123802 304147812 342439945 372678766 389816505 391236193 377822563 353191716
55938C53191716l1313954l4035974l3933508l2082799k9324920k6237378k3133067
$$ 353191716 321877762 287841788 253908280 221825481 192500561 166263183 143130116
55931A43130116k0148557j7367180j4854825j2631934j0683887r001406p578937
$$ 143130116 122981559 105614379 90759554 78127620 67443733 58442327 50863390
55924E0863390o387525n385284m547654l861007l297514k823261k423006k093680
$$ 50863390 44475865 39090581 34542927 30681920 27384406 24561145 22138139 20044459
55916B0044459j821573j587336j385603j219139j080244r56263q46713p57296
$$ 20044459 18222886 16635550 15249947 14030808 12950564 11994301 11147588 10390292
55908A0390292o83169o14560n52856n05017m67443m30575l94551l65767l42463
$$ 10390292 9707123 9092563 8539707 8034690 7567247 7136672 6742121 6376354 6033891
55899F033891l17586k91974k71446k54533k35471k15912k01645j90999j77872
$$ 6033891 5716305 5424331 5152885 4898352 4662881 4446969 4245324 4054325 3876453
55890C876453j63114j51925j43112j31636j18927j10147j03949r5066q4628p7998
$$ 3876453 3713339 3561414 3418302 3286666 3167739 3057592 2953643 2858577 2773949 2695951
55880B695951p4820p0798o7093o8244p2569p3977p1962p0979p1363o9496o5813
$$ 2695951 2621131 2550333 2483240 2414996 2342427 2268450 2196488 2125509 2054146 1984650 1918837
55869A918837o4182o4125o1623n6891n3828n2499m9457m4772m1751m0447l8070
$$ 1918837 1854655 1790530 1728907 1672016 1618188 1565689 1516232 1471460 1429709 1389262 1351192
55858A351192l5062l4155l4334l2229k8600k6991k6888k4664k0601j8604j9407
$$ 1351192 1316130 1281975 1247641 1215412 1186812 1159821 1132933 1108269 1087668 1069064 1049657
55847A049657k0187k0395k1954k4041k3625k1049j9578j9679j8951j7283j6763
$$ 1049657 1029470 1009075 987121 963080 939455 918406 898828 879149 860198 842915 826152
55836H26152j7032j5918j4104j4021j4721j3199j0192r262j0571j0933r740r462
$$ 826152 809120 793202 779098 765077 750356 737157 726965 717703 707132 696199 686459 676997
55824F76997j0375j0139q778q923j0787j1756j1252j1340j2243j1862j0012q798
$$ 676997 666622 656483 647705 638782 627995 616239 604987 593647 581404 569542 559530 550732
55812E50732q490p296n317m423m266k669PJ296J405L059O438Q784R345J0232J1893
$$ 550732 542242 534946 529629 525206 520940 518271 518278 519574 520979 524038 530476 539260 548605 558837 570730
55797E70730J2171J0514Q861P632M954P05k709m510o650r810j1977j2005j1167
$$ 570730 582901 593415 602276 609908 614862 615567 612858 608348 601698 591888 579911 567906 556739
55784E56739j0278q701p011p280r710j1996j2781j2834j2329j0075o100k023J660
$$ 556739 546461 537760 530749 523469 513759 501763 488982 476148 463819 453744 447644 445621 447281
55771D47281N922J0449J3485J4504J4055J1061L857n749j3100j6103j6880j7483
$$ 447281 453203 463652 477137 491641 505696 516757 520614 514865 501765 485662 468782 451299
55759D51299j7456j6351j5205j4337j2670j0222q597q160p467o170n646o100n939
$$ 451299 433843 417492 402287 387950 375280 365058 356461 348301 340834 334664 329018 322918 316979
55746C16979m771m134m517m480l493k848k948k460j056k12m92o92m97j218l007
$$ 316979 312208 308074 303557 299077 295584 292736 289788 287328 286272 286060 285568 284876 284379 283161 280154
55731B80154m073l640l113l385l608l478m071n410n782m603l486l401l161j854
$$ 280154 276081 272441 269328 265943 262335 258857 254786 249376 243594 238991 235505 232104 228943 227089
55717B27089n05p8J03Q43J845K789L957N150N821O371P349P443M825N31k298k806
$$ 227089 226584 226506 226609 227452 229297 232086 236043 241193 247014 253385 260734 268177 273002 273533 271235 268429
55701B68429l124m385n331n537o524q470r123p474n601n185m969l454j503m98
$$ 268429 265305 260920 255589 250052 243528 235058 225935 218461 212860 207675 202706 199252 197749 197251
55687A97251j29K76K90j45J49J574K803L124L658M955N647M776L340K180O35j370
$$ 197251 197122 197398 197688 197543 197692 199266 202069 205193 208851 213806 219453 224229 227569 229749 230384 229014
55671B29014k268j502r18j785k674k107j138j266j755j162J12Q70J225J792K148
$$ 229014 226746 225244 224326 222541 219867 217760 216622 215356 213601 212439 212551 213421 214646 216438 218586
55656B18586J921J965K849L532L139K562K680K570J257j81k41N22N13m68j594
$$ 218586 220507 222472 225321 228853 231992 234554 237234 239804 241061 240880 240639 241161 241674 241206 239612
55641B39612k748m206n452o010o526p579q294p654o356n799n967n764m792l574
$$ 239612 236864 232658 227206 221196 214670 207091 198797 191143 184787 178988 173021 167257 162465 158891
55627A58891k525j773j436j270p92k63n88j655k171j762j613k137j926k80J063
$$ 158891 156366 154593 153157 151887 151095 150832 150244 148589 146418 144656 143043 140906 138980 138700 139763
55612A39763M07j280k059j936k195k862k926k323j857j636j181o87p34j112j170
$$ 139763 140170 138890 136831 134895 132700 129838 126912 124589 122732 121096 119915 119228 118494 117382 116212
55597A16212r65r87j173j187j131j094p02R4M67j07q91r87n88l14j11K98O95R25
$$ 116212 115247 114260 113087 111900 110769 109675 108973 109067 109534 109427 108536 107549 106961 106647 106536 106834 107529 108454
55579A08454J296J730J616J164J674L533N231N437M809M611M787M696M578M875
$$ 108454 109750 111480 113096 114260 115934 119467 124698 130135 134944 139555 144342 149038 153616 158491
55565A58491N010M217K768J260m45k419l857m279m530n384o122n785m844m327
$$ 158491 163501 167718 170486 171746 171301 168882 165025 160746 156216 150832 144710 138925 134081 129754
55551A29754m187l846l438l257k851k014j595k043k158q31R42J464R04P84J524
$$ 129754 125567 121721 118283 115026 112175 110161 108566 106523 104365 103534 104476 105940 106844 107628 109152
55536A09152K194K237J937J480Q92N83P54P40K1p75r21r48j655k611k944k834
$$ 109152 111346 113583 115520 117000 117892 118475 119229 119969 119990 119215 118294 117346 115691 113080 110136 107302
55520A07302k888k775j976j150j234j790j806j528j887k717l118l101l217l046
$$ 107302 104414 101639 99663 98513 97279 95489 93683 92155 90268 87551 84433 81332 78115 75069
55506G5069j834k85Q2p64j429j420j614k328k580j714l81N53R90J153J160J296
$$ 75069 73235 72950 73032 72268 70839 69419 67805 65477 62897 61183 60802 61355 62345 63498 64658 65954
55490F5954J871K569K706K182J597J380J471J671J771J516R72O22N74K86l54m66
$$ 65954 67825 70394 73100 75282 76879 78259 79730 81401 83172 84688 85660 86282 86856 87142 86788 86322
55474H6322M66J524J583R27N59N24J97m28r09j342j965k210j446k11M14K86m9
$$ 86322 86788 88312 89895 90822 91381 91905 92102 91674 90765 89423 87458 85248 83802 83591 84005 84291 84242
55457H4242n30j268j595p93N72J316J263R99N06n79j723j967j421r27n56J73Q89
$$ 84242 83712 82444 80849 80056 80628 81944 83207 84206 84712 84133 82410 80443 79022 78095 77539 77712 78601
55440G8601P09j45n73l44j99k80O3Q19J106O60K48L70O27O52N51L53p9m59l54
$$ 78601 79310 79165 78592 78248 78049 77769 77832 78651 79757 80417 80665 81035 81662 82314 82865 83218 83139 82680 82326
55421H2326lj8m25q40j266j737j594l45J148J642J347J333J508Q54m71j072n51
$$ 82326 82323 82305 81880 81040 79774 78037 76443 76098 77246 78888 80235 81568 83076 83930 83459 82387 81836
55404H1836r2m20p61l85K16L34J05k8l7J7J75K30q1m14k31J35j10p56p35J43Q15
$$ 81836 81744 81324 80563 80178 80394 80728 80833 80805 80768 80785 80960 81190 81109 80695 80464 80599 80489 79733 78998 79141 79956
55383G9956O16R8j02j23j68J5M48O32K91k67p91j310j687j736j811k352k863k483
$$ 79956 80572 80670 80568 80445 80277 80292 80740 81372 81663 81396 80605 79295 77608 75872 74061 71709 68846 66363
55365F6363j505j133j562j542k35J656K977L297K708J512M52K65O69P44M59P01
$$ 66363 64858 63725 62163 60621 60386 62042 65019 68316 71024 72536 72988 73253 73922 74666 75125 75826
55349G5826J562J926J211K48j61l86r27j333r69r7O19R69R40L88m06n34M03J510
$$ 75826 77388 79314 80525 80773 80612 80226 79299 77966 76997 76900 77519 78488 79428 79816 79410 78876 79279 80789
55331H0789J593N62o62j238j022m26r4l62q66r93o57k33J91P80J256J070L58j47
$$ 80789 82382 82944 82282 81044 80022 79596 79502 79140 78274 77281 76624 76391 76582 77362 78618 79688 80046 79899
55313G9899k59n20j046j123l48O38Q93J74j084k167k354j487l38J73O7n2j85p58
$$ 79899 79640 79120 78074 76951 76603 77241 78134 78308 77224 75057 72703 71216 70878 71051 71118 71066 70881 70123
55295G0123j377j074J01R55R16P32R95J190P41j6n14p11o64j87M95O30k2p83j062
$$ 70123 68746 67672 67773 68728 69644 70376 71371 72561 73302 73286 72772 72061 71397 71210 71705 72335 72313 71530 70468
55276G0468r94p39j06O82Q73L59N4N10J056R21L62O2J21L00N47P17M85N8J78R21
$$ 70468 69474 68735 68629 69311 70184 70543 70597 71107 72163 73084 73446 73508 73629 73929 74476 75193 75678 75736 75914 76835
55256G6835J345Q94K71K51M98L71K3j22k74p32j054p48k57l31p70p75k52R9p8
$$ 76835 78180 79074 79345 79596 80094 80465 80488 80366 80092 79360 78306 77558 77301 76970 76200 75425 75173 75272 75194
55237G5194l46k35J11K24p0m39l98O7L57Q8j99K45J081J137J01r00q39j0O73Q93
$$ 75194 74848 74613 74724 74948 74878 74439 74041 74108 74465 74553 74354 74599 75680 76817 76918 76018 75179 75169 75842 76735
55217G6735R32R71R75Q51M50k28o91m22K25L26k90q11p63o10p28p79n45m63p30
$$ 76735 77667 78638 79613 80464 80914 80686 79995 79573 79798 80124 79834 79023 78260 77650 76922 76143 75598 75135 74405
55198G4405p28l2P63R07N69L98N84R23J240J271O83k96q72p27l65j36K68Q90J016
$$ 74405 73677 73645 74408 75315 75884 76282 76866 77789 79029 80300 80983 80687 79815 79088 78723 78587 78855 79745 80761
55179H0761K74n72o90k77N5K29L52J97j95j06Q07J687J564O94Rj94j85nL51M11
$$ 80761 81035 80463 79773 79496 79551 79780 80132 80329 80134 80028 80835 82522 84086 84780 84789 84595 84410 84405 84756 85167
55159H5167k19j069j366j075p31n70m59l60k63LL88N15M06O85J486J856R71o18
$$ 85167 84948 83879 82513 81438 80707 80137 79678 79318 79055 79058 79446 79961 80367 81052 82538 84394 85365 84747
55141H4747j657j624q47J89R41Q93K64%L60K80r62k285k226j080k96k29N0R25
$$ 84747 83090 81466 80619 80808 81749 82642 82906 82906 83266 83546 82584 80299 78073 76993 76697 76468 76518 77443
55123G7443J618J582J240J108J103J016Q90P33M08o9n75j161j760j830r51L83
$$ 77443 79061 80643 81883 82991 84094 85110 86000 86733 87141 87072 86497 85336 83576 81746 80795 81178
55107H1178J157J011M28k1j12J89O48P48K94j94j54K31N72J017J769K231J663
$$ 81178 82335 83346 83774 83753 83641 83830 84478 85226 85520 85326 85172 85403 85975 86992 88761 90992 92655
55090I2655M30l57l27pL24Q83J394J035l01j519j657j030n87o37o90l45J89M51
$$ 92655 93085 92728 92401 92394 92718 93601 94995 96030 95729 94210 92553 91523 90936 90299 89609 89264 89453 89904
55072H9904L82M27R30J574J749J408J062Q22J52j068j930j591m94J66j19q46j279
$$ 89904 90286 90713 91643 93217 94966 96374 97436 98258 98410 97342 95412 93821 93327 93493 93374 92528 91249
55055I1249r83M4J231J652J013R0l06l61o94j186j245q81o76p95q05m18J58N93
$$ 91249 90266 90310 91541 93193 94206 94296 93990 93629 92935 91749 90504 89623 88947 88152 87347 86929 87087 87680
55037H7680O74L76M1K35Q97J120M02m53m34K13N10K86J31J22j92n85k19R02J523
$$ 87680 88354 88730 88771 89006 89903 91023 91425 90972 90538 90751 91261 91547 91678 91800 91608 91023 90804 91706 93229
55018I3229O72j082k332k219j004L05P28J61n08m45J24M33M28P42J547K193K127
$$ 93229 93901 92819 90487 88268 87264 87569 88297 88458 87950 87505 87629 88062 88490 89232 90779 92972 95099
55001I5099J493O96kl78k56J96O15R08J218J453J310P40k8q60j650k021j598o04
$$ 95099 96592 97288 97286 96908 96652 96848 97463 98371 99589 101042 102352 103092 103064 102204 100554 98533 96935 96331
54983I6331L03P84J019J232J371J260P55j07q77r29j95N67O90M06L52N76N98J80
$$ 96331 96634 97418 98437 99669 101040 102300 103055 102948 102071 101142 100947 101514 102204 102610 102962 103538 104136 104316
54965A04316m13p21l56O55J520J235j07j193j145n77m40o66p33p39q97p18J32
$$ 104316 103903 103182 102826 103481 105001 106236 106129 104936 103791 103214 102774 102108 101375 100636 99739 99021 99153
54948I9153Q40M67m66o77pO37Q09P62M68k33p21j93R33J463J182Q66P49L74p8
$$ 99153 99993 100460 99994 99317 99310 99947 100756 101518 101986 101753 101032 100839 101772 103235 104417 105283 106032 106406 106328
54929A06328J31Q36J056Q09J245K664L854L968L728M106N004N844O459O701O200
$$ 106328 106459 107295 108351 109160 110405 113069 116923 120891 124619 128725 133729 139573 146032 152733 158933
54914A58933N046L913K999J714j85k151l861n619p264p805o869n515m867m728
$$ 158933 163979 167892 170891 172605 172420 170269 166408 160789 153525 145720 138851 133336 128469 123741
54900A23741m240l224k130j235n40l1L70O70M93m29j349j066L57J408J115J81
$$ 123741 119501 116277 114147 112912 112372 112341 112711 113381 113874 113445 112096 111030 111387 112795 113910 114091
54884A14091k50L9Q10K055L471M146L714L129L506M741N915O470O370N687M650
$$ 114091 113841 113880 114690 116745 120216 124362 128076 131205 134711 139452 145367 151837 158207 163894 168544
54869A68544L539K159Jk584m326m675m599n094n794n882n475n196n037m644m062
$$ 168544 172083 174242 174243 171659 167333 162658 158059 152965 147171 141289 135814 130618 125581 120937 116875
54854A16875l374k234o62L55M2r62j582j856k394k843k276q46K15K49k76q36j420
$$ 116875 113501 111267 110605 110960 111002 110040 108458 106602 104208 101365 99089 98243 98458 98707 98431 97595 96175
54837I6175j899j859j339r06p35l11O37J627K054J867J320N95p6l08RM15L19l56
$$ 96175 94276 92417 91078 90172 89437 89126 89763 91390 93444 95311 96631 97226 97150 96842 96851 97266 97585 97229
54819I7229j077j263q02o4N42R37J152J063O44L34O48J343J579J109O68Q79J334
$$ 97229 96152 94889 94087 94023 94565 95502 96654 97717 98361 98695 99343 100686 102265 103374 104042 104921 106255
54802A06255J256O03m1l34l86k86P2O33J034Q93J66p27j161q86k89J26L33N02
$$ 106255 107511 108114 108073 107739 107353 107067 107139 107772 108806 109699 109865 109138 107977 107091 106802 106928 107261 107763
54784A07763L92k50q53l98J130K560K984K616J980J179M63N08J386K081J816J296
$$ 107763 108155 107905 107052 106654 107784 110344 113328 115944 117924 119103 119566 120074 121460 123541 125357 126653
54768A26653J780L332M856N575N719N879O293O769O890O299N022L301J140j531
$$ 126653 128433 131765 136621 142196 147915 153794 160087 166856 173746 180045 185067 188368 189508 187977
54754A87977m160n767o059n774n585n384m943m497m187l762l321l467m187m378
$$ 187977 183817 178050 171991 166217 160632 155248 150305 145808 141621 137859 134538 131071 126884 122506
54740A22506l320j750p06j36M58Q28N24ooL51L94K05L85R63J540K191L191M181
$$ 122506 119186 117436 116730 116594 117052 117880 118404 118398 118392 118743 119137 119342 119727 120690 122230 124421 127612 131793
54722A31793M638M840N356N918N783M932L870K608R49n57j255j731l113n103o136
$$ 131793 136431 141271 146627 152545 158328 163260 167130 169738 170687 170130 168875 167144 164031 158928 152792
54707A52792n624m679m335m346m143l750l252k396j347q55j126j311o93L08Q31
$$ 152792 147168 142489 138154 133808 129665 125915 122663 120267 118920 118065 116939 115628 114935 115243 116074
54692A16074O12j01j014j704j680r70k38O1J89N34J005J241R46n6j524k553k326
$$ 116074 116686 116585 115571 113867 112187 111217 110979 111040 111229 111763 112768 114009 114955 114899 113375 110822 108496
54675A08496j292p65j137j437r41k37k6J00P96J608J531N32l92n16M3Q31J406
$$ 108496 107204 106439 105302 103865 102924 102687 102661 102761 103557 105165 106696 107228 106836 106320 106363 107194 108600
54658A08600J203q6j880k992k784j684n06L60R76J433J699J696J314M73o38j413
$$ 108600 109803 109717 107837 104845 102061 100377 99871 100231 101207 102640 104339 106035 107349 107822 107184 105771
54642A05771j206o1J072J153J44r40j183o40Q9P12J220J367Q56m8o88q54r21j040
$$ 105771 104565 104504 105576 106729 106873 105933 104750 104110 104199 104911 106131 107498 108354 108306 107618 106764 105843 104803
54624A04803q03J9R00J103O12J11J52N15N00k13j033j016o4P81N40m45j024p59
$$ 104803 104000 104019 104919 106022 106634 106745 106897 107412 107912 107699 106666 105650 105586 106367 106907 106462 105438 104679
54606A04679k80j48o3M92J389J998J864R88k18j083j099m63R7J69M8J13K34R1
$$ 104679 104399 104251 104188 104680 106069 108067 109931 110919 110701 109618 108519 108056 108153 108322 108370 108483 108717 108808
54588A08808j92k06J45M99M79O4m60p75p30l90R1N52P65M71k85r68r71k68O08
$$ 108808 108616 108410 108555 109054 109533 109597 109137 108362 107632 107242 107333 107885 108650 109121 108836 107868 106897 106629 107237
54569A07237J188J458J586J600J414R99L85k76p09p32m66k07p7n7j43k64j47M19
$$ 107237 108425 109883 111469 113069 114483 115482 115867 115591 114882 114150 113684 113477 113400 113343 113200 112936 112789 113208
54551A13208J155J515J277O88K7n77r04o87J5P71J258J490J527J257O97K27K58
$$ 113208 114363 115878 117155 117843 117870 117293 116389 115702 115717 116488 117746 119236 120763 122020 122717 122944 123202
54534A23202P75J290J316Q00J40l25p30j351j905j681o64J17j40q58q68n7O49
$$ 123202 123977 125267 126583 127383 127523 127198 126468 125117 123212 121531 120867 120984 120844 119986 119118 119061 119710
54517A19710O88L87Lo65j468j634q55J3m6r03j585j441n71N84J524J768J253N83
$$ 119710 120398 120785 120788 120123 118655 117021 116166 116179 116133 115230 113645 112204 111633 112217 113741 115509 116762 117345
54499A17345M03N59L68l10p68l96M73R89Q32M47K89K54N0j81l5M95R54J043R04
$$ 117345 117748 118307 118675 118365 117597 117201 117674 118663 119495 119942 120231 120485 120535 120354 120319 120814 121768 122811 123715
54480A23715P01L52n0j6O84J489J660J243R15J042J387J649J776J709J299N96
$$ 123715 124416 124768 124718 124702 125386 126875 128535 129778 130693 131735 133122 134771 136547 138256 139555 140151
54464A40151j08n84p46n33j9M15M30K28L07P14R40O25m5o76j081j247j212j080
$$ 140151 140043 139459 138713 138180 138161 138576 139006 139234 139541 140255 141195 141820 141775 141099 140018 138771 137559 136479
54446A36479r21p05m86n32r91j525j596j091l78J46K54j00n88o02N3P17O43km17
$$ 136479 135558 134853 134367 133835 132844 131319 129723 128632 128254 128400 128654 128554 127966 127364 127417 128134 128777 128775 128358
54427A28358k53J52M81O79O59L91K67O66J201J117M22p4%J69Mk62l12k44k37k58
$$ 128358 128105 128257 128738 129417 130076 130467 130734 131400 132601 133718 134140 134066 134066 134235 134239 133977 133665 133421 133184 132926
54407A32926l29n73q25p07k46J72M58Q26J126R43M98N72J274J763J491R11N07
$$ 132926 132597 132024 131199 130492 130246 130418 130876 131702 132828 133771 134269 134841 136115 137878 139369 140280 140787
54390A40787O4n66q13k37O36J061J108J182J048K25r93j696j470o81K34J122J772
$$ 140787 140851 140285 139472 139235 139871 140932 142040 143222 144270 144495 143502 141806 140336 139655 139889 141011 142783
54373A42783J735P70p11j692j242N74K500L243K873K567K953L417L278K710K186
$$ 142783 144518 145288 144577 142885 141643 142217 144717 147960 150833 153400 156353 159770 163048 165758 167944
54358A67944J677J090P38P06L64p29j884k104j504j080j334j904k389k740k850
$$ 167944 169621 170711 171449 172155 172519 171790 169906 167802 166298 165218 163884 161980 159591 156851 154001
54343A54001k507j807j154p93p48j085j697k054j652p95k40j35J41Q60J349Q60
$$ 154001 151494 149687 148533 147740 146992 145907 144210 142156 140504 139709 139469 139334 139475 140335 141684 142544
54327A42544k93r72n28M12O99N2o71o71k32j52m49m04R5K13m97j224r70R4R73
$$ 142544 142251 141279 140751 141163 141862 141914 141243 140572 140340 140188 139739 139335 139430 139643 139146 137922 136952 137046 138019
54308A38019J166R20N46J51q2j1J50K4m13q88j213j325j145p95o80r64j240j100
$$ 138019 139185 140105 140651 140802 140720 140709 140859 140883 140470 139582 138369 137044 135899 135104 134424 133460 132220 131120
54290A31120o82k66K87J032J325N14q57j415n61R43K017K287J964J348P53M28
$$ 131120 130438 130172 130459 131491 132816 133330 132473 131058 130497 131440 133457 135744 137708 139056 139809 140237
54274A40237K78o8o80j111r51l31K59N38O71R32J283J366J005N66N42P97P41K75
$$ 140237 140515 140447 139767 138656 137705 137374 137633 138171 138842 139774 141057 142423 143428 143994 144536 145333 146074 146349
54256A46349N9N10J113J192Q81P56Q75Q47N52J71l22j014j506j297o38m16r92
$$ 146349 146408 146918 148031 149223 150104 150860 151735 152582 153134 153305 152983 151969 150463 149166 148528 148112 147120
54239A47120j733j883j397p92n17o13p33m21L62J049J099O93M17M05K74j64o68
$$ 147120 145387 143504 142107 141315 140798 140185 139452 139031 139393 140442 141541 142234 142651 143056 143330 143166 142498
54222A42498j008j148r32k25N65O58p1p97p52j81J45k9k96l37k70k45o6N29J319
$$ 142498 141490 140342 139410 139185 139750 140408 140337 139540 138788 138607 138752 138723 138427 138090 137820 137575 137509 138038 139357
54203A39357J636J064M1m80o7O92Q55J92o09p42j15O93J090R93O74K73k90q59
$$ 139357 140993 142057 142098 141618 141551 142243 143098 143290 142681 141939 141824 142517 143607 144600 145274 145547 145257 144398
54185A44398q96j43Q46J270J127J047J215J121O15L64Q90J697J916J372N02l92
$$ 144398 143502 143359 144205 145475 146602 147649 148864 149985 150600 150964 151854 153551 155467 156839 157341 156949
54169A56949j258j882j969j488o75J73P14O88L30J43J01m34j587k438k194j297
$$ 156949 155691 153809 151840 150352 149677 149850 150564 151252 151582 151725 151826 151392 149805 147367 145173 143876
54153A43876o70l92M2N35M82j58p28q63q07p64o04k65J00M15O49O32L50J88L97
$$ 143876 143206 142814 142856 143391 143873 143715 142987 142124 141317 140553 139949 139684 139784 140199 140848 141480 141830 142018 142415
54134A42415O65P12R05J464J644P03o48r91k72K20k3p8N20P37l00j628j601o2
$$ 142415 143080 143792 144697 146161 147805 148508 147860 146869 146597 146817 146794 146716 147236 147973 147673 146045 144444 144382
54116A44382J606K266J988J423R89P85P95R43J111J164J001O65M02M06O22R52
$$ 144382 145988 148254 150242 151665 152654 153439 154234 155177 156288 157452 158453 159118 159520 159926 160548 161500
54100A61500J528K374L021L021K747L035L880M195L170J301l07j195j716k274
$$ 161500 163028 165402 168423 171444 174191 177226 181106 185301 188471 189772 189465 188270 186554 184280
54086A84280k869l220l084k516j956j891k294k595k273j269Q0J333K098K278K273
$$ 184280 181411 178191 175107 172591 170635 168744 166450 163855 161582 160313 160393 161726 163824 166102 168375
54071A68375K686L672M693M983M198K723J414Q70P96L61o90j706k132k223k322
$$ 168375 171061 174733 179426 184409 188607 191330 192744 193614 194410 194771 194081 192375 190243 188020 185698
54056A85698k067j167l34m15r33o43N36J313R13N1k52J40Q73J803K776L365L330
$$ 185698 183631 182464 182130 181715 180782 180139 180675 181988 182901 182952 182700 182840 183713 185516 188292 191657 194987
54039A94987K970K726K928L880N567P094P267O078M888M803N506O016N903N276
$$ 194987 197957 200683 203611 207491 213058 220152 227419 233497 238385 243188 248694 254710 260613 265889
54025B65889M283L075J875P33l42q44j82J174J796J042p1l78j78n87j822l045
$$ 265889 270172 273247 275122 275855 275513 274669 274487 275661 277457 278499 278428 278050 277872 277285 275463 272418
54009B72418l649l992m730n985p175p540o917n910n139m473l494k473k093k260
$$ 272418 268769 264777 260047 254062 246887 239347 232430 226520 221381 216908 213414 210941 208848 206588
53995B06588k137j450p97m46RN37L69n94j259r91o05q74j164p11k30q24k001k293
$$ 206588 204451 203001 202204 201758 201767 202304 202673 202079 200820 199829 199224 198350 197186 196475 196245 195421 193420 191127
53977A91127j497q19r28j170q63k12K93N31N82N64P61J383K223K973L688M395
$$ 191127 189630 188811 187883 186713 185850 185638 185931 186462 187044 187608 188369 189752 191975 194948 198636 203031
53961B03031M683M396M368N598P799R718J0659J0791J0080Q068M839J309j728
$$ 203031 207714 212110 216478 222076 229875 239593 250252 261043 271123 279191 284030 285339 283611
53948B83611m080n567n875n236m477l998l358k165p24M84J386K073K460K522K411
$$ 283611 279531 273964 268089 262853 258376 254378 251020 248855 248131 248615 250001 252074 254534 257056 259467
53933B59467K112J452O84M42Q50J271J247J224J786K649K993K652K408L112M752
$$ 259467 261579 263031 263715 264157 265007 266278 267525 268749 270535 273184 276177 278829 281237 284349 289101
53918B89101O425P162O821O187O117O626P072P095O899O661O162N302M423L756
$$ 289101 295526 302688 309509 315696 321813 328439 335511 342606 349505 356166 362328 367630 372053 375809
53904C75809K914J450l28j607k049k111k291k580k756k858l047l259l411l760
$$ 375809 378723 380173 379845 378238 376189 374078 371787 369207 366451 363593 360546 357287 353876 350116
53890C50116m670n963p007p590q136q739q591p060m988l992m523n423n485m669
$$ 350116 345446 339483 332476 324886 316750 308011 299420 292360 287372 283380 278857 273434 267949 263280
53876B63280l566k550j907k056l016m061m467m254l807l296k854k780l032k973
$$ 263280 259714 257164 255257 253201 250185 246124 241657 237403 233596 230300 227446 224666 221634 218661
53862B18661k242j448j338j714j817j463j098j054j354j940k471k248j124j00
$$ 218661 216419 214971 213633 211919 210102 208639 207541 206487 205133 203193 200722 198474 197350 197250
53848A97250j69q84j006l06K93K66P1R6M6l30q06j200j548j579q68J86M72l23
$$ 197250 197081 196197 195191 194885 195178 195444 195515 195611 195657 195327 194521 193321 191773 190194 189326 189512 189984 189661
53830A89661j060n79Q12J862J908J290O47L18K98L47K67K16N41J211J668J485
$$ 189661 188601 188022 188834 190696 192604 193894 194541 194859 195157 195504 195771 195987 196528 197739 199407 200892
53814B00892Q65L69M21J109K131K874K937K650K736L367M024M338M490M626M487
$$ 200892 201757 202126 202547 203656 205787 208661 211598 214248 216984 220351 224375 228713 233203 237829 242316
53799B42316L964L524L639M164M613M742M559M069L374K805K618K712K777K624
$$ 242316 246280 249804 253443 257607 262220 266962 271521 275590 278964 281769 284387 287099 289876 292500
53785B92500K143J269J98n70p38o24r15j970l495m744n160m862m520m557m672
$$ 292500 294643 295912 296110 295540 294802 294178 293263 291293 287798 283054 277894 273032 268512 263955 259283
53770B59283m383l856l659l839l812l268k623k414k592k739k590k208j842j799
$$ 259283 254900 251044 247385 243546 239734 236466 233843 231429 228837 226098 223508 221300 219458 217659
53756B17659k159k615k802k725k635k518k133j493r03n14k60j65k62k92ML80M59
$$ 217659 215500 212885 210083 207358 204723 202205 200072 198579 197676 197162 196902 196737 196475 196183 196187 196567 197026
53739A97026M46Q25J354J250M21k53r4O41J392J887J929J402P70P36J162J171
$$ 197026 197472 198297 199651 200901 201322 201069 200975 201616 203008 204895 206824 208226 208996 209732 210894 212065
53723B12065O28M85J243K064K131J850J862J816J150M01N22J350J869J763J729
$$ 212065 212693 213178 214421 216485 218616 220466 222328 224144 225294 225695 226217 227567 229436 231199 232928
53708B32928K270L104L719L852L484K891K569K624K559K087J734K032K637K982
$$ 232928 235198 238302 242021 245873 249357 252248 254817 257441 260000 262087 263821 265853 268490 271472
53694B71472L235L763M151L841L258L136L025J854j07j258q51J07M43J75j87n19
$$ 271472 274707 278470 282621 286462 289720 292856 295881 297735 297628 296370 295519 295626 296069 296244 296057 295538
53678B95538p54o02k25l73j243j977j890j448j376j504j246o46j92%J20J51k1
$$ 295538 294784 294182 293957 293584 292341 290364 288474 287026 285650 284146 282900 282254 282062 282062 282182 282333 282312
53661B82312k62m98r43j508j549q09j15k91q53p08J45O37K13n65j051j160q65
$$ 282312 282050 281552 280609 279101 277552 276743 276628 276337 275484 274776 274921 275558 275771 275206 274155 272995 272130
53644B72130k7R58J286R33R63K039L399L925L555K956K328J508Q71J093K041K851
$$ 272130 272103 273061 274347 275280 276243 278282 281681 285606 289161 292117 294445 295953 296824 297917 299958 302809
53628C02809L220L727M606N119M698L951L809M196M350M155M189M534M487L759
$$ 302809 306029 309756 314362 319481 324179 328130 331939 336135 340485 344640 348829 353363 357850 361609
53614C61609L071L123L557L596L206K975L082L194L244L553M015L946L102K244
$$ 361609 364680 367803 371360 374956 378162 381137 384219 387413 390657 394210 398225 402171 405273 407517
53600D07517K151K526K492J917J513J672J848J371L26o63j221j421j493j641j988
$$ 407517 409668 412194 414686 416603 418116 419788 421636 423007 423333 422670 421449 420028 418535 416894 414906
53585D14906k431k667k614k599k824k943k582k057j983k297k275j722j349j763
$$ 414906 412475 409808 407194 404595 401771 398828 396246 394189 392206 389909 387634 385912 384563 382800
53571C82800k571k978k759k136j168N4R01O43n32j551j611q79oN69P19N04J54
$$ 382800 380229 377251 374492 372356 371188 371242 372143 372786 372254 370703 369092 368213 368207 368776 369495 369999 370153
53554C70153r0k93o10p90k63J019K273K667K208J621J572K126K798K977K549K168
$$ 370153 370063 369770 369160 368370 368107 369126 371399 374066 376274 377895 379467 381593 384391 387368 389917 392085
53538C92085K608L796M840N168N176N529O250O971P674Q633R781J0662J1078J1353
$$ 392085 394693 398489 403329 408497 413673 419202 425452 432423 440097 448730 458511 469173 480251 491604
53524D91604J1873J2673J3523J4247J4803J5208J5442J5490J5504J5891J7046
$$ 491604 503477 516150 529673 543920 558723 573931 589373 604863 620367 636258 653304
53513F53304J8964K1240K3458K5337K6604K7116K7224K7540K8134K8429K8137
$$ 653304 672268 693508 716966 742303 768907 796023 823247 850787 878921 907350 935487
53502I35487K7746K7663K7352K6052K3972K2103K0928K0173J9692J9792K0427
$$ 935487 963233 990896 1018248 1044300 1068272 1090375 1111303 1131476 1151168 1170960 1191387
53491A191387K0822K0357J9389J8766J8829J9233J9560J9702J9793J9976K0252
$$ 1191387 1212209 1232566 1251955 1270721 1289550 1308783 1328343 1348045 1367838 1387814 1408066
53480A408066K0375K0014J9089J7868J6575J5051J2969J0291P377M613K096l25
$$ 1408066 1428441 1448455 1467544 1485412 1501987 1517038 1530007 1540298 1547675 1552288 1554384 1554059
53468A554059k745n086p328r711j2422j5021j6582j6684j6036j5722j6079j6791
$$ 1554059 1551314 1546228 1538900 1529189 1516767 1501746 1485164 1468480 1452444 1436722 1420643 1403852
53456A403852j7814j9478k1562k3034k3204k2639k2480k3088k3847k4051k3557
$$ 1403852 1386038 1366560 1344998 1321964 1298760 1276121 1253641 1230553 1206706 1182655 1159098
53445A159098k2647k1620k0610j9492j7959j5837j3283j0595p981n717m317m077
$$ 1159098 1136451 1114831 1094221 1074729 1056770 1040933 1027650 1017055 1009074 1003357 999040 994963
53433I94963m431m175k527J39K711M370N211N982P236Q697R613R811J0235J2016
$$ 994963 990532 986357 983830 983969 986680 991050 996261 1002243 1009479 1018176 1027789 1037600 1047835 1059851
53419A059851J5100J8242K0418K1765K2927K4012K4730K5260K6335K8340L0819
$$ 1059851 1074951 1093193 1113611 1135376 1158303 1182315 1207045 1232305 1258640 1286980 1317799
53408A317799L3028L4658L5833L6752L7644L8970M1194M4295M7595N0287N2067
$$ 1317799 1350827 1385485 1421318 1458070 1495714 1534684 1575878 1620173 1667768 1718055 1770122
53397A770122N3354N4897N7101N9646O1731O2837O3202O3498O4051O4508O4199
$$ 1770122 1823476 1878373 1935474 1995120 2056851 2119688 2182890 2246388 2310439 2374947 2439146
53386B439146O2744O0274N7217N4008N0958M8218M5727M3195M0209L6517L2240
$$ 2439146 2501890 2562164 2619381 2673389 2724347 2772565 2818292 2861487 2901696 2938213 2970453
53375B970453K7749K3297J8764J3894Q623L060k917r740j7632k6103l4185m1270
$$ 2970453 2998202 3021499 3040263 3054157 3062780 3065840 3062923 3053183 3035551 3009448 2975263 2933993
53363B933993m7434n2866n7212n9857o0829o1051o1499o2224o2457o1528n9502
$$ 2933993 2886559 2833693 2776481 2716624 2655795 2594744 2533245 2471021 2408564 2347036 2287534
53352B287534n6949n4308n1611m8800m6208m4600m4514m5523m6473m6573m5932
$$ 2287534 2230585 2176277 2124666 2075866 2029658 1985058 1940544 1895021 1848548 1801975 1756043
53341A756043m4876m3161m0411l7027l3949l1524k9256k6791k4389k2230j9901
$$ 1756043 1711167 1668006 1627595 1590568 1556619 1525095 1495839 1469048 1444659 1422429 1402528
53330A402528j7114j4402j2561j1758j1634j1972j2702j3474j3874j3943j4050
$$ 1402528 1385414 1371012 1358451 1346693 1335059 1323087 1310385 1296911 1283037 1269094 1255044
53319A255044j4254j4158j3375j1834r804p846o510n722m733l096j302K8J160
$$ 1255044 1240790 1226632 1213257 1201423 1191619 1183773 1177263 1171541 1166808 1163712 1162410 1162438 1163598
53306A163598K744M606O004O969Q404J0636J2830J4277J5434J7119J9304K1347
$$ 1163598 1166342 1170948 1176952 1183921 1192325 1202961 1215791 1230068 1245502 1262621 1281925 1303272
53294A303272K3038K4747K6710K8675L0243L1214L1535L1178L0101K8356K6256
$$ 1303272 1326310 1351057 1377767 1406442 1436685 1467899 1499434 1530612 1560713 1589069 1615325
53283A615325K4319K2775K1245J9122J6259J2927R270N212R76k873o037q762j1399
$$ 1615325 1639644 1662419 1683664 1702786 1719045 1731972 1741242 1746454 1747430 1744557 1738520 1729758 1718359
53270A718359j4015j6503j8745k0693k2574k4880k7608k9748l0344k9933l0082
$$ 1718359 1704344 1687841 1669096 1648403 1625829 1600949 1573341 1543593 1513249 1483316 1453234
53259A453234l1369l2845l3622l3920l4103l3789l2686l1428l0683l0138k9191
$$ 1453234 1421865 1389020 1355398 1321478 1287375 1253586 1220900 1189472 1158789 1128651 1099460
53248A099460k8067k7319k6830k6228k5850k6206k6788k6503k5221k3846k2883
$$ 1099460 1071393 1044074 1017244 991016 965166 938960 912172 885669 860448 836602 813719
53237H13719k1958k0766j9581j8453j6869j4620j2404j1001j0284r530q455p505
$$ 813719 791761 770995 751414 732961 716092 701472 689068 678067 667783 658253 649798 642293
53225F42293p210p547q021q323q777r912j1574j2874j3266j3246j3585j4190j4288
$$ 642293 635083 627536 619515 611192 602415 592503 580929 568055 554789 541543 527958 513768 499480
53212D99480j3595j2615j1828j1164j0387r513q651p831p139o801o923p304p551
$$ 499480 485885 473270 461442 450278 439891 430378 421727 413896 406757 399956 393033 385729 378178
53199C78178p376o860o517o870p779q394q035o888n678m895m573m507m297l633
$$ 378178 370802 363942 357425 350555 342776 334382 326347 319459 313781 308886 304313 299806 295509 291876
53185B91876k841k812l790m702m380l137k375k735l474l719l521l364l238k675
$$ 291876 289035 286223 282433 277731 273351 270214 267839 265104 261630 257911 254390 251026 247788 245113
53171B45113j464m1Q62R50P29R24J500J675J140O22P96J174P65m88j700k241k234
$$ 245113 243649 243608 244470 245420 246149 247073 248573 250248 251388 252010 252806 253980 254745 254257 252557 250316 248082
53154B48082k069k089k512l036k788j410J30O48L15J30J97k29j063j188k33P44
$$ 248082 246013 243924 241412 238376 235588 234178 234308 234956 235271 235401 235598 235369 234306 233118 232885 233629
53138B33629Q66O06P32J063J001N90L06L55P05J318J815J486J93j153j549r84
$$ 233629 234495 235101 235833 236896 237897 238487 238793 239148 239853 241171 242986 244472 244665 243512 241963 240979
53122B40979j76K98L29J82M13J441K812L380K581J117N9k69j97p5r6l52p02r37
$$ 240979 240803 241101 241430 241612 242025 243466 246278 249658 252239 253356 253415 253146 252949 252874 252778 252426 251724 250787
53104B50787j196j721k132j691n82Ln39j384j572j272j042p72k29P9l27q27n40
$$ 250787 249591 247870 245738 244047 243465 243468 242929 241545 239973 238701 237659 236887 236658 236737 236410 235583 235043
53087B35043J74K13n32j112j071r02q43m54L00N26l33j391j257K07J711K032J264
$$ 235043 235217 235430 234898 233786 232715 231813 230970 230516 230816 231342 231009 229618 228361 228568 230279 232311 233575
53070B33575L99N9kj66k83q4K8o04j695k089j362n63p83j637j904j219k75L41
$$ 233575 233974 234033 234031 233865 233582 233498 233526 232922 231227 229138 227776 227213 226430 224793 222889 221670 221395 221736
53052B21736O65Q31Q14P23P63Q03N49R4j56j08q4k82n50o67n09k2N74P30K09m15
$$ 221736 222401 223232 224046 224769 225532 226335 226884 226978 226822 226714 226630 226348 225798 225131 224622 224600 225174 225904 226113 225698
53032B25698m02J28M30K27q4k52m71p16n55O3N33M22J19J90N71P99P74P93R49
$$ 225698 225296 225424 225854 226081 225997 225745 225274 224558 224003 224066 224599 225021 225140 225330 225901 226700 227474 228267 229216
53013B29216R63O62L26M15J006J657J813J313M52m03j054j407j431j236r99o50
$$ 229216 230179 230841 231167 231582 232588 234245 236058 237371 237823 237420 236366 234959 233528 232292 231293 230643
52997B30643QP70J080Q03N22O58P73K84n17p88k50O70J577K292K494J955J173
$$ 230643 230651 231421 232501 233304 233826 234484 235257 235541 235024 234236 233986 234656 236233 238525 241019 242974 244147
52980B44147J001J545K116K328K478K668K383J409M38K02M97O28M09J65K4j62
$$ 244147 245148 246693 248809 251137 253615 256283 258666 260075 260513 260715 261212 261840 262249 262414 262438 262276
52964B62276l09j18L97Q26Q75O64M18J61j96o53j115j548j979k343k382j855r37
$$ 262276 261967 261849 262246 263072 263947 264611 265029 265190 264994 264341 263226 261678 259699 257356 254974 253119 252182
52947B52182k97m89j304j946j891j339p44k99qm4o02j486k101k009j366p52n91
$$ 252182 251885 251396 250092 248146 246255 244916 244172 243873 243865 243821 243219 241733 239632 237623 236257 235505 234914
52930B34914p73q21m59J04M50M19J56k32p41j214j258o89J30O46P50Q69J335J857
$$ 234914 234141 233320 232861 232965 233415 233834 233990 233758 233017 231803 230545 229856 229986 230632 231382 232251 233586 235443
52912B35443J831J059K6o07o44m18l10l88n03o07q16j205j582j535q60Q5O36N36
$$ 235443 237274 238333 238359 237752 237108 236690 236380 235992 235489 234882 234066 232861 231279 229744 228884 228969 229605 230141
52894B30141K49L84R54J419J348P91J29j98J6M71M91j90r57j024m19K52P21J056
$$ 230141 230390 230774 231728 233147 234495 235286 235415 235217 235233 235704 236195 236005 235048 234024 233605 233857 234578 235634
52876B35634R47K4j090j066M30K191L080L217L100K522J292J70N8P01J206J413
$$ 235634 236581 236605 235515 234449 234879 237070 240150 243367 246467 248989 250281 250451 250509 251210 252416 253829
52860B53829J762K110J837R30Jp97j811k890l284k854k402k520k873k960k926
$$ 253829 255591 257701 259538 260468 260469 259672 257861 254971 251687 248833 246431 243911 241038 238078 235152
52845B35152l124l450l507l123k383j494q17o98j023j216r23m39l29p82j421j561
$$ 235152 232028 228578 225071 221948 219565 218071 217254 216556 215533 214317 213394 212955 212626 211844 210423 208862
52829B08862p88N54J559J676J239P78K60m88r75n34N64J315J265Q28L78p4k56
$$ 208862 208074 208628 210187 211863 213102 213880 214140 213652 212677 212143 212707 214022 215287 216115 216493 216419 216163
52812B16163L14J306J600Q59K34Q19K070K526J635J96p62r34o87n89r23j405j470
$$ 216163 216477 217783 219383 220242 220476 221295 223365 225891 227526 227722 226960 226026 225339 224750 223827 222422 220952
52795B20952j030p03j031j722k002j503o15k9k14j074j927j974r77N34J748K227
$$ 220952 219922 219219 218188 216466 214464 212961 212346 212317 212103 211029 209102 207128 206151 206685 208433 210660
52779B10660K093J819J772J774J286K47n90n74j27j52o88r56o35k18m7J38M36
$$ 210660 212753 214572 216344 218118 219404 219651 219061 218487 218360 218208 217520 216564 215929 215711 215664 215802 216238
52762B16238N08K88J47J08k16n75m7J387K280J598K31l33p3j2m04n78k54J91P27
$$ 216238 216746 217034 217181 217289 217073 216498 216451 217838 220118 221716 221947 221614 221541 221529 221125 220547 220293 220484 221211
52743B21211J742L024L716L507L027K803K571J901R12oo11p01l7J231K384K705
$$ 221211 222953 225977 229693 233200 236227 239030 241601 243502 244414 244408 243797 243096 243059 244290 246674 249379
52727B49379K091R63j83r92j327j355j427j690j912j764j253p98q81j493k016
$$ 249379 251470 252433 252250 251258 249931 248576 247149 245459 243547 241783 240530 239732 238851 237358 235342
52712B35342j766p66K71P60P50N41J94k85o17n53k43L0L06P32J152J248R75N30
$$ 235342 233576 232810 233081 233841 234591 235132 235326 235041 234424 233871 233628 233658 233964 234696 235848 237096 238071 238601
52694B38601J2n21r05j029j014r06n44o3m2o78j175p66R0L17j42l52rJ17l67o95
$$ 238601 238613 238092 237187 236158 235144 234238 233694 233631 233589 232911 231736 230970 231060 231377 231235 230883 230874 230991 230624 229929
52674B29929k61K02l62j683k494k199j365o06J25R85J648J718J312R32R06J195
$$ 229929 229668 229870 229508 227825 225331 223132 221767 221161 221286 222271 223919 225637 226949 227881 228787 229982
52658B29982J592J855J871J847K251L285M484N071M678L521J951J39j686l041
$$ 229982 231574 233429 235300 237147 239398 242683 247167 252238 256916 260437 262388 262527 260841 257800
52644B57800l508l131k322j492q94o71q09j166j617k049k106j325J74J555K176
$$ 257800 254292 251161 248839 247347 246453 245782 244973 243807 242190 240141 238035 236710 236884 238439 240615
52629B40615K379K828L452L699L517L232K584R47j358k938l023k349k001k094
$$ 240615 242994 245822 249274 252973 256490 259722 262306 263253 261895 258957 255934 253585 251584 249490
52615B49490k223k319k366j923p81M13R31R27Q86O31j85j033j059m44k08o19q73
$$ 249490 247267 244948 242582 240659 239878 240291 241222 242149 243035 243666 243481 242448 241389 240945 240737 240118 239245
52598B39245m39K14N38O52Q10Q42N66K25J31K74N54R40J209R76L25p6J80O28O26
$$ 239245 238806 239020 239558 240210 241020 241862 242428 242653 242784 243058 243612 244552 245761 246737 247062 246986 247166 247794 248420
52579B48420K61J50N02Q39O78J76n2K65O79N90J37J04P22J080K87j134j805j347
$$ 248420 248681 248831 249333 250172 250850 251026 250974 251239 251918 252508 252645 252749 253471 254551 254838 253704 251899 250552
52561B50552p68q93j295j222q03o62q18p21j52N33R90J215J291J188Q85M51l7
$$ 250552 249784 248891 247596 246374 245571 244909 244091 243370 243218 243751 244741 245956 247247 248435 249320 249771 249734
52544B49734l95k91M13J243J420O30o76j770k252k073j301j36R63J544J591J505
$$ 249734 249339 249048 249461 250704 252124 252754 252078 250308 248056 245983 244682 244546 245509 247053 248644 250149
52528B50149J540J505J135N19j11p35j270j219k14J073J405O27P2Q05K125K608
$$ 250149 251689 253194 254329 254848 254737 254002 252732 251513 251299 252372 253777 254404 254476 255281 257406 260014
52512B60014K123J849K484L426L903L920L754L223K009K72j532l127m357m909
$$ 260014 262137 263986 266470 269896 273799 277719 281473 284696 286705 286977 285445 282318 277961 273052
52498B73052m564l622k725k318k330k365k064j377o20j85j70l51m67m11j80J86
$$ 273052 268488 264866 262141 259823 257493 255128 253064 251687 251067 250882 250712 250361 249894 249483 249303 249489
52482B49489O18J070J521J816J704J181O25L04P1j64m4O57J375J429J125J360
$$ 249489 250107 251177 252698 254514 256218 257399 258024 258328 258399 258235 258191 258848 260223 261652 262777 264137
52466B64137K185K712K598K608L260L808L317K028R51M79J77l29j013j805k722
$$ 264137 266322 269034 271632 274240 277500 281308 284625 286653 287604 288083 288260 287931 286918 285113 282391
52451B82391l618m293m667m589l733k238j074j065j721j770q64O4K44M8J25L24
$$ 282391 278773 274480 269813 265224 261491 259253 258179 257114 255393 253623 252759 252823 253067 253115 253240 253564
52435B53564N8o45j187j265j063o99m9P35J108Q19L30K13M02M55L27M26Q53J125
$$ 253564 253622 252977 251790 250525 249462 248763 248714 249449 250557 251376 251706 251919 252321 252776 253103 253529 254382 255507
52417B55507Q30K23j02R9O60J411K335L346M227M892N533O484P960R772J1245
$$ 255507 256337 256560 256458 256557 257217 258628 260963 264309 268536 273428 278961 285445 293405 303177 314422
52402C14422J1515J0182P528M105L26l342o134p461p466o787n858m798l809l181
$$ 314422 325937 336119 343647 347752 348078 344736 338602 331141 323675 316888 311030 306232 302423 299242
52388B99242k890k640k352k184k082j716r80j03P79J692K397K383J675J132J619
$$ 299242 296352 293712 291360 289176 287094 285378 284398 284295 285074 286766 289163 291546 293221 294353 295972
52373B95972L095M740N760N903N450M941M658M248L166J543K29k29k33m28p58
$$ 295972 299067 303807 309567 315470 320920 325861 330519 334767 337933 339476 339705 339476 339243 338815 338057
52358C38057p14k60N9j31n87q57q37p32o37l85J27O17P21O84J339K961M487M579
$$ 338057 337343 337083 337142 337011 336424 335567 334730 333998 333361 332976 333103 333720 334441 335125 336464 339425 343912 348491
52340C48491L388K481K858L850M362M438M902O032P382Q604R651J0352J0592J0930
$$ 348491 351879 354360 357218 361068 365430 369868 374770 380802 388184 396788 406439 416791 427383 438313
52326D38313J2247J4529J6613J7532J7616J7840J8431J8698J8213J7578J7690
$$ 438313 450560 465089 481702 499234 516850 534690 553121 571819 590032 607610 625300
52315F25300J8570J9318J9307J8889J8736J8854J8768J8414J8239J8363J8304
$$ 625300 643870 663188 682495 701384 720120 738974 757742 776156 794395 812758 831062
52304H31062J7738J7081J6896J7105J7151J6676J5713J4380J2781J1061R258P184
$$ 831062 848800 865881 882777 899882 917033 933709 949422 963802 976583 987644 996902 1004086
52292A004086M659J740j386m510p259r164j0117j0512j0646j0324r382q303p778
$$ 1004086 1008745 1010485 1009099 1004589 997330 988166 978049 967537 956891 946567 937185 928882 921104
52279I21104p732p312n878l681j472L25J920L753N874P758Q883R420J0074J1170
$$ 921104 913372 906060 900182 896501 895029 895354 897274 901027 906901 914659 923542 932962 943036 954206
52265I54206J2311J3092J3702J4404J4892J4661J3917J3530J4051J5135J5983
$$ 954206 966517 979609 993311 1007715 1022607 1037268 1051185 1064715 1078766 1093901 1109884
52254A109884J6118J5656J5015J4417J3632J2304J0456Q365O000L035m44l758
$$ 1109884 1126002 1141658 1156673 1171090 1184722 1197026 1207482 1215847 1221847 1224882 1224438 1220680
52242A220680o455q736j0715j1875j1880j1476j1735j2756j3757j4263j4375j4076
$$ 1220680 1214225 1205489 1194774 1182899 1171019 1159543 1147808 1135052 1121295 1107032 1092657 1078581
52230A078581j3205j2181j1798j2059j1955j0800r156p993p465o948n979m680
$$ 1078581 1065376 1053195 1041397 1029338 1017383 1006583 997427 989434 981969 975021 969042 964362
52218I64362l442k494j750r42M4J013J794K595L631M526M679M250M085M446M497
$$ 964362 960920 958426 956676 955734 955778 956791 958585 961180 964811 969337 974016 978266 982351 986797 991294
52203I91294L619K584K680L891M810M456L496L264M085N140N749O104O576O868
$$ 991294 994913 997497 1000177 1004068 1008878 1013334 1016830 1020094 1024179 1029319 1035068 1041172 1047748 1054616
52189A054616O422N380M456L838K921J357k74j348k247l806o001p938r022r529
$$ 1054616 1061038 1066418 1070874 1074712 1077633 1078990 1078716 1077368 1075121 1071315 1065314 1057376 1048354 1038825
52175A038825r952j0329j0397r902q650o691m584l016k094j332m15M47J054J604
$$ 1038825 1028873 1018544 1008147 998245 989595 982904 978320 975304 973210 971878 971463 971910 972964 974568
52161I74568K348L199L864M096L758K964K163J711J386P30j32n68l64J17O76J448
$$ 974568 976916 980115 983979 988075 991833 994797 996960 998671 1000057 1000787 1000655 1000087 999723 999840 1000516 1001964
52145A001964K151K108J372R75J417J787J109j18p43o82p01q80l88J157L258N470
$$ 1001964 1004115 1006223 1007595 1008570 1009987 1011774 1012883 1012765 1012022 1011340 1010639 1009759 1009371 1010528 1013786 1019256
52129A019256P808J0073J1769J3092J5051J8175K1721K4659K6804K8451K9539
$$ 1019256 1027064 1037137 1048906 1061998 1077049 1095224 1116945 1141604 1168408 1196859 1226398
52118A226398K9892K9785K9577K9100K8071K6883K6142K5561K4090K1299J7985
$$ 1226398 1256290 1286075 1315652 1344752 1372823 1399706 1425848 1451409 1475499 1496798 1514783
52107A514783J5206J3236J1727J0414R260Q165O980N730M568L573K676J683K95
$$ 1514783 1529989 1543225 1554952 1565366 1574626 1582791 1589771 1595501 1600069 1603642 1606318 1608001 1608296
52094A608296j698m149o713r287j2091j5191j8302k1150k3535k4883k4345k1942
$$ 1608296 1606598 1602449 1595736 1586449 1574358 1559167 1540865 1519715 1496180 1471297 1446952 1425010
52082A425010j9094j7128j5626j3209r855p206o181n491l383k6K973M916O709
$$ 1425010 1405916 1388788 1373162 1359953 1350098 1342892 1336711 1331220 1327837 1327811 1330784 1335700 1342409
52069A342409R149J1718J3494J4402J5001J5537J5828J5840J5821J5842J5704
$$ 1342409 1351558 1363276 1376770 1391172 1406173 1421710 1437538 1453378 1469199 1485041 1500745
52058A500745J5346J5040J5003J4899J4049J2162R803P843O436M796K185j211
$$ 1500745 1516091 1531131 1546134 1561033 1575082 1587244 1597047 1604890 1611326 1616122 1618307 1617096
52046A617096m676p932j1182j4274j6600j8021j9284k0981k2586k3046k2247k1166
$$ 1617096 1612420 1604488 1593306 1579032 1562432 1544411 1525127 1504146 1481560 1458514 1436267 1415101
52034A415101k0644k0494k0014j8880j7254j5407j3630j2401j2124j2650j3332
$$ 1415101 1394457 1373963 1353949 1335069 1317815 1302408 1288778 1276377 1264253 1251603 1238271
52023A238271j3581j3229j2341j1046r684q834q801r159r137q433p481o893o911
$$ 1238271 1224690 1211461 1199120 1188074 1178390 1169556 1160755 1151596 1142459 1134026 1126545 1119652 1112741
52010A112741p406q149q917r606j0461j1959j4260j6822j8758j9593j9544j9140
$$ 1112741 1105335 1097186 1088269 1078663 1068202 1056243 1041983 1025161 1006403 986810 967266 948126
51998I48126j8750j8462j8186j7723j6781j5170j3192j1677j1355j2033j2651
$$ 948126 929376 910914 892728 875005 858224 843054 829862 818185 806830 794797 782146
51987G82146j2432j1732j1474j1981j2840j3692j4539j5275j5607j5577j5574
$$ 782146 769714 757982 746508 734527 721687 707995 693456 678181 662574 646997 631423
51976F31423j5583j5095j4000j2918j2154j1100r202o905m875k855k05K828N304
$$ 631423 615840 600745 586745 573827 561673 550573 541371 534466 529591 526736 526531 529359 534663
51963E34663O855P828Q342Q206P640P072O098L794L12k878m835o177p667q717
$$ 534663 541518 549346 557688 565894 573534 580606 586704 590498 590810 587932 583097 576920 569253 560536
51949E60536q247o406m424l027j862l52J672M162O943R531J1447J2823J4259J5944
$$ 560536 552289 545883 541459 538432 536570 536218 537890 542052 548995 558526 569973 582796 597055 612999
51935F12999J7394J8224J8726J9369K0015J9961J8650J6060J2455P920K271m596
$$ 612999 630393 648617 667343 686712 706727 726688 745338 761398 773853 781773 784044 779448
51923G79448j2237j9521k5128k8339k9403k9037k7674k5384k2510j9939j8326
$$ 779448 767211 747690 722562 694223 664820 635783 608109 582725 560215 540276 521950
51912E21950j7201j5400j2475r233o669m819l072j204N35K109L818N578O764O928
$$ 521950 504749 489349 476874 467641 460972 456153 453081 451877 452412 454521 458339 463917 470681 477609
51898D77609O307N333L947J735j388m769p413q802r344r824j0305r951q240n940
$$ 477609 483916 489249 493196 494931 493543 488774 481361 472559 463215 453391 443086 433135 424895 418955
51884D18955m302l542k844j692l87Q13K201L934N628P057Q572J0281J1397J0993
$$ 418955 414653 411111 408267 406575 406188 407001 409202 413136 418764 425821 434393 444674 456071 467064
51870D67064R144O708M340K248N36q91k568m878p211q290p561n743l872k184k68
$$ 467064 476208 482916 487256 489504 490040 489149 486581 481703 474492 466202 458641 452898 449026 446842 446574
51855D46574J944L805M655M622M412M323L733J905r17l571n152n753o020o370
$$ 446574 448518 452323 456978 461600 466012 470335 474068 475973 475056 471485 466333 460580 454560 448190
51841D48190o837p235p288o856o241n893n660m808l059j149J14Q96J884L060L616
$$ 448190 441353 434118 426830 419974 413733 407840 402180 397372 394313 393164 393278 394174 396058 399118 402734
51826D02734L040J684K05j075k079k722k957k894k620k078j279m46J79O57J245
$$ 402734 405774 407458 407663 406588 404509 401787 398830 395936 393316 391238 389959 389513 389692 390349 391594
51811C91594J954K387K157J430P76M86L09J1j86l0K36K28P1J21K51N6l83o33q17
$$ 391594 393548 395935 398092 399522 400298 400784 401093 401104 400918 400888 401124 401352 401423 401544 401795 401851 401468 400835 400018
51792D00018j489k461k772k187j731k131k611k094q88j58j81k08J27L17Pl83k91
$$ 400018 398529 396068 393296 391109 389378 387247 384636 382542 381654 381496 381315 381107 381234 381551 381558 381175 380884
51775C80884L39J240K253L345M522N769O924P670P938Q119Q554Q987Q915Q217
$$ 380884 381223 382463 384716 388061 392583 398352 405276 412946 420884 429003 437557 446544 455459 463676
51761D63676P022N210K617l92l159n465p481r086r838r635q934q223p722p476
$$ 463676 470698 475908 478525 478133 474974 469509 462028 452942 443104 433469 424535 416312 408590 401114
51747D01114p314o730n385l717k510j827r88L33J647K494L160M211N734P370Q726
$$ 401114 393800 387070 381685 377968 375458 373631 372643 372976 374623 377117 380277 384488 390222 397592 406318
51732D06318R491R349Q175O184L891J981J110J485K655L958N015N528M857K565
$$ 406318 415809 425158 433333 439517 443408 445389 446499 447984 450639 454597 459612 465140 469997 472562
51718D72562o83l446m946n549n734n355m362l513l684m732n682n863n353m369
$$ 472562 471879 468433 463487 457938 452204 446849 442487 438974 435290 430558 424876 419013 413660 409291
51704D09291k757l45K437M524M965L725J705q3j246j891k066j735j075l30N24
$$ 409291 406534 406189 408626 413150 418115 421840 423545 423462 422216 420325 418259 416524 415449 415119 415643
51689D15643J527K189J780K42j706l464m938n931n900m704l085j869j081k95N22
$$ 415643 417170 419359 421139 421381 419675 416211 411273 405342 399442 394738 391653 389784 388703 388408 388930
51674C88930J068J380J826K526L217L791M581O044Q303J0999J3427J4865J4831
$$ 388930 389998 391378 393204 395730 398947 402738 407319 413363 421666 432665 446092 460957 475788
51661D75788J3164R875N199j51n099q682j0432j0332q704o221l600j055J654M415
$$ 475788 488952 498827 504026 503875 498776 490094 479662 469330 460626 454405 450805 449750 451404 455819
51647D55819O340O391M316P73l246o834r364j0655j0966j0615r700q265o576m941
$$ 455819 462159 468550 472866 473639 470393 463559 454195 443540 432574 421959 412259 403994 397418 392477
51633C92477l420j896l95Q69J652J819J470R67O61M46j37j237k387l032l105k868
$$ 392477 389057 387161 386766 387635 389287 391106 392576 393543 394204 394650 394513 393276 390889 387857 384752 381884
51617C81884k534k325k602l429m237m362l850l338l202l184k911k330j572p50
$$ 381884 379350 377025 374423 370994 366757 362395 358545 355207 352005 348821 345910 343580 342008 341258
51603C41258LN92J202K209L616M896N692O456P935J0053J1739J2001J0780Q525
$$ 341258 341261 341853 343055 345264 348880 353776 359468 365924 373859 383912 395651 407652 418432 426957
51589D26957N380J372k836o089p795q261p858o482m223j826J24K001M396O950
$$ 426957 432337 433709 430873 424784 416989 408728 400870 394388 390165 388339 388463 390464 394860 401810
51575D01810Q832J0115J1644J3540J4904J5291J5537J6569J8021J8668J7807J5778
$$ 401810 410642 420757 432401 445941 460845 476136 491673 508242 526263 544931 562738 578516
51563E78516J3625J2608J3588J6413K0162K4215K8584L2970L6209L7141L5490
$$ 578516 592141 604749 618337 634750 654912 679127 707711 740681 776890 814031 849521
51552H49521L1403K4868J6342P334o98p742j4607k1218k6507k9952l2150l3669
$$ 849521 880924 905792 922134 929468 928770 921028 906421 885203 858696 828744 796594 762925
51540G62925l4246l3470l1520k8832k5590k1934j8273j5015j2276j0021q143o389
$$ 762925 728679 695209 663689 634857 609267 587333 569060 554045 541769 531748 523605 517216
51528E17216m650l437l465m629n885o501o814p406q049q046p307o467o101o270
$$ 517216 512566 509129 505664 501035 495150 488649 481835 474429 466380 458334 451027 444560 438459 432189
51514D32189o688o916o500n398m198l544l360l072k559k364k830l474l559k946
$$ 432189 425501 418585 412085 406687 402489 398945 395585 392513 389954 387590 384760 381286 377727 374781
51500C74781k098j371p29j10L15L56R9j66k43j10K06O88J224J583J612J454J455
$$ 374781 372683 371312 370583 370473 370788 371144 371243 371077 370834 370724 370930 371618 372842 374425 376037 377491 378946
51483C78946J719J857J325P1j283k049k199k245k489k675k484k068j846j907k008
$$ 378946 380665 382522 383847 383918 382635 380586 378387 376142 373653 370978 368494 366426 364580 362673 360665
51468C60665k120k578l527m497m775m179l188k350j778j331j160j631k618l187
$$ 360665 358545 355967 352440 347943 343168 338989 335801 333451 331673 330342 329182 327551 324933 321746
51454C21746k436o23J036J731J813J963K315K829L930N983Q437J0357J1756J3439
$$ 321746 319310 318687 319723 321454 323267 325230 327545 330374 334304 340287 348724 359081 370837 384276
51440C84276J5401J6289J4963J1881Q410N363K829R99L37Q32J623J582J78k107
$$ 384276 399677 415966 430929 442810 451220 456583 459412 460411 460748 461580 463203 464785 464963 462856
51426D62856m196n438o212p253q396q636p566o110n352n231m995m420l861l389
$$ 462856 458660 453222 447010 439757 431361 422725 415159 409049 403697 398466 393471 389051 385190 381801
51412C81801k725j920j355j083p36j47M46Q25R74Q51N22M81J294K720L728L571
$$ 381801 379076 377156 375801 374718 373982 373835 374281 375106 376080 376931 377453 377934 379228 381948 385676 389247
51396C89247K505J397R48J373K401L439M113M741N944P747R547J1106J3110J6347
$$ 389247 391752 393149 394097 395470 397871 401310 405423 410164 416108 423855 433402 444508 457618 473965
51382D73965K0696K5327K9710L4112L8964M4026M8431N1579N3679N4916N4243
$$ 473965 494661 519988 549698 583810 622774 666800 715231 766810 820489 875405 929648
51371I29648M9767M0842K9195J7332O271m358j4512k3316l0483l6777m2528m6720
$$ 929648 979415 1020257 1049452 1066784 1073055 1068697 1054185 1030869 1000386 963609 921081 874361
51359H74361m8337m7852m6541m4917m2641l9687l6536l3270k9344k4528j9568
$$ 874361 826024 778172 731631 686714 644073 604386 567850 534580 505236 480708 461140
51348D61140j5590j3096j1664j0485r063p560o462n932n611n078m318l554k888
$$ 461140 445550 432454 420790 410305 401242 393682 387220 381288 375677 370599 366281 362727 359839
51335C59839k313j855j442r03k43K45M76Q30J569K254K272J704J141P34O9r85
$$ 359839 357526 355671 354229 353326 353083 353328 353804 354634 356203 358457 360729 362433 363574 364308 364377 363392
51319C63392j947k418k518k428j989j206o52p76j102p25L87J208Q79k93j324j688
$$ 363392 361445 359027 356509 354081 352092 350886 350234 349458 348356 347631 348018 349226 350105 349812 348488 346800
51303C46800j587j303q15j52K27j46j100j914k106j919j841j905j719j079k31
$$ 346800 345213 343910 343095 342943 343170 343024 341924 340010 337904 335985 334144 332239 330520 329441 329210
51288C29210N14J123J677K111K403K799L596M694N616O040O033N755N145M104
$$ 329210 329724 330847 332524 334635 337038 339837 343433 348127 353743 359783 365816 371571 376716 380820
51274C80820K771J475M50k22n45n96m86j58O46J971L346M149M258L947L231J727
$$ 380820 383591 385066 385516 385294 384749 384153 383667 383509 384155 386126 389472 393621 397879 401826 405057 406784
51258D06784o28l117m765n143m572l739l265l376l718l772l537l517l814l744
$$ 406784 406156 403039 398274 393131 388559 384820 381555 378179 374461 370689 367152 363635 359821 356077
51244C56077k790j566j149j666k178j977j336p71l21J48M16K34j53k86j35o4j80
$$ 356077 353287 351721 350572 348906 346728 344751 343415 342644 342323 342471 342887 343121 342968 342682 342547 342483 342303
51227C42303j83J58O58R77J078J191J420J540J291Q35O94J103J529J189L8j096
$$ 342303 342120 342278 342936 343913 344991 346182 347602 349142 350433 351268 351962 353065 354594 355783 355821 354725
51211C54725j436j027l89K60J058J970K675L030L203L299L171K744K219J709J036
$$ 354725 353289 352262 351873 352133 353191 355161 357836 360866 364069 367368 370539 373283 375502 377211 378247
51196C78247J63m25k54L97P50N37K07M7l21j195k057k127j442p79o41q23q73n69
$$ 378247 378410 377985 377731 378128 378878 379415 379622 379669 379348 378153 376096 373969 372527 371748 371107 370284 369411 368842
51178C68842J7M43K6j350k631k481r55M87Q31O11Q52J668K488L010L240L056K484
$$ 368842 368859 369302 369328 367978 365347 362866 361911 362398 363229 363840 364692 366360 368848 371858 375098 378154 380638
51161C80638K078K249K506K074J048K35n4k88q47j565k167k538k615k449k395
$$ 380638 382716 384965 387471 389545 390593 390828 390774 390486 389639 388074 385907 383369 380754 378305 375910
51146C75910k661k819k407j802j749k099j926j013k20j51l13p3L80N75N67O54
$$ 375910 373249 370430 368023 366221 364472 362373 360447 359434 359214 359063 358750 358677 359057 359632 360199 360853
51130C60853P35N35J54l3K78J277K855M222M325L098J724J161J037O21J99N92
$$ 360853 361588 362123 362277 362244 362522 363799 366654 370876 375201 378299 380023 381184 382221 382842 383041 383633
51114C83633J683K428K303J860J726J760J538J091Q80J218J956K593K663K182
$$ 383633 385316 387744 390047 391907 393633 395393 396931 398022 398902 400120 402076 404669 407332 409514
51100D09514J639J410J318J003N62M16O26O85J44p84j444j434j049r26j161j029
$$ 409514 411153 412563 413881 414884 415446 415862 416488 417173 417317 416533 415089 413655 412606 411680 410519 409490
51084D09490J24J783K650K237J464J296J472J146L33j21J78O92Q17N91M13N69
$$ 409490 409614 411397 414047 416284 417748 419044 420516 421662 421995 421874 422052 422744 423561 424152 424565 425134
51068D25134J144K101L227M367N681P444R598J1869J4243J6847J9304K0731K0574
$$ 425134 426278 428379 431606 435973 441654 449098 458696 470565 484808 501655 520959 541690 562264
51055E62264J9082J6775J3991J1276R726J0225J2296J4252J4601J3150J0600P508
$$ 562264 581346 598121 612112 623388 633114 643339 655635 669887 684488 697638 708238 715746
51043G15746M045M66k755n560q432j1496j3759j3854j1569q135n084l419l760
$$ 715746 719791 720257 717502 711942 703510 692014 678255 664401 652832 644697 639613 636194 632434
51030F32434o349j0415j4198j6311j6744j6128j4536j1775q410n556l647k169
$$ 632434 626085 615670 601472 585161 568417 552289 537753 525978 517568 512012 508365 506196
51018E06196o78O45J617K604M112O184Q400J0243J1281J1369J0858J0349J0129
$$ 506196 505518 506163 507780 510384 514496 520680 529080 539323 550604 561973 572831 583180 593309
51005E93309R992R698R321R052Q843Q418P525O138M429K564N44j491k936l174
$$ 593309 603301 612999 622320 631372 640215 648633 656158 662296 666725 669289 669833 668342 665406 662232
50991F62232k606k534l486m206l145o15J664L017M647P642J1287J4066J5630J6812
$$ 662232 659626 657092 653606 649400 646255 645640 647304 650321 654968 662610 673897 687963 703593 720405
50977G20405J8133J9095J9065J8166J7255J7292J8800K1674K5428K9721L4555
$$ 720405 738538 757633 776698 794864 812119 829411 848211 869885 895313 925034 959589
50966I59589L9899M5397N0634N5456N9865O3781O7186P0184P2602P3748P2979
$$ 959589 999488 1044885 1095519 1150975 1210840 1274621 1341807 1411991 1484593 1558341 1631320
50955A631320P0474O6993O2891N7801N1419M4195L6852K9588K2210J5032R071
$$ 1631320 1701794 1768787 1831678 1889479 1940898 1985093 2021945 2051533 2073743 2088775 2097846
50944B097846N104K841J461O12K94q0j732n164r284j2454j4119j5007j5993j7380
$$ 2097846 2102950 2105791 2107252 2107864 2108158 2108078 2106346 2101182 2091898 2079444 2065325 2050318 2034325 2016945
50930B016945j9141k1306k3953k7197l1209l5905m0733m5142m9181n3089n6410
$$ 2016945 1997804 1976498 1952545 1925348 1894139 1858234 1817501 1772359 1723178 1670089 1613679
50919A613679n8236n8416n7781n6927n5448n2794m9274m5637m2119l8491l4804
$$ 1613679 1555443 1497027 1439246 1382319 1326871 1274077 1224803 1179166 1137047 1098556 1063752
50908A063752l1470k8647k6113k3690k1476j9605j7998j6423j4674j2786j1156
$$ 1063752 1032282 1003635 977522 953832 932356 912751 894753 878330 863656 850870 839714
50897H39714j0157r548q584o991n442m644m276l392j726m3Q29Q45N01K88N25J352
$$ 839714 829557 820009 811425 804434 798992 794348 790072 786680 784954 784911 785740 786585 787086 787374 787899 789251
50881G89251K584L724M440M866N354O029O737P338P885Q525R373J0457J1745J3117
$$ 789251 791835 795559 799999 804865 810219 816248 822985 830323 838208 846733 856106 866563 878308 891425
50867H91425J4374J5336J6113J7244J9417K2800K6683K9976L2244L4229L7231
$$ 891425 905799 921135 937248 954492 973909 996709 1023392 1053368 1085612 1119841 1157072
50856A157072M1969M8069N4701O1549O8962P7256Q6244R5630J05454J15812J26274
$$ 1157072 1199041 1247110 1301811 1363360 1432322 1509578 1595822 1691452 1796906 1912718 2038992
50845B038992J36035J44620J52105J58583J63814J67343J68563J66542J60196
$$ 2038992 2175027 2319647 2471752 2630335 2794149 2961492 3130055 3296597 3456793
50836C456793J48968J33198J13821R1980O9006M6201K4338L685j5155l0828m2101
$$ 3456793 3605761 3738959 3852780 3944760 4013766 4059967 4084305 4087990 4072835 4042007 3999906
50825C999906m8875n1875n1516m7620m0324l0814k0990j2569o569l374l212o539
$$ 3999906 3951031 3899156 3847640 3800020 3759696 3728882 3707892 3695323 3688754 3685380 3682168 3675629
50813C675629j3845k4982l8903n4202o9822q5035r9141j11655j22626j32174j39565
$$ 3675629 3661784 3636802 3597899 3543697 3473875 3388840 3289699 3178044 3055418 2923244 2783679
50802B783679j43318j42559j37963j31190j23456j14953j05407r4915q4106p3664
$$ 2783679 2640361 2497802 2359839 2228649 2105193 1990240 1884833 1789918 1705812 1632148
50792A632148o3841n4558m5820l7857l0790k4389j8361j2790q124m746k717j809
$$ 1632148 1568307 1513749 1467929 1430072 1399282 1374893 1356532 1343742 1335618 1330872 1328155 1326346
50780A326346j605j675j866k341l209m258n258o304p525q673r463j0191j1498
$$ 1326346 1324741 1323066 1321200 1318859 1315650 1311392 1306134 1299830 1292305 1283632 1274169 1263978 1252480
50767A252480j3423j5268j6589j7754j9184k0520k0972k0290j8948j7537j6405
$$ 1252480 1239057 1223789 1207200 1189446 1170262 1149742 1128770 1108480 1089532 1071995 1055590
50756A055590j5635j4896j3494j1087q358o325m905k792Q43N082Q349J0456J2811
$$ 1055590 1039955 1025059 1011565 1000478 992120 985795 980890 978098 978941 984023 992372 1002828 1015639
50743A015639J6593K1368K5912K9782L3607L8002M2849M7674N2280N6789O1331
$$ 1015639 1032232 1053600 1079512 1109294 1142901 1180903 1223752 1271426 1323706 1380495 1441826
50732A441826O5890P0301P4189P7129P9098Q0653Q2344Q4007Q4858Q4375Q2691
$$ 1441826 1507716 1578017 1652206 1729335 1808433 1889086 1971430 2055437 2140295 2224670 2307361
50721B307361P9939P5535O8552N8761M6925L3898J9830M569j1308k6258l8565
$$ 2307361 2387300 2462835 2531387 2590148 2637073 2670971 2690801 2695370 2684062 2657804 2619239
50710B619239m7125n1558n2027m9215m4155l7657k9953k1128j1857l428K891O381
$$ 2619239 2572114 2520556 2468529 2419314 2375159 2337502 2307549 2286421 2274564 2271136 2274027 2280408
50698B280408O897M643n4p061j6425k7821m0095n1727o1739o9820p5674p8827
$$ 2280408 2287305 2291948 2291894 2284833 2268408 2240587 2200492 2148765 2087026 2017206 1941532 1862705
50686A862705p9187p7302p3753o8705o2337n5276m8119m0871l3255k5371j7597
$$ 1862705 1783518 1706216 1632463 1563758 1501421 1446145 1398026 1357155 1323900 1298529 1280932
50675A280932j0084k866L778R542J4653J9588K4296K8202L0935L2418L2274L0005
$$ 1280932 1270848 1267982 1271760 1281302 1295955 1315543 1339839 1368041 1398976 1431394 1463668 1493673
50663A493673K6146K2506K0537J9909J9256J7938J6456J5334J4587J4327J5021
$$ 1493673 1519819 1542325 1562862 1582771 1602027 1619965 1636421 1651755 1666342 1680669 1695690
50652A695690J6653J8273J9008J9260K0283K2686K5892K9178L2661L6878M1746
$$ 1695690 1712343 1730616 1749624 1768884 1789167 1811853 1837745 1866923 1899584 1936462 1978208
50641A978208M6414N0160N3083N5666N7939N9293N9150N7537N4926N1706M8081
$$ 1978208 2024622 2074782 2127865 2183531 2241470 2300763 2359913 2417450 2472376 2524082 2572163
50630B572163M4437M1442L9529L8422L7320L5325L1257K3299R741r112k9927m7746
$$ 2572163 2616600 2658042 2697571 2735993 2773313 2808638 2839895 2863194 2872935 2863823 2833896 2786150
50618B786150n8816o2263n9513n2709m3666l3622k3382j3533m591L017Q975J2872
$$ 2786150 2727334 2665071 2605558 2552849 2509183 2475561 2452179 2438646 2434055 2437072 2446047 2458919
50606B458919J4052J1955O686j010j0428k1235l3061m5067n6233o5820p3363p8453
$$ 2458919 2472971 2484926 2491612 2490602 2480174 2458939 2425878 2380811 2324578 2258758 2185395 2106942
50594B106942q0901q1095p9843p7776p5047p1583o7498o3149n8915n4913n0964
$$ 2106942 2026041 1944946 1865103 1787327 1712280 1640697 1573199 1510050 1451135 1396222 1345258
50583A345258m6861m2631l8397l4114k9677k5363k1736j8895j6165j2866r191
$$ 1345258 1298397 1255766 1217369 1183255 1153578 1128215 1106479 1087584 1071419 1058553 1049362
50572A049362n885l202o66K127M903P144Q774J0196J1743J3348J4719J5822J7096
$$ 1049362 1043477 1040275 1039609 1041736 1046639 1053783 1062557 1072753 1084496 1097844 1112563 1128385 1145481
50559A145481J9115K1942K4930K7335K9049L0527L2021L3206L3577L3071L2158
$$ 1145481 1164596 1186538 1211468 1238803 1267852 1298379 1330400 1363606 1397183 1430254 1462412
50548A462412L1448L1210L1164L0766K9855K9002K9067L0392L2739L5932M0192
$$ 1462412 1493860 1525070 1556234 1587000 1616855 1645857 1674924 1705316 1738055 1773987 1814179
50537A814179M5645N1909N8493O5395P2848Q0631Q8084R4907J01561J08674J16380
$$ 1814179 1859824 1911733 1970226 2035621 2108469 2189100 2277184 2372091 2473652 2582326 2698706
50526B698706J24403J32521J40490J47629J52890J55523J55458J52939J47898
$$ 2698706 2823109 2955630 3096120 3243749 3396639 3552162 3707620 3860559 4008457
50517D008457J39803J28011J12209R2758P0641M6942K2235l383k9536n5151p8898
$$ 4008457 4148260 4276271 4388480 4481238 4551879 4598821 4621056 4617673 4588137 4532986 4454088
50506D454088r9803j17197j30322j38403j41065j38335j30430j17875j01586q2377
$$ 4454088 4354285 4237088 4106766 3968363 3827298 3688963 3558533 3440658 3339072 3256695
50496C256695o0420l5935j0368J3750L4469N1295O4045P1468P1624O3349M6928
$$ 3256695 3196275 3160340 3149972 3163722 3198191 3249486 3313531 3384999 3456623 3519972 3566900
50485C566900K3628m669l5458o5859r3244j15734j32398j43359j49499j51648
$$ 3566900 3590528 3585859 3550401 3484542 3391298 3275564 3143166 2999807 2850308 2698660
50475B698660j50097j45113j37580j28642j18794j07976r6628q6011p7289p0621
$$ 2698660 2548563 2403450 2265870 2137228 2018434 1910458 1813830 1727819 1650530 1579909
50465A579909o5366o0743n6106n0974m5249l9357l3855k8900k4201j9495j4834
$$ 1579909 1514543 1453800 1397694 1346720 1301471 1262114 1228259 1199359 1175158 1155663 1140829
50454A140829j0457o515l021l1K316M047N582P459R872J2633J5573J8717K1887
$$ 1140829 1130372 1123857 1120836 1120805 1123121 1127168 1132750 1140209 1150081 1162714 1178287 1197004 1218891
50441A218891K4506K5903K5674K3693K0165J5899J1951Q726N809L140J607J809
$$ 1218891 1243397 1269300 1294974 1318667 1338832 1354731 1366682 1375408 1381217 1384357 1385964 1387773
50429A387773K694K613J612J500L370O104P950Q713R640J1640J4520J7821K1602
$$ 1387773 1390467 1393080 1394692 1396192 1399562 1405666 1413616 1422329 1431969 1443609 1458129 1475950 1497552
50416A497552K6211L1733L7922M4469N1192N8023O4813P1164P6503Q0410Q2751
$$ 1497552 1523763 1555496 1593418 1637887 1689079 1747102 1811915 1883079 1959582 2039992 2122743
50405B122743Q3557Q2913Q0946P7764P3322O7548O0540N2366M2673L0870J6841
$$ 2122743 2206300 2289213 2370159 2447923 2521245 2588793 2649333 2701699 2744372 2775242 2792083
50394B792083J162j5386l2215m8602o3418p5520q4310q9717r1859r0938q7213
$$ 2792083 2793245 2777859 2745644 2697042 2633624 2558104 2473794 2384077 2292218 2201280 2114067
50383B114067q0870p2010o0996m8553l5469k2330r674J993J2415K1451K8417L2071
$$ 2114067 2033197 1961187 1900191 1851638 1816169 1793839 1784165 1786158 1798573 1820024 1848441 1880512
50371A880512L1592K7245J9704R205l916j8275l1894m3651n3540o1386o6232o7454
$$ 1880512 1912104 1939349 1959053 1968258 1964342 1946067 1914173 1870522 1816982 1755596 1689364 1621910
50359A621910o5889o3259o0634n7820n4049m8957m3010l7241l2381k8139k3559
$$ 1621910 1556021 1492762 1432128 1374308 1320259 1271302 1228292 1191051 1158670 1130531 1106972
50348A106972j8448j4063j2005j2670j5197j8568k2021k4508k4832k2768j9480
$$ 1106972 1088524 1074461 1062456 1049786 1034589 1016021 994000 969492 944660 921892 902412
50337I02412j6268j3334j0281p278m941l344j973p13j4J15N33J930L904N490O293
$$ 902412 886144 872810 862529 855251 850310 846966 844993 844280 844266 844381 844914 846844 850748 856238 862531
50322H62531O629O929P428Q130Q624Q175O583M752L879M052M238L643K626K112
$$ 862531 869160 876089 883517 891647 900271 908446 915029 919781 923660 927712 931950 935593 938219 940331
50308I40331K528L517M396M736M671M789N531O653P478P730P928Q876J0829J3298
$$ 940331 942859 946376 950772 955508 960179 964968 970499 977152 984630 992360 1000288 1009164 1019993 1033291
50294A033291J5693J8202K1768K7013L3260L9155M4084M8002M9554M5468L3250
$$ 1033291 1048984 1067186 1088954 1115967 1149227 1188382 1232466 1280468 1330022 1375490 1408740
50283A408740J4357o217k3406l4652l9735l9704l6426l1938k7335k2615j7836
$$ 1408740 1423097 1416880 1393474 1358822 1319087 1279383 1242957 1211019 1183684 1161069 1143233
50272A143233j3738j0883q839o819m605k524q53K88R71J714L356O291J0104J4140
$$ 1143233 1129495 1118612 1109773 1102954 1098349 1095825 1094972 1095260 1096231 1097945 1101301 1107592 1117696 1131836
50258A131836J7959K1171K3449K5049K6635K8213K8881K8095K6432K4645K2753
$$ 1131836 1149795 1170966 1194415 1219464 1246099 1274312 1303193 1331288 1357720 1382365 1405118
50247A405118K0745J9457J9638K0652K0908J9282J5404R127R08p624j4661j9864
$$ 1405118 1425863 1445320 1464958 1485610 1506518 1525800 1541204 1550331 1551239 1543615 1528954 1509090
50235A509090k4106k7653k9663k9613k8130k6026k3430k0483j8116j7411j8603
$$ 1509090 1484984 1457331 1427668 1398055 1369925 1343899 1320469 1299986 1281870 1264459 1245856
50224A245856k1207k4788k9053l3265l6144l6684l5036l2426l0091k8279k6409
$$ 1245856 1224649 1199861 1170808 1137543 1101399 1064715 1029679 997253 967162 938883 912474
50213I12474k4142k1769j9498j7035j4318j2047j0782r975q738p235o324o033
$$ 912474 888332 866563 847065 830030 815712 803665 792883 782908 774170 766935 760611 754578
50201G54578n485m356l370l080l146l150l215l339k978j940j010j047j889k742
$$ 754578 749093 744737 741367 738287 735141 731991 728776 725437 722459 720519 719509 718462 716573 713831
50187G13831l268l700m190m599m770m649m368m319m805n342m928l348j737j255
$$ 713831 710563 706863 702673 698074 693304 688655 684287 679968 675163 669821 664893 661545 659808 658553
50173F58553j638j659p07P31J909K474K394J866J390J433K027K910L941M994N678
$$ 658553 656915 655256 654549 655280 657189 659663 662057 663923 665313 666746 668773 671683 675624 680618 686296
50158F86296N721N558N982P252R029J1114J3625J6282J8298J9314J9998K1236
$$ 686296 692017 697575 703557 710809 719838 730952 744577 760859 779157 798471 818469 839705
50146H39705K3061K4849K6463K8686L2397L7570M3237M8299N2274N5299N7537
$$ 839705 862766 887615 914078 942764 975161 1012731 1055968 1104267 1156541 1211840 1269377
50135A269377N8714N8406N6809N5028N4306N4843N5557N5117N3051M9511M4163
$$ 1269377 1328091 1386497 1443306 1498334 1552640 1607483 1663040 1718157 1771208 1820719 1864882
50124A864882L5931K4246J0128m505j8396l1295m2976n2733o0105o5285o8372
$$ 1864882 1900813 1925059 1935187 1930682 1912286 1880991 1838015 1785282 1725177 1659892 1591520
50113A591520o8788o6177o1557n6725n2457m8003m2491l6402l1267k8212k6996
$$ 1591520 1522732 1456555 1394998 1338273 1285816 1237813 1195322 1158920 1127653 1099441 1072445
50102A072445k6363k5132k3071k0916j9520j9023j8843j8359j7344j5798j3702
$$ 1072445 1046082 1020950 997879 976963 957443 938420 919577 901218 883874 868076 854374
50091H54374j1107q325n801l769k123n84R78K429L540M274M810N218N268M763
$$ 854374 843267 834942 829141 825372 823249 822665 823643 826072 829612 833886 838696 843914 849182 853945
50077H53945M001L615L908M557N045N155M933M390L459K117M50j335k811l445
$$ 853945 857946 861561 865469 870026 875071 880226 885159 889549 893008 895125 895575 894240 891429 887984
50063H87984l113k469k430l232m220m698m709m779n116n375n159m449l513k615
$$ 887984 884871 882402 879972 876740 872520 867822 863113 858334 853218 847843 842684 838235 834722 832107
50049H32107j785p95O19K369L945N045O034P430R013J0072J0541J1233J2627J4055
$$ 832107 830322 829527 830146 832515 836460 841505 847539 854969 863982 874054 884595 895828 908455 922510
50035I22510J4636J4534J4645J5260J5861J6110J6345J6956J7850J8745J9601
$$ 922510 937146 951680 966325 981585 997446 1013556 1029901 1046857 1064707 1083452 1103053
50024A103053K0546K1654K2945K4404K5919K7473K9273L1331L2811L2404K9534
$$ 1103053 1123599 1145253 1168198 1192602 1218521 1245994 1275267 1306598 1339409 1371813 1401347
50013A401347K5018K0310J6420J3645J1926J1130J1026J1029R936O240p33r960
$$ 1401347 1426365 1446675 1463095 1476740 1488666 1499796 1510822 1521851 1531787 1538027 1537294 1527334
50001A527334j9507k8190l5858m2152m5943m6599m5062m2947m1015l9040l6750
$$ 1527334 1507827 1479637 1443779 1401627 1355684 1309085 1264023 1221076 1180061 1141021 1104271
49990A104271l4114l1033k7619k4602k2765k1951k1341k0642k0283k0353k0160
$$ 1104271 1070157 1039124 1011505 986903 964138 942187 920846 900204 879921 859568 839408
49979H39408j9211j8005j7341j7218j6863j5670j3749j1659r878q500p231n765
$$ 839408 820197 802192 784851 767633 750770 735100 721351 709692 699814 691314 684083 678318
49967F78318m267l398l628m634n540n707n200m488l909l392k550j005J258L733
$$ 678318 674051 670653 667025 662391 656851 651144 645944 641456 637547 634155 631605 630600 631858 635591
49953F35591N738P099Q316R823J1189J1465J0476R138Q252P454N992M176L130
$$ 635591 641329 648428 656744 666567 677756 689221 699697 708835 717087 724541 730533 734709 737839
49940G37839L117K997J697n30k760m680o631q810j1087j3300j5146j5989j5424
$$ 737839 740956 743953 745650 745120 742360 737680 731049 722239 711152 697852 682706 666717 651293
49927F51293j3923j2383j1090r627p771n931m602l795l121k095m29J636L258L667
$$ 651293 637370 624987 613897 604270 596499 590568 585966 582171 579050 576955 576526 578162 581420 585087
49913E85087L047K376K337K691K814K614K658L549N259P104Q473R468J0665J2193
$$ 585087 588134 590510 592847 595538 598352 600966 603624 607173 612432 619536 628009 637477 648142 660335
49899F60335J3516J4205J4364J4002J2588R936O967M758L147J168j380l778n717
$$ 660335 673851 688056 702420 716422 729010 738946 745913 750671 753818 754986 753606 749828 744111
49886G44111p630r611j1092j1963j2923j4118j4477j3179j1110r938j0085j0460
$$ 744111 736481 726870 715778 703815 690892 676774 662297 649118 638008 628070 617985 607525
49874F07525r930q373o439m841l865l238k508j696j227j066m84R29K589L757M602
$$ 607525 597595 589222 582783 577942 574077 570839 568331 566635 565408 564342 563858 564787 567376 571133 575735
$$ [...]