##TITLE=AC1461_TOLI13267_8026622_EWjM0qlpsz
##JCAMPDX= 6.0         $$ Bruker NMR JCAMP-DX V2.0
##DATA TYPE= NMR SPECTRUM
##DATA CLASS= NTUPLES
##ORIGIN= BRUKER
##OWNER= Administrator
$$ 1.72 TOPSPIN		Version 2.1
$$ 2013-07-11 17:46:22.842 -0700  Administrator@X
$$ Compression mode = diff/dup
##.OBSERVE FREQUENCY= 400.02188249412
##.OBSERVE NUCLEUS= ^1H
##.ACQUISITION MODE= SIMULTANEOUS (DQD)
##.ACQUISITION SCHEME= undefined
##.AVERAGES= 8
##.DIGITISER RES= 22
##SPECTROMETER/DATA SYSTEM= spect
##.PULSE SEQUENCE= zg30
##.SOLVENT NAME= COFFEE_meoh
##.SHIFT REFERENCE= INTERNAL, COFFEE_meoh, 1, 14.98509
##AUDIT TRAIL= $$ (NUMBER, WHEN, WHO, WHERE, PROCESS, VERSION, WHAT)
$$ ##TITLE= Audit trail, TOPSPIN		Version 2.1
$$ ##JCAMPDX= 5.01
$$ ##ORIGIN= Bruker BioSpin GmbH
$$ ##OWNER= Administrator
$$ $$ E:\/data/COFFEE/nmr/AC1461_TOLI13267_8026622_EWjM0qlpsz/10/pdata/1/auditp.txt
$$ ##AUDIT TRAIL=  $$ (NUMBER, WHEN, WHO, WHERE, PROCESS, VERSION, WHAT)
(   1,<2013-07-11 17:46:16.030 -0700>,<Administrator>,<X>,<go>,<TOPSPIN 2.1>,
      <created by zg
	started at 2013-07-11 17:45:09.623 -0700,
	POWCHK enabled, PULCHK disabled,
       configuration hash MD5:
       C8 4E 4E 5D D3 5C D8 9E 9F 52 82 E0 59 8A DE 15
       data hash MD5: 64K
       5C 88 9C AE 4A E6 A7 17 4C A3 4E 4F CF 05 FA 06>)
(   2,<2013-07-11 17:46:18.967 -0700>,<Administrator>,<X>,<proc1d>,<TOPSPIN 2.1>,
      <Start of raw data processing
       efp LB = 0 FT_mod = 6 PKNL = 1 PHC0 = 0 PHC1 = 0 SI = 32K 
       data hash MD5: 32K
       3C DB B4 E3 5B 95 F1 94 57 56 22 48 88 C4 8E C2>)
(   3,<2013-07-11 17:46:19.311 -0700>,<Administrator>,<X>,<proc1d>,<TOPSPIN 2.1>,
      <pk PHC0 = 97.10815 PHC1 = 0 
       data hash MD5: 32K
       7A 5C 73 AB 97 FE 01 77 58 C6 67 EB CB 4B 30 30>)
(   4,<2013-07-11 17:46:19.405 -0700>,<Administrator>,<X>,<proc1d>,<TOPSPIN 2.1>,
      <abs ABSG = 1 
       data hash MD5: 32K
       44 3E 7C 15 E3 C3 9F EE BB 48 6D B1 19 C3 CB C4>)
(   5,<2013-07-11 17:46:19.498 -0700>,<Administrator>,<X>,<proc1d>,<TOPSPIN 2.1>,
      <abs ABSG = 2 
       data hash MD5: 32K
       67 69 90 F1 06 64 45 14 54 8A 5A B5 15 FF E8 55>)
(   6,<2013-07-11 17:46:19.561 -0700>,<Administrator>,<X>,<proc1d>,<TOPSPIN 2.1>,
      <abs ABSG = 3 
       data hash MD5: 32K
       0A F3 58 7D 08 00 6A E2 B6 09 D3 E2 82 00 B0 A5>)
(   7,<2013-07-11 17:46:19.639 -0700>,<Administrator>,<X>,<proc1d>,<TOPSPIN 2.1>,
      <abs ABSG = 4 
       data hash MD5: 32K
       49 08 8E 35 31 71 D5 AC 12 82 C9 A5 8F A6 7B 39>)
(   8,<2013-07-11 17:46:19.686 -0700>,<Administrator>,<X>,<proc1d>,<TOPSPIN 2.1>,
      <abs ABSG = 5 
       data hash MD5: 32K
       9D 6B 48 8C F3 DF 13 B6 69 38 18 E2 C0 C1 D9 2B>)
$$ ##END=
$$ 
$$ $$ hash MD5
$$ $$ E0 A2 7C E0 77 49 68 3D D5 EF 95 02 85 A1 28 AD
##$RELAX= 
##$RELAX= 
##$RELAX= 
##$RELAX= 
##$RELAX= 
##$RELAX= 
##$RELAX= 
$$ Bruker specific parameters
$$ --------------------------
##$DU= <E:\>
##$EXPNO= 10
##$NAME= <AC1461_TOLI13267_8026622_EWjM0qlpsz>
$$ [...]
150 150 150 150 150 150 150 150
##$TP07= 0
##$TPNAME0= <>
##$TPNAME1= <>
##$TPNAME2= <>
##$TPNAME3= <>
##$TPNAME4= <>
##$TPNAME5= <>
##$TPNAME6= <>
##$TPNAME7= <>
##$TPOAL= (0..7)
0.5 0.5 0.5 0.5 0.5 0.5 0.5 0.5
##$TPOFFS= (0..7)
0 0 0 0 0 0 0 0
##$TUNHIN= 0
##$TUNHOUT= 0
##$TUNXOUT= 0
##$USERA1= <user>
##$USERA2= <user>
##$USERA3= <user>
##$USERA4= <user>
##$USERA5= <user>
##$V9= 5
##$VALIST= <valist>
##$VCLIST= <CCCCCCCCCCCCCCC>
##$VD= 0
##$VDLIST= <DDDDDDDDDDDDDDD>
##$VPLIST= <PPPPPPPPPPPPPPP>
##$VTLIST= <TTTTTTTTTTTTTTT>
##$WBST= 1024
##$WBSW= 4
##$XGAIN= (0..3)
0 0 0 0
##$XL= 0
##$YL= 0
##$YMAX_a= 646503
##$YMIN_a= -548929
##$ZGOPTNS= <>
##$ZL1= 120
##$ZL2= 120
##$ZL3= 120
##$ZL4= 120
##$ABSF1= 14.98509
##$ABSF2= -5.573092
##$ABSG= 5
##$ABSL= 3
##$ALPHA= 0
##$AQORDER= 0
##$ASSFAC= 0
##$ASSFACI= 0
##$ASSFACX= 0
##$ASSWID= 0
##$AUNMP= <proc_prof1d_extract_pilot.lims>
##$AXLEFT= 0
##$AXNAME= <>
##$AXNUC= <1H>
##$AXRIGHT= 0
##$AXTYPE= 0
##$AXUNIT= <>
##$AZFE= 0.1
##$AZFW= 0.1
##$BCFW= 0
##$BC_mod= 0
##$BYTORDP= 0
##$COROFFS= 0
##$CY= 15
##$DATMOD= 1
##$DC= 0
##$DFILT= <>
##$DTYPP= 0
##$F1P= 0
##$F2P= 0
##$FCOR= 0.5
##$FTSIZE= 32768
##$FT_mod= 6
##$GAMMA= 0
##$GB= 0
##$INTBC= 1
##$INTSCL= 1
##$ISEN= 128
##$LB= 0
##$LEV0= 0
##$LPBIN= 0
##$MAXI= 10000
##$MC2= 0
##$MEAN= 0
##$ME_mod= 0
##$MI= 0
##$NCOEF= 0
##$NC_proc= -8
##$NLEV= 6
##$NOISF1= 0
##$NOISF2= 0
##$NSP= 0
##$NTH_PI= 0
##$NZP= 0
##$OFFSET= 14.98509
##$PC= 1
##$PHC0= 97.10815
##$PHC1= 0
##$PH_mod= 1
##$PKNL= yes
##$PPARMOD= 0
##$PPDIAG= 0
##$PPIPTYP= 0
##$PPMPNUM= 2147483647
##$PPRESOL= 1
##$PSCAL= 4
##$PSIGN= 0
##$PYNMP= <proc.py>
##$REVERSE= no
##$SF= 400.02
##$SI= 32768
##$SIGF1= 0
##$SIGF2= 0
##$SINO= 400
##$SIOLD= 32768
##$SPECTYP= <>
##$SREGLST= <1H.CDCl3>
##$SSB= 0
##$STSI= 32768
##$STSR= 0
##$SW_p= 8223.68421052631
##$SYMM= 0
##$S_DEV= 0
##$TDeff= 65536
##$TDoff= 0
##$TI= <>
##$TILT= no
##$TM1= 0
##$TM2= 0
##$TOPLEV= 0
##$USERP1= <user>
##$USERP2= <user>
##$USERP3= <user>
##$USERP4= <user>
##$USERP5= <user>
##$WDW= 1
##$XDIM= 32768
##$YMAX_p= 448914992
##$YMIN_p= -767965
##$CURPLOT= <Network HP LaserJet P1505>
##$CURPRIN= <$Network HP LaserJet P1505>
##$DFORMAT= <normdp>
##$LAYOUT= <+/1D_H.xwp>
##$LFORMAT= <normlp>
##$PFORMAT= <normpl>
##$SURQMSG= 1
$$ End of Bruker specific parameters
$$ ---------------------------------
##NTUPLES= NMR SPECTRUM
##VAR_NAME=  FREQUENCY,     SPECTRUM/REAL,   SPECTRUM/IMAG
##SYMBOL=    X,             R,               I
##VAR_TYPE=  INDEPENDENT,   DEPENDENT,       DEPENDENT
##VAR_FORM=  AFFN,          ASDF,            ASDF
##VAR_DIM=   32768,         32768,           32768
##UNITS=     HZ,            ARBITRARY UNITS, ARBITRARY UNITS
##FACTOR=    0.250966925370066, 1,           1
##FIRST=     8223.43324360094, -269491,      -109334
##LAST=      0,             -251635,         -79927
##MIN=       0,             -767965,         0
##MAX=       8223.43324360094, 448914992,    0
$$ Real data points
##PAGE= N=1
##DATA TABLE= (X++(R..R)), XYDATA
$$ [...]
23843 -157136 2282 -15614 83767 -174600 29699 -160260 -149063 305199 204614 201172 -65648
23831 -145164 20162 177814 83107 -39720 -23395 -123883 -76034 -212611 62853 114914 123861
23820 123861 -398771 -87834 103189 -16574 97753 117010 -260462 247532 168145 -163632
23809 -260774 -225398 188917 -14768 -162380 304591 -136806 141214 141814 203175 282114 -29617
23797 72562 -55264 -8652 -8439 18690 28330 47255 152519 45056 200993 -414887 99839 -317032
23784 38191 -185045 -466248 -125988 26092 -238940 144407 -58316 52194 -70254 99498 -19416
23772 -37431 231690 -41712 -78219 -174442 301570 -107081 117258 -281498 -172081 122951
23761 152919 -174031 24382 263781 -38881 -49451 -324887 -103216 79002 242953 -165033
23750 -134765 -140401 231134 -8262 -274293 -229499 -186630 94960 -21497 371907 53771 -207529
23738 130514 -37831 -98073 173866 -174653 -110241 289383 311199 332887 -197825 -31409 12513
23726 -24030 -25650 53222 93189 415661 234968 -310165 -95122 280148 152928 177891 126568
23715 126568 31429 -171498 253351 28498 -255059 158552 -281456 193211 -133797 -420437
23705 -420437 -5025 197456 -183956 -204239 138304 -48124 -42656 -47676 -71433 -107983 -72421
23694 -72421 149450 -276570 -113494 -167548 194213 -167326 100045 -163150 -184886 -62564
23683 114979 -33855 -152598 27542 156018 -226554 202925 -201480 -161215 94044 -373959
23672 -38502 -280444 -301022 -79544 2887 -224787 -60441 -55861 -32617 261241 -23409 145998
23660 299454 -83738 -168338 -247703 241464 -21519 -42236 -90 -333119 231821 -85020 -116090
23649 -116090 -124216 78813 272458 -173723 -447192 33040 -16232 -108555 -333365 -199879 41875
23637 190265 97824 -76097 -133976 182201 27957 137430 -183833 65889 -339441 -143897
23626 32574 108800 127529 -4736 64867 -66908 25654 -236845 148015 60598 23983 177054
23615 177054 242626 44988 -17909 -126544 64483 282721 -189347 -106576 1597 -27995 -124779
23604 -124779 -225627 17256 93661 84929 20660 239529 -36877 7277 50091 -122761 165395
23592 -74202 -65658 -306714 205678 -52179 -141455 -187992 47918 -183797 -390428 -113869 199268
23580 132503 114696 104305 65728 -78806 121357 -92404 -68741 -45986 21190 -81276 461133
23568 -71237 -4651 168589 317436 -262449 -395602 326297 -258802 -106009 -406964 -392130
23558 -392130 344898 136947 38889 -36001 -156401 -122027 -95593 -105979 71877 -517570 135148
23546 177519 -326269 -145889 322609 18538 -342058 -3466 50913 -116292 19511 52916 131859
23535 131859 -336149 -64989 -139624 -334679 -14445 -92392 -89082 111299 189581 -14591 122251
23523 256802 -224302 -128941 307976 87524 103638 -63871 -263570 -362015 -324849 52996 -142454
23511 -211878 -105243 -85138 -110322 248333 5918 -4575 -101435 41855 145598 -85286 -162244
23500 -162244 155529 63411 -250095 -125340 10109 188911 65678 -67844 8451 -111808 27262
23488 -76976 -136928 -52883 132472 203453 26814 -25817 83878 -313530 210352 -100638 -283294
23477 -283294 -97171 67429 86828 -101069 198938 -93231 -131207 -263943 288241 -253980
23466 -135853 19283 62912 121268 160202 -10462 -112773 14190 -62598 245788 -156244 27785
23454 -282810 235080 51856 -63874 3763 117187 21629 -78007 221601 -67241 271018 -276406
23442 -54684 -220629 -41379 52028 -250675 -313887 108643 -38640 135818 -283154 -91859 260341
23430 160424 -63906 26607 1462 -124225 -61353 -154060 143523 -176679 51299 220266 -19053
23418 -312608 -100542 10547 -61786 -92258 -160415 -200372 -262787 99035 98155 104389 201572 157244
23406 157244 69363 -583404 -231429 76412 -110072 62018 -166893 170948 5558 -301352
23395 43527 -183247 -94915 -59024 -442048 113192 -393346 23968 89180 -115904 -237080
23385 -237080 -123267 -37644 -106490 -97819 321183 -30798 -173163 -271005 82836 -169423 329349
23373 21965 -89785 40701 -155406 -217894 -278482 50549 35917 -202163 144115 -134438 63994
23361 72307 -97502 -134139 -3163 18072 -55184 -152695 -37541 86499 29853 -48444 -23302 138650
23348 -48074 -467645 -85971 -2746 -92701 -96591 174727 -129515 -271165 -25627 -258254 196816
23336 -261382 186346 43684 -380169 198199 60301 -38234 54862 -321275 306416 -67094
23325 175809 -508562 121222 -27262 -166213 231309 -227183 -5039 -135466 238492 -393918
23314 -133725 43154 -79700 220587 87914 -73949 -169620 -46300 93479 -127890 81173 -33050
23302 204876 -36129 4897 -116068 -87379 55038 -30218 -90704 -280905 211671 -218105 38584
23290 9979 240030 -79574 148074 165608 -84915 143233 -147333 265345 440406 -33481 148462
23278 118007 5619 135622 -119449 -53778 79898 115147 34329 -288765 94108 246927 -116080
23266 -57836 278733 38085 207096 230691 187871 166068 175063 44802 61511 71972 -45394
23254 -201466 -153460 -176760 208384 -152256 -35673 24119 24729 81694 -14555 -171080 -133721
23243 -133721 -72123 -115314 -109989 -283367 -397237 158075 55828 -443264 -68301 -75376 286857
23231 148204 12005 -230426 -50151 -90779 -62840 -8592 369536 83972 -57686 175412 -70282
23219 -330159 -16277 -132932 205923 102115 -206870 -120799 -148434 68546 -153185 -87754
23209 -87754 661 -101287 18026 -49236 172220 118956 15851 -95189 -69949 219671 -209591
23197 50840 -237119 -62096 -110328 -152764 -296474 -115390 -125088 -20188 226078 103848 -117849
23185 -15488 -67787 -327666 350070 267817 -271474 31257 -151022 101287 64562 -156540
23174 58094 -105721 12800 -13949 84176 -173826 -353288 -157008 -363159 64560 -22692 404019
23162 -99507 286458 17486 103612 127240 172364 99207 -9698 -211158 30781 29668 -108993
23150 -359029 15586 129784 89254 185174 50476 -175556 378159 280389 -80878 -38361 -47774
23139 -47774 -192109 -208387 -357208 78373 317861 140075 -92978 -92260 267162 138481 77700
23128 77700 264109 -245614 194469 -34287 -24340 241097 583 53457 2472 -137817 -238700
23117 -238700 -60119 -186595 2923 -286468 26247 336831 91040 -115247 -160607 -59590 261655
23105 -116311 157317 -222253 -108498 -72875 140453 56425 -25766 7014 165865 72900 176815
23094 176815 13877 297063 77601 -234349 -64176 -35344 -66866 -69809 198444 178588 -30781
23082 19353 -61367 92678 -67132 -228737 -50694 -132152 -306359 82279 -129953 -300043 154969
23070 57785 218815 12710 65877 135864 153343 296348 -64852 100252 230716 189269 144216
23059 144216 -288411 207809 33219 110194 -19016 148138 -105166 -59891 4432 -143877 -72185
23048 -72185 -53940 -345290 66128 -144891 21952 -52445 168339 -280824 -170378 -86478 278549
23036 76665 -154097 -124473 36012 274681 -111856 -123647 -139321 116453 116688 12515 -31911
23024 38038 114298 36571 21943 184887 -81907 145848 -207337 57065 -58339 -44619 -40634
23013 -40634 -75299 -156886 38228 30637 220241 -21323 -32336 -208629 -90093 -5259 91678 5177
23000 -324814 -146615 -174621 -70031 166043 290642 -291939 -346375 -76774 268603 61733
22989 -7476 -24954 -184169 -289548 -80426 -401652 18458 235058 -74305 -46282 -154343 5336
22977 -48805 -41986 126257 134545 9713 -149131 -79132 -130762 57609 -98333 -277993 -17105 177659
22964 -48122 32259 2431 -57328 -144795 -251299 108858 -279893 242209 -86625 -154041 -181881
22953 -181881 43230 49047 -43454 -24514 -129495 7679 -545180 329470 70169 53821 67798
22942 67798 3330 -48277 -27798 92042 153759 -99732 64064 293054 96750 -94600 18659 110520
22930 110520 304921 102361 73529 85538 30322 -107714 -241948 -247675 -280859 -224500 45043
22918 -259263 -3261 28766 -196023 56865 -285332 270967 -467091 117150 -142779 -422680
22908 -422680 -56717 -337729 391013 -99960 -196678 -240346 -76411 -144648 -72081 -139602 -276186
22897 -276186 217681 137106 -204399 -169318 123803 -140461 174355 -39949 -260717 96452
22886 -266463 -155846 -157980 196195 -194996 -22362 329804 -243033 124220 -24056 -67221
22876 -67221 44024 7600 41761 -92308 213862 173838 40357 -23723 203241 -23879 745 -209603
22863 134915 -67361 119262 -202598 89188 87147 -331111 -103081 151382 -70313 -231599
22853 -231599 -264204 17684 159307 48981 55711 -91201 47065 -44663 -93848 -184640 -219547
22842 -219547 202848 58165 -9473 15624 -40063 -43410 -35574 -11828 -207552 -40425 772 257978
22830 257978 -130322 -161389 62558 42102 -149191 161744 -268482 -90079 182182 -272073
22819 -231346 55478 -156871 -31404 -10350 -66049 -16374 100418 87357 317861 -284021 -231467
22808 -231467 102796 112125 62093 29205 -25704 40045 60845 93945 -22719 -155222 286470
22796 144357 219562 196662 -115310 -27332 106675 79478 -243165 51733 32648 172707 -102476
22784 52176 -99684 -128045 -93458 -66937 -63500 21965 -114568 -371416 -77875 128333 -402078
22772 -206347 25800 -183953 140698 123246 -108090 -143396 -327441 -25368 84351 131112 -27903
22760 -76109 -29065 -99510 -112001 -341189 -54798 15182 134319 -81365 -10502 -3185 142045
22748 343843 78482 178709 59114 -176060 228651 -158817 -20013 41075 -36814 76074 136713
22737 136713 19173 -127858 168105 -340565 30316 101256 397202 87059 242654 141478
22727 141478 -26229 -7230 -256520 -270438 43677 110187 -241334 34538 -257055 380993 -45249
22715 -284445 231519 -202007 194803 39424 -88126 -55888 -156457 -251246 -257014 53429 -172208
22703 147145 -387832 -202755 36834 -127322 151243 106572 268448 -235239 327161 -20214
22692 39565 154366 9700 -252201 -143313 238947 -121358 -204216 -550616 -36250 -19806 -21498
22681 -21498 304699 -71761 -16100 -528497 38308 231092 263934 48018 39864 226070 66652
22669 -285336 -308012 -128381 164237 -105993 -53650 7423 -137545 160518 -64794 -42247 -103334
22658 -103334 17823 94916 55561 -192314 77126 -81282 -159427 3412 -20861 -48495 -241865
22647 -241865 -40726 -332305 -41304 -14345 164212 -384100 143609 -10325 -20915 46384 -56257
22635 -40240 277366 146061 198713 55975 56719 -168542 -33016 -316720 -77181 -342414 -37882
22623 -18068 72316 -356764 47141 99415 19644 214185 276898 -204289 -9915 -41079 -251021
22612 -251021 -156716 -7445 -138948 146520 182071 111354 -102531 -229009 -198927 272726 -240310
22600 2526 11419 -292886 -99654 66354 71202 105044 -52735 218333 -33654 124972 240396
22589 240396 -227381 -159498 27892 -105206 -33666 -227159 -179574 200923 -133419 27471
22578 316614 2894 -117518 -320199 -6502 19366 -14438 16443 -51191 -26215 -91393 130683
22566 -120388 -1791 -233660 -416760 -183260 -67049 -114636 66672 82797 -6789 -28849 100706
22554 -106858 121513 34097 194434 9254 -289325 -91807 43671 29670 83967 193937 141416
22543 141416 -188338 -136498 -79253 37432 47152 97193 65656 -47002 112566 78311 35327
22531 -366211 8058 36691 62499 118285 186068 101531 -78060 -49590 -203083 -26702 273274
22519 195141 88752 -76981 -32688 -9204 -278521 -134390 81996 -244528 79443 162046 -275059
22507 -15874 -155492 -54675 -75997 -61534 -276250 206019 -14476 49527 -203800 129391 28434
22495 82195 32198 -30130 -277409 197838 150141 -162341 -155369 36587 120856 -186683 -76666
22483 157627 8493 121735 -54286 -216762 -281773 -251279 -80281 150830 -2498 197056 -493804
22471 139626 -22822 -62894 -17827 -137068 -153157 34844 -201926 185483 -216662 -179339 -4331
22459 -117549 -41613 -47198 -99973 -293793 -436282 39304 -65723 -157147 -145968 99916 -27659
22447 -169826 85998 80751 75748 61680 -23476 180351 -128316 20384 -283841 53550 -5773
22435 140661 92422 -106100 -357684 -2504 218903 7601 4344 158153 -108112 -146199 344787
22423 41658 -184874 459814 -67887 188635 -32402 -35769 71776 -192944 231452 -230099 81062
22411 -58476 -138258 -15997 74300 179811 -43185 185152 -87389 -108924 156024 -278866 -256562
22400 -256562 -77490 -55821 43251 -364643 -270344 -42387 -105197 221379 -156918 -44807 -126419
22389 -126419 310076 42314 369373 38203 -139739 -121086 -42663 -134342 -294969 -139688
22378 -258963 205953 -256365 -193135 -78510 -71640 -99407 147088 132816 -156803 -41332 91242
22366 -123742 -341414 199146 -145698 -132032 279367 -234444 -189898 -22722 214110 151490
22356 151490 -54005 -258342 -153186 -24695 39554 -342079 -184576 -10670 -31958 93223 50553
22345 50553 -40863 265841 -248079 -69424 -71242 127374 149748 126118 96205 -57672 -22390
22333 -15400 12205 -355805 -211473 -226282 -155235 95943 91803 72732 -158415 -273847 -154939
22322 -154939 -74354 -222956 -110525 -186565 7096 45816 -10577 172226 5369 -214149 -26561
22310 -275914 4876 -30702 -50740 -11961 301699 25547 -77369 161684 -60838 58891 62297
22299 62297 -96821 -150055 -239332 26606 -45340 -196587 255768 156033 251432 -29965 -23512
22288 -23512 91039 -195957 -48787 132389 76692 27049 -208176 168075 -43344 81719 14525
22276 240002 79219 -101941 -156487 -176822 -293930 165148 144726 106586 27410 13101 -152524
22264 74993 -54719 12507 -166284 -24295 152494 16893 -95660 -78619 -213234 72249 184155
22253 184155 -65808 -44117 392787 -323065 -237682 15009 -194907 -174305 49851 -320705 138193
22241 -54406 63231 -78556 -170972 -67747 63500 278041 -272317 34739 44815 -204813 -184506
22230 -184506 -79538 -197356 -177259 2801 -338374 -16593 66438 154313 131817 -2962 109250
22218 -172974 -139500 -39664 -9983 -33127 -87952 297525 -13240 -27684 261142 11188 -107428
22206 267718 -103979 77739 370549 169547 -115031 261552 178432 -285528 68159 -233382
22195 36004 135665 -2753 -56328 -186914 49962 -87902 -14650 170572 -104692 -67285 -150242
22184 -150242 127233 9091 -81009 -131178 61562 4720 148490 -43954 -241585 169081 110911
22173 110911 -12610 -27910 -288525 -230514 -135680 366495 -277214 -9728 -127367 -66156 -80629
22162 -80629 51746 113411 190691 -200515 -540322 62582 165998 -69685 -165375 166285 35246
22150 -52750 -110588 47043 -91030 88067 -82036 174941 -443118 -42609 -227236 105458 -41550
22138 -131916 -229517 116290 158204 -38900 106449 160145 22034 -100821 -16579 -14090 -78398
22127 -78398 -50625 -129377 60473 289008 168049 261025 407464 -105017 -178167 -282411 21503
22115 -239524 237020 -105207 -29173 -165003 -312607 -135598 107034 -47395 86007 110816
22105 110816 -97622 -240381 136750 7157 -109435 -57072 49760 -146690 143675 18609 95788
22094 95788 -161140 131760 -167774 -39793 -70440 20757 -108813 -54155 -125292 -26388 148417
22082 167797 761 82119 91367 -125157 -53521 -192692 -316093 -54978 38510 231858 -19215
22070 12574 206008 -47966 73357 -196738 127782 -64522 79926 -322274 -290175 -170791 265933
22058 404332 -104619 138813 300343 115099 -58324 -5648 31103 -13231 25640 -275826 -61100
22046 -32081 -324753 22883 -261437 14526 -15994 43876 -43339 -99322 -102855 306761 -320713
22034 -37920 -68618 5579 -74678 3103 -456218 -130083 -60511 -211086 -185249 -322914 -372651
22023 -372651 267906 -220842 16369 -133839 90291 -33608 -68681 18908 -556487 387377
22012 -28531 23066 -47974 83586 -270256 -162469 -156690 142103 87195 130356 -80033 -215591
22001 -215591 30754 142826 128761 -366122 13638 -273257 -101678 -48750 13837 -62913 265978
21989 97550 5825 15837 -11691 61168 24790 -11986 34015 -124069 -330727 75093 5568 122350
21977 122350 -26103 -217325 18354 158748 -285235 86201 155216 51212 -141451 -408975
21967 -408975 78815 -144758 62463 121450 -45774 -43351 -131694 -111517 21457 -146082 58882
21955 171677 -169078 -5755 -186209 -34731 107369 63440 -72778 -45841 -310151 -39493 -123619
21944 -123619 14951 274273 121677 -41528 -126145 96573 -153563 78397 1129 13614 86083
21933 86083 -256833 -44656 -59332 8942 451023 -51989 -39629 -259598 95722 -34798 191039
21921 -191282 -108848 -63358 98341 -31547 144519 -56312 240970 -44935 -137541 48816 -234796
21909 138601 -87915 59289 112855 41183 28985 140129 155529 -49230 142650 -122357 3395
21897 247646 212553 159918 -62923 -79571 244925 275111 -170136 -84383 -59128 -10212 -165611
21886 -165611 246241 -144383 9382 70323 -114187 89382 193083 -202683 -464460 46929
21875 -20027 115560 -353406 -491186 -108892 -91108 -289 -199368 196923 79799 -42541 -188823
21864 -188823 -255002 -61486 -128149 -94044 320326 167284 -42423 -24107 -50042 128783 62947
21852 -38825 -297435 -108210 -180304 -37503 -36727 -399505 -14416 -11202 -11564 -125055 279011 60690
21839 -211598 195264 -68230 110565 -451743 -26307 193434 99154 -218583 60594 -55936
21828 284659 -218671 -163078 -67664 125938 -118444 -82466 132913 137739 145135 -528578 -311344
21817 -311344 142934 36287 121271 -30654 -130010 -8028 115800 134200 -414982 -223688 -19352
21805 -228525 -376214 -69725 -221331 121058 -249870 98235 -3215 20329 27929 183959 -364312
21793 -391122 -158223 119182 217287 -249827 -79131 373456 -179875 -68892 -172339 -71244
21782 -56735 -28866 -253227 100699 -150272 76574 -40234 219953 212271 -104934 259843 211237
21771 211237 -234322 119253 35503 -99307 187928 -263492 97439 -107282 13902 -48342
21760 49571 -240327 132009 -154604 93253 -235821 46849 150586 -128834 -52684 157587
21749 -374604 -142086 -26750 -37002 -217260 -2388 -139909 -303820 -97708 -414687 -295463
21739 -295463 -206271 169643 -72009 -52710 -67224 -137179 61032 155011 -70368 153298 131937
21728 131937 -273570 203708 127965 195735 95181 112947 -128590 -129679 -54809 -66329 -224292
21717 -224292 -150840 85774 -187330 -136376 138503 104667 -85285 114028 -345371 -424615 -444097
21706 -444097 -269714 -273273 138702 -314926 -27998 -238396 27766 -22537 -43739 104187 -72528
21694 -16996 317644 -209131 -41313 -148079 -251655 -202009 451224 47829 -19091 72049 86817
21683 86817 -171619 218998 -1905 -178746 172775 23091 -295034 61058 37095 -74858 79630
21671 -21888 310393 249212 -171868 94244 -280222 -206949 23798 -423978 -49931 -41375 -1320
21659 -222933 61592 181647 -40552 126843 -96619 -64481 58482 83630 -153164 145335 -199811
21647 -21040 20566 358292 -311257 30004 -190542 -272961 129635 43158 -119983 306126
21636 126939 70374 -475492 -287308 -151119 217142 33834 171334 -413203 152992 -220767
21625 -119309 409810 -282296 10995 -181490 7415 -133189 -119635 -368976 143996 -243963
21614 -102425 -37848 -123894 -143638 178308 -84999 355588 -84532 -15485 -7795 -132189 58893
21602 -290711 -262004 -70250 -188775 -128475 -64299 7661 139867 -113828 -150284 74279 -172622
21590 -54669 -316294 -115364 327954 -31190 -43825 171800 -123372 -69256 -43724 -107257 89401
21578 236616 399645 -194166 -6420 -116744 326886 15514 123084 17759 -504983 -244640
21567 -4395 -167273 -50560 82727 -227025 -71309 62277 -258219 133748 132451 44711 35681
21556 35681 5283 112689 119825 114660 -194571 -41707 -65605 -133231 22404 183999 -136092
21544 110744 -17510 -1052 76500 42586 -645417 -172061 -57827 284142 -299118 -87997 214669
21532 -196736 -45871 53871 180149 -55219 279616 -45699 -228309 2579 56040 -196662 21807
21520 -228854 -193867 -184125 -501104 -188178 116965 -30548 -279341 302885 24832 90506 -140967
21508 -182211 22887 -333675 -219163 -77782 -164109 -294934 -146729 81129 99877 -98047 -142996
21497 -142996 -156887 48989 -206992 21919 -155590 -480202 86676 -35889 -70747 154567 36960
21485 -25775 17770 -173483 6339 -141647 -66433 -158554 -237276 -29214 192185 -135064 135927
21473 -335490 -50247 31137 200977 -36034 -14953 -58348 -391134 -273637 -210482 -112786 338160
21461 -43322 -285480 -49972 -19262 -227424 116473 -78228 -10990 183856 -140874 -229405 -30127
21449 -296087 -178592 236776 -281256 -43182 67899 -255745 275610 -31405 -39831 358339
21438 280897 26057 172472 326808 51398 97675 -22512 192843 22418 -231618 4414 -54603
21426 -215147 -86431 112619 -87325 -51358 181382 125203 -22994 -155847 -132719 121106 -203243
21414 -155530 44238 135363 219103 198251 195130 -317544 -70664 -92173 -84469 -198589 -94890
21402 -110200 78069 224102 14559 -247362 -168430 -288046 -90950 -123638 -37934 -95788 -153880
21391 -153880 -211787 4411 -64858 29886 414800 -157504 50552 143720 286942 -89606 -163586
21380 -163586 -46063 110061 -28552 3111 31509 -324368 7876 -32012 -247763 -141886 68829
21368 112315 165643 191525 -166269 -31849 -187572 -153832 129174 -222995 17910 -18131 -121839
21357 -121839 -197641 -139154 162757 167220 -113575 -115982 -186566 -19131 -10113 17790 -64356 109643
21344 8934 -149145 13880 -137042 142762 -252956 -111867 -102453 -113931 -192669 95834 -67361
21332 63324 -23591 -225543 310332 -30028 12002 -45088 -309445 -105905 -186545 -162982 -171378
21321 -171378 42628 162129 222000 -293081 -327503 173481 19488 -254639 40321 -230708
21310 -327830 -36137 107764 -265413 -365635 -78742 -240813 -179726 -300485 -151193 -302692
21300 -302692 -154782 19263 -16627 156432 39562 118598 -138030 -162437 -34224 210993 -209137
21288 134896 228542 -26313 -347069 53508 329746 -464745 -328918 43669 -72270 -13409 85984
21276 -34673 -340791 96480 8582 -142778 -24857 -259966 -310930 28656 -37931 -342132 -175895
21265 -175895 58475 75125 15620 -311819 -57285 -94578 80903 -252519 -263402 -124634 -15223
21253 -106828 -112322 -227531 58805 104113 -160358 305027 -25545 -327524 -75787 -157419 -442050
21242 -442050 147353 -70437 -70638 82052 131387 -113395 -189364 282709 -85311 -578128 -371779
21231 -371779 -10742 -78957 -351475 -24547 -41381 -76112 -93607 -41252 -162367 -313572 -47857
21219 -51536 176911 173856 -16662 65425 103216 -243961 -121139 86633 -65253 77333 -103961
21207 -179688 134470 1509 -183871 -436236 -159011 96537 112288 -33234 -264456 -128364
21196 -161099 336482 -57213 -111834 77735 -271024 41155 31313 204457 -53251 -49826 -20860
21184 -84013 72474 -261911 117202 -3871 -115026 164240 -32387 -13782 -193994 42514 -15849
21172 -115908 -252914 -83121 -56996 13928 33196 -5517 202698 -177782 -78618 -271697 -33808
21160 203015 -219596 112409 146068 12490 -47901 -91795 178929 132529 30182 19521 -66050
21148 143623 -387002 -338508 -211001 38170 -65053 -76002 -315057 1100 300291 -307753 -165368
21137 -165368 -352521 35632 -335631 7148 -31399 -69702 -224254 214222 -122733 -409989
21127 -409989 -221695 -48856 -343093 -36098 83971 51154 195597 -148400 -170152 -257253 -270059
21116 -270059 -166130 121071 -78934 69651 -255130 -34728 180828 131843 -118400 -23370
21105 143583 -111647 -86443 6 -99505 -131924 -60404 16258 22503 -116209 60978 145338 -92583
21092 -79159 44123 -65340 75043 -197023 72752 -205434 -122851 5111 -319596 -97590 376250
21080 325061 -34419 -61321 -136374 -302329 290277 16260 23598 -133059 193537 339487 49309
21068 36702 -31469 -57020 -196837 -143922 -285533 -139368 98431 -33147 -282348 86243 -128832
21056 265239 -247664 45978 162270 27261 -189349 197132 -108419 -29095 12691 -118980
21045 399107 -113707 -179238 -64643 -305617 430685 -93772 -32159 -230318 -21878 235413
21034 37165 423 -561315 73661 -226784 -224936 -45301 4916 -2191 223742 -146127 -204977 105618
21021 92593 115350 -216105 98375 209538 -20606 60501 316191 159597 334788 -76315 -66302
21010 -66302 -26491 -148388 77704 -207142 -132769 -267721 -163792 175565 -104206 -83485
21000 -83485 18181 -75707 79079 61187 -198003 -140376 -185656 74841 -77568 -159767 305653
20988 6608 -201653 154639 62056 -459725 116284 168697 -51509 -230642 -104620 -235818
20978 -235818 29813 -164617 -196738 -99570 13285 -87374 -5484 65142 -257768 223140 -155882
20966 143208 56591 99833 -491254 -58070 -230696 -117969 -172474 37653 -85981 -363256 -88955
20954 26001 -93022 70395 30742 -20997 231068 82513 -292436 -158314 -132095 52331 -7246
20942 -223072 -246166 -63058 -209484 228995 69513 -72882 5933 124734 186326 70888 269890
20931 269890 97169 3086 -1257 -223544 -13253 -71938 -71915 -158696 611 270715 30733 -132564
20918 -141683 -199586 -197279 249099 -269103 -76609 2324 -180903 -260109 218136 -520163 -222639
20906 140213 49773 -84618 63781 -247440 167356 -94060 -203694 -272615 -97393 110964 -323653
20894 -291907 -429000 58115 -203330 -192737 -45200 -72394 201379 -126851 280338 -217032
20883 -117808 427663 -61488 -165635 42663 -164995 -24799 236770 39171 -237457 -48163
20872 -117103 -22955 149816 -216340 -135254 4813 2042 -71082 -18177 189993 -224055 -195577
20861 -195577 -185372 -72922 -290236 -180764 435711 -213281 -89914 -106421 -129146 44296 252515
20850 252515 94782 -443636 -57772 -72973 -151193 -152810 -255970 170361 173305 -125250 -87370
20839 -87370 238262 -232934 190666 -259310 -15074 -325322 78670 -88029 -37685 12685 -288277
20827 265349 -188626 -76764 -162757 8751 -92295 -15319 -78485 -97793 320048 -149784 -151916
20816 -151916 -271543 -88968 -123931 125370 -263640 45546 -117708 -64630 -278634 -414880
20806 -414880 -51897 -228606 1232 -116201 -155977 -57149 117382 5937 -127220 4446 -106776
20794 -443222 -168999 -194368 131444 58226 -23364 36851 -205699 38415 -56399 127807 -111136
20782 -209580 -150173 43562 -69390 -28803 -50437 116174 275196 159528 -446850 192758
20771 -252459 -79070 -113593 6397 -120041 -200638 -160347 -75963 243304 -283815 -164847 -186073
20760 -186073 82025 -44358 -164584 -216374 186497 101394 114650 68565 24853 -40475 114618
20748 60790 -30934 56197 -361037 41094 90910 -193884 -79845 202895 32816 212897 113259
20737 113259 -228610 22445 -191528 -93109 -38484 -380923 -317972 61331 -248167 143299
20726 -203147 -252742 -274776 772 -37105 -91229 -56557 208121 -238721 121609 235705 -68766
20714 -146009 98248 -318444 53740 -173269 -226885 -6282 -317036 26654 -60082 -85455 -117713
20703 -117713 58158 -268944 -328508 4933 -59099 293642 38529 -219066 -103628 71100 -208368
20691 -126576 -87099 18712 -214180 -159973 -551384 -145164 -189255 -30399 -139482 -17759 38535
20679 -346263 -89121 134735 -141718 163764 -248431 -203367 -126187 -183110 -463405 -212867
20668 -99809 -27306 -239594 41761 -171806 305738 -65650 -156290 -140925 93106 208418 63296
20656 -174161 57551 225149 -140443 -161769 -64996 -230401 337130 2397 18717 -224964 -121293
20645 -121293 42859 -228141 209446 -22537 -272534 237254 -90565 -41114 149897 -230447
20634 -187195 174511 117741 8507 -99790 93509 -16683 32010 -64065 265839 -139104 -29808
20622 -152641 -89486 -89499 -90597 70755 6768 -48086 -267236 148324 189498 194737 -51684 -200965
20610 -200965 -152254 -566084 -423223 -17203 -30578 117521 -119944 -22148 -52824 -182363
20600 -182363 438 -143961 42789 -442003 126587 78369 -102689 -90605 -173886 -103965 -248187
20589 -248187 -132949 383463 -66670 160159 131134 -66041 -254995 62361 -285625 -123949
20578 368892 375783 299111 -121876 68938 242825 141296 -233576 -154990 239501 -17795 -176480
20567 -176480 135103 -1720 -303757 125176 -75591 8906 -43058 34955 99512 -184062 -345425
20556 -345425 -6592 -274694 -31760 217359 -27818 -166336 22693 -92508 250740 200580 61874
20544 -6119 183348 -22841 -462569 -109283 120384 -54168 -151795 -279232 130668 -176763
20533 -271201 -10825 140089 64684 148710 -62380 -300733 54822 79453 111009 -230592 -84167
20521 -101796 61964 -9434 -70362 -51797 -170017 268798 -6497 157856 -27875 29562 44865
20510 44865 -200416 166768 -289750 108623 -84857 -100702 34452 97353 -2782 -214671 335530
20498 226813 78235 57454 -326453 341897 186135 35193 -169326 -323080 -194300 26206
20487 -127360 -86184 -55075 3029 -228982 -190206 59613 20406 -48487 -5320 7657 -122173 -291166
20475 -291166 1195 -34696 -50481 173496 -21630 128159 104625 -120476 -114635 -37518 -115484
20464 -115484 71947 37668 87950 101631 158208 -27652 -85581 -161956 101050 -50527 436753
20452 -134638 121326 -15069 -173496 -299528 -88697 -209778 52992 -53735 114603 -454408
20441 -23469 -264160 -207939 -4090 -145816 78264 38199 -72040 -102143 -68551 -60114 10432 -120402
20428 53904 -38962 -36215 -284532 -28769 51011 -27486 -118365 -374073 -109920 -11679 -13414
20417 -13414 -62145 124639 -37764 -196797 258559 -407241 -148658 -62657 -55110 -166821 360170
20405 -121249 -189535 27228 106153 59573 -71832 288089 -223283 11690 -295714 -157648 117398
20393 -35426 -272934 -212248 -2780 -151067 -87210 -351538 -200539 -77515 -172083 191357 390774
20382 390774 129343 104194 1111 1293 -26337 -156641 113914 13029 65877 88837 161262
20371 161262 104539 -130866 -242278 -170988 -56514 -7365 -64223 -35038 95601 -208334 -395409
20360 -395409 -244329 1409 -151970 -264171 24911 -77993 -129165 109156 148357 338411 -144200
20348 -101275 23382 -92051 155981 306485 -167817 -46227 -114157 -197009 252945 -83168 9624
20336 188181 -21346 -69962 283948 -68399 35726 97141 35361 -71870 118690 -163706 -156968
20325 -156968 -193395 -186948 -329222 275215 -191917 -213875 -187664 -33368 129697 -149545 -221431
20314 -221431 -300335 34292 -9260 -17718 -170561 -47773 -302604 218543 129163 16643 -25356
20302 -268745 -78112 -169411 -29992 1446 -223773 -226849 -204665 162597 248824 195186 -185673
20290 -106384 -146409 -115041 20669 -49322 77414 -269402 -202126 174191 22212 98703 -21531
20278 190883 -297195 -260166 90637 29647 -29388 -145685 377440 -158678 -155750 -282250 -175711
20267 -175711 -116868 -249676 179118 178864 120569 -52187 -48559 -208367 -36455 -228130 251533
20255 -135196 143694 -109174 15132 -115979 -36457 -14788 -15330 99381 218905 189897 -11207
20243 -213457 164851 154007 40397 115793 -199702 25612 163361 18639 -236507 109348
20232 -20845 -49738 -48668 -324139 52814 119481 -41396 -132511 -271046 310289 263203 -417202
20220 -27760 -73174 -11379 453792 -320233 -116191 -191276 79834 -189064 -12856 -199451 180151
20208 -83363 -134519 22150 207520 129762 105485 74778 38105 -260085 130052 -38897 -339746
20197 -339746 272255 98803 -13927 -86970 -208995 33808 -186404 -90555 175301 -300304
20186 -29424 -342289 -350542 119536 -82074 -350976 126827 -183018 -107899 -394807 -195521
20175 11416 -31346 -260393 -74023 -249884 -236141 -25907 96100 238315 -166 -262157 -244402
20164 -244402 279344 -398032 47202 -152369 -106376 -154425 -204337 -266854 -335692 178573 -187047
20152 -25418 -1202 36785 -340903 -57823 -266981 -18547 106740 57356 -33505 -79045 160825
20140 17005 25267 -35822 -109914 154862 -47746 54567 -123941 -172589 -199725 39170 -70715
20128 65189 -250176 13967 -162076 -31427 -28614 82749 110035 -110059 -24238 -351226 3938
20116 -41536 -67733 -67978 14684 -361336 -221617 -33177 -68684 -187301 37096 266960 -272845
20104 -153714 -23004 -43733 -286924 -233017 -75443 396558 -415630 -40749 -57451 138223 203885
20093 203885 -78795 -24807 48609 -146761 176078 154480 -16754 -42454 122179 -8148 -30256
20082 -30256 -404543 -51182 -267564 -8382 33819 84418 131219 3456 -384707 -289953 -169379
20071 -169379 263338 -66529 17221 -284580 -21439 -227195 52860 -281602 140585 32239
20060 8807 -215110 -245194 88735 -41130 -59368 -280162 10800 -184209 129210 -174470 198508
20048 -2943 225943 -231921 38381 123009 27408 -16299 100512 -117878 -195681 -319842 -85510
20036 237544 -318537 -179018 -42269 224608 -183876 -2376 -192363 52795 -81567 -107425 -123729
20025 -123729 81390 -50783 353383 59565 -298158 -87169 -276539 -399962 109090 70727
20015 70727 5763 194979 -119607 83751 -115622 -122253 -82965 -151976 -355338 -405224 130536
20003 39074 46047 -86857 -45787 -93229 -248571 157388 -102494 -74114 278937 -51390 81464
19991 -43515 9648 -245561 -158298 -215529 46655 203184 239388 -477115 153820 99742 -60815
19979 74115 -102609 -104220 130297 46755 21434 -136350 -40853 -34080 -15185 -145592 -72100
19967 -135329 174834 68121 20365 -7633 -14178 296137 273822 141767 217084 -183846 -13263
19955 -320978 -207954 98026 -110083 153876 67969 125382 -154517 -18642 -307236 -92877
19944 -227644 123242 96005 -237121 -156390 -395695 87377 -51380 -145600 -31726 -62992 285192
19932 -185012 63934 116946 97350 24009 361733 153020 -175860 -112760 -49362 -177953 -212624
19921 -212624 -120219 -226049 -147237 -195176 -227484 7281 -340619 241545 104534 -148345 -100586
19910 -100586 20220 -239280 -17784 -681 -3284 -41427 -103611 -105640 -204335 -107850 29274 -178140
19897 -256335 -162068 -323018 -73799 -126964 -33420 224804 -152760 -112071 -231556 -87280 120730
19885 -408688 38507 -229418 35506 46359 -49258 -209917 -115076 -61475 -126893 -119080 -113193
19874 -113193 -241512 -259587 -55003 -196522 -86287 -253154 128247 -100622 180107 -16815
19863 -118263 175823 100970 17728 -146938 -20436 -315384 33152 -50842 -10539 -170907 -61549
19851 162430 -84840 105591 -277073 -96412 -11962 151536 -84836 -159429 -202698 -193995 -75602
19839 -363122 -284319 2245 52540 -11046 16276 -48319 151556 -74487 -144906 -86548 92586
19827 -36537 -8929 121363 -262084 172475 189196 -4391 -118138 -356248 -79666 -85551 115234
19815 -125428 -18638 -144982 -245090 6907 -767965 10967 -276603 -59565 -137620 -280097 -55095
19803 82410 -443357 37484 -415950 78034 -35073 81004 3469 44743 -47 269364 96864 393263
19791 393263 -171092 -287429 -183880 -147688 90034 -200098 -109063 -15890 -378888 295294
19780 32855 121373 157818 -296242 -38246 -181652 -213023 -403590 247685 -48405 -135146 -53447
19768 -47770 -164637 -197777 -93629 -375242 -88993 -65385 -285628 17 129983 -116030 -56404
19756 18430 -408 36689 94532 -182098 -74081 8349 18872 68203 -287579 87305 -332242 251224
19743 -156684 -94726 -40107 80764 104327 20981 -64425 -170033 -20171 55712 -66705 319841
19731 87244 -323406 -131235 116247 251544 -73973 -72292 -206021 194661 -113884 -5190 -62731
19720 -62731 -189463 101343 -198382 88567 27231 -91124 -219779 -332343 -95443 -106101 -182144
19709 -182144 23598 -102687 192850 -323396 -263407 130128 27755 -142410 -57607 -220217
19699 -220217 -193107 -180558 25680 -29536 -232327 -95417 520026 179696 -84435 27013 111707
19688 111707 -201217 -392216 -27165 6867 106540 143253 -173235 190809 -135449 -82526 -42416
19677 -42416 113439 -278206 62196 101690 -123659 -142073 25364 222954 -89247 -83126 -340544
19666 -340544 -693475 86945 -24737 -208941 -248531 290910 210116 -33816 -139144 -89282 -28899
19654 15681 -155232 -216590 89453 58195 -408695 -113279 -50740 84449 -73265 85750 -210351
19642 -93854 -174932 88899 -115498 296050 -175666 153439 -70794 -390242 -204023 58839
19631 269277 -157331 -76448 -473715 44130 49943 293581 -135166 118653 52944 -146728
19620 -456094 27795 -209950 -2127 37663 -100324 -353214 -128020 -403961 382467 -95239
19609 -218987 78494 -223117 -9001 -176907 -24979 27094 112137 -225333 -60969 -51300 169969
19597 -273390 -326089 -128541 22116 -12950 -176394 -83495 233647 58256 -3140 -151161 -39156
19585 301701 77080 329451 46689 55196 185879 83793 -87671 43749 -352947 -435812 -110641
19573 -62247 -124502 305735 -37376 -11454 -114 -164254 -65149 -386875 -335598 55741 -132574
19561 -123827 13986 -136476 33104 -158444 121133 -177467 62609 35113 -272460 -8025 -275961
19550 -275961 -173333 236053 -379504 -96074 147808 -74306 182966 181193 -55104 -98083 -224926
19539 -224926 161810 289412 -146402 -23917 -350596 136261 48652 -54421 40065 12821
19528 -148270 343701 -127437 -206638 -104447 -337230 -120481 -360241 -155889 -291094 -197154
19518 -197154 166056 -122679 -48109 286927 46465 -114381 323997 -5493 -28347 14431 -173907
19506 -14385 1244 -8888 -41554 220574 -106852 -141115 -137237 -88059 -139593 -87037 182684 -283112
19493 341296 -193665 113219 102371 208514 -125099 17517 -263790 -401525 -372532 180375
19482 -254517 -115926 -137001 84660 -5355 -97996 -169975 -14584 -124125 -44343 -151576 -56848
19470 122218 -104513 132094 -260987 -265037 -176816 286998 -207448 -389555 -77168 -65973
19460 -65973 -83852 -8649 -108782 365000 -237621 248047 25806 -64682 155080 -112242 59085
19448 -110291 -120107 -363096 -79049 -48215 -101300 -165379 -84155 -186224 154047 93139 46241
19436 39717 -123822 -121216 -179444 -151687 -17734 47004 -34764 -22749 -118225 212047 -295033
19424 -315923 -255119 229412 -61628 -387080 -142915 -49509 212048 -114791 125565 -2250
19413 -41612 125558 -180701 -105712 148976 -95959 97757 -10584 -52508 -7528 127378 -124686
19401 16660 2256 184317 -82955 2387 -419994 -111232 -372424 -140093 -129563 -301822 379101
19389 -65706 97443 45125 -315026 130515 -356750 -63649 10698 -171165 -15386 217205 -145096
19377 -197195 96577 -199504 -89888 148169 -62065 67 207707 -250390 -297797 217276 80594
19365 -281390 266738 -79046 82078 89916 -59405 34387 -142546 -139479 328927 125068 -168816
19353 -223713 -187848 -5588 -193707 64253 125927 301160 -116304 132192 88212 -405900 223785
19341 -193502 -80988 -204124 -91616 173468 -111732 94523 11030 -51983 -278510 -173536
19331 -173536 137589 150092 -68473 -122591 231733 -94909 -185961 -79463 -263291 208065 -192046
19319 55936 43571 285565 182800 -72620 -25099 -80124 -191725 -138379 60255 -60015 -9789
19307 -103506 93206 -295848 313569 -333583 163293 -73925 -8788 -243598 82721 85203 -23036
19295 -213273 -21691 -236452 231803 -1130 -161086 25780 15892 -66839 -72765 -126414 -69928
19284 -69928 41023 -247846 16770 -274682 112805 -119792 23097 -299044 -168178 134011
19273 -160488 -69334 19257 35549 -419160 -257186 -119201 218942 -184038 -253131 120690
19262 328736 -278188 -1027 182548 320386 218095 198295 -266405 -178618 -13607 47796 45692
19251 45692 -369926 -67911 91129 101154 -123786 -86219 -15837 -111398 -253843 -8195 65935
19239 -105171 -93120 22366 97569 834 142299 74361 130176 -174841 160787 -359796 -57585
19227 162657 -357928 162010 72925 -191767 -215844 -8244 266530 -28152 133341 -282550
19216 30596 -168331 69558 -181961 -42878 -139322 -145145 -158551 166323 5461 -29605 88797
19204 -124181 -32304 -308551 10981 136469 -63190 34049 -55123 -218621 308787 164735
19194 164735 -389416 -261719 166794 109211 -361913 -36382 -18579 -436643 -192789 -3035
19183 -151170 -308201 -36655 21898 142634 313 -51903 188955 -593740 -415887 -167868 80466
19171 -106671 -202992 -121737 55957 197558 -165166 131993 -191579 -196218 -147955 -74626 -862
19159 -125336 -105541 -133534 -33787 -332048 57823 -7351 -184334 -486718 -330202 -194494 33142
19147 -105958 284041 -195040 -129323 -304519 -208298 -307248 -67024 61305 135760 -53027 11653
19135 -16470 33331 -198868 118493 329543 -330688 -191629 33989 -175624 214324 -56170
19124 -165540 -67082 -274280 -333047 -42965 -79267 7418 -217794 -243598 134339 132466 -308365
19112 -289348 179090 -15822 380718 -194229 249146 -87659 135837 -87062 256301 -286345
19101 -127427 -173273 34167 -84626 -308296 -212553 65329 -368521 -51830 -306532 202274 99482
19089 104384 -47447 18218 249320 -171579 82248 -365050 -131513 41368 -16335 -107941 -227350
19078 -227350 43440 -16953 -94139 -54043 -202849 -168158 -171045 213647 -101175 -48161 -114571
19067 -114571 17758 71073 -169672 142328 54434 123262 -221056 198815 260378 -144292
19056 134499 -263760 286234 6933 92926 -223032 -157398 47421 252060 -3786 -179178 128053
19044 -71880 -264154 195533 -73628 -148339 -48344 12549 241163 -277017 -87417 -492431 -115074
19032 307529 56335 15489 14042 77991 -72837 -37307 -50183 -116308 224898 -52454 300436
19020 84468 -105760 115644 41552 -474236 115010 -376845 -300250 26763 -122491 18000
19009 -144808 -57305 41825 24926 -118845 154629 161671 -272554 -19792 57392 -221390 -92952
18997 -42056 2412 260895 30524 -22756 -181874 -129954 143797 -7254 -240672 57648 -60352
18985 -295514 -81491 -74700 -225280 7009 51363 74544 -366564 371579 255703 -98928 -107499
18974 -107499 -340439 54091 -224565 -28686 -103551 166458 -365481 84219 -205180 -108606
18964 -108606 -400385 -366969 -162308 81518 108737 56633 -75466 -340653 54542 97968 -244150
18952 -46995 -353610 -92481 239398 43743 -164142 -237724 2538 124693 -140703 -46648 -31528
18941 -31528 -49595 64325 375288 361045 472899 -90028 180112 -186125 132080 -59162 -31406
18930 -31406 -40504 -345467 58554 22800 -145417 -25495 -24708 -196275 251035 -192078 -41740
18918 -253663 350142 -19681 -160887 -95320 -25796 -140448 -80956 -313636 -69151 -335459
18908 -335459 34315 122450 28515 233021 45147 -232738 -174263 182564 47300 -336084 -32287
18896 202099 -75721 20048 162653 11726 169792 -208375 -191859 -212329 7806 -59834 173534
18884 -155996 71490 -157877 -98671 -159659 -197407 88307 -130643 156068 -349604 319718
18873 -36901 -11347 1802 -125550 97393 -127358 -109916 116014 -1425 17131 -43878 176159
18861 -53370 164931 57057 154196 -261675 -73147 -168187 55928 -218794 39733 18068 -253193
18849 -94979 -116095 -125014 13105 30751 181746 200960 -235734 227938 -48887 4876 -265410
18837 -264280 -102627 104144 -247905 -22766 -205736 189377 69433 112219 -165594 -197112
18827 -197112 246122 6386 -28363 186198 -411266 142866 -44534 -132457 91771 -57427 196844
18815 13890 -31330 149353 -41042 -87582 -35546 88258 -11432 223155 123861 -49969 160977
18803 -195410 107038 -47248 94812 -196049 256843 135038 322489 14653 163337 -196941
18792 -292106 -158765 -209044 -14459 259804 -18681 30157 -147868 -193658 -282157 -102920 -98836
18781 -98836 -200667 -35200 -11008 -384211 -33192 -136608 61773 -125491 282919 126642
18770 221910 -209788 -130103 -364918 -229965 225435 69189 137014 -213866 -153521 -53666
18759 -183517 176573 44544 -18216 -136364 -60077 81471 99873 -277996 -269656 119217 -1338
18747 -195266 182284 -253451 31724 -84811 -80804 -60568 -79401 386667 36926 123746 -313906
18735 215417 39244 -172068 139516 29091 108343 26148 20144 -325040 90401 44085 120718
18724 120718 -119853 -56388 -197537 24130 -54359 127445 -230160 -242671 -274683 33410 -63741
18712 8696 103457 -265970 5354 100355 -254375 78339 106612 -240883 236704 85131 -110925
18700 -340331 -24085 93208 27565 -67170 49465 -310513 139018 60816 -128878 -465355 -256304
18689 -256304 -54763 -27881 -229593 -366941 -322205 108497 195525 -216985 -349309 35474
18678 -35403 -414449 106661 -110246 -208105 -326362 -8719 -152476 -54949 -199164 41453 -47891
18666 -23070 -209378 -269922 -7723 -82530 -329098 63456 -199457 -9124 41181 21586 251191
18655 251191 185438 -53046 -7342 -161123 56274 -330320 -265104 -108910 -342893 -258910 -147613
18644 -147613 -291806 129568 -308941 126446 -91366 -172646 -159593 -132513 -219283 -124989 278607
18632 249096 106114 -120730 -334589 -247677 21044 -94061 -182136 18422 64116 -199009 125535
18620 -76073 -281276 162983 66544 390696 133163 -150537 -329193 13953 -3072 -256158
18610 -256158 -79521 -219480 -34151 306093 71282 -216375 -129468 53577 53432 176249 -129572
18598 -178728 11698 23115 132697 -80618 -332682 87086 -100598 34841 91440 38744 -192319
18586 -191764 -202389 -97725 -90240 -71634 30609 89739 -110152 -5818 26521 -84674 -34124 -147804
18574 -147804 -277385 14108 -36908 132452 6866 56419 -18321 154764 282999 45017 321651
18563 321651 3157 42880 -93887 -223192 -34849 -294863 230410 32058 -166526 -132840 -17665
18551 131327 214389 79512 68624 13499 -114223 332707 207002 -149278 -23375 -77413 -209267
18540 -209267 185113 -165357 45209 166192 -71983 79614 -161594 -90237 -332864 -42112
18529 -20605 94103 -116419 -95816 96325 -224557 -119896 -176650 73946 -92854 -9297 19055
18517 75464 103461 -171966 -191140 -8631 -306394 -47356 -111177 30133 -163345 33486 -52774
18505 -96832 304738 -244210 -28286 -226254 175602 27783 -175938 -303727 -184318 -197289
18495 -197289 -63204 -325281 -25714 -348559 142829 129580 -42877 49559 -142923 -261185
18485 -261185 -51531 291576 -179456 -433049 329401 66478 -118637 -113226 102786 365796
18475 365796 -201652 147570 52865 -177885 -304280 62285 -113509 49239 12093 -107365
18464 -447901 139380 -1825 -111861 9044 -116646 53470 94731 -124631 -190044 -141698 -114923
18453 -114923 -122793 158122 253654 -72967 -1131 -110858 -50248 136216 -46800 -263766 74714
18441 184053 -26385 -131549 142609 -79893 -326449 -51974 2401 -64258 -137006 178103 -339255
18429 -103506 -39554 52325 218823 -155113 -189427 18210 -4545 -81741 204329 64672 -106865
18417 10716 -17129 -228983 -42826 -122887 -27629 -88288 -199628 127047 -166772 69459 -57013
18405 -187631 195632 -132314 2345 -78099 383283 251636 54880 -209440 61810 100758 338580
18394 338580 137958 -176694 65205 -19757 37280 -175858 41471 -159053 179628 131161
18384 131161 -317984 -127215 -296499 99113 -179484 50247 -346820 -367744 -134421 -212772
18374 -212772 -189390 -84597 -28595 -37861 348500 -238170 -213585 202103 -380165 -472366 8561
18362 52763 78174 -45232 102867 -224217 56012 55898 -14653 -113313 330985 207823 -262686
18350 49682 -83372 -6173 -239876 279293 228528 188476 -264450 -92537 -124762 -249373 129463
18338 -265541 -200593 227342 -220157 -151460 -122753 239182 107627 242265 164947 -293471
18327 -168131 192770 -235018 362550 266559 -23628 -198455 1902 -243056 72330 10880 -272623
18315 -134384 27883 -224725 59011 -187640 68322 -390370 -177184 -325524 -206364 -84386
18304 -9528 138324 -33101 -188378 61055 -59532 13903 -210538 84826 -152694 83228 83975
18293 83975 -421401 -23416 -124963 -433178 -103439 -98849 -434960 180821 383918 13045
18282 -186763 151259 96247 290847 115632 -37218 -131364 -335205 46961 4376 -54890 -201169
18271 -201169 -209422 -124849 -238589 100559 -199490 144960 7629 -160616 111917 49414 126583
18260 126583 -14830 -218455 -107311 163077 -100935 -208936 -97897 -99821 97561 -200127
18249 49351 83203 -176208 243834 64226 -1223 -55812 -117157 -213617 -53017 -53583 -263651 -245718
18237 -245718 -275898 -48085 120458 90761 -3822 -137629 -17479 -221072 38922 -185661 -107496
18226 -107496 2500 132634 -221899 133020 -153462 4098 -238995 -180939 60772 -70618 -417848
18215 -417848 350973 -58495 160112 -158997 -104912 -132281 11469 240114 -9732 65975 48357
18204 48357 -30039 -224166 37585 -265171 -98008 -210761 -407821 -103439 18161 -58006 -269030
18193 -269030 28936 -12921 -114910 -95100 -148915 26211 333588 -18932 -101264 -10445 -275070
18182 -275070 -49723 86462 93125 -173635 -466537 -38568 -52948 -168512 3233 -151827 -74241
18170 67055 265640 -308041 -276017 -83687 -159762 -414665 -112718 -121126 -17180 204933 -24607
18158 -57346 -265904 130687 -111310 -297366 -13427 -57551 -289061 -122261 -35624 -155544
18148 -155544 133540 49151 -286351 -149862 108165 -198689 -46325 -34107 -242015 -27669
18137 -199280 -260935 -188267 364445 174600 -90906 347116 58444 27599 -338968 -210890
18127 -210890 -69794 -110882 166841 114563 14730 178882 153545 -139181 -253311 -198164 -300515
18116 -300515 146620 -175785 -298233 217248 -125358 -299864 -215559 -164224 -85069 -129309
18106 -129309 -128080 -446109 19443 426502 -167092 15171 -361339 -118169 -402757 118527
18095 -202957 -131321 60588 38413 -74621 58386 -354382 -11424 222531 99922 92522 79876
18084 79876 -103368 238518 -181999 128778 44763 -1426 194193 156328 -72915 -86550 -233080
18073 -233080 48848 20413 -141870 -209436 -40129 -49624 19837 58069 -93764 -106674 -57455
18062 -57455 -181876 -8491 -141449 -215487 -146768 -39205 -22560 89894 -376095 201151 98996
18050 184673 78962 -1028 125169 -232570 93121 -294479 162953 275557 -47518 -211428
18040 -211428 281543 -211872 -45640 9396 -204764 10266 -158437 135415 219238 -235618
18029 85348 -237496 -145703 59342 -97126 -130590 232506 -4443 219385 -44935 76036 -8031
18017 -40769 -210063 -10361 -139134 142656 165267 -47708 137746 4540 122921 -303160 -47364
18005 -183768 180464 -5432 322187 140548 106830 -16709 229771 -198984 214013 195613
17995 195613 -2087 124446 -361957 -173852 118174 -205364 -83942 -353505 -113450 45566
17984 20537 -299530 97619 -239748 72041 -220362 -202998 -39734 132866 -311568 -155686
17973 -175512 104743 -303846 -44969 -213079 -59517 -20799 64392 -67911 18498 -54769 261513
17961 -388267 53394 -73044 391767 -125440 92956 -145274 -799 57632 -24621 170793 1612
17949 -5205 -74767 -68195 141385 -5442 181616 -113499 128300 -140468 -320619 171137 -270916
17937 -310688 119335 -64465 -2789 99339 90120 -227836 -58951 -165494 134386 13863 -311686
17925 -195221 -129875 -69448 -23983 -74059 -264039 -195660 -69934 283777 126494 -159329 -79998
17914 -79998 123012 -216199 -134105 -178965 -18808 420 154515 -615822 44305 55002 74030
17903 74030 -207236 121318 258104 -287243 207491 114559 -84593 18824 -4450 -215237 -255943
17892 -255943 144445 189451 132448 72002 102750 42060 346094 -42459 -115100 29928 -290372
17880 -373656 -78100 -80244 323439 -260574 -42647 -143086 -17315 -46209 59051 175482 38259
17868 -126398 -66412 10565 -260911 98739 -105493 -27294 -161055 52421 142559 17961 -205351
17856 -81984 39322 3481 15041 172128 -176047 -87922 58179 -43139 132108 137490 -97168
17844 -341687 -234364 -9011 27590 290060 288135 -291425 -140368 76220 -145660 -169540 30154
17832 61539 47830 -144320 -114621 -18003 -33797 -266231 -119979 -217631 138906 -116981 -146504
17821 -146504 -342122 90640 -14639 101318 254712 74201 -52112 -2836 89001 -247047 4351
17809 194176 142974 -91451 76407 130837 56746 -34973 5181 91952 -175536 265945 352442
17798 352442 -244430 -345810 -458385 6142 -43137 115880 -233941 409359 98287 -114732
17787 154836 -102601 115058 -98025 267786 -44118 -32983 -76226 -170980 -192633 95529 33532
17775 18177 36804 -16178 34277 -76184 6022 -96982 -177068 -39579 47273 -131729 72307 -65792
17762 -35222 226399 117187 -252062 91553 -53556 170164 177918 191140 -34543 122587 194031
17751 194031 319013 -17774 -54862 -4205 55404 211132 99920 -192636 -57821 14632 115215
17740 115215 146507 -286119 -198288 176260 243692 335939 -369395 -149274 -310401 90631
17729 -64028 -429139 51870 17314 144512 90926 35962 -46616 -14472 25166 127194 -5494
17717 -162815 14209 314216 152844 242466 -62062 -179495 177575 -66921 57898 -291124
17706 -228831 294764 118366 300256 73576 -101467 -258081 -155068 57257 -170579 105814
17695 10603 -44056 295607 15606 44957 -25880 -220561 23879 81180 -28205 229948 -36914
17683 42576 106178 138418 -223963 -163160 172716 158249 83616 -334895 340477 -59891 -174910
17672 -174910 245566 196341 236376 -76004 39421 -218350 -102764 257975 -50268 -41986 -9492
17660 -418380 347197 70502 -84658 -12239 -94531 -219248 133040 118184 146823 -182299 207755
17648 -46852 45717 69890 -402436 66220 -100031 -329849 -106398 -19331 -211546 193823
17637 171613 67566 -27805 -44336 116654 52336 -65045 277938 52563 -3304 45378 84262
17626 84262 144737 -23211 -2987 118413 65343 199139 -211466 125653 167727 397102 -84314
17614 -177012 5838 176413 335999 -178107 53056 228003 247682 -571839 41859 -409435
17603 181414 30394 213160 196778 -56297 -271441 14125 -182412 -72984 174431 92038 -28551
17591 80419 144297 -119078 -16549 -57318 -148506 -533690 -13763 -31771 93581 -66599 -240956
17580 -240956 -13653 42898 88677 87275 -208094 148704 -313489 -162604 -137399 -43585 249732
17568 -78214 186926 149538 489583 397279 -359521 -266128 -415655 51419 -133724 226171
17557 -135339 144748 231402 207640 222545 -80053 6270 -222434 -293448 -236695 148863 161269
17546 161269 -96843 -120346 -109105 84113 225349 -124767 -330849 136476 289389 -137875
17535 175757 -137140 122027 -44773 85244 189045 101232 83778 285684 119706 293078
17525 293078 -52749 -100861 111531 -191283 21022 321820 236823 -285182 171165 359280
17515 359280 -199288 50209 19582 -3706 159082 219723 165716 8422 11056 240422 314998
17504 314998 -36645 -141070 -107733 86409 249735 122471 346250 -151284 104837 93721
17494 93721 109828 -22046 -102527 48518 -126023 222444 -88879 -142151 61291 -6406 193774
17482 296811 134319 53763 187960 295709 44012 88212 350976 31617 345143 -85359
17471 256352 437013 164885 309517 281396 -103185 25087 -60449 49106 23691 57086 93412
17460 93412 197731 -179854 11944 153829 -4279 18250 421941 83006 327975 273641 255701
17449 255701 135915 99120 48350 366463 653596 4042 329588 70314 238735 53744 91870
17438 91870 126958 123933 208565 313982 57312 294762 346083 238825 266786 272456 150786
17427 150786 87953 182284 361129 587223 286712 153432 50857 71762 276617 -22147
17416 -174268 296765 351175 193369 41517 -35093 -14034 242111 17975 54233 33788 -14182
17404 184851 179943 125292 265514 448502 74606 190068 65098 52536 -15800 82355 89033
17393 89033 -271356 117985 -75528 260306 59024 183811 -38734 185299 116664 143939 66533
17381 41912 233508 147294 267693 23017 312258 279900 161723 85260 8279 256263 59667
17369 213062 191628 427495 164712 108770 162376 -1147 301169 53163 326136 114679 226405
17358 226405 129114 252698 -56010 96565 115456 -55379 203226 244342 -9845 -4567 177895
17346 -8007 139500 95197 210038 -10016 337597 225172 116759 -23565 32284 -90314 8136
17334 155733 234747 75972 237976 448014 -130726 346233 418176 114528 73291 -35750
17323 -238459 353120 204972 250090 225947 262049 123797 -26672 138280 297307 461267
17313 461267 313289 552053 225422 70888 21710 193886 261398 -161253 -112319 158216
17302 131958 -87101 304987 -98405 219101 189405 307465 264875 177033 440307 73391 191974
17291 191974 100776 317008 183238 215049 -103276 331190 283753 85024 124853 287097
17281 287097 -132601 -128997 135495 303905 268729 214085 -87542 420993 21213 289593 75656
17269 502358 28104 127377 255096 197787 25667 276142 419434 -20584 450328 533873 267611
17258 267611 75084 299431 456080 80358 30547 -13657 -121042 347748 44755 180994
17248 180994 -67615 -103050 199284 252113 61042 -133493 318491 452512 315123 369416
17238 369416 226038 -105305 143872 154725 303824 493548 343997 180250 267525 316866
17228 316866 235875 336696 76534 178146 319137 7209 -28110 165224 349282 162256
17217 76822 128497 303870 364002 232522 454865 161262 369167 472209 279425 125755
17206 -135509 270015 201140 284829 67750 251511 305176 -45416 560023 52747 134463 236456
17195 236456 138426 524555 285263 294966 209872 108116 -105668 146951 387688 -36352
17184 3335 293510 253377 227152 273148 136424 298726 254886 127358 39396 159336 235196
17173 235196 286570 410362 419248 446961 287736 467565 96817 46285 327010 302376 540241
17162 540241 281389 481202 148151 310880 -101664 307941 390625 477607 402624 220917
17152 220917 547359 377969 -135275 181121 78299 464570 144993 322570 316169 109785
17141 529348 193343 420961 312118 306122 400981 168232 424596 431375 442299 22053 180939
17130 180939 682857 149518 94808 421176 121222 326536 245097 592956 191649 296315
17120 296315 429997 507979 196615 353230 334870 196859 595059 412585 297538 332076
17110 332076 212068 437235 201523 230887 606761 76582 559975 414759 80831 577457
17100 577457 375488 401826 784181 594856 319503 452473 369068 244794 252293 240361
17090 240361 271086 159225 567898 188737 342840 255363 681214 508809 535113 704752
17080 704752 333179 244932 336087 552060 228864 546476 344606 536046 850116 649402
17070 649402 672865 132178 264086 308080 503856 584394 523322 251887 1093316 395973
17059 135783 401907 669869 633101 634544 259710 611572 364140 464845 816723 634990
17049 634990 501048 764030 460895 625767 456598 728841 733713 552727 592071 448071
17039 448071 404680 319738 543312 535897 801578 488798 683332 669071 736533 588948 601996
17028 601996 461259 657303 513749 506287 733034 538607 359759 890962 720756 867502
17018 867502 1040730 645864 524085 718838 807192 703811 602068 724917 524224 800826
17008 800826 1111287 974298 913575 703984 789406 772847 1223849 624263 739342 884387
16998 884387 623308 1126493 779839 737413 1020197 677357 816593 1125687 982042 592757
16988 592757 638731 1186035 954032 910278 889994 610320 893051 833761 1226986 770941
16978 770941 725093 1038009 975606 777430 1021806 1300376 979448 999222 676725 652733
16968 652733 961170 1112327 1139262 814308 1110406 1159643 906140 790042 1218733 826708
16958 826708 991911 878856 1300715 1012196 1148930 898264 1172176 1556395 1211951 1193311
16948 1193311 1398763 1199097 1423049 1248957 1313081 1217106 1157011 1561780 1336486 1305477
16938 1305477 1558881 1247213 1304936 1188944 1352868 1446116 1128590 1319347 1468210 1290472
16928 1290472 1359490 1262476 1151928 1429474 1692796 1721218 1396785 1532251 1296621 1517768
16918 1517768 1654287 1586699 1476997 1533203 1705117 1637256 1692882 1450733 1852798 1577714
16908 1577714 1558898 1621198 1803030 1838643 1663975 1872131 1851662 1689988 2051874 1868656
16898 1868656 2200822 2306417 2224138 1905793 2243964 2109044 2254732 2297327 2199826 2170077
16888 2170077 1978351 2307939 2331059 2178164 1978550 2503563 2518062 2232080 2480498 2535006
16878 2535006 2474783 2276665 2402323 2609166 2308720 2618314 2236505 2597322 2927677 2887092
16868 2887092 2748875 2748043 2717698 2827106 2780420 3003439 2909735 2823006 2917025 2828821 3347447
16857 3347447 3322863 3055758 3007885 3347849 3240659 3025386 3652287 3365220 3586034 3595489
16847 3595489 3784730 4077127 3776911 4120361 3846616 4138285 3820305 4169504 4387965
16838 4387965 4293035 4518971 4416698 4287933 4659602 4419857 4743480 4792926 4312772 4972700
16828 4972700 4968314 5039872 5111517 5301890 5422892 5328537 5567165 5791511 5593290 5752798
16818 5752798 5810393 6178237 6278792 6088209 6571331 6494182 6877375 6973112 7082281 6845737
16808 6845737 7307516 7518486 7911604 7931143 7915645 8104741 8351375 8807364 9085282 8840853
16798 8840853 9304264 9388068 9644452 9918311 9934066 10377729 10635779 10983776 11183840 11652893
16788 11652893 11611290 12139289 12619424 12614045 13579731 13274724 13863001 14025247 14676474 15067349
16778 15067349 15836517 15885917 16418439 17179733 17442026 18206207 19193218 19345240 19842418
16769 19842418 20766952 21677084 22407353 23093590 23911095 24840129 26031206 26816550 28133806
16760 28133806 28850287 30121660 31480575 32411975 34277685 35505588 37379672 38567696
16752 38567696 40514855 42381880 44340542 46250986 48396536 50727745 53360565 56387880
16744 56387880 59331033 61919101 65149490 68822668 72493286 75959167 80596219 84593986
16736 84593986 89458716 94428967 99332884 104712236 110152613 115861552 121732955 127942301
16728 127942301 133902322 139469462 145809487 151359102 156455828 161537964 165983232 169562665
16720 169562665 172370655 174359067 175615200 175654965 174639663 173048567 170488974 166879536
16712 166879536 162827084 158056229 152913099 147053875 141312482 135456690 129019524 122697074
16704 122697074 116777498 110924381 105335582 100206313 94796390 89402271 84774067 80722488
16696 80722488 76027383 72074435 68390213 64743447 61311046 58442163 55620864 52847101
16688 52847101 50221347 47568401 45381104 43415478 41344352 39416863 37828977 36208307
16680 36208307 34589869 32684788 31792731 29963136 29252085 28425763 26535542 25698767 24496342
16671 24496342 23751962 22886394 22060120 21336517 20443519 19778456 19028689 18514725 17806264
16662 17806264 17437184 16872904 16314910 15761381 15549924 14748463 14312568 13905939 13503273
16653 13503273 12685370 12747012 12650636 11975921 11651538 11529664 11015727 10752983 10517329 9619616
16643 9619616 10107767 9784848 9126735 9275418 8785953 8704330 8601959 8355732 7987556 7879486
16633 7879486 7648276 7593700 7536459 7645252 6971612 7056665 6793606 6468608 6243239 6334873
16623 6334873 6214247 5927563 6229485 5685505 5549655 5558887 5594881 5222671 5391809 5090591
16613 5090591 5137922 4842464 4892390 4733481 4833969 4361126 4245126 4457368 4452795 4226277
16603 4226277 4205884 4065999 3893534 4209349 4053600 3814616 3885221 3550676 3391383 3612360
16593 3612360 3499431 3503774 3614164 3607590 3278462 2970043 3134438 3298299 3150112 3146059
16583 3146059 3029337 2974158 3263557 3054751 2933382 2653199 2901628 3003372 2484131 2338009
16573 2338009 2485464 2640790 2570516 2330517 2462556 2436371 2522978 2079950 2340830 2179072
16563 2179072 1954577 2030476 2237981 2141453 2231823 1786888 2007242 2047061 2071418 1978901
16553 1978901 1728686 1933806 2124266 1746077 2113506 1463561 1743379 1775043 2028039 1562471
16543 1562471 1583247 1758732 1626677 1774588 1745862 1959730 1511632 1578736 1491912 1323220
16533 1323220 1610384 1591746 1724589 1546358 1717093 1591281 1336892 1694434 1159629 1513785
16523 1513785 1348779 1314806 1175231 1332758 1517270 1333199 1222347 1510815 1497082 1268741
16513 1268741 1303860 1109309 1392651 1616765 778048 1019605 922951 1003416 864534 982752
16503 982752 1054441 1166948 980093 982455 842452 998490 633406 1050564 844344 961363
16493 961363 924577 999329 1016118 1113248 910912 944937 924213 878432 786908 977330 544945
16482 544945 911412 883412 862655 691744 990915 903996 902510 869202 880165 824557 712290
16471 712290 540551 967521 745299 521934 983497 923395 790929 830151 638131 951069
16461 951069 786335 750741 846937 571289 733522 795655 722653 698335 689144 829315 741991
16450 741991 562382 847490 917914 453400 691081 792504 603888 713318 541844 414434
16440 414434 478815 525676 521597 450813 417703 657460 718680 475916 559485 527238 554850
16429 554850 508876 884068 559768 592893 263168 308267 653312 645029 567298 826709 363593
16417 296352 264987 610123 95541 499187 81455 756722 450102 616287 354801 464863
16407 464863 880858 328761 298773 405084 705388 370633 423715 635907 489324 348933
16397 348933 375602 923178 277484 426727 494030 251950 386905 255598 464998 332589
16387 332589 486929 730925 277949 119950 552105 369857 669667 215582 483356 748664
16377 748664 414757 192233 314726 253375 -137969 63270 460491 227346 311162 412056
16367 412056 -33597 282049 117002 613598 225154 351897 494118 436755 320944 466121
16357 466121 -44467 102800 123126 72848 590008 431098 587304 186136 464005 41810
16346 228707 445616 293547 321161 89892 183091 -5747 647565 167885 372841 41924 232139
16335 232139 263074 -138212 23296 134060 299201 550548 157029 237700 61432 305054
16325 305054 160610 -85185 219098 125587 22357 273075 136359 46103 237295 387448
16315 387448 288802 -84498 416276 28139 107973 199520 483416 145205 283915 113562
16304 146177 382843 376057 169512 285150 134765 143114 464469 269053 112470 373894
16294 373894 160445 271773 442705 265373 -700 230164 114389 -1610 92605 170098 15667
16282 381072 -61190 -187666 207876 155193 184582 184622 361363 203781 569656 365560 271740
16271 271740 439123 133964 73199 162199 -4926 326286 176241 527482 261403 282817
16261 282817 493549 484059 340351 159675 178352 26015 283392 62690 126370 105880 402303
16250 402303 319371 22862 510152 -12498 150209 101099 81020 83243 187236 20107 270184
16239 270184 250327 81921 -392334 268524 106150 -3344 130877 252504 157527 74791 245522
16228 245522 226105 226395 -310557 345456 -13903 -21766 364117 18852 182914 44567 235580
16217 235580 134220 -43237 107508 -94513 139134 34090 105794 -64536 -55682 36160 -43656
16205 101656 182507 184828 165345 142122 62634 87753 182447 216327 18729 212756 -205184
16193 -17288 48626 -124690 155563 201954 -115102 328928 5741 218158 -42746 -134474 -81833
16182 -81833 -271805 -132408 59750 237779 -75624 -38958 -40008 -110733 -363440 -54585 92726
16170 -92661 177328 134001 350639 -9310 240784 301113 -150993 19113 205151 169594 13016
16158 -173462 72105 -340541 -237851 -220476 54586 -1236 148781 69052 197469 65673 177655
16147 177655 -6457 -96375 163418 47456 -171938 189139 -7989 310612 -125964 30169 134325
16136 134325 51812 -342010 98098 -125274 210854 224407 120173 212273 -69653 -3544 -156340
16125 -156340 -292352 38303 -30656 11399 197735 -126052 -168411 231598 27311 -113285
16114 -217550 303535 299632 46850 -40233 -10005 59804 -92249 72552 -67765 121657 -344882
16102 32036 -73426 46189 5907 228385 -73210 30583 -67993 174060 141169 39582 -29408
16090 -316687 -38098 228381 95784 -78522 47937 148338 314082 399668 101158 39969 167355
16079 167355 -3078 68485 51783 -55568 -232413 -78689 64050 154557 -225211 -42304 -37989
16068 -37989 -31517 47106 67899 -15933 136774 -37682 -402161 99327 10249 264168 -327710
16056 52238 -38437 -77508 417604 -186275 -27084 -304662 -159418 219442 394305 -277076
16045 49171 467259 182650 -32029 105570 -146865 92138 197424 -208833 93464 -367469
16034 -10134 361553 -126049 116473 223499 -306048 -72991 -84789 56966 341474 -44755
16023 121522 122113 2802 -1038 -82293 28638 204849 31493 -70838 -232860 -107686 -37530 183821
16010 -84043 -10281 244316 -201628 -139485 -273872 -5436 -77510 176921 209395 -71227 121201
15998 -179961 -29807 169422 -361847 -44968 -100386 -188145 -56688 -19347 -256113 -35597 219942
15986 162478 298513 228352 359437 181632 85235 608887 370984 469901 -24625 -55591
15976 -55591 -50730 119879 27691 -345883 -32872 -159651 -181371 -60502 -67776 5849 342253
15965 342253 -221845 -8984 62807 203481 21632 16030 -167175 -300110 163985 -4292 151992
15953 105211 105844 -168550 -353668 -21286 216770 -142667 -106899 58847 240603 216743 15862
15941 -39473 300087 -220815 -251290 11517 -120309 122912 28440 9403 -133499 -157056 198858
15929 -130406 -47291 107282 268989 113298 32617 515652 -52364 104852 -58204 -109169
15919 -109169 -189757 -30942 21677 -145643 -97575 45686 69520 -315634 45844 168855 -199796
15907 -92623 -353061 -134191 105960 69650 11836 -6301 -258204 201058 -177000 -117179 -94817
15896 -94817 50170 258599 118414 61699 -74640 79548 -87221 106681 -173375 -63337 270743
15884 -37569 493 -255742 92111 5887 211895 45855 -228987 -8153 -510608 -39145 199258
15872 2085 90539 -100416 -69417 -174907 169666 -31608 88583 79478 301287 114616 -243568
15860 -264266 114105 70751 -112189 -114901 -136846 -22259 -82509 -137309 -8067 -145788 -235145
15849 -235145 82409 317132 97924 -262443 6619 282138 61958 178129 -42376 -253178 82349
15837 1440 73613 54410 -186237 80415 3587 169519 -352330 158195 -32842 -76469 41683
15825 15305 -96556 -2127 98861 34799 115132 148928 -407038 -11229 176642 -291320 65927
15813 83090 161659 -17191 70396 -54622 -254738 221371 -193895 20550 -124356 -50436 -364741
15802 -364741 167891 -48506 -353016 -162320 19590 51251 375030 -77837 111021 199930
15792 199930 -81040 -246355 -152375 -254606 1378 202953 -45054 198939 -481732 -185886
15781 -109748 -287166 -147035 -97423 27927 128827 463289 -546447 187412 -177521 -330203
15771 -330203 80860 -161245 81356 -68472 322585 63451 -74047 7419 -242659 188079 -41126
15759 163039 -206547 -79529 171771 100425 175170 64480 -7591 -27956 191840 -261651 -17611
15747 -35356 -111504 96298 2730 -218397 -133399 -32570 -8838 103829 -133882 -14452 -115061
15736 -115061 -203038 -15373 -345447 -181595 39487 24657 -265257 -121965 -179722 -114028 51145
15724 38908 60671 59158 -10492 -107322 -150658 -252949 -30022 -147068 -99658 143400 369763
15713 369763 -29406 -22482 -164628 31919 233794 -142219 58002 -121738 96018 52605 -79766
15701 -180440 -56577 118597 -24116 78440 -77142 100794 -42885 166842 52077 114621 233379
15690 233379 -158110 134550 83747 237777 49372 -813 -103586 -50228 27344 -164359 69397
15678 15626 -196438 249199 -126854 29755 14713 -251951 158566 337021 20133 31298
15668 31298 277618 33052 149521 -330956 -128248 93646 48280 122200 -268875 -65003 -63059
15657 -63059 -109503 -51811 97894 -294288 -154663 -306242 -19525 -212391 -97945 -76366 -225676
15646 -225676 227749 62930 -279829 211794 -76381 137651 118718 190807 9720 343142 195451
15635 195451 -36794 17381 -198555 -81252 23147 -295751 72879 -180425 -12216 -23472 -102240
15624 -102240 185722 43109 -432711 -15707 41088 108809 170690 -132492 204409 -35754 -167045
15613 -167045 -196485 -5162 -132022 -115816 -627933 -93999 122378 -106839 -404877 -31886 -149710
15602 -149710 -157209 -171420 63699 -90903 28605 -304924 -80944 -177443 -27679 -9513 -90123 -251308
15590 -251308 115004 -115417 93921 140472 164610 44554 229141 57699 46586 169672 69943
15578 -30614 128220 -85501 79897 368056 -219823 -75390 173867 120437 -210351 39634 -85384
15566 164519 17805 -238401 -247 418222 -12264 9403 322374 10284 179795 -62873 -194660
15555 -194660 105339 384994 -75435 -195501 -167058 -272017 -292889 176750 2292 204808
15545 204808 8326 -56744 -39780 83558 -76053 18641 -28704 -192277 82385 67849 -4975 142857
15532 -114903 21210 -86803 100541 -314682 -28804 80690 -184041 20171 -7613 -156935 -53935
15520 72385 190076 -88638 83590 22375 -387730 46246 34662 26854 115698 -263862 -20076
15508 -279111 63609 -251592 -121959 248488 -35103 173108 -151489 85027 -105731 -522081
15498 -522081 -23241 -66042 32080 -238187 -256057 -64144 -111365 -39485 -50089 -100899 -460 31931
15485 -26876 235286 -107668 -73113 -306814 158546 -306669 -253205 420883 64596 439737
15475 439737 -238583 224797 91436 -188288 275434 138628 -313517 191711 -166397 -315579
15465 -315579 -73601 -239734 162752 135164 186664 128766 117974 -30217 -43887 198229 19360
15453 126088 -231313 -253058 64597 118376 29698 -87947 113535 42092 59767 830 89572
15442 89572 -129913 370193 60528 15101 -276159 -60582 96035 -172094 -126548 -86115 -13299
15430 -81470 -189688 -343539 -304122 -117357 -70377 -228745 -98661 473978 -80224 -92249 143235
15418 108819 -247385 114234 -117828 66401 121610 198758 -9597 87618 116726 -33273 86288
15406 23726 -240897 -290321 -253040 71586 -29908 28192 -105602 -40359 218978 -560 -255607
15395 -255607 22794 -6190 -33211 -51964 141387 -107304 -53887 86935 284208 -302704 -36287
15383 -153997 -38093 -104854 249456 235821 211237 99907 -29035 538731 -137349 -136619 95959
15371 -402754 -240766 53630 171248 -241280 -162909 102704 232944 113498 -189841 -81727
15360 37056 356542 -109050 -85768 517282 -183748 21293 340458 263028 -183938 -6738 -316850
15349 -316850 4450 -244660 -285845 80755 -66491 132646 78766 -100114 25285 21124 198567
15338 198567 143494 55894 241948 65994 208673 278959 -276908 -303158 -140895 82580 75534
15327 75534 -93702 139342 -12744 -31864 300138 141420 -309925 366328 -30494 287936
15316 -136700 -46354 253311 232353 35152 205234 -19863 346852 -216574 -83454 -173667 -6338
15304 -22873 216314 149412 -77016 -134817 17611 -31530 -58447 183453 -107236 276843 290569
15293 290569 9526 196542 230204 -118311 41433 233606 -44990 93279 -271140 152399 320289
15282 320289 174800 -183323 -83322 214688 -78566 -135064 437378 186693 251744 163567
15272 163567 -154680 -199884 101690 -142240 -283358 -209528 74327 285867 37648 -44140
15261 4045 205360 147203 187073 -35939 104796 111987 138411 -98352 60570 353612 230471
15250 230471 352072 935804 1389358 896180 1342910 1263255 427738 -176246 37955 8002
15239 -109194 79157 -46780 26999 133746 226567 -53872 288931 115248 126776 2093 153586
15228 153586 87674 -10142 -143638 107270 306972 174235 157891 381062 -52814 438826
15217 411905 -16299 -18170 156652 1135 76013 -103849 188776 -33103 82912 57046 -64196
15205 98457 92922 57459 -76674 -221601 96839 28867 38132 -64116 -3861 160341 117186 -112790
15192 66589 -50609 -19703 -278082 113085 122037 -53462 -32303 -6428 111518 -188402 -98133
15181 -98133 16528 142476 -190514 160062 310664 -94590 -120934 279834 -11807 279724
15170 -89080 -79519 -59551 -8064 -179718 -132809 51525 258068 -74033 -189366 -11681 144860
15158 41223 2413 -15913 -72274 322636 184287 -42017 -87823 72823 -40131 143365 60002
15146 15181 55142 292918 -199377 -220928 515823 -92961 278861 256659 -118096 319642
15135 127451 306032 -86438 -46018 51241 344064 254249 17047 399136 75933 424806 219023
15124 219023 26009 121591 230329 228086 30076 -61109 19852 254281 -134532 345229 138309
15112 -135035 -40773 145339 -13987 172834 171104 -56913 -46207 339873 -167029 176592 309990
15101 309990 172191 292240 151768 194395 376329 -79098 143989 161167 140219 -34400
15090 -97544 -117070 205558 295480 236742 247085 110652 68734 -77570 54976 80055 262953
15079 262953 197623 109956 156907 -80733 65094 -20427 447157 343621 -57085 397746 158747
15067 292368 59423 262347 141497 155711 182431 272644 27315 -128942 286331 -34420 -218976
15056 -218976 -96831 217754 384453 27019 331493 99924 291888 229467 265036 165948 129179
15045 129179 376827 -18284 346190 -317555 144817 -21222 135711 71818 32263 261342
15035 261342 67524 161345 55296 366052 197593 -79858 299057 616993 472614 335278
15025 335278 167944 404360 156204 269167 311106 238498 9176 271874 -135489 -179647
15015 -179647 141482 91302 231454 232469 -177993 149632 477681 224379 37568 207560
15005 207560 254006 162200 499619 245663 187373 447171 425859 224132 159406 264772
14995 264772 471955 148406 527076 10478 431364 157875 205114 284163 423603 211101
14984 -119450 281459 75321 271348 458161 356593 85919 113168 93006 238341 286750
14974 286750 255218 44117 268308 177110 501653 237658 250601 249656 -43645 374585 133933
14962 408538 273094 -120763 116796 158888 135226 328808 140311 419353 246518 312772
14952 312772 385366 259785 274078 529971 196526 164809 383929 103039 -23363 339040
14941 172897 191568 -249459 144140 368037 346173 240588 401374 214441 79452 364180
14931 364180 90749 36759 605575 457173 518897 121254 536618 217215 229661 197159
14921 197159 454534 238395 133847 118732 462429 277494 110169 167460 460028 500643
14911 500643 392820 430705 115188 181450 313629 285484 430342 72271 352400 19105
14900 249576 420492 21908 377743 259730 592401 251312 209610 109590 218294 446478
14890 446478 313461 381415 133436 122974 345689 211321 540749 16439 608461 251954
14879 560231 552974 392191 186334 448854 138920 630112 506040 109676 513990 335238
14869 335238 63554 309326 324567 576704 355476 117859 485429 128126 501011 242168
14858 386955 480373 222800 549042 653967 380097 400236 434717 394864 272555 624737
14848 624737 423410 412564 485534 360876 94029 414574 200877 578115 398982 410763
14838 410763 411815 259090 561879 459194 243705 402230 322840 265371 281772 430522
14828 430522 406260 693166 466067 446391 387099 590424 671486 549452 476612 668019
14818 668019 482457 481180 237163 530262 187960 291464 302423 472503 357747 934149
14808 934149 480928 600119 818880 710811 221499 645959 416415 576594 517090 323526
14798 323526 455617 724265 355039 612720 587417 296742 363111 561286 497477 685144
14788 685144 324410 607903 763039 272738 486573 565494 469313 466666 815170 627902
14778 627902 421015 502623 632872 445564 629998 740206 741297 465326 89570 472733
14768 472733 434508 532216 570672 777473 489051 487263 776132 874708 617642 581196 618225
14757 618225 469731 706423 812159 815752 576540 659213 325627 789376 456112 669793
14747 669793 473285 633751 951828 792712 685498 661229 834515 665786 775941 1007445
14737 1007445 672795 808059 490283 664634 583290 777901 737972 1068845 686138 515961
14727 515961 793064 525821 752504 413485 1136012 581766 621746 884411 645895 868312
14717 868312 658681 621476 925483 930868 699710 610039 757721 1014535 772038 941939
14707 941939 606517 585720 1051066 744704 957356 894041 907994 507928 920084 650143
14697 650143 737764 964152 1036939 934210 927395 778015 1124823 918860 428696 1068055
14687 1068055 998372 526413 908737 1072218 1198476 683173 734190 709818 982756 918081
14677 918081 1120920 891395 1173594 1104992 926326 784088 1015561 1436463 1117014 1142271
14667 1142271 914484 1355594 1297194 1265949 1106145 1064056 1273913 1255387 1073621 1094605
14657 1094605 1468817 1271262 1093321 1103946 1226249 1341678 1013404 1058529 1114559 1527948
14647 1527948 992400 1148169 1324330 984047 1092367 1192213 1385158 935953 1279354 1220339
14637 1220339 1439530 1054558 1294959 1375565 1138022 1392364 858949 1386280 1361719 1647167
14627 1647167 1172290 1423940 1265910 1416089 1477655 1309645 1427588 1490847 1383984 1583902
14617 1583902 1286465 1700520 1138998 1356662 1444223 1567782 1438765 1385029 1888657 1427167
14607 1427167 1605133 1523841 1334002 1509958 1721785 1480227 2028726 1780724 1733697 1410009
14597 1410009 1661506 1916633 1558990 1895168 1703814 1847152 1689401 1711713 1638652 1859435
14587 1859435 1714268 1930224 1726210 2009866 1946675 2084122 1936639 2062530 1953201 1854954
14577 1854954 2197139 2179638 2243233 1901366 2281327 2193690 2172953 2458721 2223131 2172269
14567 2172269 2456686 2236366 2602508 2633691 2297244 2596728 2670619 2806789 2720115 2630733
14557 2630733 2890608 2676558 2863287 3346724 3691803 3673218 4932100 5822107 7235123
14548 7235123 10774287 17895003 33004226 48764795 27363305 11481343 5321207 3409881
14540 3409881 2560344 2514838 2330961 2162523 2013671 2399288 2315338 2108715 2053331 2097525
14530 2097525 2238405 1996167 2471125 2228701 2445405 2327368 2379571 2565763 2638374 2296015
14520 2296015 2666186 2655372 2732882 2618660 2705869 2641075 2897354 2753774 2906269 2890568
14510 2890568 3015746 2882901 2863794 2971874 2992088 2698916 3045121 3352231 3231017 2898525
14500 2898525 3284224 3455378 3163026 3194544 3226839 3138522 3273752 3525235 3236642 3470585
14490 3470585 3336558 3661038 3852344 3417050 3656771 3786314 3759418 3615955 3639824 3771578
14480 3771578 3724914 3912635 3853178 3704538 3475760 4279290 4099011 4045076 4290361 4053439
14470 4053439 4413398 4077209 4388195 4787095 4401951 4680441 4392873 4824545 4643616
14461 4643616 4644756 4785059 4776651 4938006 5042828 5022484 4761379 5354910 5130618 5341445
14451 5341445 5187642 5105835 5580100 5682956 5710384 5645463 5688281 5527771 5856082 5909551
14441 5909551 6063262 5752237 6071118 6008333 6101785 6249750 6420882 6516807 6815628 6800687
14431 6800687 6851816 6838550 6927026 7073902 7343834 7300504 7507327 7550825 7586362 7878190
14421 7878190 7634618 8000055 7763410 8130912 8029510 8362333 8513974 8487814 8397983 8604945
14411 8604945 8901931 9029358 9166838 9281840 9689019 9876123 9708679 10337684 10130331
14402 10130331 10631159 10453982 10859623 10810966 10604156 10942209 10838409 11384292 11761702
14393 11761702 11397905 11605427 12211341 12262962 12777507 12707440 12988011 13273496 13405110 13657220
14383 13657220 13650053 13812255 14453834 14506052 15016821 15124911 15198611 15876659 16048789 16305710
14373 16305710 16730490 17106667 17232707 17604885 18042449 18676104 18592555 19350737 19286349 19939275
14363 19939275 20453498 20906891 21288512 22145387 21830684 22421943 23142108 23738346 24651868
14354 24651868 24916682 25448445 26165479 26545548 27203597 28350512 28843618 29299288 30096624
14345 30096624 30955039 31619713 32762105 33620113 34129888 35357611 36118388 36921887 38099417
14336 38099417 39190196 40628899 41433497 42632650 43781416 45515100 46863804 48212131
14328 48212131 50004467 51161285 52546218 54592587 56533483 58294699 60525049 62678847
14320 62678847 64652526 66889787 69180224 72043896 74414083 77010853 80114531 83042577
14312 83042577 86285894 89858960 93280895 97113683 101207890 105105101 110056763 114957709
14304 114957709 119752735 125125224 130766412 136382602 142948518 149769181 156991076 164645077
14296 164645077 172659814 181205658 189903178 199522019 209541038 220018176 230864335
14289 230864335 242294213 254336941 267248184 279958875 293704882 307139407 321465887
14282 321465887 335892536 350598384 364622535 378600938 392423071 405178922 417377830
14275 417377830 427975495 437204186 443705916 446975485 448147824 448669840 448914992 447671373
14267 447671373 444721603 440875498 434884892 426791532 416527230 404296843 391470630
14260 391470630 377527316 363093861 347885319 333023263 318444115 304475489 290567204
14253 290567204 276710379 263269128 250767235 238348812 226687915 215892318 205260420
14246 205260420 195368293 186306943 177283467 169489023 161424988 153428558 146553003 139966927
14238 139966927 134031788 128400959 122861893 117479479 112180951 107833460 103402741 99717225
14230 99717225 95755342 91801907 88166772 84890333 81659613 78716202 75393122 72722740
14222 72722740 69930347 67884218 65591282 63491839 61210182 59188139 57185661 55752659
14214 55752659 54121551 52335740 50857537 48987522 47437638 46287859 44674943 43947746
14206 43947746 43348006 41679898 40320985 39086605 37898923 37203726 36305883 35643722 34410722
14197 34410722 33484615 32337116 31392301 30748142 30518059 29482396 28830030 27978260 27263600
14188 27263600 26879923 25949436 25260228 25018852 24646568 23718902 23596422 22922674 22587555
14179 22587555 22109628 21204127 20945225 20459925 20451272 19859032 19487224 19015093 18748082 18003952
14169 18003952 18043162 17570331 17340305 16764074 16873771 16218084 16016093 15861705 15471437
14160 15471437 15490668 14791399 14705122 14517625 13962829 13906482 13753924 13559822 13247919 12993617
14150 12993617 12774761 12438365 12251403 12056617 12099734 12270465 11434278 11397535 11350569 10916041
14140 10916041 10846257 10841345 10279058 10718472 10067177 10211632 9842467 9590236 9576446 9388485
14130 9388485 9491006 9434511 9042261 9128127 8763982 8607987 8788889 8476413 8743782 8243751
14120 8243751 8230404 7935346 7825527 7683964 7623841 7617712 7837133 7373376 7529520 7310863
14110 7310863 7327419 7104867 6857293 6875275 6958340 6995491 6451840 6807239 6543790 6572313
14100 6572313 6348304 6062713 6197935 6092964 5994597 6038506 5824247 5955698 5995993 5992869
14090 5992869 5546188 5452507 5510886 5284341 5348689 5068393 5581807 5190554 4995486 4714695
14080 4714695 5274723 5004109 4998379 5043416 4593892 4559523 4546487 4689380 4700748 4752038 4556583
14069 4556583 4427653 4432798 4591449 4268662 4313075 4238704 4287388 3950932 4364680 4239629
14059 4239629 3995702 4247077 3988137 4003153 4057307 4088061 3722216 3989200 3689914 3768032
14049 3768032 3531636 3483675 3561914 3462015 3469924 3286444 3399509 3849160 3263446 3453447
14039 3453447 3365975 3284758 3208168 3283616 3570909 3250594 3436308 3326864 3280873 3426428
14029 3426428 3135708 2922982 3029476 3110872 2911002 3118133 2793040 2644399 3039155 2975638
14019 2975638 2799701 2643318 2707638 2790068 2884736 2729924 2694929 2460860 2525430 2582160
14009 2582160 2449072 2674562 2610512 2532449 2604516 2364574 2364073 2504962 2636131 2499819
13999 2499819 2053391 1981044 2314369 2281941 2015472 2176722 1910548 2253856 2022175 2528907
13989 2528907 3340321 5922266 11129986 24753548 45773308 32345222 16842280 9824679
13981 9824679 6765883 5034805 4452685 3984541 3534881 3511003 3251953 3537738 2875239
13972 2875239 2589432 2559777 2592808 2602662 2678867 2525112 2261679 2713200 2110205 1995243
13962 1995243 2409084 2199741 2413740 2509583 2209663 1971118 2332778 1614771 2169154 2347583
13952 2347583 1760189 1870233 1930217 1812913 1901967 1847021 1811574 1678644 2076507 2025424
13942 2025424 2193239 2026617 1830684 1907379 2038439 1751293 1626530 1610289 1662091 1484220
13932 1484220 1961084 1835986 1875888 1778831 1734154 1762735 1607008 1555538 1451313 1631546
13922 1631546 1523089 1470434 1431366 1550473 1704407 1727156 1488815 1439234 1865810 1322044
13912 1322044 1127010 1576079 1435800 1820255 1137673 1560457 1441517 1669762 1557896
13903 1557896 1616850 1521823 1521136 1510856 1339522 1501165 1808367 1285086 1452364 1082553
13893 1082553 1191238 1376485 1552770 1289762 1406497 1570712 1382872 1043357 1149639
13884 1149639 1107234 901060 1518348 1353690 915531 974128 1311905 1611595 1084891 1214066
13874 1214066 980795 1156778 1297221 955842 772296 1299225 912039 1153237 1219487 1410855
13864 1410855 983138 885338 684775 1070019 1270072 1337258 1262399 898129 1339973 1150246
13854 1150246 1133296 1197482 939540 884497 1211519 740141 973832 1138256 1130497 916429
13844 916429 1363026 1205000 1170031 968795 907893 935351 860259 1179512 848874 990727
13834 990727 1179677 810360 1168473 939006 956965 902194 882961 1171036 1027863 827908
13824 827908 673783 861211 980847 881818 817797 1059890 1017145 726843 835383 812682
13814 812682 881369 800429 950728 977718 648623 1258306 1267289 1108830 995479 1069683 1038980
13803 1038980 925492 949391 702822 964860 919038 790535 801255 612957 755007 837959
13793 837959 1251056 978142 938003 699762 853699 810560 987743 937175 691867 1074215
13783 1074215 603254 769371 572260 808681 823278 836975 955265 826573 636207 956086
13773 956086 824291 793952 934452 1102970 836128 801967 733467 1126191 714635 1206172
13763 1206172 791632 968134 798927 616062 773928 743288 590239 706746 663445 625974
13753 625974 190997 544907 479078 649625 974328 824186 934341 380341 455915 725316
13743 725316 610210 539732 568663 720937 156445 712692 660308 976186 628526 678261
13733 678261 551052 308158 500290 414636 532640 583823 517916 618181 803416 650740
13723 650740 359843 745989 225691 1117349 401250 614196 501401 751608 768456 691077
13713 691077 753213 505808 376236 665643 592037 418599 552470 441825 626359 753370
13703 753370 522124 777950 414841 260681 368535 820458 469361 705643 723275 717896
13693 717896 594875 826858 527293 421558 351845 275994 469408 617752 429477 462721
13683 462721 599549 751008 524203 599567 376016 276815 581470 649817 456844 280486
13673 280486 459010 755505 813559 617750 575255 179158 215928 474330 517525 410082
13663 410082 334530 902456 379463 224538 500694 333426 476998 521182 282931 92966
13652 512826 414792 625382 355915 393534 139059 521926 133560 374044 448733 502050
13642 502050 181440 384119 394925 545305 533696 296692 503802 426433 659528 774280
13632 774280 914694 130992 375349 87528 434597 245782 476257 134690 255431 493980
13622 493980 259244 400509 493982 718815 294729 412156 469903 135340 188847 368184
13612 368184 264801 593966 536684 441826 423020 286891 188718 591836 324312 365351
13602 365351 486405 358596 557355 735356 354648 514443 670374 406099 435058 483933
13592 483933 468495 597349 310931 581506 330023 320595 479349 532470 306268 456164
13582 456164 170814 562738 118565 615153 187047 516863 246709 464277 425402 345425
13572 345425 254911 101594 531416 597667 460974 377812 99279 232754 460298 477743
13562 477743 428362 381290 438985 105307 405961 347913 279999 247392 502164 385585 367653
13551 367653 101521 657035 176932 236085 67964 364316 312034 165764 23173 284071
13541 284071 585307 127640 267088 316109 -27636 330101 279206 580307 626846 177906
13530 245835 404777 226705 541646 524728 566741 63285 302780 314460 273489 313605 217103
13519 217103 384403 270773 82717 485904 416846 176733 95036 412264 383118 560007
13509 560007 318417 439672 405019 163396 336276 271941 369226 372322 293232 548679 456513
13498 456513 150062 404270 -245901 246211 306311 -229228 -11776 71021 219759 192241
13488 192241 172419 454457 479411 303300 330825 224214 135595 405435 535872 -14927
13477 -625 136852 196055 250798 336706 438264 20044 75820 331651 61799 495248 228072
13465 82472 336998 413846 232555 452948 469241 35533 188939 56329 215939 119054 39342
13453 144246 205560 -159158 -156761 -1332 140746 248885 300517 556016 159442 234858 322155
13442 322155 552939 340814 198780 -31645 371996 101094 198384 135077 88749 294444
13432 294444 329932 129641 322507 441117 201247 151616 524124 633115 251709 358737
13422 358737 -11753 223448 394685 162837 87833 468184 408328 345497 113484 6657 201080
13411 201080 620390 29371 108027 187737 456253 -396197 32749 70950 164279 589804 303120
13400 303120 8523 223617 279545 95672 184537 100001 406506 35508 513041 368852 396616
13389 396616 41476 137610 238150 252762 199653 75973 205589 -128766 -14767 83982 163249
13378 163249 319531 138266 213181 139768 -10495 282813 181247 15398 284139 151732
13368 151732 123507 365646 288824 426319 43033 375607 290882 516766 40656 207212
13358 207212 119007 283059 306101 34089 -168888 214242 114267 80478 635887 132506
13347 406146 398754 213176 305266 211667 562114 366645 357150 497304 457308 215506 99884
13335 65276 373439 333233 218819 55810 63741 473126 395965 179849 401627 271774 183503
13324 183503 128889 82338 443995 190821 276520 269390 162623 317292 -41338 299067 77703
13312 422733 338599 274964 411409 4444 154034 -178370 192891 35386 -62944 198316 340596
13301 340596 125580 174679 -103505 -14546 225587 279283 52963 218143 312256 -36382 480168
13289 436343 25763 145024 22624 406014 -57633 78718 418296 -58291 175327 11210 199547
13278 199547 386774 262221 18197 236178 203601 -120359 290251 73840 68995 245229
13268 245229 201339 459652 58490 207090 239627 203091 75536 309193 145682 -254653
13257 -27380 190118 183827 68167 126262 21722 78266 -76669 -128062 145473 263802 -152503
13245 211039 211694 242233 205110 61554 254016 219125 67380 374482 310108 433884 260761
13234 260761 -45053 94718 55519 280790 -241364 -120478 132432 291382 250310 210134
13224 210134 -131795 115470 357976 89644 48449 100674 301599 60399 136959 -135041
13213 516444 273578 155241 179129 166049 267744 181026 83004 307197 122950 220248
13203 220248 131165 -139230 -52186 415892 29291 -90188 29164 232665 214841 372585 -140592
13191 31835 82604 -39045 235164 374791 85613 -6440 20822 18338 -163210 -337812 37615
13179 233598 355118 286424 -129360 123586 131538 187009 -14598 141586 -67754 6170 266975
13168 266975 12185 54646 126736 -3051 148387 361610 -139804 52826 -76047 -7025 32204
13156 186769 107653 -229648 -180559 84166 54892 -11889 212309 258642 -96758 148966 311048
13145 311048 149661 -60619 -20681 206282 282126 -145427 138996 90085 190651 288031
13135 288031 -275019 163395 28734 -220600 324653 244409 210834 231738 -132822 290465
13124 320390 62728 82634 72233 -86445 92533 -49011 495031 -450007 222708 -55426 98870
13112 39939 245472 -4854 31482 145206 59285 -137628 199518 -60980 -17961 64235 53882
13101 53882 64462 -30735 -46506 -174817 125780 -155946 55833 55758 -2745 -33186 8155 -117213
13088 22071 42593 -15955 -58036 -13215 115318 78629 -31888 221777 -149587 190959 445056
13077 445056 226264 233048 352278 164000 64058 391794 32650 493307 252212 -40062
13066 -54494 70240 -63488 -242364 217994 142013 66243 193268 -57393 194593 236719 -73566
13054 211534 414481 -203809 172336 13921 271471 104524 186060 265755 57949 53159 160899
13043 160899 -110047 102401 167864 -55847 -69260 57083 -133772 154825 107874 262189
13033 262189 -264057 81223 -71584 -275493 206609 186881 -65968 -43262 287003 87241 187184
13022 187184 -95936 105578 268828 101483 46498 5190 329187 158197 -279392 439468
13011 137152 292397 412105 367863 183921 198216 238252 -43206 -108726 127854 247698
13001 247698 423585 -131703 31746 -49996 41106 -90216 192647 93365 -58375 36649 55241
12990 55241 68239 -211119 179408 69864 -169514 146123 -129400 326950 264286 165415
12980 165415 30052 120451 247094 164872 -19300 -304046 180043 209158 -39025 -149500 69854
12968 -136751 164358 127661 -142451 -34924 135923 239437 -396863 -574320 -124254 143749
12957 -65260 212172 -238851 -152069 390374 141346 -408234 144536 262589 224078 -134340
12946 -37071 193940 313137 255669 241500 187822 231183 107687 22663 -6834 -150984 -65502
12934 -155037 338624 36784 276850 26473 -166885 179413 343856 59440 -121312 -207028
12924 -207028 224644 168026 -91333 122022 136932 -100929 197620 95966 -55208 216892
12913 -172973 242269 38744 48290 158019 164842 87763 -875 -12287 -106911 -5963 -132658 219412
12900 19015 -118754 -79002 -84969 233355 -66010 2591 334640 -6932 11360 -166417 -379972
12889 -379972 121797 283125 262877 162251 230684 -13042 173153 208525 43849 -96150 85059
12877 1986 74152 -135414 115920 237275 -124165 140860 189072 -115424 294357 78068
12866 176227 -165277 14811 -83186 98388 -60178 134032 125421 -148726 386114 256335 291721
12855 291721 194456 201454 -325242 44867 173120 201420 181219 64482 63155 -251696 83703
12843 -102037 -208910 175840 270646 -200945 -17820 -48388 -19951 -62768 386426 191087
12832 -148035 -22321 -241971 159862 -45770 51422 433244 86636 68466 144586 63143 218254
12821 218254 196846 -29453 -182484 283701 106657 30584 27115 202095 137134 -26864 -5142
12809 198355 -21363 48706 -56128 80571 341341 73613 -258465 54951 -368065 -415358 -160099
12797 27238 -29090 294697 -148636 171346 -34961 -23112 129929 210203 -105991 -218723
12787 -218723 14298 -244773 188344 -91367 218487 -14321 -290472 145982 -30493 4753 -50824
12775 -124416 -87540 101339 -352272 54617 -116461 -37884 -173786 -183696 209903 70593 -98085
12763 -42888 -99276 242495 65284 -162697 111684 -177923 51537 47549 -106160 226275 215566
12752 215566 -221448 155572 181852 210629 -90377 144295 -59727 -10895 -19065 89134 208725
12741 208725 365225 -16284 116316 257064 2153 226975 308746 154934 199537 -48770 451100
12729 143525 180883 355160 -23257 74073 386601 496472 129499 -164575 129705 -203815
12718 47870 20578 -215386 60187 -61330 -24148 -128783 69158 78485 -112799 455676 177786
12706 161187 204899 347613 62172 139910 112775 335571 64210 -130571 139941 -102284
12695 -1977 212111 31304 81286 -65465 -80066 -57615 6064 156735 338735 116069 -202094
12683 -15721 -22167 128219 118466 352134 300293 196112 130018 320389 400081 29360 207136
12672 207136 297009 -261917 229721 -195575 95198 -28064 -23608 -14184 229848 159061 -22122
12660 267156 190211 -66716 298786 49609 161199 -75860 -71381 52562 -111681 -151930 92898
12648 119163 356322 -190746 116696 -281158 102121 -94050 -86560 -302118 -69381 333200
12637 214988 57929 205783 -133149 259951 420195 -15624 388588 136266 156899 72473
12626 192154 450507 422573 9785 145062 52750 -26636 500560 137578 65498 64130 287939
12615 287939 -91703 115394 -2764 -322207 -254510 21389 89363 -35461 13793 -10342 50070
12603 -5432 6578 -205684 -13926 156129 157517 63606 4279 16016 -137705 -169157 201041 97420
12590 18202 -17946 140253 -9885 -2983 106197 -125414 173041 -109792 58209 95367 226441
12579 226441 137951 71159 262128 206946 238592 -88220 114691 -81586 172633 89328 19175
12567 367482 -81255 -195631 -129574 150863 -86592 -28047 143009 18672 253950 157178 -29316
12555 50186 -89787 -101598 -157694 -92277 157690 202059 1442 179202 -38064 -10814 -197160
12544 -197160 -325640 257134 -15384 -83445 -47057 -205430 -358482 -217755 -31511 123396
12533 62683 -161781 309992 242344 499442 311400 -117928 37014 399085 -63958 169820
12522 -128557 194107 -62138 24859 21986 274704 -172524 -11139 -38613 69669 40992 143643
12511 143643 39837 -28343 -136129 337111 448690 -43933 186777 -117556 -103561 248224
12500 -19887 392496 -69954 135641 200513 281080 -58183 78693 186083 -50028 318578 -26625
12488 20944 -106963 43335 3565 -158986 5187 -236269 265178 14584 -187792 91538 -324365
12476 -5209 -198477 342417 -70027 246339 120647 183213 -124857 -340185 -263518 192172
12465 255772 147912 55508 169992 -81549 -351952 56616 -12247 45858 18718 387067 399915
12454 399915 -256466 224583 -3442 45312 218120 6800 -139771 -93436 82934 -121183 -280083
12443 -280083 -63629 27883 137003 107986 -156992 -143555 22981 58555 71261 55625 51456
12432 51456 -48025 125692 -90411 98323 -174624 237465 7072 -2031 168432 -54635 -65833
12421 -65833 154631 -67897 -213142 56045 -115824 -6540 218692 -87524 -260137 202278 20267
12409 131452 -202571 -67377 214764 9767 -258959 316796 95072 -225671 -26563 101554
12398 -190274 -106858 89920 240288 95732 -212025 131829 -80407 -51372 269439 171109 108444
12387 108444 -5535 90815 77193 138320 -96659 -80119 -96220 -83049 -298698 -181913 -48537
12375 -134394 -53792 154618 85315 186483 314851 45327 -139887 -149181 79717 -183215 65940
12363 396193 120272 63310 -27983 -154795 19524 -25386 -56903 -38231 153928 -172001 78277
12351 -153998 139704 151023 -244873 153348 -71826 -118409 -118766 239529 -96938 253209 -113253
12339 70206 32115 -129921 62022 -35253 -339930 61323 -371800 -62892 83883 93844 151244
12328 151244 -902 -142382 -134550 -92968 97199 103262 -106139 -275855 101910 -210396 280116
12316 181760 243790 -137219 -64954 119760 -66329 -96927 143948 49376 -36925 26246 71032
12305 71032 22233 270806 49695 132496 -49897 -132088 297267 -133846 237197 196906 -120998
12293 59590 82899 -367389 -4894 260658 172966 78085 206177 142931 154539 172394 -88088
12281 49318 -56665 -156286 190725 -22538 198384 163786 103897 560337 368226 372489 57779
12269 31881 298143 84050 84106 202727 -13139 168891 78819 -26268 -113964 110966 -3483 269480
12256 94093 314880 87757 63587 145809 272719 121714 162638 140349 347658 230515 278390
12245 278390 401583 54782 539 -44118 182056 199471 -110764 -241949 44115 -29193 2032
12233 -98049 -291724 38714 109855 336621 32119 221892 70645 -171436 437622 430151 114949
12221 115012 405944 503810 410327 431082 391447 135884 -50231 -320156 91140 106528 48068
12209 -43285 14680 126720 340194 263651 255073 53917 237899 163363 370706 331408 85829
12197 221997 179375 432523 98691 509692 176099 39396 111435 440179 136454 269376
12187 269376 34447 114445 -130227 -41629 -9213 182152 52117 294761 351926 334304 213443
12176 213443 77875 -17102 64253 -7296 305593 441213 -10963 194424 85832 163248 210392
12165 210392 -35167 -70900 -254661 239401 429736 208605 184528 -133533 -2252 467906
12154 203498 -206081 207376 -157256 -200194 120737 42713 147401 -124205 61163 187734
12144 187734 -117127 221698 -7074 -9696 -146787 435254 -13957 -46952 239492 87360 45965
12133 45965 -140174 20505 261707 4619 77823 184245 -95706 254122 29047 242535 -27209
12121 112104 30905 -86745 174730 -118017 252702 -108328 -210816 -135929 138 75109 -25068
12109 -87253 -55931 -162546 -127898 -127097 -27877 237131 -312186 -306416 218396 419203 -53036
12097 -246438 -29254 160062 -235501 -210217 -1741 -13424 91682 -73999 -26829 30169 83214
12086 83214 155909 -35669 4764 -28038 -7925 -114087 62623 167025 533405 989317 2014269
12075 2014269 813689 628189 58107 181582 -200896 -68107 -221560 -218071 70510 146775
12065 146775 -194675 49540 -145411 184927 272728 -68581 22716 119592 197670 -321657 60519
12053 -4785 20024 204299 -370792 92994 -146464 -127746 -193786 -206741 -109413 123727 -75346
12041 378533 364387 194175 49816 99299 -124827 164985 -119923 110308 -230544 -61392
12030 275502 68693 -60723 144088 -45633 230715 -133488 224246 -179238 -63053 171056
12019 -32148 -172872 125164 269236 207064 -282639 26749 35367 240319 -116312 336455
12008 340300 75042 141235 285231 52305 433194 -2538 193837 -201538 17884 61814 -193821
11996 -405586 59620 -44653 34377 -299300 -220904 -94718 160654 90655 98766 -20980 180599
11984 -277802 312473 -171643 78990 -444866 78918 195690 84150 65858 -4068 163570 -126890
11972 32910 98098 -68114 -124941 224723 145967 -54634 223649 130370 -235071 83917 -77464
11960 143028 78079 -41627 169836 -237741 10446 -107573 -102533 -68920 -429746 277148 -113949
11948 299988 6627 74233 102441 321004 -70465 -51071 -92801 21098 243348 214385 -109020
11936 130506 -86814 -67735 4084 229410 20626 -100431 77272 -237343 249892 165721 60635
11924 131781 103855 -105617 146414 173526 -31751 292308 -54196 -182875 176081 202150
11914 202150 -56424 346781 49578 -32492 -93753 8022 -232119 -66714 20345 -111074 -186850
11903 -186850 -287799 100605 194641 257515 38229 -153087 -123457 -128147 -298374 228749 -80106
11891 420 31637 -38711 -3690 -21791 52226 45316 -195407 5655 235691 11965 -19627 263945
11878 23167 -47585 -264961 93761 -93762 -169127 -224041 -121378 -205228 162085 -329837 -213941
11867 -213941 -182866 20330 100708 -252992 120326 76959 101830 -171878 41997 63320 -328829
11855 -104895 54877 -14975 -49598 -143589 -170506 -157461 -108168 79930 -35269 -4122 50703 -29163
11842 32236 114569 300108 -512292 -190459 38431 164841 -16402 -28556 -255411 -23846 -3264
11830 10626 -207676 -236177 -67072 -26526 -18400 -41205 -315715 101896 113356 -21279 85626
11818 -55482 -181982 -51946 -314628 45929 60246 408789 -29151 192235 68457 -277605 -164087
11807 -164087 116913 123809 169114 -39003 246452 247630 68410 -171073 -28382 -186681 -273243
11796 -273243 381578 -149249 -218674 -241246 95555 163344 -118933 70818 56541 125931 308624
11785 308624 -225784 246285 -498279 -220412 -71425 -22551 18737 212978 38002 21814
11775 21814 11258 -95642 19667 -16954 -87018 -155834 52734 183568 -222957 210006 22733
11763 -173610 49743 -121307 95573 55957 -128076 104330 -331583 -286073 153927 187045
11753 187045 55149 20031 -80258 16748 21728 -70042 356611 128836 -93642 -163292 -20467
11741 -166441 -29970 154285 14977 112075 133950 78844 39924 -139314 -12590 -389385 29385
11729 51122 -4471 -6542 -123355 19509 -74150 306494 -246924 -183029 -145577 180563 -319489
11717 214719 -218906 155920 -71413 69011 -230938 87747 94680 209544 -25397 -7527 -102969
11706 -102969 -151555 -222942 125113 11765 22021 -265975 136585 -9908 -66585 342043 29375
11694 193571 519134 148462 190136 -155019 331031 -46915 114527 1814 -21073 35786 -3573
11682 33320 94024 140997 -478835 197530 -15560 171585 91289 -40856 -278507 -135449 148262
11670 240604 -213270 315662 74693 87648 -371691 95239 -53461 122692 -86865 8240 -59796
11658 62491 -11951 59046 317828 145105 178305 -10519 194681 -238114 -20026 16675 239572
11647 239572 -314515 192147 319572 -116164 306065 -229747 293316 -209882 284879 -29817
11636 198082 -12478 -116246 -40362 17947 332151 55310 150750 -111868 -142694 95734 -12705
11624 -203708 -309619 -144716 188130 -9378 702 210148 149317 -114411 386086 -262233 -221056
11613 -221056 76243 21589 -157195 112520 249563 -40920 -131490 120505 -230566 53359
11602 50822 -377121 288153 64556 192538 95929 301605 220888 -120715 -362218 94718
11591 -251333 273113 331589 176548 159328 187562 -1655 87353 -189406 52240 141157 25627
11579 -333797 42282 385068 -17028 198125 31610 167856 -115733 95779 157665 91767 367757
11568 367757 -50667 276015 -66078 -65002 63737 -22075 -65967 196600 -309854 220202 146669
11557 146669 -194182 258959 -14543 147773 55939 -255419 36511 263796 172516 -96628
11546 154171 -177659 -209357 176111 59735 -52157 -214413 -197583 99099 277158 14688 207270
11535 207270 261135 -79719 501127 301418 74173 -44680 341099 145829 -27312 30189 176864
11524 176864 314898 110805 57212 146010 229716 -70403 5446 226046 -217127 166657 -49390
11512 308511 383687 213591 199885 648448 67504 2376 101686 346573 122667 -321708 49706
11500 326501 131174 79516 70346 282666 328637 99700 313431 210565 330449 248707 202118
11489 202118 -49834 326463 64843 -138323 383282 330188 108356 -28390 55720 103831 152938
11478 152938 232315 173108 -20876 143517 188756 -6797 -106657 106320 214404 21188 347318
11467 347318 -134801 282745 83132 264166 330155 326685 317922 368781 130657 428920 -47908
11455 -412965 223544 40964 89085 87681 150715 120385 -174324 272291 -77875 -66026 76723
11443 -254530 143469 -288912 277320 90275 -48260 -62434 107060 55102 68541 338597
11433 338597 -149169 -44421 -235467 463790 266247 -66992 -150518 73611 -34745 186346
11422 -7312 -168368 220314 151766 -29572 -140234 -113322 235862 -39607 -5865 -23909 61407
11410 -107260 -146901 19201 157109 -176546 44392 -160202 181206 -113987 -265931 -207445
11400 -207445 59616 292956 -148476 -104546 -59156 118811 120119 167709 -448667 60901 85349
11389 85349 -127471 -45752 480251 79514 -159375 -428457 292588 -167924 52707 -148298
11378 291482 -53734 30208 -356177 150071 202997 -218199 584724 -52704 -69170 -215360
11368 -215360 11297 116399 -132378 82629 -453166 -17891 -21484 61701 260446 -94467 -97317
11357 -97317 -56420 -176295 59970 -386597 271811 194784 -454522 224770 111966 -12098
11346 -233959 -5625 -6067 -88029 327106 71091 174572 -126444 -138066 146835 312327 -55821
11334 -149383 -36479 -53426 -53101 -323532 -45330 -166218 -230999 84897 236164 -23942 -133230
11323 -133230 78217 -162408 11813 -94396 -17898 -44344 -1701 154270 77738 -279725 -28408
11311 2884 174915 -37914 366041 -37668 191568 234616 -219098 -53949 331677 -98047 -37430
11299 -266155 -135733 -56100 10323 21760 -81918 -116810 -140319 -181567 -182578 -80052 -12628
11287 6635 25382 221172 -111821 -192064 216289 -280034 -2950 -150869 75413 39560 -61107
11275 -313454 -267147 -167752 315379 457623 -54305 -214876 -252358 -73266 -187429 62700 -199493
11263 33120 54806 274453 41784 310591 -32034 223432 101606 -15965 -297068 11844 -51863
11251 9014 95619 -107013 -65524 56021 -232964 -97423 -96845 115909 10492 -238891 -141235
11240 -141235 -38799 -41310 -36402 186665 104664 -116782 -249785 -22352 -201332 80686 45126
11229 45126 117884 -106024 -176828 -167682 -270087 -119481 -22564 457296 -10669 -194348 -167844
11218 -167844 -103694 -105202 207028 -35275 -364406 30225 -297371 215311 -238247 168226
11207 -407914 -299803 60416 63529 -329853 -155193 -38614 16951 339060 347598 138327 11143
11195 -53861 -156479 -14664 -117950 238042 -73684 -126978 -219182 -358659 48738 115972 -355985
11183 9818 -163991 -359261 -101670 30673 268451 142654 -29713 67413 -293048 219929
11172 -228558 36564 1927 167717 356929 -66667 53862 195145 32475 56758 24013 -66189
11160 -67471 23349 145745 16666 -48693 -348377 97412 -71081 115132 21447 -20962 -143465
11149 -143465 -133586 143061 199665 -104023 -58816 408658 -268581 204913 -235761 46407
11138 -138817 100270 156837 -209203 -24549 300104 223508 -239326 48397 -48060 100937
11127 164723 48248 38889 -71362 176968 22700 -48719 4604 241599 -31134 -95831 134438
11115 -132139 164754 -238091 281026 182163 36938 -181871 114114 216818 235326 188040
11105 188040 321278 270197 -221020 121180 115978 182120 303343 33256 209592 9439 280335
11094 280335 376193 299119 192589 1540 129164 176902 481525 -1653 220101 145229 -92992
11082 190832 238658 185702 284904 436044 85655 334589 445578 208422 85324 234311
11072 234311 259386 394385 99344 -98012 352295 622110 287779 577080 222402 217803
11062 217803 461566 398085 362394 102473 174789 505835 444588 595279 679771 419109
11052 419109 699944 1029700 546796 829525 738897 521397 672207 872395 795817 855825
11042 855825 1035349 398471 644373 1004095 773647 592334 463022 527019 671243 788859
11032 788859 482634 1001856 374395 364312 683913 720364 527626 745182 614657 913985
11022 913985 708749 683813 882173 547783 917211 388567 820185 747948 832587 606225
11012 606225 621029 624362 633123 448714 360825 737151 650668 853541 520850 641116 772718
11001 772718 666137 518732 546590 797752 801839 283456 717929 998800 814098 690603
10991 690603 868359 461723 779561 567957 720732 874717 844663 886021 624404 1089782
10981 1089782 909580 1197489 1660165 1373719 1868059 1876442 2077967 2245529 2511796 2914984
10971 2914984 2770075 2756236 3049069 2716261 2281408 1813909 2060366 1954007 1526728 1928735
10961 1928735 1814053 1483781 1980103 1718223 1950388 1644101 1668196 1703527 1139588 1323462
10951 1323462 1274456 1115296 743385 750707 501523 772775 474761 527959 243634 57160
10940 128656 552957 68517 397895 36363 42605 -68595 22566 183061 228361 41560 162369
10929 162369 573845 -144787 98053 74399 -203777 242551 253944 -79960 81795 131728 139619
10918 139619 -40560 -123706 93881 157740 18230 -99603 353829 95319 -57165 107373 99563
10907 99563 -37208 262728 101889 196808 14349 23004 -128387 -413409 -292546 -238528 33158
10895 147838 70877 -75159 100277 208986 224609 -3261 -256659 43744 -67430 182849 -242994
10883 87542 -356090 -293225 -376462 -30725 155086 -272913 -158285 5527 -142660 233074 3124
10871 119394 2156 189643 82711 -265020 -172587 -415961 123205 -34617 268453 -13192 -146817
10860 -146817 167733 81628 83755 -63351 221110 60836 -254754 15391 -88691 16363 66720
10849 66720 -89631 -411215 10463 -13689 167 -46821 10903 -61114 44317 149400 -93327 257181
10836 26631 -66843 284820 -285617 -114649 -46766 80926 333796 51596 33697 185181 117703
10825 117703 -158929 -55207 283952 -181248 -204819 -63655 -190767 215141 -251259 7011
10814 97344 -375232 198157 259399 124432 -59252 -157172 226820 146731 -210311 -191666 189846
10802 -72423 -109667 93381 -137328 -157878 25552 78582 -40452 -122597 272168 -98799 -52934
10791 -52934 -129435 -70281 -16573 -65834 9851 -46425 -19562 -337921 -212219 114007 206200
10780 206200 -22074 136541 -295786 -284547 88019 -82700 -106946 90225 64383 -23079 -298622
10769 -298622 241 -185914 -105640 -252642 89071 48152 -192393 232941 -127732 -187951 265587
10757 98442 -166449 -9273 -9482 97570 158596 18366 11126 139269 99017 -130017 -18113 201801
10744 121989 107909 45146 -162165 -199207 -307748 -94357 106808 -105705 16767 -251735
10733 -58 122681 -330542 -105013 -134488 21323 -143423 68866 -165278 -171096 12466 348202
10722 348202 120438 173335 78091 -31237 -100005 -41073 210917 210161 -427374 -47425 326401
10710 -135707 382314 -10224 5221 -275591 -12998 356281 -129756 -80847 -282371 -143007
10700 -143007 -245285 17385 -50539 -109307 -118775 14345 -92615 -144452 17511 337679 238358
10689 238358 -53096 218031 175597 153881 27317 -82660 -240426 -369159 -163970 -354942
10679 -354942 117001 -87806 25979 72451 -294207 -244923 -60803 -130380 -85728 -197155 -176804
10668 -176804 226987 -111378 209814 412850 11783 -455256 -137639 -214531 -90999 -228730
10658 -228730 -286526 -150089 -101452 -240948 326555 -194981 -60926 -7564 67904 -157891 -40347
10646 -77705 -39112 -291543 -149279 -229050 -276623 201430 -59955 20728 86635 -298155 -364521
10635 -364521 30131 -240856 -371038 56163 -37221 40257 29378 -285285 141230 -174706
10624 -9756 181314 -78591 198316 75922 -50793 166133 -170063 12211 154473 236555 -4795
10612 63298 71021 -458120 -39741 10622 295672 -13307 -420494 -232097 146047 138783 -194518
10600 -372745 -287305 -236489 -86833 292103 -201602 -107658 -75902 -71176 -69866 -245257 -202028
10589 -202028 99877 -5098 -191543 -441232 -67841 -208710 -309070 93776 -95977 -276565 -19719
10577 111775 -40905 -142485 -231689 -47070 3025 -101725 84400 -167500 -336791 -114804 -186003
10566 -186003 -135957 21093 171658 7881 -65683 -439314 -170927 -63703 21259 57926 27 -124925
10553 194837 -13227 160945 -43 -11293 106173 -138260 -178972 12087 -27700 331108 20823
10541 -30431 189148 -253035 -183870 -114936 -239243 -50984 -368540 -78619 -234972 -45504 -155056
10530 -155056 -296672 -391206 150969 -244451 27660 172382 128703 -110781 166619 -270298
10519 42150 -78285 60024 261876 -39109 55863 43565 -209009 235881 54011 105407 -300136
10507 122867 129432 97541 -163377 207863 151943 -51539 -114905 26738 -48033 -129006 -16095
10495 -241043 -96641 158550 123680 144765 -550157 54021 9124 188773 141718 -169944 112497
10483 115017 274482 260017 230976 365350 595631 240488 -45661 244600 255747 230568
10473 230568 113851 126710 284611 -158996 -150136 337807 58022 -426580 348094 230311
10463 230311 -142811 -207585 238932 6747 6698 -120880 -353418 -166632 206557 -207877 -139778
10452 -139778 379246 -186779 -412361 147371 -48559 -95620 -126128 -142674 -18494 -32140 8686
10440 232364 -97641 107206 -81001 137218 155292 283903 -21950 -42351 82312 250160 31432
10428 155777 -91311 -97293 -9601 39035 -192618 13190 -26309 -277038 -194849 -80032 22574
10416 45462 -44170 104911 -69481 248950 -200745 -186751 49838 87548 -115773 239559 72990
10404 15877 43976 108973 46182 -25357 -49226 -7253 -10750 -23019 66586 8662 77552 77024 223817
10391 223817 -14154 -22810 30005 124918 201887 -13549 -28149 229294 154853 -56200 25978
10379 104928 240570 177893 251693 24196 -34185 126928 51084 515194 200479 207230 420875
10368 420875 177735 498407 279038 142791 301009 473136 497101 490043 260475 611902
10358 611902 -117670 511778 339823 -153885 139920 181175 401156 395566 221667 733297
10348 733297 86488 381110 157262 2960 310893 537019 471814 422992 95400 321409 -306256
10336 140540 55792 433662 248253 68979 324656 -231719 -47371 -3129 74618 185286 137035
10325 137035 145109 22476 236366 192167 171205 24142 353236 136195 457681 -151273 17291
10313 84783 210190 64496 70829 -36378 -123684 -386340 -61816 169191 199312 -198697 -38496
10301 104862 54677 49252 401512 71537 23478 50926 -55219 -67427 -64705 367059 225710
10290 225710 4664 -185046 -27744 183180 -10825 195049 47220 82279 217840 -165671 155257
10278 12341 -204349 -341207 4613 119574 -176729 124518 -357817 -241438 -193484 191763
10267 -191552 -65198 42500 112930 280054 -72113 317405 -302805 546750 127016 360446
10257 360446 494278 269069 266203 -79809 -62408 -143475 148674 -191361 -104869 -46984 -85401
10246 -85401 114073 28128 -37341 -150573 -29301 -7377 -146220 -78567 370882 -106029 72229
10234 -268449 -1315 159528 -83161 -78736 107241 -150972 13315 -22060 -49365 -48918 -25496 31293
10221 85485 6381 -154575 -27101 62231 -353235 135431 1434 29610 -74399 -1233 37088 -376544
10208 -120710 -130551 -238197 -169235 -171124 -190921 -6909 -184072 -280953 54581 133367 -310670
10196 -314677 34260 -440775 279775 149049 44715 -226349 103135 21618 157426 -260367
10185 128187 22391 -13340 -139793 178318 -124698 -301921 172977 -71138 -138333 -84838
10175 -84838 174489 -827 -35601 -365356 -130960 75233 128909 33714 -76869 106849 -42477
10163 -61911 -18066 -123242 100585 -305836 -74273 21589 20527 -57316 37419 -73034 109981
10151 125023 -60841 169375 -94786 -113448 -274034 129462 -88755 -191676 246134 32353
10140 -35759 -113488 -129216 -364854 -144314 -166372 -147506 -32104 -114775 -41836 131143 150831
10129 150831 -22940 -243567 -151801 -157689 210655 165099 340927 -50093 -70334 -200098 123813
10117 -132237 272131 -150276 218233 31490 38372 131972 197223 -109198 -290600 -65062 -153193
10106 -153193 -190989 -202291 -262228 40359 164572 -42130 88012 -60034 89125 52462 -272779
10094 -173223 -88005 -210512 -391182 -72990 -202444 -45172 -280244 -125352 -46954 -119795
10084 -119795 -42044 144764 -29094 28111 -212026 150065 -145412 -138236 272672 250300 -351662
10072 -169573 84608 3062 108143 49769 14305 1665 163351 -195767 16843 2248 -370353
10060 118353 10462 158072 161068 -5228 -379674 17037 -135719 158778 -78546 304582 11394
10048 -403433 -78946 -23381 327937 -30462 -316252 -133077 7386 155783 -393195 -27317 115794
10036 80347 -101854 -71914 -232375 -69625 -278957 -23149 -138365 -17926 252213 -138658
10025 36869 -118446 -154146 31535 -85578 -206912 -349733 -207645 -146310 -239757 -69754 -251864
10014 -251864 -151754 -315683 -2886 12786 40552 -115564 25979 106916 230607 154761 15663
10002 -256606 -1875 116951 -309361 -354698 -220144 87473 170952 -26766 -112184 -37136 237944
9990 -33480 -119827 -198066 -113189 21275 -126763 -127760 163290 -27523 314978 -105075 11943
9978 -226193 -193368 180265 159261 -186314 -473293 91144 89094 -123027 -220514 -224094 136567
9966 -324142 -118833 -340009 152674 -25340 -76047 -263650 48437 -87080 -586340 -257123
9955 -228906 -153286 -202711 279679 -166943 93041 -230890 -192160 -4534 165149 -267692 234110
9943 -190844 -176318 -124079 -181013 19580 -49073 -65725 -237975 -281230 109168 -406603 -115990
9931 -203165 56772 381764 -286361 -115297 452232 74428 163154 -66730 -24188 139482 -126961
9919 -231845 -154883 -292464 -36140 354352 -146813 17995 -182379 54588 -115880 389032
9908 39928 -121467 203225 -180804 -79855 -223009 -281241 -74563 -168074 53652 -108516 -102714
9897 -102714 -50525 92307 -152582 -337022 -97164 47442 -143886 -8464 -31035 113601 -72393
9885 -274475 106864 159634 -62484 -75970 -181875 51444 -53142 159757 -78084 137668 -254491
9873 112141 265372 -73460 216922 -127198 144427 -141578 32312 99993 -84425 -87179 157700
9861 152588 -151229 252097 -186962 -46827 240991 18442 -250024 192176 -29658 -78609
9851 -78609 138510 44596 -71507 -45388 -154639 -250676 305240 -139337 112220 189487 -172996
9839 -226844 -6559 38946 -188682 -374867 15459 -297647 -48863 -188687 -191797 -47878 -217132
9828 -217132 24922 136564 -196305 -362846 200541 -63452 56829 133165 219467 -281637 8820
9816 -118140 -144920 -178342 -163851 -471052 -404973 97171 90196 310363 -210910 68330 49642
9805 49642 -150996 -10500 -81005 13586 -121422 49537 -52644 130030 24188 -5187 -100090
9794 -100090 145715 68515 -371517 87176 92704 -275075 -238358 -130769 -20785 -134258 -50006
9782 -182406 168378 -105551 108145 -21872 -106330 -284020 217370 111408 -16711 28126
9771 -56404 -78156 -412296 57475 72443 -85470 -92663 -120354 -101342 -47186 -209582 -300240 -98460
9758 88471 -72319 210826 -63000 -335442 87476 -323969 -291485 -8826 -169272 -154649 -35432
9746 42183 -173213 -174079 37351 -67308 44386 2056 111198 88642 322826 177993 -233454
9734 129628 -241209 -104012 -264692 329543 -75422 -48989 150884 -211568 40431 -16184
9723 126499 -356421 -411761 76589 -40737 -173103 -49474 109871 -386873 -200574 -124668 80414
9711 -38113 -41509 -80786 -252383 -309171 13581 56652 -88616 268655 -33548 -8979 -84528 61036
9698 159241 -84546 1861 -135201 -172495 -34021 55181 46603 22966 -252675 -278130 -166157
9687 -166157 -44411 -179586 -163765 -129587 8605 -282998 309041 -376693 -162902 12374 -21842
9675 -211854 -183743 440 44105 -192677 -285497 -198801 58634 -382042 -88738 -43399 -82049 -120761
9663 -120761 -3021 114228 130983 -193109 -128954 -20152 36924 36951 -181508 -357914 -208885
9652 -208885 214101 -2548 -89201 -181434 -449148 -291296 -45011 -230218 -3509 -186231 -148513
9641 -148513 -13364 -251369 144251 -243768 -91696 273852 -372639 -166012 -250044 -189164
9631 -189164 -22917 -9138 -93645 -146282 -284370 292048 -139717 -177853 244959 -91002 -85244
9620 -85244 -234305 -50574 -196609 5345 -167274 -197661 -361553 -191465 -306786 19067 247626
9609 247626 -171698 345215 -203657 161731 220040 328181 88570 108380 -139066 -188064
9599 -188064 -145744 -25872 -284989 192374 -116324 419879 -67614 35129 290898 -29149 -184009
9588 -184009 -174622 199405 176647 158086 139004 -142000 -247720 -330363 228919 -10394 -247026
9577 -247026 -212344 296529 179095 13351 16634 41915 53825 -177933 -125934 164884 206987
9566 206987 29808 -15331 -166676 -301686 92220 -243404 101175 -290323 -30489 -166675
9556 -166675 12179 62680 -136659 46544 -286209 70520 263077 -240349 85571 -37033 67808
9544 -56470 -466220 -132080 -1041 89498 -27572 82563 86929 -36818 284321 414509 -444494
9532 -293755 222916 -250516 -199406 374175 90217 226885 228890 -77152 -21844 -383690 -183252
9520 -141773 -106621 64044 -52000 -36225 -66616 -173495 76944 -6193 -577559 24638 47177
9509 47177 -225594 97006 -38647 56706 -84899 -270545 -42574 -165629 -102391 -505876 -201627
9497 -197306 -97609 39370 -176741 -238090 13748 -338164 -200391 50864 69424 36168 -28206
9485 126114 -274280 -216283 137739 -77343 -63818 -131016 145485 -212820 -40756 208149 127542
9474 127542 -125549 -262421 45517 -73877 88444 102617 -154794 -252779 -295020 -176832 182538
9462 124815 261071 140286 -108458 -16325 68032 -207472 68779 -51304 -232675 84349 -94376
9450 -53009 79166 -229383 279050 -148605 37578 -29908 168786 65385 -496953 -7732 97197
9438 40822 17874 -91935 -32861 78336 -99500 -6948 93174 239356 -81859 -312852 -79928 28231
9425 -140694 137869 -138635 -16605 -281868 24847 -44161 189479 -20409 49916 -86409 105056
9413 -188386 -159444 79430 -7784 35506 -70763 -289107 306070 273253 -170820 3875 -38608
9401 17280 6484 -197854 -69158 52768 -208162 -53580 -334641 -188118 -186104 -298293 45902
9389 133016 172682 -381523 80944 397013 27533 256981 114029 -221498 32466 -108624
9378 -313199 22499 139902 -72547 -278116 109692 -256936 -175523 -32441 -169663 44582 -155137
9366 -23108 53959 -105517 17671 -84106 -124007 -115021 -200802 -165184 -201173 1031 -74473 -87042
9354 -87042 289452 -95808 -143024 -365417 -192193 2782 85423 73033 -118957 -89611 122784
9342 243211 -215227 -131234 85093 9195 109469 -347308 -268400 -344774 -292432 66016 54384
9331 54384 -118791 103099 -243374 73873 -375332 -351390 -70047 62218 102785 -110997 295459
9319 149202 154513 -116918 92559 -211402 -266909 141985 -20091 422561 105108 -9740 -24552
9308 -24552 -210796 -250000 74077 -18321 121138 -29622 -172269 -233936 -253754 -186207 -288761
9297 -288761 168357 -34141 -4698 -184604 -333881 246831 -352856 -126441 65935 -85127 -284153
9286 -284153 -345162 -360307 308434 -194602 -5729 78157 -101460 -307114 235983 -26556 -123854
9275 -123854 -159541 -141373 92704 -416201 -96381 41196 -298728 168030 -10650 132538 -224136
9263 -195431 57526 68889 74426 -63261 -203492 61695 5817 99857 122974 -182750 37730 -173602
9250 -22351 11401 76727 77925 -357505 131972 -901 56676 -227318 71616 -246952 102550
9238 -157046 -67084 299086 189676 -122867 115340 -358794 187271 55545 152534 -383380
9227 -137757 -106934 254221 -239211 -340871 -147246 22656 21691 -293206 -59795 147823 -64704
9215 -106635 -173130 -16220 -165020 -93659 -57797 27120 -168292 354694 294905 301752 -64391
9203 -223290 -11701 -220910 -327915 -69635 -273111 -137509 147590 -167974 240795 -261532
9192 157911 -409584 27918 -47684 226090 73876 -202791 -87378 -81743 -191120 -66689 -474
9180 53473 220845 292698 240554 -94632 -105998 -5033 6431 -227022 -273984 -277826 -10135 -72980
9168 -72980 -149810 -11249 32429 -179277 -175344 59960 129355 -289834 -107867 -154268 40533
9156 -246380 -50643 4482 -242953 -71611 -126869 72134 150649 -18961 -297371 -164758 -188133
9145 -188133 114170 -17300 -162115 144596 33859 194441 -234820 -67882 -132639 14500 -85332
9133 -80771 -50961 -96131 -90935 -84731 -53727 -213259 -127718 177421 -293703 74370 -325511
9121 95472 161295 208468 -120602 27683 -90488 -187183 422962 126746 -65970 162669 -147592
9109 -82648 -495 179715 -143873 -385005 -299996 -25133 -41607 -25222 -67825 -142145 -95175 55489
9096 35550 -61313 76474 -85589 63101 -142005 39914 -114698 -341285 -204355 44063 -327393
9084 -141815 177982 109500 81605 64229 -46904 -423100 -178837 -170962 -288985 -37926 -25594
9073 -25594 161710 -62648 16212 -225070 138312 -113313 107693 101051 218708 201647 -319114
9061 -219007 273604 161863 20448 165660 -243611 231332 -225777 -18621 -203322 22702
9050 -312853 -31379 -648 -109965 -286442 -69706 -49043 -114976 -33787 -70368 -81999 -398865
9039 -398865 -122088 69069 -297324 -40891 -152536 61387 -26944 279319 -387542 -209920
9029 -209920 -224680 75049 -236563 39666 107133 -315612 183668 76051 -220315 41351 -2498
9017 -212227 -326548 -136493 -366895 -1780 -358575 -107896 38991 -344038 -79386 109887
9006 -322913 101645 -285270 12062 -193199 87315 97911 182919 -187035 -99626 -249107 -106014
8994 -62730 47647 -178201 -133062 3799 -205637 -281824 -374736 -201575 29001 -188579 -306951
8983 -306951 -10774 -152500 77445 45122 -108122 -89333 -96558 -173789 192271 82198 271010
8972 271010 232354 -118699 36467 47765 -17260 -209504 73343 -102110 268428 93507 112524
8961 112524 -13752 -286315 39676 182457 43687 -187044 -146940 -91534 45216 -223691 -145186
8950 -145186 -73363 135761 114338 37427 -80819 142859 190757 -96844 260012 -295510 -35838
8938 121743 -52139 -65798 -184065 65044 254938 -179424 -97012 37446 -326449 -114108 -273652
8927 -273652 -172725 -242707 -56490 71907 -3635 375660 906785 173716 134960 -24185 -34504
8916 -34504 -101510 -15046 266337 -124034 208634 -107884 -206702 -203689 240952 -31067 -13858
8904 -244544 108148 37944 -88777 275835 -26674 117045 -125227 281400 -228298 95033
8893 -143592 -361430 -185128 -34068 -322273 57455 173665 -6054 33980 -89393 79367 -61991
8881 9160 45860 154882 -52509 -155416 -283757 -94557 80396 12783 4284 212514 -421562
8869 23988 -68258 -317312 -229961 -33230 -204861 -181296 -104332 79331 51179 28649 -109025
8857 -6665 -4137 -176838 -110671 2701 314999 -267139 -28556 -271349 17491 -132861 -191016
8846 -191016 124950 98934 -227099 -2390 -191558 237021 123241 -492549 100954 -152358
8835 22552 -233771 44612 -85313 57080 -277185 -144476 178552 -211150 -294119 66389 -61087
8823 113287 -52576 22079 -88220 138948 105803 -89738 79078 57040 -127292 -260585 -267093
8812 -267093 152417 -22149 9793 -136029 -93393 105125 166029 -150660 160654 194785 102121
8801 102121 68038 418016 -238318 -121088 -87832 -281294 -45555 149949 -91298 82956 -478
8789 -106212 175526 296969 52487 -165024 -215821 44519 -370128 159309 -67554 -24220 -225721
8778 -225721 -285257 88371 -29321 -103745 -125998 -247715 227584 224449 -161120 -254766 -184512
8767 -184512 -350155 -153837 -112393 409848 -251013 -100674 -1059 -269157 -253346 138927
8756 -83454 -133429 86256 -126883 -73398 -73400 -79045 -471632 -151336 -7321 176 12788 -125263 75554
8742 -149143 -212553 120079 -225370 -170904 42536 -58962 -183879 -372018 -24077 192658 -190149
8730 -142188 -239447 95709 -46022 -65925 174148 -249553 -83279 -142553 9970 -93869 19211
8718 -205580 15860 -199612 -141447 368218 -116602 -42271 20452 -32357 -57260 -211669 -75618
8706 125930 -225940 -52571 -14221 -100756 -239276 134733 -195652 -84333 67559 88567 -213168
8694 -51393 -214663 -20396 -146705 -276090 -161245 -87582 53478 -148912 -205389 263706 -224073
8682 -372031 -99448 -119465 106282 -197450 311805 -375826 52432 177063 -195270 -67955
8671 72189 -110900 -68950 -254353 52736 -66482 -40614 45994 194193 95905 106595 -104747
8659 -199872 264647 60548 -266220 352468 -127210 29806 -151763 112499 -61110 -242988
8649 -242988 -292389 -28091 121181 -70587 -291260 33836 -498783 -119090 254463 48357 -137113
8637 156640 70647 -151637 -359997 -89781 -208482 -31907 157437 -26154 141496 -255278
8626 -229126 -139160 -73645 166408 277399 165559 -5549 142669 -371412 -214495 -324010
8616 -324010 -272878 -178847 -35917 -31948 -130807 -255804 198892 -239217 103880 189895 -82429
8604 -42758 -230544 -367099 -169177 -164475 5239 -283458 -212399 85283 -97979 55710 -78204
8592 112543 111718 -192944 283281 -148942 166313 -92969 -312043 -13629 155129 -210390 255431
8580 -58163 -192059 -13728 215801 3190 -28606 -181246 209472 -448165 103202 -305361 -81219
8568 -50138 440582 98297 44373 -11807 -73484 -266620 -3214 95276 -21870 -297832 -143100
8556 -246614 -104465 -222861 164464 -125610 92285 90340 -91616 130324 -30501 115178 -48013
8544 6978 -319499 -85753 -26608 76213 -223353 576 48755 -183960 -168637 11024 41932 -160491
8531 28815 113626 -30770 -286169 25732 -117018 -6351 75238 32612 -376159 -44206 16612
8519 -56020 -96980 173481 831 -109696 -48378 61815 -145273 -18734 -144488 -5486 -42303 -247536
8507 -247536 -309746 -63440 -100884 152151 257543 94522 -100293 204205 -15447 -6206 -230268
8496 -230268 -32951 -117823 366362 -100568 -156509 -292255 220822 34131 -240911 163786
8485 19802 99752 -97266 149724 -28998 -59101 240119 -204078 289124 153355 -296940 -228496
8474 -228496 184392 -163348 -259022 131030 117965 15004 45112 14333 -165863 389666 -51693
8462 -96943 -15075 60983 69147 -45630 -37244 -93784 -82357 -98576 -281106 -250813 15406 240142
8450 240142 -94088 -313428 37436 -19800 -43793 -115301 -150002 -93680 -260389 -287421 109252
8438 -60883 -27602 -34997 -158660 -144644 119214 -380978 -117561 235527 -109067 -14972 -80814
8427 -80814 195765 -315064 -272262 62175 -9204 -58255 20166 -55988 107660 590854 -170049
8415 9899 -27498 -26933 127684 -99245 64028 -60737 -389059 -439836 117574 270339 192608 -354235
8402 -25824 256994 199295 -260128 -118057 -237391 -71885 -295060 -127492 9339 -167347 -196863
8391 -196863 68930 134941 34433 187556 -57880 -347403 238218 -251139 15653 33007 41027
8380 41027 -124530 -171855 -223758 191000 -190470 4406 -47738 -46708 -112442 -25120 46221 356313
8368 356313 45814 517406 -302607 -104006 74746 80664 -251996 -351413 -61900 -444700 106102
8356 -223633 -64001 173811 36548 56501 393541 -92953 -245105 -355610 279022 103884
8345 -187558 -238933 -278828 84036 -115451 165920 88985 -124377 315429 -116608 30378 -102039
8333 9131 -109861 121424 -147217 -216237 -493865 -258508 223741 -195859 -261225 -25862 -149140
8322 -149140 -72986 12602 5237 113037 33888 -570969 -374872 76999 -135076 -105916 -52313
8310 9932 -205462 -176281 91720 103581 81082 -192206 -475439 -221225 47640 91567 56563
8299 56563 93218 -136596 339152 -33461 -203376 -258806 -40292 149793 -268507 -63211 -209568
8288 -209568 -146119 -18603 -161074 -72642 -118423 2984 120418 -38040 12898 -129398 112268
8276 357867 -11953 14633 70257 81803 7935 -14091 -6933 -184595 -95798 -720 11073 208932
8264 208932 -111730 106347 -95802 143331 -165062 -115883 19715 -30592 -75180 132108 28751
8252 -154355 -576828 16702 -56561 -163879 -194057 75946 65704 -196562 220337 198364 -123816
8240 121177 26927 92787 -129226 -51426 -49172 -7868 -404443 -278195 -23673 -201560 242935
8228 142000 -280977 -187380 70529 -188314 -68033 -289390 -292161 -80858 60337 95090 82492
8217 82492 -169882 25502 50532 -149403 128051 5369 -352806 15750 106019 -258175 -93571
8205 -83973 -217756 -80857 -133222 107961 152372 119778 -15356 -148110 -52462 79092 57414
8194 57414 72074 178814 -296859 118970 -59702 170338 207760 149867 -145726 214427 233121
8183 233121 -408424 68082 -100755 15001 100658 207611 199407 -250086 -63208 -245191 -358287
8172 -358287 40958 -87961 255886 170170 109971 79070 235795 -8106 10090 110127 -88650
8160 -150816 98040 -188185 64461 -434043 -143623 -272517 -169878 -332752 12422 76381
8150 76381 -307775 233256 43799 -296108 83298 -128126 142479 -27678 -180464 -268290 -48327
8138 -245904 14881 41831 139056 86748 82514 177215 14807 339137 -259478 -98632 42299
8126 22349 -125107 145781 214293 241672 -230684 143211 201565 52504 -289591 -154949 -28552
8114 84853 -216786 -300443 -183868 110033 -167666 -152307 -98161 180755 44715 -249924 182077
8102 357772 203941 -585455 -88248 -139820 -16917 -256548 297788 -106421 -149824 -75696 -79610
8091 -79610 194316 350362 -110582 28877 -123820 -352 -108941 92477 -162551 -331170 -361566
8080 -361566 230157 41178 -16988 -97191 -616 -18043 -193910 197330 -298000 355893 -342667
8068 -79798 -171799 -97661 -43899 4191 156581 -161981 -118368 -349988 213700 -99555 -251281
8057 -251281 118430 251341 22350 -126775 115731 91092 -157370 188228 -159458 -16153
8046 121476 -342074 1640 -75327 -227608 49081 -22904 95244 -347008 389460 -39956 -133573
8035 -133573 -82120 354790 -17286 -103391 -372703 133493 -265984 -11141 -132184 -105847 110250
8023 -308928 -28849 48964 72015 -174682 -52089 -460763 -453695 -107046 119359 231528 107782
8011 -470412 191642 -302767 247751 -6676 300095 -297280 164019 306708 33153 116666
8001 116666 -297951 47518 -38369 185850 -208380 -64182 -234462 -62310 -486764 -24545 98329
7989 56465 21420 -203100 162316 -146051 45673 147638 -313432 346588 -31334 -7600 -265026
7978 -265026 17752 -42804 -59300 -379896 12522 -66210 -462150 -112308 73982 250463 -349780
7966 -93303 -20901 64376 -107582 -317020 136188 74630 -165472 -68130 61315 -38058 -49910
7955 -49910 -62973 -293824 -95492 -45395 146601 47653 -60776 61126 -340168 -360609 -137348
7943 127245 -387758 -38705 96990 -158467 -168240 -35904 -198585 158267 -38130 -207052 -30177
7931 184101 -430126 -332495 -38192 -269534 119042 -343550 62025 105109 -92144 -187952 8636
7919 -247774 -12920 -64467 263274 -79424 -71078 62724 157542 -296586 76427 -134877 141214
7907 -22853 67346 -187978 28164 70245 392038 -138989 -313413 128008 -126324 -156176 81638
7895 -6989 29707 -182926 -68635 -219787 -221457 138193 -49067 22274 -176612 -171884 -44490 307675
7882 77765 244159 -207846 133176 7837 93886 -47692 -62867 -247282 221122 -10322 -16323
7871 -16323 -16442 -333773 -179110 -347780 -184415 -54132 -89853 91720 -95941 53085 -136780
7859 175876 -64560 293458 123859 -212741 -194227 -189329 -174136 -49489 211449 -150327 -12999
7847 -257656 -222099 320982 -59653 -329399 5463 -137185 122876 -70358 46369 211341 47886
7835 -93311 -27159 -127546 213415 -86654 -144880 -125041 -73896 254393 -49664 -28978 98374
7823 187608 -81617 -250085 -352293 117150 28326 28563 24650 153504 -357670 -18855 -163457
7812 -163457 -170912 356419 -118984 207521 183550 341355 -30489 -99437 -288740 28505 143196
7801 143196 -239661 -164506 -138876 -166886 -304042 -15780 71519 -284924 -36325 74773 28198
7789 -115412 -2820 -317097 -30927 -111373 -135249 95357 166910 127472 -192020 -158005 31114
7777 -127270 -107269 -362791 61926 -55652 69288 126479 117400 147220 252063 -409781 105253
7765 -335736 292526 277075 64667 -175847 -203011 -74984 84394 -106503 115340 -93831 -43695
7753 -133646 39938 12182 -419333 -111013 10854 91354 -13171 101016 14876 -38965 55086
7741 35581 -61017 -76295 326589 77325 -196561 101445 9934 14685 93104 235126 92597
7729 -82595 39992 -198724 -159062 -264922 -29298 -222819 -269114 21457 116742 -348989 2762
7717 73489 -11878 -270059 -262164 -128326 -365621 -113901 13013 -165858 -15896 147820 -85115
7705 -128752 -72034 20851 -107816 144375 80378 -70448 70996 -75833 115790 -87988 -196614
7694 -196614 -176921 232166 314311 59630 -111792 223326 -95593 -13533 94748 76276 -208798
7682 31147 -161877 33674 39853 286152 96923 -51220 -173061 -405104 68117 211434 -219326
7670 -135161 -199411 -148525 -167002 -80188 -273794 -99148 -86898 1027 67374 58363 198459 -128797
7657 -106921 -108139 245556 -239344 43753 100369 -78615 266568 258894 -114751 -79346 -57759
7646 -57759 85888 -47539 46220 -199086 -169684 54887 -47389 -162156 -166603 -474252 285428
7634 213656 438531 -437988 60896 -250457 15330 174589 22228 -179036 -74569 -178608
7624 -178608 151757 -213960 185888 -198494 -143644 53174 -32653 -298660 246 208904 -20265
7612 121065 -70040 70061 -144619 339306 19092 67196 -169869 127851 -81235 -27835 -162514
7601 -162514 -49071 -72199 102058 89174 232962 21066 -20278 -194204 48830 113015 224513
7590 224513 -111473 -353113 -128923 45257 67824 218434 35586 -180543 136104 -824 -242187
7579 -242187 -68441 -325167 328359 -90436 -103106 66958 -224556 -186986 -6532 -122212 -98481
7568 -98481 112320 -65671 82210 94748 -40741 -289848 -191755 -176116 124690 61785 -22065
7556 237875 -91593 62393 -199942 -54454 -344452 -59943 -70006 -73864 -5555 -170515 -60923
7544 -157528 246717 -127844 153410 -10318 -101607 -151149 -42615 -139353 69347 -173671 -323795
7533 -323795 248481 5842 -72088 362204 -14761 -78364 132459 -207801 -196395 -157930 -17414
7521 -304188 142389 61049 -52691 -77661 201061 212541 -27901 61453 -382685 -367981 -131911
7509 -62138 -22570 107595 -91671 -132432 113323 -326978 11030 144490 -108200 -377469 -66957
7497 280571 -182447 -242452 20155 309849 131128 -70086 -15691 130558 177689 -41236 90628
7485 -34248 -117637 -230092 121974 3531 -323519 254500 -132494 250596 91110 33609 113231
7474 113231 -59699 147436 -229864 49487 96802 15609 34084 -72351 -168553 54597 172848
7463 172848 -365105 -106901 -202049 134530 -260325 -1717 327725 -113704 -5015 -68653 166988
7451 225895 36879 131879 279017 -32447 263981 -289812 41781 -231036 -127824 154176
7440 -208452 158326 -69855 -65830 -29776 265137 -214736 -158308 52921 37473 -200987 -183165
7429 -183165 -65191 -176896 -5350 454517 -115693 -16824 -67299 25428 41201 -65932 6962
7417 -109399 21010 52115 -437082 -74700 -122398 95125 -182724 278081 221424 -253577 -109842
7405 -2189 -186800 -332706 121721 39648 -164710 321978 -56364 129929 93232 304430 41603
7393 63897 -25275 143164 60610 103039 112384 20177 -158125 -52091 225894 42598 -375373
7381 102365 13662 116529 152354 298198 185632 81494 -52168 17092 140580 -30540 -158929
7370 -158929 58174 385322 -129673 -115510 -256712 223299 231217 -169068 -216242 65181 -53864
7358 8106 -67783 137999 163654 44364 73272 5750 -208552 5413 -205719 -273704 16935 -47577
7345 -320174 -44278 -121002 -254720 -88635 -66735 47250 -50101 -193955 -55036 -258560 -274745
7334 -274745 -327054 -220552 238466 -210832 3762 -287715 112411 -39630 -166224 -100583 -130199
7323 -130199 105767 -112939 -207922 -339621 138819 -47241 227762 -276946 -109249 26167
7312 -481587 51280 259225 -287433 -172657 211284 -78001 -195747 -136635 133076 -154335
7301 91025 -291570 98652 -13150 172149 -42218 -271093 -114522 -168815 -109738 255075 119604
7289 112915 60826 -327340 37741 -71998 36263 -110516 71195 -211752 -21779 -266860 -223538
7278 -223538 -470528 -108862 -52014 11684 280291 -163757 -269159 434735 125891 -225302
7267 257404 -720 32947 308696 239 -26840 -209353 86027 2299 -226804 -21120 101004 125447
7255 125447 -241409 107709 30459 1367 -129626 -46011 211306 -290657 108655 -280288
7244 76093 -221160 28753 -13090 -49342 -124140 -110725 120721 -426834 107154 54843 108564
7233 108564 -140286 -131304 -100035 58037 -136274 120827 80893 36373 24746 -12656 26055
7221 101447 -72856 206435 76037 -196475 38807 197370 -191714 -116278 -145364 -81511 -328188
7210 -328188 -178743 190684 -130653 280194 -461199 -16007 -59073 161420 -28233 166665
7199 24586 228817 -117933 177601 -111828 10578 58490 418728 -53293 -43343 -177960 375142
7187 190147 -140366 -160147 -91793 -41558 -117941 -102776 198748 79253 -95090 -49773 -88903
7176 -88903 -125285 -116787 -318822 -216318 -114827 -34420 -287633 -170108 -28506 -361601 87360
7164 63016 -249474 -361195 -271190 -60003 -188009 77633 -56964 -64348 382446 10610 -224064
7152 -7330 96976 47214 -134892 30047 72221 -39620 413 37072 48902 -157398 24908 15962
7140 15962 134386 -52652 -97848 3708 -282210 237555 -162071 -53416 211479 136173 -266475
7128 -6616 -137003 162504 110014 -315840 117045 198524 -75714 213797 -144757 281046 250716
7117 250716 160169 -273440 39860 -497138 180629 104776 72648 -237631 -142334 -391777 -111452
7105 -125497 167729 -109753 33619 50127 -12217 -110920 -117464 166789 -270330 -122415 -119644
7094 -119644 236039 -149167 -65102 45840 -48826 -165525 95750 91794 172538 -231793 299
7082 10060 339478 255417 5394 129659 28277 -5348 78390 10799 -301774 97210 -90230 -34762
7069 -370628 37980 370259 -191735 102304 145428 -238153 -172730 -300096 22801 160740
7059 160740 155938 64947 -120027 268854 60307 -254963 157044 82597 -10464 189044 17669
7047 -34781 83147 -75443 -13620 135755 -171681 191735 205872 84914 79656 109483 -43033
7035 -200820 -183471 -240917 -296353 -309471 -88134 52328 209932 54754 -8272 141747 -48418
7023 20722 105362 -78314 58155 -99327 -17891 -35631 264798 -190856 17525 -18610 -179541
7012 -179541 -130112 -205002 -119105 -6862 45647 -289500 26152 -32256 31314 -126800 -30124
7000 -138722 -99651 -6094 -81471 45400 -140236 40541 26109 176919 45642 -23972 65495
6988 106851 5068 59135 80632 67234 -146605 -379844 78648 -29272 -197848 216682 109993
6977 109993 -3303 251290 158277 -41838 -143790 -234365 65915 -96625 -58169 -255732 34625
6965 22082 20987 32521 36590 -144618 -32319 -44671 258914 130177 -148711 163471 -214099
6953 180161 -219766 -284636 131977 -384008 -141551 -188764 64399 481 -71238 134541 -58240
6941 -291396 -46670 -259609 -174532 -235466 -95890 166947 -176169 3237 -38699 -31580 -68652
6930 -68652 -159549 -148189 -48417 -199872 132194 -201494 -125753 -9786 47707 -151195 46074
6918 -56874 -59005 53179 110025 84607 73421 -169846 172811 -91743 9553 -249679 123419
6906 -17142 174408 -26020 174994 -312503 -3343 -183974 -12270 196466 228408 -97598 79652
6894 -212273 17028 -335222 -16464 -236576 -431484 130241 74592 -6741 -40385 190442 -120764
6882 227189 -2557 -322793 -99344 -160467 -138584 66855 -14161 -78594 65005 -43997 -157925
6871 -157925 148928 -130602 1751 -74228 37517 -246814 174789 -34893 166084 -51600 -7134
6859 294760 -93636 -213819 294244 82191 -79190 338069 142030 -198112 -89857 -190013
6849 -190013 316368 95793 -142994 -159302 70354 -199681 -72705 -81910 196173 215653 -107697
6837 130344 124481 62348 115586 -156414 -130581 103161 -87248 128046 -15728 6810 44610
6826 44610 165805 -184495 109666 -47251 81761 -117042 4838 -20077 -76428 -547218 182133
6814 -633 -71983 -141597 36199 -176268 -138139 -350508 147603 254162 47599 -46606 65278
6802 86819 113816 8032 -286348 -102341 -5581 206445 -85378 -8801 91048 266462 -125223
6790 194258 -17849 74520 71351 -33750 354646 45917 -100420 114983 -41049 -231253 -272449
6779 -272449 -89545 -60378 -121579 250504 -108055 -174228 171174 -126174 127441 275579
6769 275579 -254643 -128022 184813 41683 160867 -127485 -227777 -50181 -257892 -265470
6759 -265470 149386 156890 93647 217877 -63545 156162 64115 -211878 -256661 -45124 26528
6747 86871 -426446 10977 -275764 -24427 -251237 -68445 -218692 214514 -43131 -161119 231838
6735 -88651 48957 -7970 519 -120387 131104 -70509 77931 153207 359180 200916 -23822 -133730
6723 -133730 -126645 61287 -176099 -17656 -188908 211892 -35617 138605 19310 -242496 -55096
6711 -188860 -6811 184835 139991 272715 32312 -33324 -47767 170051 -82290 79015 -1068
6699 -190635 -142867 -102464 -275645 -272769 46787 26347 38710 -177973 -174356 -2124 33272 -156583
6686 222905 -82820 237648 172674 -79993 -54690 -141296 -62032 -23757 209835 -21939 214456
6674 381085 422576 114260 359904 -187218 -137714 -56855 -49261 -140720 179488 -185430 37359
6662 -179214 218078 -343211 -92018 -364883 239801 -148704 -171705 -37664 -273291 -15620
6651 75923 -93006 -15265 -19619 494296 -88675 -89827 -38235 -258514 -233998 -15027 -94145 62938
6638 -187720 -21953 -189572 31784 -344512 -6507 21055 -124518 86840 12623 -201287 25681
6626 -87569 -90367 50496 -41170 30051 22904 -28361 27205 -216562 -141146 -4347 36188 138919
6614 138919 -121237 83449 50407 46588 -46189 -70394 243973 -137884 -255376 -165529 -262716
6603 -262716 -154738 -71075 -195146 137803 94001 -5413 101519 225905 73458 12342 -193557
6591 -90723 -341703 -93026 -58192 -91405 -322677 -167679 154311 -171997 153824 -63243 -28682
6579 45114 -215828 18085 -31576 -125972 -97330 224298 -134665 -71410 -36345 -239849 93808
6567 -92140 66452 -14234 75631 54345 272369 -101318 58997 -47891 110627 178861 62972
6555 61641 -6142 74039 -173531 -66187 358493 131390 -7028 212253 100481 30768 143976
6544 143976 -199325 129091 -110455 -147093 -277007 -55196 82712 26498 195322 312358
6534 312358 -59424 105842 -59200 172556 -142349 -349733 -114857 -86707 -39450 109550
6523 -235256 152681 118361 186375 259 277460 -178275 19629 -332004 -195586 -138451 10996
6511 215207 -86254 -310511 85619 207003 -152421 -61495 -114350 93797 -120602 -21237 82487
6499 43674 -121962 -46991 225993 74716 -369056 -16588 -224472 -274986 -101231 -134093 -322794
6488 -322794 79883 38488 -77457 -138038 -185440 151488 -61366 -242248 -387543 -272132 298109
6476 -79515 -93896 99070 97495 213954 -110480 -403181 -4511 212805 -126570 177422 37432
6464 -283096 -221739 204057 -164002 -259171 -318038 24756 -119469 -73387 298423 247889 -132419
6452 201246 256836 67185 33940 -100778 -114084 -105753 186634 -305672 284918 6470 -6692
6440 -221874 -116888 184025 330403 -358120 116890 -48653 179910 90363 30186 216821
6430 216821 96044 331697 -17491 100575 -101014 -76965 -380466 179029 -80262 -141801 -137899
6419 -137899 291706 78154 342156 -306731 30314 -101750 -334208 44490 110018 68921 19772
6407 -35978 -18412 -87822 63929 -66022 185226 155843 246259 -223438 -205183 393484 184875
6395 104554 207913 -422189 168102 208264 -274715 45544 201944 -2026 -187735 51459 -180723
6383 287600 125895 42809 23905 42558 351613 -35062 2495 -18031 292375 6903 119809
6372 119809 -237704 -318159 176555 -69972 -66641 -79014 -237611 -285786 4110 -140366 5911
6360 -367686 -223044 -226424 -62112 -255337 50057 -45421 -148209 -60682 -312445 -39225 -31145
6349 -31145 181038 68059 -60195 204553 359592 -240290 -169181 332904 -392069 122393
6338 52175 -171683 -178930 -115952 52488 223046 -115620 66698 28056 4791 170486 114058
6327 114058 -200062 236157 -215216 -109907 -158518 -269946 -75177 3241 -142236 -410395
6317 -410395 97471 -338033 78788 121723 -192423 -183907 4871 -222689 70963 39065 -23294
6305 137596 60830 -112718 168245 -33358 -31975 -310048 480931 -154568 101004 -63829 86049
6293 141025 -274631 191102 383101 -195829 -35626 -343261 82988 11192 -26522 -155037
6283 -155037 -28803 -18611 -36307 -139713 186903 200291 55162 -148783 -53976 -82959 308772
6271 -384441 -264482 -104042 94667 51159 385447 204104 91068 -37922 245152 -43044 59078
6259 -2359 -143144 77701 258814 -87640 -120442 159649 26237 -187172 -19173 -244345 378591
6247 -139043 -293111 197201 217137 60575 -9103 -32916 231437 90123 103422 -148182 217432
6235 163918 64784 -19335 243111 -69198 -168848 -100524 -278303 153241 456681 36265 -260460
6223 308701 -176257 -57126 -253928 -130225 -164084 40438 -209904 -92528 -121680 -11012 165486
6211 293680 133981 -68135 -60095 45142 -205718 -166949 320467 -361478 -136966 34151 -175094
6199 -330054 -95053 93084 68986 221793 -162160 -123936 -211021 -182597 -136422 -193172 58189
6187 107448 -98300 -70029 1755 -195425 -63214 127869 -334035 213314 -268852 263464 -77430
6175 -52912 -190409 109814 -188038 -188034 -256758 -89087 -89878 -69567 -42128 -24748 -81408 108699
6162 -51815 -370644 42690 -38652 -182314 58253 -29154 37099 26000 68826 101600 -148699
6150 2377 -191808 1942 96244 -211695 -206005 -47700 523 -18107 16945 42237 -111582 70161
6137 -88256 -205399 73210 -357310 -248839 -105912 -242376 -201041 79378 124209 -38940 -7398
6125 -291404 -227038 -236335 48303 143827 -6774 132416 -73740 -129328 176507 156420 36312 -6904
6112 -232125 131562 -167745 -31294 -47455 55645 54364 204305 180276 -233370 16710 402969
6101 402969 -130153 -317840 116485 -52695 -129292 -189751 201809 -80140 131789 96351 -313415
6089 -69465 -220278 70380 -103431 -8618 -121096 -125276 135582 -36515 12089 178101 -67888
6077 -119369 -295285 -72767 288706 2219 115615 -213453 -11325 104718 -101507 175251
6066 231043 28220 -358330 -214169 1430 219998 -130222 -158571 24495 414380 242392 -216497
6054 -65704 87141 -79456 52965 204548 410266 120367 140131 48478 -245278 -130028 -153094
6043 -153094 30569 381664 -182799 86384 59829 120852 219885 -168730 20106 -32710 -47314
6032 -47314 -48943 31851 -500572 -1918 -170587 -195954 35476 -179824 -199425 45615 56483 -108851
6019 -124061 -26763 65897 -151383 55880 15496 -23323 145725 196668 3007 -23449 66901
6007 18947 105273 92671 87107 -431940 142671 53835 189659 217544 -113658 -200885 85383
5995 -22354 52278 -323973 195127 -65855 -110071 272002 -84201 278656 237149 -134168 -78601
5984 -78601 5750 -151216 -47841 80629 253318 208059 175392 -134585 -176958 114826 123767
5973 123767 -158213 222365 255289 -91044 -133364 -318960 51610 -225882 198264 -1594 316588
5961 -228181 166352 -309708 -39475 -170050 -68663 -279354 40754 -81286 -329861 -115077
5950 -38801 -149695 -88060 164989 129883 319172 136179 -311793 -114620 41882 -368070
5939 -318166 38048 416654 -106444 20940 -8939 -92431 100341 67898 277529 489175 -263637
5927 -94539 -396446 -22281 9286 -51865 94526 -34391 247547 312645 184143 158196 -92403
5915 -81490 -109365 -3733 398597 101761 251777 105678 171635 -85492 250364 -164272 171772
5903 -159847 301496 -44665 261699 235110 -317369 78329 -273863 59687 177202 -288349
5892 -75231 104362 -49059 73738 169982 -200943 40700 68407 -408874 -52530 -139594 13883
5880 25012 50577 -20280 169875 -287154 -79884 -512 -245927 -239228 63583 172873 304309
5869 304309 -43396 -188004 139029 -150471 125321 210155 12908 158733 237450 -45254 -178891
5858 -178891 176179 100078 4363 -61822 -80745 97874 -71497 -24572 -46208 268651 -24334
5846 -98169 246523 223862 -241125 -227815 90446 147684 20861 -245996 5553 116298 114037
5835 114037 44465 -579191 9331 -77484 -33456 2883 -110250 -106323 -170669 50923 178264 23517
5822 -47375 -227821 113750 -138602 -133093 -142967 -303612 -97274 -201526 45020 -158485 -130144
5811 -130144 -292499 122002 400792 129779 149016 91875 54238 -311893 -31706 25469 116146
5800 116146 -152311 311054 36353 -93195 -249558 -490201 -10802 112132 82939 83364 18815
5788 -62139 105476 -184998 -207041 -46266 209178 -22040 218063 -10858 -22415 -13420 148889
5776 285915 -167827 169634 -110770 -10737 104948 -117054 232240 -100293 -339828 -220433
5766 -220433 5673 5929 129421 255946 130068 313122 354243 -126605 -123270 -271612 -180492
5755 -180492 -110242 104836 86858 -79280 -201264 175766 -140775 -74428 4146 -21665 -121741
5744 -121741 105069 55542 -102008 113811 156331 -142247 114278 -44275 -143717 -74070 237006
5732 64533 -110936 -83517 -32910 -133220 -11797 82791 -241505 107255 -114574 216644 204699
5721 204699 190621 -222675 212998 48992 154618 297029 327846 -148680 96438 31965 -292620
5709 -182377 96613 100299 -124596 216252 13897 -296295 -83949 205724 -28312 -127053 -29531
5697 -185361 -60431 -223517 -211574 139360 -70862 513134 192073 -292101 -140128 26029
5686 17032 -227590 28872 370806 -220337 -377505 357475 31012 -263471 -193623 -6029 -18653
5675 -18653 -158450 191437 107516 -316450 -167645 36279 231346 -232588 30804 -32459 309352
5663 70379 194042 54404 108884 8504 121584 -28213 35853 116393 183764 -109942 -86743
5652 -86743 -55930 -145795 -144840 -245307 170584 1517 -67833 -317492 -47567 100238 132557 41625
5639 -150153 -180428 -168621 -205752 -175792 370427 -97340 185337 350678 -23549 82126 94002
5628 94002 -68984 255817 -24741 34043 -161457 96712 24125 133834 -172938 -8963 64436
5616 321318 80560 -12440 -60884 -189061 -109967 -119794 -124154 52777 -548 53709 -96588 35588
5603 147822 54170 322201 214210 -273540 -406597 168785 -183479 -97767 -299651 -134567
5592 4415 71687 85337 -44594 -127406 253996 -151792 -80966 -233769 -212475 184986 146295
5581 146295 -58906 -11591 -168289 360202 248080 116746 -82887 -18230 251127 52658 238588
5570 238588 -264358 2809 -58356 120565 340653 403285 -50389 -114471 184592 251527 39344
5558 128209 -334632 -50655 -32283 -49946 368107 72126 -38988 -178349 17161 -109062 -107929
5547 -107929 -19076 -177631 461675 137449 222781 -76517 -154175 -221408 -39465 295734 234272
5536 234272 -93604 -34381 -236648 236612 388996 -59335 -49570 252271 -7181 68148 150455
5525 150455 77176 203539 45424 234462 -206655 59329 168405 -30150 -186206 -292329
5515 -292329 -122935 30375 -31396 -25520 75174 35642 -183502 171338 91891 408763 -315541
5503 232998 -141263 -183929 -107516 220651 195111 -109589 -343061 -121997 -427605 186331
5492 -4376 -196898 -23863 -44576 40089 80118 -49298 -153189 176097 116129 -323931 -228509
5481 -228509 188061 -277271 159575 -238776 177126 -201192 91346 -232708 -134850 24129
5470 420653 139450 82523 -217359 -116742 -132322 157482 -48770 -47746 -159519 108824 360510
5459 360510 105116 -143251 157530 16031 -1277 -115236 59584 17155 -179330 -126541 -71641
5448 -71641 -18426 314355 349770 56229 128668 71602 213454 26784 -106742 20205 251571
5437 251571 7798 70233 83950 -19775 -132535 -100279 265129 -102736 107012 -154295 137477
5425 319748 -11822 354021 224593 135502 -104477 -84732 25643 -95403 178636 21184 -45963
5413 -175066 -10962 231607 -79278 -105958 47564 -15463 163926 -75115 -369378 -37932 34753
5401 -243099 258493 -326224 -7805 -266865 -281560 265959 20310 76587 -11631 92382 -89892
5389 -150061 22784 83829 103291 -5737 62986 -72990 12876 -301133 -161200 -59015 -93912
5378 -93912 -30430 37165 -94232 -154933 -256730 -238399 86040 126260 39980 -87182 -150062 73599
5365 -85781 7958 428368 63464 -152063 1973 -123053 -86585 94645 80327 -52875 67500 34078
5353 34078 255887 -522873 -102004 151078 -245556 -424910 107277 -191972 -220753 6440
5342 -107710 141764 96885 115362 66003 323872 -139705 -59962 -131757 32558 48903 263778
5331 263778 -127318 113642 -258921 -34152 -106554 -39206 114029 264115 156222 280398
5321 280398 23490 163728 356971 116511 -75615 -12365 -345239 113827 -73621 -200336
5311 -200336 -160312 -43677 257420 164926 144686 -40537 -123371 201868 -43123 -190106 140328
5299 -31441 240213 -59935 54520 243357 -84635 360305 351399 44900 -6900 40135 -278916
5287 32314 91356 -12286 -90824 -209448 133333 325511 41537 -28020 -15820 248472 -129095
5275 151955 -49657 124612 -283148 -221068 115830 -204850 228313 -194951 86946 260021
5265 260021 196819 7114 -93583 44289 -157206 -6410 348138 -3059 102406 -241917 -24475
5253 87777 -238308 -296843 157120 8050 -111005 -17692 -132037 -422958 68701 -414511 8436
5241 -222232 1525 100339 -130013 40348 -104661 148614 191839 -23630 -10251 -362763 111725
5229 118152 425535 -62740 112585 48002 -171220 -218188 -187265 -6432 60767 234659 -349475
5217 -57046 -279274 76264 41405 -109898 -16988 -74459 70167 -281610 67498 276564 153266
5206 153266 -52802 -245235 -6381 -2792 18349 99184 -224123 -33039 -237896 96263 55704
5195 55704 423152 111697 -14465 126666 -120884 -23727 109369 -100723 -39905 -256850
5185 -256850 306420 -260551 159136 288293 128638 2260 -79802 317825 -18737 -221060
5175 -221060 89052 -73379 -332282 71653 -11091 -52395 279857 -271866 41224 -114447 19211
5163 -290475 41048 -80323 98440 -60382 -305260 -99947 39343 131378 -114994 242777 185817
5152 185817 235209 378355 69760 -143512 -4526 -115111 -10558 137711 100879 -100732 -64840
5141 -64840 -94271 144207 -116937 -140313 385939 21757 5291 -27436 -176675 403224 211051
5130 211051 73608 -92287 -162787 118200 -17700 -65728 18138 224330 103662 51008 6077
5118 -297449 -89246 -32012 275618 -73532 -297052 254243 -314656 -188149 -148843 -56534 9028
5106 190200 168007 -266339 94875 -68941 274117 -104526 -122140 -139338 34625 79869 57379
5095 57379 204679 284653 120836 -110146 -221783 -128107 57480 -181624 175703 142384 300683
5084 300683 187170 27909 -162092 -244539 -69334 -24684 89770 -254511 -73794 578670 102613
5072 -181573 29244 124093 97692 181334 -17865 -16077 -22700 195173 -18049 -60906 -111835 23855
5059 -120627 -312215 288155 228520 -60415 106514 -68769 23190 249618 -82392 -105035 1750
5047 -39970 263762 469839 -86225 -171683 -125931 -53264 168137 130237 -354455 139262 66715
5035 86155 -175158 62515 -181223 20808 252236 330398 -40555 -124908 50347 -64422 172287
5023 100107 -128846 78268 -297225 75728 -333239 -50299 135167 -98406 205343 -99855 -32143
5011 -257075 187791 328954 11377 22292 119100 -182424 -52580 -129386 -125258 -249636 19265
4999 -103069 23357 69465 -179541 135502 154410 -19551 47526 150946 46929 16680 33967
4988 33967 132180 -117117 -201386 -184960 47970 -68412 128 41233 8637 -124250 -172305 -60815
4975 -75780 -192473 11917 316034 -157035 55333 -135610 -137689 167946 48932 -18081 156813
4963 34038 206265 -129454 167150 -268989 156192 137414 87358 -117899 142508 11629
4952 261139 -190735 -42861 131575 218722 -256528 13320 123912 -149694 -98459 211266
4941 -55289 612626 -171310 -143602 -146699 -58866 -158477 38975 111087 -60908 -119178 -160273 -16605
4928 317434 32000 152971 265981 -164573 -183449 -262507 28750 104648 -80670 4641 55400
4917 55400 18036 29198 -139094 -358763 -206178 -37510 2166 76159 197214 -148020 81979
4905 -385900 -402939 -99135 -339503 -127804 -244239 373922 152882 -131088 -95081 35884
4894 -76705 -90445 77312 146658 -97206 -124662 -179887 -138629 -104059 201169 -261526 -2066 -178446
4882 -178446 184599 168493 -59543 336888 122926 48803 63129 256062 -190128 -125964 231511
4870 252784 -44341 86520 54891 -24755 -96948 -10626 120044 150554 -168774 -15289 383810
4858 172526 44193 -75212 83930 -216756 -237802 310464 197420 34982 -244936 295240 -29671
4846 197778 602245 -200453 -219392 -122929 -271500 -220623 37370 49388 -148352 -161772 -12591
4834 32094 -103265 108112 24460 8971 24437 77748 134882 -295409 -95922 59573 142276
4823 142276 74582 37619 117049 22580 234956 -75157 -142569 -66812 64145 -138330 -185180
4812 -185180 63242 179872 104571 -340541 -201947 190317 68205 -140134 140789 363166
4802 363166 118574 -34406 -72795 -138876 68478 -76894 -280851 15774 271427 376937 85397
4790 30711 -123113 -335757 79279 -28688 136432 25845 53675 -112012 -6553 489635 69216
4778 -151245 -24239 45854 -6344 35540 238945 -262247 200812 -57331 -330093 115298 104756
4767 104756 -138248 110619 -11676 -180822 38426 -156757 130839 105850 114227 -164754 -123434
4756 -123434 -485457 -406073 224195 -98043 -76953 256522 -30558 -24756 -72893 -166814 149593
4744 -139942 82805 315431 -4970 -140866 265854 -4681 12990 88141 233784 43424 -224232
4732 -22412 187659 102956 319320 -141919 -22563 -12047 41969 121335 124476 118541 95565 -231633
4719 150541 242202 278297 -22258 -166131 83120 136790 -309610 -227550 98857 -137937 -20662
4707 406640 -166521 134882 -144336 -95231 2530 71304 22671 165234 188132 14099 14978
4696 14978 157701 -348853 95141 -47671 -10666 164849 93258 -53901 236492 -989 -8196 157291
4683 153721 -92454 46874 149023 -118990 -3463 270700 -46671 393431 -14843 -143755 100815
4671 16842 -164866 -35395 109694 201442 93783 195892 -223201 -49322 -243859 -34783 -269145
4660 -269145 237515 -105540 -67364 -332482 86716 153874 138628 51891 -110028 130800 -32797
4648 106658 -49905 210669 -95514 -70067 141244 -245581 -173396 -78473 258964 -205245 -98049
4636 76817 141132 -50331 -18657 51698 -90834 183245 -14316 84065 -169303 21535 -39480
4624 96129 -252701 115742 65177 79239 19117 146616 -150547 26475 186285 31063 -22632
4612 -184644 -202556 33776 188768 -53379 -34271 -108005 300890 -32303 139427 72867 70634
4601 70634 18305 -88582 -202345 -53348 -128114 42608 390109 57762 -12566 55618 -309248
4589 29348 279379 -95547 52520 -58252 -334877 219092 -73193 330480 45853 -72962 1086
4577 94610 7898 -39445 147240 204163 269456 41302 -255227 -12932 -204455 -160312 -103672
4566 -103672 -125566 117387 205929 301561 -151921 142727 172401 33724 -154980 200549 76517
4554 140441 60232 107550 294886 -216597 139555 259691 967 28358 237680 165891 135734
4543 135734 -112666 50256 -123351 -204854 -90141 -85961 153000 -64772 390014 73439 337991
4532 337991 -75003 339954 -203689 -347661 -55170 -33949 -88823 -114422 217961 164481 189998
4521 189998 -46358 231733 -50733 304116 218681 44981 71350 -184257 -129806 -202661 -155164
4510 -155164 -169265 327636 -186479 135903 290543 -154205 -184321 -435645 40028 125450
$$ [...]
##END NTUPLES=NMR SPECTRUM
##END=
