##TITLE=AC1461_TOLI13267_8026622_EWjM0qlpsz
##JCAMPDX= 6.0         $$ Bruker NMR JCAMP-DX V2.0
##DATA TYPE= NMR SPECTRUM
##DATA CLASS= NTUPLES
##ORIGIN= BRUKER
##OWNER= Administrator
$$ 1.72 TOPSPIN		Version 2.1
$$ 2013-07-11 17:59:21.764 -0700  Administrator@X
$$ Compression mode = diff/dup
##.OBSERVE FREQUENCY= 400.02188249412
##.OBSERVE NUCLEUS= ^1H
##.ACQUISITION MODE= SIMULTANEOUS (DQD)
##.ACQUISITION SCHEME= undefined
##.AVERAGES= 64
##.DIGITISER RES= 22
##SPECTROMETER/DATA SYSTEM= spect
##.PULSE SEQUENCE= noesygpps1d.comp
##.SOLVENT NAME= COFFEE_meoh
##.SHIFT REFERENCE= INTERNAL, COFFEE_meoh, 1, 14.96109
##AUDIT TRAIL= $$ (NUMBER, WHEN, WHO, WHERE, PROCESS, VERSION, WHAT)
$$ ##TITLE= Audit trail, TOPSPIN		Version 2.1
$$ ##JCAMPDX= 5.01
$$ ##ORIGIN= Bruker BioSpin GmbH
$$ ##OWNER= Administrator
$$ $$ E:\/data/COFFEE/nmr/AC1461_TOLI13267_8026622_EWjM0qlpsz/12/pdata/1/auditp.txt
$$ ##AUDIT TRAIL=  $$ (NUMBER, WHEN, WHO, WHERE, PROCESS, VERSION, WHAT)
(   1,<2013-07-11 17:59:16.827 -0700>,<Administrator>,<X>,<go>,<TOPSPIN 2.1>,
      <created by zg
	started at 2013-07-11 17:47:47.264 -0700,
	POWCHK enabled, PULCHK disabled,
       configuration hash MD5:
       C8 4E 4E 5D D3 5C D8 9E 9F 52 82 E0 59 8A DE 15
       data hash MD5: 64K
       25 AE 0D 13 F3 36 10 44 11 F3 D6 C5 C7 8E D9 9E>)
(   2,<2013-07-11 17:59:19.733 -0700>,<Administrator>,<X>,<proc1d>,<TOPSPIN 2.1>,
      <Start of raw data processing
       efp LB = 0.3 FT_mod = 6 PKNL = 1 PHC0 = 0 PHC1 = 0 SI = 128K 
       data hash MD5: 128K
       81 F7 59 E5 C2 90 95 CC EA 5B 01 65 87 AD 8C E1>)
(   3,<2013-07-11 17:59:20.702 -0700>,<Administrator>,<X>,<proc1d>,<TOPSPIN 2.1>,
      <pk PHC0 = -80.07385 PHC1 = 0 
       data hash MD5: 128K
       44 10 F7 33 E4 BE BA 63 C6 D5 D1 D5 83 8A E2 AB>)
(   4,<2013-07-11 17:59:21.170 -0700>,<Administrator>,<X>,<proc1d>,<TOPSPIN 2.1>,
      <abs ABSG = 1 
       data hash MD5: 128K
       B2 C4 3E F2 60 85 8E BD 46 0B AB 94 33 2D 94 9C>)
(   5,<2013-07-11 17:59:21.280 -0700>,<Administrator>,<X>,<proc1d>,<TOPSPIN 2.1>,
      <abs ABSG = 2 
       data hash MD5: 128K
       25 7C 98 50 86 B4 0C 78 BC 18 E1 E1 3E 67 93 01>)
(   6,<2013-07-11 17:59:21.358 -0700>,<Administrator>,<X>,<proc1d>,<TOPSPIN 2.1>,
      <abs ABSG = 3 
       data hash MD5: 128K
       95 84 85 1F 6A A6 7E 61 B2 30 E2 F0 D1 76 B0 DA>)
(   7,<2013-07-11 17:59:21.483 -0700>,<Administrator>,<X>,<proc1d>,<TOPSPIN 2.1>,
      <abs ABSG = 4 
       data hash MD5: 128K
       47 7A F3 4A 19 76 2F 6B F4 AA BA 90 6B 67 28 44>)
(   8,<2013-07-11 17:59:21.577 -0700>,<Administrator>,<X>,<proc1d>,<TOPSPIN 2.1>,
      <abs ABSG = 5 
       data hash MD5: 128K
       A7 69 D1 4E E5 15 72 5A 83 BD AD 3B 8B 05 DD 71>)
$$ ##END=
$$ 
$$ $$ hash MD5
$$ $$ 24 D5 B2 A0 2D AB E4 B9 E1 F4 01 EF E5 83 79 78
##$RELAX= 
##$RELAX= 
##$RELAX= 
##$RELAX= 
##$RELAX= 
##$RELAX= 
##$RELAX= 
##$RELAX= 
$$ Bruker specific parameters
$$ --------------------------
##$DU= <E:\>
##$EXPNO= 12
$$ [...]
##$TP07= 0
##$TPNAME0= <>
##$TPNAME1= <>
##$TPNAME2= <>
##$TPNAME3= <>
##$TPNAME4= <>
##$TPNAME5= <>
##$TPNAME6= <>
##$TPNAME7= <>
##$TPOAL= (0..7)
0.5 0.5 0.5 0.5 0.5 0.5 0.5 0.5
##$TPOFFS= (0..7)
0 0 0 0 0 0 0 0
##$TUNHIN= 0
##$TUNHOUT= 0
##$TUNXOUT= 0
##$USERA1= <user>
##$USERA2= <user>
##$USERA3= <user>
##$USERA4= <user>
##$USERA5= <user>
##$V9= 5
##$VALIST= <valist>
##$VCLIST= <CCCCCCCCCCCCCCC>
##$VD= 0
##$VDLIST= <DDDDDDDDDDDDDDD>
##$VPLIST= <PPPPPPPPPPPPPPP>
##$VTLIST= <TTTTTTTTTTTTTTT>
##$WBST= 1024
##$WBSW= 4
##$XGAIN= (0..3)
0 0 0 0
##$XL= 0
##$YL= 0
##$YMAX_a= 6386243
##$YMIN_a= -12681418
##$ZGOPTNS= <>
##$ZL1= 120
##$ZL2= 120
##$ZL3= 120
##$ZL4= 120
##$ABSF1= 14.96109
##$ABSF2= -5.597092
##$ABSG= 5
##$ABSL= 3
##$ALPHA= 0
##$AQORDER= 0
##$ASSFAC= 0
##$ASSFACI= 0
##$ASSFACX= 0
##$ASSWID= 0
##$AUNMP= <proc_prof1d_extract.lims>
##$AXLEFT= 0
##$AXNAME= <>
##$AXNUC= <1H>
##$AXRIGHT= 0
##$AXTYPE= 0
##$AXUNIT= <>
##$AZFE= 0.1
##$AZFW= 0.1
##$BCFW= 0
##$BC_mod= 0
##$BYTORDP= 0
##$COROFFS= 0
##$CY= 15
##$DATMOD= 1
##$DC= 0
##$DFILT= <>
##$DTYPP= 0
##$F1P= 0
##$F2P= 0
##$FCOR= 0.5
##$FTSIZE= 131072
##$FT_mod= 6
##$GAMMA= 0
##$GB= 0
##$INTBC= 1
##$INTSCL= 1
##$ISEN= 128
##$LB= 0.3
##$LEV0= 0
##$LPBIN= 0
##$MAXI= 10000
##$MC2= 0
##$MEAN= 0
##$ME_mod= 0
##$MI= 0
##$NCOEF= 0
##$NC_proc= -2
##$NLEV= 6
##$NOISF1= 0
##$NOISF2= 0
##$NSP= 0
##$NTH_PI= 0
##$NZP= 0
##$OFFSET= 14.96109
##$PC= 1
##$PHC0= -80.07385
##$PHC1= 0
##$PH_mod= 1
##$PKNL= yes
##$PPARMOD= 0
##$PPDIAG= 0
##$PPIPTYP= 0
##$PPMPNUM= 2147483647
##$PPRESOL= 1
##$PSCAL= 4
##$PSIGN= 0
##$PYNMP= <proc.py>
##$REVERSE= no
##$SF= 400.020009599481
##$SI= 131072
##$SIGF1= 0
##$SIGF2= 0
##$SINO= 400
##$SIOLD= 131072
##$SPECTYP= <>
##$SREGLST= <1H.CDCl3>
##$SSB= 0
##$STSI= 131072
##$STSR= 0
##$SW_p= 8223.68421052631
##$SYMM= 0
##$S_DEV= 0
##$TDeff= 65536
##$TDoff= 0
##$TI= <>
##$TILT= no
##$TM1= 0
##$TM2= 0
##$TOPLEV= 0
##$USERP1= <user>
##$USERP2= <user>
##$USERP3= <user>
##$USERP4= <user>
##$USERP5= <user>
##$WDW= 1
##$XDIM= 131072
##$YMAX_p= 428048119
##$YMIN_p= -11219
##$CURPLOT= <Network HP LaserJet P1505>
##$CURPRIN= <$Network HP LaserJet P1505>
##$DFORMAT= <normdp>
##$LAYOUT= <+/1D_H.xwp>
##$LFORMAT= <normlp>
##$PFORMAT= <normpl>
##$SURQMSG= 1
$$ End of Bruker specific parameters
$$ ---------------------------------
##NTUPLES= NMR SPECTRUM
##VAR_NAME=  FREQUENCY,     SPECTRUM/REAL,   SPECTRUM/IMAG
##SYMBOL=    X,             R,               I
##VAR_TYPE=  INDEPENDENT,   DEPENDENT,       DEPENDENT
##VAR_FORM=  AFFN,          ASDF,            ASDF
##VAR_DIM=   131072,        131072,          131072
##UNITS=     HZ,            ARBITRARY UNITS, ARBITRARY UNITS
##FACTOR=    0.0627417313425164, 1,          1
##FIRST=     8223.62146879497, 1847,         -57254
##LAST=      0,             2940,            -57411
##MIN=       0,             -11219,          0
##MAX=       8223.62146879497, 428048119,    0
$$ Real data points
##PAGE= N=1
##DATA TABLE= (X++(R..R)), XYDATA
$$ [...]
67911 87321 85820 84142 82524 80752 78650 76449 74522 73085 72294 72334 73138 74229 75072 75490 75612 75552 75213
67894 75213 74386 73085 71839 71444 72149 73268 73975 74305 74905 75888 76591 76490 75707 74454 72728 70917 70033
67877 70033 70703 72295 73685 74583 75548 76876 78174 79004 79375 79457 79261 78809 78274 77730 77023 76060 75046 74220
67859 74220 73489 72495 71025 69301 67884 67298 67614 68302 68544 67799 66149 64079 61988 59989 58201 57021
67843 57021 56854 57579 58569 59350 59974 60571 60862 60521 59791 59237 58980 58799 58964 60209 62513 64605 65324 65042
67825 65042 65109 66182 67777 69357 71052 73188 75738 78515 81403 84089 86002 86847 86936 86615 85658 83613
67809 83613 80647 77601 75186 73369 71632 69613 67433 65514 64137 63173 62246 61168 60072 59102 58206
67794 58206 57391 56983 57262 57918 58214 57805 57105 56738 56867 57207 57460 57514 57371 57177 57229 57738 58516 59103 59181 58794
67774 58794 58247 57974 58406 59656 61306 62776 63996 65410 67176 68639 68965 68199 67345 67301 67988 68666 68917
67757 68917 69037 69417 69841 69661 68666 67468 66852 66917 67075 66802 66091 65227 64525 64307 64767 65638 66312 66537 66726
67738 66726 67297 67970 68075 67347 66039 64429 62697 61203 60349 59988 59419 58147 56336 54435 52718 51387
67722 51387 50702 50639 50666 50314 49878 50167 51548 53417 54728 54913 54327 53924 54427 55614 56461 56120 54757 53292
67704 53292 52438 52180 52126 52019 51818 51590 51570 52143 53484 55193 56491 56851 56335 55347 54238 53204 52418 52005
67686 52005 51906 51850 51557 50932 50146 49589 49721 50756 52433 54178 55513 56246 56294 55553 54112 52429 51119 50528
67668 50528 50584 51002 51526 52040 52606 53378 54383 55400 56157 56592 56856 57111 57451 57961 58708 59631 60497 60960 60715
67649 60715 59767 58609 57886 57692 57389 56396 55003 54111 54244 55183 56434 57666 58645 59248 59714 60535 61826
67632 61826 63030 63498 63218 62795 62862 63604 64675 65418 65341 64616 63961 63888 64135 64023 63266 62293 61886 62605 64381
67613 64381 66453 67823 68062 67632 67263 67117 66777 65937 64769 63580 62430 61294 60345 59780 59462 59010 58342
67596 58342 57861 57932 58340 58505 58186 57651 57139 56524 55701 54945 54547 54386 54260 54405 55167 56254 56869 56661 56044
67577 56044 55492 55055 54737 54773 55199 55577 55541 55276 55124 55025 54758 54382 54082 53862 53810 54319 55572 57066 58196
67558 58196 59028 59922 60587 60257 58814 57029 55598 54574 53967 54194 55552 57605 59529 60757 61071 60397
67542 60397 58914 57115 55454 54044 52938 52449 52814 53632 54000 53327 51852 50363 49529 49459 49761 49971 49969 50000
67524 50000 50369 51175 52313 53515 54365 54492 53899 53044 52483 52450 52770 53030 52869 52319 51923 52320 53578 55108
67506 55108 56261 56799 56706 55894 54403 52717 51501 50984 50823 50555 49998 49222 48408 47889 48142 49441 51516
67489 51516 53721 55648 57417 59218 60694 61128 60314 58877 57505 56200 54655 53086 52138 52003 52237 52532
67473 52532 53093 53975 54605 54416 53685 53295 53782 54956 56245 57095 57170 56562 55797 55363 55254 55108 54659 53860 52780
67454 52780 51739 51291 51675 52420 52978 53606 55000 57045 58603 58886 58428 58283 58653 58860 58411 57542 56739 56214
67436 56214 55933 55775 55475 54735 53605 52574 52096 52152 52387 52523 52429 51973 51164 50467 50606 51797 53356 54352
67418 54352 54535 54375 54273 54121 53735 53300 53141 53269 53436 53498 53456 53242 52748 52015 51236 50674 50724 51802 53771
67399 53771 55667 56452 56035 55154 54325 53497 52753 52578 53044 53356 52802 51791 51365 51933 53098 54503 56139
67382 56139 57761 58707 58594 57753 56710 55629 54533 53758 53744 54498 55583 56577 57332 57858 58185 58416 58745 59376
67364 59376 60352 61378 61849 61273 59854 58517 58096 58506 58887 58601 57913 57578 57907 58454 58701 58823 59535 61172
67346 61172 63167 64536 64693 63664 61741 59305 56900 55144 54437 54838 56118 57733 58980 59664 60536 62494
67330 62494 65253 67393 68016 67779 67870 68467 68849 68663 68326 68214 68223 68302 68819 70041 71564 72594 72646 71801 70433
67311 70433 68873 67287 65794 64627 64053 64027 64121 64014 63909 64197 64870 65602 66305 67157 68139 68995 69676 70370
67293 70370 71002 71218 71004 70846 71032 71249 71135 70813 70514 70047 69080 67727 66519 65932 66178 67145 68306 68997
67275 68997 69147 69423 70323 71525 72549 73553 74771 75513 74678 72312 69807 68343 67808 67547 67442 67746 68325
67258 68325 68666 68515 68109 67906 68318 69518 71145 72353 72522 71910 71339 71292 71589 71886 72086 72115 71665 70556
67240 70556 69214 68392 68273 68209 67602 66779 66574 67201 68103 68928 69993 71470 72771 73384 73887 75334 77764
67223 77764 80019 81061 80790 79544 77585 75398 73789 73207 73361 73852 74731 76044 77313 78047 78450 79058
67207 79058 79910 80675 81401 82488 83872 84881 85068 84745 84438 84196 83680 82682 81334 80005 79163 79106 79609 79949
67189 79949 79541 78585 77960 78448 80095 82277 84288 85832 86993 87841 88244 88148 87882 87959 88501 89032 88998 88415
67171 88415 87899 88003 88618 89091 88925 88207 87367 86754 86607 87179 88448 89819 90584 90815 91325 92555 93946 94798
67153 94798 95278 96039 97141 98022 98418 98626 98758 98413 97416 96378 96147 96949 98369 99861 101044 101764 102272
67136 102272 103132 104628 106345 107593 108056 107811 106959 105736 104826 105013 106336 107957 109037 109519 109996 111052
67120 111052 112846 115060 117122 118660 119817 120947 121978 122505 122580 122915 123952 125147 125741 125958 126844 128892
67104 128892 131396 133270 134026 133832 133144 132599 132857 134095 135770 137194 138195 139005 139781 140590 141685 143285
67088 143285 145024 146028 145740 144502 143245 142695 142902 143429 143931 144606 145992 148276 150957 153339 155179 156621
67072 156621 157765 158657 159570 160806 162194 163262 163943 164729 165983 167591 169435 171715 174455 177095 178998
67057 178998 180173 181111 182089 183003 183776 184584 185674 187181 189026 190801 191970 192472 192968 194162 195998 197902
67041 197902 199678 201678 204073 206484 208503 210214 211963 213890 215935 218082 220362 222771 225357 228230
67027 228230 231272 233985 235917 237230 238653 240827 243817 247198 250466 253301 255625 257589 259580 262174
67013 262174 265866 270608 275578 279646 282328 284303 286779 290330 294454 298341 301815 305316 309143 313067
66999 313067 316745 320176 323558 326961 330415 334144 338393 343071 347873 352691 357584 362335 366452 369784
66985 369784 372815 376163 380022 384298 389051 394495 400673 407335 414050 420347 425936 430965 435936 441184
66971 441184 446652 452262 458224 464657 471237 477597 483958 490918 498696 506969 515422 524015 532672 541129
66957 541129 549278 557393 565896 575015 584740 594855 604990 614830 624391 633995 643990 654629 666066
66944 666066 678220 690707 703186 715748 728711 742060 755414 768517 781435 794291 807180
66933 807180 820374 834264 848996 864556 881188 899234 918403 937680 956258 974223 992120
66922 992120 1010238 1028637 1047486 1066934 1086854 1107120 1127995 1149914 1173000 1197034 1221698
66911 1221698 1246563 1271089 1295068 1318997 1343671 1369436 1396145 1423743 1452426 1482106 1512030
66900 1512030 1541214 1569229 1596517 1624011 1652420 1681831 1711895 1742297 1772861 1803321 1833377
66889 1833377 1863029 1892495 1921601 1949703 1976592 2003118 2030385 2058452 2086312 2113046 2138440
66878 2138440 2162433 2184575 2204371 2221872 2237657 2252395 2266590 2280538 2294215 2307153 2318541
66867 2318541 2327548 2333719 2337177 2338475 2338137 2336358 2333103 2328313 2321870 2313581 2303444 2291893 2279518
66854 2279518 2266579 2252910 2238136 2221778 2203365 2182818 2160624 2137260 2112593 2086305 2058810
66843 2058810 2031133 2003779 1976315 1948330 1920215 1892484 1864745 1835974 1805741 1774716 1743951
66832 1743951 1713997 1684750 1655842 1627044 1598407 1570124 1542257 1514615 1486932 1459037 1430825
66821 1430825 1402313 1373853 1346090 1319400 1293449 1267581 1241600 1215971 1191229 1167450 1144333
66810 1144333 1121629 1099411 1078027 1057801 1038666 1020043 1001222 981973 962729 944120 926401
66799 926401 909290 892255 874906 857198 839464 822231 805904 790509 775751 761360 747415
66788 747415 734275 722151 710720 699196 686845 673585 660149 647539 636108 625190 613910
66777 613910 602330 591450 581888 573034 563891 554372 545160 536472 527807 519021 510813 503717 497242 490528
66763 490528 483384 476106 468704 460999 453243 445958 439248 432890 426934 421503 416097 409985 403454 397769
66749 397769 393530 389814 385435 380307 374960 369454 363677 358257 354075 350910 347485 342990 337782 332499
66735 332499 327329 322452 318364 315139 311990 308197 304054 300271 296773 292844 288320 283918 280302 277446
66721 277446 275005 272743 270369 267490 264061 260568 257484 254861 252666 251096 250133 249116 247281 244621
66707 244621 241777 239153 236571 233798 230906 227987 224928 221716 218658 216085 213979 212058 209998 207526
66693 207526 204583 201589 199258 197865 196867 195504 193568 191367 189203 187268 185823 184995 184433 183551 182128
66678 182128 180316 178175 175674 173133 171046 169354 167521 165572 164400 164571 165325 165316 163996 161775 159235
66663 159235 156911 155525 155528 156297 156517 155475 153442 150808 147731 144842 143352 143753 144924 145223 144161 142536
66647 142536 141281 140798 141083 141760 141968 140928 138845 136849 135888 135909 136078 135540 134000 131921 130145 129069
66631 129069 128253 127088 125642 124418 123529 122739 122190 122281 122739 122647 121689 120592 119879 118941 117048 114740 113320
66614 113320 113253 113877 114580 115396 116300 116708 116131 114877 113713 113025 112605 112032 111039 109648 108172 107054 106506
66597 106506 106330 106209 106137 106448 107355 108454 108816 107715 105335 102618 100376 98707 97343 96225 95451 94881
66581 94881 94300 93953 94439 95910 97723 99113 99950 100553 100998 101006 100532 100035 99953 100074 99727 98554 96845 95043
66563 95043 93211 91230 89356 88180 87999 88496 89112 89457 89318 88618 87583 86707 86317 86362 86742 87528 88609
66546 88609 89496 89818 89775 89712 89601 89354 89314 89772 90250 89991 89087 88362 88070 87542 86365 85133 84571 84505 84223 83429
66526 83429 82345 81205 80135 79305 78783 78412 78055 77741 77374 76747 76151 76391 77717 79187 79737 79482 79226
66509 79226 79041 78268 76817 75493 74850 74544 74127 73729 73572 73430 73050 72651 72556 72683 72800 72929 73062 72853 72080
66490 72080 71157 70659 70520 70259 69851 69816 70398 71176 71646 71743 71609 71250 70690 70241 70270 70843 71698 72492 72926 72815
66470 72815 72220 71397 70466 69284 67882 66829 66766 67510 68034 67628 66845 66971 68555 70736 72099 71972 70833
66453 70833 69668 69175 69444 70074 70484 70311 69629 68739 67746 66499 64997 63643 62906 62857 63225 63809 64569 65307
66435 65307 65628 65426 65205 65604 66659 67772 68425 68668 68797 68814 68430 67551 66485 65619 65032 64512 63879 63182
66417 63182 62621 62323 62229 62148 61880 61326 60550 59832 59607 60190 61484 63014 64301 65135 65456 65130 64011 62179
66399 62179 59973 57872 56416 56084 56874 58036 58583 58272 57835 58075 58964 59890 60537 61150 61985 62894 63609 64165
66381 64165 64840 65726 66534 66795 66277 65248 64369 64237 64890 65762 66184 65914 65175 64207 62954 61254 59241 57341
66363 57341 55818 54549 53395 52608 52594 53332 54349 55344 56531 58241 60345 62224 63197 63000 62085 61488 62000
66346 62000 63279 64095 63712 62685 61967 61620 60966 59781 58661 58164 58220 58553 59138 59961 60739 61261 61750 62538
66328 62538 63553 64397 64778 64650 64060 63172 62340 61870 61675 61335 60558 59488 58600 58350 58826 59639 60211 60294 60155
66309 60155 60168 60328 60271 59687 58626 57464 56674 56526 56882 57324 57600 57895 58619 59977 61735 63306 64042 63671
66291 63671 62582 61533 60958 60709 60516 60415 60463 60358 59753 58888 58509 59125 60592 62370 63872 64530 63998 62560
66273 62560 61127 60520 60812 61481 62136 62926 64257 66210 68250 69515 69441 68143 66181 64060 62121 60774
66257 60774 60446 61062 61848 61909 61073 60002 59519 59920 60834 61597 61723 61223 60564 60319 60774 61790 62933 63699
66239 63699 63754 63147 62319 61789 61753 62052 62501 63072 63672 63928 63496 62630 62187 62846 64382 65860 66550 66495 66223
66220 66223 66115 66161 66154 65959 65610 65275 65121 65181 65368 65638 66040 66552 67017 67360 67769 68473 69413 70311 70974 71333
66200 71333 71294 70870 70475 70649 71361 71885 71667 71034 70673 70591 70126 69004 67830 67199 66701 65357 63025 60959
66182 60959 60712 62639 65631 68163 69397 69383 68569 67389 66192 65228 64524 63914 63347 63107 63514 64414 65209
66165 65209 65513 65535 65564 65295 64136 62223 60609 60143 60491 60710 60532 60529 61051 61648 61783 61638 61834 62627 63792
66146 63792 65116 66526 67761 68348 68060 67178 66176 65318 64669 64286 64260 64615 65305 66275 67485 68838 70105
66129 70105 70920 70950 70167 68942 67820 67200 67175 67517 67796 67763 67767 68524 70181 71846 72450 71958 71225 70705 69937
66110 69937 68542 67113 66604 67150 68041 68726 69283 69916 70522 71047 71891 73541 75873 78098 79504 80111 80478
66093 80478 80976 81433 81499 81139 80565 79888 79155 78673 78884 79738 80528 80632 80191 79805 79771 79946 80196 80508 80732 80668
66073 80668 80523 80802 81585 82253 82248 81776 81426 81321 81027 80251 79204 78243 77514 77011 76703 76424 75947 75384 75276
66054 75276 75985 77150 78115 78786 79661 80966 82256 83054 83509 84004 84422 84290 83606 83041 83188 83932 84696 85044
66036 85044 84922 84600 84561 85168 86235 87111 87433 87557 87995 88645 89014 89130 89733 91336 93406 94816 95057 94744
66018 94744 94835 95543 96255 96500 96602 97074 97689 97731 97244 97351 98904 101302 103230 104315 105365 107055 109105
66001 109105 110937 112535 114263 116220 118224 120258 122586 125420 128648 131848 134532 136529 138130 139665
65987 139665 140892 141142 140122 138205 135799 132882 129515 126332 123921 121948 119524 116417 113319 110855
65973 110855 108931 107226 105777 104656 103540 102129 100794 100258 100655 101322 101612 101534 101446 101481 101587 101932 102853
65956 102853 104333 105767 106439 106143 105259 104375 103962 104315 105480 107123 108659 109711 110428 111199 112160 113150 114135
65939 114135 115388 117052 118705 119690 119961 120387 121983 124865 128137 130870 132978 135071 137575 140293 142845
65924 142845 145230 147720 150290 152434 153648 154031 154352 155541 158097 161815 166022 170079 173736 177054 180018
65909 180018 182358 183803 184419 184570 184524 184228 183585 182842 182464 182556 182574 181834 180288 178592 177304 176188 174510
65892 174510 171927 168835 165781 162754 159282 155118 150648 146567 143281 140651 138131 135122 131430 127580
65878 127580 124566 122999 122476 121951 120759 119097 117536 116377 115633 115341 115519 115894 115922 115179 113583 111352
65862 111352 108871 106591 104832 103654 102973 102726 102746 102661 102228 101787 102034 103250 105023 106830 108570 110271
65846 110271 111594 112058 111768 111559 112215 113608 114780 114892 114085 113368 113608 114732 116004 116993 118048 119795
65830 119795 122397 125435 128426 131365 134839 139582 145675 152149 157658 161674 164757 167569 169988 171552
65816 171552 172402 173236 174365 175300 175388 174461 172662 169957 166185 161509 156556 152021 148175 144801 141614 138688
65800 138688 136428 135094 134447 133972 133366 132739 132378 132447 132913 133678 134755 136329 138578 141370 144256 146906
65784 146906 149529 152756 157112 162611 168778 175003 181011 187047 193467 200033 205755 209550 210948 210113
65770 210113 207406 203190 197864 191761 185035 177842 170517 163413 156670 150419 145173 141714 140570 141653
65756 141653 144352 147845 151513 155262 159361 163903 168720 174010 180559 188806 198015 206942 215121 222881
65742 222881 230294 236863 242224 246308 248698 248671 246193 242129 237070 230672 222646 213718 204880 196187 187074
65727 187074 177552 168377 160143 152826 146163 139955 134047 128502 123802 120456 118327 116663 114778 112447
65713 112447 109835 107408 105762 105104 104923 104541 103881 103329 102970 102478 101676 100767 100043 99807 100450 102021 103741
65696 103741 104581 104441 104128 104136 104153 104041 104450 105856 107610 108727 109310 110423 112656 115530 118361 121060 123851
65679 123851 126713 129556 132713 136891 142604 149776 157874 166299 174724 183219 192145 201924 212800 224701
65665 224701 237159 249364 260457 269998 278161 285271 291056 294591 295298 293960 292330 291658 291857 292184
65651 292184 292262 292157 291936 291802 292402 294301 297047 299340 300255 299780 297981 294272 287969 279209 268826 257520
65635 257520 245545 233046 220270 207425 194654 182195 170435 159824 150802 143630 138096 133538
65623 133538 129362 125422 121764 118238 114721 111552 109320 108223 107914 107943 107996 107749 106929 105741 104875 104808 105298
65606 105298 105763 106003 106287 106869 107696 108571 109273 109477 108849 107523 106315 106111 106955 107957 108229 107730 107039 106556
65588 106556 106267 106232 106875 108628 111575 115594 120588 126361 132459 138463 144396 150699 157847 166030 175045
65573 175045 184352 193477 202536 212136 222452 232596 241248 247776 252394 255399 256754 256419 254476 250785
65559 250785 244974 237060 227711 217648 207129 196361 185994 176721 168571 161049 153872 147120 140741
65546 140741 134486 128499 123533 120249 118533 117699 117177 116841 116842 117358 118411 119762 121063 122242 123555 125106
65530 125106 126497 127224 127251 126856 125977 124197 121468 118519 116281 115092 114601 114233 113549 112377 110930 109694
65514 109694 108934 108431 107938 107739 108369 109776 111144 111683 111257 110170 108736 107323 106462 106488 107165 107969 108672
65497 108672 109397 110182 110881 111505 112354 113659 115337 117199 119220 121437 123777 126187 128780 131611 134315
65482 134315 136255 137140 137316 137319 137263 136874 136093 135362 135122 135148 134594 132739 129603 125869 122391 119789 118278 117606
65464 117606 117190 116471 115246 113650 111852 109843 107584 105316 103654 103187 103919 105193 106325 107196 108050 108834
65448 108834 109154 108947 108773 109170 109974 110622 110917 111155 111645 112472 113688 115281 116968 118377 119572 121102 123369
65431 123369 126157 128912 131214 132891 133880 134160 133692 132383 130316 128070 126493 125937 125926 125788 125367 124904
65415 124904 124513 124144 123865 123781 123699 123288 122570 121942 121685 121756 122076 122683 123517 124442 125608 127435 129969 132577
65397 132577 134593 136040 137364 138638 139513 139919 140319 141089 142023 142680 142941 142906 142478 141427 139832 138119 136626
65380 136626 135410 134555 134248 134361 134294 133617 132679 132206 132363 132713 133119 134146 136258 139025 141531 143311 144499
65363 144499 145269 145752 146527 148603 152615 158295 164939 172080 179524 187043 194413 201596 208545 214968 220578
65348 220578 225483 229929 233686 236039 236463 235029 232097 227968 223047 218022 213505 209481 205355 200585
65334 200585 195231 189875 185020 180549 175835 170504 165031 160339 156821 154034 151432 149031 147077 145414
65320 145414 143651 141813 140366 139561 139154 138855 138676 138632 138411 137670 136470 135124 133720 132102 130285 128608
65304 128608 127361 126493 125826 125409 125490 126195 127363 128707 130061 131462 133037 134839 136760 138616 140358 142126
65288 142126 143954 145428 145880 145054 143483 142021 141097 140614 140463 140805 141757 143086 144364 145309 145806 145760 145055
65271 145055 143633 141597 139284 137218 135728 134575 133199 131442 129722 128367 127167 125852 124621 123799
65257 123799 123277 122811 122627 123096 123958 124551 124813 125297 126054 126263 125404 124173 123636 123887 124125 123851 123373 123210
65239 123210 123479 123972 124439 124698 124691 124524 124346 124161 123852 123371 122866 122634 122926 123594 123985 123510 122415 121592 121429
65220 121429 121281 120424 119137 118360 118543 119327 120208 120963 121479 121705 121838 122166 122681 123184 123735 124591 125643 126400
65202 126400 126568 126285 125659 124552 123022 121615 120927 121087 121828 122845 123944 125097 126463 128133 129695 130341
65186 130341 129648 128099 126686 126170 126742 128105 129656 130838 131609 132432 133655 135048 136090 136583 136825 137271
65170 137271 138124 139118 139673 139537 139237 139579 140594 141487 141869 142557 144622 147928 151216 153524 154984 156259
65154 156259 157803 159961 163288 168249 174674 181858 189323 197254 206050 215619 225504 235822 247707 262336
65140 262336 279591 298066 316336 333706 349726 363808 375871 386853 397788 408537 418069 425813
65128 425813 432018 436703 439037 438202 434419 428717 421890 414095 405317 395779 385728 374966 362802 348637
65114 348637 332672 315966 299736 284666 270909 258456 247160 236602 226337 216390 207208 199107
65102 199107 192023 185809 180385 175505 170740 165885 161135 156732 152740 149288 146708 145159 144370 144013 144104
65087 144104 144730 145574 146070 145980 145533 145071 144803 144858 145270 145887 146478 146920 147117 146827 145919 144774 144110 144269 144885
65068 144885 145407 145725 146122 146734 147290 147386 146940 146354 146207 146707 147470 147918 147918 147857 148117 148678 149334 150011 150690 151161
65048 151161 151162 150707 150051 149315 148376 147201 146030 145113 144414 143802 143382 143346 143391 142589 140146 136329 132419 129576
65030 129576 127867 126513 124994 123581 122776 122593 122683 122949 123654 124889 126273 127309 127798 127802 127442 126972 126832
65013 126832 127346 128356 129363 130062 130571 131203 132202 133732 135889 138521 141123 143081 144161 144782 145748 147530
64997 147530 149749 151500 152274 152468 152826 153546 154160 154205 153730 153148 152868 153122 153891 154899 155907 157089 158912
64980 158912 161536 164536 167277 169318 170335 170045 168508 166299 164005 161678 159109 156533 154630 153692 153120
64965 153120 151945 149749 146935 144229 142090 140630 139911 140003 140639 141021 140400 138939 137667 137374 137789 138046
64949 138046 137673 136806 135645 134217 132712 131630 131426 132149 133465 134866 135885 136374 136594 136833 136953 136589
64933 136589 135771 135026 134743 134741 134565 134024 133288 132688 132534 132962 133774 134494 134679 134122 132901 131496 130744 131221 132526
64914 132526 133593 133850 133776 134146 135179 136736 138859 141562 144342 146528 148070 149502 151129 152733 154163
64899 154163 155819 158403 162455 168173 175261 182787 189544 194875 199044 202726 206355 210039 213747 217244
64885 217244 220059 221868 222871 223547 224091 224271 223775 222438 220162 216868 212594 207504 201799 195882 190658
64870 190658 187245 186054 186246 186471 186152 185779 185925 186339 186263 185347 183869 182182 180392 178549 176662 174403
64854 174403 171247 167257 163349 160381 158211 156088 153749 151618 150037 148931 148254 148163 148511 148705 148386 147873
64838 147873 147615 147552 147354 146933 146352 145536 144528 143776 143687 144042 144352 144632 145302 146377 147389 148169 149140 150654
64820 150654 152572 154749 157463 160993 165119 169403 173716 178178 182797 187438 192082 196880 202096 208089
64806 208089 215003 222239 228517 232774 234824 234972 233400 230345 226467 222393 217996 212756 206798 201018
64792 201018 196053 191689 187442 183241 179292 175704 172598 170321 169144 168806 168646 168205 167631 167525 168390 170129
64776 170129 172131 173964 175910 178568 181986 185567 188856 192067 195701 200010 204943 210284 215646 220680
64762 220680 225585 231067 237480 244201 250176 254918 258676 261810 264406 266448 268061 269540 271266 273472
64748 273472 275881 277669 277961 276323 272739 267433 260971 254232 247861 241819 235732 229514 223337 217280
64734 217280 211459 206387 202647 200215 198599 197609 197480 198150 198989 199458 199589 199547 199206 198583 198322 199279 201705
64717 201705 205152 209051 213037 216834 220217 223167 225796 228038 229537 229938 229173 227429 224889 221593 217561
64702 217561 212990 208228 203432 198402 193005 187735 183439 180327 177547 174126 170219 167073 165708 165949
64688 165949 166848 167756 168752 170159 171965 173867 175701 177708 180332 183802 187895 192119 196183 200333 205188
64673 205188 211175 218208 225907 233908 241716 248449 253221 255847 256817 256389 254146 249709 243574 236812 230239
64658 230239 224327 219618 216500 214521 212569 210000 207182 204793 203038 201810 201162 201253 202127 203903 206870
64643 206870 210979 215473 219561 223417 228064 234215 241632 249677 258058 266787 275647 284079 291565 297948
64629 297948 303355 307917 311532 313730 313875 311733 307981 303864 300114 296311 291551 285709 279701 274554
64615 274554 270630 267828 266079 265330 265373 266057 267382 269015 270077 269974 269257 269009 269420 269608 268862 267370 265547
64598 265547 263313 260431 257025 253301 249072 244040 238365 232646 227457 223103 219632 216908 214841 213626
64584 213626 213490 214123 214861 215644 217261 220261 224106 227891 231494 235370 239469 243063 245583 247034 247539
64569 247539 246996 245323 242657 239213 235214 230961 226697 222362 217773 212984 208240 203665 199310 195366
64555 195366 191968 188922 186102 183988 183205 183451 183543 182728 181448 180538 180224 180352 181159 183103 185987 188776
64539 188776 190474 190925 190673 190275 189873 189291 188341 187069 185801 184966 184676 184441 183545 181912 180437 180075 180646
64522 180646 181037 180648 180138 180406 181439 182660 183917 185368 186647 187096 186930 187334 189049 191503 193718 195577
64506 195577 197722 200624 204331 208913 214579 221327 228792 236445 243701 249984 255094 259490 263787 267767
64492 267767 270202 269977 267259 263267 258919 254074 248276 241921 236238 232206 229876 228800 228597 228851 228926
64477 228926 228418 227565 226698 225457 223115 219682 216156 213476 211623 209906 207839 205613 203974 203767 205311
64462 205311 208060 211045 213737 216303 219039 221894 224554 226593 227456 226745 224798 222713 221478 221264 221682
64447 221682 222458 223615 225217 227261 229755 232720 236169 240144 244695 249794 255396 261522 268122 274991
64433 274991 282173 290332 300209 311713 324182 337693 353440 372450 394541 419199 446985 479390
64421 479390 517498 561529 611714 669026 734768 809656 893233 983741 1078297 1173368 1265397
64410 1265397 1351434 1429697 1499751 1561789 1615305 1658504 1689145 1705747 1707842 1695510 1669308
64399 1669308 1630569 1581168 1522586 1455240 1378859 1293604 1201083 1104453 1007495 913541 825270
64388 825270 745012 674389 613424 560660 514626 474804 440920 412117 387483 366803 349912
64377 349912 335747 323028 311618 302201 294677 287886 281031 274324 267938 261378 254440 247947 242699
64364 242699 238191 233134 227054 220784 215552 211984 209880 208575 207573 207066 207705 209745 212662 215841 219320
64349 219320 223492 228391 233652 238932 243967 248288 251357 253009 253466 252884 251111 247948 243509 238328 233208
64334 233208 228854 225479 222790 220507 218813 218183 218854 220615 223008 225585 228048 230333 232575 234875 237071
64319 237071 238773 239619 239501 238649 237500 236371 235245 233969 232546 231033 229265 226996 224355 221809 219541
64304 219541 217122 213944 209767 204826 199736 195342 192175 189850 187431 184650 182345 181352 181449 181891 182578
64289 182578 184041 186473 189447 192586 195927 199546 203305 207113 211064 215170 219302 223477 227932 232822
64275 232822 238047 243428 248825 254098 259170 264066 268626 272261 274334 274717 273672 271381 268157 265033
64261 265033 263369 263568 264694 265636 266133 266349 266038 264719 262323 259038 254708 249064 242518 236093 230344
64246 230344 224814 218877 212817 207755 204529 202864 201646 199959 197827 196030 195215 195278 195617 195877 196255 197050
64230 197050 198156 199137 199705 199889 199754 199202 198241 197241 196659 196563 196684 196877 197099 196905 195528 192838 189829
64213 189829 187666 186534 185848 185309 185029 184826 184232 183326 182807 183010 183539 184200 185524 187833 190400 192232 193338
64196 193338 194560 196443 198898 201820 205443 210185 216566 225048 235404 246468 257214 267891 279354
64183 279354 291261 301790 309274 313394 314542 312902 308671 302540 295257 287002 277726 267879 258296 249516
64169 249516 241562 234254 227406 220881 214812 209666 205779 202949 200727 198953 197650 196543 195089 193074
64155 193074 190943 189490 189368 190731 193092 195611 197769 199819 202394 205712 209351 212672 215256 217006
64141 217006 218122 218984 219838 220521 220716 220364 219654 218609 217052 215064 213216 212125 211858 211909 211717 211163 210640
64124 210640 210699 211640 213434 216028 219516 223909 228830 233718 238374 243171 248653 254993 261847 268683 275242
64109 275242 281733 288476 295275 301253 305507 307943 309321 310513 311854 313239 314657 316399 318722 321422
64095 321422 323901 325701 326849 327529 327540 326329 323558 319364 314045 307831 301101 294452 288299 282634 277352
64080 277352 272506 268049 263675 259306 255380 252192 249176 245419 240860 236506 233492 232298 232740 234211
64066 234211 235875 237097 237874 238522 239032 239098 238776 238562 238767 239286 240097 241445 243325 245283 247072 249123 252009
64049 252009 255746 259918 264266 268876 273942 279577 285719 292129 298700 305821 314127 323769 334219 344809
64035 344809 355049 364294 371704 376904 380309 382498 383614 383698 383140 382293 380986 378952 376567 374664 373663
64020 373663 373254 372794 371675 369423 365887 361360 356253 350718 344743 338465 332162 326112 320650 316126 312534
64005 312534 309439 306559 304088 302125 300240 298091 296148 295148 295067 295283 295568 296241 297479 299248 301883
63990 301883 305888 310963 316014 320428 324691 329408 334392 339238 344188 349748 355824 362013 368610 376576
63976 376576 386314 396977 407294 416895 426583 437431 449821 463364 477574 492436 508402 526029
63964 526029 545681 567367 590767 615600 642165 671321 703703 739182 777412 818735 864257
63953 864257 915271 973176 1039881 1117629 1208185 1312618 1432010 1567833 1721247 1892288
63943 1892288 2079997 2282952 2499266 2726329 2961166 3201084 3443561 3685173 3920688
63934 3920688 4143382 4346455 4524414 4673449 4790866 4874505 4922756 4934752 4910142 4848815
63924 4848815 4751284 4619491 4457026 4268566 4059326 3834897 3600992 3362902 3125176 2891752
63914 2891752 2666088 2450979 2248459 2060055 1887050 1730420 1590506 1466687 1357331
63905 1357331 1260324 1173995 1097457 1029887 969815 915674 866867 823618 785767 752379 722546
63894 722546 695813 671533 648711 626989 607127 589755 574165 559121 544573 531670 521072
63883 521072 512125 504001 497040 492445 490865 491702 493840 496804 501040 507178 515262 524817 535475 547247
63869 547247 560289 574711 590628 607967 626112 644071 661153 677227 692248 705936 718021
63858 718021 728401 736903 743274 747539 749844 749709 746085 738648 728535 717156 704657 690173 673306
63845 673306 654641 634998 614862 594597 574542 554732 534945 515182 495797 477051 458807
63834 458807 440749 422756 405179 388859 374606 362336 350992 339649 328480 318232 309109 300755
63822 300755 293059 286249 280291 274912 270220 266614 263976 261645 259347 257493 256358 255580 254740 253857 252934
63807 252934 251572 249494 247068 244891 243116 241534 240007 238493 236918 235297 233781 232312 230588 228587
63793 228587 226795 225511 224263 222361 219847 217515 216062 215505 215285 214649 213134 211076 209506 209202 209864
63778 209864 210492 210415 209609 208220 206360 204436 203165 202942 203394 203789 203772 203546 203410 203313 202901 201979 200824 199951
63760 199951 199557 199387 199233 199314 199927 200881 201601 201780 201672 201685 201946 202382 203058 204232 206014 208046 209624 210373
63742 210373 210862 212257 215106 218614 221506 223536 225709 228923 232813 236161 238097 238594 238164 237634 238125
63727 238125 240567 244887 249970 254680 258834 263037 267828 273207 278804 284164 288938 293097 296911 300454
63713 300454 303194 304434 304181 303133 301685 299444 295991 291762 287699 284261 281229 278397 275960 274223
63699 274223 273353 273522 274883 277224 279970 282713 285458 288167 290374 291628 292181 292833 294114 295892 297819
63684 297819 299795 301781 303417 304218 304195 303973 304115 304555 304936 305299 306080 307437 309038 310619 312326 314254
63668 314254 316057 317412 318578 320053 321802 323325 324355 324986 325134 324412 322711 320416 317785 314473 309956
63653 309956 304265 298089 292314 287532 283752 280507 277423 274719 272882 271883 271200 270707 270989 272413 274368
63638 274368 275894 276829 277861 279673 282535 286554 291703 297501 303222 308637 314238 320571 327720 335655
63624 335655 344665 354947 365973 376912 387869 400220 415218 432527 450725 469283 489409 512600
63612 512600 538954 567442 597472 629290 662868 697272 731397 764600 796066 824063 846520
63601 846520 862273 871412 874678 873016 867586 859686 850502 841030 832052 823814 815771 806852 795934 781941
63587 781941 763980 741948 716967 690719 664294 638028 612357 588272 566713 547904 531498
63576 531498 517122 504601 493907 485169 478632 474489 472766 473318 475785 479589 484208 489507 495652 502751
63562 502751 510756 519644 529444 540123 551791 564890 579805 596282 613734 632278 652977 676904
63550 676904 704450 735821 771574 811892 855542 900082 942917 981484 1012632 1033007 1040940 1037825
63538 1037825 1027187 1012475 995895 978943 963170 949942 939625 931307 923379 914384 903482 890405
63526 890405 874993 856696 834545 807847 777060 743872 710186 676973 644177 611710 580353
63515 580353 551577 526521 505183 486551 469418 453158 437840 423816 411314 400432 391265 383781
63503 383781 377572 371977 366606 361662 357604 354557 352172 350067 348214 346826 345959 345349 344651 343767 342933
63488 342933 342497 342588 342959 343210 343318 343942 346024 349937 355078 360402 365273 369756 374224 378869 383454 387248
63472 387248 389319 389286 387812 385974 384022 381135 376613 370911 365140 359905 355082 350507 346255 342281 338386
63457 338386 334730 331933 330404 329897 329967 330557 331908 334201 337655 342689 349487 357523 366018 374955 385192
63442 385192 397444 411593 427335 445084 465649 489138 514861 542460 572449 604984 638260
63431 638260 668760 693266 710519 721231 727244 730998 735096 741484 750814 762944 778126 797453
63419 797453 822037 851995 886358 923790 963174 1003441 1042936 1079072 1108848 1129981 1141735
63408 1141735 1144776 1140421 1130192 1115982 1100249 1085519 1073286 1063170 1053172 1040928 1024892 1004507
63396 1004507 979680 950550 917793 882644 846336 809684 773309 737893 703960 671820 642095
63385 642095 615850 593651 574784 558128 543629 532139 523841 517769 513151 510391 510233 512655 517246
63372 517246 524090 533405 544567 556391 568441 581469 596487 613913 633734 655848 679946 705487
63360 705487 732322 761194 793275 829134 868189 909002 949880 989229 1025496 1056955 1081744
63349 1081744 1098375 1106400 1106578 1100374 1089405 1075330 1059978 1045068 1031517 1018971 1006127 991617
63337 991617 974608 954734 931733 905382 875751 843365 809160 774424 740687 709279 680828
63326 680828 655356 632978 614229 599572 588905 581805 577823 575946 573892 568722 558531 543422
63314 543422 524879 504699 484633 466247 450317 436434 423719 411983 401795 393452 386392 379875
63302 379875 373861 368856 365034 361850 358570 354985 351512 348644 346371 344184 341647 338926 336568 334791
63288 334791 333133 330951 328058 324711 321151 317520 314201 311776 310435 309647 308674 307296 305813 304494 303342
63273 303342 302391 301860 301895 302356 302997 303700 304384 304885 305149 305510 306551 308547 311123 313515 315211 316402 317830
63256 317830 320166 323509 327504 331822 336331 340815 344859 348250 351345 354775 358889 363793 369832 377569
63242 377569 387059 397478 407875 418263 429703 443300 459309 477255 496630 517253 539092 562010
63230 562010 585813 610428 635879 662023 688374 714293 739383 763679 787426 810745 833641
63219 833641 856324 879346 903231 927980 953040 977739 1001577 1024010 1044084 1060504 1072121
63208 1072121 1078284 1078784 1073586 1062690 1046197 1024525 998585 969697 939109 907477 874959 841996
63196 841996 809854 780154 753845 730915 711155 694891 682671 674394 669166 666134 665232 667002 671903
63183 671903 679954 690844 704069 719018 735249 752770 771769 791894 812047 831162 849131 866676
63171 866676 884338 901871 918708 934638 949700 963586 975592 985148 991955 995419 994381 987894
63159 987894 976127 960009 940026 915898 887690 856717 824868 793268 762028 731125 700968
63148 700968 672113 645005 620238 598588 580391 565084 551651 539439 528328 518299 509176 500807
63136 500807 493293 486942 482032 478474 475686 473058 470651 469222 469300 470447 471724 472635 473304 473937 474742 476327
63120 476327 479539 484523 490289 495510 499575 502704 505288 507468 509279 510926 512796 515224 518136 520943
63106 520943 522960 524108 525051 526516 528544 530464 531462 531083 529425 527112 525044 523881 523622 523687 523357 522181
63090 522181 520154 517719 515561 514248 513991 514674 515984 517466 518711 519719 521021 523262 526608 530620 534699
63075 534699 538624 542755 547807 554305 562112 570496 578795 586989 595657 605483 616828 629547 643112
63062 643112 657176 672267 689715 710559 734651 761170 789848 821245 855905 893848 935059
63051 935059 979872 1028445 1080197 1134206 1189952 1247262 1305697 1364527 1423307 1482045 1540689
63040 1540689 1598823 1656028 1712200 1767335 1821334 1874300 1926772 1979226 2031376 2082237 2130766
63029 2130766 2176011 2216525 2250039 2274090 2286918 2287610 2275605 2250475 2212352 2162363 2102438 2034710
63017 2034710 1961163 1883787 1804794 1726514 1651030 1579987 1514723 1456403 1405859 1363292 1328236
63006 1328236 1299940 1277894 1262103 1252916 1250542 1254643 1264437 1279166 1298331 1321391 1347491 1375728
62994 1375728 1405598 1436831 1468867 1500893 1532595 1564460 1597075 1630269 1663133 1694521 1723292
62983 1723292 1748319 1768683 1783738 1792675 1794300 1787669 1772788 1750148 1719619 1680482 1632772 1578106
62971 1578106 1518898 1457128 1394099 1330880 1268529 1208032 1150358 1096387 1046522 1000524 957963
62960 957963 918634 882321 848559 817060 788068 761731 737340 713885 691379 670853 652779
62949 652779 636126 619452 602455 585878 570214 555241 540812 527375 515341 504376 493773
62938 493773 483389 473816 465649 458924 453319 448575 444501 440739 436827 432529 427969 423467 419366 415979
62924 415979 413453 411566 409764 407533 404819 402095 399995 398725 397741 396133 393540 390548 387942 385693
62910 385693 383119 380035 377150 375103 373578 371852 369876 368220 367123 366177 365042 363949 363344 363382 363911
62895 363911 364599 364859 364077 362292 360448 359605 359993 361069 362289 363412 364160 364172 363554 363102 363608 365076 366857
62878 366857 368410 369655 370695 371543 372214 372767 373099 372967 372398 371925 372166 373204 374567 375683 376242 376249 376057
62861 376057 376251 377219 378731 380144 381078 381719 382446 383384 384356 385099 385481 385697 386262 387532 389236 390759 391926
62844 391926 393127 394539 395693 396135 396147 396410 397170 398162 399159 400170 401143 401963 402742 403724 404827 405655 406075
62827 406075 406482 407364 408857 410770 412763 414354 415132 415237 415482 416714 419122 422285 425773 429493 433547
62812 433547 437991 442756 447638 452343 456695 460871 465361 470580 476586 483217 490489 498731 508300 519218
62798 519218 531128 543467 555606 567049 577930 589363 602950 619673 639432 661782 686880
62787 686880 715441 748044 784885 826108 872004 922871 979034 1040990 1109202 1183596 1263571
62776 1263571 1348592 1438438 1532634 1629837 1727958 1824679 1917555 2003815 2080501 2145083 2195897
62765 2195897 2231947 2252362 2256232 2243102 2213587 2169376 2112516 2044774 1967794 1883665 1795018
62754 1795018 1704482 1614063 1524960 1437798 1353111 1271843 1195383 1124865 1060439 1001421 947151
62743 947151 897431 852165 811038 773805 740564 711357 685630 662393 640909 621063 603139
62732 603139 587467 574249 563461 554807 547850 542175 537391 533074 528940 525157 522293 520870 521005 522559
62718 522559 525504 529887 535484 541777 548507 556147 565543 577048 590279 604829 621026 639823 662081
62705 662081 688153 717962 751249 787780 827579 871018 918517 970184 1025845 1085338 1148541
62694 1148541 1215164 1284645 1356154 1428421 1499664 1567951 1631623 1689010 1737895 1775822 1801154
62683 1801154 1813431 1812500 1797803 1769058 1727372 1675198 1615123 1549004 1478234 1404412 1329495 1255422
62671 1255422 1183742 1115526 1051382 991437 935435 883109 834613 790470 750977 715798 684310
62660 684310 656168 631255 609211 589467 571726 555955 541727 528081 514420 501257 489624
62649 489624 479854 471310 463294 455847 449452 444185 439404 434403 429296 425052 422545 421717 421885 422678 424198
62634 424198 426279 428099 428802 428217 426706 424596 422054 419318 416695 414423 412718 411818 411797 412504 413828 415851
62618 415851 418539 421547 424570 427636 430810 433933 437019 440653 445446 451254 457429 463784 470790 478853
62604 478853 487929 498034 509719 523757 540565 560047 581850 605788 632275 662278 696452 734265
62592 734265 774392 816074 859594 905185 951903 998002 1042040 1083019 1119552 1149552 1171126
62581 1171126 1183567 1187247 1182672 1169919 1149065 1120928 1087188 1049734 1009989 968794 926719 884309
62569 884309 842207 801233 762195 725483 690926 658330 628051 600772 576771 555732 537264
62558 537264 521174 507134 494544 483043 472821 464053 456276 448799 441667 435753 431757 429448 428048
62545 428048 427030 426256 425532 424462 422864 421099 419746 419022 418613 418069 417240 416386 416001 416581 418384 421283
62529 421283 424904 428967 433501 438746 444976 452543 461905 473390 486889 501963 518423 536799 558134
62516 558134 583184 611753 642902 675909 710925 748490 788516 830129 872590 915851 959815
62505 959815 1003291 1044170 1080617 1111741 1137145 1156279 1168469 1173349 1171125 1162628 1149274 1132875
62493 1132875 1115269 1098040 1082514 1069779 1060634 1055584 1055001 1059337 1069154 1084957 1106838 1134232
62481 1134232 1166107 1201486 1239607 1279391 1318885 1355499 1386742 1410667 1425968 1432229 1430073 1420468
62469 1420468 1403571 1378432 1344037 1300525 1249415 1192977 1133503 1072809 1012072 952212 894453
62458 894453 840275 790636 745492 704249 666512 632246 601541 574598 551756 533093 518017
62447 518017 505557 495083 486455 479477 473547 468088 463111 459122 456502 455068 454234 453506 452848 452640 453258
62432 453258 454536 455556 455094 452516 448329 443762 439685 436057 432368 428382 424298 420437 417084 414450
62418 414450 412427 410446 407902 404762 401459 398296 395327 392725 390699 388935 386664 383577 380242 377361
62404 377361 375074 373312 372370 372578 373691 375167 376903 379181 382014 385026 387990 391043 394361 397880 401322
62389 401322 404206 406059 407028 408138 410436 413955 418012 422398 427551 433540 439725 445720 451996 459078
62375 459078 466824 475091 484497 495629 507822 519711 531090 543420 558202 575520 594535 614975
62363 614975 637561 663275 692758 726418 764609 807476 854858 906542 962417 1022106 1084476
62352 1084476 1147740 1210023 1269516 1324015 1370799 1407619 1433827 1450192 1457576 1456246 1446548 1429558
62340 1429558 1406467 1377657 1343006 1303015 1259033 1212351 1163680 1113746 1063847 1015447 969510
62329 969510 926539 886978 851212 819321 791149 766404 744399 723940 703956 684217 665081
62318 665081 646616 628464 610565 593404 577346 562182 547673 534085 521766 510587 500330
62307 500330 491475 484896 480671 477684 474632 471146 467820 465508 464764 465579 467307 469056 470493 472165 474862
62292 474862 478896 484291 491318 500189 510213 519944 528477 536286 544440 553329 562491 571453 580161 588568
62278 588568 596257 602705 607772 611759 615130 618296 621588 625309 629755 635153 641564 648935 657410 667597
62264 667597 680385 696444 715998 739083 765873 796755 832249 872877 918905 970068 1025633
62253 1025633 1084702 1146198 1208490 1269296 1326152 1376809 1419174 1451351 1472266 1482122 1481903 1472507
62241 1472507 1454614 1429089 1396924 1358718 1314719 1265495 1212189 1156032 1098132 1039962 983493
62230 983493 930351 881061 835501 793890 756835 724511 696260 671130 648552 628403 610657
62219 610657 595172 581752 570294 560722 552708 545575 538764 532434 527268 523529 520624 517875 515360
62206 515360 513564 512459 511512 510619 510466 511774 514457 517712 520722 523269 525918 529646 535055 541869 549437
62191 549437 557649 566930 577285 587901 598005 607750 617849 628648 639981 651752 664133 677080
62179 677080 689990 701992 712425 721091 728378 735229 742787 751861 762845 776174 792683 813294
62167 813294 838480 868164 902125 940276 982486 1028303 1076793 1126406 1174797 1219115 1256933
62156 1256933 1287043 1309202 1323196 1328616 1325678 1315763 1300634 1281236 1257550 1229367 1196790 1160105
62144 1160105 1119808 1076974 1033252 990317 949503 911879 878170 848413 822057 798680 778340
62133 778340 761090 746551 734282 724184 716116 709407 703331 698009 694340 693038 694155 697575 703492
62120 703492 712121 723217 736146 750216 764604 778065 789048 796410 800115 801188 800900 799910 798203
62107 798203 795768 792970 789998 786183 780347 771951 761634 750508 739315 728516 718853 711251 706136
62094 706136 703245 702356 703850 708282 715502 724507 734232 744220 754485 764982 775524 786117 797058
62081 797058 808595 820654 833023 845729 859094 873470 889096 906242 925363 946898 970778
62070 970778 996145 1021723 1046647 1071085 1096046 1122538 1150840 1180472 1210740 1241155 1271242
62059 1271242 1300005 1325783 1346860 1362235 1371751 1375537 1373626 1366188 1353841 1337416 1317475 1294156
62047 1294156 1267374 1236897 1202384 1163727 1121553 1077266 1032499 988494 945867 904769 865286
62036 865286 827783 792813 760592 730774 703006 677573 655150 635983 619660 605629 593534
62025 593534 583021 573653 565180 557514 550266 542714 534475 525871 517340 508782 499820 490452 481147 472468
62011 472468 464916 458953 454780 452153 450650 450085 450462 451714 453778 456816 461022 466216 471894 477677 483453
61996 483453 489033 493949 497669 499963 500959 500918 499937 497851 494501 490019 484711 478687 471914 464616 457253
61981 457253 449983 442578 435117 428246 422388 417158 412070 407380 403565 400311 396872 393289 390359 388311
61967 388311 386434 384295 382488 381638 381343 380780 379985 379819 380864 382902 385405 387999 390413 392459 394237
61952 394237 396138 398544 401669 405714 410964 417626 425693 435025 445588 457616 471576 487861 506464
61939 506464 526976 548888 571809 595414 619430 643725 668105 691906 714085 734065 752296
61928 752296 769596 785954 800317 811538 819205 823507 824630 822554 817266 809016 798474 786670 774665
61915 774665 763225 752949 744655 739316 737432 738851 743501 751917 764516 780495 798092 816013 834023
61902 834023 851844 868098 880860 888953 892181 890586 884171 873353 859049 842149 823319 803368
61890 803368 783267 763516 743920 724272 704968 686701 669940 654904 641603 629457 617284
61879 617284 604241 590647 577497 565391 554376 544515 535921 528317 521261 514908 509967 506766 504889
61866 504889 503920 503982 505264 507567 510725 515099 521242 529384 539686 552702 568979 588242 609556 632489
61852 632489 657725 686239 718123 752549 788753 826603 865983 906001 945258 982844 1018453
61841 1018453 1051241 1079179 1100254 1114120 1121861 1124115 1120327 1110220 1095298 1078258 1061277 1045522
61829 1045522 1032006 1022005 1016413 1015348 1018711 1026609 1038781 1053890 1069897 1085126 1098567 1109123
61817 1109123 1115063 1114597 1106911 1092353 1071664 1045345 1013875 978304 940280 901500 863197 826087
61805 826087 790547 756810 725076 695523 668170 642875 619582 598552 580186 564592 551464
61794 551464 540309 530590 521668 512980 504516 496946 490986 486618 483076 479570 475878 472214 468721 465306
61780 465306 461980 459114 457179 456210 455697 455028 453915 452377 450568 448777 447416 446790 446873 447420 448183 448936
61764 448936 449548 450208 451355 453134 455158 457151 459570 463027 467201 470992 473901 476625 479904 483227 485148
61749 485148 484765 482503 479539 476803 474507 472385 470144 467688 464986 461951 458639 455446 452857 450954
61735 450954 449420 448016 446767 445666 444547 443390 442461 442050 442287 443250 444902 446910 448939 451272 454568
61720 454568 458748 462665 465399 467395 469677 472254 474148 474978 475641 477063 478880 479916 479616 478458 476958
61705 476958 474911 471852 467965 464015 460348 456409 451548 446012 440712 436164 432143 428420 425206 422633
61691 422633 420290 417720 414991 412300 409347 405677 401541 397769 394723 391942 388974 386039 383532 381234
61677 381234 378537 375343 372324 370220 369123 368582 368181 367801 367436 367101 367011 367518 368577 369398 369077 367622 366091
61660 366091 365591 366360 367934 369869 372057 374473 376914 378992 380349 381000 381499 382562 384423 386757 389332
61645 389332 392359 396002 399955 403906 408166 413245 418849 423812 427187 429124 430469 431747 432668 432507 430771
61630 430771 427540 423280 418386 412970 407031 400704 394362 388626 384253 381701 380652 380250 380039 380357 381543
61615 381543 383057 383849 383497 382474 381330 380024 378191 375664 372505 368744 364379 359551 354573 349678 344820
61600 344820 339729 334272 328666 323225 317952 312663 307596 303502 300859 299313 298209 297379 296979 296807 296357
61585 296357 295501 294544 293545 292141 290237 288416 287287 286724 286047 284818 283217 281713 280542 279516 278277
61570 278277 276790 275550 275160 275706 276702 277626 278330 278910 279444 279974 280617 281568 283001 284912 286956 288552 289397
61553 289397 289884 290763 292346 294188 295552 296005 295577 294628 293694 293301 293777 295170 297270 299675 302065 304557
61537 304557 307535 310882 313694 315241 316009 317177 319147 321213 322742 323871 324761 324932 323959 322320 320841
61522 320841 319602 318121 316493 315501 315424 315407 314430 312517 310544 309112 308086 307201 306642 306747 307374 307899 307858
61505 307858 307374 306899 306697 306698 306745 306742 306555 306003 305081 304142 303712 304086 305124 306482 307978 309645 311412 312933
61487 312933 313955 314800 316177 318418 321111 323611 325698 327549 329283 330801 332008 333044 334217 335684
61473 335684 337052 337475 336574 335229 334852 335642 336223 335448 333909 332955 332822 332690 332272 332089 332157 331553 329784 327697
61455 327697 326504 326467 326993 327403 327167 325974 324202 322927 322917 323901 325213 326650 328187 329453 330288 331413
61439 331413 333631 336502 338785 340296 342379 346173 351147 355843 359531 362542 365310 367799 369856 371565
61425 371565 373017 374076 374695 375347 376826 379488 382827 385993 388663 391181 393859 396412 398275 399215 399374
61410 399374 398823 397422 395220 392696 390454 388743 387367 385939 384108 381666 378693 375692 373380 372109
61396 372109 371471 370665 369306 367710 366280 364879 363124 361197 359939 359982 361010 362055 362435 362335 362562 363844
61380 363844 366255 369250 372209 374905 377403 379737 381957 384425 387679 391815 396215 400053 403008 405411
61366 405411 407780 410301 412711 414693 416299 417843 419319 420294 420682 421378 423634 427882 433544 439914 446709
61351 446709 453758 460748 467484 474034 480412 486494 492270 497731 502390 505468 506853 507405 508036 508979 510273
61336 510273 512339 515452 518939 521546 522503 521867 519993 517123 513349 508599 502667 495589 487942 480632 474455
61321 474455 469951 467306 466157 465803 465883 466539 467689 468661 469074 469680 471692 475399 479972 484556 489112 494271
61305 494271 500780 509008 518645 528913 539151 548829 556786 561192 561085 557576 552738 547513 541483 534480
61291 534480 527344 520891 514998 509118 503115 497282 491968 487455 483816 480743 477865 475368 473924 473944 475259
61276 475259 477495 480378 483719 487621 492616 499017 506190 513111 519583 526091 532501 537955 542362 547005
61262 547005 553075 560432 568404 577080 587008 598117 609625 620626 630202 637416 641945 644469 645823
61249 645823 646100 645107 643283 641298 639014 635663 631000 625565 619783 613561 606862 600109 593799 588125 582996
61234 582996 578036 572588 566276 559601 553528 548462 544177 540707 538624 538147 538597 539109 539467 539885 540364 540755
61218 540755 541169 541793 542342 542170 541122 540009 540046 541828 544947 548548 551999 554917 556810 557252 556595 556101
61202 556101 557003 559602 563554 568756 575544 584211 594816 607379 621803 637608 654217 671381 688825
61189 688825 705462 719664 730555 738515 744241 747909 749645 750282 751029 752576 754891 757531 759718 760359
61175 760359 758594 754416 748543 741777 734710 727804 721288 714982 708535 701785 694629 686732 677755 667869
61161 667869 657674 647562 637459 627191 616841 606746 597426 589522 583543 579619 577721 577986 580417
61148 580417 584268 588146 590958 592404 592437 590611 586357 579661 571192 561868 552505 543765 536143 529920 525185
61133 525185 521851 519596 517959 516668 515899 516195 518257 522717 529822 539127 549671 560690 572044 583908
61119 583908 596353 609510 623957 640497 659376 679853 700621 720675 739978 759415 779966
61108 779966 801657 823318 843495 861538 877724 892517 906029 918017 927928 934864 937848 936438
61096 936438 930967 922176 910825 897725 883783 869632 855284 840433 825108 809875 795330 781631
61084 781631 768599 756204 744739 734514 725518 717497 710310 704120 699216 695758 693760 693213 694104 696333
61070 696333 699786 704495 710674 718478 727773 738256 749848 762829 777426 793340 809928 826925
61058 826925 844789 864200 885469 908652 933930 961429 990776 1021352 1053093 1086603 1122336
61047 1122336 1160046 1199240 1239791 1281760 1324833 1368271 1411352 1453705 1495278 1536065 1575743
61036 1575743 1613615 1649157 1682589 1714548 1745285 1774687 1802996 1830811 1858228 1884668 1909806
61025 1909806 1933886 1956910 1978654 2000239 2024776 2055484 2093789 2140088 2195509 2261610 2338991
61014 2338991 2427840 2529966 2649407 2791490 2962582 3170656 3425003 3735779 4115080 4578004
61004 4578004 5141579 5824155 6648210 7642038 8833990 10243472 11876584 13717959 15701018
60995 15701018 17668674 19377993 20586931 21180618 21237138 20977778 20651584 20447924 20470431
60986 20470431 20729729 21120239 21415175 21335204 20677670 19417074 17701484 15760091 13802225
60977 13802225 11968073 10329547 8909236 7698601 6674145 5810329 5084807 4477574
60969 4477574 3970368 3547812 3196910 2904873 2658954 2448613 2266381 2106592 1964741
60960 1964741 1838153 1725498 1625158 1535177 1454849 1384669 1324286 1271943 1226380 1187652 1155194
60949 1155194 1126467 1098646 1070737 1043171 1016300 990292 965631 942565 920551 899170 878977
60938 878977 860477 842762 824235 804471 784372 764652 745157 725752 707041 689873 674574
60927 674574 660858 648207 636278 625157 615216 606560 598819 591646 585176 579658 574898 570396 565974
60914 565974 561980 558948 557204 556626 556632 556590 556388 556430 557059 558352 560466 563622 567474 571074 573805 575883 577572
60897 577572 578445 577992 576489 574516 571887 567781 561895 554800 547122 538942 530163 520990 511791 502764 493932
60882 493932 485311 476858 468354 459543 450475 441677 433775 426830 420249 413629 407521 402958 400263 398746
60868 398746 397582 396503 395659 395387 396300 398943 403071 407738 412347 417125 422308 427519 432310 436735 440880
60853 440880 444426 447248 449966 453238 456906 460428 463713 466872 469538 471261 472341 473515 474926 476025
60839 476025 476296 475396 472810 468222 462275 456258 450929 446185 441765 437634 433684 429808 426290 423520 421231
60824 421231 418740 415953 413386 411057 408200 404410 400271 396420 392653 388477 383937 379291 374397 369064
60810 369064 363711 358923 354581 350095 345431 341262 338032 335434 332988 330663 328627 326781 324940 323325
60796 323325 322492 322739 323820 325286 326879 328508 330021 331236 332140 332915 333810 335042 336698 338549 340094
60781 340094 341069 341844 343021 344730 346691 348884 351619 354770 357546 359373 360582 361811 363056 363773 363647
60766 363647 362863 361837 361130 361326 362452 363623 363799 362812 361250 359423 357056 354017 350777 347957 345804
60751 345804 344275 343278 342667 342288 342206 342655 343628 344664 345199 345037 344427 343702 342770 340946 337530 332718 327711
60734 327711 323686 320835 318637 316681 314820 312821 310501 308121 306130 304570 303230 302249 302001 302415 303080
60719 303080 304031 305728 308068 310190 311633 313042 315217 317881 319996 321066 321641 322626 324465 326946 329488
60704 329488 331646 333509 335536 337856 339924 341101 341450 341715 342560 344057 345823 347415 348478 348764 348204
60689 348204 347000 345508 343947 342220 340092 337552 334897 332519 330739 329832 329907 330622 331280 331487 331524 331875
60673 331875 332555 333170 333406 333178 332425 331139 329484 327622 325496 323069 320609 318424 316445 314434 312478
60658 312478 310917 309916 309490 309788 310844 312136 312989 313432 314174 315661 317655 319833 322329 325476 329334
60643 329334 333530 337243 339357 339154 336991 333963 330845 327714 324564 321676 319156 316655 313852 310946
60629 310946 308503 307063 306946 307967 309218 309639 309081 308487 308801 310033 311507 312635 313234 313465 313732 314355
60613 314355 315116 315400 314883 313880 312963 312609 313164 314637 316412 317686 318374 319049 319894 320304 319826 318850 318058
60596 318058 317775 318221 319752 322303 325078 327436 329654 332290 335165 337657 339677 341706 343990 346282 348332
60581 348332 350151 351811 353364 354885 356302 357335 357923 358501 359595 361403 364087 368058 373481 379815 386442
60566 386442 393503 401532 410456 419611 428669 437778 446649 454139 459052 461023 460455 457924 453838 448479
60552 448479 442267 436033 430889 427480 425493 424283 423910 425155 428549 433835 440504 448367 457396 467420
60538 467420 478347 490521 504512 520489 537872 555535 572282 587203 599620 608837 614135 615193
60526 615193 612455 606944 599762 591845 583901 576213 568504 560308 551627 543163 535864 530280 526287 523371
60512 523371 521243 520203 520759 522842 525723 528866 532597 537690 544516 553005 563309 576120 592317 612550
60498 612550 637134 666065 699007 735395 774546 815685 858040 901023 944058 986013 1025015
60487 1025015 1059116 1086920 1107303 1118869 1120302 1111216 1092209 1064082 1027539 983787 934979 883750
60475 883750 832484 783041 736774 694440 656227 622035 591730 565107 541809 521477 503899
60464 503899 488862 475930 464476 453927 443981 434585 425817 417825 410843 405128 400714 397219 394049
60451 394049 390826 387522 384257 381186 378578 376655 375229 373759 371987 370278 369149 368683 368597 368615 368492 367937
60435 367937 366896 365781 365010 364354 363137 361107 358845 357221 356607 356684 356866 356843 356755 356836 356978 356844 356411 356072
60417 356072 356116 356435 356935 357869 359362 360943 361975 362420 362800 363598 365028 367188 369886 372434 374132 375053
60401 375053 375911 377139 378548 379985 381810 384424 387682 391092 394403 397686 400916 403775 405946 407506
60387 407506 408908 410534 412361 414149 415885 417831 420143 422769 425816 429639 434261 438973 442875 445752
60373 445752 448104 450509 453252 456424 459927 463299 465896 467442 468333 469388 471267 474016 477081 479867
60359 479867 482361 485016 488089 491523 495617 501261 509101 518864 529929 542085 555132 568030 579183
60346 579183 587533 592847 595091 594237 590708 585373 578838 571185 562545 553513 544800 536802 529601 523122
60332 523122 517212 511782 506833 502180 497413 492509 488228 485295 483291 481041 478162 475555 474172 473900
60318 473900 473985 474110 474710 476522 480136 485820 493605 503615 516148 531015 546908 562012 575430 587584
60304 587584 599115 610064 620425 630768 641530 651821 659605 663253 662654 658741 652141 642525 629317
60291 629317 612866 594641 576248 558637 542451 528598 517760 509480 502458 495949 490328 486137
60279 486137 483084 480246 476914 472959 468647 464303 459979 455390 450441 445773 442398 440648 439836 438990 437582
60264 437582 435490 432804 429870 427179 424948 423060 421466 420235 419140 417707 415917 414414 413709 413532 413274
60249 413274 412745 412215 412020 412377 413342 414636 415716 416266 416496 416864 417658 418822 419912 420278 419713 418960 419144
60232 419144 420629 422912 425649 429071 433154 437169 440496 443351 446184 448877 451125 453149 455419 457980
60218 457980 460665 463715 467570 472222 477369 483085 489646 496713 503366 509150 514608 520482 526687 532461
60204 532461 537348 541746 546409 551594 556856 561652 565883 569714 573153 576170 579023 581914 584337 585411
60190 585411 585074 584424 584511 585169 585397 584553 582774 580471 577840 574743 570814 565798 560015 554322 549423 545362
60174 545362 541785 538475 535518 533222 531985 531895 532305 532175 530971 528903 526257 523072 519684 516877 515075
60159 515075 513919 513054 512765 513334 514386 515495 516936 519080 521459 523200 524108 524529 524458 523736 522999 523448 525474
60142 525474 528270 531031 533885 537384 541643 546383 551418 556791 562627 569041 576022 583344 590738 598074
60128 598074 605106 611189 615664 618552 620474 621863 622629 622655 622245 621889 621831 621994 622151 622104 621789 621217 620302 618942
60110 618942 617387 616215 615574 614757 612896 609909 606329 602451 598255 594025 590397 587624 585306 583028 580890
60095 580890 579280 578434 578393 579091 580401 582234 584550 587148 589600 591728 593905 596460 598942 600541 601131
60080 601131 601296 601310 600762 599315 597242 594927 592340 589280 585687 581428 576219 570134 563847 557956 552303
60065 552303 546246 539457 532146 524702 517424 510510 504066 498163 492966 488694 485255 482111 478717 475155
60051 475155 472233 470909 471548 473666 476408 479298 482420 485891 489558 493487 498295 504366 510891 516430
60037 516430 520502 524002 527798 531550 534276 535558 535676 534945 533477 531454 529114 526460 523285 519448 514938
60022 514938 509768 504055 498037 491749 484837 477048 468759 460641 452891 445295 438130 432403 428790 426686
60008 426686 424796 422523 420276 418431 416600 414292 411843 410114 409324 408712 407586 406318 406017 407335 409808
59993 409808 412338 414145 415339 416625 418532 420992 423773 427100 431395 436405 441079 444604 447179 449529
59979 449529 451988 454401 456454 457651 457283 455082 451802 448607 445983 443702 441689 440278 439640 439642 440385 442202
59963 442202 444828 447244 448774 449925 451727 454533 457834 460964 463567 465561 467024 468033 468346 467439 465137
59948 465137 462078 459225 456994 455208 453728 452616 451663 450308 448293 446003 443823 441498 438618 435546
59934 435546 433246 432131 431680 431437 431811 433401 435986 438864 441920 445585 449822 454019 458110 462890 468688
59919 468688 474347 478169 479567 479258 478172 476782 475369 474310 474011 474783 476718 479565 482996 487132 492346
59904 492346 498259 503564 507414 510452 513709 516897 518700 518549 517169 515470 513823 512443 511539 510817 509629
59889 509629 507966 506734 506871 508713 512326 517563 523620 529278 534086 538688 543675 548793 553681 558725
59875 558725 564547 571108 577748 583722 588299 590955 592024 592734 593995 595495 596480 596931 597352 597850 598246 598829
59859 598829 600110 601859 603208 603844 604397 605438 606732 607831 608955 610842 613976 618315 623605 629487 635149
59844 635149 639166 640105 637563 632586 626925 621865 617897 615293 614376 614891 615490 614400 610630 604398 596639
59829 596639 588510 581224 575756 572320 570268 568663 566997 565382 564228 563814 564054 564467 564359 563177 560871
59814 560871 558013 555458 553714 552649 551803 550914 549942 548687 546645 543419 539210 534822 531109 528309 525837
59799 525837 522938 519655 516886 515231 514062 512178 509217 505891 502884 500111 497191 494064 490825 487464
59785 487464 484172 481555 480082 479429 478726 477428 475697 474040 472827 472215 472377 473607 476064 479377 482756
59770 482756 485713 488556 491863 495629 499339 502807 506446 510698 515663 521338 527662 534157 540080 545266
59756 545266 550385 556017 561872 567343 572462 577872 584019 590799 597887 605076 612332 619724 627262 634650
59742 634650 641371 647156 652252 657059 661590 665408 667994 669138 669104 668386 667197 665313 662680 659943 657965
59727 657965 656897 656179 655340 654228 652559 650066 647240 645133 644050 643153 641714 639991 638378 636464 633700
59712 633700 630485 627813 626142 625283 625136 625867 627538 630060 633346 637043 640377 642784 644483 646019 647583
59697 647583 649253 651406 654154 656745 658410 659578 661270 663290 663999 662154 658219 653535 648983 644914
59683 644914 641766 639977 639398 639250 638682 637198 634595 630750 625542 618993 611463 603616 596074 589150 582944
59668 582944 577528 572894 568881 565395 562577 560642 559611 559349 559640 560149 560545 560865 561493 562654 564258 566385
59652 566385 569406 573309 577404 581184 584899 588694 591628 592419 590959 588240 584896 580696 575522 569909
59638 569909 564281 558417 552168 546198 541456 538183 535836 533798 531824 529902 527942 525677 522821 519374
59624 519374 515656 511913 507962 503475 498571 493821 489645 485943 482343 478588 474672 470804 467272 464233
59610 464233 461671 459678 458522 458236 458367 458558 459146 460754 463342 466142 468508 470363 471799 472796 473524 474463
59594 474463 475946 477791 479641 481401 483137 484759 486068 487080 488105 489417 490897 492019 492256 491434 489635
59579 489635 486856 483073 478707 474610 471346 468737 466336 464054 461993 459975 457713 455288 453080 451265
59565 451265 449763 448552 447705 447190 446907 446848 446932 446842 446328 445563 444963 444831 445384 446796 448879 451086 453218 455793
59547 455793 459259 463267 467285 471516 476506 482254 488631 496427 506845 519965 534821 551128 569559
59534 569559 589495 607396 618600 620799 615386 605858 595536 586574 580101 576555 575780 577061 579424
59521 579424 582214 585388 589112 593099 596489 598330 598060 595683 591693 586733 581073 574520 566950 558709
59507 558709 550285 541939 533874 526350 519205 511740 503723 496122 490208 486191 483436 481634 480842 480628 480274
59492 480274 479863 480130 481072 481730 481709 481933 483342 485540 487390 488432 489176 490349 492297 494869 497590 500161
59476 500161 502900 506379 510596 514933 518979 522869 526738 530367 533468 535743 536596 535485 532838 530024
59462 530024 528202 527683 528441 530488 533553 537119 541130 546022 551835 558048 564570 572068 580865 590270 599459
59447 599459 608246 616455 623315 628149 631056 632251 631335 627921 622451 615709 608046 599791 591883 585239
59433 585239 579817 575033 570782 567323 564480 561795 559347 557807 557781 559585 563306 568503 574275 580394 588150
59418 588150 599292 614296 632337 652696 675294 699976 726298 754102 783132 811377 834375
59407 834375 847094 847040 835951 818935 801756 788102 778756 773213 771878 776313 787142 801788 814415
59394 814415 818510 810537 791918 767630 742639 719577 699345 682668 670108 661126 654338 648865
59382 648865 644774 642175 640613 639496 638527 637533 636424 635575 635657 636736 637854 637892 636639 634778 633090 631998
59366 631998 631668 632075 632810 633133 632587 631575 631100 631802 633437 635459 637878 641176 645591 651045 657773 666403
59350 666403 677165 689501 702731 716661 731300 746508 762263 778742 795711 812265 827657
59339 827657 841936 855264 867072 876535 883466 888008 889754 888075 883259 876440 868272 858347 846171
59326 846171 832130 817164 801851 786193 770147 754182 739270 726192 714736 703828 692695
59315 692695 681743 671989 663831 656723 649883 642951 636083 629865 625073 622248 621531 623079 627296 634288
59301 634288 643439 653976 665625 678019 689517 697252 698568 692385 679612 662796 645079 628670
59289 628670 614057 600867 589144 579319 571361 564881 559985 557154 556209 556231 556740 558253 561338 565799
59275 565799 571193 577631 585573 595165 606141 618112 630634 643191 655377 667027 678090 688537
59263 688537 698335 707251 714647 719818 722590 723315 722321 719765 716002 711625 706938 701800 696185 690566 685575
59248 685575 681540 678531 676612 675859 676291 677814 680143 682902 686102 690341 696120 702980 709830 716075 721865
59233 721865 727163 731241 733436 733897 733222 731699 729247 725779 721235 715424 708175 699538 689667 678726
59219 678726 667108 655490 644425 634006 624129 614899 606532 599007 592098 585700 579911 574845 570564
59206 570564 567183 564793 563134 561463 559036 555949 553405 552794 554285 556551 558190 559289 561242 565070
59192 565070 570326 575764 580714 585500 590671 596203 601647 606815 611972 617245 622217 626493 630466 634995
59178 634995 640296 645662 650400 654469 657983 660763 662837 664757 666793 668288 668522 667895 667448 667495 667474 667033
59162 667033 666411 665758 664831 663512 661945 660025 657310 653578 648930 643329 636609 628982 620898 612350 603064
59147 603064 593524 584982 578025 571800 565150 557991 551116 545103 539924 535270 530751 526028 521195 516831
59133 516831 513350 510469 507682 505062 503244 502662 503123 504158 505619 507908 511653 517086 523765 531034 538684
59118 538684 546968 556043 565741 575905 586566 597666 608876 619866 630574 641125 651644 662190
59106 662190 672694 682980 693004 702953 712828 722053 729808 735640 739510 741489 741901 741524 740974 739953
59092 739953 737747 734502 731341 729131 727799 726909 726192 725213 723300 720277 716709 712950 708445 702432 694907
59077 694907 686435 677405 668017 658752 650251 642752 635989 629585 623312 617053 610824 604832 599347 594504
59063 594504 590207 586160 582037 577777 573633 569705 565623 561033 556238 551857 548018 544442 541221 538794
59049 538794 537079 535389 533381 531439 529913 528675 527687 527292 527554 527984 528378 529252 530982 533135 535226 537570
59033 537570 540723 544561 548600 552845 557634 563009 568917 575769 584099 593875 604865 617443 632286
59020 632286 649258 667354 685807 704514 723063 739928 753159 761682 765702 765995 763107 757304 749181
59007 749181 740073 731560 724521 718875 714356 711178 709713 709771 710700 712111 714169 717058 720388 723265 724855
58992 724855 724844 723328 720430 716205 710999 705545 700333 695070 689176 682686 676150 669737 663127 656436 650599
58977 650599 646497 644112 642844 642217 642042 642376 643706 646770 651786 658152 665192 672793 680936 689026 696219
58962 696219 702212 707359 712157 716910 721646 726041 729603 732116 733638 733865 731928 727148 719715 710365
58948 710365 699808 688773 678088 668150 658604 649021 639703 631420 624637 619361 615451 612569 610077
58935 610077 607489 604902 602619 600582 598575 596716 595206 593792 592062 590218 588933 588366 587758 586197 583510
58920 583510 580328 577451 575149 572975 570293 567071 563970 561569 559783 558338 557485 557818 559557 562364 565823
58905 565823 569796 574354 579732 586351 594581 604302 614765 625040 634727 644233 654202 664527 674210
58892 674210 682565 690343 699150 709853 722169 735754 750844 767526 785103 802620 819481 835110
58880 835110 848632 859460 867849 874361 879029 881475 881496 879085 874156 866751 857495 847495 837849 829307
58866 829307 822119 816050 810771 806291 802700 799549 796015 791689 786544 780155 771763 761363 749913 738218
58852 738218 726441 714960 704652 695766 687504 679421 672295 666819 662350 657825 653056 648098 642146
58839 642146 634305 624933 615064 604936 594295 583746 574484 566727 559599 552567 546054 540569 536102
58826 536102 532407 529209 526191 523404 521471 520712 520467 520089 520205 521908 524975 527972 529968 531142 531896
58811 531896 532561 533862 536409 539550 541865 542967 543755 544713 545164 544590 543596 542975 542686 542319 541821 541297 540712
58794 540712 540225 540204 540554 540607 539992 539034 538038 536865 535588 534937 535646 537814 541218 545740 551189 557213 563694
58777 563694 570742 578046 584804 590644 596071 601538 606531 609980 611205 610098 606830 601868 596027 589939
58763 589939 583528 576335 568383 560511 553877 549217 546557 545522 545827 547365 549910 553045 556534 560384
58749 560384 564349 567755 570196 572019 573670 575007 575828 576709 578533 581348 584462 587626 591422 596430 602629
58734 602629 609701 617395 625569 634318 644016 654722 665691 676011 685637 695178 704721 713501 720787
58721 720787 726572 731429 736215 741872 748903 756981 765450 774143 783310 792978 802861 812602 821545 828577
58707 828577 832850 834395 833439 829597 822520 812816 801233 787261 769771 748934 726395 703580 681016
58694 681016 659255 639112 620718 603474 587378 573323 561712 551702 542316 533447 525371 518011
58682 518011 511160 504779 498844 493416 488987 485996 483963 481929 479911 478982 479662 481190 482782 484724 487779
58667 487779 492238 498055 505315 514168 524713 537087 551071 565509 578679 589305 596706 600302 599983
58654 599983 596866 592576 587619 581435 574041 566410 559074 551633 544064 537325 532198 528520 525932 524352
58640 524352 523290 521811 519702 517723 516292 514940 513499 512680 512908 513638 514371 515286 516308 516596 515676 514151
58624 514151 512713 511348 510062 509315 509097 508718 508166 508634 510891 514217 517747 521799 526912 532536 537752
58609 537752 542465 546909 550736 553629 556093 558643 560792 561796 561853 561662 561338 560633 559749 559090 558584 557976
58593 557976 557422 557222 557398 558006 559342 561419 563876 566818 571023 576884 583922 591749 600588 610395 620454
58578 620454 630368 640432 650538 659881 668396 677177 686677 695888 704288 713278 724462 737752 752533
58565 752533 769567 790129 814076 840314 868492 898724 930192 961524 992172 1022046 1050088
58554 1050088 1074424 1093785 1107851 1116653 1120639 1120893 1118298 1112862 1104662 1094695 1083784 1071402 1056757
58541 1056757 1040350 1023219 1005280 985695 964318 941504 917105 891144 864988 840427 817879
58530 817879 796867 777835 761952 749287 738704 729600 722413 717267 713300 709554 705650 701479 697046
58517 697046 692616 688400 684233 680107 676535 673718 670949 667626 664248 661504 659128 656630 654396 652863
58503 652863 651355 649078 646709 645584 645794 646379 646904 647460 647592 646748 645484 644885 645129 645974 648107 652375
58487 652375 658029 663473 668661 675133 683744 693930 705276 718240 733092 749498 767342 786732
58475 786732 807023 826989 845924 863406 878123 888302 893328 893681 889502 880735 868709 855880
58463 855880 843630 831677 819942 809624 801997 797317 795384 796131 799298 804505 811949 822070 834214
58450 834214 846509 857309 866036 872504 876282 876915 874071 867468 857335 844895 831775 819081 807576
58437 807576 798204 791531 787052 783966 782277 782317 783770 786159 789689 794586 800260 806371 813985 824289
58423 824289 836676 849395 861438 872366 881075 886392 888448 887933 884632 878310 870243 862034 853581
58410 853581 844143 834697 826931 820398 813150 804979 797613 791730 786299 781064 777229 775227 774085 773538
58396 773538 774677 777905 782192 786898 792416 798489 803781 807755 811239 814601 817021 818069 818368 818328 817812
58381 817812 817352 817991 819744 821915 825038 830548 838324 846626 854685 863254 872362 880823 888540 896987 906731
58366 906731 916536 925649 934962 945227 956188 968090 981891 997149 1011767 1024677 1036771 1048419
58354 1048419 1058181 1065023 1069807 1073619 1076415 1078243 1079978 1081937 1083482 1084780 1087168 1091077 1095447 1099907
58340 1099907 1105554 1112891 1120997 1129528 1139560 1151638 1164999 1179369 1195443 1212874 1230002 1246353
58328 1246353 1263127 1280419 1296223 1309144 1319743 1328365 1334165 1337348 1339884 1342737 1344770 1345562 1346898
58315 1346898 1350130 1354401 1358792 1363987 1370569 1378011 1386531 1397502 1410774 1424138 1436739 1450459 1466522
58302 1466522 1483499 1500288 1518248 1538422 1559112 1578263 1596020 1613206 1629593 1645488 1662684
58291 1662684 1681924 1701520 1720178 1739059 1759482 1780914 1802845 1826252 1851590 1877699 1904245
58280 1904245 1932760 1963740 1995323 2026382 2058217 2091738 2125946 2160752 2198159 2238890 2281008
58269 2281008 2323694 2369043 2418200 2469222 2520971 2575590 2634775 2697021 2760983 2827997 2898730
58258 2898730 2970866 3042746 3115753 3190432 3263998 3334559 3404116 3474568 3544551 3613296 3683667
58247 3683667 3758194 3835922 3916383 4002639 4097021 4197826 4303662 4416882 4539314 4668944
58237 4668944 4804445 4948622 5103846 5268775 5443228 5631170 5834907 6051624 6279776
58228 6279776 6523259 6784856 7061704 7352252 7661541 7994327 8349529 8727281 9134869
58219 9134869 9579448 10061679 10583089 11152693 11779361 12465005 13212757 14034410 14942353
58210 14942353 15942817 17045780 18273132 19648449 21188615 22915936 24869245 27094024
58202 27094024 29635170 32554643 35947701 39931678 44633947 50206771 56841400 64755655
58194 64755655 74190649 85444453 98895597 114978542 134159972 156942938 183808381
58187 183808381 215031751 250471363 289380706 330063914 369320496 402248682 423230287
58180 423230287 428048119 415819972 389311182 353499623 313584099 273652538 236304082
58173 236304082 202840122 173640070 148553809 127209297 109169207 93981195 81212685
58166 81212685 70484648 61471361 53881548 47461400 42008935 37365215 33393075 29974950
58158 29974950 27021002 24460968 22229529 20269194 18539788 17011480 15652313 14432623
58150 14432623 13335634 12351849 11466792 10664056 9935689 9278938 8685895 8145665 7653504
58141 7653504 7208577 6805054 6433570 6089043 5769505 5469945 5185043 4915829 4666377
58132 4666377 4435732 4219515 4017171 3830747 3658269 3494952 3339819 3195315 3061609
58123 3061609 2936587 2820021 2712525 2611739 2514442 2421127 2333971 2252011 2172840 2097240
58113 2097240 2027435 1962493 1900018 1840688 1786485 1736033 1686328 1637616 1592058 1549008 1506194
58102 1506194 1464229 1425363 1388875 1352164 1315438 1280960 1248489 1215862 1183436 1153730 1127054
58091 1127054 1101444 1076575 1054013 1033898 1014921 997225 982030 968738 955582 942554 930546
58080 930546 918331 903695 886951 870051 852792 833276 811727 790546 770819 751828 733647
58069 733647 717118 701535 685365 669135 654779 642376 630364 618614 608442 599794 591301 582992
58057 582992 576194 570768 565009 558134 550420 541278 529907 517601 506686 497238 487436 476999 467639
58044 467639 460205 454011 448887 445257 442103 437468 431243 425127 419748 414145 408051 402277 396748 390616
58030 390616 384397 379482 375304 369462 361059 351645 342527 333445 324350 316163 309125 302412 295960 290802
58016 290802 287100 283636 279749 276040 272768 269257 265318 261631 258390 255143 252236 250846 251309 252860
58002 252860 255066 257997 261030 263192 264768 266871 269403 271174 271998 272828 273781 274017 273748 274395 276355 278540
57986 278540 280480 283063 286618 290021 292252 293295 293047 290941 287148 282663 277782 271958 265509 259865
57972 259865 255602 251715 247417 243277 240052 237682 235961 235014 234666 234367 234085 234297 234996 235794 236881 238672
57956 238672 240577 241492 241427 241216 240822 239482 237378 235401 233363 230355 227010 225397 226327 228608 231274 234632
57940 234632 238708 242763 247077 253284 262008 271814 281404 291253 302204 313961 325840 337502 347918
57927 347918 354991 357392 355800 351579 345289 337217 328141 318662 308672 298151 287563 277050 266336
57914 266336 255860 246719 238957 231216 222821 214898 208703 204077 200414 197986 197352 198299 200185 202505
57900 202505 204557 205464 205132 204412 203948 203787 204317 206272 209363 212253 214503 217276 221461 226369 231002 235404
57884 235404 239957 244466 248695 252772 256404 258797 260022 261292 263190 264813 265299 264841 263462 260339 255480
57869 255480 250750 247914 246650 245616 244392 243242 242024 240740 240341 241644 244079 246636 249453 253317
57855 253317 258158 263111 267621 271525 274529 276485 277762 278631 278830 278354 277847 277412 275899 272386 267670
57840 267670 263245 259490 255925 252663 250379 249190 248571 248233 248276 248759 249808 251759 254574 257548 260218
57825 260218 263010 266381 269951 273247 276544 280112 283235 285017 285720 286289 286858 286565 284566 280485 274155
57810 274155 265753 255961 245417 234248 222642 211429 201453 192775 185039 178195 172297 167084 162380
57797 162380 158466 155487 153029 150845 149418 149096 149224 148877 148016 147296 147220 148139 150504 154338 158861 163269
57781 163269 167544 172039 176888 182356 189027 196898 204896 212025 218366 224286 229361 232947 235205 236661
57767 236661 237236 236525 234522 231343 226803 221055 215054 209584 204458 199450 195206 192265 189978 187593 185791
57752 185791 185847 187745 190351 193123 196356 199995 203446 206468 209207 211517 213233 214910 217160 219375 220230
57737 220230 219448 218057 216864 215690 214184 212464 210728 208935 207029 204954 202545 199908 197697 196397
57723 196397 195670 195064 194930 195749 196952 197455 197235 197313 198279 199776 201386 203043 204444 205020 204681 203950 203243
57706 203243 202605 202054 201530 200657 199287 198173 198329 199780 201658 203417 205217 207173 208998 210352 210859 209882
57690 209882 207042 202862 198225 193389 188268 183385 179510 176458 173261 169622 166321 164101 163088 163435
57676 163435 165665 170162 177066 186880 200423 217983 239252 264393 294570 331027 373959 422289
57664 422289 473779 524710 569474 600983 612509 600701 567902 521312 469125 417195 368841
57653 368841 326137 290047 259981 234704 213680 196769 183124 171631 162146 155143 150245 146308
57641 146308 142853 140266 138628 137484 136771 136720 136800 135977 134287 132978 132796 133177 133438 133679 134075 134231 133725
57624 133725 132526 130605 127932 125133 123251 122502 122083 121483 121141 121415 121724 121201 119659 117598 115773 114852
57608 114852 114907 115127 114661 113719 113100 112830 112255 111395 110978 110935 110122 107965 105291 103097 101467 100101 98845
57591 98845 97180 94270 90176 86184 83304 81326 79809 78955 78717 78048 76081 73433 71436 70463 69800 68758
57575 68758 67218 65358 63470 61835 60386 58763 56881 54994 53052 50693 48161 46407 45801 45463 44464
57560 44464 43017 41915 41383 41116 40880 40450 39474 38079 37172 37502 38711 39847 40531 41127 42130 43782 45999
57543 45999 48277 49993 51109 52207 53666 55294 56943 58797 60655 61647 61172 59637 57810 55983 54209
57528 54209 52765 51864 51356 51096 51089 50986 50138 48613 47478 47582 48711 50373 52566 55154 57331 58622 59720
57511 59720 61395 63162 63956 63716 63273 63033 62782 62622 63113 64442 66156 67758 68948 69350 68594 66693 63937
57494 63937 60555 56855 53418 50599 48048 45278 42532 40547 39570 39092 38529 37734 36860 36031 35164 34079
57478 34079 32948 32545 33464 35020 35651 34706 33130 31962 30924 29159 26639 24078 21922 20220 19073
57463 19073 18423 17768 16795 16028 16143 16982 17890 18650 19387 19911 19991 20002 20445 21025 20964 20107 18967 17819 16528
57444 16528 15201 14292 14061 14514 15697 17378 18614 18459 17183 16116 16203 17268 18643 19891 20789 21198
57428 21198 21093 20474 19335 18065 17552 18343 19877 21172 22076 23190 24706 26055 26701 26705 26460 26424 27009 28151
57410 28151 29025 28837 27874 27188 27314 27922 28653 29450 29981 29565 28068 26277 24984 24128 23127 21726 20233
57393 20233 19206 19114 20048 21555 22926 23729 24015 24089 24340 25121 26503 28216 30140 32642 36014 39669 42459
57376 42459 43815 44173 44205 44068 43566 42703 41845 41382 41300 41065 40082 38382 36662 35518 34886 34357 33726 33044
57358 33044 32525 32629 33820 35899 37994 39580 41093 43095 45357 47279 48765 50062 51149 51999 53080
57343 53080 54797 56650 57729 57939 58030 58496 59084 59444 59646 60010 60741 61598 61744 60358 57846 55855 55433
57326 55433 55710 55157 53598 52018 50894 49932 49209 49238 49810 49935 49190 48197 47545 47084 46497 45790 45061 44491
57308 44491 44553 45382 45952 44849 42020 38831 36258 34033 31760 29709 28040 26325 24400 22822 21848 20814
57292 20814 19168 17368 16032 14878 13249 11151 9027 6965 4811 2702 766 -1367 -4058 -6798 -8506
57277 -8506 -8579 -7048 -3688 2447 12338 25962 42145 59373 76777 94215 111410 127350 140955
57264 140955 152144 161660 169874 176444 181277 185132 188853 192466 195457 197640 199425 201386 203827 206615
57250 206615 209367 211966 214839 218378 222112 224970 226527 227505 228832 230641 232542 234526 237171 240946
57236 240946 245541 250040 253870 257621 262610 269386 276960 283885 289781 295380 301439 308267 316078 324960
57222 324960 334427 343638 352154 360033 367314 374025 380583 387461 394492 401191 407780 415151 423796 433432
57208 433432 443606 453884 463608 472417 481117 491028 502295 513793 524909 536394 549095 562860
57196 562860 577155 591894 607062 622282 637284 652269 667438 682847 698989 716776 736551
57185 736551 757837 780317 804150 828944 853478 877103 900552 924646 949063 973099 996842
57174 996842 1020693 1044437 1067791 1091381 1116212 1142378 1169105 1195927 1223197 1251589 1281640
57163 1281640 1313574 1347259 1382467 1419383 1458323 1498740 1539108 1578160 1615643 1651535 1685341
57152 1685341 1716770 1746432 1775179 1803261 1830752 1858223 1886290 1914899 1943698 1972664 2001853
57141 2001853 2031085 2060536 2091137 2123646 2157595 2191634 2224409 2254640 2281073 2303259 2322069
57130 2322069 2338798 2354246 2369258 2385581 2405367 2430150 2460936 2498767 2544398 2597741 2658279
57119 2658279 2725549 2798517 2875019 2952857 3031304 3110945 3192530 3276843 3365492 3461054 3566645
57108 3566645 3686007 3823767 3984929 4174238 4396444 4656781 4960959 5315811 5731468
57099 5731468 6223191 6810820 7516904 8365672 9382784 10594902 12029714 13716790 15687384
57090 15687384 17971836 20596112 23578477 26924414 30619540 34624914 38877111 43288225
57082 43288225 47742179 52094980 56189792 59883034 63062846 65647108 67568506 68764828
57074 68764828 69184817 68805220 67646618 65776771 63298466 60329145 56984163 53369807
57066 53369807 49583236 45713751 41843178 38045530 34385777 30917764 27682611 24708332
57058 24708332 22010105 19590997 17443909 15554446 13903222 12467335 11222235 10143855
57050 10143855 9209460 8397373 7687485 7062759 6509630 6016843 5574823 5176369 4816707
57041 4816707 4492001 4198384 3932838 3694046 3481486 3293976 3129512 2986046 2862076
57032 2862076 2756951 2670884 2604137 2556086 2525747 2512759 2515569 2526974 2532498 2515529 2465506
57021 2465506 2382019 2272623 2148138 2019201 1894471 1779643 1677188 1586983 1507483 1436902
57011 1436902 1373936 1317768 1267675 1222970 1183255 1148156 1116663 1087297 1059268 1032952 1008818
57000 1008818 986352 964548 943115 922594 903454 885654 869076 853894 840390 828705 818840
56989 818840 810779 804595 800563 799153 800794 805677 813785 824888 838207 851968 863360 869218 867341
56976 867341 857625 841887 822385 800630 777682 755003 734196 716013 700296 686931 676238 668373
56964 668373 663105 660435 660796 664354 670689 679595 691640 707459 726875 749041 772787 795972 814702
56951 814702 824286 821703 807252 783944 755637 725739 696967 671343 649808 632003 616972 604305
56939 604305 594423 587847 584696 585094 589522 598352 611457 628748 650771 678127 710353 745448 779839
56926 779839 808234 824520 824496 808393 780322 745391 707742 670573 636240 605630 578242 553459
56914 553459 531341 512131 495743 482004 470752 461418 453128 445435 438378 431774 425184 418789 413426
56901 413426 409470 406445 404039 402666 402610 403458 404996 407879 412721 419088 426123 433864 443386 455970 472569
56886 472569 493577 518494 545957 574332 601800 625525 641633 647158 642148 629465 612632 594165
56874 594165 575516 557774 542126 529771 521425 516972 516025 518975 527116 541495 562069 588327 620424
56861 620424 659247 705578 759427 819860 884773 950316 1010259 1056183 1079717 1076536 1049115 1005298
56849 1005298 953825 901190 851715 808467 773002 745202 724591 711682 707591 712965 728049 753338
56837 753338 789503 837013 896482 968904 1054657 1152210 1257880 1365723 1466331 1546288 1591311
56826 1591311 1592384 1550209 1474458 1378952 1276568 1176537 1084300 1002653 932853 875282 829829
56815 829829 796101 773392 760821 757998 765627 785027 816912 860900 916122 981711 1056114 1135572
56803 1135572 1212686 1276255 1313841 1316866 1284865 1225093 1148153 1063976 980412 902841 833657
56792 833657 772988 720870 678271 645700 621998 605436 595340 591878 595051 604834 621663 645760
56780 645760 676319 711981 751195 790756 824379 844341 845352 826837 792165 746670 696029 644978
56768 644978 596451 551802 511655 476234 445257 418236 394904 375000 357859 342690 329118
56757 329118 317022 306131 296249 287633 280587 274844 269815 265252 261233 257741 254742 252421 250856 249668
56743 249668 248410 247078 245828 244556 243161 241859 240751 239577 238425 238128 239225 240906 241840 241754 241434
56728 241434 241415 241540 241722 242293 243462 244962 246328 247129 247128 246595 246259 246507 246903 246941 246805 246878 247012 247005 247304 248350
56708 248350 249605 250172 250105 250121 250265 249965 249333 249215 249760 249975 249069 247426 245876 244731 243890 243299 242897 242521
56690 242521 242125 241769 241355 240770 240304 240443 241246 242459 244159 246566 249132 250642 250612 250016 250180 251332 252595
56673 252595 253105 252788 252207 251918 251937 251787 251119 250214 249697 249841 250399 251048 251700 252382 253029 253431 253281 252379 250969
56654 250969 249733 249259 249519 249962 250012 249497 248815 248653 249238 249916 249901 249372 249232 249774 250337 250412 250304 250424 250759
56635 250759 251331 252294 253164 252947 251599 250413 250297 250652 250605 250265 249852 248758 246658 244566 243410 242391 240203
56618 240203 237164 234611 232820 231167 229855 229683 230285 230393 229900 229997 231091 232123 232299 232017 231729 231220 230522
56601 230522 230312 230854 231502 231674 231465 231070 230575 230518 231584 233363 234445 234109 233053 232116 231285 230392 229854 230132
56583 230132 231084 232271 233388 234244 234919 235970 237771 239710 240907 241649 243064 245376 247645 249403 251301
56568 251301 253778 256320 258589 261230 264908 269383 274121 279168 284960 291937 300624 311272 322979 333863
56554 333863 342474 348508 352083 353286 352770 351792 351127 350530 349541 348099 346147 343464 340230 337001 333908
56539 333908 330667 327462 324875 322727 320060 316565 312984 309762 306417 302691 299215 296381 293572 290217
56525 290217 286790 284064 282075 280366 278631 276634 274212 271699 269683 268015 265906 263255 260899 259214
56511 259214 257572 255653 254229 253980 254508 255184 256039 257140 257905 257788 256935 255696 254220 252983 252759 253528
56495 253528 254307 254546 254710 255013 254805 253930 253419 253903 254437 253986 253088 252879 253281 253412 253226 253563 254879 256861
56477 256861 258913 260312 260352 259110 257645 256782 256225 255458 254839 255008 255886 257071 258634 260683 262588 263484
56461 263484 263165 261879 259775 257213 255050 253914 253592 253628 253945 254371 254335 253740 253429 254141 255636 257444 259658
56444 259658 262222 264299 265214 265348 265329 265100 264568 264333 264833 265499 265691 265692 265813 265370 263738 261685 260429 259914
56426 259914 259261 258452 258301 259058 260216 261461 262738 263593 263530 262894 262548 262848 263673 265085 267094 269125 270610
56409 270610 271751 272860 273409 272773 271516 270789 270602 269814 267862 265517 263858 263290 263670 264721 266117 267518
56393 267518 268590 268928 268356 267532 267624 268997 270799 272260 273591 275091 276297 276881 277564 279111 281070 282504
56377 282504 283434 284542 285886 286974 287742 288544 289421 290243 291245 292636 293992 294759 294988 294924 294368 293183 291974
56360 291974 291523 291976 293120 294836 296642 297648 297763 298156 299681 301639 302976 303818 304747 305446 305340 304845
56344 304845 304757 304981 305059 305289 306076 306820 306748 306371 306811 308213 310025 312292 315301 318476 321015 323257 326041
56327 326041 329134 331647 333662 336007 338661 340815 342385 344171 346500 348811 350460 350989 349939 347452
56313 347452 344721 342833 341561 340279 339397 339663 340716 341684 342695 344424 346687 348958 351716 355707 360328
56298 360328 364390 368061 372312 376821 380268 382575 385001 388029 390896 393306 395860 398562 400511 401491
56284 401491 402534 404582 407681 411545 415780 419637 422763 426096 430719 436049 440509 443790 447004 450852
56270 450852 455227 460502 467407 475460 483146 489980 496994 505057 514076 523960 534942 546786 559075
56257 559075 572449 588242 606823 627608 650711 677126 707218 740469 776773 816530 859391
56246 859391 904415 951613 1001880 1055157 1109959 1164854 1219069 1271561 1320857 1365892 1405814
56235 1405814 1439104 1464222 1480996 1489974 1490733 1482492 1466142 1443827 1416559 1384071 1346984 1307215
56223 1307215 1266081 1223861 1181402 1140216 1100644 1061729 1023289 986464 951877 918953 887352
56212 887352 857437 829103 801810 776038 752967 732431 712935 693933 676416 660946 646919
56201 646919 634024 622675 612699 603325 594715 587744 582154 576808 571924 568970 568092 567726 567093 566989 567689
56186 567689 568269 568519 569377 570842 571629 571495 571817 573190 574578 575547 577176 579941 582828 585504 589285 594919
56170 594919 601252 607037 612360 617526 622394 627553 634271 642489 650696 658489 667301 677907 689244 700519
56156 700519 712439 725563 739461 754384 771770 792222 814986 840245 869877 905141 945733
56145 945733 992044 1046225 1110101 1184133 1269340 1367938 1480892 1606549 1742142 1884128 2026068
56134 2026068 2158904 2275241 2372321 2450818 2513507 2565754 2614003 2661513 2706904 2747293 2780340
56123 2780340 2802837 2811067 2804675 2787758 2764429 2735353 2699473 2655839 2601747 2531993 2442627 2334152
56111 2334152 2210154 2075556 1937574 1805052 1684071 1575741 1479612 1396647 1327228 1269172
56101 1269172 1220127 1179736 1147504 1120928 1097835 1078491 1063418 1051347 1041117 1033357 1028412 1024846
56089 1024846 1021796 1020523 1021927 1024846 1028391 1033365 1039727 1045444 1049698 1054449 1061033 1068025 1074332 1081304
56075 1081304 1089786 1098240 1105955 1114962 1126450 1138558 1150005 1162578 1177516 1192858 1207064 1221856
56063 1221856 1238648 1255658 1271472 1287936 1306345 1324322 1339890 1355152 1372352 1389711 1404933
56052 1404933 1419482 1435454 1451437 1465559 1479654 1496283 1514455 1532283 1551009 1572314 1594567
56041 1594567 1615880 1638066 1663414 1690319 1716344 1742836 1772255 1803699 1835368 1868601 1905121
56030 1905121 1943034 1979947 2017373 2057804 2100285 2143151 2188008 2236499 2286244 2334585 2383290
56019 2383290 2435027 2488567 2542236 2598571 2660463 2726037 2792403 2860927 2933714 3008675 3083533
56008 3083533 3160887 3243780 3330236 3417959 3510177 3610679 3717286 3826619 3940950 4063699
55998 4063699 4192691 4325008 4464050 4614384 4774129 4939985 5115154 5304317 5505493
55989 5505493 5715191 5936913 6176064 6431403 6700301 6987241 7297863 7630213 7981720
55980 7981720 8359138 8771244 9217794 9696779 10216363 10787953 11414043 12095373 12843297
55971 12843297 13671857 14585084 15586818 16696204 17939001 19332377 20895358 22666331
55963 22666331 24693637 27020200 29699495 32819126 36489541 40822580 45946609 52032661
55955 52032661 59283467 67917679 78202604 90492659 105207050 122792027 143731889
55948 143731889 168526000 197527952 230738480 267657768 306998252 346059442 380262399
55941 380262399 403861087 412072553 403331429 379933641 346683166 308779087 270365595
55934 270365595 234122411 201446851 172801171 148090380 126985486 109091732 93989450
55927 93989450 81263375 70547309 61530267 53930201 47493857 42019519 37352148 33356114
55919 33356114 29911813 26931159 24350564 22107932 20142929 18414109 16895280 15556306
55911 15556306 14363527 13295613 12341968 11487154 10711586 10005190 9365601 8784321 8248025
55902 8248025 7751833 7298317 6884531 6501958 6147817 5824599 5529376 5254643 4998919
55893 4998919 4766050 4554649 4358043 4173852 4004168 3847095 3697379 3554917 3423977
55884 3423977 3304520 3192289 3086267 2987678 2892685 2794675 2693499 2594681 2500185 2407736
55874 2407736 2318419 2236613 2162220 2090577 2020362 1954537 1893423 1833978 1776268 1723820 1676919
55863 1676919 1631919 1587753 1547016 1510037 1473730 1436908 1401318 1367003 1332009 1296990 1264905
55852 1264905 1235873 1207302 1179183 1154127 1132006 1109572 1085600 1061658 1037847 1012683 987177
55841 987177 964099 943069 921132 898189 877000 857870 838405 818708 801732 787955 774593
55830 774593 760705 748349 738044 727769 717265 708792 702602 695946 687500 678740 670130 660049 648472
55817 648472 637747 628730 619725 610072 601128 593019 584133 574656 567028 562070 558109 554611 553207 554465
55803 554465 557101 561024 567642 576536 585402 594002 604594 617603 630293 640515 648285 653009 652835
55790 652835 647834 640378 631388 619581 605391 591938 580814 570273 558836 547314 535951 523129
55778 523129 508707 495579 486163 480108 476977 478227 484756 495211 508435 524761 542732 556936
55766 556936 561478 554387 537541 514353 488854 464823 443826 425169 408486 394706 383953 374843
55754 374843 366828 361016 357612 354775 351218 347761 345087 342062 337621 332474 327676 323314 319651 317691
55740 317691 317459 317530 317250 317502 318261 317486 313722 307996 301970 296057 290531 286570 284668 283530 281851 279773
55724 279773 277570 274532 270338 266051 262595 259640 256953 255366 255358 256181 257384 259818 264150 269803 276192
55709 276192 283460 291032 296975 299877 300150 298699 295721 291563 287192 282915 278016 272349 266753 261260
55695 261260 254638 246575 238622 232040 226340 220896 216323 213244 211301 210367 211139 213587 216410 218968 222061
55680 222061 225882 229096 231127 233497 237543 242389 246493 249556 251515 251387 248749 245001 241591 238282
55666 238282 234524 231124 228972 227462 225892 225261 226893 230141 233230 235658 238242 241304 244292 246850
55652 246850 249147 251460 254258 258146 263028 267907 271991 275129 276771 275832 272362 268041 264081 259758
55638 259758 253870 246415 237930 228530 218637 209394 201245 193349 185475 179157 175656 173985 172269 169955
55624 169955 167409 164551 161418 159098 158503 158876 158778 157864 156586 155020 153154 151487 150161 148367 145722
55609 145722 143281 142035 141407 140452 139430 138783 137657 135144 132149 130346 129902 129719 129338 129024 128537 127449
55593 127449 126383 126433 127526 128620 129268 129859 130601 131361 132232 133205 133678 133238 132529 132421 132826 133313 134160 135767
55575 135767 137695 139515 142034 146396 152494 159419 166940 175185 183379 190259 195429 199091 200864 200177
55561 200177 197508 193903 189548 184038 177799 171890 166585 161381 156272 151749 147659 143355 138992 135565
55547 135565 133558 132580 132296 132630 133057 132815 132049 131845 132929 134963 137149 138834 139638 139699 139725 140134 140329 139501
55529 139501 137909 136620 136163 136219 136368 136289 135481 133672 131419 129502 127844 125790 123253 120769 118535 116265
55513 116265 113948 111992 110610 109690 109203 109121 109002 108328 107217 106300 105988 106211 106673 106973 106828 106536 106738 107348
55495 107348 107302 105973 104128 102817 102021 101218 100582 100568 100858 100787 100446 100343 100387 100233 100316 101397 103285 105032
55477 105032 106272 107424 108709 109888 110872 111680 111888 110965 109083 106860 104522 102131 100357 100015 100846 101660
55461 101660 101697 101121 100296 99385 98675 98588 99244 100443 101890 103025 103138 102262 101497 101653 102077 101620 100327 99207
55443 99207 98758 98729 98946 99305 99217 98189 96845 96296 96630 96999 97079 97421 98362 99588 100796 101891 102586 102664 102571
55424 102571 102896 103376 103326 102869 102777 103194 103559 103756 104331 105525 107007 108516 109872 110481 109901 108873 108702 109496
55406 109496 110098 109798 109028 108172 106887 104996 103092 101770 100989 100507 100257 100077 99762 99549 99835 100301 100156
55389 100156 99422 99115 99871 101188 102319 103189 104099 105136 106198 107072 107354 106814 105953 105601 105891 106249 106437
55372 106437 106845 107630 108312 108452 108130 107541 106701 105687 104627 103347 101542 99371 97390 95936 95052 94830
55356 94830 95177 95483 95304 95236 96186 97848 98802 98238 96741 95337 94640 94987 96368 98008 98880 98940 99075 99645
55338 99645 99971 99469 98407 97192 95813 94450 93785 94091 94558 94131 92678 90983 89878 89669 90082 90547 90731
55321 90731 90846 91210 91702 92063 92424 92997 93531 93758 94082 94956 95872 95985 95603 95977 97548 99396 100522 100697
55303 100697 99952 98363 96630 95799 95997 96268 95954 95351 94799 94105 93237 92649 92503 92466 92640 93712 95715 97617
55285 97617 98700 99453 100445 101180 100818 99365 97485 95740 94600 94570 95563 96634 96949 96656 96349 96195 96100 96172
55267 96172 96440 96499 96036 95385 95119 95368 95896 96484 96886 96846 96471 96212 96160 95831 95034 94473 94965 96366 97667
55248 97667 97984 97220 95968 95005 94626 94421 93867 93068 92509 92307 92278 92611 93669 95110 96045 96229 96328 96774 97226
55229 97226 97391 97513 97620 97129 95756 94180 93235 92986 93028 93219 93639 94246 94937 95625 96052 95985 95705 95734 96013
55210 96013 95992 95653 95562 95741 95407 94249 93067 92618 92607 92410 92099 92150 92678 93495 94450 95342 95991 96698 97933
55191 97933 99237 99320 97777 95929 95260 95686 96083 95885 95424 95084 94888 94739 94579 94503 94940 96284 98166 99652
55173 99652 100385 100835 101155 100683 99078 97154 95954 95643 95910 96718 97996 99245 100166 101188 102677 104141
55157 104141 104878 104937 104826 104769 104774 104887 104722 103357 100490 97336 95619 95860 97133 98152 98241 97625 97212 97679
55139 97679 98576 98951 98931 99668 101346 102542 102348 101877 102482 103512 103308 101751 100297 99825 99902 100135 100850 102169
55121 102169 103494 104326 104892 105683 106809 107928 108468 107956 106479 104727 103342 102501 102260 102722 103470 103551 102663
55104 102663 101824 102182 103605 105118 106175 106880 107414 107986 108839 109608 109253 107442 105456 104867 105757 107085 108231
55087 108231 109245 110105 110749 111497 112455 112915 112317 111380 111197 111665 111881 111669 111441 110898 109340 107191 105824
55070 105824 105737 106081 106142 106098 106181 106213 106185 106273 106121 105158 103791 103262 104064 105476 106839 108193 109412 109887 109579
55051 109579 109364 109762 110182 109970 109415 109156 109275 109496 109711 109812 109530 108881 108256 107772 107104 106267 105949 106590 107707
55032 107707 108616 109374 110490 112070 113682 114853 115343 115160 114528 113715 112782 111704 110682 109981 109526 109071 108749
55015 108749 108895 109320 109383 108907 108470 108595 109156 109753 110161 110223 109835 109295 109291 110287 112100 114108 115582 116002 115559
54996 115559 115236 115796 116748 117020 116596 116622 117732 119157 119900 119987 120047 120237 120168 119556 118469 117225 116341 116271 116901
54977 116901 117592 117915 118055 118316 118663 118942 119174 119372 119476 119609 120013 120520 120573 120084 119852 120716 122532 124296
54959 124296 125109 124846 124114 123770 124316 125579 127000 128177 128932 129050 128411 127305 126166 125033 123762 122708
54943 122708 122536 123245 124001 124188 124055 124120 124458 124930 125644 126760 128134 129447 130462 131006 131045 130922 131204 132122
54925 132122 133474 135128 137233 139809 142655 145899 150141 155700 162045 168233 173601 177753 180242 180738
54911 180738 179453 177100 174415 171679 168602 164665 159727 154324 149252 145008 141792 139671 138270 136642
54897 136642 134191 131598 130144 130097 130497 130630 130887 131870 133362 134588 135030 134665 133898 133535 134370 136461 139203
54880 139203 142241 145773 149783 153678 157138 160775 165381 170853 176276 180753 183793 185166 184812 182792
54866 182792 179198 174357 169145 164581 160866 157270 153177 148856 144968 141815 139373 137534 135954 134123
54852 134123 131991 130102 128684 127108 124772 122081 119959 118705 117926 117386 117202 117252 117007 116150 114985 114067
54836 114067 113658 113574 113445 113100 112813 113063 113935 114874 115216 114893 114497 114665 115444 116241 116391 115849 115223 115052 115237
54817 115237 115391 115424 115421 115201 114600 114061 114263 115141 115978 116555 117482 119112 120809 121738 121829 121505 120954 120208 119631
54798 119631 119755 120736 122295 124066 125742 126999 127581 127420 126658 125648 124881 124613 124633 124720 125231 126731 128999
54781 128999 130962 131770 131526 130920 130641 131186 132623 134397 135943 137602 140303 144267 148776 153365 158315
54766 158315 163618 168461 172421 176373 181376 187208 192714 197075 199975 200939 199439 195544 189908 183234
54752 183234 176231 169740 164236 159334 154294 148924 143617 138854 135115 132937 132390 132680 132867 132860 133197 133973
54736 133973 134621 134749 134636 134774 135285 135972 136729 137809 139667 142492 145864 149092 151949 154806 158067 161845
54720 161845 166187 171021 175704 179228 181197 182098 182346 181690 179889 177250 173968 169638 164143 158473 153821
54705 153821 150235 146979 143956 141932 141375 141787 142213 141931 140781 139289 138415 138693 139669 140482 140769 140680 140309
54688 140309 139586 138475 136879 134681 132272 130616 130210 130320 129893 128870 127905 127118 125972 124287 122649 121727
54672 121727 121739 122545 123763 124839 125449 125744 125832 125345 124027 122482 121673 121885 122768 124164 126138 128314 129929
54655 129929 130545 130211 129065 127455 126263 126297 127309 128252 128502 128219 127588 126487 124958 123350 121887 120649
54639 120649 119939 119979 120335 120396 120466 121525 123766 126181 127862 128922 129829 130505 130539 129776 128353 126578 125037
54622 125037 124299 124226 124046 123388 122754 122689 122979 123098 123065 123401 124429 125968 127563 128849 129756 130449 130959 131013 130552
54603 130552 130224 130805 132093 132979 132800 132081 131712 131841 131892 131331 130117 128725 127905 128123 128991 129534 129184 128312
54585 128312 127721 127943 129081 130864 132597 133471 133304 132825 133004 134159 135753 136825 136637 135280 133767 133219
54569 133219 133840 134902 135726 136228 136500 136422 135962 135445 135137 134904 134604 134554 135232 136667 138389 139853 140702 140807
54551 140807 140402 140186 140983 143072 145843 148207 149474 149879 150159 150672 151115 151158 150973 150892 150820 150374 149378 147937
54533 147937 146243 144669 143761 143649 143659 143050 142047 141588 142104 143062 143727 143876 143771 143879 144588 145732 146490 146249
54515 146249 145462 145049 145150 145160 144946 145087 145750 146212 145821 144772 143629 142762 142508 143097 143974 143910 142395 140370
54497 140370 139003 138284 137535 136832 137014 138335 139868 140508 140162 139747 140151 141351 142601 143439 144229 145495 146963
54480 146963 147823 147884 147838 148272 149057 149968 151290 153331 155756 157895 159477 160713 161848 162917 163809 164410 164814
54463 164814 165392 166375 167415 167979 168134 168425 168976 169392 169668 170316 171238 171276 169515 166493 163523 161300 159677
54446 159677 158381 157277 156257 155417 155088 155246 155253 154717 154209 154501 155369 155826 155339 154264 153211 152583 152659 153499
54428 153499 154747 155903 156799 157524 158081 158460 158800 159052 158753 157654 156330 155555 155256 154714 153753 153046 153146
54411 153146 153826 154498 154828 154777 154500 154394 154847 155818 156869 157715 158434 159124 159669 159991 160256 160726 161593 162934
54393 162934 164572 166008 166788 166930 166760 166375 165611 164517 163419 162452 161380 160117 159122 159011 159897 161266
54377 161266 162448 163108 163420 163843 164725 166009 167303 168161 168418 168383 168753 170045 172039 173988 175470 176703
54361 176703 177869 178624 178687 178500 178684 179037 178742 177612 176465 176030 175986 175435 174032 172306 170927 169912 168603
54344 168603 166435 163722 161503 160494 160373 160358 160243 160478 161334 162474 163393 163801 163514 162490 161240 160686 161216
54327 161216 162167 162624 162479 162288 162314 162296 162129 162198 162745 163296 163132 162230 161366 161260 161850 162470 162584 162166 161474 160678
54307 160678 159765 158762 157952 157786 158417 159336 159674 159027 157873 157011 156717 156682 156625 156569 156532 156410 156317 156646 157445 158043
54287 158043 157738 156761 156160 156658 157913 159010 159437 159437 159535 159954 160530 161027 161331 161336 160869 159937 158963 158510 158716 159183
54267 159183 159432 159350 159204 159414 160317 161934 163893 165732 167295 168670 169773 170276 170045 169404 168890 168912 169600
54250 169600 170661 171362 171097 170099 169231 168889 168552 167658 166456 165615 165329 165270 165151 164860 164252 163335 162617 162770
54232 162770 163878 165389 166799 167987 168850 169083 168636 168096 168270 169363 170760 171656 171812 171627 171565 171695 171820
54215 171820 171796 171464 170454 168518 166134 164270 163314 162641 161509 160079 159085 158762 158633 158301 157996 158131 158588
54198 158588 158666 157727 155922 154272 153847 154707 155782 155977 155251 154431 154197 154613 155535 156988 158939 160979 162509
54181 162509 163217 163268 163050 162845 162779 162966 163517 164358 165149 165596 165728 165698 165398 164560 163268 162065 161444 161400 161547
54162 161547 161460 160892 159977 159294 159450 160426 161518 162028 161830 161290 160856 160778 160922 160829 160252 159580 159332 159302 158797 157809
54142 157809 157293 157946 159308 160461 161099 161436 161555 161428 161328 161600 162173 162681 162982 163247 163663 164301 165117 165868
54124 165868 166319 166649 167324 168435 169611 170758 172243 173998 175198 175431 175536 176552 178312 179879 180964
54109 180964 181984 183038 183774 184265 185148 186833 189261 192413 196357 200742 204857 208240 210662 211616 210590
54094 210590 207947 204835 202107 199883 198191 197247 196876 196393 195472 194641 194619 195526 196983 198515 199605 199836
54078 199836 199269 198385 197382 195904 193703 191228 189239 188046 187373 186808 186205 185746 185729 186211 186872 187291 187218
54061 187218 186466 184891 182827 181257 180964 181657 182449 183105 184115 185576 186811 187402 187948 189357 191813 194829
54045 194829 197959 201110 204332 207672 211197 214995 219210 224052 229625 235734 241993 248027 253459 257954
54031 257954 261630 265170 269089 273058 276434 279241 282044 284951 287472 289371 290919 292228 293016 293212 293089
54016 293089 292586 291226 289001 286683 284818 282971 280417 277084 273351 269352 265025 260512 256048 251667
54002 251667 247421 243616 240423 237429 234013 230128 226396 223448 221352 219648 217789 215626 213519 211935
53988 211935 211006 210571 210456 210450 210217 209682 209334 209601 210007 209636 208504 207753 208290 209879 211826 213881 216056 218253
53970 218253 220674 224128 229336 236143 243876 252132 260713 268923 275417 278806 278362 274400 268206 261378
53956 261378 254951 249260 244522 241067 238824 237137 235563 234526 234801 236528 238981 241137 242339 242710 243099
53941 243099 244351 246549 249278 252533 256680 261477 265943 269595 273043 276835 280439 283086 285041 287192
53927 287192 289756 292192 294218 296160 298441 301385 305407 310692 316651 322320 327416 332529 338251 344573
53913 344573 351222 358074 365040 371812 377952 383132 387236 390376 392778 394591 395748 395995 394937 392195
53899 392195 387921 383095 378851 375325 371650 367206 362332 357504 352491 346862 340764 334610 328414 322052
53885 322052 315811 310039 304537 298998 293757 289372 285639 281846 277915 274489 271821 269341 266464 263178
53871 263178 259605 255646 251386 247370 244075 241430 239088 236878 234699 232326 229697 227215 225408 224276
53857 224276 223213 221627 219519 217370 215587 214213 213234 212861 213222 213889 214113 213544 212412 211013 209502 208224
53841 208224 207634 207643 207598 207232 207085 207534 207998 207741 207027 206765 207282 208164 209136 210344 211757 212951 213613 213808 213723
53822 213723 213551 213602 214096 214879 215686 216607 217894 219443 220943 222404 224083 225980 227877 229763 231664 233230
53806 233230 234186 235238 237776 242429 248398 254422 259921 265035 270072 275227 280497 285540 289835 293216
53792 293216 296131 299243 302895 306946 310903 314161 316319 317290 317114 315825 313684 311249 308858 306252 303123
53777 303123 299762 296675 293708 290108 285452 280025 274364 268909 264023 259710 255331 250219 244742 240181
53763 240181 237358 235838 234640 233215 231567 229867 228316 227057 226004 224980 224084 223594 223398 222901 221664
53748 221664 219887 218131 216810 216032 215629 215292 214862 214528 214534 214814 215194 215734 216487 217160 217557 218151 219519 221256
53730 221256 222274 222291 222269 223122 224672 226222 227551 228893 230401 231996 233514 234701 235418 235986 236964 238451
53714 238451 240000 241379 242921 244972 247468 250238 253202 256061 258383 260313 262616 265689 269063 272231
53700 272231 275366 278746 282068 284965 287799 291264 295415 299632 303291 306047 307754 308700 309746 311575
53686 311575 313752 314969 314354 312318 310194 309176 309487 310297 310523 309823 308724 307836 307316 307139 307318 307555 307201
53669 307201 306026 304667 303874 303644 303496 303295 303277 303549 304020 304618 305126 305094 304405 303664 303441 303338 302465 300755
53651 300755 299167 298547 298894 299844 301283 303191 305308 307257 308819 309943 310734 311563 312983 315334 318435
53636 318435 321702 324517 326586 328116 329664 331717 334437 337815 341802 346176 350475 354268 357409 359910
53622 359910 361851 363529 365371 367432 369277 370673 372099 374169 376816 379504 382026 384622 387469 390585
53608 390585 394078 397967 401825 405143 408093 411365 415143 418779 421664 423913 425945 427748 428922 429230
53594 429230 428897 428461 428466 429116 430093 430800 430827 430110 428763 427010 425200 423548 421857 419819 417642 415936 414894
53577 414894 413955 412527 410670 408791 406966 405004 402983 401258 399856 398260 396028 393453 391362 390269
53563 390269 389954 389926 390075 390596 391404 392018 392121 391934 391861 392057 392559 393495 394837 396164 397156 398149 399728 401827
53545 401827 403739 405051 406073 407221 408481 409724 411149 413098 415753 419269 423922 429777 436423 443352
53531 443352 450485 458049 466047 474196 482420 491142 501020 512474 525387 539145 552993 566552 580042
53518 580042 594009 608885 624866 641996 660237 679509 699850 721462 744481 768782 794115
53507 794115 820341 847333 874761 902210 929494 956615 983464 1009736 1035150 1059536 1082771
53496 1082771 1104996 1126933 1149537 1172994 1196319 1218259 1238491 1257713 1276808 1296234 1316075
53485 1316075 1336071 1355566 1373894 1391108 1408010 1425282 1442875 1460521 1478446 1497082 1516140
53474 1516140 1534416 1550594 1563995 1574525 1582246 1587188 1589403 1588930 1585650 1579208 1569291 1556121 1540698
53461 1540698 1524276 1507509 1490258 1472355 1454213 1436374 1418693 1400415 1381042 1360723 1339794
53450 1339794 1318345 1296411 1274284 1252411 1231057 1210132 1189295 1168295 1147314 1126926 1107634
53439 1107634 1089671 1073407 1059565 1048580 1040029 1033308 1028674 1026805 1027307 1028557 1029383 1030257 1032365 1036154
53425 1036154 1041305 1047634 1055303 1064405 1074986 1087386 1102049 1118994 1137791 1157987 1179332 1201760
53413 1201760 1225446 1250731 1277679 1305913 1335141 1365567 1397399 1430294 1463801 1498218 1534428
53402 1534428 1572915 1613473 1655948 1700844 1749007 1800873 1856001 1913192 1971224 2029753 2089337
53391 2089337 2150323 2212035 2273459 2334413 2395331 2456070 2515727 2573674 2629984 2684615 2736887
53380 2736887 2786203 2832669 2876444 2916929 2953212 2985126 3013319 3038298 3059808 3077148 3089683
53369 3089683 3097022 3098933 3095133 3084922 3067009 3040004 3003394 2958137 2906313 2850275 2791974 2732697
53357 2732697 2672994 2612776 2551763 2490101 2428554 2368014 2308989 2251810 2197162 2145812 2097614
53346 2097614 2051156 2004830 1958023 1911042 1864167 1817400 1771086 1726255 1684074 1645123 1609244
53335 1609244 1575872 1544457 1514859 1487445 1462734 1440921 1421860 1405389 1391419 1379658 1369384
53324 1369384 1359502 1348777 1336312 1322132 1307218 1292648 1278773 1265506 1253144 1242282 1232978 1224672
53312 1224672 1217136 1210920 1206573 1203935 1202571 1202465 1203805 1206421 1209960 1214536 1220676 1228612 1237993 1248379
53298 1248379 1259802 1272789 1288019 1305928 1326466 1349153 1373416 1398860 1425254 1452483 1480627
53287 1480627 1509856 1539933 1569877 1598339 1624392 1647907 1669278 1688947 1707064 1723369 1737365
53276 1737365 1748684 1757166 1762510 1764118 1761643 1755559 1746757 1735529 1721369 1703946 1683909 1662357
53264 1662357 1639647 1615095 1587860 1557867 1525827 1492631 1458938 1425193 1391705 1358562 1325620
53253 1325620 1292770 1260188 1228209 1197001 1166540 1136931 1108459 1081121 1054329 1027390 1000284
53242 1000284 973622 947788 922477 897203 871929 846949 822466 798768 776570 756627 738964
53231 738964 722991 708467 695816 685268 676188 667652 659298 651173 643088 634655 625745 616371 606225
53218 606225 594936 582693 570032 556967 543033 528325 513836 500427 488013 476155 464964
53207 464964 454930 446204 438567 431846 425903 420370 414824 409094 403059 396340 388649 380333 372128 364356
53193 364356 356708 348827 340719 332634 324879 317860 312004 307447 303894 300811 297700 294316 290809 287578
53179 287578 284806 282205 279419 276564 274126 272391 271177 270075 268781 267287 265979 265390 265592 265889 265401
53164 265401 263918 261951 260035 258264 256539 254954 253764 253064 252593 251973 251299 251327 252646 254596 255560 254605
53148 254605 252350 249912 247638 245444 243777 243284 243808 244609 245491 246816 248437 249584 250028 250459 251367 252329
53132 252329 252852 253253 254115 255428 256799 258124 259384 260106 259664 258127 256378 255410 255662 256907 258447 259545
53116 259545 260051 260612 262002 264218 266392 267651 267913 267751 267567 267204 266460 265762 265775 266271 265976 263954 260736
53099 260736 257557 254839 252145 249381 247159 245937 245597 246005 247177 248603 249208 248477 247072 245872 244929
53084 244929 243875 242863 242465 242854 243639 244372 244846 244976 244758 244305 243776 243338 243221 243518 243915 243931 243530 243074
53066 243074 242637 241936 241036 240476 240380 240138 239386 238636 238382 238212 237561 236825 236889 237776 238572 238643 238245 237955 238089 238698
53046 238698 239696 240894 242172 243436 244213 243683 241659 239224 237764 237568 237936 238386 238965 239506 239505 238903 238324
53029 238324 238321 238899 239876 241108 242155 242380 241722 240935 240707 240933 241128 241203 241472 242167 243263 244603 245901 246732
53011 246732 246764 245989 244641 242981 241224 239615 238481 238224 239105 240866 242672 243658 243533 242523 240990 239436
52995 239436 238665 239346 241272 243447 245043 246025 246801 247657 248685 249957 251449 252862 253660 253367 252037 250580
52979 250580 250316 251850 254471 257008 259038 260836 262459 263670 264715 266228 268075 269088 268531 267204 266595
52964 266595 267316 268930 270829 272553 273566 273535 272877 272362 272081 271349 269759 267788 266071 264532 262659 260378
52948 260378 258175 256420 255001 253737 252808 252475 252508 252271 251432 250328 249473 248928 248451 248121 248348 249207 250132
52931 250132 250519 250383 250168 250080 249903 249427 248707 247878 246963 246063 245500 245504 245826 245971 245885 246146 247247 248893 250295
52912 250295 251057 251354 251288 250543 248969 247097 245700 245091 245191 245991 247454 249073 250062 250092 249480 248670 247929 247530
52894 247530 247682 248138 248290 247920 247458 247328 247422 247534 247846 248555 249328 249601 249261 248584 247673 246505 245525 245564 246912
52875 246912 248832 250301 251038 251580 252533 254025 255815 257662 259513 261436 263480 265520 267227 268270 268604
52860 268604 268561 268542 268610 268435 267731 266596 265304 263789 261608 258533 254968 251591 248644 245823 242864 240011
52844 240011 237757 236253 235128 233836 232076 229937 227831 226325 225854 226442 227643 228838 229576 229680 229199
52829 229199 228436 227960 228307 229469 230760 231348 230983 230199 229812 230198 230999 231462 231112 230192 229514 229870 231482 233908
52811 233908 236470 238836 241195 243731 245969 246918 246033 243827 241316 239024 236814 234528 232326 230473 229148
52796 229148 228479 228334 228115 227271 226108 225560 225947 226483 226310 225476 224564 223841 223367 223464 224402 225821 227071 228012
52778 228012 228918 229766 230219 230247 230146 229860 228919 227182 225182 223543 222459 221833 221519 221334 221195 221391 222271 223591
52760 223591 224597 224933 225023 225337 225773 226093 226530 227518 229024 230551 231718 232571 233479 234929 237235 240152 242862
52743 242862 244675 245725 246810 248552 250800 252835 254076 254645 255205 256185 257263 257816 257809 257799 258063 258182 257718
52726 257718 256860 256000 255025 253551 251714 250232 249564 249365 248868 247627 245804 243923 242466 241599 241205 241199 241748
52709 241748 243070 245000 246891 248096 248522 248665 249012 249514 249755 249633 249655 250387 251728 252871 252939 251580 249176
52692 249176 246722 245309 245325 246123 246686 246555 245881 244822 243416 242003 241194 241148 241311 241070 240390 239647 239208 239298
52674 239298 239885 240534 240730 240557 240676 241385 242216 242694 242976 243313 243404 242916 242277 242296 243222 244723 246620 248995
52656 248995 251690 254382 257123 260170 263220 265466 266538 266793 266525 265562 263940 262327 261250 260308 258733
52641 258733 256509 254411 253095 252588 252591 252799 252885 252619 252185 252132 252835 254180 255858 257783 260018 262409 264538
52624 264538 266022 266715 266610 265702 264057 261892 259443 256800 254071 251678 250271 250188 251126 252450 253721 254750
52608 254750 255293 255032 253931 252377 250851 249562 248516 247735 247243 246909 246560 246289 246455 247269 248432 249349 249746
52591 249746 250000 250804 252467 254616 256608 258181 259595 261143 262691 263831 264397 264602 264668 264565 264274 264048
52575 264048 264120 264248 263894 262987 262136 261924 262233 262517 262514 262364 262193 261982 261832 261929 262111 261853 260931 259890 259578 260295
52555 260295 261551 262490 262398 260994 258650 256342 255071 255088 255749 256217 256189 255869 255436 254742 253605 252227 251233
52538 251233 251222 252275 253831 255094 255705 256040 256791 258202 259838 261195 262305 263517 264779 265515 265287 264296
52522 264296 263063 261870 260716 259652 258857 258493 258691 259637 261467 264061 267099 270233 273150 275626 277756
52507 277756 280021 282788 285718 287887 288585 287858 286232 284145 281791 279369 277216 275572 274287 272983 271598
52492 271598 270586 270337 270508 270312 269476 268508 267927 267640 267314 266928 266610 266285 265806 265230 264659 264200 264308 265643
52474 265643 268002 269882 269882 268372 267128 267505 269563 272658 276000 278721 280377 281576 283367 285873 288179
52459 288179 289609 290271 290271 289427 288029 286904 286216 285106 283137 281198 280209 279655 278322 276001 273532 271482
52443 271482 269718 268129 266937 266232 265818 265548 265360 265049 264490 264003 263973 264175 263978 263289 262889 263731 266075 269265
52425 269265 272154 273874 274433 274471 274369 273937 273117 272482 272620 273462 274729 276614 279360 282548 285675 289321
52409 289321 294868 302878 312469 322502 332696 343207 353617 362854 369859 373920 374508 371297 364571
52396 364571 355489 345638 336222 327707 320311 314532 310769 308586 306963 305452 304479 304247 304030 303109 301902
52381 301902 301416 301881 302654 303342 304300 305963 308277 310937 313796 316935 320580 324914 329692 334218 338034
52366 338034 341438 344904 348194 350559 351658 351802 351414 350783 350200 349756 349105 348028 347169 347511 349053 350644
52350 350644 351342 351430 351929 353552 356320 359771 363357 366832 370314 373800 376889 379455 382327 386588 392251
52335 392251 398370 404454 410985 418409 426471 434934 444179 454602 465999 478083 491146 505645 521477
52322 521477 538183 555651 574152 593747 613926 633793 652521 669951 686911 704651 723721
52311 723721 743580 763405 782917 802216 821247 839815 857934 875792 893410 910483 926533
52300 926533 941235 954785 967917 981201 994265 1005970 1015292 1021678 1024638 1023803 1019624 1013447 1006427
52287 1006427 998730 990118 980862 971630 962834 954591 947139 940814 935658 931407 927868 925160 923679 923946
52273 923946 926322 930694 936607 943784 952254 961880 972117 982503 993112 1004210 1015691 1027169 1038555
52260 1038555 1050297 1063031 1077018 1091811 1106545 1120798 1135073 1150054 1165380 1179702 1192073
52249 1192073 1202797 1212548 1221145 1227564 1230828 1230581 1227068 1220954 1212981 1203527 1192668 1180749 1168442
52236 1168442 1156002 1143010 1129222 1115294 1102106 1089711 1077481 1065040 1052516 1040072 1027877
52225 1027877 1016527 1006849 999069 992545 986560 981070 976535 973246 971091 969894 969732 970721 972584 974735
52211 974735 976966 979862 984091 989357 994449 998423 1001298 1003577 1005635 1007797 1010544 1014172 1018478 1023046
52197 1023046 1027628 1032136 1036646 1041586 1047414 1053800 1059650 1064365 1068590 1073124 1077553 1080699 1082154 1082490
52183 1082490 1081943 1079708 1074887 1067666 1059178 1050477 1041954 1033638 1025729 1018624 1012473 1006891 1001368 995875
52169 995875 990855 986671 983435 981316 980520 980831 981620 982595 984086 986368 989121 991876 994545 997140 999397
52154 999397 1001084 1002294 1003032 1002968 1002088 1001160 1001003 1001649 1002763 1004488 1007180 1010589 1014044 1017265 1020343 1023079
52138 1023079 1025055 1026314 1027322 1028311 1029253 1030505 1032845 1036846 1042665 1050445 1060370 1072382 1086376 1102639
52124 1102639 1121581 1143046 1166422 1191331 1217605 1244664 1271699 1298595 1325976 1354146 1382503
52113 1382503 1410151 1436505 1461243 1484257 1505835 1526245 1544924 1560720 1573240 1583351 1592092
52102 1592092 1599680 1605977 1611246 1615808 1619247 1620574 1619109 1614899 1608404 1599974 1589458 1576215 1559809
52089 1559809 1540851 1520804 1500777 1480859 1460899 1441481 1423684 1408093 1394431 1382107 1370917
52078 1370917 1361347 1354296 1350253 1348679 1348510 1349431 1352197 1357550 1365271 1374738 1385913 1399141 1414174 1429997
52064 1429997 1445679 1460974 1476036 1490914 1505513 1519807 1533913 1547941 1561794 1575152 1587703
52053 1587703 1599296 1609621 1617814 1622786 1624198 1622788 1619415 1613968 1605571 1593688 1578676 1561293 1542072
52040 1542072 1521332 1499556 1477505 1455897 1435021 1414733 1394904 1375879 1358321 1342539 1328072
52029 1328072 1313968 1299368 1283826 1267402 1250700 1234692 1220210 1207447 1195962 1185120 1174480
52018 1174480 1163874 1153295 1142878 1132987 1124171 1116681 1109874 1102342 1092982 1081919 1070133 1058221
52006 1058221 1045849 1032379 1017605 1001680 984675 966548 947504 928218 909743 893102 878720
51995 878720 866073 854069 841906 829556 817378 805451 793293 780150 765581 750012 734638
51984 734638 720505 707533 694632 680766 665721 649940 634031 618537 603856 590137 577427
51973 577427 566021 556471 549164 544109 541136 540021 540404 541936 544634 548753 554158 560138 565960 571291
51959 571291 575967 579746 582450 583886 583476 580538 575314 569183 563412 558096 552853 548085 544821 543606
51945 543606 544302 546930 551903 559383 569129 581193 596162 614406 635573 659124 684873 712542 741056
51932 741056 768650 793448 813554 826814 831197 825783 811342 789926 763970 735623 706506 677737
51920 677737 650024 623761 599173 576523 556191 538444 523129 509758 497981 487765 479038 471490
51908 471490 465072 460475 458578 459308 461519 464182 467282 471220 475738 479954 483237 485424 486173 484692 480373
51893 480373 473376 464470 454657 445037 436499 429216 422700 416654 411510 407929 406175 406279 408312 412003
51879 412003 416477 421062 426183 432812 441070 449967 458486 466324 473445 479452 483689 485641 485189 482807
51865 482807 479534 476266 472976 469026 464351 459817 456341 454184 453346 454048 456340 459612 462984 465965 468389
51850 468389 469928 470040 468281 464474 458784 451890 444840 438326 432226 426142 420270 415320 411657 408894
51836 408894 406494 404473 403239 402888 402976 403136 403637 404972 406906 408388 408612 407788 406547 405027 403049 400859
51820 400859 398967 397362 395624 393850 392739 392669 393402 394864 397350 400641 403734 405984 407820 409694 411039
51805 411039 411104 410342 409973 410375 410831 410869 410937 411451 411947 411660 410557 409319 408440 407708 406582 404830 402683 400461
51787 400461 398277 396217 394574 393627 393215 392876 392480 392424 393146 394706 396829 398975 400400 400737 400747 401949 405225
51770 405225 410149 415893 422175 428938 435714 441990 447850 453604 458992 463252 465719 465925 463409 458060
51756 458060 450518 441806 432685 423729 415609 408683 402541 396585 390957 386297 382807 380199 378449 377872
51742 377872 378433 379692 381526 384311 388303 393439 399817 407678 416645 425524 433152 439092 443374 446082
51728 446082 447497 448244 449056 450589 453458 457902 463110 467351 469127 468086 464735 459733 453809 447996 443424
51713 443424 440684 439398 438388 436473 433468 430421 428529 427875 427692 427827 429162 432234 436017 438711 439403
51698 439403 438447 436528 434083 431677 430215 430364 431976 434279 436400 437535 436938 434278 430039 425196 420351
51683 420351 415481 410708 406864 404774 404155 403824 403108 402487 402697 403773 405400 407692 411049 415473 420618
51668 420618 426478 433588 442474 453104 464748 476119 485790 492732 496452 496614 493018 486228 477738 469034
51654 469034 460869 453892 449429 448740 451672 456811 462826 468866 473786 476012 474608 469892 462810 454241
51640 454241 445038 436079 427928 420863 415354 412015 410885 411188 411923 412214 411146 408059 403362 398490 394634
51625 394634 391886 389693 387572 385121 381999 378369 374909 371995 369264 366283 363209 360475 358194 356241
51611 356241 354527 352923 351312 349970 349396 349538 349745 349811 350465 352368 355271 358701 362903 368465 375430 383527
51595 383527 392850 403466 414477 424179 431150 434748 434800 431565 426014 419577 413455 408378 404828 403119
51581 403119 403385 405896 411098 418924 428362 438412 449336 462244 477411 493580 509101 523311 536685
51568 536685 550029 563506 576085 586017 592409 596453 600797 607724 618333 633269 653330 678895
51556 678895 709124 742101 775460 806770 833815 855154 870502 880398 885396 885422 879721 867463 848769
51543 848769 825215 799089 772028 744526 716721 689267 663309 639890 619613 602575 588324
51532 588324 575920 564283 552610 540564 528238 516025 504364 493499 483495 474430 466348 458972
51520 458972 451679 443984 436021 428486 422050 416855 412551 408771 405519 403004 401203 399750 398253 396489
51506 396489 394233 391232 387578 383922 381035 379266 378547 378691 379403 380257 381003 381797 382823 383810 384344 384568
51490 384568 385144 386398 387839 388663 388483 387567 386565 386050 386066 386064 385430 384069 382296 380334 378285 376477 375334
51473 375334 374732 373833 371775 368334 363890 359051 354381 350166 346301 342627 339392 337022 335441 334128 333042
51458 333042 332885 334045 335760 336930 337491 338414 340516 343803 347909 352526 357377 362454 368566 377066 388644
51443 388644 402664 417983 433915 449853 464375 475660 482957 487112 489457 490737 491277 491492 491461 490263
51429 490263 486392 479049 468757 456829 444589 433023 422651 413477 405270 398029 391986 387195 383397
51416 383397 380327 377869 375927 374493 373862 374385 375842 377452 378612 379289 379699 380105 381056 383137 386094 388790
51400 388790 390484 391669 393139 394813 396192 397536 399693 402984 407124 412166 418641 426685 435810 445763
51386 445763 456921 469619 483805 499716 518292 540462 566428 595981 629077 665766 705959
51375 705959 749573 796311 844634 891255 932349 965419 989815 1005795 1013635 1013512 1005622 990217
51363 990217 967764 939114 905261 866939 824847 780364 735642 692713 652588 615350 580937
51352 580937 549611 521811 497804 477520 460566 446341 434296 424193 415994 409365 403477 397599
51340 397599 391848 386993 383383 380385 377145 373660 370815 369449 369656 370829 372071 372639 372345 371524 370429
51325 370429 368751 366123 362926 360139 358273 356901 355351 353487 351648 350232 349552 349778 350687 351656 352179
51310 352179 352295 352372 352636 353011 353230 352982 352167 351083 350151 349387 348480 347513 347080 347389 347613 346635 344280 341413
51292 341413 339039 337679 337469 338302 339781 341458 343236 345323 347773 350412 353251 356697 361173 366654 372575
51277 372575 378035 382170 384675 386063 387191 388429 389507 390214 390873 391916 393249 394413 395269 396189 397547
51262 397547 399252 400831 401749 401606 400309 398154 395594 392802 389605 385958 382229 378792 375530 372105 368592
51247 368592 365450 362886 360707 358914 357881 357662 357559 356803 355448 354175 353475 353436 354110 355460 357022 358133
51231 358133 358597 358738 358804 358763 358682 358693 358572 357893 356854 356362 357043 358586 360311 361827 362845 362990 362380 361919
51213 361919 362382 363498 364555 365576 367170 369381 371501 373151 374852 377266 380348 383489 386096 387802
51199 387802 388548 388769 389274 390564 392336 393810 394449 394229 393360 391950 390018 387740 385583 383987 382824 381394
51183 381394 379254 376959 375638 375833 377065 378520 379860 381243 382893 384763 386371 386947 386072 384332 382948
51168 382948 382517 382504 382238 381992 382536 383951 385626 387371 389723 392861 395885 397715 398280 398188 397533 395819 393084
51151 393084 390285 388244 386745 385163 383556 382508 382152 381961 381508 380859 380175 379448 378834 378815 379686 381166 382693
51134 382693 383913 384795 385552 386545 387873 388963 389080 388477 388465 389875 391968 393471 394238 395144 396541 397749
51118 397749 398182 398221 398739 400263 402837 406155 409540 412187 413812 414835 415807 416901 418081 419325 420492
51103 420492 421338 421977 422986 424729 426885 428935 430862 432936 435024 436573 437285 437478 437707 438203 438753 439003
51087 439003 438882 438714 438883 439408 440010 440518 440912 441002 440508 439627 439090 439392 440381 441805 443755 446137 448259 449642
51069 449642 450977 453537 457790 463237 469510 476885 485717 496212 508958 524896 544285 566130 588815
51056 588815 610750 630216 645566 656455 664543 672325 681396 692136 704298 716897 727852 735011
51044 735011 737939 737944 736057 731717 723872 712709 699706 686528 674580 665202 659153 655527 651771 645217
51030 645217 634558 620008 602742 584577 567627 553412 542139 533165 526148 521389 519090 518860 520207
51017 520207 523080 527493 532975 538984 545775 554233 564669 576300 588099 599684 611046 621860 631683
51004 631683 640610 649098 657092 663810 668595 671574 673360 674423 674973 675177 675187 675061 674853 674698 674728 675052 675968
50987 675968 678005 681638 687096 694612 704658 717662 733498 751371 770111 788508 805638 821314
50975 821314 836269 851766 868993 888895 912337 940056 972404 1009425 1051248 1098148 1150097
50964 1150097 1206477 1266423 1329380 1395203 1463782 1534632 1606733 1678640 1748744 1815522 1877593
50953 1877593 1933697 1982874 2024802 2059857 2088622 2111263 2127464 2137054 2140689 2139924 2136643 2132401
50941 2132401 2128073 2123776 2118830 2111951 2101914 2088310 2071689 2052992 2032950 2011904 1989806 1966164
50929 1966164 1940206 1911377 1879521 1844480 1805743 1762826 1715868 1665577 1612756 1558222 1503066
50918 1503066 1448476 1395238 1343728 1294453 1248182 1205395 1165927 1129361 1095552 1064628 1036738
50907 1036738 1012031 990600 972141 955785 940548 926012 912423 900172 889302 879556 870806 863314
50895 863314 857408 852896 849119 845782 843490 842897 843490 843886 843508 843281 844304 846415 848719 851065 854195
50880 854195 858487 863370 868254 873499 880059 888429 898288 909029 920355 932380 945398 959729 975666
50867 975666 993380 1012758 1033488 1055571 1079694 1106834 1137407 1171179 1208205 1249473 1296174
50856 1296174 1348642 1406518 1469936 1540065 1618385 1705827 1802726 1909130 2024824 2149362 2282429
50845 2282429 2423973 2573563 2729606 2889567 3050993 3211990 3370440 3522982 3665140
50836 3665140 3792475 3901473 3989546 4054952 4097300 4117914 4119144 4103266 4072432 4029603 3978863
50825 3978863 3924475 3869983 3818397 3772646 3735093 3706644 3686640 3673372 3664246 3655679 3643579 3624296
50813 3624296 3595044 3553637 3498437 3428782 3345131 3248555 3140308 3022010 2895956 2764977
50803 2764977 2632017 2499878 2371166 2248293 2133393 2028095 1933224 1848827 1774623 1710417
50793 1710417 1656057 1611272 1575783 1549299 1531049 1519570 1513383 1511727 1514155 1519507 1525870 1531569
50781 1531569 1535755 1538066 1538321 1536641 1533262 1528099 1520942 1512126 1502267 1491223 1478093 1462487 1444983
50768 1444983 1425854 1404325 1379800 1353038 1325199 1296468 1266755 1237204 1209583 1184280 1160291
50757 1160291 1137320 1116556 1098928 1083885 1070670 1059775 1052116 1047494 1045041 1044875 1048217 1055861 1067423
50744 1067423 1082214 1100103 1121287 1145805 1173713 1205339 1241048 1280924 1324911 1373064 1425555
50733 1425555 1482656 1544815 1612421 1685236 1762217 1842175 1924389 2008348 2093016 2176841 2258519
50722 2258519 2337420 2413007 2483880 2547455 2600479 2639885 2663558 2670704 2661761 2638175 2602395 2557929
50710 2557929 2508845 2458803 2410578 2366564 2329269 2300685 2281155 2269317 2263318 2261745 2263307 2266143
50698 2266143 2267853 2266007 2258309 2242517 2216759 2180032 2132305 2074403 2008177 1936666 1863455 1791549
50686 1791549 1722819 1658409 1599264 1546230 1500021 1461311 1430713 1408541 1394797 1389477 1392627 1404000
50674 1404000 1422955 1448910 1481661 1520980 1565942 1614739 1665022 1714444 1761295 1804960 1845556
50663 1845556 1882852 1915708 1942949 1964662 1982250 1997274 2010619 2022689 2033787 2043991 2053035
50652 2053035 2060739 2067494 2074063 2080916 2088006 2095282 2103392 2113790 2128095 2147208 2171021 2198920 2230419
50639 2230419 2265184 2302626 2341850 2382058 2422705 2463085 2501967 2537937 2570134 2598556 2623720
50628 2623720 2646121 2666072 2683855 2699581 2712181 2718123 2711551 2686850 2642154 2580849 2509970 2437236
50616 2437236 2368965 2309356 2260483 2222751 2195802 2179162 2172070 2173112 2180510 2192649 2207826 2223500
50604 2223500 2236385 2243510 2242994 2233740 2214819 2185445 2145363 2095105 2036078 1970521 1901130 1830353
50592 1830353 1759926 1690942 1624056 1559540 1497508 1438384 1383056 1332379 1286598 1245364 1208152
50581 1208152 1174585 1144586 1118383 1096107 1077207 1060620 1045880 1033868 1025908 1022192 1021557 1022826
50569 1022826 1025849 1031027 1038309 1047158 1057327 1069240 1083571 1100670 1120497 1142931 1168010 1195905
50557 1195905 1226659 1259999 1295508 1333073 1373081 1416009 1461781 1509526 1557902 1605559 1651493
50546 1651493 1695317 1737397 1778556 1819423 1860185 1901098 1943065 1987397 2034995 2086184 2141395
50535 2141395 2201574 2267527 2339153 2415739 2496952 2583191 2675076 2773112 2877967 2990540 3111243
50524 3111243 3239222 3372428 3508343 3644546 3778813 3908938 4032429 4146229 4246805
50515 4246805 4330717 4395189 4438177 4458112 4453844 4424969 4372235 4297627 4203925 4094045 3970860
50504 3970860 3837799 3699372 3560732 3426736 3301759 3190142 3095904 3021530 2967609 2934125
50494 2934125 2921533 2929958 2957732 3001490 3057405 3121286 3187406 3248216 3295935 3324283 3328820 3306687
50482 3306687 3257006 3181497 3084114 2969855 2843826 2710921 2575667 2441932 2312686 2189926
50472 2189926 2074711 1967365 1867811 1775762 1690705 1612025 1539381 1472903 1412809 1358798 1309895
50461 1309895 1265031 1223859 1187008 1155448 1129490 1108457 1091369 1077662 1067051 1058994 1052843 1048509
50449 1048509 1046457 1046866 1049249 1053183 1059080 1067897 1080242 1095987 1114410 1134205 1153388 1169716 1181608
50436 1181608 1188775 1192100 1193103 1193450 1194643 1197777 1203352 1211239 1220967 1232244 1245274 1260525 1278202
50423 1278202 1298104 1319998 1343918 1370068 1398638 1429878 1464252 1502368 1544754 1591786 1643776
50412 1643776 1701084 1764033 1832562 1905853 1982460 2061000 2140565 2220211 2298276 2372673 2441828
50401 2441828 2504850 2560800 2608386 2646550 2674738 2692162 2697227 2688203 2664240 2625422 2572236 2505742
50389 2505742 2428282 2343512 2255523 2167995 2083921 2005630 1934907 1873173 1821532 1780527 1750080
50378 1750080 1729923 1719916 1719700 1728265 1744244 1766315 1792687 1820275 1844976 1863044 1871925 1869923
50366 1869923 1855809 1829278 1791543 1745062 1692660 1636862 1579738 1523019 1468287 1417059 1370557
50355 1370557 1329333 1293183 1261410 1233090 1207161 1182422 1157421 1130335 1099393 1064035 1025745
50344 1025745 987377 951485 919389 891556 868139 848944 833391 820912 811174 803724 797802 792745
50332 792745 788302 784328 780531 776872 773912 772312 772129 772892 774190 775888 778007 780802 784754 789997 795847
50317 795847 801309 806090 810779 816125 822553 830231 839030 848359 857647 867159 877811 889850 902198
50304 902198 913547 923773 933832 944451 955342 965633 974779 983171 992174 1003400 1017584 1034179
50292 1034179 1052233 1071432 1091936 1113565 1135896 1159074 1183449 1207689 1227766 1238759 1238028 1226721
50280 1226721 1208564 1187652 1167140 1149088 1134761 1124825 1119328 1117623 1118718 1122008 1127722 1136372 1147800
50267 1147800 1161084 1175547 1191624 1210588 1233546 1260832 1292157 1327036 1365094 1406146 1449945
50256 1449945 1495584 1541114 1584000 1622327 1655710 1685074 1711637 1736123 1758763 1779627 1798581
50245 1798581 1814878 1826922 1832559 1829657 1816578 1792547 1758029 1714943 1666446 1616202 1567546 1522881
50233 1522881 1483418 1449184 1419211 1391895 1365412 1338046 1308291 1274901 1237259 1195958 1152966
50222 1152966 1110828 1071465 1035627 1003285 974212 948181 924976 904382 886058 869375 853734
50211 853734 839203 826476 815905 806889 798542 790701 783839 778240 773765 770271 767653 765447 762904
50198 762904 759681 756136 752855 750138 747958 746040 743950 741475 738914 736633 734330 731290 727444 723612
50184 723612 720513 718059 715878 713986 712622 711840 711640 712073 712833 713210 712974 712999 714537 718019 722899 728329
50168 728329 733605 738325 742744 747812 754332 762199 770862 780246 790648 801964 813778 826283 840468
50155 840468 857280 877139 900425 927915 960328 997681 1039300 1084379 1132599 1184516 1241422
50144 1241422 1304579 1374461 1450643 1532071 1617088 1703487 1789165 1872760 1953441 2030347 2102914
50133 2102914 2171663 2237950 2302561 2364744 2422365 2472199 2509949 2530923 2531534 2510382 2468115 2406920
50121 2406920 2330266 2242372 2147097 2047376 1945772 1845055 1747869 1656146 1571210 1494071 1425169
50110 1425169 1364089 1309994 1262193 1219882 1181600 1145569 1110764 1077425 1046506 1018808 994483
50099 994483 973040 953733 936114 920235 906281 894158 883588 874494 867037 861373 857504 855275
50087 855275 854319 854137 854457 855436 857290 859795 862424 864962 867803 871501 876191 881452 886630 891230 895068
50072 895068 898194 900738 902897 904933 906968 908766 909818 909760 908669 906998 905244 903537 901448 898331 894069
50057 894069 889317 884769 880496 876427 873163 871505 871175 870898 870137 870040 872115 876581 882649 889927 898720
50042 898720 909181 921094 934512 949889 967235 985707 1004369 1023118 1042603 1063445 1085846
50031 1085846 1109865 1135811 1164197 1195265 1228750 1264310 1302201 1343145 1387465 1434658 1483963
50020 1483963 1534798 1586192 1636119 1682011 1721937 1754993 1781037 1800907 1816889 1831931 1847604
50009 1847604 1862850 1874734 1879983 1875687 1859284 1828934 1784302 1726988 1660231 1588170 1514929 1443735
49997 1443735 1376529 1314241 1257288 1205736 1159294 1117512 1080150 1047210 1018576 993668 971423
49986 971423 950501 929578 907801 885297 863190 842781 824468 807574 791317 775680 761160
49975 761160 747944 735869 725092 716156 709205 703606 698632 694077 689881 685612 680843 675761 670880
49962 670880 666369 662202 658796 656818 656382 657023 658599 661614 666505 673102 681058 690277 700568 711217
49948 711217 721283 730115 737352 742742 746349 748717 750417 751412 751117 749043 745206 739984 733723 726388
49934 726388 717416 706114 692494 677675 663261 650248 638721 628422 619279 611334 604569 599064
49922 599064 595128 592960 592216 592219 592686 593986 596481 599795 603055 605875 608747 612335 616670 621294 626002
49907 626002 631143 637237 644596 653308 663311 674405 686292 698609 710814 722128 731842 739658 745551
49894 745551 749432 751219 751114 749340 745627 739418 730756 720556 709757 698614 687110 675629 664711
49881 664711 654368 644171 633947 623975 614512 605557 597234 589991 584220 579802 576179 572780 569400
49868 569400 566400 564599 564733 566865 570430 574924 580341 586836 594302 602612 612065 623119 635643 648864
49854 648864 662147 675373 688239 699622 708251 713948 717657 720239 721765 722128 721638 720506 718147 713593
49840 713593 706477 697170 686209 674246 662421 651980 643269 635684 628870 623418 619948 618086 616894
49827 616894 616000 615704 616165 617183 618797 621489 625616 631076 637751 645842 655446 666058 676811 687087
49813 687087 696589 704989 711917 717391 721931 726021 729557 731932 732589 731272 727886 722377 714897 705931
49799 705931 696171 686350 677203 669292 662621 656582 650545 644382 638264 632179 626118 620581 616260 613100
49785 613100 610236 607201 604637 603387 603279 603391 603250 603144 603383 603953 605039 607262 611113 616463 622846 629860
49769 629860 637109 644097 650455 656047 660679 664030 666149 667728 669430 671069 671826 671207 669398 666680 662911
49754 662911 657777 651263 643685 635389 626637 617717 609000 600890 593786 588021 583695 580577 578275 576651
49740 576651 575986 576591 578189 579857 580769 580977 581256 582202 583781 585793 588408 591849 595770 599388 602348 605178
49724 605178 608882 614268 621698 631116 642102 654039 666340 678400 689357 698250 704593 708558 710379
49711 710379 709859 706773 701521 694962 687675 679743 671292 662918 655434 649437 645151 642426 640774 639621
49697 639621 638679 637911 637124 635875 633986 631994 630849 631166 632863 635453 638617 642536 647685 654228 661669
49682 661669 669313 677105 685787 696121 708239 721921 737242 754618 774186 795156 815511 832279
49670 832279 842653 845608 842640 836678 830243 824671 820619 818536 818424 819748 822042 825240 828951 831537
49656 831537 830484 823899 811600 794894 775711 756018 737510 721245 707389 695583 685672 677958
49644 677958 672693 669586 668069 667947 669476 672711 676958 681016 683869 685156 685041 683748 681206 677135 671528
49629 671528 664938 658060 651093 643807 636260 629141 623215 618694 615336 612864 611046 609624 608543 608079
49615 608079 608390 609074 609545 609829 610616 612493 615406 618842 622238 625193 627628 629834 632116 634349 636149
49600 636149 637458 638625 639843 640899 641643 642323 643232 644289 645298 646380 647754 649213 650132 650124 649476 648839
49584 648839 648589 648609 648652 648753 649071 649387 649142 648193 647228 647032 647525 648073 648637 650025 652845 656825 661509 667026
49566 667026 673681 681182 688908 696799 705392 714903 724654 733444 740269 744726 747107 748136 748308 747379 744710
49551 744710 740182 734613 729261 725049 722184 720230 718538 716785 715225 714283 714026 714231 714865 716158 718138
49536 718138 720442 722741 725087 727724 730829 734721 740093 747637 757452 769094 782280 797341 814831
49523 814831 834842 856870 880153 903700 925818 943983 955883 960958 960868 958341 955635 954067 954456
49510 954456 957378 962859 970126 977881 984679 989023 989388 984561 974187 959027 940662 920793 900634
49497 900634 880942 862539 846461 833270 822345 812398 802925 794788 789104 785812 783755 782005 780638
49484 780638 780137 780510 781324 782325 783640 785386 787371 789267 790877 792145 793025 793486 793622 793634 793747 794144 794947
49467 794947 796201 797942 800302 803443 807241 811079 814122 815942 816848 817550 818496 819496 819908 819201 817367
49452 817367 814826 811976 808922 805700 802561 799843 797572 795485 793494 791960 791321 791607 792517 793936 796147
49437 796147 799453 803705 808350 812936 817475 822317 827808 834226 841921 851215 862032 873868 886315
49424 886315 899415 913206 927083 939940 950751 958553 961983 959640 951413 939149 925661 913295
49412 913295 903552 897355 894804 894859 896170 898556 903178 911040 921808 934344 947923 962424 977679
49399 977679 993265 1008919 1024682 1040482 1055942 1070758 1085017 1098885 1112132 1124192 1134582
49388 1134582 1143065 1149407 1153254 1154398 1153086 1149909 1145366 1139538 1132196 1123192 1112803 1101810 1091279
49375 1091279 1082180 1074981 1069497 1065126 1061452 1058711 1057647 1058761 1061795 1066044 1071107 1077091 1083945 1090867
49361 1090867 1096616 1100402 1102224 1102366 1100799 1097271 1091814 1085008 1077700 1070643 1064410 1059550 1056541 1055523
49347 1055523 1056158 1057842 1059993 1061978 1063005 1062475 1060550 1057973 1055086 1051260 1045589 1037927 1028956 1019469
49333 1019469 1010181 1002219 997098 995736 997763 1002238 1008974 1018865 1032876 1051062 1072638 1096627 1121827
49320 1121827 1146020 1165748 1177610 1180164 1174496 1163043 1148152 1131651 1114894 1098479 1082115 1065341
49308 1065341 1048371 1031916 1016465 1002277 989917 980098 972947 967981 964805 963218 962590 961976 961201
49295 961201 961144 962506 964762 966768 967913 968207 967731 966557 964823 962326 958315 952287 944745 936698 928681
49280 928681 920852 913779 908375 905016 903344 903030 904207 907075 911497 917150 923703 930813 938146 945472
49266 945472 952495 958724 963796 967790 970988 973643 976369 980409 986906 996149 1008135 1023464 1042675
49253 1042675 1064782 1087665 1110046 1131845 1151968 1166970 1173157 1169610 1158297 1141635 1120987 1097379
49241 1097379 1072484 1048280 1026170 1006755 990142 976198 964604 954935 946878 940566 936736 936230
49229 936230 939110 944426 951073 958627 967076 976140 985389 994894 1005135 1016156 1027333 1038074 1048307
49216 1048307 1058032 1066832 1074157 1079885 1084340 1087955 1091201 1094637 1098709 1103572 1109389 1116753 1126447 1138722
49202 1138722 1153073 1168865 1185930 1204357 1223898 1243899 1263766 1283148 1301605 1318389 1332859
49191 1332859 1345028 1355486 1364870 1373598 1382096 1390956 1400609 1410911 1421210 1430906 1440107 1449917 1462060
49178 1462060 1477944 1497934 1521683 1549269 1581774 1620562 1666156 1717949 1774473 1833071 1889138
49167 1889138 1936536 1969837 1986683 1988328 1978490 1962008 1943845 1927887 1915769 1906956 1900263 1895136
49155 1895136 1891440 1888630 1885908 1883193 1881382 1881504 1883926 1888392 1894488 1901854 1910309 1920030 1931471 1944811
49141 1944811 1959523 1974660 1989634 2004676 2020505 2037504 2055209 2072736 2089726 2106668 2124115
49130 2124115 2141947 2159764 2177697 2196223 2215242 2234065 2252428 2270908 2290158 2310440 2332239
49119 2332239 2356589 2384159 2414544 2447150 2482457 2521791 2566317 2617140 2676277 2746649 2831015
49108 2831015 2931572 3050369 3188405 3342644 3503748 3658398 3796470 3918049 4033151
49099 4033151 4151480 4268943 4363617 4407598 4386345 4308894 4200420 4084675 3971194 3855419
49089 3855419 3728299 3586256 3434704 3284546 3146057 3025152 2923493 2840191 2772968 2718783
49079 2718783 2674705 2638574 2608826 2583994 2562721 2544041 2527301 2511916 2497410 2483638 2470796
49068 2470796 2459292 2449515 2441368 2433965 2426311 2418568 2412163 2408220 2406200 2404516 2402164 2399188 2395880 2392329
49054 2392329 2388872 2386265 2384960 2384563 2384311 2383993 2384189 2385715 2388963 2393716 2399368 2405154 2410045 2412615 2411535
49039 2411535 2406639 2399392 2391957 2385744 2381062 2377970 2376926 2378383 2382167 2387639 2394304 2401957 2410259 2418508
49025 2418508 2425931 2432103 2437047 2441056 2444469 2447537 2450415 2453303 2456574 2460625 2465571 2471240 2477587 2484953
49011 2484953 2493725 2503853 2514924 2526610 2538768 2551097 2563141 2574731 2586107 2597465 2608682
49000 2608682 2619645 2630387 2640562 2649195 2655487 2659716 2662940 2665856 2668274 2669547 2669153 2666983 2663450
48987 2663450 2659256 2654744 2649627 2643690 2637463 2631703 2626448 2621268 2616233 2611791 2607631 2602558 2595805 2587785
48973 2587785 2579220 2570233 2560829 2551691 2543810 2537451 2531926 2526307 2520169 2513852 2508261 2504230 2501935 2501090
48959 2501090 2501704 2504296 2509273 2516466 2525300 2535052 2544971 2554798 2565361 2578004 2593139 2609922 2627620
48946 2627620 2646587 2667426 2689832 2712900 2736118 2759554 2783490 2808498 2835488 2865098 2897263
48935 2897263 2931868 2969386 3010268 3054116 3100145 3148233 3198849 3252144 3307680 3364876 3423183
48924 3423183 3482136 3541859 3603218 3666811 3732133 3798422 3865917 3935190 4005479 4074840 4142100
48913 4142100 4207564 4271551 4333334 4392155 4448433 4503234 4556978 4609257 4659492 4707215 4752042
48902 4752042 4794035 4834047 4873268 4912309 4950799 4987684 5021713 5051837 5077467 5098508 5115226
48891 5115226 5128186 5138213 5146038 5151777 5154891 5154701 5150917 5143725 5133541 5120601 5104658 5085233 5062284
48878 5062284 5036308 5007527 4975313 4938898 4898369 4854357 4806986 4755848 4700934 4642879 4582269
48867 4582269 4519476 4455300 4391033 4327502 4264697 4202600 4141884 4083439 4027760 3975049 3925360
48856 3925360 3878235 3832788 3788683 3746649 3707538 3671300 3637407 3605898 3577405 3552341 3530638
48845 3530638 3512233 3497303 3485988 3478163 3473482 3471438 3471577 3473928 3479034 3487235 3498066 3510715 3524898
48832 3524898 3540914 3558921 3578548 3599239 3620617 3642409 3664262 3685841 3707053 3728141 3749559
48821 3749559 3771699 3794699 3818529 3843160 3868485 3894157 3919797 3945336 3970763 3995581 4019070
48810 4019070 4041363 4063767 4087557 4112807 4138709 4164750 4191060 4217936 4245554 4274126 4303864
48799 4303864 4334742 4366514 4398863 4431290 4463075 4493659 4522852 4550377 4575552 4597933 4617981
48788 4617981 4636486 4653556 4668840 4682570 4695476 4707513 4717469 4724104 4726926 4725510 4718885 4706299
48776 4706299 4688120 4665279 4638181 4606799 4571545 4533280 4492478 4449039 4402938 4354549 4304254
48765 4304254 4252261 4198851 4144305 4088514 4031216 3972819 3914423 3856773 3799713 3743115 3687827
48754 3687827 3635128 3585574 3538976 3495196 3454186 3415321 3377604 3340822 3305840 3273363 3242999
48743 3242999 3214098 3187019 3162928 3142500 3125507 3111547 3100440 3091723 3084458 3078007 3072620 3068753
48731 3068753 3066081 3063745 3061471 3059871 3059486 3060112 3061362 3063446 3066775 3070945 3074801 3077658 3080030 3082869
$$ [...]
##END NTUPLES=NMR SPECTRUM
##END=
