##TITLE=AC1461_TOLI13267_7819493_ubtpHvw9Po
##JCAMPDX= 6.0         $$ Bruker NMR JCAMP-DX V2.0
##DATA TYPE= NMR SPECTRUM
##DATA CLASS= NTUPLES
##ORIGIN= BRUKER
##OWNER= Administrator
$$ 1.72 TOPSPIN		Version 2.1
$$ 2013-04-30 22:27:11.819 -0700  Administrator@X
$$ Compression mode = diff/dup
##.OBSERVE FREQUENCY= 400.02188249412
##.OBSERVE NUCLEUS= ^1H
##.ACQUISITION MODE= SIMULTANEOUS (DQD)
##.ACQUISITION SCHEME= undefined
##.AVERAGES= 8
##.DIGITISER RES= 22
##SPECTROMETER/DATA SYSTEM= spect
##.PULSE SEQUENCE= zg30
##.SOLVENT NAME= COFFEE_meoh
##.SHIFT REFERENCE= INTERNAL, COFFEE_meoh, 1, 14.98509
##AUDIT TRAIL= $$ (NUMBER, WHEN, WHO, WHERE, PROCESS, VERSION, WHAT)
$$ ##TITLE= Audit trail, TOPSPIN		Version 2.1
$$ ##JCAMPDX= 5.01
$$ ##ORIGIN= Bruker BioSpin GmbH
$$ ##OWNER= Administrator
$$ $$ E:\/data/COFFEE/nmr/AC1461_TOLI13267_7819493_ubtpHvw9Po/10/pdata/1/auditp.txt
$$ ##AUDIT TRAIL=  $$ (NUMBER, WHEN, WHO, WHERE, PROCESS, VERSION, WHAT)
(   1,<2013-04-30 22:27:05.116 -0700>,<Administrator>,<X>,<go>,<TOPSPIN 2.1>,
      <created by zg
	started at 2013-04-30 22:25:59.444 -0700,
	POWCHK enabled, PULCHK disabled,
       configuration hash MD5:
       F7 49 AB AC A2 8D 51 76 73 8D C1 9A A6 38 9F DE
       data hash MD5: 64K
       1C A1 AE 1A 51 1F 2D 08 91 56 86 66 9E A9 6D B3>)
(   2,<2013-04-30 22:27:08.053 -0700>,<Administrator>,<X>,<proc1d>,<TOPSPIN 2.1>,
      <Start of raw data processing
       efp LB = 0 FT_mod = 6 PKNL = 1 PHC0 = 0 PHC1 = 0 SI = 32K 
       data hash MD5: 32K
       4B 31 5E B0 49 90 CD F4 38 63 C3 67 05 5F 26 E7>)
(   3,<2013-04-30 22:27:08.381 -0700>,<Administrator>,<X>,<proc1d>,<TOPSPIN 2.1>,
      <pk PHC0 = 98.23975 PHC1 = 0 
       data hash MD5: 32K
       9C 87 DD 69 69 83 79 9C 37 F4 33 32 99 CE A7 2A>)
(   4,<2013-04-30 22:27:08.506 -0700>,<Administrator>,<X>,<proc1d>,<TOPSPIN 2.1>,
      <abs ABSG = 1 
       data hash MD5: 32K
       BB 7E 1F C4 36 64 82 73 00 F2 85 79 BD AF EC 9A>)
(   5,<2013-04-30 22:27:08.553 -0700>,<Administrator>,<X>,<proc1d>,<TOPSPIN 2.1>,
      <abs ABSG = 2 
       data hash MD5: 32K
       52 9B 34 C3 C4 ED 30 AC F4 59 5F 42 96 8E 2E 64>)
(   6,<2013-04-30 22:27:08.616 -0700>,<Administrator>,<X>,<proc1d>,<TOPSPIN 2.1>,
      <abs ABSG = 3 
       data hash MD5: 32K
       C2 4D 3E 03 81 01 4B 44 DD 87 61 02 6C 4B CD B8>)
(   7,<2013-04-30 22:27:08.663 -0700>,<Administrator>,<X>,<proc1d>,<TOPSPIN 2.1>,
      <abs ABSG = 4 
       data hash MD5: 32K
       9D 72 C2 49 AF 54 F1 70 7E CB FD 0D CB A5 1A 7A>)
(   8,<2013-04-30 22:27:08.710 -0700>,<Administrator>,<X>,<proc1d>,<TOPSPIN 2.1>,
      <abs ABSG = 5 
       data hash MD5: 32K
       F2 52 22 3F 66 10 33 3E 77 AB 43 69 EE 2C 35 72>)
$$ ##END=
$$ 
$$ $$ hash MD5
$$ $$ 8F B4 52 DA 93 92 53 33 28 25 44 05 58 30 C3 6D
##$RELAX= 
##$RELAX= 
##$RELAX= 
##$RELAX= 
##$RELAX= 
##$RELAX= 
##$RELAX= 
$$ Bruker specific parameters
$$ --------------------------
##$DU= <E:\>
##$EXPNO= 10
##$NAME= <AC1461_TOLI13267_7819493_ubtpHvw9Po>
$$ [...]
150 150 150 150 150 150 150 150
##$TP07= 0
##$TPNAME0= <>
##$TPNAME1= <>
##$TPNAME2= <>
##$TPNAME3= <>
##$TPNAME4= <>
##$TPNAME5= <>
##$TPNAME6= <>
##$TPNAME7= <>
##$TPOAL= (0..7)
0.5 0.5 0.5 0.5 0.5 0.5 0.5 0.5
##$TPOFFS= (0..7)
0 0 0 0 0 0 0 0
##$TUNHIN= 0
##$TUNHOUT= 0
##$TUNXOUT= 0
##$USERA1= <user>
##$USERA2= <user>
##$USERA3= <user>
##$USERA4= <user>
##$USERA5= <user>
##$V9= 5
##$VALIST= <valist>
##$VCLIST= <CCCCCCCCCCCCCCC>
##$VD= 0
##$VDLIST= <DDDDDDDDDDDDDDD>
##$VPLIST= <PPPPPPPPPPPPPPP>
##$VTLIST= <TTTTTTTTTTTTTTT>
##$WBST= 1024
##$WBSW= 4
##$XGAIN= (0..3)
0 0 0 0
##$XL= 0
##$YL= 0
##$YMAX_a= 664721
##$YMIN_a= -565296
##$ZGOPTNS= <>
##$ZL1= 120
##$ZL2= 120
##$ZL3= 120
##$ZL4= 120
##$ABSF1= 14.98509
##$ABSF2= -5.573092
##$ABSG= 5
##$ABSL= 3
##$ALPHA= 0
##$AQORDER= 0
##$ASSFAC= 0
##$ASSFACI= 0
##$ASSFACX= 0
##$ASSWID= 0
##$AUNMP= <proc_prof1d_extract_pilot.lims>
##$AXLEFT= 0
##$AXNAME= <>
##$AXNUC= <1H>
##$AXRIGHT= 0
##$AXTYPE= 0
##$AXUNIT= <>
##$AZFE= 0.1
##$AZFW= 0.1
##$BCFW= 0
##$BC_mod= 0
##$BYTORDP= 0
##$COROFFS= 0
##$CY= 15
##$DATMOD= 1
##$DC= 0
##$DFILT= <>
##$DTYPP= 0
##$F1P= 0
##$F2P= 0
##$FCOR= 0.5
##$FTSIZE= 32768
##$FT_mod= 6
##$GAMMA= 0
##$GB= 0
##$INTBC= 1
##$INTSCL= 1
##$ISEN= 128
##$LB= 0
##$LEV0= 0
##$LPBIN= 0
##$MAXI= 10000
##$MC2= 0
##$MEAN= 0
##$ME_mod= 0
##$MI= 0
##$NCOEF= 0
##$NC_proc= -8
##$NLEV= 6
##$NOISF1= 0
##$NOISF2= 0
##$NSP= 0
##$NTH_PI= 0
##$NZP= 0
##$OFFSET= 14.98509
##$PC= 1
##$PHC0= 98.23975
##$PHC1= 0
##$PH_mod= 1
##$PKNL= yes
##$PPARMOD= 0
##$PPDIAG= 0
##$PPIPTYP= 0
##$PPMPNUM= 2147483647
##$PPRESOL= 1
##$PSCAL= 4
##$PSIGN= 0
##$PYNMP= <proc.py>
##$REVERSE= no
##$SF= 400.02
##$SI= 32768
##$SIGF1= 0
##$SIGF2= 0
##$SINO= 400
##$SIOLD= 32768
##$SPECTYP= <>
##$SREGLST= <1H.CDCl3>
##$SSB= 0
##$STSI= 32768
##$STSR= 0
##$SW_p= 8223.68421052631
##$SYMM= 0
##$S_DEV= 0
##$TDeff= 65536
##$TDoff= 0
##$TI= <>
##$TILT= no
##$TM1= 0
##$TM2= 0
##$TOPLEV= 0
##$USERP1= <user>
##$USERP2= <user>
##$USERP3= <user>
##$USERP4= <user>
##$USERP5= <user>
##$WDW= 1
##$XDIM= 32768
##$YMAX_p= 463094525
##$YMIN_p= -724727
##$CURPLOT= <Network HP LaserJet P1505>
##$CURPRIN= <$Network HP LaserJet P1505>
##$DFORMAT= <normdp>
##$LAYOUT= <+/1D_H.xwp>
##$LFORMAT= <normlp>
##$PFORMAT= <normpl>
##$SURQMSG= 1
$$ End of Bruker specific parameters
$$ ---------------------------------
##NTUPLES= NMR SPECTRUM
##VAR_NAME=  FREQUENCY,     SPECTRUM/REAL,   SPECTRUM/IMAG
##SYMBOL=    X,             R,               I
##VAR_TYPE=  INDEPENDENT,   DEPENDENT,       DEPENDENT
##VAR_FORM=  AFFN,          ASDF,            ASDF
##VAR_DIM=   32768,         32768,           32768
##UNITS=     HZ,            ARBITRARY UNITS, ARBITRARY UNITS
##FACTOR=    0.250966925370066, 1,           1
##FIRST=     8223.43324360094, 19247,        -191200
##LAST=      0,             101287,          -51772
##MIN=       0,             -724727,         0
##MAX=       8223.43324360094, 463094525,    0
$$ Real data points
##PAGE= N=1
##DATA TABLE= (X++(R..R)), XYDATA
$$ [...]
19548a27116j63382J39015k5921j04956I8522a56785E3388J10990l2119g3162
19537b22543e9548D9519K58067a62361M7620l3403m13590a93239B5513c66226
19526b13500d3552j29985Q4737A1826f2600m36089i9076k82613D2902b4731j70598
19515a95329A14732d1712m5162j47501o9255b6737j41389j4843A35752b8186J0876
19504a7310A30267J04496g3778A0636P2678b82815G8403C3643a94875I5615J8044
19493A13659b09555G7930a87510D4462b17834b5685j57648B77826E8811K1070
19483G9881M6434b04692R5200J0120n2247j01844h8489j16395G4366M0037D5554
19471D9109N0115j64B2721b79803I9207b84820A44443B0197a93261a0085l60579
$$ y = [-127116, -290498, -151483, -177404, -282360, 98522, -156785, 53388, 164378, 132259, -73162, -222543, -59548, 49519, 307586, -162361, -114741, -148144, -561734, -193239, 25513, -366226, -213500, -43552, -173537, -88800, 11826, -62600, -498689, -99076, -381689, 42902, -24731, -195329, 114732, -41712, -86874, -234375, -303630, -26737, -168126, -182969, 135752, -28186, -17310, 130267, 234763, -73778, 10636, 83314, -282815, 78403, 33643, -194875, 95615, 113659, -209555, 77930, -187510, 44462, -217834, -25685, -183333, 277826, 58811, 79881, 126315, -204692, -109492, -99372, -151619, -253463, -88489, -204884, 74366, 114403, 45554, 49109, 99224, 99060, 22721, -279803, 99207, -284820, 144443, 20197, -193261, -10085, -370664]
19460c70664L9906C5650L79253C6305b00723K5518L3289b5526k02539L5459H1969
19448g4856o6104B64098a07032A18466h971k08818d9370k44441A2896K48905j5369
19437B46432a87927l25815a75049A28314b41114G0358b15452L7077j16497A05907
19426c91997r7443A96521b52847f3593k45137d5223k38302B82949a87570q0472
19416b68042A05495K677a62787H143a30083I1991D295a24366A14190m2438a45857
19404C33370e3586r9647p4422J2143e4770A74062q792a11557C9640b24876J04811
19393a20065b2689j03231k04894g7160j26926D8756K3687b17670o7011B42872
19382c82558J73280L0516G6988j9061Q1659d5882j1850P466j9736g546l2132j2354
$$ y = [-370664, -330758, 35650, 414903, 36305, -200723, -175205, -141916, -25526, -228065, -192606, 81969, -74856, -140960, 264098, -107032, 118466, -8971, -217789, -49370, -293811, 12896, 261801, 246432, -187927, -513742, -175049, 128314, -241114, 70358, -215452, -178375, -294872, 105907, -391997, -489440, 196521, -252847, -63593, -308730, -45223, -283525, 282949, -187570, -268042, 105495, 108172, -162787, 8143, -130083, 91991, 4295, -124366, 114190, 71752, -145857, 333370, -53586, -153233, -227655, -215512, -54770, 174062, 165270, -111557, 39640, -224876, -120065, -22689, -125920, -330814, -77160, -204086, 48756, 72443, -217670, -284681, 242872, -382558, -209278, -178762, 76988, 57927, 139586, -45882, -57732, -50266, -70002, -7546, -39678, -52032]
19370e2032k2041f348j87589j33038D9045j7558h5603K1568l3681C2888a06667
19358A88588a38884l9890Q5007j5738o1757B05955c8468o4436C34231a26012D5741
19346d34268A62777c06595B2839Q2401g1801l95874a79273A29150c06719A24235
19335b1677j85438g7980G7812h014l02245C67318B6709h3015M0605A48779b24675
19323f656n02286K19623B24684b9227k15722e9288l21962b7881j00407p6744A07122
19311b5692j75750a00264j90263h8738j33279a02134o1992L3543A15128K17641
19301C32769j57653b25839c1305j77723C4298J05506J5949a91395E3939b34894
19290I171h9217L2293j55027Q3501n744M4762L1926R921B36369p4820O7950d3975
$$ y = [-52032, -74073, -6348, -193937, -326975, 49045, 31487, -85603, -64035, -97716, 32888, -106667, 188588, -138884, -178774, -93767, -109505, -171262, 205955, -38468, -102904, 334231, -126012, 45741, -434268, 162777, -306595, 22839, 105240, -71801, -467675, -179273, 129150, -306719, 124235, -21677, -207115, -77980, 77812, -8014, -310259, 367318, 26709, -83015, -42410, 148779, -224675, -6656, -508942, -289319, 224684, -29227, -244949, -59288, -381250, -27881, -128288, -205032, 107122, -25692, -201442, -100264, -290527, -88738, -222017, -102134, -164126, -130583, 115128, 332769, 175116, -225839, -31305, -209028, 34298, 139804, 155753, -191395, 53939, -234894, 9171, -89217, -56924, -211951, -128450, -134194, -89432, -57506, -47585, 236369, 161549, 229499, -43975]
19277A51908p3099h0181o5840j26638a27276j4032E4561o470b2828l77697A1373
19265c39192A77148a31832C2225h0057A06818o5A241a54225H6872a93222j92747
19254c85969o9979D5597a58605M9514j11052D119a68508O6799B20950h9215I0260
19242A5295g2916p5829C74a57353n6845d6865j2871D08355E2716J1652l541J70742
19230B31569a19523r5123b5168A1838a14739F9914Q4404Q6463A14981e326l08424
19219c13750N8682A82009g1344H2194J74746j7320c8250p1916j76820A63958J57959
19208C21917A15151c10271J53968k2479g5270m1308l50719d2487j91194j7647
19198b51328a05826c7039B9660Q7432g7637j61068N6757F9687K78531C7289J22632
$$ y = [151908, 78809, -80181, -146021, -272659, -127276, -141308, 54561, 48091, -22828, -400525, 11373, -339192, 177148, -131832, 32225, -80057, 106818, 106753, 1241, -154225, 86872, -193222, -385969, -455948, 45597, -158605, -109091, -220143, 4119, -168508, -101709, 220950, -89215, 90260, 15295, -72916, -148745, 374, -157353, -214198, -46865, -59736, 408355, 52716, 64368, 60827, 231569, -119523, -214646, -25168, 11838, -114739, 69914, 154318, 240781, 114981, -5326, -313750, -255068, 182009, -71344, 82194, 256940, 239620, -38250, -110166, -286986, 163958, 321917, 115151, -310271, -156303, -178782, -75270, -116578, -467297, -42487, -233681, -251328, -105826, -37039, 29660, 117092, -77637, -238705, -181948, 69687, 348218, 37289, 159921]
19187A59921c06331A79936a26770J7183j69347i5893a1670E716a43931K4423o720
19176a26228j17267j00865J51762c1278p3898L3641j01633A86269a33716e1704
19165a59904f3779O880b5404A58503a82032j48943B37420C9491L05467d7813j41866
19154a89679n6731G1997a7872n9486j4949A76744m1437E5981J93865a71308C91000
19142a37028C1686J84176B1304K62174F0498b14521A64414e77700B25268a47550
19131B1643h6952A96337m7238i988B89243a27163B3026c6272r4634N6249G6032
19119b77543D9862h291j11691j43588B17715h7633B0981J1686b96428G3024d22167
19107b33522I6269b13812m4689A89858f2931H1846K4031c17925L3611A97159b8433
$$ y = [159921, -306331, 179936, -126770, -109587, -278934, -95893, -11670, 5716, -143931, -119508, -126228, -243495, -344360, -192598, -31278, -105176, -71535, -173168, 186269, -133716, -51704, -159904, -63779, -56899, -25404, 158503, -182032, -330975, 237420, 39491, 344958, -47813, -189679, -246410, 71997, -17872, -77358, -92307, 176744, 135307, 55981, 249846, -171308, 391000, -137028, 31686, 215862, 21304, 283478, 60498, -214521, 164414, -577700, 225268, -147550, 21643, -86952, 196337, 149099, -9988, 289243, -127163, 23026, -36272, -130906, -74657, 76032, -277543, 49862, -8291, -119982, -263570, 217715, -87633, 20981, 32667, -296428, 73024, -422167, -233522, 96269, -213812, -258501, 189858, -62931, 81846, 105877, -317925, -284314, 197159, -28433]
19095a60246A75498b6919m0599l21168h1951D04583A28462E2892d32760P2154
19085c60606B85708b02634A09124b36789O4606H5403c8270F7186a27825G9311
19074i9953q4500j820g143j51282A6378J43264a00493G9387a78338C38746j65855
19063A72891a2671B7272a58739j09247B09902b3167k0809q6955c2651A08470a0510
19051B72990I3617d667m1421C07336f2883j43774l6569g2709k51004C01811b26985
19039b17420g8976D7381i654n4499m7286E4996b17404C1722j4192N4045J95053
19028B66628j06387B4695K54543o8127a1295r2945A25127E669c9471k6131A96928
19016F7606c5221j98415l7312g7719j3520j51391B69071a42235F7582b04120b3061
$$ y = [-160246, 175498, -26919, -67518, -388686, -81951, 404583, 128462, 52892, -432760, -360606, 285708, -202634, 109124, -236789, -172183, 85403, -38270, 67186, -127825, 79311, -99953, -184453, -186273, -7143, -158425, 16378, 159642, -100493, 79387, -178338, 338746, 172891, -12671, 27272, -158739, -267986, 209902, -23167, -43976, -130931, -32651, 108470, -10510, 272990, 93617, -4667, -46088, 307336, -62883, -206657, -243226, -72709, -323713, 301811, -226985, -217420, -78976, 47381, -9654, -64153, -111439, 54996, -217404, 31722, 17530, 71575, 266628, 160241, 24695, 279238, 211111, -11295, -104240, 125127, 5669, -39471, -65602, 196928, 67606, -35221, -233636, -270948, -77719, -91239, -242630, 269071, -142235, 67582, -204120, -23061]
19004D3547a12355A90239f6464n3646j79056e9651k20974C0384c18295A32193
18993B19952n7353G84J97634a56969D9847M9895Q4661b13347N5270M8916k40769
18982c49930f6557D0873c26194J15453h533l9640k19930d5193l08816g0816B09205
18970b74338q5576a34831A12734b04145B36324f582A29089L8933D0532M5150c03058
18958C0554R0376C4096J012E510K83141f8635j57075J7698M687e2692l0811E1237
18945b56642A70255b37347A38559c0873A5284E929f9949A42414o0273a3847m68311
18934d82158i6698j32220C9290K0646e9604A85386h7695l2475P099B13552i6926
18922b98827b2466D5922b56869B00357a2358A50506b28746j00136A699Q8686L1669
$$ y = [43547, -112355, 190239, -66464, -120110, -299166, -59651, -280625, 30384, -318295, 132193, 219952, 162599, 784, 198418, -156969, 49847, 99742, 184403, -213347, -158077, -109161, -349930, -66557, 40873, -326194, -210741, -8533, -48173, -268103, -45193, -354009, -70816, 209205, -274338, -359914, -134831, 112734, -204145, 236324, -6582, 129089, 168022, 40532, 85682, -303058, 30554, 120930, 34096, 35108, 5510, 288651, -68635, -225710, -208012, -203325, -52692, -83503, 51237, -256642, 170255, -237347, 138559, -30873, 15284, 5929, -69949, 142414, 82141, -13847, -482158, -96698, -228918, 39290, 59936, -59604, 185386, -87695, -120170, -113071, 213552, -96926, -298827, -22466, 45922, -256869, 200357, -12358, 150506, -228746, -328882, 1699, 90385, 122054]
18911A22054d3701m8073A43209a78216N9950p5483b2889E8902d0733I4237a43564
18899C90514A04378M027g3693j79156D7361A9706g3561B08754D4317O850a05075
18887a37857A0590a35985A76091B0194f0000j23050j53577h2879O523g521A23468
18875A16004g1340A32328c128A53604A7484c7818m22627J21976K1788R0328b8620
18863B40465f5206A64266c2859A0860a03866j70961C8687L30314e4480E279R4213
18852I9492D4440O8708a33126A61158K14700A4973J69304D194f0722k4157I006
18840b59668A80540b70409B1793a56709l2517F8467C1346a34167A96110a08022
18829d3916A08893a47681a7964A79155b21057I2155K02618E8024b03086B39427
$$ y = [122054, -43701, -91774, 143209, -178216, -118266, -193749, -22889, 58902, -40733, 94237, -143564, 390514, 104378, 108405, -73693, -252849, 47361, 19706, -73561, 208754, 44317, 51167, -105075, -137857, 10590, -135985, 176091, 20194, -60000, -183050, -336627, -82879, -76356, -7521, 123468, 116004, -71340, 132328, -3128, 153604, 17484, -37818, -460445, -338469, -316681, -226353, -28620, 240465, -65206, 164266, -32859, 10860, -103866, -274827, 38687, 369001, -54480, 5279, 99492, 44440, 113148, -133126, 161158, 375858, 14973, 184277, 4194, -60722, -84879, 9006, -259668, 180540, -270409, 21793, -156709, -189226, 68467, 31346, -134167, 196110, -108022, -43916, 108893, -147681, -17964, 179155, -221057, 92155, 294773, 58024, -203086, 239427]
18818B64818b60062J22892B27538c21000i588q8495A3368a4739A33667M0343H5544
18806B20613d4715D6947J19060J20442O6876A29301d2272C7422Q825b11892H3084
18794b40590g6400g718A38949J28125J5851a35564d8363p4488B8556M75210a56843
18782a92438b6846k23260m5076I6438J08337g516j83875e4733D7846a32394b9176
18770i4165j16748b9966j55039D172b61126p299e8396C1970a95660j17330A04951
18758a40316H0503b23952g4811D64687c71784A78583F3866J8329J87288F7520
18747C109J72871C8211a5780k2104r7168n3043C34136A19656m2994a8844j01793
18736a20637K3647l0591j10867d0505A80097F0225e39345b3389j19450I4348K753
$$ y = [264818, -260062, -137170, 227538, -321000, -9588, -98083, 13368, -14739, 133667, 174010, 85544, 220613, -44715, 46947, 166007, 286449, 353325, 129301, -42272, 37422, 46247, -211892, 83084, -240590, -76400, -7718, 138949, 267074, 282925, -135564, -48363, -122851, 28556, 503766, -156843, -192438, -26846, -250106, -295182, 96438, 204775, -7516, -191391, -54733, 47846, -132394, -29176, -94165, -210913, -29966, -185005, 4172, -261126, -268425, -58396, 31970, -195660, -312990, 104951, -140316, 80503, -223952, -74811, 464687, -371784, 178583, 63866, 82195, 269483, 67520, 3109, 175980, 38211, -15780, -37884, -135052, -188095, 334136, 119656, 76662, -18844, -120637, -96990, -127581, -238448, -40505, 180097, 60225, -539345, -23389, -142839, 94348, 97101]
18725I7101B4528K27995g1133k69237b0901A47116b32468j61703B20980b28839
18714h8205d0246A7699c10193F7649a8473I0552a82628A24522J23721c33481j2666
18703c46147a39949O8887l5587M2170G702J11416b87733C760a72138P6415m7740
18692a43463k3761M0021A60581h1773j8925k09182M5096D9840K3185K86064I2964
18680c6827A37452f8823j67370I8964d53062a44210l0497N3462A6737b19829L2712
18669a87117e5645A60874k0905b57699a28778o0694C98318g0510j59409C88219
18658c8890B9379g3706q781A53861a90199B23777I8948h4365b2163A21827J402
18647A23229C321c19699a47718B40271A02545b7683E14311A39278e3876I9884
$$ y = [97101, 24528, 252523, -71133, -340370, -20901, 147116, -232468, -394171, 220980, -228839, -88205, -40246, 17699, -310193, 67649, -18473, 90552, -182628, 124522, 248243, -333481, -346147, -139949, -71062, -106649, -64479, 7702, 119118, -287733, 3760, -172138, -95723, -143463, -167224, -127203, 160581, -81773, -100698, -309880, -264784, 49840, 73025, 359089, 92964, -36827, 137452, -68823, -236193, 98964, -453062, -144210, -174707, -121245, 16737, -219829, -187117, -55645, 160874, 139969, -257699, -128778, -189472, 398318, -70510, -229919, 388219, -38890, 29379, -73706, -82487, 153861, -190199, 223777, 98948, -84365, -22163, 121827, 123229, 3321, -319699, -147718, 240271, 102545, -27683, 514311, 139278, -53876, 99884]
18636c3977B18266b29910j46515a36283H3384J76573b79780c4239G961c7058E6701
18624A60357A781L2778M9051i1382j28685J1749Q876a6531A66584b25377J08934
18613a16443M8722j45994f2647K145a804k20815Q3167C3201e9702C51209G7722
18601a15283e828j40473e9682l36622e9246A26156D9028e9336b6128m4027m2018
18590a12173e4524H5868b31529C2600e4527A69655L1961a35526A88253o0448i3866
18578G761J8686a67762a6843j38624g821k56168E8262a02522C2237J73210f0547
18566A74223K9180i0067p8784B90281A073b13023B192e5490C2004Q5796b87581
18554d68615d3093B05479a20269r7078j74179C67396a24548m9974a1373p9336
$$ y = [-33977, 218266, -229910, -376425, -136283, 83384, 259957, -279780, -34239, 7961, -37058, 56701, 160357, 1781, 34559, 83610, -91382, -220067, -208318, -199442, -16531, 166584, -225377, -116443, -67721, -213715, -62647, -60502, -1804, -222619, -139452, 33201, -59702, 351209, 77722, -115283, -5828, -146301, -59682, -396304, -59246, 126156, 49028, -59336, -26128, -70155, -112173, -54524, 85868, -231529, 32600, -54527, 169655, 201616, -135526, 188253, 127805, -93866, 7761, 26447, -167762, -16843, -155467, -7821, -263989, 58262, -102522, 32237, 205447, -60547, 174223, 203403, -90067, -168851, 290281, 1073, -213023, 2192, -55490, 32004, 117800, -287581, -468615, -43093, 205479, -120269, -217347, -391526, 367396, -124548, -174522, -11373, -90709]
18544i0709A58834h2681L4548o9853i97A7661b29240e6456J800A78602B8495P2822
18532A01317M6569c05073i5740n9632B4738g788j89513Q7394C6176J36735P8723
18521B51634E9747k4847e7898C26085I0656b96261h0668m8713f4272a1514j33747
18510a45261j03863K9458B13527A6275a30341o9276F0281h5009D35645D1852Q1206
18499A23058k9454a9073j15004A6880a24874n3307d3528l20084D9900B0328d5412
18487a70266e5109A59543b57038k52626J96505c2929j87890Q7513i846I4321k3128
18476G1193e5578m5579r2072b2234j78684A47178l8147a6819j11335A45886m6663
18465I9223l8616d71955a97723c0447A1893b389j5426D5876J65319c36784k42622
$$ y = [-90709, 158834, -82681, -48133, -117986, -997, 17661, -229240, -56456, -54656, 178602, 28495, 101317, 147886, -305073, -95740, -155372, 24738, -7788, -197301, -109907, 36176, 172911, 251634, 59747, 34900, -57898, 326085, 90656, -296261, -80668, -129381, -64272, -11514, -145261, -249124, -219666, 213527, 16275, -130341, -199617, 60281, -85009, 435645, 41852, 123058, 93604, -19073, -134077, 16880, -124874, -178181, -43528, -363612, 49900, 20328, -45412, -170266, -55109, 159543, -257038, -509664, -313159, -32929, -220819, -133306, -9846, 94321, 71193, -55578, -101157, -193229, -22234, -200918, 147178, 109031, -16819, -128154, 145886, 99223, 60607, -471955, -197723, -30447, 11893, -2389, -17815, 45876, 211195, -336784, -579406]
18454e79406a72067b8183l57956a1811j46430A90696q769J70565G0989J57007
18444B27996a0685B77600i0569C15157b40987B6649f3873J6732O973B35083a12077
18432A19162Q0659f8057j99671A6205A174d635j12637m3292k17032G5185e14A8542
18419a95410j49166a9029k78537a35340e196l64598i6261K0362A01524d3609j01421
18408a45030B97955A8589a4245j83618I6512e597A25779j0862h51j08041k77032
18397c85924A90995l2320A5878J48412P2775k4651p7585j5708a59304k1592G2366
18385h0122E4740b6025H1786b72387j06495a11526d4400j97250A29408g0221B2861
18373D5185J34756A9922P5722b70762G6188i3870A4499O4844A3442a03264l0346
$$ y = [-579406, -172067, -28183, -386139, -11811, -158241, 190696, 181927, 352492, 70989, 227996, -10685, 277600, -90569, 315157, -240987, 26649, -63873, -47141, -40168, 235083, -112077, 119162, 199821, -68057, -267728, 16205, 1174, -4635, -117272, -160564, -377596, 75185, -514, 18542, -195410, -344576, -19029, -297566, -135340, -5196, -369794, -96261, -75899, 101524, -43609, -145030, 297955, 18589, -14245, -197863, 96512, -5597, 125779, 114917, -851, -108892, -385924, 190995, 158675, 15878, 164290, 237065, 212414, 134829, 119121, -159304, -180896, 72366, -80122, 54740, -26025, 81786, -272387, -378882, -111526, -44400, -241650, 129408, -70221, 22861, 45185, 179941, 19922, 95644, -270762, 76188, -93870, 14499, 79343, 13442, -103264, -133610]
18362a33610A07562b56800a05551j23766B9175K388a14436k41695a25391C961
18351b61754N0388A21571b32n0450R205q6272A62891o3250A3517c3993q2901l9440
18339a56334a6804A45390a16831H1595a65689E3974r200d4820k64899a29374m785
18328a34159k01243j9042a74985D5911A1850a96289e3089j92101q9571A20125
18317F1834a87336C2727f6518J1121j79642g1264A73658o4988i1933A17161j0575
18306A06586K7392a68575C89610A37958a11398A07131n086b41262e7064B54199
18295F1343b26111j7728h7422A49951i2822I6851c19497A86128a62660A90595
18284i3185o7224j47819E970N6865J36157l1625b56803A62931D7390a38119k52386
$$ y = [-133610, 107562, -256800, -105551, -229317, 29175, 31563, -114436, -356131, -125391, 3961, -261754, -211366, 121571, -232, -50682, -41477, -127749, 162891, 99641, 13517, -33993, -116894, -156334, -16804, 145390, -116831, 81595, -165689, 53974, 44774, -44820, -309719, -129374, -134159, -335402, -354444, -174985, 45911, 11850, -196289, -53089, -245190, -334761, 120125, 61834, -187336, 32727, -66518, -55397, -235039, -71264, 173658, 108670, -91933, 117161, 106586, 133978, -168575, 389610, 137958, -111398, 107131, 102045, -241262, -57064, 254199, 61343, -226111, -243839, -87422, 149951, -92822, 96851, -319497, 186128, -162660, 190595, -93185, -160409, -308228, 5970, 62835, 198992, 167367, -256803, 162931, 47390, -138119, -390505]
18273c90505C7771a81183A08509K05515C5501a16398d4849p8100c9805B35972
18262c8471n230j06028a0126B90942a59332b3274A18102b27802P8581b5780j46904
18251a72684e1684n4866F407a11131J5216r9712A36673f2685A73837n9963k08
18240A13666M4383d48853h303m6156k5898A78030c31678A68144b61851B27953
18229C18878a52852n5311A32781g8081m7191p257q0834R6649m307A11229i8663
18217e4315j68566B63527q9354b63042D7384h655r768k85633e0589E4776B2970
18205C62830F1030a88018H9500c58920J7544R3278b6519A42378g822A30634c01420
18193f4057C1341b36572g0102K7361A66194k2318E1141a71909H2751c1517H8086
$$ y = [-390505, 37771, -181183, 108509, 314024, 35501, -116398, -44849, -122949, -39805, 235972, -38471, -43701, -149729, -10126, 290942, -159332, -23274, 118102, -227802, -149221, -25780, -172684, -51684, -106550, 6407, -111131, -95915, -195627, 136673, -62685, 173837, 113874, 113666, 158049, -448853, -8303, -54459, -80357, 178030, -331678, 168144, -261851, 227953, 318878, -152852, -208163, 132781, -78081, -125272, -132529, -213363, -116714, -121021, 111229, -98663, -54315, -222881, 263527, 174173, -263042, 47384, -8655, -18423, -304056, -50589, 54776, 22970, 362830, 61030, -188018, 89500, -358920, -341376, -248098, -26519, 142378, -7822, 130634, -301420, -64057, 31341, -236572, -70102, -42741, 166194, 143876, 51141, -171909, 82751, -31517, 88086]
18181H3303a23190d915l78986a44899I7781B2371J35468d1340j35603A25516Q1759
18170B07275b29663R4762C26352i6395J3533J1515C4162J11303g6087j22302c1479
18158d1145k4485j2383C33690e61479c7337j94571A44569e6204B68375c6983j88748
18147b25731J0443A04117f8048m4127n8890G6706L8081c83086a72569j87800A6327
18135h8333k14074B26243C5605L5694A2876a49079b3719B29032b36078J04718
18125a31360A30977Q8239f4737o5661B4139e4936k44290E2849b60570i4150Q312
18114h5838B02104b6602I5189i5090k49977H5526h1978D879b06776A71294h2434
18102a30917D5578a50277r1271R0447E235c61973c4277j68794N8832j5081k23861
$$ y = [83303, -123190, -4915, -383901, -144899, 97781, 22371, 157839, -41340, -176943, 125516, 207275, -229663, -134901, 326352, -96395, -82862, -71347, 34162, 145465, -76087, -198389, -31479, -41145, -65630, -78013, 333690, -561479, -37337, -231908, 144569, -56204, 268375, -36983, -225731, -215288, 104117, -68048, -112175, -171065, 76706, 114787, -383086, -172569, -360369, 16327, -88333, -302407, 226243, 35605, 71299, 12876, -149079, -23719, 229032, -236078, -131360, 130977, 219216, -64737, -130398, 24139, -54936, -299226, 52849, -260570, -94150, -85838, 202104, -26602, 95189, -95090, -345067, 85526, -81978, 4879, -206776, 171294, -82434, -130917, 45578, -150277, -241548, -151101, 5235, -361973, -34277, -203071, -144239, -159320, -383181]
18091c83181d6051A66438A4625c857k01457C9993e8610o7875l0465A14715b79381
18079g1498D1902J10417b8310j04176l0129A23873m5439k9147c73975a31181B70930
18067A31450i5524j96569a37681p7927d7546o5221A44221Q4915a53151A33376
18056a15135B39277A02642a12755j00788d1782D35784j18210E3301a48450k87286
18046d35736J42022A7333a8297l9267G3927d9738H1921a92752B48223d10220I0600
18034H6123l937P5765B026J6585a42390L5229c9787k1699n5047H26K74624C3320
18021h294l9097F2477a0157F0016N4794a08226N3685A88314a67772B50379I617
18009D0120L47432a23808K9579A47615a01155B19324I9387a90305k5261M0709
$$ y = [-383181, -46051, 166438, 14625, -3857, -205314, 39993, -58610, -126485, -156950, 114715, -279381, -71498, 41902, 152319, -28310, -132486, -162615, 123873, 78434, 49287, -373975, -131181, 270930, 131450, -95524, -292093, -137681, -215608, -47546, -112767, 144221, 229136, -153151, 133376, -115135, 239277, 102642, -112755, -213543, -41782, 435784, 317574, 53301, -148450, -435736, -293714, 17333, -18297, -57564, 73927, -49738, 81921, -192752, 248223, -410220, 90600, 86123, 82186, 157951, 2026, 18611, -142390, -107161, -39787, -61486, -116533, 826, 275450, 33320, -8294, -47391, 62477, -10157, 60016, 114810, -108226, -54541, 188314, -167772, 250379, 9617, 40120, 387552, -123808, -94229, 147615, -101155, 219324, 99387, -190305, -215566, -174857]
17999a74857b7904B5952M6356a59423C22084C6707b88841A06727J69583a10776
17988d5627C91558j89066a07806A26256c16945a08183p299A14875L3472N9871
17978B08218a31148N0402j33525C69187A21562g968j98241L7702d5458l1071A47573
17966B9258A4121K89954g6550B02281M1031C2520E697O5233Q3860h5381B24427
17954A83094l1286a87350J966g2300A95714r0518L2156A8826a51951n6487G1288
17942E3179R8406j3304a76605c3984A74386d4815B3071J31668E0540c63863b579
17930D2452b39127B21604I8214c3840j2061l37239H8259R6690g9700k22543a39339
17918c30323a025A21649M8632c42437B20676A3744a75496b7072m3898D910b34595
$$ y = [-174857, -27904, 25952, 72308, -159423, 322084, 36707, -288841, 106727, 276310, -110776, -45627, 391558, 202492, -107806, 126256, -316945, -108183, -115482, 114875, 148347, 208218, -131148, -80746, -214271, 369187, 121562, -7968, -206209, -168507, -45458, -76529, 147573, 29258, 14121, 304075, -76550, 202281, 243312, 32520, 5697, 70930, 154790, -85381, 224427, 183094, 151808, -187350, -185384, -72300, 195714, 105196, 137352, 18826, -151951, -208438, 71288, 53179, 151585, 138281, -176605, -33984, 174386, -44815, 23071, 154739, 50540, -363863, -2579, 42452, -239127, 221604, 98214, -33840, -45901, -383140, 88259, 184949, -79700, -302243, -139339, -330323, -1025, 121649, 170281, -342437, 220676, 13744, -175496, -27072, -70970, 4910, -234595]
17906b8251D8288N4365a52891P2324B57223e43010C23539A55944b58307a27688
17895C16112a67570A16893l2871M8424L6983g9886f440j17310E2551g5964j59497
17884b35461A02689K34264G9680g455o4102A2878J82548F1888O6905a31005j34685
17873b65690B12139D9732b63378B45565a8029A00771C992K72978g144B73594a0643
17861i6324C7877Q627c7341A1885a32363e1057n9750k5878p0556f6704C24282
17849e6793A24801M3813e0557A27369b10083l3376A28197a37311B25117r9119
17839A25998b06795f5103A91601a7418k32433a8217l0103o2830N5073C8472K28786
17828B67258o5338q6631O4259b67985D3804g7020B82737o0729e9967k03626P0907
$$ y = [-28251, 48288, 102653, -152891, -80567, 257223, -543010, 323539, 155944, -258307, -127688, 316112, -167570, 116893, 84022, 132446, 169429, -79886, -6440, -123750, 52551, -75964, -235461, 102689, 336953, 79680, -7455, -71557, 12878, 195426, 61888, 128793, -131005, -265690, 212139, 49732, -263378, 245565, -18029, 100771, 3992, 276970, -7144, 273594, -10643, -96324, 37877, 46504, -37341, 11885, -132363, -51057, -110807, -136685, -207241, -66704, 324282, -56793, 124801, 168614, -50557, 127369, -210083, -243459, 128197, -137311, 225117, 125998, -206795, -65103, 191601, -17418, -249851, -18217, -48320, -111150, -56077, 38472, 267258, 201920, 115289, 179548, -267985, 43804, -77020, 282737, 222008, -59967, -263593, -192686]
17817a92686q0450F8031J38602F4093a2257A19093d9692A10139N224f1028A90955
17805E3349M7429Q223c08343J13007j46889a60822C359L50527h6903A07207a31737
17793c34674F8633A5824K27358c7685p013A20315e7835k54333F7393f2062A01312
17781A79729H5440J5971K66825a90270A9745c7210j27076K0642b6998I0386c82112
17769A65784n9298D5118a6651B74401H3936M3744a03964d2714j03100d076A36477
17757B06985a68694A6950c38814A32815b50771D13828H4857a22664B1981Q1906
17747A03887m9795o643K4754R3450i5842k03998A04155c32979M5889J17363M7646
17736a22081b7715B22364r5997d240A47806a96901M0065B55760J08993g8360k06315
$$ y = [-192686, -273136, 68031, 206633, 64093, -12257, 119093, -49692, 110139, 115363, -61028, 190955, 53349, 100778, 109001, -308343, -195336, -342225, -160822, 3359, 353886, -86903, 107207, -131737, -334674, 68633, 15824, 243182, -37685, -44698, 120315, -57835, -312168, 67393, -62062, 101312, 179729, 85440, 101411, 368236, -190270, 19745, -37210, -164286, -143644, -26998, 90386, -382112, 165784, 106486, 45118, -16651, 274401, 83936, 127680, -103964, -42714, -145814, -4076, 136477, 206985, -168694, 16950, -338814, 132815, -250771, 413828, 84857, -122664, 21981, 103887, 54092, 47449, 72203, 165653, -95842, -299840, 104155, -332979, -287090, -169727, -122081, -27715, 222364, 126367, -4240, 147806, -196901, -156836, 255760, 364753, -78360, -284675]
17725b84675B9566L51918d0435C03J03598a33109A58964J72437A05018k3804J62201
17714B43415C6312b08601N5360E5222A4276e0762F200L3361a54755P1558B33850
17702i0350b485j1237k29790A3736N0484J44701D3981H041N3630k9298b77205
17690B96387A3954Q2977a04929D3698e6981o0154j58175A49526n8614e7567A17001
17678B64200H4250J1103c67308B14789J296J0296G439J65554e6120A26949a00753
17666D5116J62005C4833e072o2713A16088E5820e3049H6784J14281a42619a4710
17654c34342C02111h788k10736I1513h3840A94232f736j80341p9947M9922Q5535
17643a31567A13811C5461b76493D8356B0805h8586n6934h697j35193b4226R561
$$ y = [-284675, 29566, 381484, -40435, 303, 103901, -133109, 158964, 331401, 105018, 81214, 243415, 36312, -208601, -153241, 55222, 14276, -50762, 6200, 39561, -154755, -83197, 233850, -90350, -2485, -13722, -243512, 13736, 64220, 208921, 43981, 8041, 61671, 32373, -277205, 296387, 13954, 96931, -104929, 43698, -56981, -117135, -275310, 149526, 90912, -57567, 117001, 264200, 84250, 95353, -367308, 214789, 216085, 226381, 7439, 172993, -56120, 126949, -100753, 45116, 207121, 34833, -5072, -67785, 116088, 55820, -53049, 86784, 201065, -142619, -14710, -334342, 302111, -8788, -219524, 91513, -83840, 194232, -6736, -187077, -267024, -217102, -131567, 113811, 35461, -276493, 48356, 20805, -88586, -145520, -8697, -143890, -24226, -14665]
17632a4665k59836A77255O0627d8880A42953J09564i7166B15028a24057l1140
17622a55197A92145a32395F5036A4515a71738I483c2079B2190K39231a44179c9537
17610c59420A29308m1347Q0234c9095A26436g1900l6651B90354b6402j64655H8304
17598a46333B7479b00269A65191B41P102K27010a54390C1689M2854L508L17024
17587C95075b21289A44631f7852A06731J60051a44306e5674n0372j92777A97331
17576A21881i2382B73651a75327A71917G6211N3504a64288C7908Q3712h7026p9037
17565a66063D41475g1716A80689o5418B802f5981K1288A96844d2372n5591B02442
17553a67890j94956D8141N9677R133J71332J6474A13563f365B35058A8301b59225
$$ y = [-14665, -274501, 177255, 237882, -48880, 142953, 252517, -97166, 215028, -124057, -155197, 192145, -132395, 65036, 14515, -171738, 9483, -32079, 22190, 261421, -144179, -39537, -359420, 129308, 87961, 168195, -39095, 126436, -71900, -108551, 290354, -26402, -191057, 88304, -146333, 27479, -200269, 165191, 241, 7343, 234353, -154390, 31689, 74543, 78051, 395075, -221289, 144631, -67852, 106731, 266782, -144306, -55674, -106046, -298823, 197331, 121881, -92382, 273651, -175327, 171917, 76211, 129715, -164288, 37908, 121620, -87026, -166063, 441475, -71716, 180689, 115271, 2802, -65981, -44693, 196844, -42372, -97963, 202442, -167890, -362846, 48141, 107818, 116951, 288283, 304757, 113563, -6365, 235058, 18301, -259225]
17541B65889I9964h8341m241I8163J47823j00446a95000G2187R342k6255J25137
17530A80411J53416E4002J63662B8565c3435g070k30698C58165H459J33374b2973
17518A18549L74069f5021A49663J46345r8814b11204Q7378F6425b30521d2877
17507a12261E1895a51388L1387P585A48947E7002B5714a75494L2628f4558M020
17496f0538K6203H5369J89724E9896A6391K29004A01450K97325l0073A74752e9872
17484B91655J26405E6582b43394B01303q7649J99635A06823K13928b4C75229b4913
17472c4485m8919H4399J620K15895I0595a27453A36528K73552j42052n7578H1700
17460a321G42542H337J87345Q1594P7088j63454c2925j8826b2349E25365j50436
$$ y = [265889, 99964, -88341, -92582, 98163, 245986, 145540, -195000, 72187, 81529, 55274, 180411, 333827, 54002, 217664, 28565, -33435, -7070, -237768, 358165, 8459, 141833, -22973, 118549, 492618, -65021, 149663, 296008, 197194, -211204, -123826, 66425, -230521, -42877, -112261, 51895, -151388, -120001, -112416, 148947, 57002, 25714, -175494, -142866, -64558, -60538, -34335, 85369, 275093, 59896, 16391, 245395, 101450, 398775, 368702, 174752, -59872, 291655, 418060, 56582, -243394, 201303, 113654, 313289, 106823, 320751, -24, 375229, -24913, -34485, -83404, 84399, 86019, 301914, 90595, -127453, 136528, 410080, 268028, 210450, 81700, -1321, 742542, 8337, 195682, 277276, 354364, 190910, -32925, -51751, -22349, 525365, 374929]
17449C74929q331j00669K69530p8395j46690N8813K40856k93260O278A49424O0627
17438B10051K01954B5404C245e9789K8064C98776A49416J45790o6525j8291L1663
17427B42053j18919J74143A08198K30456K28817j27241B07975o9224J16721n928
17417B49544j20164J54794a08581A14257K16990Q7952N1334a41940C35503j56700
17407A78803J49065N827j60842O5031Q9620f1133I9983a58361g2879A37748L12045
17396D49793a91401D52926G3824K76204o7623J21950A12496b62409D2170a67429
17385c4045j658P86B06078J56263G2441c8962r121i585A76728a03308M4997C20690
17372f8639I3600L5703Q0771j7001N9296a05121m9063d005E21399m6208a1237
$$ y = [374929, 366598, 265929, 535459, 457064, 310374, 369187, 610043, 316783, 323061, 149424, 210051, 412005, 25404, 3245, -59789, -31725, 398776, 149416, 295206, 228681, 210390, 242053, 123134, 297277, 108198, 338654, 567471, 440230, 207975, 138751, 255472, 249544, 129380, 284174, -108581, 114257, 331247, 419199, 470533, -141940, 335503, 178803, 327868, 333695, 172853, 237884, 327504, -61133, 99983, -158361, -72879, 137748, 449793, -191401, 452926, 73824, 350028, 282405, 404355, 112496, -262409, 42170, -167429, -34045, -35703, -34917, 206078, 362341, 72441, -38962, -48083, -9585, 176728, -103308, -58311, 320690, -68639, 93600, 129303, 210074, 193073, 252369, -105121, -154184, -4005, 521399, 475191, -11237]
17360A82382a1758A28363e1014f053A85747i2381A5090c41716B89674k8371J4085
17349B75388J11307l9551a15256A01647D2100K04021K33844H0788K94676p0968
17339C04496a5102A21663h2703B31875r4146N0290G1719L4888J41239n9948q2438
17328A05460J56596J01581a04963D04983h0663A88495o9279g1328C36983a67527
17317b67154C36531a9540A00901K17775A15133d3886C64771D8965R3117B0554
17306F0015K55043r1654g7363A32914m8094K77632j16882D6663a7039C91818j01179
17295B90639c0064j8068C7646J3916P7501k3418m4712J76269e0472C32228K71608
17284F03836A01853L00536A10346K71421j55064N0724p0034L15900b79888A75435
$$ y = [182382, -11758, 128363, -51014, -6053, 185747, -92381, 15090, -341716, 289674, 261303, 275388, 386695, 347144, -115256, 101647, 42100, 246121, 479965, 80788, 375464, 304496, -15102, 121663, -82703, 231875, 137729, 188019, 71719, 106607, 247846, 187898, 105460, 262056, 363637, -104963, 404983, -80663, 188495, 119216, -71328, 336983, -167527, -267154, 336531, -19540, 100901, 318676, 115133, -43886, 364771, 48965, 142082, 20554, 60015, 315058, 223404, -77363, 132914, 84820, 362452, 245570, 46663, -17039, 391818, 290639, -30064, -48132, 37646, 51562, 129063, 105645, 60933, 237202, -50472, 332228, 603836, 101853, 402389, 110346, 381767, 226703, 277427, 207393, 523293, -279888, 175435]
17273A00896K36786o3969G7406K23887H9205J46801J56061m4167n0938j1676o6589
17262B18697k869P6402j36158J87740H5900k066J79160H7757K48166k2226j43659
17251A70038K46849K18186H5074J45990K9660h1462A83863K42243j00197p2672
17241B53237J91077a3957A18749m4889K54859m6069d0631C37761j42961K56293
17231D51093k8615j22174F2818K41106D8621J75761J08281d7918B01681J55171
17221C56852L3578F8433J31394a58524F0414N5828J61915n4012J66385M7686A78321
17209D77368A05665L44054k6257G3595K75173j28812q6040J32412F0433c5163
17198A34925l8955L47466B00661K46646A30044p562a20802b2867A49709J38023
$$ y = [100896, 337682, 273713, 77406, 301293, 89205, 236006, 392067, 347900, 296962, 285286, 218697, 215828, 292230, 156072, 343812, 85900, 83834, 262994, 87757, 335923, 313697, 170038, 416887, 635073, 85074, 231064, 260724, -81462, 183863, 426106, 325909, 253237, 444314, -13957, 118749, 73860, 328719, 282650, -40631, 337761, 194800, 451093, 422478, 300304, 62818, 303924, 48621, 224382, 332663, -47918, 201681, 356852, 390430, 68433, 199827, -158524, 60414, 116242, 278157, 224145, 390530, 438216, 178321, 477368, 105665, 449719, 423462, 73595, 348768, 219956, 133916, 266328, 60433, -35163, 134925, 95970, 443436, 200661, 447307, 130044, 122482, -120802, -22867, 149709, 287732]
17188B87732i7709B02454P472L78296N721B26630K05531j48278D9920L76397A31945
17176E35766j68387A76095L21004A44458L41544j58111H1505L26496k173b0547
17165C25296j00857J84388J2324j65374q3268J31519k7228L9866A18172K69928
17155C88100j51715K18660N6800B37199J61895K2688r047j48002J569J48937J91684
17144F06923B07336L09974c2238D43403B00248J19443K05838A1770N89304k14618
17134C86456P7100j49557j15762L23101j47856K63902k75517J37319j47060j44139
17124B07987K37098A81878K36481P9801j53190o2700L2423J57849B17551L21354
17114E38905k7035j32576J85694j71980j48881J31033p0026N3425J5551A06098
$$ y = [287732, -97709, 202454, 209926, 588222, 593943, 226630, 432161, 283883, 49920, 426317, 131945, 535766, 367379, 176095, 497099, 144458, 486002, 327891, 81505, 408001, 405828, -20547, 325296, 224439, 408827, 421151, 255777, 172509, 304028, 276800, 316666, 118172, 388100, 236385, 455045, 511845, 237199, 399094, 421782, 412735, 264733, 266302, 415239, 606923, 207336, 517310, -32238, 443403, 200248, 319691, 525529, 11770, 601074, 386456, 463556, 313999, 198237, 521338, 373482, 637384, 361867, 499186, 352126, 207987, 445085, 181878, 418359, 498160, 344970, 282270, 314693, 472542, 217551, 538905, 511870, 379294, 564988, 393008, 244127, 375160, 305134, 358559, 374110, 106098]
17103B74734K09486o2664A79687J96202J2162J25610j73629J54415Q000K91631
17093G94078j18726C29802L14935n5792j98226L72766A35034K95796Q4988J27
17083E15945k09155A48010M55715j84522P9068K1388P7576p5967R9757j56214
17073D64811o6055Q8086J85440B74489J90495j83272L07189J93858j17844k39763
17063D25152L24587p220l29924j02000K70510j04044J9155O3594J51466k03714
17053E07562P6737B72573L02922J17780J159k77193K05249B60289M37025j53533
17043E43781J22941B49015L04726L97100j30022k88317J4065L07335j84976j60794
17033E08132J05190J20912j59745K31282C48173M18741k96768J47964j80184J77792
$$ y = [274734, 484220, 421556, 179687, 375889, 388051, 513661, 340032, 494447, 502447, 794078, 675352, 329802, 644737, 588945, 390719, 763485, 135034, 430830, 515818, 515945, 306790, 148010, 603725, 419203, 498271, 519659, 597235, 521268, 621025, 464811, 398756, 486842, 672282, 274489, 464984, 281712, 588901, 782759, 664915, 425152, 749739, 742519, 412595, 310595, 581105, 477061, 496216, 559810, 711276, 507562, 584299, 272573, 575495, 693275, 694434, 417241, 622490, 260289, 697314, 543781, 666722, 249015, 553741, 950841, 820819, 532502, 546567, 853902, 668926, 508132, 613322, 734234, 574489, 805771, 348173, 766914, 470146, 618110, 437926, 615718]
17023F15718k4704J96228j60396J29389k33917K31850O7753l65624K78197j39277
17013E95217J35185j06564l329L03020j63882k63013L57488K6264j74164o2158
17003F44064J41596l5289Q4628M39429D59705L07076k52886K4067L33589l37633
16993E33918M61083n0255l45437K00456j22269j08811J03399O03330F34306N0287
16983F84593K82076J75912m93794M28958l66649j6144M38982l11761J75722q6958
16973I10937J5065K56636m3981m95444L89369J91429l06582J71009l47131K22680
16963I63987L51162k57565k2975Q8630K1690k29350J45917L81501o63905J6024
16953G95116R116P87264n71854L40258j35173k10791j48243M55122o690n4862
$$ y = [615718, 591014, 787242, 626846, 756235, 522318, 754168, 821921, 456297, 734494, 595217, 730402, 623838, 620509, 923529, 759647, 496634, 854122, 880386, 706222, 644064, 785660, 750371, 834999, 1274428, 459705, 766781, 513895, 537962, 871551, 533918, 995001, 944746, 599309, 799765, 677496, 568685, 672084, 1275414, 634306, 684593, 966669, 1142581, 648787, 1077745, 711096, 694952, 1133934, 822173, 997895, 910937, 926002, 1182638, 1138657, 643213, 1032582, 1224011, 917429, 1088438, 741307, 963987, 1315149, 1057584, 1034609, 1123239, 1144929, 915579, 1061496, 1442997, 779092, 795116, 804232, 1591496, 1019642, 1359900, 1224727, 1013936, 865693, 1320815, 1314125, 1259263]
16943A259263O7571M8556q4518m49786K22425K1608M49815o7908o7735R6054j96888
16932A298457j6436k23627P5681K57386K02268m64561M44544j23091J63472j94356
16922A419737j41383K38528r9959j66482N22545o8647l33969M94741l79462J2532
16912A498181J23453K91347q9897k36848J79470J25105k01612J03682N1866r3989
16902A750758j3370k7276K48014k01717j8962m7766J44850J44156m93996P67429
16892B252120m94660L64319j30672j16030L43993J18782m08026N81599k80312
16883B231113J61252m36535M73605l68385M13946J66713l49226K73017k2295M2949
16873B586154j20868j14152L73443o6915L26258k27830k15967L34953L2894r69
$$ y = [1259263, 1326834, 1375390, 1290872, 841086, 1063511, 1085119, 1534934, 1467026, 1399291, 1495345, 1298457, 1282021, 1058394, 1134075, 1391461, 1593729, 1129168, 1573712, 1450621, 1614093, 1419737, 1278354, 1516882, 1416923, 1250441, 1772986, 1704339, 1370370, 1865111, 1485649, 1498181, 1621634, 1912981, 1823084, 1586236, 1765706, 1890811, 1689199, 1792881, 1844747, 1750758, 1737388, 1710112, 1958126, 1756409, 1737447, 1689681, 1834531, 1978687, 1484691, 2252120, 1757460, 2121779, 1991107, 1875077, 2219070, 2337852, 1929826, 2511425, 2231113, 2392365, 1955830, 2429435, 2061050, 2474996, 2641709, 2292483, 2565500, 2543205, 2586154, 2465286, 2351134, 2724577, 2657662, 2983920, 2756090, 2540123, 2875076, 2907970, 2907001]
16863B907001k30673L39772j94822K15017K33888k08793j6646O5505J51946P4296
16853C336491j00104J51391k9585J99567k62390Q472q3684K81763J48514K2935
16843C673370J46924J43714j97101K72301L90943m54000K14351M2742o1698o3463
16833D108083K25710K52538K29016m03208L79681K65051J99131k11491j93853
16824D850658K81802K47949K14969j77315m5906J64740Q6338K85383J27989q83
16814F035724N11218p4101K36553L15881R219o3600K18580k8951K84758L3578
16804G478859K67228o3699O11900K20919J04974J06869k3807O88069J4229k1828
16794I383713L37673K16770K02226L1886J035435j11181M20915L73882J64921
$$ y = [2907001, 2676328, 3016100, 2821278, 3036295, 3270183, 3061390, 3044744, 3110249, 3262195, 3336491, 3236387, 3387778, 3358193, 3557760, 3295370, 3303842, 3220158, 3501921, 3650435, 3673370, 3820294, 3964008, 3766907, 4039208, 4430151, 3976151, 4190502, 4233244, 4171546, 4108083, 4333793, 4586331, 4815347, 4412139, 4791820, 5056871, 5256002, 5044511, 4850658, 5132460, 5380409, 5595378, 5418063, 5372157, 5536897, 5623235, 5908618, 6036607, 6035724, 6546942, 6472841, 6709394, 7025275, 7034494, 6970894, 7189474, 7160523, 7445281, 7478859, 7746087, 7682388, 8294288, 8515207, 8620181, 8727050, 8703243, 9391312, 9405541, 9383713, 9721386, 9938156, 10140382, 10172268, 11207703, 11096522, 11517437, 11891319, 12056240]
16785A2056240L33745K58948M76704M62103L97901K39590M53866L53672M47630
16776A5480399R80377j41347P96902O85466O66326O29856O40409O07862N30290
16767B0876540R87218R41052P66484J043594P57839R89169Q54454J275911J314095
16758B9806356J344093Q49771J653297J203117J483181J893363J775155J464731
16750D1473064K315128K560118J990199K482298K499318K782656K933791L307500
16742F2344072L249577M251516L604801M377117M363561M855125M896932N550935
16734I7493636N749525O118019O256848O280227P398008O917365P186434P275230
16726A50675292P013051P037759O328349N837440N425525M562319L511817K152238
$$ y = [12056240, 12389985, 12648933, 13125637, 13587740, 13985641, 14225231, 14679097, 15032769, 15480399, 16460776, 16319429, 17116331, 17801797, 18468123, 19097979, 19738388, 20346250, 20876540, 21863758, 22804810, 23571294, 24614888, 25372727, 26361896, 27216350, 28492261, 29806356, 31150449, 32000220, 33653517, 34856634, 36339815, 38233178, 40008333, 41473064, 43788192, 46348310, 48338509, 50820807, 53320125, 56102781, 59036572, 62344072, 65593649, 69845165, 73449966, 77827083, 82190644, 87045769, 91942701, 97493636, 103243161, 109361180, 115618028, 121898255, 129296263, 136213628, 143400062, 150675292, 157688343, 164726102, 171054451, 176891891, 182317416, 186879735, 190391552, 192543790]
16718A92543790J153999J01468j385245k629467l420020m470603n765959n854354
16710A70273609o759101o984187p320937p398115p154605p624521o442235p195601
16702A13394307n924874o814321n594708n236389n192536m703635m603368m241387
16694G1083089l916966l402504l685699l380769k740840k974780k577995k555266
16686D5848270k291981k163169k034883j808527j396108j797328j498752j479740
16678C1377782j205639j308707j483882j154209n99374j146716j157861p76328
16670B2545066q36062q88419o18858j084907p32331o87522l91087m26853p85013
16661A6094014q2728p84519o34996k92223q70053l06131k02815m45744m37243
$$ y = [192543790, 193697789, 193799257, 192414012, 189784545, 186364525, 181893922, 176127963, 170273609, 163514508, 156530321, 149209384, 141811269, 134656664, 127032143, 120589908, 113394307, 107469433, 100655112, 95060404, 89824015, 84631479, 79927844, 75324476, 71083089, 67166123, 63763619, 60077920, 56697151, 53956311, 50981531, 48403536, 45848270, 43556289, 41393120, 39358237, 37549710, 36153602, 34356274, 32857522, 31377782, 30172143, 28863436, 27379554, 26225345, 25625971, 24479255, 23321394, 22545066, 21709004, 20820585, 20201727, 19116820, 18384489, 17696967, 17305880, 16879027, 16094014, 16011286, 15226767, 14591771, 14299548, 13429495, 13123364, 12920549, 12474805, 12037562]
16652A2037562l70675j31200l82730k23992k09242m33500l45053n06150j26299
16643I308721j10883p66124K13513j72492j93534k11719m06794j29245m9167k01185
16633G281091m5277l59972m84972K91372j51071N2068o4381o36297M09091m96498
16623E795154J46456p12745K65719J8075l61270M413j58646j13279J23893k64837
16613D742933k49106J4281J66864m09250k5374k2099L7674k64279j2976j68511
16603C810157J5145j51406P487j10674R2915P3850m84419M9632P1198k52085k6533
16592C095267J16030l58011J91766J67912l01258J15683j43563l3438j10176k06917
16582B533295O0934J48678j21218n4171l50937J20340J32951k9118j31339k69372
$$ y = [12037562, 11666887, 11535687, 11152957, 10928965, 10719723, 10286223, 9941170, 9435020, 9308721, 9197838, 8431714, 8645227, 8472735, 8279201, 8067482, 7660688, 7531443, 7482276, 7281091, 7235814, 6875842, 6390870, 6682242, 6531171, 6583239, 6518858, 5882561, 6291652, 5795154, 5941610, 5228865, 5494584, 5512659, 5151389, 5155802, 4997156, 4883877, 5007770, 4742933, 4493827, 4508108, 4674972, 4265722, 4240348, 4218249, 4255923, 3991644, 3978668, 3810157, 3825302, 3673896, 3681383, 3570709, 3663624, 3737474, 3253055, 3302687, 3373885, 3121800, 3095267, 3211297, 2853286, 3045052, 3212964, 2911706, 3027389, 2883826, 2850388, 2740212, 2533295, 2594229, 2742907, 2621689, 2567518, 2216581, 2336921, 2469872, 2440754, 2309415, 2040043]
16572B040043L42961q1898n2004K02580k66197q8709o2142j00856p409K24004
16562B150373p7962N4783j56659j53867m4092j79990L03718K83452n26709j4367
16552A638680J35774l33530J0712J14955n3177L68809l10203R3573J40014l61411
16542A444196K4590J36573k95334J17395K37898j67443J7004j18707J95830k83444
16532A308558J66927N1389j42347J34761l15362J9152o8441j88216L49205j82692
16522A132934N5019k6166k29453K02085j92686J59356J09218J25898q9221l35632
16512I11352K1377K11428o9394k0105j72566L45667l59082K95015m6868j34934
16502I81890j56795J8404l10774N93276l47540J67735R4541l70383L0287L54210
$$ y = [2040043, 2383004, 2301106, 2249102, 2451682, 2185485, 2096776, 2034634, 1933778, 1926369, 2150373, 2072411, 2127194, 1970535, 1816668, 1772576, 1592586, 1896304, 2179756, 1653047, 1638680, 1774454, 1440924, 1451636, 1566591, 1513414, 1882223, 1572020, 1665593, 1805607, 1444196, 1468786, 1605359, 1310025, 1427420, 1665318, 1497875, 1514879, 1396172, 1592002, 1308558, 1475485, 1526874, 1384527, 1519288, 1203926, 1223078, 1154637, 966421, 1315626, 1132934, 1187953, 1161787, 932334, 1134419, 941733, 1101089, 1210307, 1336205, 1246984, 911352, 932729, 1144157, 1074763, 1054658, 882092, 1227759, 868677, 1163692, 1116824, 981890, 825095, 843499, 532725, 1126001, 778461, 946196, 1040737, 670354, 700641, 1054851]
16492A054851j76360L51684k80880m0709j37623K41236l58087J94599k40357L46408
16482I54762j29868j3638J92665k80718P4832q2295N4615k26602L62460p0760
16472H35453C65884K52882j41274M21646m35579l664K37207J47880l61599J08633
16462E92016k5696M58502m53118j02057K43761C40288K35508k10819K55507k43886
16452C76598J5065M46129D17275A14933M86590k35535K51398N1586k64571M81829
16442H86230C20913O7985L34335j40729j6304l5275o7303J75078j61417Q6655
16432E63938k42886L26971k09072O7015k41784J31571k2533J89241r5563K211
16422D69109o5340K10187B69069J77263k6405N4277o5290O6070j27023M8406A00299
$$ y = [1054851, 878491, 1230175, 949295, 908586, 770963, 1012199, 654112, 848711, 608354, 954762, 824894, 811256, 1003921, 723203, 798035, 715740, 770355, 543753, 906213, 835453, 365884, 618766, 477492, 899138, 463559, 459895, 697102, 844982, 483383, 592016, 566320, 1024822, 571704, 469647, 713408, 340288, 575796, 364977, 620484, 376598, 391663, 837792, 417275, 114933, 601523, 365988, 617386, 668972, 404401, 886230, 320913, 388898, 723233, 582504, 566200, 530925, 463622, 638700, 477283, 563938, 321052, 648023, 438951, 505966, 264182, 395753, 373220, 562461, 466898, 469109, 403769, 613956, 269069, 446332, 419927, 474204, 408914, 474984, 347961, 396367, 100299]
16410E88730j44883q9843I4641K06071j18437L21157j66271R3132A79428J04100
16400B83528K04611k0660m1228p4650J96312A69528M30965H5925L12053L5031
16390D33009I1887J46946K86134m7969K72351C62082A41251O6754M8588K6967
16380B83560p2906K78177k25539L58759k28475N4820j39210N7588n4205L9270
16370C51839k3213H8531R3061B4995K68274m4054J34162q9578L8251a64977B26003
16358A10796L20235B07818K2181K59459K417G3725J40409O4898A37018K00403
16348C37421r0292h6267A61884j7337L20562j68860G2406P5995k7162M52303D3417
16336A05154K95272A66757k3475L10138o4416A15584K51259G7230b51130c4125
$$ y = [588730, 443847, 354004, 94641, 300712, 182275, 503432, 337161, 430293, 179428, 283528, 488139, 467479, 426251, 351601, 547913, 169528, 600493, 85925, 397978, 433009, 91887, 238833, 524967, 476998, 749349, 362082, 141251, 208005, 256593, 283560, 210654, 488831, 263292, 622051, 393576, 448396, 309186, 366774, 312569, 351839, 328626, 88531, 181592, 24995, 293269, 249215, 383377, 293799, 332050, -164977, 226003, 110796, 431031, 207818, 229999, 489458, 491875, 73725, 214134, 279032, 137018, 337421, 247129, -86267, 161884, 144547, 465109, 296249, 72406, 148401, 121239, 573542, 43417, 105154, 400426, 166757, 143282, 453420, 389004, 115584, 366843, 77230, -251130, -34125]
16325B53227P9955r6413G9451a42692C3465O9359J06792b9992B23611m2760K51035
16314D31886k00600J51707A70917J37118A18924M4154m6554K06555P2576r1101
16304C04554o2317N0718o0851p6071K65656j05078A44226L80849F0450K01346
16294B61796E8648b8460B5568N9439K63003K8767r5722K4053O2299m1212d8717
16282C24688a8631B93860j00491d17749A92848a1775C59685q7177i2811B71602
16271A63183J7331F2447h5248I7039J44926H714c9574G1158M04425A12909e2219
16259H0056P8409k2677L51983A44930m3123D1333J26316b0032D2813a10984B57692
16247c42013B56377J08349A8146b85478B77470j33328J28888b37494I5077e9289
$$ y = [253227, 333182, 236769, 79451, -142692, 33465, 102824, 209616, -29992, 223611, 180851, 431886, 231286, 382993, 170917, 308035, 118924, 163078, 116524, 323079, 395655, 304554, 242237, 292955, 232104, 156033, 421689, 316611, 144226, 525075, 60450, 261796, 58648, -28460, 25568, 85007, 348010, 376777, 281055, 305108, 367407, 326195, -48717, 324688, -18631, 293860, 193369, -417749, 192848, -11775, 359685, 272508, -92811, 271602, 163183, 180514, 62447, -85248, 97039, 241965, 8714, -39574, 71158, 475583, 112909, -52219, 80056, 158465, 135788, 487771, 144930, 101807, 41333, 167649, -20032, 42813, -110984, 257692, -342013, 256377, 364726, 18146, -285478, 277470, 144142, 273030, -237494, 95077, -59289]
16236E01907B11464K64573A17381C794h119j02349j5782E23218g9277l5762B02974
16224a4690q9283I614f1155A9483N1289L86906E4442P4218J2126b60731J07199
16213a53532l807B47765j12136R7094A02091C8417K51071b78777b9975B55591
16202C4114M03281b39732D81297b21663A68508J40078c2371j09328B1608N2597
16192G4205a43582C7003O1359a05778k58290B73312F5617b6180j13061G0391d9957
16180f1227k1285A58999J37179j44040k3067A5835P5940l5545O5852e4191A05715
16168a07145B11978a2602B02859n8830a23878B38516I2795K43377a9208l7727
16158e6935D77896A58551C6804J0658N0804M9653B0770i9497B30818L0274A7257
$$ y = [501907, 211464, 476037, 117381, 3794, -8119, -110468, -126250, 523218, -79277, -115039, 202974, -14690, -103973, 9614, -61155, 19483, 70772, 457678, 54442, 128660, 140786, -260731, -153532, -157339, 247765, 135629, 232723, 102091, 38417, 289488, -278777, -29975, 255591, 34114, 437395, -239732, 481297, -221663, 168508, 308586, -32371, -141699, 21608, 74205, -143582, 37003, 98362, -105778, -364068, 273312, 65617, -26180, -139241, 70391, -49957, -61227, -82512, 158999, 296178, 152138, 129071, 15835, 91775, 56230, 122082, -54191, 105715, -107145, 211978, -12602, 202859, 144029, -123878, 238516, 92795, 336172, -19208, -56935, 477896, 158551, 36804, 47462, 98266, 147919, 20770, -99497, 230818, 261092, 17257]
16146d065j42101j8374k10016A39630M3082F3394b3213r4950A35769j661Q7568
16135B21676F9983g9026J0822k14977A16248B0580J68186J4644a85866B6575l140
16124B3435c88736C25300f6725R654B81505A19882B8976d8993j61778d8747B01045
16112D2575P943p60J26865D10L5238P4890k4174J32937r9881l5967L50974k14507
16100B19920I3857k6634J5169b05865A84718b0828A50314d32149a53596B0700
16089a51639n5193J00408j17732c3359E1327J02247c46908a61508A72703b7821
16078A78455q8190a35821B55256n5744a52897H3881J85513r1110m9170e2739C01309
16066b12137B18911j7042a09819A29841f1216j6576B96952E0989e154l59781j55185
$$ y = [-4065, -146166, -164540, -374556, 139630, 182712, 63394, -23213, -118163, 135769, 134108, 221676, 69983, -79026, -68204, -283181, 116248, 20580, 188766, 203410, -185866, 26575, 23435, -388736, 325300, -66725, -57071, 281505, 119882, 28976, -48993, -210771, -48747, 201045, 42575, 50518, 49758, 176623, 410, 35648, 110538, 86364, 219301, 119420, 83453, 434427, 219920, 93857, 67223, 82392, -205865, 184718, -20828, 150314, -432149, -153596, 20700, -151639, -206832, -106424, -224156, -33359, 51327, 153574, -346908, -161508, 172703, -27821, 178455, 90265, -135821, 255256, 199512, -152897, 83881, 269394, 178284, 129114, -52739, 301309, -212137, 218911, 201869, -109819, 129841, -61216, -77792, 296952, 50989, -5154, -364935, -520120]
16055e20120a48386A06666c47812A09794a43167C1296P4179a95994c2025B16064
16044d3763j76830q0h8045I3749O145c78534I205J47236a47717O1902m3350K0280
16032a08885D02544b09739j89489a11529r5597F0445a73740A07368c37128a47400
16021f734m37010g8374k13752d4207k09056A12467a78050A5216b32480F8678c40937
16009B58419k2704E8222h0131C4939a25821M9079j2906l2720b342I2796a0509
15997B42855B5668N324K53380j11308B2075a26058D9026a10288d3439D8635J91556
15986B40191c6404j03399B26923L3769K19666J32995A63419G1930L11862n98A24471
15974c38018A05331B4169a10213a6761h279l24184i3843L3364C3614a099A1165
$$ y = [-520120, -148386, 106666, -347812, 109794, -143167, 31296, 105475, -195994, -32025, 216064, -43763, -220593, -220673, -88045, 93749, 99894, -378534, 9205, 156441, -147717, -85815, -129165, -108885, 402544, -209739, -399228, -111529, -207126, 60445, -173740, 107368, -337128, -147400, -6734, -443744, -78374, -292126, -44207, -253263, 112467, -178050, 15216, -232480, 68678, -340937, 258419, 235715, 58222, -80131, 34939, -125821, -76742, -89648, -122368, -2342, 92796, -10509, 242855, 25668, 30992, 284372, 173064, 22075, -126058, 49026, -110288, -43439, 48635, 240191, -36404, -139803, 226923, 260692, 480358, 613353, 163419, 71930, 383792, 383194, 124471, -338018, 105331, 24169, -110213, -16761, -8279, -332463, -93843, -60479, 33614, -1099, 11165]
15962b17843h2863H0430d96867a33520d3352A41850P4335l0578D8709K01171f2893
15950A60163a38204E8059c08882E53806d19707M9457D5284O6233b25026m0559
15940b65585D8694J18630b81918C8355a64814F8134A0822K03572a09925B76288
15929d2300m32618A67536o8516B9059b23526c2604j47359Q456C2905h5297A04460
15917A50897k2697c1005k41789J4913E5923d65123J46717J26162I0629P757b43946
15905b79940O0661k43249A42631k6555l1144K53184b45156D2506P9155b38343
15894I2066a19266a839k21278I3893i0081l5147A803Q8090m1442c7070A48401
15882C2204g8140L7290a3903A20617M5736b2162A78532c22701b7397A0825g8317
$$ y = [-217843, -82863, 80430, -496867, -133520, -43352, 141850, 216185, 185607, 48709, 249880, -62893, 160163, -138204, 58059, -308882, 553806, -419707, -370250, 45284, 111517, -225026, -265585, 48694, 167324, -281918, 38355, -164814, 68134, 10822, 214394, -109925, 276288, -42300, -474918, 167536, 99020, 29059, -223526, -32604, -179963, -171507, 32905, -85297, 104460, 150897, 128200, -31005, -272794, -257881, 55923, -465123, -318406, -192244, 90629, 98386, -243946, -279940, -219279, -462528, 142631, 116076, 84932, 338116, -245156, 42506, 121661, -238343, 92066, -119266, -1839, -223117, 93893, -90081, -125228, 1803, 89893, 48451, -37070, 148401, 32204, -78140, -40850, -13903, 120617, 166353, -22162, 178532, -322701, -27397, 10825, -78317]
15870a65538o8332O3602A70834e0693o4706A9251J28846K56452A88482J317i6042
15858f532D6760j6316b73760m5771a05909j62336D6250K783K7553Q5947A0950
15846b63455a7565j88971A58544a64816A23571h3089k83336J30210Q5666A7582
15835A66838F2276a56401B41859c8699l21014k0319A48867b6926B40096b81189
15824g547k2521j51582G5749B4648J3828a08063e59l291C3734e6816F9562a73085
15811A16624G681Q0273J01877a74341A05617J02611D6528E133a89570D7630d7627
15799a54675C7442q427P4493E1399f9875j02448A57905a92256A48712b80155e977
15787G4123a09582d2078D9162c5035C19761d217k60691f030m7467j50906k1613
$$ y = [-165538, -233870, -170268, 170834, -50693, -115399, 19251, 148097, 404549, 188482, 189799, -96042, -6532, 46760, 30444, -273760, -319531, -105909, -268245, 46250, 49033, 76586, 162533, 10950, -263455, -17565, -206536, 158544, -164816, 123571, -83089, -366425, -236215, -150549, 17582, 166838, 62276, -156401, 241859, -38699, -359713, -380032, 148867, -26926, 240096, -281189, -7547, -30068, -181650, 75749, 24648, 38476, -108063, -559, -3850, 33734, -56816, 69562, -173085, 116624, 7681, 87954, 189831, -174341, 105617, 208228, 46528, 5133, -189570, 47630, -47627, -154675, 37442, 29015, 103508, 51399, -69875, -172323, 157905, -192256, 148712, -280155, -5977, 74123, -109582, -42078, 49162, -35035, 319761, -4217, -264908, -6030, -53497, -204403, -226016]
15776b26016a06027j75301C3499i4298j13368J0766q3856a37037k6192C23474
15765C5510b73018A7066b54710a9596D902N4282e7249A36975q298J00093B26L6946
15753C7172J77762E9472B7656J54678O8832a04362o7751K067o4798E50503j42628
15742D07875E6029a74771A01401a55654c0906B8671a82354h9650B32534a86167
15731b8700k2592B25807l9591a16479F4490f2631l5578j10007B33310F4364k1326
15720D3038c16753h7381C0511b45191j2568N3101F2263J58043h8535A2354c6236
15708A32846b21524Q1954C007f5758A44774b44529G4613b26786N4667A22391b35753
15696a77956A28504m2358a398k05957a01387G1224M51676A14977O5972a06385
$$ y = [-226016, -106027, -281328, 33499, -94298, -207666, -196900, -280756, -137037, -163229, 323474, 35510, -273018, 17066, -254710, -19596, 4902, 59184, -57249, 136975, 128677, 228770, 226, 37172, 214934, 59472, 27656, 182334, 251166, -104362, -172113, -170046, -234844, 550503, 407875, 56029, -174771, 101401, -155654, -30906, 28671, -182354, -89650, 232534, -186167, -28700, -51292, 225807, 186216, -116479, 64490, -62631, -98209, -208216, 233310, 64364, 43038, -316753, -87381, 30511, -245191, -257759, -204658, 62263, 220306, -88535, 12354, -36236, 132846, -221524, -139570, 3007, -65758, 144774, -244529, 74613, -226786, -172119, 122391, -235753, -177956, 128504, 86146, -1398, -207355, -101387, 71224, 522900, 114977, 180949, -106385]
15685b22003a01213q0744e5705j89744A67300c81488e5374p0937j66614B19042
15674A50540j7248l0576Q7453k8912c6943G8091K19332A18306c6927C7253b04400
15662f0448G7408e18672b23999F329h267r674j01174b2381C6440a20377A09831
15650g8033l89469a21142j21628i6334a7129A9323a82930H1679b11653g8079b6371
15638E0665c32571i8653I6481a52590N554m6245C30169e3895A24517a38282B46905
15626I9699b08710A5007g493k29812A2380Q0684A1626J79629k9784c6379c989
15614I4062b07313p3541B63598c02766f8851a007o5846r8622M8126A92315d64695
15602E4510c46683J17646h3696l3135J3567b3591A41110L0594c86549a03765c9768
$$ y = [-222003, -101213, -181957, -55705, -245449, 167300, -381488, -55374, -126311, -292925, 219042, 150540, 133292, 102716, 190169, 161257, -36943, 78091, 297423, 118306, -36927, 37253, -204400, -60448, 77408, -518672, -223999, 6329, -8267, -17941, -119115, -22381, 36440, -120377, 109831, -78033, -467502, -121142, -242770, -96334, -17129, 19323, -182930, 81679, -211653, -78079, -26371, 50665, -332571, -98653, 96481, -152590, -147036, -193281, 330169, -53895, 124517, -138282, 246905, 99699, -208710, 15007, -7493, -237305, 12380, 93064, 11626, 191255, 161471, -36379, -3989, 94062, -207313, -280854, 263598, -302766, -68851, -1007, -66853, -165475, -117349, 192315, -464695, 54510, -346683, -229037, -83696, -116831, -103264, -23591, 141110, 171704, -386549, -103765, -39768]
15590b38905h2701j66537B21268a08006B11578b67146A4001N3970b89280A61262
15579I8851b12591A02170b33393C45114a19839I496K67985b83652B70266Q373
15569B78639a91628j59313F8280g246k20122A13849a62896A96040a25228B7906
15558e8171j7725l1632B8946l08J26506D5861A9351b19230C15136j42222a37934
15546b7658A70884E8777L973M7161b69124o3466a7827A55605f9959A07207d066
15534B44446b1586k77453e5557I3097b04259c9875J5831B00699g6563B95910I837
15522c5025A75374n8685k5223d3154H2619J41597a93810L0665A85546c0436A83413
15510H3223a91362A75398C5044J74866A0518h736B56194i6372A77478M17221a08014
$$ y = [-238905, -82701, -249238, 221268, -108006, 211578, -267146, 14001, 67971, -289280, 161262, 98851, -212591, 102170, -233393, 345114, -119839, 9496, 277481, -283652, 270266, 278639, -191628, -350941, 68280, -7246, -227368, 113849, -162896, 196040, -125228, 27906, -58171, -75896, -107528, 28946, 28638, 155144, 45861, 19351, -219230, 315136, 172914, -137934, -27658, 170884, 58777, 62750, 109911, -269124, -332590, -17827, 155605, -69959, 107207, -4066, 244446, -21586, -299039, -55557, 93097, -204259, -39875, -24044, 200699, -76563, 295910, 9837, -35025, 175374, 116689, 91466, -43154, 82619, 224216, -193810, -163145, 185546, -30436, 183413, 83223, -191362, 175398, 35044, 209910, 10518, -8736, 256194, -96372, 177478, 594699, -108014]
15498A10242R8326H3414e202B22887r7660a87053N129K6047j21954G1296P7754
15487A49050a69206A364b79993C33645q5844p2764b6904H3762M9694K3702b4173
15475i8495E7990h6109l8530C37974a31566O5454p251A90636P7983B5096R3313
15464A18409a49562b6105A22862M1195i2064b9269A33137C0483K46624I8986a39831
15452b31296M3597k08760B5619h428o288B89515C3491a8743B1897c77624f3883
15440A47733F8112O3995a09088A65492a57342j3272o3309q5565J23689q1243R9399
15429a77643k7883l7892j11025A85740j4126J07531A2227a01224c0620k04764
15419b35384G8627K67280b91355J38309I8999g6775H3048k8911a85560a3784l5867
$$ y = [110242, 208568, 83414, -5202, 222887, 125227, -187053, -181924, -155877, -277831, 71296, 149050, -169206, 1364, -279993, 333645, 247801, 175037, -26904, 83762, 133456, 157158, -24173, -98495, 57990, -86109, -124639, 337974, -131566, -66112, -73363, 190636, 268619, 25096, 118409, -149562, -26105, 122862, 164057, -92064, -29269, 133137, 30483, 277107, 98986, -139831, -231296, -187699, -396459, 25619, -8428, -14716, 289515, 33491, -18743, 21897, -377624, -63883, 147733, 68112, 132107, -109088, 165492, -157342, -170614, -233923, -319488, -195799, -277042, -177643, -205526, -243418, -354443, 185740, 171614, 279145, 12227, -101224, -30620, -235384, 78627, 345907, -291355, -153046, 98999, -76775, 83048, 54137, -185560, -13784, -49651]
15408d9651B28942A08993a58754a1340A55953M4994k4482C734e9866B75829a17539
15396a1797j98535D9343A3522L7959k4157L46958A52788a31781p2675g2508E1136
15384B58320b77560N117A52097b2120G6930b63341Q6688C02189a84340q3954j5665
15373b83959B35067C2312e509k12829J3635A23527h5257P603A67453j7371d35361
15361b42012F3518K9465d4067D4549a83862c0550k822I6447N4118c01143A98522
15349C24971r9500E784a84618B2994Q7296k3971G406b22609d5314G811M6693K34005
15337B88509a07817j7588H1325L5360m4247i3693B07220a18865a9536H1044a50166
15325A42574M6237A5684M91639H9949R630d1196D6627J73167B0303J10603a001
$$ y = [-49651, 228942, 108993, -158754, -11340, 155953, 200947, 176465, 3734, -59866, 275829, -117539, -11797, -210332, 49343, 13522, 51481, 27324, 374282, 152788, -131781, -204456, -72508, 51136, 258320, -277560, -272443, 152097, -22120, 76930, -263341, -176653, 302189, -184340, -268294, -283959, 235067, 32312, -5509, -218338, -204703, 123527, -85257, -77654, 167453, 150082, -435361, -242012, 63518, 92983, -44067, 44549, -183862, -30550, -33372, 96447, 150565, -301143, 198522, 324971, 225471, 5784, -184618, 22994, 110290, 86319, 7406, -222609, -45314, 7811, 54504, 288509, -107817, -125405, 81325, 116685, 72438, -93693, 207220, -118865, -19536, 81044, -150166, 142574, 188811, 15684, 507323, 89949, 99579, -41196, 46627, 219794, 20303, 130906, -1001]
15313i890j31073B94980b4746E7640O6066c7595j1287i281k61589A19978J52237
15302B72215I7841g0904A6345P5424J2523m8885a14651A1840a34898K9955G5668
15290e0237B15241m6561c1857q0927J0691C33138D5855l428c3801A92353C2238
15278a0109D7397O1011M2950f0632I6736a30527j14470h9894l4632k28875B57203
15266b02112O0315d4146B0176M26897c41506B29568B4631a13860A54246l6067
15256A18179M8625a41083G3013b0436C80371j70128L4052L16539N73692L09324
15246A443850n08420O99436o48820l71320F4885A4227J05033J52719j24959J16104
15236B63124F8626a12662l2863d3323A76379a12113A37611a25304A01799J76300
$$ y = [-9890, -140963, 294980, -24746, 57640, 123706, -37595, -48882, -9281, -270870, 119978, 272215, 97841, -70904, 16345, 91769, 104292, 55407, -114651, 11840, -134898, -104943, 75668, -50237, 215241, 168680, -31857, -112784, -102093, 333138, 45855, 42427, -33801, 192353, 32238, -10109, 47397, 108408, 151358, -60632, 96736, -130527, -244997, -89894, -124526, -353401, 257203, -202112, -141797, -44146, 20176, 447073, -341506, 229568, 24631, -113860, 154246, 118179, 166804, -141083, 73013, -20436, 380371, 210243, 244295, 560834, 1134526, 1443850, 935430, 1634866, 986046, 614726, 64885, 14227, 119260, 271979, 147020, 263124, 68626, -112662, -145525, -43323, 176379, -112113, 137611, -125304, 101799, 278099]
15226B78099J71816A42623b15844C6056R7838c16510M2409E1330c5637A80487
15215D19723B5015O081b2465G5586f4695A3560K18240d16895E52138g3865m1854
15204a15719E78032A64465d7818D20085h2821B96248a29715A35594a8394l12721
15194c31115i8154j86792A05168D5685a3469I5083B7468r992J6809g1607A50999
15182A95655l5117a00856B35004g6657j34660g4264k9401B08119G8465L0889K52164
15171C61518n3590a88482l049B07796J09544a89310C4404c6691A18784R0250I7327
15159A87957e821A30704C7888e1062C43684Q0628b8354C57167i5429k4538D5778
15147a89047a0049B89157j0280j22866M1533C2456J81363J31642h8318C14141
$$ y = [278099, 449915, 142623, -215844, 36056, 133894, -316510, -274101, 51330, -35637, 180487, 419723, 25015, 31096, -22465, 75586, -64695, 13560, 231800, -416895, 552138, -73865, -115719, 578032, 164465, -47818, 420085, -82821, 296248, -129715, 135594, -18394, -331115, -98154, -284946, 105168, 45685, -13469, 95083, 27468, 17476, 34285, -71607, 150999, 195655, 160538, -100856, 235004, -76657, -211317, -74264, -103665, 208119, 78465, 109354, 361518, 307928, -188482, -191531, 207796, 317340, -189310, 34404, -36691, 118784, 209034, 97327, 187957, -5821, 130704, 37888, -51062, 343684, 424312, -28354, 357167, -95429, -119967, 45778, -189047, -10049, 289157, 278877, 156011, 197544, 32456, 213819, 345461, -88318, 314141]
15136A7893N8850B7757J31115k128D0904b5155A35556f5646k7203A80901a7959
15124D1235a1166E8472L20721A43256J96830j59034D1795J55305j2224b7149A00907
15112A67548O7283I5732J99406G412i8814A63712J49779g008j5346B6699K22822
15101B49521G512L31819K1111d7458A26343e8360r3504C17825j01393J97303o8256
15090C45479e4431D3750N6423K20991j27994b33718B97380B9703L0215a4292j85045
15079a99337D7088J70982J57757j77364a04879A1510e618k03107A99662Q5816
15069B85478E8006J707O2847F704N3032a33075B26160A3015a3237A81647H5239
15057C67576B4685K21231A06974K18426j13575O1787H9068K8826L40949k29082
$$ y = [17893, 76743, 27757, 158872, 156744, 40904, -25155, 135556, -65646, -92849, 180901, -17959, 41235, -11166, 58472, 379193, 143256, 340086, 181052, 41795, 197100, 184876, -27149, 100907, 167548, 234831, 95732, 295138, 7412, -98814, 163712, 313491, -7008, -22354, 26699, 249521, 7512, 339331, 360442, -47458, 126343, -58360, -151864, 317825, 216432, 413735, 345479, -54431, 43750, 100173, 321164, 193170, -233718, 297380, 29703, 59918, -14292, -199337, 47088, 218070, 375827, 198463, -104879, 11510, -5618, -208725, 199662, 285478, 58006, 59713, 122560, 6704, 59736, -133075, 226160, 13015, -13237, 181647, 85239, 367576, 24685, 245916, 106974, 325400, 211825, 273612, 89068, 117894, 458843, 229761]
15047B29761B9725R7139h5B94550B9500K11473O5016A14013J30021A00771M0731
15036A41502K52445J172j94132l9629J15036a27859B38048f5461B95064b9781
15025D23085C484L48060J70344B10716O0157J71049j4778j82987A10382K10387
15015C20769m8020O5799L8066I7460J57142p9455B6171c65G1071L6502B2391Q1244
15003A03635K42810A23623J83063A31607K3991J62472K10802j65814A39756J85983
14993C25739j13968K64093G7277K46865j07819K07461j13984m0187F1199J61756
14983B22955J3750J40498A27732K11962A1041J90214J92404j89933L64366D4072
14972A56257p5347K97307A51410O0969R1648j17651L4999H2170O7758L23943K86282
$$ y = [229761, 29725, 126864, -85, 294550, 29500, 240973, 305989, 114013, 244034, 100771, 141502, 393947, 395119, 200987, 161358, 276394, -127859, 238048, -65461, 295064, -29781, 423085, 3484, 351544, 521888, 210716, 270873, 441922, 427144, 244157, 110382, 320769, 272749, 338548, 376614, 97460, 254602, 175147, 26171, -365, 71071, 107573, 22391, 103635, 346445, 123623, 306686, 131607, 155598, 318070, 528872, 363058, 139756, 325739, 211771, 475864, 77277, 324142, 216323, 423784, 309800, 269613, 61199, 222955, 236705, 377203, 127732, 339694, 11041, 201255, 393659, 203726, 568092, 44072, 156257, 80910, 378217, 151410, 212379, 304027, 186376, 221375, 82170, 149928, 473871, 760153]
14961G60153k52095k36222R0018J26777q6194j89033K0724K5251J31262L687a70636
14949A21529J40244Q0315c7311A71281N614Q254L3948N814m1317c2741J2378D51842
14936B68546j32525K01838Q2803L66K2030j89918J83171J59598j76316j92195
14926B27398C1527L33431r3619F4533K66124E8024N35481M8244k35332L9936j8485
14915D27868O537j50725K2206j03677N8485L18794B51978o0168L4104L11352B55758
14903B45664E1525L09379K18516k45542N9378K3073o9134p2143L8666K07613k26640
14892B94691L9753j08778L86629L9608B76279J62869l5244G9039L04481K13081
14882E96601p8406J07864l05679L1340A16427K76326A24965M73033A59882K83974
$$ y = [760153, 508058, 271836, 361854, 488631, 402437, 213404, 234128, 259379, 390641, 394328, -170636, 121529, 261773, 342088, -37311, 171281, 176895, 185149, 219097, 224911, 183594, -32741, -20363, 451842, 268546, 136021, 337859, 420662, 421028, 443058, 253140, 436311, 595909, 419593, 227398, 31527, 364958, 271339, 64533, 330657, 58024, 593505, 641749, 406417, 446353, 427868, 434405, 283680, 305886, 202209, 260694, 579488, 251978, 191810, 225914, 537266, 255758, 245664, 51525, 360904, 579420, 333878, 393256, 416329, 347195, 275052, 313718, 521331, 294691, 334444, 225666, 612295, 651903, 276279, 439148, 403904, 79039, 383520, 596601, 518195, 626059, 320380, 351720, 116427, 392753, 124965, 597998, 159882, 443856]
14872D43856O2472B15590J94885J07554k49293o521K12286J27018j79669J5344
14862D37194j15358M01137C60278L04132B93109f6810D41934B03427M39029C14145
14851D41236l6643r5269K06176N9337B49267J0252K07230P9877J0722J3938j26104
14840D45182j11787P3658P0486q4201k2661P1683J55560M1436k54830K59364k55693
14829C88197J7367M1581j60275J54585j1468J64984k34317K7758A55420K81863
14819D37283P7574K3042J46820B30652N54789C08331M33505k54701M6521k1508
14809E12148K27585C15776J48155J48820r2993J77550n4496k58222K84324B97487
14798C89224J39514k09145m9818K23768L20999k77537P286K1521K88635m08869
$$ y = [443856, 506328, 215590, 410475, 518029, 268736, 262215, 474501, 601519, 421850, 437194, 321836, 722973, 360278, 664410, 293109, -66810, 441934, 203427, 642456, 314145, 441236, 404593, 309324, 515500, 574837, 249267, 259519, 466749, 546626, 557348, 571286, 445182, 333395, 407053, 477539, 393338, 370677, 442360, 597920, 639356, 384526, 643890, 388197, 405564, 447145, 286870, 441455, 429987, 594971, 360654, 388412, 155420, 437283, 514857, 537899, 684719, 230652, 785441, 308331, 741836, 487135, 533656, 512148, 739733, 315776, 463931, 612751, 519758, 697308, 642812, 384590, 668914, 297487, 389224, 528738, 319593, 269775, 493543, 814542, 537005, 544291, 565812, 854447, 445578]
14788D45578J19896j41736L67632l39964M40315D10052L69448k81189r9031L70802
14778G70082o5546k10311J81738q5402N0696K15717N3631C15346J57916N0649
14768E23911K35506n3166K380n7612O2467O2412q0585j63127J78914k96905J39629
14757E53824L85415m13183L00918k20686L01475k85382o9170L55125J58499l83627
14747F83208j79362L87499k88356r2596K06892j42548J21959m8679K10539k50139
14737F08417J89364C81130K22429R1191O6007n5274J20706j16038L83565l20137
14727G73579j82147l9888m3451K55846J74360j85750j4781J28153k04002J64037
14717H25956k93051M06431J71092m58542J43471k22948M79453n2326q1410o3953
$$ y = [445578, 565474, 423738, 791370, 451406, 891721, 410052, 779500, 498311, 399280, 770082, 704536, 494225, 675963, 590561, 641257, 856974, 910605, 315346, 473262, 523911, 759417, 706251, 708631, 651019, 713486, 775898, 695313, 532186, 711100, 414195, 553824, 939239, 526056, 826974, 606288, 907763, 622381, 553211, 908336, 1066835, 683208, 503846, 891345, 602989, 510393, 717285, 574737, 696696, 648017, 858556, 608417, 797781, 381130, 603559, 694750, 760757, 705483, 826189, 710151, 1093716, 773579, 591432, 551544, 508093, 763939, 938299, 752549, 737768, 865921, 661919, 825956, 532905, 939336, 1110428, 651886, 795357, 572409, 1051862, 999536, 918126, 854173]
14707H54173k35997L63425O2074j99235m749j6301j57660K80906k24738L37734
14697A059632j68280q0922N31172l85123j65713L260L31788l13817K0763L5063
14687H67823r0250n107L20841n9103j09916o1209J26190M02563l33909l14830
14677G43093k0137L02999k41897N71386k83323r9227K49192j38072k63648N04603
14667A324969j80408k89304M02630k73573O0634M8173l56392P7503L72885R7688
14657A284805J69631l16549p0695n4117J84213M7772j18475J94375j86373r099
14647A125488Q8467L1035k2096J96326O987j97356L26293l04345K15291m62448
14637A003642K37104j13281K56113l01852K61542Q4897K74569l40095P927k06693
$$ y = [854173, 618176, 981601, 1043675, 844440, 839691, 823390, 665730, 946636, 721898, 1059632, 891352, 810430, 1341602, 956479, 790766, 794026, 1125814, 811997, 832760, 867823, 777573, 772466, 1093307, 1034204, 924288, 863079, 989269, 1391832, 1057923, 743093, 722956, 1025955, 784058, 1355444, 1072121, 972894, 1222086, 1084014, 820366, 1324969, 1144561, 855257, 1257887, 984314, 1044948, 1093121, 736729, 814232, 1187117, 1284805, 1454436, 1137887, 1067192, 1013075, 1197288, 1245060, 1126585, 1320960, 1134587, 1125488, 1213955, 1244990, 1222894, 1419220, 1426207, 1228851, 1555144, 1250799, 1466090, 1003642, 1240746, 1127465, 1383578, 1081726, 1343268, 1428165, 1702734, 1362639, 1370566, 1163873]
14627A163873M83893l28039N5350J56662L3137J569k05775J31033j96039M3915
14617A339579M53166k52530j30686L04115k60849j5882Q8576P841O2625J50642
14607A746597k85701N4000J05625J29878P2819o9732L9248J29207k72110l3259
14597A616572k49359N45753k67118Q2751l4825L3674M07194k71627k52645K47441
14587A857811M4105k4358J55140j37673K20186Q1317j01888N3358q1196N5606
14577B122408O9600Q8307j97147J75925k95632M60014O5282l98752J79118j91171
14567B077952K67724q4714J64235K28802j19868L83485M1629J38294l53179K21187
14557B965547n5728l5699N80974K45392J02001O07201K20173J183327J924465
$$ y = [1163873, 1647766, 1319727, 1375077, 1531739, 1564876, 1566445, 1360670, 1491703, 1295664, 1339579, 1792745, 1540215, 1409529, 1713644, 1452795, 1436913, 1525489, 1533330, 1595955, 1746597, 1460896, 1514896, 1620521, 1750399, 1823218, 1753486, 1792734, 1921941, 1649831, 1616572, 1367213, 1912966, 1645848, 1728599, 1693774, 1727448, 2134642, 1863015, 1610370, 1857811, 1901916, 1877558, 2032698, 1895025, 2115211, 2196528, 2094640, 2147998, 2066802, 2122408, 2192008, 2280315, 2083168, 2259093, 1963461, 2423475, 2488757, 2090005, 2269123, 2077952, 2345676, 2260962, 2425197, 2653999, 2534131, 2917616, 2959245, 3097539, 2744360, 2965547, 2909819, 2874120, 3455094, 3700486, 3802487, 4409688, 4629861, 5813188, 7737653]
14548G737653L679548Q293956J8638721J2893011B3473642A0239293m949932k164228
14540C125133o16491K2249n15378R0606j23802Q3249K85296j08723N1768j05859
14530B188048K80821l79119p9410M65375j90996l2357J96261l9328J27612j68391
14520B368516L12438L8505J4925j31735K66708J29185j40836l8372M06178l95634
14510B829878M70323l58432j01294n8992R8227Q3094M737K16009j32859k3360
14500C027331J48400k61618M17602l944k21095K43185M33242k27923K50701m97976
14490C307905P1371J53162m8404K45316j36976L33526k93701K99481K541K33381
14480D167602j59256J7588J20320K11406j87969J70329j5996L91922m39576l6322
$$ y = [7737653, 11417201, 19711157, 38349878, 51242889, 23473642, 10239293, 5289361, 3125133, 2508642, 2530891, 2015513, 2106119, 1982317, 2065566, 2350862, 2242139, 2293907, 2188048, 2468869, 2089750, 2010340, 2475715, 2284719, 2252362, 2448623, 2409295, 2536907, 2368516, 2680954, 2719459, 2734384, 2602649, 2869357, 2998542, 2857706, 2819334, 3225512, 2829878, 3300201, 2941769, 2840475, 2781483, 2879710, 2962804, 2967541, 3183550, 3050691, 3027331, 3175731, 2914113, 3331715, 3327771, 3106676, 3349861, 3783103, 3555180, 3805881, 3307905, 3379276, 3532438, 3484034, 3729350, 3592374, 3925900, 3632199, 3931680, 3934221, 4167602, 4008346, 4025934, 4146254, 4357660, 4169691, 4340020, 4324024, 4715946, 4276370, 4240048]
14470D240048J66679k4118K62650Q0795q6399l33982O30532m0209j5768J29342
14460E009570j91683K78877K55034n99205N80223L3986J97318j1558N7167l57230
14450E252499J30096N6130K15527L88950j04039n1064P5025K12641j58986L81476
14440F398255o071p3148n768K41208K10758j31806N6196N83990O7133J86270l30499
14429G196518l2113p3289L51371M08245o2935N3685M6354k115N77468m43053M51621
14418H471757J12157j69304M29132J48457k09732L99134k6552K83300L7806k78136
14408I198019L88842L18493o3283M87149J57912J76949k23065L59216M82505m222
14398A1278515J17421l2263N34957Q0671o370K17918M5833M67907n8111N69811
$$ y = [4240048, 4406727, 4382609, 4645259, 4726054, 4639655, 4305673, 4936205, 4895996, 4880228, 5009570, 4817887, 5096764, 5351798, 4752593, 5332816, 5366802, 5564120, 5552562, 5609729, 5252499, 5382595, 5438725, 5654252, 6043202, 5939163, 5888099, 5963124, 6175765, 6016779, 6398255, 6392184, 6319036, 6313268, 6554476, 6765234, 6633428, 6689624, 7273614, 7340747, 7527017, 7196518, 7164405, 7091116, 7442487, 7850732, 7787797, 7841482, 7887836, 7885721, 8463189, 8020136, 8471757, 8583914, 8414610, 8843742, 8992199, 8782467, 9181601, 9155049, 9438349, 9476155, 9198019, 9586861, 9905354, 9842071, 10329220, 10487132, 10664081, 10441016, 10800232, 11282737, 11278515, 11395936, 11363673, 11898630, 11979301, 11972931, 12190849, 12236682, 12704589, 12646478, 13216289]
14388A3216289J44854K88859p5494M67309K04978m9736M48520J45281N52937o401
14378A5337396N24068L74842L68027K9025J67591N97016N4003P02367N1694O26464
14368A8832493M89692L31602J63795K99943P49604N41938J56267J64052P56659
14359B2486045N16113M12324O47441P10883N38805M00648P90603O78551N88111
14350B7769524N87209N64022O54074Q84257O68678R92145P05426J013447N81379
14341C4420161J127587Q78306J096298J330157P62298J061890J322292J064496
14333D3063485J288148J034098J490236J340737J834473J686200J154987J343095
14325E4235459K148647J785073J994588K318598J911075K081172K642775K448258
$$ y = [13216289, 13361143, 13650002, 13574508, 14041817, 14246795, 14197059, 14645579, 14790860, 15343797, 15337396, 15861464, 16236306, 16604333, 16633358, 16800949, 17397965, 17451968, 18154335, 18206029, 18832493, 19322185, 19653787, 19817582, 20117525, 20867129, 21409067, 21565334, 21729386, 22486045, 23002158, 23414482, 24061923, 24772806, 25311611, 25712259, 26502862, 27181413, 27769524, 28356733, 28920755, 29574829, 30459086, 31127764, 32119909, 32825335, 33838782, 34420161, 35547748, 36426054, 37522352, 38852509, 39614807, 40676697, 41998989, 43063485, 44351633, 45385731, 46875967, 48216704, 50051177, 51737377, 52892364, 54235459, 56384106, 58169179, 60163767, 62482365, 64393440, 66474612, 69117387, 71565645]
14317G1565645K415407L023211K600166L054784L127941L388502L770245L453679
14309I6399580M340369L715239M653661M753518M870672N374369N496961N771736
14301A35376105O142154O906885O788876P456925Q042954Q130914Q701427R686406
14293A97232646R733753J0350686J0841302J1420952J2506286J2521288J3157831
14286B77764744J3545145J4410361J4291934J5111897J4899020J5142594J4829975
14279C79995670J4833530J3767214J2995354J1510069J0704225Q501827N476322
14272D57784211K704387J165102R89250M51575k337657l570567n819480p458163
14264D43908658r141584j0893951j2197434j3370019j3784443j4771176j5344588
$$ y = [71565645, 73981052, 77004263, 79604429, 82659213, 85787154, 89175656, 92945901, 96399580, 100739949, 104455188, 109108849, 113862367, 118733039, 124107408, 129604369, 135376105, 141518259, 148425144, 155214020, 162670945, 170713899, 178844813, 187546240, 197232646, 206966399, 217317085, 228158387, 239579339, 252085625, 264606913, 277764744, 291309889, 305720250, 320012184, 335124081, 350023101, 365165695, 379995670, 394829200, 408596414, 421591768, 433101837, 443806062, 452307889, 457784211, 460488598, 461653700, 462642950, 463094525, 460756868, 457186301, 451366821, 443908658, 434767074, 423873123, 411675689, 398305670, 384521227, 369750051, 354405463]
14257C54405463j5373056j5273234j5113148j3585215j4043391j3488686j2913732
14250B54615001j2593890j1801686j0956504j0693287j0177054r359068q909151
14243A80124361q344895q129801p447769p438224o441420o119172n624141o153302
14235A24425637n301575m817463n263682l682082l957173m080793m105095l696114
14227H9521660l525808l154289l150716k936756k651190k764070k230370k797960
14219F6310501j843214k333765k058879k064855j857608j367067j505697j522255
14211E1757161j907371j824155j361856j157016j049498q51767j500513j717784
14203D0387201p63318j112018q32867p37040r49905j044113j160218j045306o34095
$$ y = [354405463, 339032407, 323759173, 308646025, 295060810, 281017419, 267528733, 254615001, 242021111, 230219425, 219262921, 208569634, 198392580, 189033512, 180124361, 171779466, 163649665, 156201896, 148763672, 142322252, 136203080, 130578939, 124425637, 119124062, 114306599, 109042917, 105360835, 101403662, 97322869, 93217774, 89521660, 85995852, 82841563, 79690847, 76754091, 74102901, 71338831, 69108461, 66310501, 64467287, 62133522, 60074643, 58009788, 56152180, 54785113, 53279416, 51757161, 49849790, 48025635, 46663779, 45506763, 44457265, 43605498, 42104985, 40387201, 39623883, 38511865, 37678998, 36941958, 35992053, 34947940, 33787722, 32742416, 32108321]
14194C2108321l60888j020658r02147r62435m08255r67219j53937j038200n99037
14185B5695545m82079m16553m12291r35415k63867q05642k04833n78624n04978
14176B1091263m52383k86659n42243l40287j51181l54631n18331l54156m05999
14167A7685393k94275k40939m42791j00229r45175J03364l44069j49535m43861
14158A4827883J7634q25133J3476l39934k9621l01872N7464n30214l32746k6500
14148A2530437k98192k91832J97944N770n39635k14005k00600J07849m92925J30781
14138A0935592k37456l04934k59381l2942K11553n35640j51499L58007o28411
14129I354889n9401m5459N1711k11161n8807n09663J92723l11387k0411P5084
$$ y = [32108321, 31747433, 30726775, 29824628, 28862193, 28453938, 27486719, 27332782, 26294582, 25695545, 25213466, 24796913, 24384622, 23449207, 23185340, 22379698, 22174865, 21596241, 21091263, 20638880, 20352221, 19809978, 19469691, 19318510, 18963879, 18445548, 18091392, 17685393, 17391118, 17150179, 16707388, 16607159, 15661984, 15765348, 15421279, 15271744, 14827883, 14845517, 14020384, 14033860, 13693926, 13664305, 13362433, 13419897, 12889683, 12556937, 12530437, 12232245, 11940413, 12138357, 12144127, 11604492, 11390487, 11189887, 11297736, 10804811, 10935592, 10698136, 10393202, 10133821, 10100879, 10312432, 9776792, 9625293, 9983300, 9354889, 9295488, 9250029, 9301740, 9090579, 9031772, 8522109, 8714832, 8403445, 8383034, 8458118]
14119H458118o09423n8356J17234j48520J9048j09349J8835n93787J81203J06370
14109G381373k01697k53375J65263k69469K66721k85897o2560r4813j53273Q799
14099F501072j31709R3470n75496J49199o7874J46989j68740j32591K0011j518
14089E832813J1712l26078j09417L03285o00235J81513p2278P5921Q1928l07164
14079E072000j49852k5005J72549o81132N43669Q4771m11286k31843L06148K84742
14069D964761k99097j90550J84980j48776k70163J95776K7509J32985l87133K17450
14059D427742m29440J66948j01107o7064L37415l37885K46559k94347l90064L69808
14049C928565j90699j29209n8557L20218j45433J31119k35077l23717j03121K42643
$$ y = [8458118, 7848695, 7790339, 7907573, 7759053, 7778101, 7668752, 7687587, 7093800, 7275003, 7381373, 7179676, 6926301, 7091564, 6822095, 7088816, 6802919, 6740359, 6645546, 6492273, 6501072, 6369363, 6462833, 5887337, 6036536, 5968662, 6115651, 5946911, 5814320, 5834331, 5832813, 5844525, 5518447, 5409030, 5712315, 5112080, 5293593, 5221315, 5297236, 5379164, 5072000, 4922148, 4897143, 5069692, 4388560, 4932229, 5017000, 4605714, 4373871, 4680019, 4964761, 4665664, 4475114, 4660094, 4511318, 4241155, 4436931, 4464440, 4597425, 4210292, 4427742, 3998302, 4165250, 4064143, 3997079, 4334494, 3996609, 4243168, 3948821, 3558757, 3928565, 3737866, 3608657, 3550100, 3870318, 3724885, 3856004, 3620927, 3297210, 3194089, 3436732]
14039C436732l06569N46776l20577k18344K87727j47182m3674J71041k38235K20114
14029C387809k7274j61064P4628n2847l58035l8784j14096L67286k38125J32415
14019B971913l11454L65628J274p4554m96963N20002l15503j69948r2420J25970
14009B523945k7199j5479J33639j53353r7288j92890K14385o1052j12492r4567
13999B117649J15853o0129l07255K43067J84174k39413J90355K43627j40493O61805
13989C009240O82662K399748O250112J7365506K3284374k4963348j3169976n838830
13981I019488k547078j357577j055449j45404k39769j32149o08092J38308l02215
13972B770063K84364j88294k86061J49440p086n47562J1804J3149L28016r6059
$$ y = [3436732, 3130163, 3676939, 3356362, 3138018, 3425745, 3278563, 3234889, 3405930, 3167695, 3387809, 3360535, 3199471, 3274099, 3221252, 2863217, 2824433, 2710337, 3077623, 2839498, 2971913, 2660459, 3026087, 3027361, 2952807, 2455844, 2975846, 2660343, 2490395, 2397975, 2523945, 2496746, 2481267, 2614906, 2461553, 2364265, 2171375, 2385760, 2324708, 2212216, 2117649, 2233502, 2173373, 1866118, 2109185, 2293359, 2053946, 2244301, 2487928, 2347435, 3009240, 3691902, 6091650, 12341762, 29707268, 52991642, 28028294, 14858318, 9019488, 6472410, 5114833, 4059384, 3913980, 3674211, 3542062, 2933970, 3072278, 2770063, 3054427, 2866133, 2580072, 2729512, 2722426, 2174864, 2186668, 2199817, 2527833, 2431774]
13962B431774K0541l91431M11704m44654K86476l86387L44329j7682j05120j4432
13952B135118K86161k99008k23822R5239J77673k0980k01806R645K28263j85835
13942B000648K30886m43346l3635K97990k98374L5917m98990N01487N9699J93624
13932B045906j4268m41623L02088q0408n8755l65552M61822k27797M01846k93622
13922A729637j83484J40332m19328L54149m47794M98356k09857J21151N5522k14357
13912A424327L35375m44188L52136o92331N20076R3586r6567j3666p934J16154
13902A586968j99284J04379j15119P4614J74743L2114m3203j84122k05676K68348
13892A493762l4224k31551L07121m4949q7200k01072J23019J31452L8211m65930
$$ y = [2431774, 2452315, 2060884, 2472588, 2027934, 2314410, 1928023, 2272352, 2254670, 2149550, 2135118, 2421279, 2122271, 1898449, 1993688, 2171361, 2150381, 1948575, 1958220, 2186483, 2000648, 2231534, 1788188, 1754553, 2052543, 1754169, 1790086, 1291096, 1792583, 1852282, 2045906, 2031638, 1590015, 1892103, 1811695, 1752940, 1387388, 1849210, 1621413, 2023259, 1729637, 1546153, 1686485, 1267157, 1621306, 1173512, 1671868, 1462011, 1583162, 1638684, 1424327, 1759702, 1315514, 1667650, 975319, 1495395, 1588981, 1492414, 1478748, 1470814, 1586968, 1387684, 1492063, 1376944, 1451558, 1626301, 1658415, 1615212, 1431090, 1225414, 1493762, 1459538, 1227987, 1535108, 1490159, 1402959, 1201887, 1324906, 1456358, 1494569, 1028639]
13882A028639L37735l18385J46980R1947K29277k33713k82601R8700K26088K12598
13872A537265l00741L9007k92223r6265K86414j32488M3085K61815j73290k378
13862A170201K42747k32260k97734K60322J47538k79175J22681Q4732K5915k73767
13852I71200L08854l06321J36787j57819J35493j18064j50970L60421l04627J3437
13842H88391L21386j39633j4l73722K92825l80740k9521J66763J29231K78393
13832A153359j79113R9037j83595K12118k1072m07879K22845Q7100k15809K41015
13822A008006j9680m6445K943J82315l24432M1742J08424k62139O00656m52764
13812H38626o4861J45608J20878J13019J48925k55446k78064J06776J25867j1149
$$ y = [1028639, 1366374, 1047989, 1194969, 1286916, 1516193, 1282480, 999879, 1098579, 1324667, 1537265, 1236524, 1275531, 983308, 887043, 1173457, 1040969, 1084054, 1345869, 1172579, 1170201, 1412948, 1180688, 882954, 1143276, 1290814, 1011639, 1134320, 1219052, 1244967, 971200, 1280054, 973733, 1110520, 952701, 1088194, 970130, 819160, 1179581, 874954, 888391, 1209777, 1070144, 1070130, 696408, 989233, 608493, 578972, 745735, 874966, 1153359, 974246, 1073283, 889688, 1101806, 1080734, 672855, 895700, 982800, 766991, 1008006, 988326, 941881, 944824, 1127139, 802707, 844449, 952873, 690734, 1291390, 838626, 773765, 919373, 1040251, 1153270, 1302195, 1046749, 768685, 875461, 1001328, 990179]
13802I90179M1109j71770j62313M4621J78293M8199J69336k71514k55335J86941
13792G97746j34832J95196j05116n3055M3929P3750J05963j67556K08690l7290
13782I27425k5690k49676j25643j42347R4680k01929K33126K63980o7391j48633
13772E57902K81372L5070j75746K9155M44895k56450j8674j20415J87103j82291
13762G81921J9233k78580K94988l36393J68734J45002p5330j46540J61742j43191
13752E91586J55520k30862Q2925j3j53273M38033j55199p9213j31391l8308J42974
13741F22779K08494j20480k08085K25654C42545N57842m04519M21141j02961m5789
13731G68259j79898J27361k3260k91796K10001l2904n5666L5539K51109l5235
$$ y = [990179, 1031288, 859518, 697205, 741826, 920119, 968318, 1137654, 866140, 610805, 797746, 662914, 858110, 752994, 699939, 743868, 817618, 923581, 756025, 964715, 927425, 901735, 652059, 526416, 384069, 478749, 276820, 509946, 773926, 706535, 557902, 839274, 874344, 698598, 727753, 1172648, 916198, 897524, 777109, 964212, 781921, 801154, 522574, 817562, 481169, 649903, 794905, 719575, 573035, 734777, 591586, 747106, 516244, 599169, 599156, 445883, 883916, 728717, 649504, 518113, 479805, 622779, 831273, 710793, 502708, 728362, 342545, 900387, 495868, 917009, 814048, 768259, 588361, 715722, 692462, 400666, 610667, 577763, 522097, 557636, 808745, 773510]
13721G73510j57231j85824K44578j44976J74749j3578J11257l73298L36412k37991
13711E27608J63370k67037J54710P5345k81618K00960L1297n3395q3698j77270
13701B90272K49363k67246L12960j6735k9001j52775K10466P014j35980J67194
13691F35532k06125q3183J79321j02238O8604J69318j96102J01584j36340R2761
13681E23132J02248l09258j45147M20099L41938C84194K87666k9610A43679J9987
13671A63666K84766N2476O200K8756j26721K23970k67890j41918K84132L31186
13661H38623l40614j12518k4303L58180l40776K25843j17733K21198j26633k38472
13651C42795K68810E7878L38794j84588P4991K19263Q8796j77179K8805L69420
$$ y = [773510, 616279, 430455, 675033, 530057, 704806, 691228, 802485, 429187, 765599, 527608, 690978, 423941, 578651, 653996, 372378, 573338, 604635, 551240, 467542, 290272, 539635, 272389, 585349, 568614, 539613, 386838, 597304, 604318, 468338, 635532, 429407, 346224, 525545, 423307, 491911, 661229, 465127, 566711, 430371, 523132, 625380, 316122, 170975, 591074, 933012, 384194, 671860, 642250, 143679, 163666, 448432, 500908, 507108, 535864, 409143, 633113, 365223, 223305, 507437, 838623, 498009, 385491, 361188, 719368, 378592, 604435, 486702, 707900, 581267, 342795, 611605, 57878, 396672, 212084, 287075, 506338, 595134, 417955, 446760, 816180]
13641H16180C84287O1353F7213N17904L7004j83322A99679M02795k42395j5107
13631C44972k8895J03843j86440J07019J24458j53555K5560N6789L13808q1933
13621F25626l04546j11163K00404r3001K3329P4623J9017Q2942J4706j08826J58635
13610E81746O3738k80468I4193L57150R0620q2939B21724J43970J61740j65712
13600C61722m6817A03501P67181C38905A59673L41176j35134R7901R0514P2686
13590F26816a6437D93674l9724j71260J16020j42548K09667K8540R6066j55070
13580D35365j79351N7859j7208N8104J7960K9101J02232A97122K95358j9583d6872
13568E17547j80434K23567A86325R0691K08047o3355K65772m7365j80260j14438
$$ y = [816180, 384287, 445640, 67213, 585117, 622121, 438799, 199679, 602474, 360079, 344972, 316077, 419920, 233480, 340499, 464957, 311402, 336962, 393751, 707559, 625626, 321080, 209917, 410321, 317320, 340649, 415272, 434289, 517231, 531937, 423111, 581746, 645484, 365016, 94193, 451343, 541963, 459024, 221724, 365694, 527434, 361722, 314905, 103501, 870682, 338905, 159673, 500849, 365715, 463616, 554130, 626816, -16437, 493674, 453950, 282690, 398710, 256162, 465829, 494369, 590435, 435365, 256014, 313873, 296665, 354769, 372729, 401830, 504062, 197122, 492480, 472897, -46872, 517547, 337113, 560680, 186325, 277016, 485063, 421708, 687480, 640115, 459855, 345417]
13558C45417j03209p4811m6462O0480E5832K31440J00303j15650Q613M53969B35176
13546C46059K44053B69941n7300o3043Q9612L15155k15598K47176B32346j5745
13536B16601j02408J52972K22204j42238A40211o9061J93396K5604F7947L32795
13526D00742j6618q3894L4273A31736l3836R8552P3430K19501j38897Q836j22460
13515B36862H0755P0429K1586K35348a63169A68019N4326K38078Q5397k60413
13505B85407M64451k67763j53999P3400k8272q5986O9136a51050A60325G4278
13494A68104J09123Q9729N1222r6319K594K2394j32318Q0671a37519B9196K22738
13483B51934j15357K28339O8794N2943B38382J08011H2688L42308A86468J46420
$$ y = [345417, 242208, 167397, 120935, 181415, 55832, 287272, 387575, 271925, 280538, 734507, 235176, 346059, 590112, 269941, 212641, 149598, 239210, 554365, 338767, 585943, 232346, 216601, 114193, 267165, 489369, 347131, 140211, 71150, 264546, 290150, 67947, 400742, 384124, 300230, 334503, 131736, 97900, 196452, 269882, 489383, 350486, 359322, 236862, 80755, 151184, 172770, 408118, -163169, 168019, 222345, 460423, 545820, 285407, 749858, 482095, 328096, 401496, 373224, 287238, 356374, -151050, 160325, 74278, 168104, 277227, 366956, 418178, 321859, 324453, 346847, 214529, 295200, -137519, 29196, 251934, 136577, 364916, 433710, 486653, 238382, 346393, 82688, 424996, 186468, 332888]
13473C32888H5438M4894a17719H7569J06023K64690B8153L96112j92304H4805
13462f764B38230J43125A04082g725c99E51002j69772C0687J92038j7900B351
13450D47556A66153J36063M9655m5510n9279A3004J34747O1115L44171r5991F9933
13438C75752G5137J67302l1181K06751A29706K62740p3182A30975M0226K53003
13428D24204A18088f1427C00291M497j2690Q9744i1679j78870B49670K10516A89133
13416C16911j22600K3924N5185J17418o4132k3903j30488K51081j41099j37172
13406A45125O9590Q9404J54446k02638r0305i9563B79509D7693g4772A03804N4807
13395A58611M13286a53538C12113F3876J32666c7044H0149J91495O8175D4126
$$ y = [332888, 85438, 130332, -117719, 87569, 193592, 458282, 28153, 424265, 231961, 84805, -6764, 238230, 381355, 104082, -7725, -399, 551002, 381230, 30687, 222725, 204825, 2351, 447556, 166153, 302216, 351871, 306361, 247082, 13004, 147751, 208866, 553037, 457046, 69933, 375752, 75137, 242439, 211258, 418009, 129706, 392446, 319264, 130975, 171201, 424204, 118088, -61427, 300291, 304788, 292098, 381842, -91679, -270549, 249670, 460186, 189133, 316911, 194311, 218235, 273420, 390838, 326706, 302803, 172315, 423396, 282297, 145125, 214715, 304119, 458565, 255927, 165622, -99563, 279509, 47693, -74772, 103804, 158611, 571897, -153538, 312113, 63876, 196542, -37044, 80149, 271644, 339819, 44126]
13384A96748J83998j47045A14562K69913K285j30037d9602A56034O6075D2576
13373C38672r0346D9685a17877E74239k77325J55876J07216F0695J29361B492
13362D26045A02382B0586e5117A65285C8689J5881K41669L2326k2477L5900j25640
13351B16348n2644D1895K59283C782L53450n8027p5767o6667K08533Q289D7458
13339B14602J58571K52365A62948K23935o3762j4129F1002J83998J08796j64632
13329A89164J78641L7664I6123L7626B5227K38136A25204K03523p5950A358K81244
13318B82602k2832D7072L10601A53098J64736b95392A88210j0317J01200A31813
13307A31975N6929n7468L7113J2242K0967B2332K61143a12905B25453q9858J16622
$$ y = [196748, 380746, 233701, 114562, 384475, 386760, 256723, -49602, 156034, 222109, 42576, 338672, 248326, 49685, -117877, 574239, 296914, 452790, 560006, 60695, 190056, 2492, 426045, 102382, 20586, -55117, 165285, 38689, 54570, 296239, 328565, 306088, 341988, 216348, 163704, 41895, 301178, 3782, 357232, 299205, 223438, 156771, 365304, 373593, 47458, 214602, 373173, 625538, 162948, 386883, 323121, 308992, 61002, 245000, 353796, 189164, 367805, 405469, 96123, 133749, 25227, 263363, 125204, 328727, 252777, 1358, 282602, 259770, 47072, 357673, 153098, 317834, -295392, 188210, 177893, 279093, 131813, 131975, 188904, 131436, 168549, 180791, 201758, 22332, 283475, -112905, 225453, 135595, 252217]
13296B52217m8463K18592A40608C4330K41685E6839L52548B9201F385J84829D4954
13284g1774D32864b2379I6138L17984A12718a02095D9241K39730q7704c433A86822
13272b29150A25232f6829A43298o3652b0053A12668K6033h3406B71681p5743E3941
13260E3141K86446a30689B4805e2598B06946O4924C6227J65734B02J13459L4522
13249A48183E6766L0395K54452a01071B63611I126R7407L03843A7382K91193B5475
13237C4542J5630k0523M02991j24144C8397K15727q7017P2928j13566b2328C72179
13225h2299C32439A50750N4158e2440D36884I3190C0236R123d4899G0419a53369
13213D4015K28427e7744n3952j1414I9410J11871a13178A09500Q1943c4542o2886
$$ y = [252217, 203754, 422346, 140608, 34330, 276015, 56839, 409387, 29201, 6385, 191214, 44954, -71774, 432864, -22379, 96138, 414122, 112718, -102095, 49241, 288971, 201267, -3433, 186822, -229150, 125232, -66829, 143298, 79646, -20053, 112668, 138701, -83406, 271681, 195938, 53941, 53141, 339587, -130689, 24805, -52598, 206946, 271870, 36227, 201961, 202, 113661, 148183, 56766, 87161, 341613, -101071, 263611, 9126, 106533, 410376, 17382, 308575, 25475, 34542, 50172, 29649, 432640, 308496, 38397, 254124, 167107, 240035, 126469, -22328, 372179, -82299, 332439, 150750, 204908, -52440, 436884, 93190, 30236, 39359, -44899, 70419, -153369, 44015, 272442, -57744, -111696, -123110, 99410, 211281, -113178, 109500, 191443, -34542, -97428]
13202i7428C54563C7291a28109B20413b5668o6216I7681L10682j03877h1789C17264
13190f7032A56594F5166q271a23468d6861N464A18754a18140A31741R3126E7126
13178B33a4332A00756a97207o0938G6458J83238e2894m664A51853N5742J92396
13167C99991b30111B2965K63150K12184a3529B34669l7273b55787i9188A81243
13156a45281j26392K1293A00802h1471A10735e9568A94274m5561m5600B5379f1776
13144B06347C5267J06551m4571K2551b6793C10042j01482I2310b4157k5898A94166
13132A56069L8574h5798b1384B2556J13535B4562N7358K15379g2655B08980b6618
13120B5356J96868p1870L3072b70217H7848J66491A12787K07604c9025p4287k07421
$$ y = [-97428, 354563, 37291, -128109, 220413, -25668, -91884, 97681, 408363, 304486, -81789, 317264, -67032, 156594, 65166, 56895, -123468, -46861, -41397, 118754, -118140, 131741, 224867, 57126, 233, -14332, 100756, -197207, -258145, 76458, 259696, -52894, -57558, 151853, 207595, 399991, -230111, 22965, 286115, 498299, -13529, 234669, 197396, -255787, -99188, 181243, -145281, -271673, -250380, 100802, -81471, 110735, -59568, 194274, 148713, 103113, 25379, -61776, 206347, 35267, 141818, 97247, 119798, -26793, 310042, 208560, 92310, -24157, -50055, 194166, 156069, 194643, -85798, -21384, 22556, 136091, 24562, 81920, 297299, -72655, 208980, -26618, 25356, 222224, 150354, 183426, -270217, 87848, 254339, 112787, 320391, -39025, -113312, -320733]
13109c20733D1401J64805p9847K9773j6898K9166m57b56196A48420m518N2589
13098A96491m1703o3125D3306Q2944f3903B49860i152I402L88507A19704J09155
13087B28859B9474i2849C3383O3595C1289N5441c5325O790A47313K23635A54140
13075B91352j10084b52663A00885A5857a01261A29436h9073A56478M1897r5431
13065A02944J93925a04480C50911j09949J53631K01188A99955a44117I3631b10879
13054h8739K2175C01815d756C2735L1129K10958n0802J9620a30276I4138l2661
13043F1477k0287J21007C5456K5783f9497A45921e3102A00831K1468b27088A13999
13031c5863B06042B4105J27956r675N827I949J94736j9595H808a19487B82615
$$ y = [-320733, 41401, 206206, 126359, 156132, 139234, 168400, 167943, -256196, 148420, 143902, 196491, 154788, 91663, 43306, 126250, -63903, 249860, -9152, 9402, 397909, 119704, 228859, 29474, -92849, 33383, 96978, 31289, 86730, -35325, -28535, 147313, 370948, 154140, 291352, 181268, -252663, 100885, 15857, -101261, 129436, -89073, 156478, 198375, 102944, 296869, -104480, 350911, 240962, 394593, 595781, 199955, -144117, 93631, -210879, -88739, -66564, 301815, -4756, 32735, 63864, 274822, 224020, 243640, -130276, 94138, 61477, 41190, 162197, 35456, 61239, -69497, 145921, -53102, 100831, 122299, -227088, 113999, -35863, 206042, 24105, 152061, 142386, 148213, 9949, 204685, 185090, 8808, -119487, 282615]
13019H1748H003K08908O665J07315M7914a59166G9351N1575B0700J05053m2223
13008H3530j0082e1920A49255P7325j06361L3642f916j66801C33511g1447A86015
12996B02775m6868J82106k4846M3561b42759a21345B01738J74222b71663B29491
12985I6411g8735G1849l742J42653h1639C05663a27578k06997i9500C19986h3695
12973A67755F3461a4142C72486c07995a6453F7133J4079J89260e88j63057A5039
12961A25844a72580E6395a17466j4981E9853J17274J26898h8008m72742A36221
12950f0305B2592a69312c197F205J17597i3410c0021A58906c83584G5019L21102
12939C96121H3999N9270N5893B3502N6832E778J60168G940J26310J8314b38247
$$ y = [81748, 8003, 216911, 223576, 330891, 378805, -159166, 79351, 130926, 20700, 125753, 83530, 73448, -51920, 149255, 226580, 120219, 153861, -6916, -173717, 333511, -71447, 186015, 202775, 155907, 338013, 313167, 356728, -242759, -121345, 201738, 375960, -271663, 229491, 96411, -78735, 71849, 68107, 210760, -81639, 305663, -127578, -334575, -99500, 319986, -83695, 167755, 63461, -14142, 372486, -307995, -16453, 67133, 81212, 270472, -588, -163645, 15039, 125844, -172580, 56395, -117466, -132447, 59853, 177127, 304025, -88008, -560750, 136221, -60305, 22592, -169312, -3197, 6205, 123802, -93410, -30021, 158906, -383584, 75019, 396121, 83999, 143269, 199162, 23502, 80334, 5778, 165946, 7940, 134250, 152564, -238247]
12927f1269k7495j08386A29529J04724C7392e9614B7183e5903j31616B76089J15183
12916C91272c8275M212A91003J06276a27040l5248A67330d1271A30799g7560C53451
12904a27108K24M9160I7632h8558C93480A27860l2152f2463l594A04464m8761
12893E5703j2536P6995c36197B02177b25790A75753N1750e8790n163A77405h9625
12881A66153B5584g9510D6652Q4831f2627D5824a26817C09052a26190M4743C03161
12869D4013j4431K43909j34858m6614K00940b9546A38863O8026l895B5299P0613
12858I5912j6372L8115K56902D8625b8365l40344B24768j7680L02609B26805e0613
12846e3067E0878F107K04875a02460I6989d3283B17403r3804d6909E3048I949
$$ y = [-61269, -88764, -197150, 129529, 234253, 37392, -59614, 27183, -55903, -187519, 276089, 391272, -38275, -34063, 191003, 297279, -127040, -162288, 167330, -41271, 130799, -77560, 353451, -127108, -126884, -77724, 97632, -88558, 393480, 127860, 95708, -62463, -66057, 104464, 55703, 43167, 120162, -336197, 202177, -225790, 175753, 227503, -58790, -63953, 177405, -89625, 166153, 25584, -79510, 46652, 131483, -62627, 45824, -126817, 309052, -126190, -81447, 303161, 44013, 29582, 273491, 138633, 92019, 292959, -29546, 138863, 206889, 202994, 25299, 95912, 79540, 117655, 374557, 48625, -28365, -368709, 224768, 207088, 509697, 226805, -50613, -53067, 50878, 6107, 210982, -102460, 96989, -43283, 217403, 123599, -46909, 53048, 9949]
12834B55361c4500j8221A3469a01044L5981A42292c69702H0048J4790b72853F2887
12822b29814D036K62980I3136d7557P655B20901b34470d4128A97590a69382C12029
12810A58709o8940K4310d7515j59951L930M8202A85165i5651c423l25608A28515
12798c86651h9414A68835k6051o123C3881a00890F4587K98394j31245a15795F117
12786F8960c7592A25605L97602a69805A227Q5714b6603G3387A9881K49440A06963
12774c9800j52000F6680c61319F397h8608n5297d3998A2251J0747L1413L2160
12763H6571a99309g4334A44089J0555J13230A21259b5263j16872m6445A03346
12752A46029i3258A52443d00156J48818D18679e7788E0904f8747q2846B6834J90169
$$ y = [255361, -34500, -52721, 13469, -101044, -65063, 142292, -369702, 80048, 94838, -272853, 62887, -229814, 4036, 267016, 93136, -47557, -39902, 220901, -234470, -44128, 197590, -169382, 312029, 158709, 89769, 114079, -47515, -207466, -203536, -155334, 185165, -95651, -3423, -329031, 128515, -386651, -89414, 168835, 142784, 136661, 33881, -100890, 64587, 362981, 231736, -115795, 6117, 68960, -37592, 125605, 523207, -169805, 1227, 86941, -26603, 73387, 19881, 269321, 106963, -39800, -191800, 66680, -361319, 6397, -88608, -143905, -43998, 12251, 22998, 54411, 86571, -199309, -74334, 144089, 154644, 267874, 121259, -25263, -142135, -188580, 103346, 146029, -93258, 152443, -400156, -251338, 418679, -57788, 50904, -68747, -151593, 26834, 217003]
12741B17003l8745m9596a56391C47983c6555j04195B03125J83172J94991A37615
12730b3145B85002A29551B4093D323K01407a71691b9427o9873G0786a10542A06787
12718A14112a52339D8601j2103j0002J83519a60315K6679I568a36290I1338L8537
12707A29875b8763A63695J07934H2555J26157n9532O7284M1352h7167b5115o3773
12696h8888H6647J78801F5874O1683n6210a2548B29415a80782A9668J05498b2285
12684b05382d6822A12376J01027L8466A6906K32893o2587g214A60078a5094j66377
12673a81471B29172B1654L24482c37852H2224e0292j64642B7900L93113J5169
12663D36182H7493J67756a33221I2722J00164q4477C4486j6210b69821B19612
$$ y = [217003, 178258, 128662, -156391, 347983, -36555, -140750, 203125, 386297, 581288, 137615, -23145, 285002, 129551, 24093, 4323, 205730, -171691, -29427, -99300, 70786, -110542, 106787, 114112, -152339, 48601, 36498, 26496, 210015, -160315, -133636, 9568, -136290, 91338, 129875, -28763, 163695, 271629, 82555, 208712, 149180, 216464, 257816, -87167, -25115, -88888, 86647, 265448, 65874, 127557, 71347, -12548, 229415, -180782, 19668, 125166, -22285, -205382, -46822, 112376, 213403, 251869, 16906, 249799, 187212, -7214, 160078, -15094, -181471, 229172, 21654, 346136, -337852, 82224, -50292, -214934, 27900, 421013, 436182, 87493, 255249, -133221, 92722, 192886, 108409, 34486, 18276, -269821, 219612]
12652c4628j4940A46720b5803E8394J27608i0637H6393R7697q4160b05629B79283
12640b52522G0021K20621A42733b1557l27880b5665D58494F5238K3214d8424D62340
12628A58073L53815A90480J18671a87195M636c7403m8168C09685J4955J393G7064
12616c4832k57470i2421M3793A6603a91351c3021F7968a04019j89977B74009M5425
12605C19434b29542A44502a04699H1794a9598A74444b9885G2199L0218L44710
12595D47127A6057L4557K53252C8924J38590N4292D5230Q1466M881i7657M5546
12584e2111a2539k04896A62690L34114a89931A48735F1630j9742J59347A566J9812
12573B1378R1506b53491I7388J07710j00227k8994j1577i916j97558a1590A15852
$$ y = [-34628, -49568, 146720, -25803, 58394, 186002, -90637, 86393, 184090, 99930, -205629, 279283, -252522, 70021, 290642, 142733, -21557, -349437, -25665, 458494, 65238, 88452, -48424, 462340, 158073, 511888, 190480, 309151, -187195, -182559, -37403, -85571, 309685, 324640, 326033, 77064, -34832, -292302, -92421, -48628, 16603, -191351, -33021, 67968, -104019, -293996, 274009, 319434, -229542, 144502, -104699, 81794, -19598, 174444, -29885, 72199, 102417, 447127, 16057, 50614, 303866, 38924, 177514, 231806, 45230, 126696, 131577, -97657, -52111, -12539, -217435, 162690, 496804, -189931, 148735, 61630, 41888, 201235, 1566, 21378, 112884, -253491, 97388, 205098, 104871, 75877, 64300, -9916, -207474, -11590, 115852]
12561C15685H2720B8253J95816b58955A23686i5174C92956G1960a39602A89591
12550E3095e3966C84014r7702n9570a48544A2512b3563g575k1832K43B27858H0097
12537A43613a65617A24628K08915A9495K08611l3419l4538F0816L02400b32371
12526A90625q2962a8907A9739a05825L7721k5962A0114f0337k65801D4435Q215
12515E2650j3738e65004K42556N5553D7461a4588A08718a07776J5520j33012A35636
12503c5375k35621B04835C4070g7558A50971h3254A58858J79460E2970b37080
12492b8451p6170M999j6777K0256I1496e8418E62414a57663A49215j1965E7102
12480b2134A48523l5824C2672b43102d996D9046J4231a899j563F2952b37815c8073
$$ y = [315685, 82720, 28253, 224069, -258955, 123686, -95174, 392956, 71960, -139602, 189591, 53095, -53966, 384014, 286312, 226742, -148544, 12512, -23563, -7575, -29407, -29164, 227858, 80097, 143613, -165617, 124628, 333543, 19495, 228106, 194687, 160149, 60816, 363216, -232371, 190625, 107663, -18907, 19739, -105825, -68104, -94066, 10114, -60337, -326138, 44435, 52650, 38912, -565004, -322448, -266895, 47461, -14588, 108718, -107776, -92256, -225268, 135636, -35375, -270996, 204835, 34070, -77558, 150971, -83254, 158858, 338318, 52970, -237080, -28451, -104621, -99622, -116399, -96143, 91496, -58418, 562414, -157663, 149215, 137250, 57102, -22134, 148523, 112699, 32672, -243102, -4996, 49046, 63277, -1899, -3462, 62952, -237815, -38073]
12467A70726m494b52857B34224a1466C36915c7727j40749A91622a93214P750A92599
12455a92772a8005F1715h4620A76732a75684H1792g9785A42367J41708j07821
12445A76254a61148J7483g0908B5087J11656a17902l7845M1504D5388a97677A573
12433A63996k7346d4488B8340b15307B6826K07756g8187I0749b54449i5946j72810
12422b68756I3382d9886j6271l1742j98008D5931a9898j88522Q7752C26341r9307
12411B27034a5455p3211A92924b77716J17105A66545o5239a75311p6784Q7874
12401a64221P8816j7101j69864B69305D8578a4158C76889G3065a47440c4760F9936
12389G8004N0570J86346b99786a31540c6405l4106B07316l8536R1407H3708J75263
$$ y = [170726, 166232, -252857, 234224, -11466, 336915, -37727, -178476, 191622, -193214, -185464, 192599, -192772, -18005, 61715, -84620, 176732, -175684, 81792, -79785, 142367, 284075, 176254, -161148, -143665, -70908, 25087, 136743, -117902, -155747, -114243, 45388, -197677, 1573, 163996, 136650, -44488, 28340, -215307, 26826, 234582, -78187, 90749, -254449, -95946, -268756, 93382, -49886, -66157, -97899, -295907, 45931, -19898, -208420, -120668, 326341, 227034, -15455, -88666, 192924, -277716, -160611, 166545, 101306, -175311, -252095, -164221, -85405, -102506, -272370, 269305, 48578, -14158, 376889, 73065, -147440, -34760, 69936, 78004, 128574, 314920, -299786, -131540, -36405, -70511, 207316, 168780, 260187, 83708, 258971]
12378B58971a95770c2846n4254E7418j8099a21037N2056C08759A6636L8837b28849
12366A40535P8420b60775d9900f450A99851F1097b51923O1346B44278b24658o5526
12355b90184B30794c1215o9526F450e0049B9239O0660f0838A15300a23705B977
12343C70092f5885j02790h451j87320D45675B17536K52908i5505B3087a22463
12332D16136b5274G2801j331K06023E7165b44116B43481G6664R1115k5927M0038
12321A81890a51120I2905K69583a32503j25499D39377C237M2136J81256j11580
12311A15049b58786E3547a62342b2893j21355F2017J13790o5556M379J52589o0964
12300B06255Q2430F1236J19172G395a8614j76095G242a29003p3634B49305r6420
$$ y = [258971, -195770, -32846, -87100, 57418, 39319, -121037, -68981, 308759, 16636, 55473, -228849, 140535, 218955, -260775, -49900, -6450, 199851, 61097, -251923, -190577, 244278, -224658, -290184, 230794, -31215, -100741, 6450, -50049, 29239, 89899, -60838, 115300, -123705, 2977, 370092, -65885, -168675, -8451, -195771, 445675, 217536, 470444, -95505, 23087, -122463, 416136, -25274, 72801, 71470, 277493, 57165, -244116, 243481, 76664, 167779, 141852, 181890, -151120, 92905, 362488, -132503, -258002, 439377, 3237, 45373, 226629, 115049, -258786, 53547, -162342, -22893, -144248, 62017, 175807, 110251, 114630, 267219, 206255, 288685, 61236, 180408, 7395, -18614, -194709, 7242, -129003, -202637, 249305, 152885]
12289A52885o1672J26519d68552b10984A23811m7640j5061d2214B07653Q7398
12279B95051a9364C37924a14873D7354c693B6058J57046M4416k3835d6898F8739
12267F9485a29138A55562J17701n6119b31182h1325J4606E7891K11500G7051R7652
12256A74703m5119D6498b44754D57782j36094A24556a05996C06964A1158h2341
12245A32083L24006B5050a48907A72943J36906c22973B08990a97614B86121I5680
12234h284r8317B03498N4848J262B9328J73736k4139K35798A34677J54412O8730
12223C57819j62700C1767K49680L7571A57958D7356M90769A97281A7520K52983
12213B70503K47962C9874R7045J23693H7051J41927K5128b34107H3305R2102R6153
$$ y = [152885, 91213, 217732, -468552, -210984, 123811, 76171, 61110, -42214, 207653, 295051, -19364, 337924, -114873, 47354, -3693, 26058, 183104, 227520, 203685, -46898, 68739, 69485, -129138, 155562, 273263, 217144, -231182, -81325, -66719, 57891, 269391, 77051, 174703, 129584, 46498, -244754, 457782, 321688, 124556, -105996, 306964, 11158, -82341, 132083, 456089, 25050, -148907, 172943, 309849, -322973, 208990, -197614, 286121, 95680, -8284, -106601, 203498, 258346, 259608, 29328, 203064, 178925, 414723, 134677, 289089, 357819, 195119, 31767, 281447, 319018, 157958, 47356, 538125, 197281, 17520, 270503, 518465, 39874, 136919, 260612, 87051, 228978, 254106, -234107, 83305, 175407, 271560]
12202B71560R7753k7847d1661H8465j5029J26064a6321C07617o0780g9204B32392
12190A94505F9986K05117A28965N5737L6164G1561R9586g1481D0606K4601R6453
12179A61660l5831K6105L1933P7053a97844B10591K12385A19166D2264J67897
12169B10161H7699J86139g581A68902A2127a34859B62823a37541B51174b01717
12158I7101f5598m5021B10284c7325C12259F8786C0665L14280C3565J81674J831
12147B17070H5084M7847J44748F6647a20528A05819h6880m5706I4210a23397B14850
12135i7294q9879D4695J759K1300B676c5682p7615q4314A1024R2522k6828j9959
12123E6759J1222a70323J1357m443J8137o6833Q4692l4458d8027B6348J63783
$$ y = [271560, 369313, 341466, -41661, 88465, 73436, 199500, -16321, 307617, 246837, -79204, 232392, 194505, 69986, 275103, 128965, 184702, 220866, 71561, 171147, -71481, 40606, 65207, 161660, 125829, 151934, 183867, 260920, -197844, 210591, 422976, 119166, 42264, 210161, 87699, 273838, -7581, 168902, 12127, -134859, 262823, -137541, 251174, -201717, 97101, -65598, -110619, 210284, -37325, 312259, 68786, 30665, 344945, 33565, 215239, 217070, 85084, 132931, 277679, 66647, -120528, 105819, -86880, -132586, 94210, -123397, 214850, -97294, -187173, 44695, 46454, 67754, 2676, -35682, -113297, -197611, 11024, 103546, 76718, 56759, 67981, -170323, -158966, -163409, -145272, -212105, -127413, -161871, -48027, 26348, 190131]
12112A90131m1603b0719B43815A16876a25765A89483K35060a68039O6128o5608
12102a67519M9696l1306A02808e0113A07009R7449d42656a28311l56516a05279
12091A04186i6467j00697H664b4844C5382j2200b56798M7558R1480l3033H6501
12079E8622M1306a23355B33773J59068J265643M09620H51344l43279k48849k2203
12069B37013b1787B3030a56477O3518A13037N8479a71143D4327N0725K3117a0876
12057b4562A34336a22463F2569K00628q5508e0674A43045j3060I77i6469b1165
12045B882J07554J08616b1643A31870b0138A71997a51501j04926B6690a33816
12034E4137J35243a742j28205A44935e9092A42186F0377e6785k7541r7622M0566
$$ y = [190131, 148528, -20719, 243815, 116876, -125765, 189483, 424543, -168039, -101911, -167519, -117823, -149129, 102808, -50113, 107009, 204458, -442656, -128311, -484827, -105279, 104186, -96467, -197164, 8664, -24844, 35382, 23182, -256798, -209240, -117760, -150793, 86501, 58622, 99928, -123355, 233773, 392841, 1658484, 2068104, 851344, 508065, 259216, 237013, -21787, 23030, -156477, -92959, 113037, 171516, -171143, 44327, 95052, 118169, -10876, -24562, 134336, -122463, 62569, 263197, 177689, -50674, 143045, 129985, 977, -96469, -21165, 2882, 110436, 219052, -21643, 131870, -20138, 171997, -151501, -256427, 26690, -133816, 54137, 189380, -1742, -129947, 144935, -59092, 142186, 60377, -56785, -84326, -181948, -141382]
12023a41382j22739G8787g782B76402h2864N649I8988l075C6382Q0657f2731A50259
12010A32757c3324G6935a63607j08381b5804o1415m8924j22259M2568B79393A25807
11998a2567l04471D9958B4866R6334e0158A278c20353J06922K6406j35318A15609
11986A32098a79889f2004D5706k914N5331i435k34851K7652i1923J1221A55651
11974A03853a50636C8449J84210p2637a17032J1641H6554h1074n2241q5237e7430
11962c2869k76425A21883m8333c74435a17200A02254c3188j67167B719J30918
11952A33637R3124p8540m9809b64924A98864F6264b80104F6647i7106A43489a42221
11940B33182b2776j88232L6356j37139A98251a9786I9979d272j26013m274j0564
$$ y = [-141382, -264121, 78787, -7782, 276402, -82864, -77215, 98988, 95913, 36382, 117039, -62731, 150259, 132757, -33324, 76935, -163607, -271988, -25804, -87219, -136143, -258402, -215834, 279393, 125807, -12567, -317038, 49958, 24866, 121200, -50158, 1278, -320353, -213431, -187025, -322343, 115609, 132098, -179889, -62004, 45706, 42792, 98123, -9435, -244286, -216634, -91923, -80702, 155651, 103853, -150636, 38449, 222659, 150022, -117032, -105391, 86554, -81074, -133315, -218552, -57430, -32869, -309294, 121883, 73550, -374435, -117200, 102254, -33188, -200355, 2719, 133637, 226761, 148221, 98412, -264924, 198864, 66264, -280104, 66647, -97106, 143489, -142221, 233182, -22776, -211008, -174652, -311791, 198251, -19786, 99979, -4272, -130285, -134559, -145123]
11929a45123F707i2634c3146A99588a30697b7620B0284J2790O7485i2618K7072
11918f5546j50759D4588a55350B12942i0578q0962A54699L54961a86121G1323
11907A20217a34695j67068I9705K621e541B69501n5810c27447P8872C04451A6402
11895a26408A7155P3603a31223j8165A02827B6893K1393B3267b64672k05136B9770
11883a33532A67806E5843J45722a18584j32083B2493a03602B04146d59000A80125
11872c14225D25680b97862J36475j68920d5822A1515b18140C748h9914I4377a17025
11860b61166d5920C9843i8769C38386F9516b906B4748J81993a80835F1708Q8868
11849A50576p0708d91742A07337c5022E4386a44598K7808A07659J69162a47624
$$ y = [-145123, 6707, -92634, -33146, 199588, -130697, -27620, 20284, 33074, 100559, -92618, -65546, -216305, 44588, -155350, 212942, -90578, -171540, 154699, 509660, -186121, 71323, 120217, -134695, -301763, 99705, 102326, -5541, 269501, 213691, -327447, -248575, 304451, 16402, -126408, 17155, 90758, -131223, -149388, 102827, 26893, 48286, 23267, -264672, -469808, 29770, -133532, 167806, 55843, 201565, -118584, -250667, 22493, -103602, 204146, -459000, 180125, -314225, 425680, -297862, -161387, -330307, -45822, 11515, -218140, 3748, -89914, 94377, -117025, -261166, -45920, 39843, -98769, 338386, 69516, -2906, 24748, 206741, -180835, 61708, 150576, 79868, -491742, 107337, -35022, 54386, -144598, -116790, 107659, 276821, -147624]
11838a04333M0507o697A41642D7160J7237A3669e5306F8451b01336K6200I0369
11826I7316b68836g2216B08085m0811J48679c27468a63059A93365B5868L26415
11816C52283c20242F7536c638j02657D8984c21948A2803d1035B3698g190B05351
11804a15400L384B55178e6598k27902j55504G8976g7414j30390P8522H1744g5959
11792E6967B5427a08027A01257J69835p8172K037I4516a80494A49073C1708h9794
11780B32524c63682J13542C1867h967r7124D3253K57938b17322D7763p409h4672
11768e5396A6220c04899A35128h1920I6270a40912j0711a3431H8842h7247j95915
11757b83162J17399f3191l04061R0214A12908c1697i463k25954A18312g3217K6357
$$ y = [-104333, -63826, -70523, 141642, 47160, 64397, 13669, -55306, 68451, -201336, -175136, 90369, 97316, -268836, -72216, 208085, 167274, 315953, -327468, -163059, 193365, 25868, 352283, -320242, 67536, -3638, -106295, 48984, -321948, 12803, -41035, 23698, -7190, 205351, -115400, -112016, 255178, -56598, -284500, -440004, 78976, -77414, -207804, -129282, 81744, -75959, 56967, 25427, -108027, 101257, 271092, 192920, 194957, 94516, -180494, 149073, 31708, -89794, 232524, -363682, -250140, 31867, -8967, -106091, 43253, 301191, -217322, 47763, 40354, -84672, -55396, 16220, -304899, 135128, -81920, 96270, -140912, -151623, -13431, 88842, -87247, -283162, -165763, -63191, -367252, -277038, 112908, -31697, -9463, -235417, 118312, -73217, -46860]
11746d6860D7473c86982c5191r079C4752j5230L1862K2600a00072B00239a05155
11734A67427i1221M1716j6998r5827A08499a91550R5257B1075a91748M1988n4854
11723b04614i4576L6414F9842J01272a62965k65899C19195c86q4820A32112a80221
11711B9135J65982L3599a57647I6006M2848P7340n5555a26112B07320I9665D9378
11699f416A16682b0717A58062d9385o072A61679a12673h753A62238o2932K47634
11688C46940j22513I254J37417L08240a49642L4463A93260p2019a25873B08867
11677A58570a77160A6115J4321L1594Q5201b88391C31010j32369n8151a84268
11666F0440J70272b8823H9044a79369g8354j8415F0875a69199P6842J3976A12281
$$ y = [-46860, 47473, -386982, -35191, -44270, 34752, 19522, 51384, 73984, -100072, 200239, -105155, 167427, -91221, -49505, -66503, -162330, 108499, -191550, -96293, 21075, -191748, -149760, -204614, -94576, -58162, 69842, 171114, -162965, -428864, 319195, -386, -85206, 132112, -180221, 29135, 195117, 228716, -157647, 96006, 138854, 216194, 160639, -126112, 207320, 99665, 49378, -6416, 116682, -20717, 158062, -49385, -55457, 161679, -112673, -8753, 162238, 99306, 346940, 224427, 9254, 146671, 454911, -149642, -115179, 193260, 121241, -125873, 208867, 158570, -177160, 16115, 30436, 62030, 147231, -288391, 331010, 198641, 140490, -184268, 60440, 230712, -28823, 89044, -179369, -78354, -96769, 60875, -169199, -92357, -78381, 112281]
11654B41419b1746A49368m9154O121N6256b5010a1461C2122P5416J84859e13939
11642c54418a31400a6685P50E7880f9626B83877a64149b6249C1369b28836d0729
11630G0390A3711J66069j3126O7574d9317j98899g2995B15078H3436e4048B15450
11618c35812A09407P5118R4649G8344J8653C8100a16570G9507Q386b46550i7457
11606a08969H8302j7384p128j724d3747B32074H1782a8100j08032C25040F6177
11594A1387a51156A43329c30048d49A87366f8815A90465D2570j4533J63245L31876
11583E23158a7322r1896B55592F1612l11h6168A03348h1B5869o83K27893I868
11570B7969a87109k4298A10663J13377e0306H7983C4148b9593D28412C0885K90399
$$ y = [241419, -21746, 149368, 100214, 106335, 162591, -25010, -11461, 32122, 107538, 292397, -513939, -354418, -131400, -16685, -15935, 57880, -69626, 283877, -164149, -26249, 31369, -228836, -40729, 70390, 13711, 179780, 166654, 234228, -49317, -248216, -72995, 215078, 83436, -54048, 215450, -335812, 109407, 184525, 279174, 78344, 96997, 38100, -116570, 79507, 87893, -246550, -97457, -108969, 88302, 70918, 63790, 62066, -43747, 232074, 81782, -18100, -126132, 325040, 66177, 11387, -151156, 143329, -330048, -449, 187366, -68815, 190465, 42570, 28037, 191282, 523158, -17322, -109218, 255592, 61612, 61301, -86168, 103348, -81, 25869, 25186, 253079, 9868, 27969, -187109, -211407, 110663, 224040, -50306, 87983, 34148, -29593, 428412, 30885, 321284]
11559C21284j16795d339A78204K38736q3018b31882e7042A83057f7414k50172
11549c17586B16296H2947J59451m2745J27a18399A87983O269o7988R0847g0275
11537a34952F7728j3837L3449a32489F9507K70909C2681P546J1124b39544B13777
11525E5882L784J73030r1132C7373h7518A76960q4311e2968B11435J06009K2503
11514C39947A2699Q0424h3989A95268r3232a21157A49058K03982B346a5496j35626
11503a51122B51551i8237A02306J2749K36457H6519c2664C86134A20918L69027
11493D89945A37513a90473E7258J24043J1899a72577A2302e6020A12748D1221
11482B35183o6133R647e2612P472C33848B9609L1254j7758K21928q5315K08076
$$ y = [321284, 204489, -4339, 178204, 416940, 333922, -231882, -57042, 183057, -67414, -317586, 216296, 82947, 242398, 199653, 199780, -118399, 187983, 194252, 126264, 217111, -70275, -134952, 67728, 53891, 87340, -132489, 69507, 340416, 32681, 40227, 51351, -239544, 213777, 55882, 59666, 232696, 141564, 37373, -87518, 176960, 92649, -52968, 211435, 317444, 339947, 12699, 93123, -83989, 195268, 102036, -121157, 149058, 353040, 2346, -15496, -151122, 251551, -98237, 102306, 115055, 351512, 86519, -32664, 386134, 120918, 489945, 137513, -190473, 57258, 181301, 193200, -172577, 12302, -56020, 112748, 41221, 235183, 169050, 178697, -52612, -45140, 333848, 29609, 60863, 43105, 265033, 179718, 387794]
11471C87794h3736D43263A69638F2772J06303K23601A76410f520B93364P137N6510
11460C57011j65749H3795b0513B36552g161D5954K2505K2565K6118K5181N7551
11449A99874Q4730b40505J15310b6926r3617A88340I0890J40701G4956a42445
11438F8950b24442A55335o0957b04690D86646A85370J08960q5772f5078A14131
11427G116d2830f831A02304a18045H1156b9500o1865c314n0896F5791J79174G5912
11414i0084A1091O0780B0677J92546A3741i7541B67315A07490j317b63993H4243
11402A811J17030b29085Q5569H6694h1310r5096H9600b76057C0421a27513M7121
11391h0392o7819j21650j9649E5016a53966l2430A26296C3463L825R332J62700
$$ y = [387794, -83736, 443263, 169638, 62772, 169075, 392676, 176410, -6520, 293364, 300501, 357011, 191262, 83795, -20513, 236552, -7161, 45954, 68459, 91024, 117142, 142323, 199874, 284604, -240505, -125195, -26926, -120543, 188340, 90890, 231591, 74956, -142445, 68950, -224442, 155335, 94378, -204690, 486646, 185370, 294330, 208558, -65078, 114131, 7116, -42830, -6831, 102304, -118045, 81156, -29500, -91365, -3314, -54210, 65791, 244965, 75912, -90084, 11091, 71871, 20677, 213223, 13741, -97541, 267315, 107490, 106173, -263993, 84243, 1811, 118841, -229085, -143516, 86694, -81310, -176406, 89600, -276057, 30421, -127513, -80392, -148211, -269861, -289510, 55016, -153966, -186396, 126296, 33463, 37288, 46620, 209320]
11380B09320o6874N8895l306L48637h829E3964e9842b8066A64702h7887A57914
11368D35851b85276I7378b19043N9539A71075a76531a8632A69787a38997d0339
11357A34145a98065B49160b59710C9104d35515A55976a9535j46159B03175d3750
11346b4551j53162j20208a28310C17533g3230E5121J82981n4608j9972p5567Q292
11335I6247O1230c575E4592d145C782J79677a10056A9021h9442j23044C28695
11323E5678R3299F8743K01480C6203b22389p1417h8664j8534A14230M735E2467
11311d5740C32365b1100A9263J35867a72828a5157q1001n4799r0270J3546J08865
11300a18816c0970k84446g5546B42254F1038b91305k01546g4764j6893k32598
$$ y = [209320, 142446, 201341, 198035, 546672, -8829, 53964, -59842, -28066, 164702, -87887, 157914, 435851, -285276, 97378, -219043, -159504, 171075, -176531, -18632, 169787, -138997, -40339, 134145, -198065, 249160, -259710, 39104, -435515, 155976, -19535, -165694, 203175, -43750, -24551, -177713, -297921, -128310, 317533, -73230, 55121, 238102, 183494, 163522, 87955, 96247, 157477, -3575, 54592, -4145, 3782, 183459, -110056, 19021, -89442, -212486, 328695, 55678, 148977, 68743, 270223, 36203, -222389, -293806, -88664, -107198, 114230, 118965, 52467, -45740, 332365, -21100, 19263, 155130, -172828, -15157, -96158, -150957, -241227, -227681, -118816, -30970, -315416, -75546, 242254, 61038, -291305, -492851, -74764, -91657, -324255]
11290c24255a11472E9660B246Q0642c087B6916j2473K749b19471r6228I669a7092
11277a86A74514K1151I6509b66522B3163L00992E6195k783a84896l0364c2584
11265i9467A11534B4895K67913i6269A40436c5446A61499b85706f0484a6957C63037
11253A13724n2876a75614A15677h7092A54167b45955d3625l1051j9542k75988
11243c70206d5561C8159a62816a680j7106B22188a15715F0811b1223k92178A36093
11231F8685h7409C47910j62988b10036C7136l68N2082k7396g8398A31060b35002
11219b36894k3655E0930a13978j33326m1837b0406j20675j64224b5787q0291o2708
11208a68786C63764F9259K5282a20820D5360K24586a17773a5354j53640C09864
$$ y = [-324255, -111472, 59660, 2246, 82888, -3087, 26916, 14443, 17192, -219471, -315699, 9669, -17092, -186, 174514, 195665, 96509, -266522, 23163, 324155, 56195, 53412, -184896, -215260, -32584, -99467, 111534, 24895, 292808, -96269, 140436, -35446, 161499, -285706, -60484, -16957, 363037, 113724, 60848, -175614, 115677, -87092, 154167, -245955, -43625, -74676, -94218, -370206, -45561, 38159, -162816, -1680, -18786, 222188, -115715, 60811, -21223, -313401, 136093, 68685, -87409, 347910, 184922, -210036, 37136, 36768, 88850, 61454, -78398, 131060, -235002, -236894, -260549, 50930, -113978, -247304, -289141, -20406, -141081, -305305, -25787, -106078, -168786, 363764, 69259, 94541, -120820, 45360, 269946, -117773, -15354, -168994, 309864]
11197I8459K49357i8611d4839A00574J36679l4074a54075e2929k07943a17616
11186C1351c5412A32419a30019a296C3074J04145E9853g3927A18618a84861B28991
11174a37857a1852j15883B3943b15812J00934j84432D0773g3538r8297A36092
11163A1685c01194a44857j59866B54192J4887a87622A01273M9429o0028a29936
11152i0665B4336g0833C9744d9630j05210a7981l00621a01260A78905d3488j362
11141d4850J7688j25197b8185l19986D49428b12035d0641A47482a21922d5818
11130a18538B7927f0071l43447c9280j98388D0624O7071j7424L04179j45846A24145
11118a38508m2836M8314K5581B08389J94322i435F9494J66862K13951E872a27876
$$ y = [98459, 347816, -98611, -44839, 100574, 237253, 203179, -154075, -52929, -260872, -117616, 31351, -35412, 132419, -130019, -1296, 33074, 137219, 59853, -73927, 118618, -184861, 228991, -137857, -11852, -127735, 23943, -215812, -114878, -299310, 40773, -73538, -171835, 136092, 11685, -301194, -144857, -304723, 254192, 269079, -187622, 101273, 150702, 90674, -129936, -90665, 24336, -70833, 39744, -49630, -154840, -17981, -318602, -101260, 178905, -43488, -44850, -27162, -152359, -28185, -348171, 449428, -212035, -40641, 147482, -121922, -45818, -118538, 27927, -60071, -403518, -39280, -237668, 40624, 107695, 90271, 394450, 248604, 124145, -138508, -181344, -133030, -107449, 208389, 402711, -9435, 69494, 236356, 450307, 5872, -127876]
11106f2126B40855J36138j86852P1984K196A21303L49802r4483a06828D59404
11095f1035o0824A1333K84887q5146q1655E1306K43938Q7595I0372K28736I4824
11083B32810j06931b6521B6544O43514A48656D1647K29204R4714J68574k06514
11073C27625D6574K43655j42231o6225M8149R5045M0875J01469J09667P9325k3137
11062E33166L6147J15970l08971K05909K92953j76230j28891K09765J27018l83162
11052E23674K29293N4008N4402j04393p701l0365K01684j70466J57012k23749
11042F83399R555K8855L8444j06101J02189K54365J3704o0996l02882M3631J35084
11031H39247l00412N4556M20J70681K042O7720M9429k18791J69834j62653M75713
$$ y = [-62126, 240855, 376993, 190141, 262125, 264321, 121303, 471105, 376622, -106828, 459404, -61035, -121859, 11333, 296220, 211074, 129419, 51306, 295244, 382839, 90372, 319108, 94824, 232810, 125879, -26521, 26544, 670058, 148656, 41647, 270851, 365565, 534139, 327625, 46574, 290229, 147998, 81773, 129922, 224967, 265842, 367311, 476978, 556303, 533166, 569313, 685283, 376312, 582221, 875174, 698944, 570053, 779818, 906836, 523674, 752967, 806975, 861377, 756984, 749283, 718918, 920602, 750136, 907148, 683399, 692954, 721809, 760253, 654152, 756341, 1010706, 1024410, 963414, 660532, 704163, 839247, 538835, 593391, 593811, 764492, 766534, 834254, 883683, 664892, 834726, 672073, 1147786]
11020A147786C38905J76913R4049A98400M20393p104J26708m4220m2605J56053
11010H07625B98471L68275p0372p1400K35359o6033j06274J45784P6105j47086
11000F62829j26063M08304l92116J68427J08771B68409M80055C21279M24785J11974
10990H58038K04210l39454J44814r2903j69796J32469L72650j61059K35594M33287
10980A617850o43725L97678n5363M87633J5227L31753N19747K74511k82136N80191
10970C243366j20256R2215q83154L04578m30496j46343j547l47808p2005K3425
10960A661975m8381J4826P20030p51412J80823N0055q5373j95918l35404l7458
10950A173763k58631k85160C11832J35232A58809p2969J33352j3251O3395B7555
$$ y = [1147786, 338905, 515818, 609867, 198400, 618793, 611689, 738397, 694177, 651572, 807625, 298471, 666746, 596374, 524974, 760333, 694300, 588026, 733810, 809915, 662829, 536766, 945070, 552954, 721381, 830152, 268409, 748464, 321279, 746064, 858038, 1062248, 722794, 867608, 774705, 604909, 737378, 1110028, 948969, 1184563, 1617850, 974125, 1371803, 1316440, 1804073, 1819300, 2151053, 2670800, 2945311, 2663175, 3243366, 3123110, 3215325, 2332171, 2636749, 2206253, 2059910, 2058363, 1710555, 1638550, 1661975, 1613594, 1628420, 2348450, 1597038, 1777861, 1827916, 1742543, 1546625, 1211221, 1173763, 915132, 629972, 311832, 447064, 158809, 85840, 219192, 205941, 269336, 27555]
10939B83101B0575M05462A69205a35026I7692e259C94070g4205B47694H8450K13913
10928C02363a168j26392B9184a1776A43020f8123C27613A57528D4037c1910k17659
10917b49569J14868A503L4655l581g8074B43360A2987a40985I921b67153b4835
10905B03352E7821k3717K18769k228c09978B54277R6341C4045a80237J6615d1555
10893d0498l75988H6473c23762a8677B83822a31143K1618j96099A40077g1772
10882D4499P2025J577R3283A05230C2641b634j0175A47883c68155C93522H3233
10870A25164a31484q5738F745f4554G3552j7059O7435A1209O8451k8431L70009
10859D21238b77660B73391b48603E7584a43177H3137P158J17077b31069J01083
$$ y = [283101, 20575, 426037, 169205, -135026, 97692, -5259, 394070, -74205, 247694, 88450, 302363, -1168, -127560, 29184, -11776, 143020, -68123, 327613, 157528, 44037, -31910, -249569, -134701, 1503, 36158, 32577, -78074, 243360, 12987, -140985, 9921, -267153, -24835, 203352, 57821, 34104, 252873, 250645, -309978, 254277, 350618, 34045, -180237, -163622, -41555, -40498, -416486, 86473, -323762, -18677, 283822, -131143, -109525, -305624, 140077, -71772, 44499, 116524, 118101, 211384, 105230, 32641, -2634, -12809, 147883, -368155, 393522, 83233, 125164, -131484, -217222, 6745, -64554, 73552, 56493, 123928, 11209, 79660, 51229, 421238, -277660, 273391, -248603, 57584, -143177, 83137, 90295, 207372, -231069, -129986]
10849a29986C8949N001J68192b68766C0614J85209f1826b2749j50827k83135F5623
10837B7484f4913A21396f6924K0844l1444A9873J60033a99583f7528r7713I5401
10825a54766A48836d6111o4985B7165a11223j84219a43566D9770a94802I9511
10814a84614D14170d7392j94168B3205N06J26066a08835B6811a84701A55727a80798
10802g5679A63002o1489J00090b476k60442A75519k0063h0036B61325C8669e82
10790I2318e0358k29095B47394D0820N0312O5787b59501d1169k19154J03194m4051
10779b01180q9311J28156f6574B73858b87368a3712E4290b13373R3865c2736C78650
10767a94281B6106K28623c1117j2549B44069c8900M140k442C49927B3093f7429
$$ y = [-129986, 38949, 43950, 212142, -268766, 30614, 215823, -61826, -22749, -173576, -456711, 65623, 27484, -64913, 121396, -66924, -46080, -77524, 19873, 179906, -199583, -67528, -165241, 95401, -154766, 148836, -46111, -111096, 27165, -111223, -295442, -143566, 49770, -194802, 99511, -184614, 414170, -47392, -241560, 23205, 23711, 149777, -108835, 26811, -184701, 155727, -180798, -75679, 163002, 101513, 201603, -2476, -262918, 175519, 155456, -80036, 261325, 38669, -582, 92318, -50358, -279453, 247394, 40820, 91132, 156919, -259501, -41169, -260323, -157129, -201180, -290491, -162335, -66574, 273858, -287368, -13712, 54290, -213373, -119508, -32736, 378650, -194281, 26106, 254729, -31117, -43666, 244069, -38900, -34760, -37202, 349927, 23093, -67429]
10755I6809j5507k1556a8971A02801a69588A84540a46023N6100I5962m515J29780
10744B21227a41438j47830C65825G363i1507m7188n8932j06871d5586k38683a2301
10732f4188R42E0396a22549I1289c4055k77954H1148Q2134l2270a46100a4174
10720b99943p3027A89630a1518j81368D4461L425K13416g9504F2969L1877D4538
10708b22176A3619c45722e6237A10755J23186a55683A1075n028M6302a19094o6059
10697a85153f8510b6573D27275A12124C6661R3814a58670l16557K29645I341h2932
10685a76162N548H947a70274p8735I9276J71809j23181d73660E8986a67286L619
10674a63667B13851E4324M2412N463I392b29782E6246R8629b57599J26478q9443
$$ y = [96809, 81302, 59746, -18971, 102801, -169588, 184540, -146023, -89923, 95962, 91447, 221227, -141438, -289268, 365825, 7363, -91507, -138695, -197627, -304498, -45586, -284269, -12301, -64188, -63246, 50396, -122549, 91289, -34055, -312009, 81148, 163282, 131012, -146100, -14174, -299943, -372970, 189630, -11518, -192886, 44461, 47886, 261302, -79504, 62969, 94846, 44538, -222176, 13619, -345722, -56237, 110755, 233941, -155683, 11075, 6047, 52349, -119094, -185153, -68510, -26573, 427275, 112124, 36661, 130475, -158670, -475227, -245582, 9341, -82932, -176162, -170614, 8947, -170274, -249009, 99276, 271085, 147904, -473660, 58986, -167286, -163667, 213851, 54324, 96736, 102199, 9392, -229782, 56246, 154875, -257599, -131121, -220564]
10663b20564O3325A38442b71899C7518A4359i7647L1284j9912J4470j69599m3508
10652b84912L2445a9181j17443B0008J71318J8457b99647g594A87782b73338G9831
10640B99105j21823A1689J92369b38A23382b61907B04075H2163A7145b67847J09741
10629a58106M5934C7151c0226g052l20602d1476J3790C508b13491k0947C65365
10617f4771L1715E404a81811B64309p8867c58589h6527M2358A37322M2831a13754
10605a01372A3974a1637r1851A29742j9935a20407j8256j60033a0075l79970D1252
10593b93415A94909b25293i8987J8342j1057p1353H0209b50073C6217a13056a5050
10581b69106c8474o8289H9898d7623A83563a32727d7721B69073a51862M5537j64146
$$ y = [-220564, -157239, 138442, -271899, 37518, 14359, -97647, -66363, -86275, -71805, -241404, -284912, -252467, -19181, -136624, 20008, 191326, 209783, -299647, -7594, 187782, -273338, 79831, 299105, 177282, 11689, 204058, -238, 123382, -261907, 204075, 82163, 17145, -267847, -158106, -112172, 37151, -30226, -7052, -327654, -41476, -27686, 3508, -213491, -234438, 365365, -64771, -33056, 5404, -181811, 264309, 185442, -358589, -86527, -44169, 137322, 180153, -113754, -101372, 13974, -11637, -103488, 129742, 109807, -120407, -138663, -298696, -10075, -390045, 41252, -293415, 194909, -225293, -98987, -80645, -91702, -163055, 80209, -250073, 36217, -113056, -15050, -269106, -38474, -106763, 89898, -47623, 183563, -132727, -47721, 269073, -151862, -106325, -270471]
10570b70471a05235I6508m6782R4243a75798D9768e7289k8968B11689a82274h7115
10558a72642r7118n8501p0867J32404J25467A28394e3706A18308H156a95103j41975
10547c37078a45654B5850c70193g6214F9086L4264i7518H0730a66833a5592j78242
10536a93834B77996A08440G019a411E1431A4479J21813a7834k55109A9248K5308
10525D4556b34594F5314L24119A67978b93006j66553a99102h3098Q861c5026A25706
10513c10807J42136A12811m3405h6421j04911A43788b58431A30841a37472O3332
10503g4140m5646A64258a60907j67028J33629h2095A2686d119A14007d3866C954
10491A37814R4713a59235E183J14438a34857q8306m4969e6122G5130J65289J62492
$$ y = [-270471, -105235, 96508, 49726, 143969, -175798, 49768, -57289, -86257, 211689, -182274, -87115, -172642, -269760, -328261, -399128, -266724, -141257, 128394, -53706, 118308, 8156, -195103, -337078, -145654, 25850, -370193, -76214, 69086, 103350, -97518, 80730, -166833, -15592, -193834, 277996, 108440, 7019, -1411, 51431, 14479, 136292, -17834, -272943, 19248, 44556, -234594, 65314, 389433, 167978, -293006, -459559, -199102, -83098, -74237, -35026, 125706, -310807, -168671, 112811, 69406, -86421, -191332, 143788, -258431, 130841, -137472, -74140, -119786, 164258, -160907, -327935, -194306, -82095, 12686, -4119, 114007, -43866, 3954, 137814, 232527, -159235, 5183, 119621, -134857, -223163, -268132, -56122, 75130, 240419, 402911]
10480D02911J23543n7893m2660F597J48015K9169K63619n1160g9084A60009h9554
10468G9384a24563B35747j00466a515G1749B9191a67527D3704b3360q800B6370
10456i7760j3691A04050e7685B57590g6793j40977C98727A64546J80474c03460
10445c06925a209k32619A10014k2123A329J15386a08171A42285E3860i3620B02533
10433b03331g4445A71268l475A1832e9689A06050l6473L6773a20391j46533c8546
10421D7900e1791C61160a92711A15146Q5499c11014a5092m53107D2727L88553
10411D31280i7196B31865A13432m5325c01191a17551H027a43407p8443j1678A43789
10399a96693q2329B66387E6034A3987a72797A64651o2911K85709A27537L03531
$$ y = [402911, 526454, 468561, 425901, 6597, 154612, 183781, 447400, 396240, -79084, 160009, -89554, 79384, -124563, 235747, 135281, -1515, 71749, 29191, -167527, 43704, -23360, -32160, 26370, -97760, -111451, 104050, -57685, 257590, -76793, -217770, 398727, 164546, 345020, -303460, -306925, -1209, -233828, 110014, 87891, 1329, 116715, -108171, 142285, 53860, -93620, 202533, -203331, -74445, 171268, 167793, 11832, -59689, 106050, 69577, 106350, -120391, -266924, -38546, 47900, -51791, 361160, -192711, 115146, 200645, -311014, -15092, -468199, 42727, 431280, -97196, 231865, 113432, 68107, -301191, -117551, 8027, -143407, -221850, -233528, 143789, -196693, -279022, 266387, 56034, 13987, -172797, 164651, 101740, 387449, 127537, 431068]
10389D31068C8444g001j40547j0709A78929a99786A46494N670k7256P1235K06551
10378D02694j62424N6160J20361j24982m7033D5183J74575Q4352H3654L39821
10368D23475I5047L87829j10577l7913K13112r6750K44238k15216B8175K93096
10358C21271D4748B1179H157J13808J41405L18046F7920M19436R2333p1712A93762
10346A11383J20281C6038K9522L15595d5942B97025b0112A78960K9618Q8669j35079
10335A62168L63274A69436b6816B90507i6407A76003b25569J03655B09650J6083
10325B25733o5735a95380B06135J83821O3640p8310A54731a80456B16096E4261
10314C21256I2685L69282C9437Q8065a52429m7122c3454A58313M0731J0693H0764
$$ y = [431068, 38444, -7001, -147548, -158257, 178929, -199786, 146494, 152164, 124908, 196143, 402694, 240270, 296430, 416791, 291809, 244776, 45183, 219758, 304110, 83654, 423475, 95047, 482876, 372299, 334386, 547498, 450748, 694986, 479770, 28175, 321271, 44748, 21179, 8157, 121965, 263370, 581416, 67920, 487356, 579689, 507977, 193762, 111383, 231664, 36038, 65560, 381155, -45942, 297025, -20112, 178960, 208578, 297247, 162168, 525442, 169436, -26816, 290507, -96407, 176003, -225569, -121914, 209650, 225733, 159998, -195380, 206135, 389956, 453596, 375286, 154731, -180456, 216096, 54261, 321256, 92685, 461967, 39437, 127502, -152429, -199551, -33454, 158313, 199044, 209737, 80764]
10302c02348h9283B12816K8192g081k57269B35280j14425r264C1838g5767C17804
10290a99876C62649b6068l5751l1423k25498B0500Q148b35972I8852b87675H3740
10278b93380Q4812k22274h477o3497A86024i0441C0359G546e8398l7837E8475
10266g0445H0246b16395j53080D2480A5909a73657A59110p5602K42877A12524
10255A78306G2788J01032P4285F4509c25332B57350j13698K25798a91280A49697
10244A3910J39085K1048K4565c31206K0698H6356b81101I7314C1959a56320B49573
10232f3525C65645b40258K7659E9689J48892b0344j21550c0851A73695e1019j80805
10221b31824J01735j6792K4503j38534j50036J94796k40298J98936A20208e1611
$$ y = [-302348, -89283, 212816, 241008, -7081, -264350, 235280, 120855, 111591, 31838, -75767, 317804, -199876, 362649, -26068, -61819, -93242, -318740, 20500, 28648, -235972, 98852, -287675, 83740, -293380, -208568, -430842, -8477, -71974, 186024, -90441, 30359, 7546, -58398, -96235, 58475, -70445, 80246, -216395, -369475, 42480, 15909, -173657, 159110, 83508, 326385, 112524, 178306, 72788, 173820, 248105, 64509, -325332, 257350, 143652, 369450, -191280, 149697, 13910, 152995, 174043, 198608, -331206, -310508, 86356, -281101, 97314, 31959, -156320, 249573, -63525, 365645, -240258, -212599, 59689, 208581, -20344, -141894, -30851, 173695, -51019, -231824, -130089, -146881, -122378, -260912, -410948, -216152, -456450, -257514, 120208, -51611]
10210a48881C6365J4195b66625j37029A10620i3154n1195j24723l5218C48809
10199E6729a66016C54863b5459A86490d91009J03212L4407D8414a17884B29001
10188b14907G3850a26846M640n5422c5637A45159F7135a30473l5115k4090A70
10176a60027A3289d4482m9088I2575B0669P3273a00162A95977a14605j05667J1632
10165b08640A67798h8519a9489l51588h6010e090H5368J69208B9384c34231A85793
10153a59816A41853a9363q6424j87988e7615q1464j1411A89420i3285c1317k47087
10142b78404A08174c45923B49343E3750g2588A25157D5417e9549B3675J44179
10132A67854N9528a01486j31627j27946J15776E5270a62736c4522B37352G6102
$$ y = [-148881, 36365, 50560, -266625, -403654, 110620, -93154, -144349, -269072, -304290, 348809, 56729, -166016, 354863, -25459, 186490, -491009, -387797, -353390, 48414, -117884, 229001, -214907, 73850, -126846, -122206, -177628, -35637, 145159, 67135, -130473, -165588, -189678, 170, -160027, 13289, -44482, -93570, 92575, 20669, 93942, -100162, 195977, -114605, -220272, -208640, 167798, -88519, -19489, -371077, -86010, -5090, 85368, 254576, 29384, -334231, 185793, -159816, 141853, -19363, -105787, -293775, -57615, -139079, -150490, 189420, -93285, -31317, -278404, 108174, -345923, 249343, 53750, -72588, 125157, 45417, -59549, 23675, 167854, 227382, -101486, -233113, -361059, -245283, 55270, -162736, -34522, 237352, 76102]
10121b0679j94366h8688M2513j53262E8135b5993B306P1928a13822J4704j86485
10110b85603m9800B12224H9310b05031k9442E1544J97507b32417M6760H342P7885
10099H6227i0689E8133d2439j36583A95479a51413A05318B0416M866a50189e8773
10087c8225B02281b8808B17044e7588j55704A11820A1045d0407N731j3274n5860
10076a03810d140j62665f2682j1727j08662C00900E3981e5886A21398c30220h9605
10064a2887j05152C1120K16821f5534L0761C9953a27905b1731q2652k09406a53079
10052b15599p4419c7804q7436A62245a49647G5397b1355D3865a47741R209E9560
10040C138a05252a2048o4824m0263C04139r7152a35237J0642j7260c9085n7726
$$ y = [-20679, -215045, -88688, -46175, -199437, 58135, -25993, 2306, 74234, -113822, -99118, -285603, -335403, 212224, 89310, -205031, -234473, 51544, 249051, -232417, -185657, 8342, 86227, -90689, 58133, -42439, -179022, 195479, -151413, 105318, 20416, 25282, -150189, -58773, -38225, 202281, -28808, 217044, -57588, -213292, 111820, 11045, -40407, -34676, -47950, -103810, -4140, -166805, -62682, -74409, -183071, 300900, 53981, -55886, 121398, -330220, -89605, -12887, -118039, 31120, 247941, -65534, -34773, 39953, -127905, -21731, -104383, -313789, -153079, -215599, -290018, -37804, -125240, 162245, -149647, 75397, -21355, 43865, -147741, -138532, 59560, 3138, -105252, -12048, -76872, -117135, 304139, 206987, -135237, -124595, -141855, -39085, -96811]
10029i6811k02222j05646A09946d69066C20462b34571A77613a44376C0384D158
10018a08582C74020A01715a3156o15513a8745k09021a04738l11550e3897H4589
10007a4097j36115O2487n706D9821d9220H470J21663a75972j15926A5184O590
9996B1774M4262K941c58161J38675Q5778j02230A75990D0985J54375b70455b0792
9984c4050o1666A65200B8181d9206k25073r068B8360a72141e1599m3494j39922
9973b35015A14322a9865A7004e8680p6053l6844k27014A5956b5233j73213J9422
9962a79024H1608d944C37870c6740A3415a91521P2245A10326N5941c44143h3811
9950D3267b84872j8358c2302j37113B9344J73243a02069o7983R127E4349c68656
$$ y = [-96811, -299033, -404679, 109946, -469066, 320462, -234571, 177613, -144376, 30384, 4158, -108582, 374020, 101715, -13156, -628669, -18745, -227766, -104738, -416288, -53897, 84589, -14097, -150212, -87725, -93431, 49821, -49220, 8470, 130133, -175972, -291898, 15184, 21774, 66036, 68977, -358161, -219486, -133708, -235938, 175990, 40985, 195360, -270455, -20792, -34050, -95716, 165200, 28181, -49206, -274279, -283347, 28360, -172141, -51599, -95093, -235015, 114322, -19865, 17004, -58680, -134733, -171577, -398591, 15956, -25233, -198446, -179024, 81608, -4944, 337870, -36740, 13415, -191521, -119276, 110326, 166267, -344143, -83811, 43267, -284872, -303230, -32302, -169415, 29344, 202587, -102069, -170052, -160925, 54349, -368656]
9938A46589a07920b4153j0217B3887b15657j64787a38005N4442o6576A50394a23638
9926H228a19688A15562a94497B68892c58436a63155B11540L6000I8449a48651
9915a25103B59839F4005b60070j35598a91515f540k23487Q820b4073l77060A49789
9903c23835e8220J908C0184c89719J04501I6618a0227k38609j3972O3526l4864
9892b34146k6932A82241g5731r6537J1857I1011c8233a3908B53485c6403A47953
9880C4466j6573a29996D33929B4062b98995N5832A702N639J96168e08103E3381
9868E964b41907j47582f9685j08047e1338a6696H7238P600f4482L1017j32907
9857a66372G3279a01396c5564C8738b2368m8474B17171j9215o4691l9337c82828
$$ y = [146589, -107920, -24153, -34370, 23887, -215657, -380444, -138005, -83563, -150139, 150394, -123638, 8228, -119688, 115562, -194497, 268892, -358436, -163155, 211540, 247540, 98449, -148651, -125103, 259839, 64005, -260070, -395668, -191515, -6540, -230027, -221207, -24073, -401133, 149789, -323835, -58220, -56312, 30184, -389719, -285218, 96618, -10227, -248836, -262808, -199282, -234146, -261078, 182241, -75731, -172268, -160411, 91011, -38233, -13908, 253485, -36403, 147953, 34466, 17893, -129996, 433929, 24062, -298995, -243163, 1702, 7341, 203509, -508103, 53381, 5964, -241907, -389489, -69685, -177732, -51338, -16696, 87238, 94838, -64482, -33465, -166372, 73279, -101396, -35564, 38738, -22368, -70842, 217171, 197956, 133265, 93928, -382828]
9845b71927B48983H205a36633c1204j08673E5663h7796A80266a22339C33448g3239
9833b94222e702m92q8338k0639k11477O6758A39648a07742D8594a55157q6370
9822b41527E3760k4597a78985A42593d76250I2696a56723q9789G460e781l0938
9811c6719A44094l6470d7647j56033c7372j89192M4405B32063d37869a86401M9929
9800a36472D14564c18218A55488a56792o9969H0263P8624D07a01839d0792j23746
9789a64538A67626b79956B10768d5908B39334a16201F2826Q219j7013A6874C73
9777A58192N8647b01827C7793L1858i6962j02802F1882K31311a95560g3942J5153
9766e8789j14318j76511I2969i2502B54157b55285F6030b02485P1648j66133c5957
$$ y = [-271927, 248983, 8205, -136633, -31204, -139877, 55663, -87796, 180266, -122339, 333448, -73239, -294222, -5702, -6194, -94532, -115171, -326648, -259890, 139648, -107742, 48594, -155157, -241527, 53760, 29163, -178985, 142593, -476250, 92696, -156723, -246512, 7460, -5781, -36719, 144094, 107624, -47647, -203680, -37372, -226564, -182159, 232063, -437869, -186401, -136472, 414564, -318218, 155488, -156792, -226761, 80263, 158887, 407, -101839, -40792, -164538, 167626, -279956, 210768, -45908, 239334, -116201, 62826, 71045, 54032, 16874, 373, 158192, 216839, -201827, 37793, 69651, -96962, -199764, 61882, 293193, -195560, -73942, -58789, -173107, -349618, 92969, -92502, 254157, -255285, 66030, -202485, -130837, -296970, -35957]
9754A72134m6150n4947c1072G4839a29379d5585O609C70619a60190a1401j04652
9743a16053r807P597j78765A46622J22304a69430m3516B40716b51402c2758j91352
9732b24110A27032a12114A17523J12890k2947L6250r5624c39055A31921j8569
9722A13352a38427a0113k39975H6310a94312j9048j9840p5953J09580l98A72869
9710c38098d5698A68719B5344a59435F8364f4182l15963a80803Q9972C10082a51303
9698A8940c39601G6147b45220R0324A95909b1738D2236b3623q8416k9723j31243
9687b73005i7121P461j7771a6752E0474m56A3109b51572G1829L2074h2814A43965
9674g2413j75362D3221b21422L6136M1443f3838A2091c71725a81245e533k78526
$$ y = [172134, 125984, 71037, -31072, 74839, -129379, -45585, -38976, 370619, -160190, -11401, -116053, -125860, -118263, -297028, 146622, 268926, -169430, -212946, 240716, -251402, -32758, -224110, 127032, -112114, 117523, 230413, 207466, 243716, 148092, -339055, 131921, 113352, -138427, -10113, -250088, 86310, -194312, -213360, -233200, -309153, -199573, -199971, 172869, -338098, -45698, 168719, 25344, -159435, 68364, -64182, -380145, -180803, -90831, 310082, -151303, 18940, -339601, 76147, -245220, -154896, 195909, -21738, 42236, -23623, -112039, -141762, -273005, -97121, -89660, -107431, -16752, 50474, 50018, 13109, -251572, 71829, 103903, -82814, 143965, -72413, -247775, 43221, -221422, -185286, -143843, -63838, 12091, -371725, -181245, -5533, -284059]
9663b84059h1747A39499a30978A1496a37952j71002a00557k2035a9308B35791
9652G0119J9381a00725m0698j00127J3701N5840j12461O511c9831k2692l3729
9641i6252A42630c14675c3314m26840G5603P1987a6395m52487J97494A24193n5809
9630F8384k0236J15087K6344a31752m46f0416j09096B72761N4265b1156k48633
9619b69789A36874E2409d6241l6182C51267F4004a74544a9967j26579M255j26232
9608b68523d0719B02881c19359P1215C07175A32976b50655M5476j17897a55713
9597d40397P8427A54539b91581G5649c99509o3924a95458n0261H0965c6950j81835
9586b18785N7533g5159j9032r782K771j01061j6896N4474j5460j95841a03960
$$ y = [-284059, -81747, 139499, -130978, 11496, -137952, -308954, -100557, -122592, -19308, 235791, 70119, 89500, -100725, -141423, -241550, -227849, -172009, -284470, -277959, -39831, -62523, -96252, 142630, -314675, -33314, -460154, 75603, 147590, -16395, -468882, -271388, 124193, 68384, 48148, 163235, 189579, -131752, -132198, -60416, -169512, 272761, 327026, -21156, -269789, 136874, 52409, -46241, -82423, 351267, 64004, -174544, -19967, -146546, -142291, -268523, -40719, 202881, -319359, -248144, 307175, 132976, -250655, -205179, -323076, -155713, -440397, -361970, 154539, -291581, 75649, -399509, -463433, -195458, -245719, 80965, -36950, -218785, -161252, -75159, -94191, -103973, -101202, -202263, -219159, -164685, -180145, -375986, -103960]
9574A6853J45718b6486q3325B22627E6563d2566C2889b12356h5302A15498K9688
9563A45186b3403m8789A60400b48825R3091B91259d30670f3952j75226k94543
9553e33721a86980B7142a38208j01183g1403J4971l0642q6506p3536m0829j7980
9542c05925j728d6476p7817j2735O3481q9132r7414D8481i4910p2250A07605b609
9529c83919A29894i5580L3284D0437L3851a51887J1751i206k41500J20888f4876
9517c96867J71371A31779e2575k21179I045J11627c33400B13143c7350j53523
9507a90873A78887g1329K8664J3859j06033A27491b05814o5532q9116a71884d7860
9495b04630L0958H2891a94908j46130j0820A17382b72536C11917I8105b66135
$$ y = [16853, 162571, -26486, -109811, 222627, 56563, -42566, 32889, -212356, -85302, 115498, 145186, -23403, -72192, 160400, -248825, -155734, 291259, -430670, -63952, -239178, -533721, -186980, 27142, -138208, -239391, -71403, -56432, -87074, -173580, -247116, -287945, -305925, -307653, -46476, -124293, -137028, -73547, -162679, -260093, 48481, -94910, -167160, 107605, -2609, -383919, 129894, -95580, -62296, 40437, 74288, -151887, -140136, -9206, -250706, -129818, -64876, -396867, -225496, 131779, -52575, -273754, 9045, 120672, -333400, 213143, -37350, -190873, 178887, -71329, -42665, -28806, -134839, 127491, -205814, -271346, -360462, -171884, -47860, -204630, -173672, 82891, -194908, -341038, -351858, 117382, -272536, 311917, 98105, -266135]
9484d4512A13980a00069A7045a32001E9089a03429G5376J07011h6730N396C9051
9472C7634b57175R5226r4818d4589j68734F134J49997b71446D8464b91358J14325
9461a77033O8281N0500H7207l5780l110b51815C87968b75239i1777k28207d3266
9449g6889a6490o8436b2821B5080j0663d2687h971A16905d614n9101r1897r0510
9437b46122N829j32599J67881h5004k4280A8609b78091J13741l82c6258A65376
9425g6870n5305d249j70237H0336J3646Q1276Q5724b9647j20104J8765f4710o5164
9413a29874C09825a68631j3063J9653D6935R0635c1218B5030a43736K8714g7j79962
9401a80039E622a3397j38507n2691E2779A852c53909R119F476M6006a99192E1983
$$ y = [-44512, 113980, -100069, 17045, -132001, 59089, -103429, 75376, 182387, -86730, -81334, 39051, 37634, -257175, -161949, -256767, -44589, -213323, 6134, 156131, -271446, 48464, -291358, -177033, -108752, -58252, 87207, 51427, 48317, -251815, 387968, -275239, -91777, -319984, -43266, -76889, -16490, -84926, -22821, 25080, 14417, -42687, -8971, 116905, -4614, -63715, -155612, -246122, -240293, -372892, -205011, -85004, -109284, 18609, -278091, -164350, -164732, -36258, 165376, -76870, -132175, -4249, -174486, 80336, 93982, 175258, 260982, -29647, -149751, -130986, -64710, -129874, 309825, -168631, -181694, -162041, 46935, 137570, -31218, 25030, -143736, -115022, -77, -180039, 5622, -13397, -151904, -204595, 52779, 1852, -353909, -344790, 6476, 52482, -199192, 51983]
9388b28302E4409B4913a99446i1767H1252a31794d1540o7283l7849A44770M2473
9377A87243A7972K6159O5054b46183A78157a5592G3658P3693a64873q0222l4287
9366b79382A05628b54747G420Q2150b10126q1399c3044B7701c1746b058o9359
9355g1417O700k38905Q2765E856K0511a78763M0650N3069D05739H4127C6509d14905
9342d7597j20925j28670A46427m461c3674j70311Q3212H1486b74577O6400n5425
9331b63602a25956A99035H007a41212K4628A46419g2637j10926R484L4165r543
9320a49457g1864J0463R848j36810h4418l80013d0237A44943b32707G8750b44423
9308b49748f3615C69950D906R5682a1193B48318c1022C2186a73490j44021R7175
$$ y = [-228302, 54409, 24913, -199446, -91767, 81252, -131794, -41540, -108823, -146672, 144770, 187243, 17972, 44131, 109185, -246183, 178157, -15592, 73658, 147351, -164873, -245095, -279382, 105628, -254747, 7420, 89570, -210126, -291525, -33044, 27701, -31746, -2058, -71417, -64717, -303622, -220857, 5856, 26367, -178763, -138113, -85044, 405739, 84127, 36509, -414905, -47597, -168522, -297192, 146427, 141966, -33674, -203985, -120773, 81486, -274577, -208177, -263602, -125956, 199035, 8007, -141212, -116584, 146419, -72637, -183563, -174079, -139914, -149457, -71864, -61401, -51553, -188363, -84418, -464431, -40237, 144943, -232707, 78750, -244423, -249748, -63615, 369950, 4906, 100588, -11193, 248318, -31022, 32186, -173490, -317511, -220336]
9297b20336H1685a47506G2328a29420l0508N9369B96977A2422b58577R6441a893
9285F3280g24727b13256r1579H2838l8719L21829a10785j90008j27176i6299J8090
9274g8209j0372j38660g7951A08402b40878A04104K21870a43040C304g9354A91770
9262a65547b747q3545l2991H1100l4301P0722C4894j0565G613d04237G0569O4956
9250A35525e7163j94859B77188o8120d4544l7328B89692a77436B63954h192m14086
9239d22278J74377n3945E1223k4630q740c23905a17834B9250O2996a16504H80
9227d2884q5910k92601A16713j2417A8194K21587F655a07128c8944A8626a50263
9215i8909C8310K61035A49359C9419e5624k06929a2439B14281h6496A30294a0819
$$ y = [-220336, 81685, -147506, 72328, -129420, -159928, -100559, 296977, 12422, -258577, -162136, -1893, 63280, -724727, -213256, -304835, 82838, 44119, 365948, -110785, -300793, -427969, -96299, -78209, -88581, -227241, -77951, 108402, -240878, 104104, 325974, -143040, 3304, -79354, 191770, -165547, -2747, -86292, -119283, 81100, 46799, 117521, 34894, 24329, 7613, -404237, 70569, 135525, -57163, -252022, 277188, 209068, -44544, -81872, 289692, -177436, 263954, -8192, -422278, -247901, -301846, 51223, 26593, 17853, -323905, -117834, 29250, 92246, -116504, 880, -42884, -128794, -421395, 116713, 104296, 18194, 239781, 6655, -107128, -38944, 18626, -150263, -98909, 38310, 299345, 149359, 39419, -55624, -262553, -12439, 214281, -86496, 130294, -10819]
9203a03844B5529a18208A95779d20207a73587L4717A91640a01432j13913L065
9193b12280J6546F35K6171f8461b5576B54008A05819B9125c1653G6260b4920j37409
9181a62329j5912m1402A03918c04506A35640c98974B3908a49330H2302c58079
9170C501c32553h4155l68155b15795O853A5196Q1277J2473e4982n0123n7525A14927
9157H4865a92938l17671A99536E1286J9534a21592f329m3714E7398N8873N56b3014
9144A66451d9739E439b58322p1199A60276p1373h5275C06183A04199c81938B15931
9132a13574j5371k81493C4612J63329b50163k5624a22479k16845A16368l5322
9122H1046c0816k1582k40620B4823i3091I8919h4397k6246c5081A81152o9235
$$ y = [-103844, 25529, -118208, 195779, -420207, -173587, -138870, 191640, -101432, -215345, -212280, -195734, 635, 26806, -68461, -25576, 254008, 105819, 29125, -31653, 76260, -24920, -162329, -178241, -219643, 103918, -304506, 135640, -398974, 23908, -149330, 82302, -358079, 3501, -332553, -84155, -452310, -215795, -208942, 15196, 96473, 108946, -54982, -105105, -162630, 114927, 84865, -192938, -510609, 199536, 51286, 70820, -121592, -6329, -50043, 57398, 116271, 116827, -23014, 166451, -49739, 5439, -258322, -329521, 160276, 88903, -85275, 306183, 104199, -381938, 215931, -113574, -128945, -410438, 34612, 197941, -250163, -275787, -122479, -339324, 116368, 81046, -30816, -52398, -293018, 24823, -93091, 98919, -84397, -110643, -35081, 181152, 111917]
9111A11917a29786A11339b76608a08697m0952I0220a99237B6309b45425C5184
9100B9333b88963P9015l6148a12220b5126k40171B2580b5662k17908g6872L2660
9089d4212A68549b49058N2284b7141r4510H6943a47657N320L1873M0202j53900
9078b24162P3533H6018Q796b20349D9433e62757a70799a6722k56398J18349a4484
9066c6586A24600e29595a94775k1262e2167K1776E8225A7231K03945a87872L2764
9055a55108l21384A1118L068O526K22950a23498d4444A18825B5951c680j07848
9044a11528k17182B86802A27798n3342K9047e966A22212J39676p3196d25083d5259
9032A9305d0694q7656k03122A34958c42707f9455F6916J10721p86F9570J27930
$$ y = [111917, -129786, 111339, -276608, -108697, -149649, 90220, -199237, 26309, -245425, 35184, 29333, -288963, -209948, -246096, -112220, -25126, -265297, 22580, -25662, -243570, -76872, -44212, 168549, -249058, -196774, -27141, -121651, 86943, -147657, -142337, -110464, -70262, -224162, -150629, 86018, 94814, -220349, 49433, -562757, -170799, -16722, -273120, -154771, -14484, -36586, 124600, -529595, -194775, -216037, -52167, -30391, 58225, 17231, 221176, -187872, -155108, -476492, 11118, 14186, 20712, 243662, -123498, -44444, 118825, 25951, -3680, -111528, -328710, 286802, 127798, 74456, 103503, -5966, 122212, 261888, 188692, -425083, -45259, 19305, -40694, -128350, -331472, 134958, -342707, -69455, 66916, 177637, 176851, 69570, 197500]
9021A97500a95516K4596A7122b62612B14451e6412H817b82892c4190k04944i3827
9009B38434a68320B41632d2375J0410k97493D9372A7879J65019g1923n0878B08637
8997A04246c17307L6178g9756L4680I4361a59629f5550A00545a346o7722J5853
8986e3215q3441A26001B3833M71156h354j34259l7226h1850k086p5172I854b7044
8973d1213j25047G396b683j09358O488B42446f128B17281j4572D5424a27563l6598
8961a64161k07624a61914Q184E8153g677j32173k00301e9741j45554M3436A31513
8949b10572A56376M0288m3791m9554a97830a0520k11618a4587l29367G6242b57008
8937C17079j58443l9176b00928n5268c2894H9030b96828D05242E6075e39996b27179
$$ y = [197500, -195516, -170920, 17122, -262612, 214451, -56412, 8817, -282892, -34190, -239134, -93827, 238434, -168320, 241632, -42375, -31965, -329458, 49372, 17879, 182898, -71923, -122801, 208637, 104246, -317307, -281129, -79756, -45076, 94361, -159629, -65550, 100545, -1346, -69068, -53215, -136656, 126001, 23833, 494989, -8354, -142613, -179839, -81850, -83936, -159108, 9854, -27044, -41213, -166260, 7396, -2683, -112041, -105553, 242446, -6128, 217281, 202709, 45424, -127563, -164161, -371785, -161914, -153730, 58153, -7677, -139850, -340151, -59741, -205295, -161859, 131513, -210572, 156376, 196664, 152873, 103319, -197830, -10520, -222138, -14587, -343954, 76242, -257008, 317079, 158636, 119460, -200928, -256196, -32894, 89030, -296828, 405242, 56075, -539996, -227179]
8925D31211b52327B23280J7348A14604J304246C11015D7653J69931i025n3081
8915f2106p545j09572A76270g6023m8532r7946p9076J28452A54632d47190J54025
8904b93165P0191d9253n339B89516b1550l5593A37128H742d683o0116k34768F3268
8891a01719a4081m2535j37218A32552f5288a2588o982l76410a14072n4712A04706
8879b75217A80789h0659a7687j58209j25455A06627d9832I349N225d073l30521
$$ y = [431211, -252327, 223280, 240628, 114604, 1418850, 311015, 47653, 217584, -9025, -62106, -69651, -179223, 176270, -76023, -124555, -222501, -301577, -173125, 154632, -447190, -293165, -222974, -49253, -54592, 289516, -21550, -57143, 137128, 8742, -4683, -64799, -299567, 63268, -101719, -14081, -56616, -193834, 132552, -65288, -12588, -19570, -395980, -114072, -168784, 104706, -275217, 180789, -80659, -17687, -175896, -301351, 106627, -49832, 9349, 14574, -4073, -334594]
$$ [...]
##END NTUPLES=NMR SPECTRUM
##END=
