##TITLE=AC1461_TOLI13267_7819493_ubtpHvw9Po
##JCAMPDX= 6.0         $$ Bruker NMR JCAMP-DX V2.0
##DATA TYPE= NMR SPECTRUM
##DATA CLASS= NTUPLES
##ORIGIN= BRUKER
##OWNER= Administrator
$$ 1.72 TOPSPIN		Version 2.1
$$ 2013-04-30 22:40:10.444 -0700  Administrator@X
$$ Compression mode = diff/dup
##.OBSERVE FREQUENCY= 400.02188249412
##.OBSERVE NUCLEUS= ^1H
##.ACQUISITION MODE= SIMULTANEOUS (DQD)
##.ACQUISITION SCHEME= undefined
##.AVERAGES= 64
##.DIGITISER RES= 22
##SPECTROMETER/DATA SYSTEM= spect
##.PULSE SEQUENCE= noesygpps1d.comp
##.SOLVENT NAME= COFFEE_meoh
##.SHIFT REFERENCE= INTERNAL, COFFEE_meoh, 1, 14.96111
##AUDIT TRAIL= $$ (NUMBER, WHEN, WHO, WHERE, PROCESS, VERSION, WHAT)
$$ ##TITLE= Audit trail, TOPSPIN		Version 2.1
$$ ##JCAMPDX= 5.01
$$ ##ORIGIN= Bruker BioSpin GmbH
$$ ##OWNER= Administrator
$$ $$ E:\/data/COFFEE/nmr/AC1461_TOLI13267_7819493_ubtpHvw9Po/12/pdata/1/auditp.txt
$$ ##AUDIT TRAIL=  $$ (NUMBER, WHEN, WHO, WHERE, PROCESS, VERSION, WHAT)
(   1,<2013-04-30 22:40:05.381 -0700>,<Administrator>,<X>,<go>,<TOPSPIN 2.1>,
      <created by zg
	started at 2013-04-30 22:28:35.710 -0700,
	POWCHK enabled, PULCHK disabled,
       configuration hash MD5:
       F7 49 AB AC A2 8D 51 76 73 8D C1 9A A6 38 9F DE
       data hash MD5: 64K
       E3 22 F9 16 22 93 90 06 10 E2 F5 73 FA A0 30 3F>)
(   2,<2013-04-30 22:40:08.319 -0700>,<Administrator>,<X>,<proc1d>,<TOPSPIN 2.1>,
      <Start of raw data processing
       efp LB = 0.3 FT_mod = 6 PKNL = 1 PHC0 = 0 PHC1 = 0 SI = 128K 
       data hash MD5: 128K
       41 DF 58 C1 E0 98 50 36 F0 B6 11 B7 BB E9 B1 7D>)
(   3,<2013-04-30 22:40:09.381 -0700>,<Administrator>,<X>,<proc1d>,<TOPSPIN 2.1>,
      <pk PHC0 = -79.19495 PHC1 = 0 
       data hash MD5: 128K
       79 38 70 D5 CB 33 5D CA 2F 02 88 E7 AC D8 2D 99>)
(   4,<2013-04-30 22:40:09.819 -0700>,<Administrator>,<X>,<proc1d>,<TOPSPIN 2.1>,
      <abs ABSG = 1 
       data hash MD5: 128K
       78 F6 89 FF 89 75 82 A9 64 CD 0D 42 7D 5A D2 5D>)
(   5,<2013-04-30 22:40:09.928 -0700>,<Administrator>,<X>,<proc1d>,<TOPSPIN 2.1>,
      <abs ABSG = 2 
       data hash MD5: 128K
       27 2B 70 DA B8 BF 57 28 74 61 2F DA CC 3D 6D 96>)
(   6,<2013-04-30 22:40:10.053 -0700>,<Administrator>,<X>,<proc1d>,<TOPSPIN 2.1>,
      <abs ABSG = 3 
       data hash MD5: 128K
       B8 39 40 14 A8 A1 FB B6 91 15 74 29 3F BC 00 3A>)
(   7,<2013-04-30 22:40:10.147 -0700>,<Administrator>,<X>,<proc1d>,<TOPSPIN 2.1>,
      <abs ABSG = 4 
       data hash MD5: 128K
       CC B3 9E E1 B4 74 C2 41 13 E2 5B CE 7E 44 3F E1>)
(   8,<2013-04-30 22:40:10.241 -0700>,<Administrator>,<X>,<proc1d>,<TOPSPIN 2.1>,
      <abs ABSG = 5 
       data hash MD5: 128K
       DE B4 95 75 4A 89 D2 DD C1 58 BA DE 44 2D 18 E8>)
$$ ##END=
$$ 
$$ $$ hash MD5
$$ $$ 8A AD 01 A5 4E 22 C6 D7 AC A4 6D 46 4D 8C 40 B8
##$RELAX= 
##$RELAX= 
##$RELAX= 
##$RELAX= 
##$RELAX= 
##$RELAX= 
##$RELAX= 
##$RELAX= 
$$ Bruker specific parameters
$$ --------------------------
##$DU= <E:\>
##$EXPNO= 12
$$ [...]
##$TP07= 0
##$TPNAME0= <>
##$TPNAME1= <>
##$TPNAME2= <>
##$TPNAME3= <>
##$TPNAME4= <>
##$TPNAME5= <>
##$TPNAME6= <>
##$TPNAME7= <>
##$TPOAL= (0..7)
0.5 0.5 0.5 0.5 0.5 0.5 0.5 0.5
##$TPOFFS= (0..7)
0 0 0 0 0 0 0 0
##$TUNHIN= 0
##$TUNHOUT= 0
##$TUNXOUT= 0
##$USERA1= <user>
##$USERA2= <user>
##$USERA3= <user>
##$USERA4= <user>
##$USERA5= <user>
##$V9= 5
##$VALIST= <valist>
##$VCLIST= <CCCCCCCCCCCCCCC>
##$VD= 0
##$VDLIST= <DDDDDDDDDDDDDDD>
##$VPLIST= <PPPPPPPPPPPPPPP>
##$VTLIST= <TTTTTTTTTTTTTTT>
##$WBST= 1024
##$WBSW= 4
##$XGAIN= (0..3)
0 0 0 0
##$XL= 0
##$YL= 0
##$YMAX_a= 6558247
##$YMIN_a= -13254625
##$ZGOPTNS= <>
##$ZL1= 120
##$ZL2= 120
##$ZL3= 120
##$ZL4= 120
##$ABSF1= 14.96111
##$ABSF2= -5.597072
##$ABSG= 5
##$ABSL= 3
##$ALPHA= 0
##$AQORDER= 0
##$ASSFAC= 0
##$ASSFACI= 0
##$ASSFACX= 0
##$ASSWID= 0
##$AUNMP= <proc_prof1d_extract.lims>
##$AXLEFT= 0
##$AXNAME= <>
##$AXNUC= <1H>
##$AXRIGHT= 0
##$AXTYPE= 0
##$AXUNIT= <>
##$AZFE= 0.1
##$AZFW= 0.1
##$BCFW= 0
##$BC_mod= 0
##$BYTORDP= 0
##$COROFFS= 0
##$CY= 15
##$DATMOD= 1
##$DC= 0
##$DFILT= <>
##$DTYPP= 0
##$F1P= 0
##$F2P= 0
##$FCOR= 0.5
##$FTSIZE= 131072
##$FT_mod= 6
##$GAMMA= 0
##$GB= 0
##$INTBC= 1
##$INTSCL= 1
##$ISEN= 128
##$LB= 0.3
##$LEV0= 0
##$LPBIN= 0
##$MAXI= 10000
##$MC2= 0
##$MEAN= 0
##$ME_mod= 0
##$MI= 0
##$NCOEF= 0
##$NC_proc= -2
##$NLEV= 6
##$NOISF1= 0
##$NOISF2= 0
##$NSP= 0
##$NTH_PI= 0
##$NZP= 0
##$OFFSET= 14.96111
##$PC= 1
##$PHC0= -79.19495
##$PHC1= 0
##$PH_mod= 1
##$PKNL= yes
##$PPARMOD= 0
##$PPDIAG= 0
##$PPIPTYP= 0
##$PPMPNUM= 2147483647
##$PPRESOL= 1
##$PSCAL= 4
##$PSIGN= 0
##$PYNMP= <proc.py>
##$REVERSE= no
##$SF= 400.020009593599
##$SI= 131072
##$SIGF1= 0
##$SIGF2= 0
##$SINO= 400
##$SIOLD= 131072
##$SPECTYP= <>
##$SREGLST= <1H.CDCl3>
##$SSB= 0
##$STSI= 131072
##$STSR= 0
##$SW_p= 8223.68421052631
##$SYMM= 0
##$S_DEV= 0
##$TDeff= 65536
##$TDoff= 0
##$TI= <>
##$TILT= no
##$TM1= 0
##$TM2= 0
##$TOPLEV= 0
##$USERP1= <user>
##$USERP2= <user>
##$USERP3= <user>
##$USERP4= <user>
##$USERP5= <user>
##$WDW= 1
##$XDIM= 131072
##$YMAX_p= 421573256
##$YMIN_p= -11381
##$CURPLOT= <Network HP LaserJet P1505>
##$CURPRIN= <$Network HP LaserJet P1505>
##$DFORMAT= <normdp>
##$LAYOUT= <+/1D_H.xwp>
##$LFORMAT= <normlp>
##$PFORMAT= <normpl>
##$SURQMSG= 1
$$ End of Bruker specific parameters
$$ ---------------------------------
##NTUPLES= NMR SPECTRUM
##VAR_NAME=  FREQUENCY,     SPECTRUM/REAL,   SPECTRUM/IMAG
##SYMBOL=    X,             R,               I
##VAR_TYPE=  INDEPENDENT,   DEPENDENT,       DEPENDENT
##VAR_FORM=  AFFN,          ASDF,            ASDF
##VAR_DIM=   131072,        131072,          131072
##UNITS=     HZ,            ARBITRARY UNITS, ARBITRARY UNITS
##FACTOR=    0.0627417313425164, 1,          1
##FIRST=     8223.62146879497, -683,         -57355
##LAST=      0,             701,             -57201
##MIN=       0,             -11381,          0
##MAX=       8223.62146879497, 421573256,    0
$$ Real data points
##PAGE= N=1
##DATA TABLE= (X++(R..R)), XYDATA
$$ [...]
63904A563669j16478j04245r3742q3878p4026o4657n6613n0078m4553l9524l4892
$$ 1563669 1447191 1342946 1249204 1165326 1091300 1026643 970030 919952 875399 835875 800983
63893H00983l0868k7666k5268k3354k1503j9477j7361j5456j4094j3453j3324
$$ 800983 770115 742449 717181 693827 672324 652847 635486 620030 605936 592483 579159
63882E79159j3061j1947r834p239m766k552m16J648L394M782O167P918R973J1943
$$ 579159 566098 554151 544317 537078 532312 529760 529344 530992 534386 539168 545335 553253 563226 575169
63868E75169J3578J4961J6225J7274J7823J7699J7064J6329J5813J5435J4783
$$ 575169 588747 603708 619933 637207 655030 672729 689793 706122 721935 737370 752153
63857G52153J3547J1758R648P351M896K290n41l715p063r998j2077j3624j5325
$$ 752153 765700 777458 787106 794457 799353 801643 801102 797387 790324 780326 768249 754625 739300
63844G39300j7241j8676j9251j9518k0150k0956k1221k0866k0544k0608k0543
$$ 739300 722059 703383 684132 664614 644464 623508 602287 581421 560877 540269 519726
63833E19726j9735j8405j7393j7101j6984j6218j4675j3032j1929j1245j0394
$$ 519726 499991 481586 464193 447092 430108 413890 399215 386183 374254 363009 352615
63822C52615r182q058p446p191o856o275n555m744l842l060k676k623k469j960
$$ 352615 343433 335375 327929 320738 313882 307607 302052 297308 293466 290406 287730 285107 282638 280678
63808B80678j346j049j171j429j513j379j218j169j161j038q24p72j121j811k446
$$ 280678 279332 278283 277112 275683 274170 272791 271573 270404 269243 268205 267381 266609 265488 263677 261231
63793B61231k538j912j027p48j487k662l297l122k704k450k068j271m94l68q60
$$ 261231 258693 256781 255754 255006 253519 250857 247560 244438 241734 239284 237216 235945 235451 235083 234223
63778B34223j385j572j426r16n0P39Q49K77l38n05l50j55N7L00L92K30N2J22L99
$$ 234223 232838 231266 229840 228924 228874 229613 230462 230739 230401 229896 229546 229391 229448 229748 230140 230370 230422 230544 230943
63759B30943O47P12N56J93k22m54m73n54q64j141j022n38q3J05K12N57J200J910
$$ 230943 231590 232302 232858 233051 232829 232375 231902 231348 230484 229343 228321 227783 227700 227805 228017 228574 229774 231684
63741B31684K435K709K785K700K496K311K253K182J872J452J428K057K926L398
$$ 231684 234119 236828 239613 242313 244809 247120 249373 251555 253427 254879 256307 258364 261290 264688
63727B64688L335L089K989L164L750M808N979O654O599O116N579N081M653M337
$$ 264688 268023 271112 274101 277265 281015 285823 291802 298456 305055 311171 316750 321831 326484 330821
63713C30821L948L093J709K11j046k145l188l828l743l245l006l182l327l129
$$ 330821 334769 337862 339571 339782 338736 336591 333403 329575 325832 322587 319581 316399 313072 309943
63699C09943k758k369j726o63M39J053J217J441J911K243K139J849J763J808J706
$$ 309943 307185 304816 303090 302427 302866 303919 305136 306577 308488 310731 312870 314719 316482 318290 319996
63684C19996J561J713K010J832R89J47pL48N28L78M27J076K046K733K915K896
$$ 319996 321557 323270 325280 327112 328101 328248 328241 328589 329117 329495 329922 330998 333044 335777 338692 341588
63668C41588L072L397L368K627J563J043J490K398K850K300P31j534l916n773
$$ 341588 344660 348057 351425 354052 355615 356658 358148 360546 363396 365696 366427 364893 360977 355204
63654C55204o862p469p813p652o768n453m138k900j811j310j646k199k118j418
$$ 355204 348342 340873 333060 325408 318640 313187 309049 306149 304338 303028 301382 299183 297065 295647
63640B95647o83O3J226K513K971K476K133K805M001M772M951M976N079N367O107
$$ 295647 294964 295027 296253 298766 301737 304213 306346 309151 313152 317924 322875 327851 332930 338297 344404
63625C44404P275Q181Q263P947Q109Q877R675J0329J1409J3348J5811J8122K0017
$$ 344404 351679 359860 368123 376070 384179 393056 402731 413060 424469 437817 453628 471750 491767
63612D91767K1678K3347K5127K7056K9170L1361L3273L4486L4945L4991L4699
$$ 491767 513445 536792 561919 588975 618145 649506 682779 717265 752210 787201 821900
63601H21900L3357K9992K4353J7155R378J966m014p689r243r814j0217j0265r766
$$ 821900 855257 885249 909602 926757 936135 938101 934087 926398 917155 907341 897124 886859 877093
63588H77093r456j0342j2573j5617j9136k2921k6225k7973k7770k6259k4413k2841
$$ 877093 867637 857295 844722 829105 809969 787048 760823 732850 705080 678821 654408 631567
63576F31567k1604k0299j8326j5513j2394r639p304m980k467K4K175L740M635
$$ 631567 609963 589664 571338 555825 543431 533792 526488 521508 519041 519065 521240 524980 529615
63563E29615N147N791O614P076P023P315Q688J0514J1635J2201J3534J6129J8933
$$ 529615 534762 540553 547167 554243 561266 568581 577269 587783 599418 611619 625153 641282 660215
63550F60215K1024K2994K6028L0288L4930L9203M2849M5653M7152M6661M3204
$$ 660215 681239 704233 730261 760549 795479 834682 877531 923184 970336 1016997 1060201
63539A060201L5750K4264J0654j869j0768j5540j7246j6998j5221j2208q947o888
$$ 1060201 1095951 1120215 1130869 1129000 1118232 1102692 1085446 1068448 1053227 1041019 1032072 1025184
63527A025184o913q834j2028j6103k0780k5533k9854l3590l6580l8233l8075l6581
$$ 1025184 1018271 1009437 997409 981306 960526 934993 905139 871549 834969 796736 758661 722080
63515G22080l4798l3160l1220k8621k5639k2708k0003j7646j5763j4144j2419
$$ 722080 687282 654122 622902 594281 568642 545934 525931 508285 492522 478378 465959
63504D65959j0769r767r366q688p197n428m072l115k405k392l367m480m456l174
$$ 465959 455190 445423 436057 427369 420172 414744 410672 407557 405152 402760 399393 394913 390457 387283
63490C87283j702q49m93k99k62l32j79L34R49J542K356L490M528N035N110N120
$$ 387283 385581 384732 384239 383940 383678 383346 383167 383501 384450 385992 388348 391838 396366 401401 406511 411631
63474D11631N164N095M893M664M328L495J733r42l803n715o073n435m969n179
$$ 411631 416795 421890 426783 431447 435775 439270 441003 440061 436258 430543 424470 419035 414066 408887
63460D08887n544n446m985m508l867k727j370n12k79L8R90K220L044L418L887
$$ 408887 403343 397897 392912 388404 384537 381810 380440 379928 379649 379687 380677 382897 385941 389359 393246
63445C93246M741N683O423P176Q404J0182J2101J3743J5127J6658J8760K1566
$$ 393246 397987 403670 410093 417269 425673 435855 447956 461699 476826 493484 512244 533810
63433E33810K4881K8368L1648L4142L4888L2798K7508K0088J2708P310M550M069
$$ 533810 558691 587059 618707 652849 687737 720535 748043 768131 780839 788149 792699 796768
63421G96768N484Q719J3389J8490K3140K7406L1866L6448M0175M2055M1742L9220
$$ 796768 802252 810971 824360 842850 865990 893396 925262 961710 1001885 1043940 1085682 1124902
63409A124902L4447K7680J9746J1521L444m051r973j3366j4327j3906j3099j2535
$$ 1124902 1159349 1187029 1206775 1218296 1221740 1217689 1207716 1194350 1180023 1166117 1153018 1140483
63397A140483j3018j5436j9722k4576k8735l2115l5331l8492m0898m1661m0329
$$ 1140483 1127465 1112029 1092307 1067731 1038996 1006881 971550 933058 892160 850499 810170
63386H10170l7254l3641l0780k8809k6626k3429j9813j6714j3959j0762p280m480
$$ 810170 772916 739275 708495 679686 653060 629631 609818 593104 579145 568383 561103 556623
63374E56623k514m46K176M607O254P704R681J1801J3297J4412J6090J8478K0711
$$ 556623 554109 553663 555839 560446 566700 574404 584085 595886 609183 623595 639685 658163 678874
63361F78874K2171K3204K4527K6537K9359L2928L6698L9751M1567M2328M2255
$$ 678874 701045 724249 748776 775313 804672 837600 874298 914049 955616 997944 1040199
63350A040199M0959L7735L2322K5100J6768Q168K54o192j0924j4056j5639j5699
$$ 1040199 1081158 1118893 1151215 1176315 1193083 1201251 1201505 1195313 1184389 1170333 1154694 1138995
63338A138995j4817j4190j4785j6589j8988k1758k5181k9203l2972l5548l6761
$$ 1138995 1124178 1109988 1095203 1078614 1059626 1037868 1012687 983484 950512 914964 878203
63327H78203l6942l6129l4030l0775k7029k3203j9117j4717j0639p531n181l161
$$ 878203 841261 805132 771102 740327 713298 690095 670978 656261 645622 638091 632910 629749
63315F29749k207m027r208j5883k1120k3402k3271k1875j9724j6980j4137j1770
$$ 629749 627542 623515 614307 598424 577304 553902 530631 508756 489032 472052 457915 446145
63303D46145r947q350o846n533m376l284k469k278k588k775k475k051k078k672
$$ 446145 436198 427848 421002 415469 411093 407809 405340 403062 400474 397699 395224 393173 391095 388423
63289C88423l481m114m394m347m199m200m300m153l571k808k281k181k468k903
$$ 388423 384942 380828 376434 372087 367888 363688 359388 355235 351664 348856 346575 344394 341926 339023
63275C39023k953k075m61Q08Q72J40k49J37P08Q65O98N76N58N96Q47J437K126
$$ 339023 336070 333995 333534 334342 335214 335354 335105 335242 335950 336815 337513 338089 338647 339243 340090 341527 343653
63258C43653K518K538K474K674L293M193M970N198M818M264M111M578N419O175
$$ 343653 346171 348709 351183 353857 357150 361343 366313 371511 376329 380593 384704 389282 394701 400876
63244D00876O508O497O637P514R306J1588J3659J5097J6073J7109J8482J9897
$$ 400876 407384 413881 420518 428032 437338 448926 462585 477682 493755 510864 529346 549243
63232E49243K0893K1513K2268K3338K4234K4520K4511K4785K5291K5440K5006
$$ 549243 570136 591649 613917 637255 661489 686009 710520 735305 760596 786036 811042
63221H11042K4388K3942K3560K3075K2679K2705K3251K4074K4628K4205K2382
$$ 811042 835430 859372 882932 906007 928686 951391 974642 998716 1023344 1047549 1069931
63210A069931J9420J5866J1745O554J32o881j3634j9674k4772k8632l1130l2560
$$ 1069931 1089351 1105217 1116962 1123516 1123648 1116767 1103133 1083459 1058687 1030055 998925 966365
63198I66365l3235l3053l1729k9383k6532k3621k0679j7495j3999j0526p585n246
$$ 966365 933130 900077 868348 838965 812433 788812 768133 750638 736639 726113 718528 713282
63186G13282k870J53L527O343Q349J0317J2875J5527J7306J8010J8245J8489J8612
$$ 713282 710412 710565 714092 720435 728784 739101 751976 767503 784809 802819 821064 839553 858165
63173H58165J8342J7775J7329J7339J7725J7951J7408J5888J3554J0455O516K090
$$ 858165 876507 894282 911611 928950 946675 964626 982034 997922 1011476 1021931 1028447 1030537
63161A030537j966n221q361j2487j7790k3301k7754l0443l1382l1153l0574l0214
$$ 1030537 1028571 1023350 1014989 1002502 984712 961411 933657 903214 871832 840679 810105 779891
63149G79891k9995k9373k7848k5329k2244j9371j7301j5822j4138j1928r884q884
$$ 779891 749896 720523 692675 667346 645102 625731 608430 592608 578470 566542 556658 547774
63137E47774q861q889q130o463m400k811k377k813k895j798j89O54O42R64K326
$$ 547774 538913 530024 521894 515431 511031 508220 505843 503030 500135 498337 498148 498802 499444 500408 502734
63122E02734L947M719M670M677N065N215M585L591L153L513L902L543K718K393
$$ 502734 506681 511400 516070 520747 525812 531027 535612 539203 542356 545869 549771 553314 556032 558425
63108E58425K831L180K697J785J291J267J102O30K83K29J40p8j01O6j19q29j399
$$ 558425 561256 564436 567133 568918 570209 571476 572578 573208 573491 573720 573860 573782 573681 573747 573628 572799 571400
63091E71400j175l88K55M66M38L23J45J4M7J35J31Q6J79M64R17J500K037K289
$$ 571400 570225 569837 570092 570558 570996 571319 571464 571478 571525 571660 571791 571877 572056 572520 573437 574937 576974 579263
63073E79263K357K724L710N139O751Q539J0338J1602J2091J2490J3695J5644J7508
$$ 579263 581620 584344 588054 593193 599944 608483 618821 630423 642514 655004 668699 684343 701851
63060G01851J8888K0236K2055K4381K7176L0616L4591L8480M1854M5054M8636
$$ 701851 720739 740975 763030 787411 814587 845203 879794 918274 960128 1005182 1053818
63049A053818N2465N5824N8171N9531O0209O0552O0859O1195O1242O0634N9497
$$ 1053818 1106283 1162107 1220278 1279809 1340018 1400570 1461429 1522624 1583866 1644500 1703997
63038A703997N8353N7512N6870N6306N5913N5643N5055N3693N1497M8534M4482
$$ 1703997 1762350 1819862 1876732 1933038 1988951 2044594 2099649 2153342 2204839 2253373 2297855
63027B297855L8664L0600K0299Q132n300j9144l2495m4778n5848o5580p3508p8983
$$ 2297855 2336519 2367119 2387418 2395550 2390250 2371106 2338611 2293833 2237985 2172405 2098897 2019914
63015B019914q1583q1381p8931p5025p0229o4590n7894n0289m2406l4736k7174
$$ 2019914 1938331 1856950 1778019 1702994 1632765 1568175 1510281 1459992 1417586 1382850 1355676
63004A355676j9439j1778m799J297O929J2452J7552K1600K4427K6474K8235K9807
$$ 1355676 1336237 1324459 1319660 1320957 1327886 1340338 1357890 1379490 1403917 1430391 1458626 1488433
62992A488433L1009L1771L2239L2534L2594L2267L1468L0122K8085K5220K1549
$$ 1488433 1519442 1551213 1583452 1615986 1648580 1680847 1712315 1742437 1770522 1795742 1817291
62981A817291J7146J1887N516j963j0182j8771k7643l6592m4845n1390n5893n9054
$$ 1817291 1834437 1846324 1851840 1849877 1839695 1820924 1793281 1756689 1711844 1660454 1604561 1545507
62969A545507o1746o3933o4647o3134n9844n6036n2484m8943m4993m1016l7842
$$ 1545507 1483761 1419828 1355181 1292047 1232203 1176167 1123683 1074740 1029747 988731 950889
62958I50889l5587l3430l0734k7881k5722k4565k3989k3377k2276k0498j8365
$$ 950889 915302 881872 851138 823257 797535 772970 748981 725604 703328 682830 664465
62947F64465j6673j5963j5857j5525j4684j3720j2895j2047j1165j0636j0617
$$ 664465 647792 631829 615972 600447 585763 572043 559148 547101 535936 525300 514683
62936E14683j0546r738q220o615n407m678m354m332m408m377m246m085l747l017
$$ 514683 504137 494399 486179 479564 474157 469479 465125 460793 456385 452008 447762 443677 439930 436913
62922D36913k061j352j104j076j075j297j909k569k770k501k221k196k255k212
$$ 436913 434852 433500 432396 431320 430245 428948 427039 424470 421700 419199 416978 414782 412527 410315
62908D10315k132j976j461n80O4p8o75q62m08k0l57j174j658j396p21k53k84n20
$$ 410315 408183 406207 404746 404166 404230 404152 403477 402615 402207 402187 401830 400656 398998 397602 396881 396628 396344 395824
62890C95824l89K15O00L8j154j832j439o57k72L2J055K669L760L524K220O20o83
$$ 395824 395435 395650 396250 396288 395134 393302 391863 391206 390934 390966 392021 394690 398450 401974 404194 404814 404131
62873D04131j275r03J73J163J333N55q01k156k834k311p64R07J841K002J951J994
$$ 404131 402856 401953 402126 403289 404622 405177 404376 402220 399386 397075 396311 397218 399059 401061 403012 405006
62857D05006J878J285L90k62l44k6L52P67J433K278K799K642K073J650J528J426
$$ 405006 406884 408169 408559 408297 407953 407927 408279 409046 410479 412757 415556 418198 420271 421921 423449 424875
62841D24875J176R51R04R06P39M09J46K27P25J268J236M85k26J0J106K058K257
$$ 424875 426051 427002 427906 428812 429551 429960 430106 430333 431058 432326 433562 434047 433821 433831 434937 436995 439252
62824D39252K169K424K796K612J900J445J748K425K810K794K763K955L193L282
$$ 439252 441421 443845 446641 449253 451153 452598 454346 456771 459581 462375 465138 468093 471286 474568
62810D74568L368L700M148M270L964L740M149N086O026O757P546Q580R718J0860
$$ 474568 477936 481636 485784 490054 494018 497758 501907 506993 513019 519776 527322 535902 545620 556480
62796E56480J2122J3427J4353J4735J5096J6055J7536J9039K0636K3153K7209
$$ 556480 568602 582029 596382 611117 626213 642268 659804 678843 699479 722632 749841
62785G49841L2437L7889M2960M7697N2433N7440O2880O8765P4882Q0914Q6665
$$ 749841 782278 820167 863127 910824 963257 1020697 1083577 1152342 1227224 1308138 1394803
62774A394803R1925R6119R8454R8629R7074R4014Q8619P9710O7361N3013L7864
$$ 1394803 1486728 1582847 1681301 1779930 1877004 1971018 2059637 2139347 2206708 2259721 2297585
62763B297585K1882M840j2369k8368m2819n6291o8712p8884q5878r0124r2609
$$ 2297585 2319467 2324307 2311938 2283570 2240751 2184460 2115748 2036864 1950986 1860862 1768253
62752A768253r3667r3030r0722q7223q2941p8014p2634o7230o2191n7564n3004
$$ 1768253 1674586 1581556 1490834 1403611 1320670 1242656 1170022 1102792 1040601 983037 930033
62741I30033m8058m2656l7410l3204l0302k8042k5539k2526j9379j6545j4256
$$ 930033 881975 839319 801909 768705 738403 710361 684822 662296 642917 626372 612116
62730F12116j2572j1378j0369r234p883o437n078l978l182k448j405j6J292K185
$$ 612116 599544 588166 577797 568563 560680 554243 549165 545187 542005 539557 538152 538136 539428 541613
62716E41613K914L987N508P152Q691J0240J1987J3977J6179J8523K0881K3291
$$ 541613 544527 548514 554022 561174 569865 580105 592092 606069 622248 640771 661652 684943
62704F84943K6130K9770L3946L7856M1123M4323M8255N2861N7323O1098O4425
$$ 684943 711073 740843 774789 812645 853768 898091 946346 999207 1056530 1117628 1182053
62693A182053O7642P0477P2323P2877P2117O9728O5106N7983M8709L7780K5449
$$ 1182053 1249695 1320172 1392495 1465372 1537489 1607217 1672323 1730306 1779015 1816795 1842244
62682A842244J2001j998j5939k9418m1937n2699o1086o7182p1453p4062p4830
$$ 1842244 1854245 1852247 1836308 1806890 1764953 1712254 1651168 1583986 1512533 1438471 1363641
62671A363641p3812p1439o8174o4362o0406n6645n3015m9163m4967m0641l6373
$$ 1363641 1289829 1218390 1150216 1085854 1025448 968803 915788 866625 821658 781017 744644
62660G44644l2259k8568k5594k3153k0703j8142j6016j4723j3930j3024j1869
$$ 744644 712385 683817 658223 635070 614367 596225 580209 565486 551556 538532 526663
62649E26663j0760r961r500r258q993q461p608o510n118l402j758p38k73L36J336
$$ 526663 515903 505942 496442 487184 478191 469730 462122 455612 450494 447092 445334 444596 444323 444659 445995
62634D45995K014J719R36O47Q93P27m26j935k785k731k335k042j575m20J262K549
$$ 445995 448009 449728 450664 451311 452204 452931 452505 450570 447785 445054 442719 440677 439102 438682 439944 442493
62618D42493K770K326K163K594L173L624M221N057N692N916O247P177Q399R378
$$ 442493 445263 447589 449752 452346 455519 459143 463364 468421 474113 480029 486276 493453 501852 511230
62604E11230J0196J1211J2264J3047J3962J5776J8450K1167K3526K5992K8959
$$ 511230 521426 532637 544901 557948 571910 587686 606136 627303 650829 676821 705780
62593G05780L2184L5441L9034M3093M6846M9168M9635M8579M6297M2646L7402
$$ 705780 737964 773405 812439 855532 902378 951546 1001181 1049760 1096057 1138703 1176105
62582A176105L0614K2608J3798M663m330j2831k0627k7588l3604l8545m2209m4392
$$ 1176105 1206719 1229327 1243125 1247788 1243458 1230627 1210000 1182412 1148808 1110263 1068054 1023662
62570A023662m5106m4748m3926m2949m1533l9167l5887l2560l0077k8395k6541
$$ 1023662 978556 933808 889882 846933 805400 766233 730346 697786 667709 639314 612773
62559F12773k3729k0175j6751j4135j2417j1332j0486r564q522p626p064o654
$$ 612773 589044 568869 552118 537983 525566 514234 503748 494184 485662 478036 470972 464318
62547D64318o023n010l744k464j405p11k85J37O36R91J047J003J103J250J230
$$ 464318 458295 453285 449541 447077 445672 444961 444676 444813 445449 446440 447487 448490 449593 450843 452073
62532D52073J089R98R96J134J750L079M757O103O905P546Q392R552J1202J3594
$$ 452073 453162 454160 455156 456290 458040 461119 465876 471979 478884 486430 494822 504374 515576 529170
62518E29170J6546J9374K1720K4008K6841L0133L3268L5993L8630M1403M3877
$$ 529170 545716 565090 586810 610818 637659 667792 701060 737053 775683 817086 860963
62507H60963M5379M5676M4975M3343M0525L6481L1735K6775K1357J4869P379r7
$$ 860963 906342 952018 996993 1040336 1080861 1117342 1149077 1175852 1197209 1212078 1219457 1219360
62495A219360o472j1262j4311j5360j4337j1691q012l489J867P619J3061J7901
$$ 1219360 1212888 1201626 1187315 1171955 1157618 1145927 1137915 1134426 1136293 1143912 1156973 1174874
62483A174874K2425K6985L1627L6230M0620M4347M6538M6146M2483L5621K6442
$$ 1174874 1197299 1224284 1255911 1292141 1332761 1377108 1423646 1469792 1512275 1547896 1574338
62472A574338J6175N834l987j3042k1608l0569m0628n1086n9951o5664o8347o9108
$$ 1574338 1590513 1596347 1592360 1579318 1557710 1527141 1486513 1435427 1375476 1309812 1241465 1172357
62460A172357o8645o7090o4588o1211n6687n1013m5151m0198l6019l1546k6473
$$ 1172357 1103712 1036622 972034 910823 854136 803123 757972 717774 681755 650209 623736
62449F23736k1746j8195j5571j3294j1312r828q679p572o507n570m674l800l108
$$ 623736 601990 583795 568224 554930 543618 533790 525111 517539 511032 505462 500788 496988 493880
62436D93880k514j671o49j81p20j672k097j888j710k006k617l233l683l781l476
$$ 493880 491366 489695 489046 488865 488145 486473 484376 482488 480778 478772 476155 472922 469239 465458 461982
62421D61982l175l434m184m678m437l840l480l319k943k420k292k680k952k673
$$ 461982 458807 455373 451189 446511 442074 438234 434754 431435 428492 426072 423780 421100 418148 415475
62407D15475k338k641l313l366k503j527j121r65m29L91R92J397K020K834L333
$$ 415475 413137 410496 407183 403817 401314 399787 398666 397701 397272 397663 398655 400052 402072 404906 408239
62392D08239L347L223L191L127L048L287L917M469M523M210L955M032M589N711
$$ 408239 411586 414809 418000 421127 424175 427462 431379 435848 440371 444581 448536 452568 457157 462868
62378D62868P164Q289Q568Q173P767P846Q449R394J0576J1900J3112J3878J4238
$$ 462868 470032 478321 486889 495062 502829 510675 519124 528518 539094 550994 564106 577984 592222
62365E92222J4861J6580J9525K2982K6237K9324L2671L6457M0663M5404N0693
$$ 592222 607083 623663 643188 666170 692407 721731 754402 790859 831522 876926 927619
62354I27619N6019O0664O4314O6859O7779O6301O2186N5776M7338L7039K5628
$$ 927619 983638 1044302 1108616 1175475 1243254 1309555 1371741 1427517 1474855 1511894 1537522
62343A537522J4413M276m824j3208k0840k7592l3659l9295m4385m8484n1160n2252
$$ 1537522 1551935 1556211 1551387 1538179 1517339 1489747 1456088 1416793 1372408 1323924 1272764 1220512
62331A220512n2000n0886m9082m6262m2307l8015l4445l1728k9162k6479k4233
$$ 1220512 1168512 1117626 1068544 1022282 979975 941960 907515 875787 846625 820146 795913
62320G95913k2839k2025k1383k0800k0090j9002j7802j7090j6759j6004j4643
$$ 795913 773074 751049 729666 708866 688776 669774 651972 634882 618123 602119 587476
62309E87476j3513j3075j2593j1343r778q590p437n657l673k571k539k758k635
$$ 587476 573963 560888 548295 536952 527174 518584 511147 505490 501817 499246 496707 493949 491314
62296D91314k255j699q47Q6O19O98P21R29J347K219L724N289N960N635N238N445
$$ 491314 489059 487360 486513 486599 487218 487916 488637 489566 490913 493132 496856 502145 508105 513740 518978 524423
62280E24423N892N922N573N357N543O071O954Q344J0224J2251J3965J5171J6092
$$ 524423 530315 536237 541810 547167 552710 558781 565735 574079 584303 596554 610519 625690 641782
62267F41782J7182J8628K0237K1830K3562K5615K7902L0358L3311L7076M1364
$$ 641782 658964 677592 697829 719659 743221 768836 796738 827096 860407 897483 938847
62256I38847M5496M9197N2755N6392N9907O2875O4773O4802O2037N6002M7025
$$ 938847 984343 1033540 1086295 1142687 1202594 1265469 1330242 1395044 1457081 1513083 1560108
62245A560108L6019K4083J2224J089r095j8209k6035l2667l8925m5705n2805n8865
$$ 1560108 1596127 1620210 1632434 1633523 1624428 1606219 1580184 1547517 1508592 1462887 1410082 1351217
62233A351217o2680o4233o4228o3067o0651n6942n2320m7366m2572l8227l4381
$$ 1351217 1288537 1224304 1160076 1097009 1036358 979416 927096 879730 837158 798931 764550
62222G64550l0842k7388k4006k0912j8259j5904j3544j1155r173q123q052q368
$$ 764550 733708 706320 682314 661402 643143 627239 613695 602540 593367 585244 577192 568824
62210E68824q259p252n523l818k901k825k793j989m68J073K286L405M555N371
$$ 568824 560565 553313 547790 543972 541071 538246 535453 533464 532996 534069 536355 539760 544315 549686
62196E49686N602N543N538N547N559O001P229Q902J0288J1031J1204J0943J0457
$$ 549686 555288 560831 566369 571916 577475 583476 590705 599607 609895 620926 632130 643073 653530
62183F53530J0252J0783J1934J3112J3801J3668J2480J0358Q046O459N938O278
$$ 653530 663782 674565 686499 699611 713412 727080 739560 749918 757964 764423 770361 776639
62171G76639P253Q829J0979J3784J7524K2269K7466L2441L7134M1834M6290M9662
$$ 776639 783892 792721 803700 817484 835008 857277 884743 917184 954318 996152 1042442 1092104
62159A092104N1348N1272M9321M5098L8511L0137K0870J1522K883m357j0073j4875
$$ 1092104 1143452 1194724 1244045 1289143 1327654 1357791 1378661 1390183 1393066 1388709 1378636 1363761
62147A363761j9607k4745l0201l5371l9337m1448m1889m1474m0731l9402l6942
$$ 1363761 1344154 1319409 1289208 1253837 1214500 1173052 1131163 1089689 1048958 1009556 972614
62136I72614l3238k8780k4369k0695j7972j5836j3685j1193q434n693l387j959
$$ 972614 939376 910596 886227 865532 847560 831724 818039 806846 798412 792719 789332 787373
62124G87373j412j034J3J817L712N157O208P109P877Q425Q732Q677P957O317L774
$$ 787373 785961 784927 784940 786757 790469 795626 801834 808943 816820 825245 833977 842654 850611 856928 860702
62109H60702O35k476m706n456m922l909l188l209m226o168q332r737r951r229
$$ 860702 861337 858861 854155 848699 843777 839868 836680 833471 829245 823077 814745 805008 795057 785828
62095G85828p797n565k684R2K045L157L893M551N130N571N907O261O858P878R150
$$ 785828 778031 772466 769782 769874 771919 775076 778969 783520 788650 794221 800128 806389 813247 821125 830275
62080H30275J0274J1217J2438J4243J6251J7874J9114K0523K2375K4199K5246
$$ 830275 840549 851766 864204 878447 894698 912572 931686 952209 974584 998783 1024029
62069A024029K5228K4545K3854K3538K3691K4498K6369K9377L2745L5231L6146
$$ 1024029 1049257 1073802 1097656 1121194 1144885 1169383 1195752 1225129 1257874 1293105 1329251
62058A329251L5667L4124L1370K7026K1123J4233P131N19n109r735j4008j8860
$$ 1329251 1364918 1399042 1430412 1457438 1478561 1492794 1499925 1500444 1495335 1485600 1471592 1452732
62046A452732k4661l0774l6104m0156m3398m6422m8975n0104m9322m7276m5108
$$ 1452732 1428071 1397297 1361193 1321037 1277639 1231217 1182242 1132138 1082816 1035540 990432
62035I90432m3409m1967m0237l7840l4744l1311k8011k4985k2002j9015j6386
$$ 990432 947023 905056 864819 826979 792235 760924 732913 707928 685926 666911 650525
62024F50525j4405j2894j1646j0861j0723j0858j0678j0071r310q565q010q033
$$ 650525 636120 623226 611580 600719 589996 579138 568460 558389 549079 540514 532504 524471
62012E24471q661r010q128o227m330k820j171Q35K618L775M646N508O019N955
$$ 524471 515810 506800 498672 492445 488115 485295 484124 484959 487577 491352 495998 501506 507525 513480
61998E13480N801O015O267O028N464N062M711L859K409Q07p00k361m383o539q492
$$ 513480 519281 525296 531563 537591 543055 548117 552828 556687 559096 559903 559203 556842 552459 545920 537428
61983E37428j0150j1526j2390j2353j1392j0090r177q778q355p502o461n627m896
$$ 537428 527278 515752 503362 491009 479617 469527 460350 451572 443217 435715 429254 423627 418731
61970D18731l971l033k518k322j888j082l28J24M35N91L46m0J94J199K145K399
$$ 418731 414760 411727 409209 406887 404999 403917 403589 403713 404148 404739 405085 405045 405239 406438 408583 410982
61954D10982K445K962L677L840L460L310L860M944O354Q059R825J1209J2107J2932
$$ 410982 413427 416389 420066 423906 427366 430676 434536 439480 445834 453893 463718 474927 487034 499966
61940D99966J4073J5493J6950J8384J9889K1360K2340K2316K1302K0051J9363
$$ 499966 514039 529532 546482 564866 584755 606115 628455 650771 672073 692124 711487
61929G11487J9161J8565J7011J4862J2755J0733Q383N534K456m93l079n142o610
$$ 711487 730648 749213 766224 781086 793841 804574 812957 818491 820947 820454 817375 812233 805623
61916H05623p499p819p680p377o993n858l029J325N643Q627J0709J3137J5930
$$ 805623 798124 790305 782625 775248 768255 762397 759368 760693 766336 774963 785672 798809 814739
61903H14739J7645J7234J5289J3070J0881P943L666j413o034r347j1545j3415
$$ 814739 832384 849618 864907 877977 888858 896801 900467 899054 893020 883673 872128 858713
61891H58713j5408j7259j8483j8968j8933j8485j7440j5664j3487j1714j1084
$$ 858713 843305 826046 807563 788595 769662 751177 733737 718073 704586 692872 681788
61880F81788j1563j2287j2460j2288j2616j3645j4457j4080j2562j0693q995p475
$$ 681788 670225 657938 645478 633190 620574 606929 592472 578392 565830 555137 546142 538667
61868E38667o099n016m247l545k595j174P94L118N297O917Q138R551J1524J3857
$$ 538667 532568 527552 523305 519760 517165 515991 516785 519903 525200 532117 540255 549806 561330 575187
61854E75187J6165J8409K0870K3685K6588K9197L1481L3688L5794L7269L7532
$$ 575187 591352 609761 630631 654316 680904 710101 741582 775270 811064 848333 885865
61843H85865L6497L4458L1632K8040K3735J8851J3486P778K048l340q082j1741
$$ 885865 922362 956820 988452 1016492 1040227 1059078 1072564 1080342 1082390 1079050 1070968 1059227
61831A059227j3736j3918j2913j1388r222n909j584K946P082J0674J3446J4949
$$ 1059227 1045491 1031573 1018660 1007272 998050 992141 990557 993503 1000585 1011259 1024705 1039654
61819A039654J5065J3884J1143O555P20n251j1121j7518k4271k9860l3065l4307
$$ 1039654 1054719 1068603 1079746 1086301 1087021 1081770 1070649 1053131 1028860 999000 965935 931628
61807I31628l4680l4485l3470l1808l0003k8214k6375k4556k2735k0659j8451
$$ 931628 896948 862463 828993 797185 767182 738968 712593 688037 665302 644643 626192
61796F26192j6717j5536j4046j1728r436q280q075p809p151o498n893m969l821
$$ 626192 609475 593939 579893 568165 558729 550449 542374 534565 527414 520916 515023 510054 506233
61783E06233k961k512k235k213k660l136k855j808q50n75q23j239j599j601j046
$$ 506233 503272 500760 498525 496312 493652 490516 487661 485853 485003 484428 483605 482366 480767 479166 478120
61768D78120l26rP1O25J718K539K540K168K159K672L406M065M442M367L908L378
$$ 478120 477794 477785 477856 478481 480199 482738 485278 487446 489605 492277 495683 499748 504190 508557 512465 515843
61752E15843L025K837K628K134J099m39k009l139l787m174m418m555m648m540
$$ 515843 518868 521705 524333 526467 527566 527127 525118 521979 518192 514018 509600 505045 500397 495857
61738D95857l897k835k070j970j962j467q28n86l79M19J385J532R16N74R08J269
$$ 495857 491960 489125 487055 485085 483123 481656 480828 480242 479863 480282 481667 483199 484115 484689 485597 486866
61722D86866J326J616K374K929K759K278K038J922J643J388J327J129N17j51l86
$$ 486866 488192 489808 492182 495111 497870 500148 502186 504108 505751 507139 508466 509595 510112 509961 509575
61707E09575k82l10p53j697l156m730n580n179l949k771k133k043k368k888l201
$$ 509575 509293 508983 508230 506533 503377 498647 493067 487888 483939 481168 479035 476992 474624 471736 468535
61692D68535l075k767k724k977l186l148l040l068l153l057k761k563k658k783
$$ 468535 465460 462693 459969 456992 453806 450658 447618 444550 441397 438340 435579 433016 430358 427575
61678D27575k543k047j837k102k402k394k297k371k411k248k206k484k560j945
$$ 427575 425032 422985 421148 419046 416644 414250 411953 409582 407171 404923 402717 400233 397673 395728
61664C95728j062n67k17P03J968K564K206J707J733K027K108J926J655J423J454
$$ 395728 394666 394099 393882 394585 396553 399117 401323 403030 404763 406790 408898 410824 412479 413902 415356
61649D15356J820K129K058K060K753L652L650K784K403L289M564M970M275L028
$$ 415356 417176 419305 421363 423423 426176 429828 433478 436262 438665 441954 446518 451488 455763 458791
61635D58791J724P17K20j23j023k474l538l511k789k226k287l032m197m986m617
$$ 458791 460515 461232 461452 461329 460306 457832 454294 450783 447994 445768 443481 440449 436252 431266 426649
61620D26649l395k451k148j713q01k41o05j103q59l94q47k283l769m705n186n386
$$ 426649 423254 420803 418655 416942 416141 415900 415295 414192 413333 412939 412092 409809 406040 401335 396149 390763
61604C90763n389n448n718n919n708n135m422l726l331l577m169m273l675l151
$$ 390763 385374 379926 374208 368289 362581 357446 353024 349298 345967 342390 338221 333948 330273 327122
61590C27122l214l292k762k016j740j866j962k032k102j685n91M14N95L79N57
$$ 327122 323908 320616 317854 315838 314098 312232 310270 308238 306136 304451 303860 304274 304869 305248 305805
61575C05805R19O97j15q77j342j600j373m42N30O31o6p67j179j448j281k62J101
$$ 305805 306724 307421 307306 306429 305087 303487 302114 301672 302202 302833 302767 302000 300821 299373 298092 297830 298931
61558B98931J790J695J579J691J456O44j59m35k03M37J395K146K087J442J011
$$ 298931 300721 302416 303995 305686 307142 307786 307627 307192 306989 307426 308821 310967 313054 314496 315507
61543C15507R53O89O6k66R7P84J380J961K610L099L310L356L156K436J323L68
$$ 315507 316460 317149 317215 316949 317046 317830 319210 321171 323781 326880 330190 333546 336702 339138 340461 340829
61527C40829j45l72m32l50m03q33j329j419j285j376j443r43k57l38j081j293
$$ 340829 340684 340312 339880 339530 339127 338294 336965 335546 334261 332885 331442 330499 330242 329904 328823 327530
61511C27530n13L88P05P56P57J81j002j608q28M05O89R1k65KK83K27J61L43N94
$$ 327530 327017 327405 328110 328866 329623 329804 328802 327194 326366 326771 327460 327551 327286 327288 327571 327798 327959 328302 328896
61492C28896P91R87J036O96J59J6M97J115J223P18J18kM30J040J600K304L133
$$ 328896 329687 330674 331710 332406 332565 332581 333078 334193 335416 336134 336252 336250 336680 337720 339320 341624 344757
61475C44757L443K728J575J014J031O88k27p98n63l39q20j397j246p28o07o36
$$ 344757 348200 350928 352503 353517 354548 355236 355009 354211 353648 353309 352489 351092 349846 349118 348511 347875
61459C47875j06P09R13N96P70J613K032J308J79k32J49N51M90J88R6M63J241K109
$$ 347875 347769 348478 349391 349987 350757 352370 354402 355710 355889 355657 355806 356357 356847 357035 357131 357594 358835 360944
61441C60944K670K679K160J313N58M45J198K330L045K991K429J666Q53K75L87
$$ 360944 363614 366293 368453 369766 370324 370769 371967 374297 377342 380333 382762 384428 385281 385556 385943
61426C85943J236K197K516J999J030J23l09M1J196K677L643L524K527J453R27
$$ 385943 387179 389376 391892 393891 394921 395044 394735 394776 395972 398649 402292 405816 408343 409796 410723
61411D10723R06Q92N31j77j046j854k388k675l076l769m171l487j998j074j498
$$ 410723 411629 412521 413052 412875 411829 409975 407587 404912 401836 398067 393896 390409 388411 387337 385839
61396C85839k383k387j527r07r50r25k95M22N78L67L47N28N44M42N86R55J155
$$ 385839 383456 381069 379542 378635 377685 376760 376465 376887 377465 377832 378179 378707 379251 379693 380279 381234 382389
61379C82389J140J401K224L157L450K867J884J260J433K192K847K832K259J725
$$ 382389 383529 384930 387154 390311 393761 396628 398512 399772 401205 403397 406244 409076 411335 413060
61365D13060J521J356R69P53J282K411L326L536L367L387L776M536N807P509Q975
$$ 413060 414581 415937 416906 417659 418941 421352 424678 428214 431581 434968 438744 443280 449087 456596 465571
61350D65571R568R530R660J0132J0238R398P847O046M008J721j43o95N4J097J542
$$ 465571 475139 484669 494329 504461 514699 524097 531944 537990 541998 543719 543576 542881 542935 544032 545574
61335E45574J422J259J211R56K35q23j922k890l741m487m979m975m435l695l244
$$ 545574 546996 548255 549466 550422 550657 549834 547912 545022 541281 536794 531815 526840 522405 518710 515466
61320E15466l211l247k999k553k244k119j837j196l96L05R97J945L191M578O053
$$ 515466 512255 509008 506009 503456 501212 499093 497256 496060 495664 495969 496966 498911 502102 506680 512733
61305E12733P640R212J0456J1079J0824R401O810L590M37k453n169p300q050p343
$$ 512733 520373 529585 540041 551120 561944 571345 578155 581745 582182 579729 574560 567260 559210 551867
61291E51867o186n541n346n129m959n074m994l948k083l99N08R44J248J332J338
$$ 551867 545681 540140 534794 529665 524706 519632 514638 510690 508607 508208 508716 509660 510908 512240 513578
61276E13578J987L625N443O290O045N631N749O141O191N790N328N088M946M760
$$ 513578 515565 519190 524633 530923 536968 542599 548348 554489 560680 566470 571798 576886 581832 586592
61262E86592M784N423O626P909R044J0340J1838J2629J1538Q576N152K735J628
$$ 586592 591376 596799 603425 611334 620378 630718 642556 655185 666723 675299 680451 683186 684814
61249F84814J161O44j06r03j480j827k322l394m920o201o709o646o616o845p036
$$ 684814 685975 686619 686513 685610 684130 682303 679981 676587 671667 665466 658757 652111 645495 638650 631614
61234F31614o901o613o558o766o732n966m574l140k024j128l88p5l09o93p68o06
$$ 631614 624713 618100 611542 604776 598044 592078 587504 584364 582340 581212 580824 580749 580440 579747 578979 578373
61218E78373n18m63j68M08J151K130L214L685K965J595O46K15n85k024l106k902
$$ 578373 577855 577392 577224 577632 578783 580913 584127 587812 590777 592372 593018 593233 592648 590624 587518 584616
61202E84616j654o8J711L810N936P754R557J1900J4714J7330J9190K0100J9972
$$ 584616 582962 582894 584605 588415 594351 602105 611662 623562 638276 655606 674796 694896 714868
61189G14868J8797J6799J4273J1411Q513O118M640L944L606L380L231L063K690
$$ 714868 733665 750464 764737 776148 784661 790779 795419 799363 802969 806349 809580 812643 815333
61176H15333J954Q17n75j883k940m012n371o715p543q066q944j0064j0475r889
$$ 815333 817287 818104 817529 815646 812706 808694 803323 796608 789065 780999 772055 761991 751516 741627
61162G41627r309r637j0508j1148j1582j2134j2398j1658j0010q178o493m855
$$ 741627 732318 722681 712173 701025 689443 677309 664911 653253 643243 635065 628572 623717
61150F23717l297j821l7K159L763L500J341j583m407p012r248j0656j1078j0768
$$ 623717 620420 618599 618562 620721 624484 627984 629325 627742 623335 616323 607075 596419 585341 574573
61136E74573r836q265o422m781l240j450L08J394J901K495L275L865M629O573
$$ 574573 564737 556472 550050 545269 542029 540579 540887 542281 544182 546677 549952 553817 558446 565019
61122E65019R684J2515J3956J4513J5277J6438J7481J8186J8816J9718K1097K2753
$$ 565019 574703 587218 601174 615687 630964 647402 664883 683069 701885 721603 742700 765453
61110G65453K3827K3528K2266K1346K1256K1165K0316J8958J7342J4955J1520
$$ 765453 789280 812808 835074 856420 877676 898841 919157 938115 955457 970412 981932
61099I81932P778M410R35l319p813j1361j3595j4995j5996j6921j8302k0207k1650
$$ 981932 989710 994120 995055 991736 983923 972562 958967 943972 927976 911055 892753 872546 850896
61086H50896k1668k0672j9796j9276j8485j7268j6144j5288j4345j3244j2168
$$ 850896 829228 808556 788760 769484 750999 733731 717587 702299 687954 674710 662542
61075F62542j0847q843o530m858m071l554k926k292j509k84R40J344J188J722
$$ 662542 651695 642852 636322 631464 627393 623839 620913 618621 617112 616828 617768 619112 620300 622022
61061F22022L338M942N638N959O794Q083R311J0493J1859J3196J4210J5139J6322
$$ 622022 625360 630302 635940 641899 648693 656776 666087 676580 688439 701635 715845 730984 747306
61048G47306J7571J8516J9286K0385K2120K4375K6705K8533K9719L0876L2528
$$ 747306 764877 783393 802679 823064 845184 869559 896264 924797 954516 985392 1017920
61037A017920L4078L4446L3787L3480L4260L5534L6849L8687M1182M3462M5026
$$ 1017920 1051998 1086444 1120231 1153711 1187971 1223505 1260354 1299041 1340223 1383685 1428711
61026A428711M6644M8911N1065N2279N3079N4424N6435N9199O3664P0430P8680
$$ 1428711 1475355 1524266 1575331 1627610 1680689 1735113 1791548 1850747 1914411 1984841 2063521
61015B063521Q7664R8199J11120J25474J40111J56157J75996K00913K31833K71174
$$ 2063521 2151185 2249384 2360504 2485978 2626089 2782246 2958242 3159155 3390988 3662162
61005C662162L21325L82270M53775N38858O41783P64265R08779J083869J296586
$$ 3662162 3983487 4365757 4819532 5358390 6000173 6764438 7673217 8757086 10053672
60996A0053672J534758J761970J932708K003753J926532J648973J160381N49258
$$ 10053672 11588430 13350400 15283108 17286861 19213393 20862366 22022747 22572005
60988B2572005m636l29456l70473k06246L0216K28381L06577J88351j74231p36840
$$ 22572005 22567369 22237913 21867440 21661194 21691410 21919791 22226368 22414719 22240488 21503648
60978B1503648j346215j818047k046053k042603j890509j672579j440742j222488
$$ 21503648 20157433 18339386 16293333 14250730 12360221 10687642 9246900 8024412
60970H024412j031176q68624p29625o09995n08947m25213l55545k97727k51538
$$ 8024412 6993236 6124612 5394987 4784992 4276045 3850832 3495287 3197560 2946022
60961B946022k15967j88084j65374j46938j31889j18618j06193r4794q4306p4073
$$ 2946022 2730055 2541971 2376597 2229659 2097770 1979152 1872959 1778165 1693859 1619786
60951A619786o4296n5994m9302m3396l8343l5341l4699l5150l5588l5953l6028
$$ 1619786 1555490 1499496 1450194 1406798 1368455 1333114 1298415 1263265 1227677 1191724 1155696
60940A155696l5019l3006l1340l0763l0420k9454k8374k7950k7824k7097k5537
$$ 1155696 1120677 1087671 1056331 1025568 995148 965694 937320 909370 881546 854449 828912
60929H28912k3481k1262j9228j7635j6129j4107j1876j0512j0282j0172r302p854
$$ 828912 805431 784169 764941 747306 731177 717070 705194 694682 684400 674228 664926 657072
60917F57072o282m677l341k822k910k635j660n99L77J804L388L778K647J551J664
$$ 657072 650790 646113 642772 639950 637040 634405 632745 632146 632523 634327 637715 641493 644140 645691 647355
60902F47355K113J754J218J694K734K936K049R61nj305l061m910o676q235r010
$$ 647355 649468 651222 652440 654134 656868 659804 661853 662814 662809 661504 658443 653533 646857 638622 629612
60887F29612q655p854p551p765q023q417r209r922r922r513r422r526r170q372
$$ 629612 620957 613103 605552 597787 589764 581347 572138 562216 552294 542781 533359 523833 514663 506291
60873E06291p697p224o695o323o363o198m986l017j313k17N79R13M53j19M02J950
$$ 506291 498594 491370 484675 478352 471989 465791 460805 457788 456475 456258 456837 457750 458203 458084 458486 460436
60857D60436L192L430L228L039K543J764J573K384L391L668L357L138L267L568
$$ 460436 463628 467058 470286 473325 475868 477632 479205 481589 484980 488648 492005 495143 498410 501978
60843E01978L858L871L285K174J030J39p02j624k453l105l736m333m601m414l915
$$ 501978 505836 509707 512992 515166 516196 516335 515633 514009 511556 508451 504715 500382 495781 491367 487452
60828D87452l170k240j512j320j312q89k33j49p96j437j592j575j732k021k595
$$ 487452 484282 482042 480530 479210 477898 477009 476776 476627 475831 474394 472802 471227 469495 467474 464879
60813D64879l798n189n578m711l978m662o142o757n951m657l831l521l402l371
$$ 464879 461081 455892 450314 445603 441625 436963 430821 424064 418113 413456 409625 406104 402702 399331
60799C99331l407l402l317l229l059k590j806j073p88r57j204j215j038r22q77
$$ 399331 395924 392522 389205 385976 382917 380327 378521 377448 376660 375703 374499 373284 372246 371324 370447
60784C70447o16j6N75O97L79J00K60Q57J604K155K309K233K400L107M106M858
$$ 370447 369831 369815 370390 371087 371466 371566 371826 372683 374287 376442 378751 380984 383384 386491 390597 395455
60768C95455M993M381L089J592P00P90J301J350P59N7l24l49j30J54J26m75j319
$$ 395455 400448 404829 407918 409510 410210 411000 412301 413651 414410 414467 414143 413794 413664 413818 413944 413469 412150
60751D12150j821j882j871j952j899j582j168q40o76p53j090j553k079k834l818
$$ 412150 410329 408447 406576 404624 402725 401143 399975 399135 398459 397706 396616 395063 392984 390150 386332
60736C86332m656n126n560o178o447n742m333l043k180j546j121r69p19n6M95
$$ 386332 381676 376550 370990 364812 358365 352623 348290 345247 343067 341521 340400 339431 338712 338656 339151
60721C39151K27m58m91K41P93P34O44Q65R20N77M18Q60J442J631J546J452J247
$$ 339151 339378 338920 338429 338670 339463 340197 340841 341706 342626 343203 343621 344481 345923 347554 349100 350552 351799
60704C51799R61J055J733K499K822K769K605K372K105J917J682J243J056J836
$$ 351799 352760 353815 355548 358047 360869 363638 366243 368615 370720 372637 374319 375562 376618 378454
60690C78454L221L757K655Q39k81l36J46O58Q87O13K5k73o3J50q1o12j180j748
$$ 378454 381675 385432 388087 388926 388645 388309 388455 389113 390000 390613 390638 390365 390302 390452 390371 389759 388579 386831
60672C86831k060j696r39p02j131j255o26k58j112k502l126k850k450k239k046
$$ 386831 384771 383075 382136 381434 380303 379048 378422 378164 377052 374550 371424 368574 366124 363885 361839
60657C61839k046k357k282j128M60J127O80K31M54Q70R74J070J604K385K863K640
$$ 361839 359793 357436 355154 354026 354486 355613 356293 356524 356978 357848 358822 359892 361496 363881 366744 369384
60641C69384J584j20j824k855l139l100k949k583k041j485p83K33J083R24k89
$$ 369384 370968 370848 369024 366169 363030 359930 356981 354398 352357 350872 350089 350322 351405 352329 352040
60626C52040j569k070j946j744j499r50k47J61K11L24P41J143J136Q32O64O97
$$ 352040 350471 348401 346455 344711 343212 342262 342015 342176 342387 342711 343452 344595 345731 346563 347227 347924
60610C47924N54P2l24k11K38N96Q79J348J808J733J117N50L90M51N77Q79J195
$$ 347924 348478 348550 348226 348015 348253 348849 349728 351076 352884 354617 355734 356284 356674 357125 357702 358581 359776
60593C59776J067N88N71J432K506K967K849K653K429J922J154L87k75o83m80L69
$$ 359776 360843 361431 362002 363434 365940 368907 371756 374409 376838 378760 379914 380301 380026 379343 378863 379232
60577C79232J203J400J192J285J902K754L652M611N539O379P338Q571R727J0299
$$ 379232 380435 381835 383027 384312 386214 388968 392620 397231 402770 409149 416487 425058 434785 445084
60563D45084J0312J0230J0326J0391R912Q403N805K793K67j548l122m613n535
$$ 445084 455396 465626 475952 486343 496255 504658 510463 513256 513523 511975 508853 504240 498705
60550D98705n614n208m453k873m60J696K732L213M127N361O235P038Q688J1172
$$ 498705 493091 487883 483430 480557 480097 481793 484525 487738 491865 497226 503461 510499 519187 530359
60536E30359J3468J5022J6202J7278J7888J7629J6368J3913J0179N779J651j865
$$ 530359 543827 558849 575051 592329 610217 627846 644214 658127 668306 674085 675736 673871
60524F73871m987p593r199r803r867r545q703p693p153o924o200m927l966l570
$$ 673871 668884 661291 652092 642289 632422 622877 614174 606481 599328 592404 586204 581277 577311 573741
60510E73741k842j218M87J361J851L036M999O929Q494J0236J2680J5836J9666
$$ 573741 570899 569681 570168 571529 573380 576416 581415 588344 596838 607074 619754 635590 655256
60497F55256K4259K9327L4062L7875M0979M3828M6246M7494M7151M5442M2578
$$ 655256 679515 708842 742904 780779 821758 865586 911832 959326 1006477 1051919 1094497
60486A094497L8187L1787K3630J4538N078m720j4820k4836l4233m2389m8434n1687
$$ 1094497 1132684 1164471 1188101 1202639 1207717 1202997 1188177 1163341 1129108 1086719 1038285 986598
60474I86598n2392n1522m9646m6672m2821l8889l5220l1312k7068k3492k1262
$$ 986598 934206 882684 833038 786366 743545 704656 669436 638124 611056 587564 566302
60463E66302j9458j6827j3699j1444j0399r598q420p281o574o027n374m802m410
$$ 566302 546844 530017 516318 504874 494475 484877 476457 469176 462602 456575 451201 446399 441989
60450D41989l931l221k502k014j848k114k744l176k860j967j120n68k31k70q27
$$ 441989 438058 434837 432335 430321 428473 426359 423615 420439 417579 415612 414492 413924 413693 413423 412596
60435D12596j392j290p38n27p50p49l34j20m71j003j326j426j219n62R3lp09r96
$$ 412596 411204 409914 409176 408649 407899 407150 406816 406696 406225 405222 403896 402470 401251 400689 400782 400779 400070 399074
60417C99074m37K39M05M55R09J468J579J344J239J383J590J762J770J393P68M82
$$ 399074 398637 398876 399281 399736 400645 402113 403692 405036 406275 407658 409248 411010 412780 414173 414941 415423
60401D15423Q53J492J834J814J705J746K063K592K876K430J519J086J671K868
$$ 415423 416276 417768 419602 421416 423121 424867 426930 429522 432398 434828 436347 437433 439104 441972
60387D41972L913M370M107L335K787L173M116M396L511K374J993K228K392K403
$$ 441972 445885 450255 454362 457697 460484 463657 467773 472169 475680 478054 480047 482275 484667 487070
60373D87070K629L072L383L456L413L238K882K536K380K238J834J237Q11Q74J540
$$ 487070 489699 492771 496154 499610 503023 506261 509143 511679 514059 516297 518131 519368 520179 521053 522593
60358E22593K568L285L176K700L026M653O760Q322R309J0326J1533J2459J2612
$$ 522593 525161 528446 531622 534322 537348 542001 548761 557083 566392 576718 588251 600710 613322
60345F13322J1735R703O729L528Q07j440l754o394q904j0496j0722r824q545p547
$$ 613322 625057 634760 641489 645017 645824 644384 640630 634236 625332 614836 604114 594290 585745 578198
60331E78198o941o471o018n740n660n444m745l600k479j947k166k675k811k446
$$ 578198 571257 564786 558768 553028 547368 541924 537179 533579 531100 529153 526987 524312 521501 519055
60317E19055j933j292j06J476K493K647L217N459Q719J1420J3366J5579J8085
$$ 519055 517122 515830 515724 517200 519693 522340 525557 531016 539735 551155 564521 580100 598185
60304E98185J9565J9457J8781J8377J7818J6531J4663J2086P964K213l773q735
$$ 598185 617750 637207 655988 674365 692183 708714 723377 735463 743427 745640 741867 733132
60292G33132j2912j6854j9991k1388k1076j9556j6942j3584j0743r332q603p327
$$ 733132 720220 703366 683375 661987 640911 621355 604413 590829 580086 570754 562151 554824
60280E54824n689m785m782m917m977n384n936n780m789l855l599l671l517l066
$$ 554824 549135 544350 539568 534651 529674 524290 518354 512574 507785 503930 500331 496660 493143 490077
60266D90077k489j974j799k048k246j937j441j416j773j850j564j495j769j776
$$ 490077 487588 485614 483815 481767 479521 477584 476143 474727 472954 471104 469540 468045 466276 464500
60252D64500j211n50k25q9rk72q90j134l86Q43J446J077M63K83K88j72r88j197
$$ 464500 463289 462739 462514 462425 462416 462144 461254 460120 459734 460577 462023 463100 463563 463846 464134 463962 462974 461777
60234D61777k32J220K007J934J853K335K976L210L176L331L663L820L685L402
$$ 461777 461545 462765 464772 466706 468559 470894 473870 477080 480256 483587 487250 491070 494755 498157
60220D98157L100K954L225L874M439M667M929N616O438O814O734O656O783O886
$$ 498157 501257 504211 507436 511310 515749 520416 525345 530961 537399 544213 550947 557603 564386 571272
60206E71272O826O764O846O969O860O322N519M956M958N133M815L992L266K862
$$ 571272 578098 584862 591708 598677 605537 611859 617378 622334 627292 632425 637240 641232 644498 647360
60192F47360K354J569R02M63k63j378k128k090j968k455l100l205l146l726m787
$$ 647360 649714 651283 652185 652648 652385 651007 648879 646789 644821 642366 639266 636061 632915 629189 624402
60177F24402n479n602n616n579n091m167l240k420j520p42n16p93j198j699k373
$$ 624402 618923 613321 607705 602126 597035 592868 589628 587208 585688 584946 584430 583637 582439 580740 578367
60162E78367k799k505j799j318j019m50K42N42N79Q80J298J315J251J892K890
$$ 578367 575568 573063 571264 569946 568927 568477 568719 569261 569840 570720 572018 573333 574584 576476 579366
60147E79366K953J874J042J384K093K092J702J865K589L155L442M063N362O991
$$ 579366 582319 584193 585235 586619 588712 590804 592506 594371 596960 600115 603557 607620 612982 619973
60133F19973Q437R458R995J0004R423Q247O679N198M110L117J654k17j690k080
$$ 619973 628410 637868 647863 657867 667290 675537 682216 687414 691524 694641 696295 696078 694388 692308
60119F92308j444k91Q48J505J387P50K51K77O25R20R90O78j59j317k224k588k740
$$ 692308 690864 690573 691421 692926 694313 695063 695314 695591 696216 697136 698126 698804 698645 697328 695104 692516 689776
60102F89776l154l847m421m515m060l317k783k810l238l450k951j726j27J427
$$ 689776 686622 682775 678354 673839 669779 666462 663679 660869 657631 654181 651230 649504 649377 650804
60088F50804K642L372L539L061K059J077P24R56J190J267J669K398K406R11j328
$$ 650804 653446 656818 660357 663418 665477 666554 667278 668234 669424 670691 672360 674758 677164 678075 676747
60073F76747k901l611m474o051p809r089r781r904r372q457p754p433p113o628
$$ 676747 673846 670235 665761 659710 651901 642812 633031 623127 613755 605298 597544 590111 582998 576370
60059E76370o288o179n865n104m327m081m354m697m620l845k466r74K07J151K122
$$ 576370 570082 563903 558038 552934 548607 544526 540172 535475 530855 527010 524544 523570 523777 524928 527050
60044E27050L046L777M632N912P109P418O988O719O736O154M646L197K657K493
$$ 527050 530096 533873 538505 544417 551526 558944 565932 572651 579387 585541 590187 593384 596041 598534
60030E98534J674K28j002j724k501l739n115o060o406o342o056n665n455n931
$$ 598534 600208 600436 599434 597710 595209 591470 586355 580295 573889 567547 561491 555826 550371 544440
60016E44440p315q988r769r055p467o068n261m801m473m209l774k986k158j666
$$ 544440 537125 528137 518368 509313 501846 495778 490517 485716 481243 477034 473260 470274 468116 466450
60002D66450j281n59K66M83nn39o61n01j79M25J227J904K403K887L209L178L260
$$ 466450 465169 464610 464876 465359 465354 464815 464154 463653 463474 463899 465126 467030 469433 472320 475529 478707 481967
59985D81967M115N400N912N174L988L148K469J443R2j254k329k783k366j545j221
$$ 481967 486082 491482 497394 502568 506556 509704 512173 513616 513708 512454 510125 507342 504976 503431 502210
59970E02210j523j667j320j124j437j523p43L04P35Q93J904L937N772O083M771
$$ 502210 500687 499020 497700 496576 495139 493616 492873 493177 493912 494805 496709 500646 506418 512501 517272
59955E17272K933J848J821J902R40j065k985l914l849l157k137j311j295j881
$$ 517272 520205 522053 523874 525776 526716 525651 522666 518752 514903 511746 509609 508298 507003 505122
59941E05122k047j308m74n48j521k689l541l790l166j836n88O1M85J236K213L096
$$ 505122 503075 501767 501293 500745 499224 496535 492994 489204 486038 484202 483614 483675 484160 485396 487609 490705
59925D90705M064N433O860P670P687P262O689O053N403M663L596K216R79K89Q5
$$ 490705 494769 500202 507062 514732 522419 529681 536370 542423 547826 552489 556085 558301 559280 559569 559654
59910E59654J88N87J205J835K584L765N036N386M433L057K192J650Q05k85j110
$$ 559654 559842 560429 561634 563469 566053 569818 574854 580240 584673 587730 589922 591572 592377 592092 590982
59895E90982j580j764j354j95J001J443J463K083L547N096O076O491O537O318
$$ 590982 589402 587638 586284 586089 587090 588533 589996 592079 595626 600722 606798 613289 619826 626144
59881F26144O043N929N872N759N900O589P352P272O082M367K703J116n25k123
$$ 626144 632187 638116 643988 649747 655647 662236 669588 676860 682942 687309 690012 691128 690603 688480
59867F88480l463m297m366l713k942k735l079l307l007k476k259k486k796k724
$$ 688480 685017 680720 676354 672641 669699 666964 663885 660578 657571 655095 652836 650350 647554 644830
59853F44830k093j076M5J150K200L055L691M512N910P491Q250P668O127M110J728
$$ 644830 642737 641661 641706 642856 645056 648111 651802 656314 662224 669715 677965 685633 691760 695870 697598
59838F97598o61k142k137j085K52J613K793L002J533j166l874n789o817o968o327
$$ 697598 696937 694795 692658 691573 691825 693438 696231 699233 700766 699600 695726 689937 683120 676152 669825
59823F69825n497n275n741o083n577m421l552l772m993o290o797o561o192n809
$$ 669825 664328 659053 653312 647229 641652 637231 633679 629907 624914 618624 611827 605266 599074 593265
59809E93265n027m027l696m284m739m108k920k299k339k188j516q68p70j200j831
$$ 593265 588238 584211 580515 576231 571492 567384 564464 562165 559826 557638 556122 555254 554484 553284 551453
59794E51453k197j779o17L33J15j036j981j976j182j13P75J110Q50M87N01P67
$$ 551453 549256 547477 546860 547193 547308 546272 544291 542315 541133 541020 541795 542905 543755 544242 544743 545510
59778E45510R12R64J130J216R96Q26J187J723J587P07J5L11J453K768L749M242
$$ 545510 546422 547386 548516 549732 550728 551554 552741 554464 556051 556758 556773 557084 558537 561305 565054 569296
59762E69296M360M306M147L844L662M092N058N732N609N347N854O990P882Q157
$$ 569296 573656 577962 582109 585953 589615 593707 598765 604497 610106 615453 621307 628297 636179 644336
59748F44336Q127Q069Q107Q579R588J0415J0195R102Q049P349O524N338M147L157
$$ 644336 652463 660532 668639 677218 686806 697221 707416 716518 724567 731916 738440 743778 747925 751082
59734G51082K147J052O3r29k195l387l697l010k216k123k614l109l302l262l211
$$ 751082 753229 754281 754344 753415 751220 747833 744136 741126 738910 736787 734173 731064 727762 724500 721289
59719G21289l372l656l634l180k911l421m285m580m185l755l542l167k565k121
$$ 721289 717917 714261 710627 707447 704536 701115 696830 692250 688065 684310 680768 677601 675036 672915
59705F72915j722p37P85J835J872J683K190L161L716L652L536L820M448N150N653
$$ 672915 671193 670456 671241 673076 674948 676631 678821 681982 685698 689350 692886 696706 701154 706304 711957
59690G11957N677N032L730J949Jj671k774l425l922m253m196l848l634l792m199
$$ 711957 717634 722666 726396 728345 728346 726675 723901 720476 716554 712301 708105 704257 700623 696831 692632
59675F92632m718n296n728n808n745n905o146n913n114m305l868l584l214k935
$$ 692632 687914 682618 676890 671082 665337 659432 653286 647373 642259 637954 634086 630502 627288 624353
59661F24353k853k534j492Q8J507K287K571K798L199L571L558L177K872K975L245
$$ 624353 621500 618966 617474 617562 619069 621356 623927 626725 629924 633495 637053 640230 643102 646077 649322
59646F49322L148K419J130n69k455m126n330o193o942p464p456o822n775m724
$$ 649322 652470 654889 656019 655450 652995 648869 643539 637346 630404 622940 615484 608662 602887 598163
59632E98163m172m288m438l708k264j415j923k922l262l143l487m299m741m565
$$ 598163 593991 589703 585265 581557 579293 577878 575955 573033 569771 566628 563141 558842 554101 549536
59618E49536m277m139l975l856l999m117l720k980k382j730n20R28J792K073K398
$$ 549536 545259 541120 537145 533289 529290 525173 521453 518473 516091 514361 513841 514769 516561 518634 521032
59603E21032K678K221J272R85J604J991J424O19M11N21L90K09M33R19J228J204
$$ 521032 523710 525931 527203 528188 529792 531783 533207 533826 534237 534758 535148 535357 535790 536709 537937 539141
59587E39141Q03M0o17m69L32O36k96j907l176l636l320k495j894k376l788m901
$$ 539141 539944 539984 539367 538898 539230 539866 539570 537663 534487 530851 527531 525036 523142 520766 516978 512077
59571E12077m889m221l634l059k157j184o32m85m70n53p51q52q02q40r33o52J4
$$ 512077 507188 502967 499333 496274 494117 492933 492301 491816 491346 490793 490042 489190 488388 487548 486615 485963 485977
59554D85977M44M51Q07K052L456L905L416K980L180L738M251M733N376O182O970
$$ 485977 486421 486872 487679 489731 493187 497092 500508 503488 506668 510406 514657 519390 524766 530948 537918
59539E37918P653Q551J0228J2872J5905J8520K0236K0420J7825J1753L670l490
$$ 537918 545571 554122 564350 577222 593127 611647 631883 652303 670128 681881 685551 682061
59527F82061p827r441q993o702l174J47K228L279L752L384J952O8j567l033m656
$$ 682061 674234 664793 655800 649098 645924 646071 648299 651578 655330 658714 660666 660734 659167 656134 651478
59512F51478o287p750r207j0465j0724r755q583q141q033p476o700o377o220n326
$$ 651478 645191 637441 628234 617769 607045 597290 588707 580566 572533 565057 558357 551980 545760 540434
59498E40434l651k137j490j570j846j859j388o53j51OK03N32N93M09P49J875K912
$$ 540434 536783 534646 533156 531586 529740 527881 526493 525840 525689 525695 525898 526430 527023 527432 528181 530056 532968
59481E32968L088K905L188L806M298M966O202P338P360O416N454M722L745K461
$$ 532968 536056 538961 542149 545955 550253 555219 561421 568759 576119 582535 587989 592711 596456 598917
59467E98917J261J04j245k251k074r71q2K48Q49K234L818N007O082P466Q806R375
$$ 598917 600178 600282 599037 596786 594712 593741 593659 593907 594756 596990 600808 605815 611897 619363 628169 637544
59451F37544R056Q466Q263Q552Q786Q269O895N288L963K586M32k587n756q221
$$ 637544 646600 655066 663329 671881 680667 688936 695831 701119 705082 707668 708100 705513 699757 691536
59437F91536r546r719r088q104o951n565m184l355l187l101k725k383k223j566
$$ 691536 681990 672271 663183 655079 648128 642563 638379 635024 631837 628736 626011 623628 621405 619839
59423F19839J33K352M380O555R571J2926J5262J6144J6568J7635J9553K1865K3951
$$ 619839 619972 622324 626704 633259 642830 655756 671018 687162 703730 721365 740918 762783 786734
59410G86734K5210K5421K4725K2556J7121P172n516j6542k2158k1645j6735r833
$$ 786734 811944 837365 862090 884646 901767 908939 903423 886881 864723 843078 826343 816510
59398H16510l049K328O307R508J1433R985L493o919j7522k4504k6316k4019j9946
$$ 816510 813461 815789 822096 831604 843037 853022 856515 849596 832074 807570 781254 757235 737289
59385G37289j6021j2900j0331q011n892l905j866J91J856K730K932L058L599M385
$$ 737289 721268 708368 698037 690026 684134 680229 678363 678554 680410 683140 686072 689130 692729 697114
59371F97114M755M338L503K812K274J590R75J019J642J973J549Q65M29N2l37j8
$$ 697114 701869 706207 709710 712522 714796 716386 717361 718380 720022 721995 723544 724409 724838 724890 724553 724535
59355G24535J585L822N521O435P260Q517J0192J2184J4297J5942J6588J6445J6165
$$ 724535 726120 729942 735463 741898 749158 757675 767867 780051 794348 810290 826878 843323 859488
59342H59488J6004J5703J5040J3949J2348J0341Q324O401M041Q99k384m878o585
$$ 859488 875492 891195 906235 920184 932532 942873 951197 957598 961639 962538 960154 955276 948691
59329I48691q198r970j1534j2736j3751j4450j4344j3283j1684j0124r037q641
$$ 948691 940493 930523 918989 906253 892502 878052 863708 850425 838741 828617 819580 810939
59317H10939q705q574p922p187o893o919o956p152p633p872p322o318n499m717
$$ 810939 802234 793660 785738 778551 771658 764739 757783 750631 742998 735126 727804 721486 715987 711270
59303G11270l382j544L01K203M547P048Q931J0020J0545R931O894J068o188j2786
$$ 711270 707888 706344 706645 708848 713395 720443 729374 739394 749939 759870 766764 767832 761644 748858
59289G48858j7175j8754j7906j5847j3734j1792r648p326n246l434j506O09K598
$$ 748858 731683 712929 695023 679176 665442 653650 644002 636676 631430 627996 626490 627099 629697
59276F29697M358N943P156P907Q725J0201J2030J3396J4071J4346J4175J3315
$$ 629697 634055 639998 647154 655061 663786 673987 686017 699413 713484 727830 742005 755320
59264G55320J2019J0630Q756N940K915Q66m36k406n422q149r372r271q540p449
$$ 755320 767339 777969 786725 792665 795580 796446 796010 793604 788182 780033 770661 761390 752850 745401
59250G45401o254n435m957m144k758j404n59L8O99J320J938K885M065M907N327
$$ 745401 739147 733712 728755 724611 721853 720449 719890 719928 720627 721947 723885 726770 730835 735742 741069
59235G41069N846O507O627N977N225M765M091K820J390J55j288l230n126o426
$$ 741069 746915 753422 760049 766026 771251 776016 780107 782927 784317 784472 783184 779954 774828 768402
59221G68402p392q432r286r521r247q738p960o981o265n987n703n209n035n486
$$ 768402 761010 752578 743292 733771 724524 715786 707826 700845 694580 688593 682890 677681 672646 667160
59207F67160n879n460m491l716l290k951k798l004l146k647j707j053q45n44J61
$$ 667160 661281 655821 651330 647614 644324 641373 638575 635571 632425 629778 628071 627018 626173 625629 625790
59192F25790Q74J110R65J075K046L852N789P056P478P421P093O403N533N070N254
$$ 625790 626664 627774 628739 629814 631860 635712 641501 648557 656035 663456 670549 676952 682485 687555 692809
59177F92809N608N620N378N247N318N522N886O286O270N559M537L914M020M616
$$ 692809 698417 704037 709415 714662 719980 725502 731388 737674 743944 749503 754040 757954 761974 766590
59163G66590N157N071M064K405P32o12j849l342n147p120r112j0854j1982j2374
$$ 766590 771747 776818 780882 783287 784019 783407 781558 778216 773069 765949 756837 745983 734001 721627
59149G21627j2336j2254j2134j1662j0675r516q804q711q604p774o513n836o074
$$ 721627 709291 697037 684903 673241 662566 653050 644246 635535 626931 619157 612644 606808 600734
59136F00734o397o070n284m283k615k28J648J873J183J247K356L385L840M407
$$ 600734 594337 588267 582983 578700 576085 575857 577505 579378 580561 581808 584164 587549 591389 595796
59122E95796N404O127O146O055O556P687R200J0782J1768J1625J0886J0679J1208
$$ 595796 601200 607327 613473 619528 626084 633771 642971 653753 665521 677146 688032 698711 709919
59109G09919J1739J2031J2525J2956J2268J0380Q667Q069P896P166N939M621L050
$$ 709919 721658 733689 746214 759170 771438 781818 790485 798554 806450 813616 819555 824176 827226
59096H27226J117n95j614k280k943l255k905k341k087k017j848j665j538j367
$$ 827226 828343 827748 826134 823854 820911 817656 814751 812410 810323 808306 806458 804793 803255 801888
59082H01888j565k977n537p906r060r420r787j0123j0145j0194j0563j0671r810
$$ 801888 800323 797346 791809 783903 774843 765423 755636 745513 735368 725174 714611 703940 694130
59069F94130q223o726n720n177n058n145m968m464m073l880l396k649k541l433
$$ 694130 685907 679181 673461 668284 663226 658081 653113 648649 644576 640696 637300 634651 632110 628677
59055F28677m360m360l785l446l320l047k916l284l662l388k788k606k690k206
$$ 628677 624317 619957 616172 612726 609406 606359 603443 600159 596497 593109 590321 587715 585025 582819
59041E82819r73L18J119J519J854K332L018L732M224M559N010N453N499N384O019
$$ 582819 581846 582164 583283 584802 586656 588988 592006 595738 599962 604521 609531 614984 620483 625867 631886
59026F31886P769R996J2128J4325J6583J8228J8936J9385K0130K0570J9791J7675
$$ 631886 639655 649651 661779 676104 692687 710915 729851 749236 769366 789936 809727 827402
59014H27402J4448R990M458j022n190p824r417j0258j0395r886q595o310l566
$$ 827402 841850 851840 856298 855276 850086 842262 832845 822587 812192 802306 793711 787401 783835
59001G83835j479k76J050L037M685M914M073L062J936L55j382k752l841m848n528
$$ 783835 782356 782080 783130 786167 790852 795766 799839 802901 804837 805192 803810 801058 797217 792369 786841
58986G86841n862o467p461p961p550p218p650p757o294m010k675k605k613j860
$$ 786841 780979 774512 767051 759090 751540 744322 736672 728915 722621 718611 715936 713331 710718 708858
58972G08858m25J509L689N387O188O728P709Q786R482J0261J1381J1637R955P445
$$ 708858 708433 709942 713631 719018 725206 731934 739643 748429 757911 768172 779553 791190 801145 808590
58958H08590O014N428L748M79k758m816o386q386j0591j2396j3643j4166j3622
$$ 808590 814604 820032 823780 824259 821501 816685 810299 801913 791322 778926 765283 751117 737495
58945G37495j2254j0889r901q980q057p462p060o138m450k626j324o52l99k84
$$ 737495 725241 714352 704451 695471 687414 679952 672892 666754 662304 659678 658354 657702 657303 657019
58931F57019KL66J91p68j715j773j243j109j654k441l246m014m312l870l325l415
$$ 657019 657021 657387 657578 656810 655095 653322 652079 650970 649316 646875 643629 639615 635303 631433 628108 624693
58915F24693l728l341k299j351o04L57J329J791K060K864L970M606N101O635R282
$$ 624693 620965 617624 615325 613974 613370 613727 615056 616847 618907 621771 625741 630347 635448 642083 651365
58900F51365J1694J2923J3325J3477J3424J3215J3064J2695J1589J0125R501J0325
$$ 651365 663059 675982 689307 702784 716208 729423 742487 755182 766771 776896 786397 796722
58888G96722J2116J4305J6727J9011K0417K0532J9447J7246J4054J0580P709N577
$$ 796722 808838 823143 839870 858881 879298 899830 919277 936523 950577 961157 968866 974443
58876I74443L598J303j467m747p973r893r972r426r668j0244r628p663n673m461
$$ 974443 978041 979344 977877 973130 965157 955264 945292 935866 926198 915954 906326 898663 892990 888529
58862H88529l780l650m525o043p192p903r085j0867j2247j2752j2930j2916j2040
$$ 888529 884749 881099 876574 870531 863339 855436 846351 835484 823237 810485 797555 784639 772599
58849G72599j0304q858q361q090p292o341n923o139o939q498j0529j2036j2288
$$ 772599 762295 753437 745076 736986 729694 723353 717430 711291 704352 695854 685325 673289 661001
58836F61001j1509j0339r267q669q591q414p498o191n326m842l994k797k043j830
$$ 661001 649492 639153 629886 621217 612626 604212 596714 590523 585197 580355 576361 573564 571521 569691
58822E69691j361m50N7k50n83r9J087K372L265L318K440J409J191J630J728J216
$$ 569691 568330 567880 567937 567687 567104 567005 568092 570464 573729 577047 579487 580896 582087 583717 585445 586661
58806E86661P89Q10R40J080J464J687R76l91j166r26n39n94o49l82l11q03j414
$$ 586661 587450 588260 589200 590280 591744 593431 594407 594016 592850 591924 591385 590791 590142 589760 589449 588646 587232
58789E87232j630j375o06P49K222L170L808M843O166P026P430Q083Q941R219Q883
$$ 587232 585602 584227 583621 584370 586592 589762 593570 598413 604579 611605 619035 627118 636059 645278 654161
58774F54161Q641Q339O991M599K327N54j642m508o809p641p576p350o853o050
$$ 654161 662802 671141 678132 682731 685058 685612 683970 679462 672653 665012 657436 650086 643233 637183
58760F37183n553n426m740l050j242j62M42J047J579K039K728L305K848J385J87
$$ 637183 631630 626204 621464 618414 617172 617010 617452 618499 620078 622117 624845 628150 630998 632383 632570
58745F32570L5L99Q27J671K949L863M222M904O188P058P034P210Q442R834J0217
$$ 632570 632605 633004 633831 635502 638451 642314 646536 651440 657628 664686 671720 678930 687372 697206 707423
58730G07423R992J0272J1070J1517J1249J0621R927R161Q184O811N243M433N147
$$ 707423 717415 727687 738757 750274 761523 772144 782071 791232 799416 806227 811470 815903 821050
58717H21050O716P767Q182R010J0371J1089J0689J0019R359P655M408O99k515
$$ 821050 827766 835533 843715 852725 863096 874185 884874 894893 904252 911907 916315 917014 914499
58704I14499n633r063j2170j4525j6840j9613k2111k3635k4551k5186k4979k3642
$$ 914499 908866 899803 887633 873108 856268 836655 814544 790909 766358 741172 716193 692551
58692F92551k1926k0256j7910j4529j1266r359q601q144p785p662p612p594p714
$$ 692551 670625 650369 632459 617930 606664 597305 588704 580560 572775 565113 557501 549907 542193
58679E42193p391n766l387j999k037j988q86L81J103K141M074N792O394O853Q266
$$ 542193 534802 529036 525649 523650 521613 519625 518739 519120 520223 522364 526438 532230 538624 545477 553743
58664E53743R972J0925J1562J2628J3365J2492J0063O885L116j125m768o876p948
$$ 553743 563715 574640 586202 598830 612195 624687 634750 641635 644751 643626 638858 631982 624034
58651F24034q880r427q939p798o937o639o692o951o989o180m841m114m065l431
$$ 624034 615154 605727 596788 588990 582053 575414 568722 561771 554782 548602 543761 539647 535582 532151
58637E32151j879q32j001r26O23K551L229K832K338J663M62n10n54l41o60j009
$$ 532151 530272 529440 528439 527513 528136 530687 533916 536748 539086 540749 541211 540701 540147 539806 539146 538137
58621E38137q17o62r24o11Q89K447L161M043N942P476P142O030O088O925O666
$$ 538137 537320 536658 535734 535123 536012 538459 541620 545663 551605 559081 566223 572253 578341 585266 591932
58606E91932N051L394K181R54oqM55K64n23j092j456k039k351j744q22n13m30
$$ 591932 596983 600377 602558 603512 603506 603498 603953 604217 603694 602602 601146 599107 596756 595012 594190 593677 593247
58589E93247L25J524K541L809N915Q034Q978R078R434J0126J0664J1265J2055
$$ 593247 593572 595096 597637 601446 607361 615395 624373 633451 642885 653011 663675 674940 686995
58576F86995J2061J0739R521J0008J1518J2361J2591J3495J5191J6760J8180K0191
$$ 686995 699056 709795 719316 729324 740842 753203 765794 779289 794480 811240 829420 849611
58564H49611K2750K5360K8280L1779L4878L6403L6579L5973L3892K9549K3890
$$ 849611 872361 897721 926001 957780 992658 1029061 1065640 1101613 1135505 1165054 1188944
58553A188944J8387J2951O831O75m199p773j0730j2842j3772j4480j5974j7656
$$ 1188944 1207331 1220282 1227113 1227788 1223589 1215816 1205086 1192244 1178472 1163992 1148018 1130362
58541A130362j8696j9940k2406k5107k6533k7190k8379k9519k9064k7208k5287
$$ 1130362 1111666 1091726 1069320 1044213 1017680 990490 962111 932592 903528 876320 851033
58530H51033k3352k0578j7282j4361j1553q445o178n869o341n767m526l998l721
$$ 851033 827681 807103 789821 775460 763907 755462 749284 743415 737074 731307 726781 722783 719062
58517G19062k516j299j859l560m226l612l193l144k427j380j354k072k097j501
$$ 719062 716546 715247 713388 709828 705602 701990 698797 695653 693226 691846 690492 688420 686323 684822
58503F84822j486j834j353l64q2j70M79J228P68k6O68K243K605J915K159L492
$$ 684822 683336 681502 680149 679785 679703 679533 680012 681240 682008 681982 682650 684893 687498 689413 691572 695064
58487F95064M349M799O451R123J0946J1747J3131J5206J6481J7011J8372K0401
$$ 695064 699413 704212 710663 719786 730732 742479 755610 770816 787297 804308 822680 843081
58475H43081K1117K0079J8649J6867J3263Q048L229p27n172r987j3171j4206j4650
$$ 843081 864198 884277 902926 919793 933056 941104 944333 943606 938434 928447 915276 901070 886420
58462H86420j4970j3806j0904p844n320k454Q01L376N466Q389J1826J3941J4224
$$ 886420 871450 857644 846740 838896 833576 831122 831923 835299 840765 849154 860980 874921 889145
58449H89145J3552J1593P330J998j899m466p922j2167j4458j3822j2229j0973
$$ 889145 902697 914290 921620 923618 921719 917253 909331 897164 882706 868884 856655 845682
58437H45682r321p207n785m858k960l96J104J797L495N783O532O285P846J1200
$$ 845682 836361 829154 823369 818511 815551 815155 816259 818056 821551 827334 833866 840151 847997 859197
58423H59197J3195J2909J2890J4029J3716J0477O257K562j675o718j0400j1592
$$ 859197 872392 885301 898191 912220 925936 936413 942670 945232 943557 936839 926439 914847
58411I14847j1920j2542j2565j1848j1825j2350j1356q805p286p505p056m818
$$ 914847 902927 890385 877820 865972 854147 841797 830441 821636 814350 806845 799789 794971
58399G94971k668j469M56L352M743L812L133M123M761L653K499K544K331J026
$$ 794971 792303 790834 791290 794642 799385 803197 806330 810453 815214 818867 821366 823910 826241 827267
58385H27267K19N44J13j773k991k494k204l219l830l056k347k086l51L037N330
$$ 827267 827486 828030 828143 826370 823379 820885 818681 815462 811632 808576 806229 804143 803792 806829 812159
58370H12159N630O719J0047J2971J3331J2728J2988J3231J2774J3117J4699J5437
$$ 812159 817789 824508 834555 847526 860857 873585 886573 899804 912578 925695 940394 955831
58358I55831J4511J3896J4299J3603J1133R223Q619O906L505J459J996K178M83
$$ 955831 970342 984238 998537 1012140 1023273 1032496 1041115 1048021 1051526 1052985 1054981 1057159 1057642
58345A057642k38J874M222M624M944O864Q663R126J0063J2083J2606J1072J1109
$$ 1057642 1057404 1059278 1063500 1068124 1073068 1079932 1088595 1097721 1107784 1119867 1132473 1143545 1154654
58332A154654J4366J7223J6902J5825J6384J6545J4399J2081J1292R716N834K493
$$ 1154654 1169020 1186243 1203145 1218970 1235354 1251899 1266298 1278379 1289671 1299387 1305221 1307714
58320A307714J890J785L94P3K321M213L821L942O446Q260P229O536Q885J1622
$$ 1307714 1309604 1311389 1311783 1311856 1314177 1318390 1322211 1326153 1332599 1340859 1348088 1354624 1363509 1375131
58306A375131J2204J2953J5760J7589J6245J5067J6817J8468J7150J5681J6851
$$ 1375131 1387335 1400288 1416048 1433637 1449882 1464949 1481766 1500234 1517384 1533065 1549916
58295A549916J7841J5925J4171J5752J8031J7943J7784J9998K1861K1090K0952
$$ 1549916 1567757 1583682 1597853 1613605 1631636 1649579 1667363 1687361 1709222 1730312 1751264
58284A751264K3995K6590K5778K5303K8599L2053L1810L0975L3226L5668L5024
$$ 1751264 1775259 1801849 1827627 1852930 1881529 1913582 1945392 1976367 2009593 2045261 2080285
58273B080285L4546L7534M0476L9929L9561M2978M6369M6134M6576N1910N7864
$$ 2080285 2114831 2152365 2192841 2232770 2272331 2315309 2361678 2407812 2454388 2506298 2564162
58262B564162N9725O1213O6434P0722O9096O6146O7529O9204O5593O0834O1010
$$ 2564162 2623887 2685100 2751534 2822256 2891352 2957498 3025027 3094231 3159824 3220658 3281668
58251C281668O2711O0572N8752O3229P0022P3009P6041Q5029R5518J00814J04931
$$ 3281668 3344379 3404951 3463703 3526932 3596954 3669963 3746004 3831033 3926551 4027365 4132296
58240D132296J14478J25414J31288J36715J48579J61917J69131J75064J87852
$$ 4132296 4246774 4372188 4503476 4640191 4788770 4950687 5119818 5294882 5482734
58231E482734K03117K13011K22379K39568K59850K75135K91088L16782L46640
$$ 5482734 5685851 5898862 6121241 6360809 6620659 6895794 7186882 7503664 7850304
58222G850304L71314L96874M33609M75892N13802N54110O07955O68930P26745
$$ 7850304 8221618 8618492 9052101 9527993 10041795 10595905 11203860 11872790 12599535
58213A2599535P90893Q76018R76090J079839J198563J350152J529724J727563
$$ 12599535 13390428 14266446 15242536 16322375 17520938 18871090 20400814 22128377
58205B2128377J961510K258049K617513L035232L539795M169459M929332N816669
$$ 22128377 24089887 26347936 28965449 32000681 35540476 39709935 44639267 50455936
58197E0455936O867724Q131549R626278J1380338J3483400J6026114J9031558
$$ 50455936 57323660 65455209 75081487 86461825 99945225 115971339 135002897
58190A35002897K2525051K6572604L1039626L5291824L8309532L9116309L6905747
$$ 135002897 157527948 184100552 215140178 250432002 288741534 327857843 364763590
58183C64763590L0825757K0235199N748710j0067059k3631454l2417337l6204274
$$ 364763590 395589347 415824546 421573256 411506197 387874743 355457406 319253132
58176C19253132l6467417l4863925l2355864k9328992k6004431k2603399j9329718
$$ 319253132 282785715 247921790 215565926 186236934 160232503 137629104 118299386
58169A18299386j6350055j3768352j1592267r763060q229235o963305n924191
$$ 118299386 101949331 88180979 76588712 66825652 58596417 51633112 45708921
58162D5708921n056118m326241l724395l227811k801791k432305k124350j870439
$$ 45708921 40652803 36326562 32602167 29374356 26572565 24140260 22015910 20145471
58154B0145471j650517j459072j303004j175665j060013r54210q68288p98526
$$ 20145471 18494954 17035882 15732878 14557213 13497200 12542990 11674702 10876176
58146A0876176p29844o60699o01955n53351n03744m52743m10483l77253l43683
$$ 10876176 10146332 9485633 8883678 8330327 7826583 7373840 6963357 6586104 6242421
58137F242421l09932k85316k69772k53966k36740k24925k16987k04063j86516
$$ 6242421 5932489 5647173 5377401 5123435 4886695 4661770 4444783 4240720 4054204
58128D054204j73152j64657j53550j39733j30577j26056j18700j08152j01412
$$ 4054204 3881052 3716395 3562845 3423112 3292535 3166479 3047779 2939627 2838215
58119B838215r8836r3727q5713q1098q0035p6346o9968o6918o7031o4248n8927
$$ 2838215 2739379 2645652 2559939 2478841 2398806 2322460 2252492 2185574 2118543 2054295 1995368
58108A995368n7386n9159n7010n0185m5706m5708m4987m1934m0752m1797m0398
$$ 1995368 1937982 1878823 1821813 1771628 1725922 1680214 1635227 1593293 1552541 1510744 1470346
58097A470346l6398l4648l5251l3333k9059k7665k8938k6944k1214j7892j8519
$$ 1470346 1433948 1399300 1364049 1330716 1301657 1273992 1245054 1218110 1196896 1179004 1160485
58086A160485j7801j4157j2476j4344j5035j2763j1999j4878j7624j8036j8797
$$ 1160485 1142684 1128527 1116051 1101707 1086672 1073909 1061910 1047032 1029408 1011372 992575
58075I92575k0887k1211j9118j8199j9509j9672j7507j5963j5930j4762j2290
$$ 992575 971688 950477 931359 913160 893651 873979 856472 840509 824579 809817 797527
58064G97527j1731j3201j2900j0006q008q010p239n274n266p670r196r173j0509
$$ 797527 785796 772595 759695 749689 741681 733671 726432 721158 715892 708222 699026 689853 679344
58051F79344j3234j3598j0951r074r362q920o746n495n739m768k528k479n035
$$ 679344 666110 652512 641561 632487 623125 614205 607459 601964 596225 591457 588929 586450 581415
58038E81415o336n070m394n550n771m213l830n501o330n573o198q715r536p560
$$ 581415 575079 570009 565615 560065 554294 550081 546251 540750 534420 528847 522649 513934 504398 496838
58024D96838o415p840q739p232n875o324o248m357l145l969m288k557j082j432
$$ 496838 490423 482583 473844 466612 460737 454413 448165 443808 440663 436694 432406 429849 428767 427335
58010D27335j665n66m8r55j024O35J583Q06Q42K917M442L818L193M027M375L007
$$ 427335 425670 425104 425056 424101 423077 423712 425295 426101 426943 429860 434302 438120 441313 445340 449715 452722
57994D52722J853J851O97k709n787o745p385q937r368p477n660n762o056m986
$$ 452722 454575 456426 457123 454414 448627 441882 434497 425560 416192 408715 403055 397293 391237 386251
57980C86251m159m914n620n051m812n861o163m452k752k685k750j663q64j256
$$ 386251 382092 377178 371558 366507 361695 355834 349671 345219 342467 339782 337032 335369 334505 333249
57966C33249j051N82J418K40o61K90R53m15j717p50R01Q90n6m20r70k560l601
$$ 333249 332198 332780 334198 334438 333777 334067 335020 334605 332888 332138 333039 333929 333873 333453 332483 329923 326322
57949C26322k773j607j670j778o70L36R5K38K241M540N337N704P209Q973R764
$$ 326322 323549 321942 320272 318494 317824 318160 318255 318493 320734 325274 330611 336315 343524 352497 362261
57934C62261J0432J1683J2017J0585R442J0151J0680Q560M761J620p74l338n429
$$ 362261 372693 384376 396393 406978 416420 426571 437251 445811 450572 452192 451418 448080 442651
57921D42651o338p206q908j0073r686r303j0232j0956r963q652q634q587o723
$$ 442651 436313 429107 420199 410126 400440 391137 380905 369949 359986 351334 342700 334113 327390
57908C27390m097k515j326P09K482K456J628J595J644O06l74J81J162R34M50J405
$$ 327390 323293 320778 319452 320161 322643 325099 326727 328322 329966 330572 330198 330379 331541 332475 332925 334330
57892C34330L019L638L780M688N552N123M463M999N533M208J979J029J097M46
$$ 334330 337349 340987 344767 349455 355007 360130 364593 369592 375125 379333 381312 382341 383438 383884
57878C83884q71j727k604m496o326o464n788o167o982o122l730j918j384j012
$$ 383884 383013 381286 378682 374186 367860 361396 355608 349441 342459 336337 332607 330689 329305 328293
57864C28293l11K33O99J433J824J455J471K857M499N047N285O346P097N984M130
$$ 328293 327982 328215 328914 330347 332171 333626 335097 337954 342453 347500 352785 359131 366228 372212 376342
57849C76342L765M692N061M598M341M050K733R67R5k17j165k342k577k277k566
$$ 376342 380107 384799 389860 394458 398799 402849 405582 406549 406644 406427 405262 402920 400343 398066 395500
57834C95500l012k708k499l484m423l515j802j771l271l825k592j046p7P27J131
$$ 395500 392488 389780 387281 383797 379374 375859 374057 372286 369015 365190 362598 361552 361475 362202 363333
57819C63333L16j131j691j267r15p19j64mj308l227m213m826o713r397j0870j0919
$$ 363333 363649 362518 360827 359560 358645 357926 357762 357758 356450 353223 349010 344184 337471 328074 317204 306285
57803C06285j1015j1170r931p430n530m691l499j574l13l13m36M5N73R16J570
$$ 306285 295270 284100 274169 266739 261209 256518 253019 251445 251132 250819 250383 250428 251001 251917 253487
57788B53487K305K262J750J997L043L767L967M504N392N788N863O660Q061Q917
$$ 253487 255792 258054 259804 261801 264844 268611 272578 277082 282474 288262 294125 300785 308846 317763
57774C17763R070R326R524Q726P236O251N631M129J817R7p31j721l073l854m035
$$ 317763 326833 336159 345683 354409 361645 367896 373527 377656 379473 379570 378839 377118 374045 370191 366156
57759C66156m595n512n702n161n024n358n023l906l119k803j894m07K78k41p48
$$ 366156 361561 356049 350347 345186 340162 334804 329781 325875 322756 319953 318059 317652 317930 317689 316941
57744C16941o00m88o45k89O39J013M05l40p46j209j602j120J46J125J518J901
$$ 316941 316341 315853 315208 314919 315558 316571 316976 316636 315890 314681 313079 311959 312105 313230 314748 316649
57728C16649K050J015q79k040j861j266p93k7R41J378J459K049K798K444J192
$$ 316649 318699 319714 318835 316795 314934 313668 312875 312848 313789 315167 316626 318675 321473 323917 325109
57713C25109O80J306J723J348J098J193M89j212k407k285j919k172k297j606p98
$$ 325109 325789 327095 328818 330166 331264 332457 332946 331734 329327 327042 325123 322951 320654 319048 318250
57698C18250o21o95n62n35p78q87q80j371k330l146m051n809p725p902o016l960
$$ 318250 317629 316934 316372 315837 315059 314172 313292 311921 309591 306445 302394 296585 288860 280958 274942 270982
57682B70982l096k668j638k86Q85K162L713N139O661R324J3348J7721K2010K7022
$$ 270982 267886 265218 263580 263294 264179 266341 270054 275193 281854 291178 304526 322247 344257 371279
57668C71279L3107L9303M4866N0028N4408N5912N1823M0205K0652m339k8655m5749
$$ 371279 404386 443689 488555 538583 592991 648903 700726 740931 761583 757244 728589 682840
57656F82840n3586n5029n3185m8632m1677l4398k8695k4230j9948j6155j3581
$$ 682840 629254 574225 521040 472408 430731 396333 367638 343408 323460 307305 293724
57645B93724j1804r994q173o593m931l116j839j434j222p71n74q53r83p15o45
$$ 293724 281920 271926 263753 257160 252229 249113 247274 245840 244618 243847 243273 242420 241437 240722 240077
57630B40077q55n78J28J4j256k285k162j861k338k820k224j029m08n68j075j767
$$ 240077 239222 238644 238772 238786 237530 235245 233083 231222 228884 226064 223840 222811 222403 221835 220760 218993
57614B18993k436k557k152j983k246k250j869j924k520k509j399k64P2J98N73
$$ 218993 216557 214000 211848 209865 207619 205369 203500 201576 199056 196547 195148 194884 194956 195154 195727
57599A95727M34o58j642j542q74m71j79K50K92k34n18j68k1n44r14o03m31r45
$$ 195727 196161 195503 193861 192319 191445 190974 190795 191045 191337 191103 190585 190417 190396 189852 188938 188335 187904 186959
57581A86959j258p10k38p48j542j663j475j576j555j150j240k219k766j912r66
$$ 186959 185701 184991 184753 184005 182463 180800 179325 177749 176194 175044 173804 171585 168819 166907 165941
57566A65941j590l063l372k245j184j043j274j232q07J4R85J353P77R7L05J258
$$ 165941 164351 161288 157916 155671 154487 153444 152170 150938 150131 150145 151130 152483 153260 153357 153662 154920
57550A54920K179K819L336L685L904M247M435L678K049P69M45K37m55q62k94N53
$$ 154920 157099 159918 163254 166939 170843 175090 179525 183203 185252 186021 186466 186703 186248 185386 185092 185645
57534A85645Q88J037J391J364N82j48k39l99j119j517j021p62j744k927k780j591
$$ 185645 186533 187570 188961 190325 190907 190759 190520 190121 189002 187485 186464 185702 183958 181031 178251 176660
57518A76660o20k2O80J100P09J37J68K35m56j247j064l13m5p3L80R38O96qj99
$$ 176660 176040 176018 176698 177798 178507 178644 178812 179047 178591 177344 176280 175967 175922 175849 176229 177167 177863 177855 177656
57499A77656l6l54j025j358j574k271l006k963k523k537k666k061j128r09j204
$$ 177656 177620 177266 176241 174883 173309 171038 168032 165069 162546 160009 157343 155282 154154 153245 152041
57484A52041j081p34j054j659j310j36L75k40p88m07L23N62L51J55J83L82M90
$$ 152041 150960 150226 149172 147513 146203 146067 146442 146202 145414 145007 145330 145892 146243 146398 146581 146963 147453
57467A47453J69m74q32p79r52j467j304J13J662K051J613J391J373R65M12K62
$$ 147453 147622 147148 146316 145537 144585 143118 141814 141927 143589 145640 147253 148644 150017 150982 151394 151656
57451A51656J96j88k57M90J015J45j301j583o46Q7J0k87n33r23j013k08Q68J048
$$ 151656 151852 151664 151407 151897 152912 153057 151756 150173 149527 149614 149624 149337 148804 147881 146868 146660 147528 148576
57433A48576L99q4k30o27j095q40O7Q38J324J856K024J162k60j082j051o94j05
$$ 148576 148975 148891 148661 148034 146939 146099 146166 147004 148328 150184 152208 153370 153110 152028 150977 150283 150178
57416A50178P47J141N66QN41J362R65j83k64J014K167K426K350K044Q11j135k452
$$ 150178 150925 152066 152632 152640 153181 154543 155508 155325 155061 156075 158242 160668 163018 165062 165873 164738 162286
57399A62286k536k057j524p97r8J13K21R58J816J603M97j30P4J29l20l77N08J842
$$ 162286 159750 157693 156169 155372 155274 155387 155608 156566 158382 159985 160482 160352 160426 160555 160235 159858 160366 162208
57381A62208L131M185M408L297J660Q67Q93O53P4O9N78M21o84j745k255k631k823
$$ 162208 165339 169524 173932 177229 178889 179756 180649 181302 181376 181445 182023 182444 181760 180015 177760 175129 172306
57364A72306k262j366j254j731j338J98J365J176M07L1m2r4J12N86Q59Q37Q98
$$ 172306 170044 168678 167424 165693 164355 164553 165918 167094 167501 167532 167490 167396 167508 168094 168953 169790 170688
57347A70688J044J015J140J830K408J929R08O57J150J265Q94J003J629J799J402
$$ 170688 171732 172747 173887 175717 178125 180054 180962 181619 182769 184034 184928 185931 187560 189359 190761
57332A90761J218J156M65l02K89J966K792K056J069P16L98j84l42J2Q0n8N72J664
$$ 190761 191979 193135 193600 193298 193587 195553 198345 200401 201470 202186 202584 202400 202058 202070 202150 202092 202664 204328
57314B04328J613J57j135j504j857k464k187q50k4m99j087r54q95j370j421o99
$$ 204328 205941 206098 204963 203459 201602 199138 196951 196101 196077 195578 194491 193537 192642 191272 189851 189152
57298A89152m06j041j332n63J04j40l04K71M75m37j294j111q94j636k387j994
$$ 189152 188746 187705 186373 185810 185914 185774 185470 185741 186216 185779 184485 183374 182480 180844 178457 176463
57282A76463j148r77j085o94l62q99j787k202k427k838k758j654l25M01R25J730
$$ 176463 175315 174338 173253 172559 172197 171298 169511 167309 164882 162044 159286 157632 157307 157708 158633 160363
57266A60363K300K378K830M069N004M875M611N128N729N569N190N203M949L950
$$ 160363 162663 165041 167871 171940 176944 181819 186430 191558 197287 202856 208046 213249 218198 222148
57252B22148L236L678M441M555M631N404O056N609M709M354M120L320K620K829
$$ 222148 225384 229062 233503 238058 242689 248093 254149 259758 264467 268821 272941 276261 278881 281710
57238B81710L291L141K955L475L926L341K478K622L514M079M272M605M868M810
$$ 281710 285001 288142 291097 294572 298498 301839 304317 306939 310453 314532 318804 323409 328277 333087
57224C33087N005N596N467M177L289M094N398N443M667M517M830M545L972M077
$$ 333087 338092 343688 349155 353332 356621 360715 366113 371556 376223 380740 385570 390115 394087 398164
57210C98164M471M243L987M767N896N963N401N824P234Q123Q008P887Q244Q494
$$ 398164 402635 406878 410865 415632 421528 427491 432892 438716 445950 454073 462081 469968 478212 486706
57196D86706Q339Q119P935P720P808Q361Q798Q870R412J0813J1948J1970J1973
$$ 486706 495045 503164 511099 518819 526627 534988 543786 552656 562068 572881 584829 596799 608772
57183F08772J3119J4449J4469J3773J3920J4715J4823J4265J4084J4180J3627
$$ 608772 621891 636340 650809 664582 678502 693217 708040 722305 736389 750569 764196
57172G64196J2659J2324J2587J2594J2283J2079J1776J1442J2407J5337J8357
$$ 764196 776855 789179 801766 814360 826643 838722 850498 861940 874347 889684 908041
57161I08041J9315J8959J9563K1284K2451K2683K3054K3675K3721K3635K4689
$$ 908041 927356 946315 965878 987162 1009613 1032296 1055350 1079025 1102746 1126381 1151070
57150A151070K6478K7216K6565K5969K6312K7267K8809L1220L3819L5596L6913
$$ 1151070 1177548 1204764 1231329 1257298 1283610 1310877 1339686 1370906 1404725 1440321 1477234
57139A477234L8717M0761M2468M4761M8704N3185N6391N8886O2604O7485P1958
$$ 1477234 1515951 1556712 1599180 1643941 1692645 1745830 1802221 1861107 1923711 1991196 2063154
57128B063154P6126Q1552Q8156R4327R9995J06708J14638J22267J29046J35832
$$ 2063154 2139280 2220832 2308988 2403315 2503310 2610018 2724656 2846923 2975969 3111801
57118C111801J42766J49311J56160J64607J74384J84643J96283K10638K26679
$$ 3111801 3254567 3403878 3560038 3724645 3899029 4083672 4279955 4490593 4717272
57109D717272K42654K59529K79633L03078L29426L61992M06451M65998N41998
$$ 4717272 4959926 5219455 5499088 5802166 6131592 6493584 6900035 7366033 7908031
57100G908031O38206P59807R09728J091474J314706J591863J929324K326881K783526
$$ 7908031 8546237 9306044 10215772 11307246 12621952 14213815 16143139 18470020 21253546
57091B1253546L295792L851384M432605N024278N608180O152138O617645O971171
$$ 21253546 24549338 28400722 32833327 37857605 43465785 49617923 56235568 63206739
57083F3206739P157592P054312O495109N395545L867988K187084O22005p02645
$$ 63206739 70364331 77418643 83913752 89309297 93177285 95364369 95986374 95283729
57075I5283729j803549k741741l549293m223969m753952n133813n368400n471314
$$ 95283729 93480180 90738439 87189146 82965177 78211225 73077412 67709012 62237698
57067F2237698n458651n342917n134821m849434m506804m127094l728342l327808
$$ 62237698 56779047 51436130 46301309 41451875 36945071 32817977 29089635 25761827
57059B5761827k941071k578864k246942j948981j687214j460630j265285j097179
$$ 25761827 22820756 20241892 17994950 16045969 14358755 12898125 11632840 10535661
57051A0535661r53476q31072p26124o35613n58164m92879m38247l92391l53609
$$ 10535661 9582185 8751113 8024989 7389376 6831212 6338333 5900086 5507695 5154086
57042E154086l20615k92766k69961k51704k36446k22233k07780j92514j76164
$$ 5154086 4833471 4540705 4270744 4019040 3782594 3560361 3352581 3160067 2983903
57033B983903j58919j41594j24967j09065r3366p7249o0178m2128k4180p988N361
$$ 2983903 2824984 2683390 2558423 2449358 2355992 2278743 2218565 2176437 2152257 2144269 2149630
57022B149630J4451J5049J019k9442o8703j03259j23293j28110j22866j12599
$$ 2149630 2164081 2179130 2180149 2150707 2082004 1978745 1855452 1727342 1604476 1491877
57012A491877j00265q8102p7858o9653o2330n5373m9467m5008m1165l7073l3006
$$ 1491877 1391612 1303510 1225652 1155999 1093669 1038296 988829 943821 902656 865583 832577
57001H32577k9783k7550k5890k4632k3713k2617k0795j8535j6634j5163j3361
$$ 832577 802794 775244 749354 724722 701009 678392 657597 639062 622428 607265 593904
56990E93904j0785p854n084k477J01K628N221Q068J0645J1648J0085N990q0p466
$$ 593904 583119 575265 570181 567704 567805 570433 575654 583722 594367 606015 616100 622090 622010 614544
56976F14544j4888k0372k2637k2186k0430j8110j5247j2150r509p518n674l537
$$ 614544 599656 579284 556647 534461 514031 495921 480674 468524 459015 451497 445823 442286
56964D42286j144J406M177P137J0099J3063J6211J9409K1936K2808K1206J6593
$$ 442286 441142 442548 446725 453862 463961 477024 493235 512644 534580 557388 578594 595187
56952E95187Q895j060j1404j9918k5143k6948k6153k3765k0610j7317j4221j1157
$$ 595187 604082 603022 591618 571700 546557 519609 493456 469691 449081 431764 417543 406386
56940D06386p766m146q56J911M794Q555J3279J8528K3877K8758L2137L2912L0417
$$ 406386 398620 394474 393618 395529 400323 408878 422157 440685 464562 493320 525457 558369 588786
56927E88786K4220J3992M37j3968k6067l3941l7361l6850l3336k8462k4049k0877
$$ 588786 613006 626998 627435 613467 587400 553459 516098 479248 445912 417450 393401 372524
56915C72524j8512j6320j4014j1444q744o623n623n132m066k387r44J03J446L071
$$ 372524 354012 337692 323678 312234 303490 296867 291244 286112 282046 279659 278715 278818 280264 283335
56901B83335L925L582L125L715N161O451O965O732O157N905O439P361P910Q226
$$ 283335 287260 290842 293967 297682 302843 309294 316259 322991 329148 335053 341492 348853 356763 364989
56887C64989R260J1247J3147J3848J2957J0154M903k543j0620j7473k1962k3581
$$ 364989 374249 385496 398643 412491 425448 435602 440505 437962 427342 409869 387907 364326
56875C64326k2344j9162j5428j1770p886l737R8L514P225J1650J6456K1595K7669
$$ 364326 341982 322820 307392 295622 287736 283999 284097 287611 294836 306486 322942 344537 372206
56862C72206L4682M1484M6967N0868N2874N1810M6354L5814K0220Q84j8631l3599
$$ 372206 406888 448372 495339 546207 599081 650891 697245 733059 753279 754163 735532 701933
56850G01933m1224m2193l8968l3607k7453k1274j4831p362P68Q113J4406K1365
$$ 701933 660709 618516 579548 545941 518488 497214 482383 475021 475789 483902 498308 519673
56838E19673L0405M0847N1293O1435P1361Q0178Q6264Q7721Q1727O5150L7645
$$ 519673 550078 590925 642218 703653 775014 855192 941456 1029177 1110904 1176054 1213699
56827A213699L602l0180n7993p6258q3318q0497p2277o3148n4340m4790l4446
$$ 1213699 1217301 1187121 1129128 1052870 969552 889055 816778 753630 699290 654500 620054
56816F20054k4818j6690r180j199P433J6420K5501L4381M2861N0810N7339O0299
$$ 620054 595236 578546 569366 568167 575600 592020 617521 651902 694763 745573 802912 863211
56804H63211N7271M6843K8819M379k2944m7499o4250p1573p1048o5366n7097m8390
$$ 863211 920482 967325 996144 1000523 977579 930080 865830 794257 723209 657843 600746 552356
56792E52356m0348l2847k5619j9083j3511q224k496L496R352J5231K1076K5923
$$ 552356 512008 479161 453542 434459 420948 412724 410228 413724 423076 438307 459383 485306
56780D85306K8950L0309K9855K5987J7112L803j1347k5453l6116m1712m2325l9974
$$ 485306 514256 544565 574420 600407 617519 621322 609975 584522 548406 506694 464369 424395
56768D24395l6842l3616l0086k6396k2842j9385j6271j4187j3016j1587r568q205
$$ 424395 387553 353937 323851 297455 274613 255228 238957 224770 211754 200167 190599 182394
56756A82394q090p767o054m214m021m918n050m106l154k533j852j400j643j894
$$ 182394 174304 166537 160483 156269 152248 147330 142280 138174 135020 132487 130635 129235 127592 125698
56742A25698j231j86K01K27O81R90J77j005r77J00O86L61m9m00j202j926j398
$$ 125698 124467 124281 124482 124709 125390 126380 126557 125552 124575 124675 125361 125722 125673 125273 124071 122145 120747
56725A20747J34J258J578J847K117J688R07J027K121K854K515J711J031M87L08
$$ 120747 120881 122139 123717 125564 127681 129369 130276 131303 133424 136278 138793 140504 141535 142022 142330
56710A42330P50J224R93N27P47J327J325J031J414K129J977R96K19l34j381k397
$$ 142330 143080 144304 145297 145824 146571 147898 149223 150254 151668 153797 155774 156770 156989 156655 155274 152877
56694A52877k103p78j3j52r4M06M60Q9L33J082J110M41M95J535K196K018K110
$$ 152877 150774 149996 149983 149831 149737 150143 150603 150692 151025 152107 153217 153658 154153 155688 157884 159902 162012
56677A62012K767K762J721R80J234J340M81m38n72m86p12o48N0N30K46p4Q0Lp64
$$ 162012 164779 167541 169262 170242 171476 172816 173297 172859 172287 171801 171089 170441 170491 171021 171267 171193 171273 171276 170512
56658A70512j303p67K37O55M16J9l43o01n30k61k71n81p12o05n91n99m19n30j354
$$ 170512 169209 168442 168679 169334 169750 169769 169426 168825 168295 168034 167763 167182 166470 165865 165274 164675 164256 163726 162372
56639A62372j944j075O30J379R22O25R01P61Q4R3R90J314L75o65q79q48j055r55
$$ 162372 160428 159353 159983 161362 162284 162909 163810 164571 164655 164748 165738 167052 167427 166762 165883 165035 163980 163025
56621A63025m24l72j043j407j035q66j363j632j175p80r16r19n91p59j497j570
$$ 163025 162601 162229 161186 159779 158744 157878 156515 154883 153708 152928 152012 151093 150502 149743 148246 146676
56605A46676n35L61K80l5l3l73j240j508p15j1l3K70J523K445J969J044R20J165
$$ 146676 146141 146502 146782 146747 146714 146341 145101 143593 142878 142867 142834 143104 144627 147072 149041 150085 151005 152170
56587A52170Q87M69O38J020R77P52P13O21N33J026J722J244m53j415n03R36J465
$$ 152170 153057 153526 154164 155184 156161 156913 157626 158247 158780 159806 161528 162772 162319 160904 160401 161337 162802
56570A62802J778L005M519N126N016M949M826M555N038O736Q607R886J1486J4109
$$ 162802 164580 167585 172104 177230 182246 187195 192021 196576 201614 208350 216957 226843 238329 252438
56556B52438J6324J6317J4306J1545Q153L806l99k784l265l110l097l198l477
$$ 252438 268762 285079 299385 310930 319083 322889 322490 319706 316441 313331 310234 307036 303559
56543C03559l928l948l157k185j792j837j932k194k641k806k695l044l877m116
$$ 303559 299631 295683 292526 290341 288549 286712 284780 282586 279945 277139 274444 271400 267523 263407
56529B63407l372k685k701k649k064j836k356k455j492q35j628k736k641j953
$$ 263407 260035 257350 254649 252000 249936 248100 245744 243289 241797 240962 239334 236598 233957 232004
56515B32004k223l405m308m607m715m557l915l287l065k761k047j538j533j290
$$ 232004 229781 226376 222068 217461 212746 208189 204274 200987 197922 195161 193114 191576 190043 188753
56501A88753o26p32k137l359l030j904j275r04m3Q65J110J070J104M91j022k026
$$ 188753 188127 187395 185258 181899 178869 176965 175690 174786 174743 175608 176718 177788 178892 179383 178361 176335
56485A76335j476m12j10J6R10J819J672J101J159J374Q89L05M78P46K48l03N0
$$ 176335 174859 174447 174337 174353 175263 177082 178754 179855 181014 182388 183277 183582 184060 184806 185054 184751 184801
56468A84801O69O74O89J342J588N68m08N3R14N99j11M63J824K331K079K184K319
$$ 184801 185470 186144 186833 188175 189763 190331 189923 189976 190890 191489 191378 191841 193665 195996 198075 200259 202578
56451B02578J575P53J139J923J499M27M42J290J323N52L76Q10O49n3l06m88j708
$$ 202578 204153 204906 206045 207968 209467 209894 210336 211626 212949 213501 213877 214687 215336 215283 214977 214489 212781
56434B12781l253l318k048j281j476j374n86n1mK28M92L0p10n95J15K37j79k20
$$ 212781 209528 206210 204162 202881 201405 200031 199445 199394 199390 199618 200110 200140 199430 198835 198950 199187 199008 198788
56416A98788j23o41j035q5J332J249j75r73o50n09q64n68N33J227J162J166J219
$$ 198788 198665 198024 196989 196904 198236 199485 199310 198337 197687 197178 196314 195746 196279 197506 198668 199834 201053
56399B01053M10r08j192j96P28R95J459K500L354L541L346K876K262K361L620
$$ 201053 201463 200555 199363 199167 199895 200890 202349 204849 208203 211744 215090 217966 220228 222589 226209
56384B26209M711M164K757K197K236J451J69l9O81P13r1l20K53M88L08P19J462
$$ 226209 230920 235084 237841 240038 242274 243725 243894 243855 244536 245249 245158 244838 245091 245579 245887 246606 248068
56367B48068J204J40j81L55L09n32q40l20r3l11J54J385K157K182K320K467J646
$$ 248068 249272 249412 249231 249586 249895 249363 248523 248203 248110 247799 247953 249338 251495 253677 255997 258464 260110
56350B60110K90m7O43Q01Q8k92j00l88j166j201l76J87M32J333K554K713K125
$$ 260110 260400 260353 260996 261797 261885 261593 261493 261105 259939 258738 258362 258549 258981 260314 262868 265581 267706
56333B67706K516L874M345L545L191L932M410L990L824M425M665L908K915K055
$$ 267706 270222 274096 278441 281986 285177 289109 293519 297509 301333 305758 310423 314331 317246 319301
56319C19301Q05n95j122r05j083j637j580j145j393j827j019M90P55k01m19O44
$$ 319301 320106 319511 318389 317484 316401 314764 313184 312039 310646 308819 307800 308290 309045 308844 308425 309069
56303C09069J696K461L821N191N002L928M193N504N236L036J462J521J321Q2l62
$$ 309069 310765 313226 317047 322238 327240 331168 335361 340865 346101 349137 350599 352120 353441 353523 353161
56288C53161P31J459Q87P33K024L207L152K975L410L335K409K234L416M251L752
$$ 353161 353892 355351 356238 356971 358995 362202 365354 368329 371739 375074 377483 379717 383133 387384 391136
56273C91136L286L801M230L973M224N477O365O285O517P597Q275Q224Q922J0717
$$ 391136 394422 398223 402453 406426 410650 416127 422492 428777 435294 442891 451166 459390 468312 479029
56259D79029J1904J1978J2784J5200J7602J8987K0690K3623K6715K9432L2924
$$ 479029 490933 502911 515695 530895 548497 567484 588174 611797 638512 667944 700868
56248G00868L7318M0838M3008M5678M9549N2734N4184N5331N6776N6641N3872
$$ 700868 738186 779024 822032 867710 917259 969993 1024177 1079508 1136284 1192925 1246797
56237A246797N0128M6535M1656L4441K6308J8466J0092Q15p836j5089k2055k8744
$$ 1246797 1296925 1343460 1385116 1419557 1445865 1464331 1474423 1475238 1467402 1452313 1430258 1401514
56225A401514l3129l4745l6021l8366m0183m0395m0489m1176m0593l7923l5391
$$ 1401514 1368385 1333640 1297619 1259253 1219070 1178675 1138186 1097010 1056417 1018494 983103
56214I83103l4518l3692l1638k9876k9430k8585k6278k4407k4198k3579k0822
$$ 983103 948585 914893 883255 853379 823949 795364 769086 744679 720481 696902 676080
56203F76080j7620j5902j4671j2613j0857j0429r893q106o494o134n512l639k271
$$ 676080 658460 642558 627887 615274 604417 593988 584095 575989 569495 563361 557849 554210 551939
56190E51939k573k723j359k39q29j388l02R51Q83Q87K208L190K507J947K959L619
$$ 551939 549366 546643 545284 545045 544216 542828 542526 543477 544360 545247 547455 550645 553152 555099 558058 561677
56174E61677K145M05P40K176K938L720N351O196N110M164N284O972P394P788R701
$$ 561677 563822 564227 564967 567143 570081 573801 579152 585348 590458 594622 599906 606878 614272 622060 631761
56159F31761J1799J2539J3191J5058J6703J6882J7312J9464K1799K3060K5030
$$ 631761 643560 656099 669290 684348 701051 717933 735245 754709 776508 799568 824598
56148H24598K9012L3132L6308M1115M9279N8145O5458P3773Q6025J00174J12553
$$ 824598 853610 886742 923050 964165 1013444 1071589 1137047 1210820 1296845 1397019 1509572
56137A509572J23039J32631J39114J39656J34825J26094J12592R4658P7327O5707
$$ 1509572 1632611 1765242 1904356 2044012 2178837 2304931 2417523 2512181 2589508 2655215
56127B655215N9459N5556N3065N0927M4874L1850J4978m34j3191k4549l3812m0536
$$ 2655215 2714674 2770230 2823295 2874222 2919096 2950946 2965924 2965490 2952299 2927750 2893938 2853402
56115B853402m8168o0499p6742r4065j11819j29081j41455j45345j42479j35931
$$ 2853402 2805234 2744735 2667993 2573928 2462109 2333028 2191573 2046228 1903749 1767818
56105A767818j25136j09446r2728p9150o7681n5866m5473l9069l4473k8290k1774
$$ 1767818 1642682 1533236 1440508 1361358 1293677 1237811 1192338 1153269 1118796 1090506 1068732
56094A068732j7710j4765j0513o748o042o262m206j468r46r26J453M212M182L263
$$ 1068732 1051022 1036257 1025744 1018996 1012954 1006692 1002486 1001018 1000072 999146 1000599 1004811 1008993 1012256
56080A012256M865P389P547O880Q511J0658R949Q089Q708J0654J0831J0521J2444
$$ 1012256 1017121 1024510 1032057 1038937 1047448 1058106 1068055 1076144 1084852 1095506 1106337 1116858 1129302
56067A129302J4840J4977J4959J7506J9714J7948J5002J5331J7195J6840J6155
$$ 1129302 1144142 1159119 1174078 1191584 1211298 1229246 1244248 1259579 1276774 1293614 1309769
56056A309769J8332K0295J7837J4143J4568J6961J6110J3779J5028J8271J8594
$$ 1309769 1328101 1348396 1366233 1380376 1394944 1411905 1428015 1441794 1456822 1475093 1493687
56045A493687J7430J9290K2268K1683J9856K2196K6684K7449K5819K7381L1092
$$ 1493687 1511117 1530407 1552675 1574358 1594214 1616410 1643094 1670543 1696362 1723743 1754835
56034A754835L1785L0713L2865L6570L6569L4700L6644M0804M1495M0304M2892
$$ 1754835 1786620 1817333 1850198 1886768 1923337 1958037 1994681 2035485 2076980 2117284 2160176
56023B160176M7395M7695M5467M7082N1156N1443M9333N1157N5671N6835N6292
$$ 2160176 2207571 2255266 2300733 2347815 2398971 2450414 2499747 2550904 2606575 2663410 2719702
56012B719702O0346O7260P0544P1852P7410Q4845Q7423Q7845R3587J02215J06152
$$ 2719702 2780048 2847308 2917852 2989704 3067114 3151959 3239382 3327227 3420814 3523029 3629181
56001C629181J08103J16110J27328J33148J36382J46127J59611J67237J71621
$$ 3629181 3737284 3853394 3980722 4113870 4250252 4396379 4555990 4723227 4894848
55992D894848J82769J98346K08453K16004K31709K52746K68168K81401L04565
$$ 4894848 5077617 5275963 5484416 5700420 5932129 6184875 6453043 6734444 7039009
55983G039009L34482L58514L80310M14072M57011M94594N29854N78818O39935
$$ 7039009 7373491 7732005 8112315 8526387 8983398 9477992 10007846 10586664 11226599
55974A1226599O98237P57226Q34871R30690J030294J139911J280712J451978J638658
$$ 11226599 11924836 12682062 13516933 14447623 15477917 16617828 17898540 19350518 20989176
55965B0989176J852791K126029K464614K857806L327848L920911M650735N506145
$$ 20989176 22841967 24967996 27432610 30290416 33618264 37539175 42189910 47696055
55957D7696055O511543P719977R153892J0826315J2814235J5225143J8099596
$$ 47696055 54207598 61927575 71081467 81907782 94722017 109947160 128046756
55950A28046756K1446348K5329552K9702829L4067019L7446551L8782496L7177443
$$ 128046756 149493104 174822656 204525485 238592504 276039055 314821551 351998994
55943C51998994L1740535K1712685P397700q964473k3774410l4002047l8722909
$$ 351998994 383739529 405452214 412849914 403885441 380111031 346108984 307386075
55936C07386075l8967596l6459317l2630111k8416088k4371836k0737928j7540987
$$ 307386075 268418479 231959162 199329051 170912963 146541127 125803199 108262212
55929A08262212j4763448j2413204j0463319q833754p462640o331619n410211
$$ 108262212 93498764 81085560 70622241 61788487 54325847 47994228 42584017
55922D2584017m638974l981299l437233k994601k615163k278734j995577j765198
$$ 42584017 37945043 33963744 30526511 27531910 24916747 22638013 20642436 18877238
55914A8877238j563637j379817j225959j103108r91689q84281p94818p27163o65296
$$ 18877238 17313601 15933784 14707825 13604717 12613028 11728747 10933929 10206766 9541470
55905I541470o02184n49439n10762m72971m30691l94638l68452l41200l09372
$$ 9541470 8939286 8389847 7879085 7406114 6975423 6580785 6212333 5871133 5561761
55896E561761k83522k66797k48566k25197k06403j95292j82277j64279j50577
$$ 5561761 5278239 5011442 4762876 4537679 4331276 4135984 3953707 3789428 3638851
55887C638851j44049j35331j20992j09643j04664r8231q7635q0757q0240p8603
$$ 3638851 3494802 3359471 3238479 3128836 3024172 2925941 2838306 2757549 2677309 2598706
55877B598706p3881p4029q0575q3798p9439p5200p5323p3600o7178o2887o3842
$$ 2598706 2524825 2450796 2370221 2286423 2206984 2131784 2056461 1982861 1915683 1852796 1788954
55866A788954o3331n7759n2888n1677m8584m1368l6428l6875l6961l3549l1733
$$ 1788954 1725623 1667864 1614976 1563299 1514715 1473347 1436919 1400044 1363083 1329534 1297801
55855A297801l3852l4271l0325k7540k8779k8768k4717k1983k3929k5874k4405
$$ 1297801 1263949 1229678 1199353 1171813 1143034 1114266 1089549 1067566 1043637 1017763 993358
55844I93358k3217k4701k4932k1902j9842k0738k0329j6840j4895j6447j6709
$$ 993358 970141 945440 920508 898606 878764 858026 837697 820857 805962 789515 772806
55833G72806j3459j1496j3315j4161j1059q258q892r470p467o349q236r404p761
$$ 772806 759347 747851 734536 720375 709316 701058 692166 682696 675229 668880 660644 651240 643479
55820F43479p216r859j1457r413p736r295j0541q699p010p870p844m454j188p94
$$ 643479 636263 626404 614947 605534 597798 588503 577962 569263 562253 554383 546539 542085 540897 540103
55806E40103k91K585M633L816L943P648J1092J0883J0074J1948J3774J2225R348
$$ 540103 539812 542397 547030 550846 554789 562437 573529 584412 594486 606434 620208 632433 641781
55793F41781P787N410O3n303p557q724j1424j3696j3211j2069j2531j2491r951
$$ 641781 649568 654978 655041 649738 642181 633457 622033 608337 595126 583057 570526 558035 548084
55780E48084p730q875j1462j2341j2061j1857r966n313o73J973N098J0501J4965
$$ 548084 540354 531479 520017 507676 495615 483758 473792 468479 467806 469779 474877 485378 500343
55767E00343J5288J3314J1327P077j575j0947j5797j6181j5394j4259j2029r960
$$ 500343 515631 528945 540272 547349 545774 534827 519030 502849 487455 473196 461167 451207
55755D51207r366q805p193o861r687j3213j4519j4764j6007j6775j5021j2413
$$ 451207 441841 433036 425843 418982 409295 396082 381563 366799 350792 334017 318996 306583
55743C06583j1382j0678q092m941l635l298j880k63l20j102q72p09k372m605n192
$$ 306583 295201 284523 276431 271490 267855 264557 262677 262414 262094 260992 260120 259411 257039 252434 247242
55728B47242m663m569m298k890j894k994m789n055m209l662k928j271P7K11O62
$$ 247242 242579 238010 233712 230822 228928 225934 221145 216090 211881 208219 205291 204020 204097 204308 204970
55713B04970K540M128M085M150N746O975O103M923N232N054K164j523l094l508
$$ 204970 207510 211638 215723 219873 225619 232594 238697 243620 248852 253906 256070 254547 251453 247945
55699B47945n249p517p905o872o449o336n113l631l439l527k215o44q72k115k275
$$ 247945 242696 235179 227274 220402 213953 207617 202504 198873 195434 191907 189692 189048 188176 186061 183786
55684A83786j522j018kK411M432M146L069L620M887M579L335L131L123J206j625
$$ 183786 182264 181246 181244 183655 188087 192233 195302 198922 203809 208388 211723 214854 217977 219183 217558
55669B17558k603j828j620k129j518J47R31O06P15J441J597J299J682K413K328
$$ 217558 214955 213127 211507 209378 207860 208007 208938 209544 210259 211700 213297 214596 216278 218691 221019
55654B21019J927K462L357L260K758L245M013L412K008J564J669M54j993l882
$$ 221019 222946 225408 228765 232025 234783 238028 242041 245453 247461 249025 250694 251148 249155 245273
55640B45273m830n888p003p247p021p473q125p683o582o252o455n884m693m019
$$ 245273 240443 234555 227552 220305 213284 205811 197686 190003 183421 177169 170714 164830 160137 156118
55626A56118l599k381q44k95n32m33j75n94j184r91n90r55j425j077q28j859l092
$$ 156118 152519 150138 149294 148999 148467 148034 147859 147265 146081 145090 144500 143545 142120 141043 140215 138356 135264
55609A35264k909k101k351l019k345q00k41o74p85p66j630k501j791l61l67j550
$$ 135264 132355 130254 127903 124884 122539 121739 121498 120824 120039 119273 117643 115142 113351 112990 112623 111073
55593A11073j745o73n8l46l56Rk85q52k34J213J609P55M23J298K222K550K857
$$ 111073 109328 108655 108597 108251 107895 107904 107619 106767 106533 107746 109355 110110 110533 111831 114053 116603 119460
55576A19460L216L090K963L899N516O478O741P266P922P867P469P563P316N281
$$ 119460 122676 125766 128729 132628 138144 144622 151363 158629 166551 174418 181887 189450 196766 202047
55562B02047K129j02j118k256l721m529m848n795p075p297o433n628m936l700
$$ 202047 204176 204074 202956 200700 196979 192450 187602 181807 174732 167435 161002 155374 150438 146738
55548A46738k683l173m369m327l181k619k569j411O21J402N07j25M28Q92N05K47
$$ 146738 144055 140882 136513 132186 129005 126386 123817 122406 123027 124429 124936 124811 125239 126131 126636 126883
55532A26883O83R70O81M62L93k60j330j771j641j967k678k743k351k693l502l274
$$ 126883 127566 128536 129217 129679 130072 129812 128482 126711 125070 123103 120425 117682 115331 112638 109136 105862
55516A05862k047j508k112k427j750j053r22p78m94o71j002m69N95P65k3l79O3
$$ 105862 103815 102307 100195 97768 96018 94965 94043 93265 92771 92100 91098 90629 91224 91989 91966 91587 91650
55499I1650L02J82O40J468J232k04j295j325j160j264j147r43j304j621o61R06
$$ 91650 91952 92134 92774 94242 95474 95270 93975 92650 91490 90226 89079 88136 86832 85211 84550 85456
55483H5456J075k01r09l18J88m8n3L80K26k75M55K200K581R24n13k66J57p22j836
$$ 85456 86531 86330 85421 85103 85291 85243 85190 85570 85796 85521 85976 88176 90757 91681 91168 90902 91059 90337 88501
55464H8501j819j377j555j670q67nk16j014j405j576j938j833n95R90J649J235
$$ 88501 86682 85305 83750 82080 81213 81208 80992 79978 78573 76997 75059 73226 72631 73621 75270 76505
55448G6505M86l9p5L97Q40O58K24L58P75M56m47p78m53n88j274j243j69P19Q58
$$ 76505 76991 76952 76877 77274 78114 78772 78996 79354 80129 80585 80138 79360 78907 78319 77045 75802 75633 76352 77210
55429G7210J228K321L066K558J244j67j340j555k00J580J735L25m31M10J273R89
$$ 77210 78438 80759 83825 86383 87627 87460 86120 84565 84365 85945 87680 88005 87574 87984 89257 90246
55413I0246N46Q58J080L91m26n08k87k64p8K07l60j777k569k037j377j500j594
$$ 90246 90792 91650 92730 93121 92695 92187 91900 91636 91558 91765 91405 89628 87059 85022 83645 82145 80551
55396H0551r34k83l26m52k10l11j044j348n84L63Q12J380K307K501J445L31R2
$$ 80551 79617 79334 79008 78556 78346 78035 76991 75643 75059 75422 76234 77614 79921 82422 83867 84198 84290
55379H4290J1n69r58p95j111k306k916j984q70j075j884j905j435j431j468o71
$$ 84290 84301 83732 82774 81979 80868 78562 75646 73662 72792 71717 69833 67928 66493 65062 63594 62923
55363F2923M32P49M38L71N82O18N97O97N35J12K73J190J620Q19j04n8K28l11j038
$$ 62923 63355 64104 64542 64913 65495 66113 66710 67407 67942 68054 68327 69517 71137 71956 71852 71794 72022 71711 70673
55344G0673o58O59J758K276K572K596K020R44l64j683k307j476R5O29j39m77M49
$$ 70673 70015 70674 72432 74708 77280 79876 81896 82840 82476 80793 78486 77010 77105 77734 77595 77118 77567
55327G7567J227Q23M37J144J717P18r26j516j272j317j321l05J185J858J790J860
$$ 77567 78794 79617 80054 81198 82915 83633 82707 81191 79919 78602 77281 76976 78161 80019 81809 83669
55311H3669J887J224L97L16N52J64n42p09o55j089j501j090n76j084j939j530
$$ 83669 85556 86780 87177 87493 88045 88209 87667 86958 86303 85214 83713 82623 82047 80963 79024 77494
55295G7494P8J384J892K400L083L135K358J464Q09J39m60o63p56j185j624j529
$$ 77494 77572 78956 80848 83248 86331 89466 91824 93288 94097 94236 93776 93113 92357 91172 89548 88019
55279H8019j252j337j330n27N39Q05L62J00J11j09l66q8L71J73n52r73r29p88
$$ 88019 86767 85430 84100 83573 84112 84917 85279 85379 85490 85381 85015 84927 85298 85471 84919 83946 83017 82229
55261H2229l73N79J337J011P7l05j72m56j113j167m68O8M8J8K32K60l9k95m17
$$ 82229 81856 82435 83772 84783 84860 84555 84383 83927 82814 81647 81179 81247 81295 81313 81545 81805 81766 81471 81054
55242H1054o31p15k45M82O72J85l69o15n86k41M10R09Q21M40K36P1l14n92m39
$$ 81054 80423 79708 79463 79945 80617 80802 80433 79818 79232 78991 79401 80310 81131 81571 81807 81878 81564 80972 80533
55223H0533l12o34q08r2J044J525J209Q15O89O95Q47J133J093M79r9n2K54K81
$$ 80533 80221 79587 78779 78687 79731 81256 82465 83280 83969 84664 85511 86644 87737 88216 88117 88065 88319 88600
55205H8600K63N09N01j69q40q27o54r91j270o99J81L41pp0n2n85j209j074n70
$$ 88600 88863 89372 89873 89704 88864 88037 87383 86392 85122 84423 84604 84945 84938 84868 84816 84231 83022 81948 81378
55186H1378o12q85m49M60R48J288K315L402L011J196l26o64n58o48o32l60k39
$$ 81378 80766 79881 79432 79892 80840 82128 84443 87845 90856 92052 91726 91062 90504 89856 89224 88864 88625
55169H8625k58M9M97M04j18k98l6J35K56P97J376J162L99P9K17o3p62r38m50k02
$$ 88625 88367 88416 88913 89317 89199 88901 88865 89000 89256 90053 91429 92591 92990 93069 93286 93223 92461 91523 91073 90871
55149I0871n04o79n03n22p57n27J92O39O44P80J024O83j55n73m06m56r01j009
$$ 90871 90367 89688 89185 88663 87906 87379 87571 88210 88854 89634 90658 91341 91186 90613 90207 89751 88850 87841
55131H7841o25m26m37J06J007R62k73j135n14O97J160Q99O35M35O8j84L7M83P32
$$ 87841 87216 86790 86353 86459 87466 88428 88155 87020 86506 87203 88363 89262 89897 90332 90400 90216 90253 90736 91468
55112I1468Q00P91N61J36r0M3K26K48L04N31Q16J121J453J515J029K70l30q31
$$ 91468 92268 93059 93620 93756 93666 93709 93935 94183 94487 95018 95834 96955 98408 99923 100952 101222 100892 100061
55094A00061j366j506r91n85j080j807j471j85P65R31J020J203P76l40j181j211
$$ 100061 98695 97189 96198 95613 94533 92726 91255 91070 91835 92766 93786 94989 95765 95425 94244 93033
55078I3033q80n54l1O29J042J307J768J958J182N1j16N52N86m18j233j149q99
$$ 93033 92153 91599 91568 92197 93239 94546 96314 98272 99454 99505 99389 99941 100527 100109 98876 97727 96828
55061I6828j009r43n52n99j124r17M99J805J778R30L27L5l50p08q00p84o06J06
$$ 96828 95819 94876 94324 93725 92601 91684 92183 93988 95766 96696 97023 97058 96708 96000 95200 94416 93810 93916
55043I3916J007R91j64j236j268o93k68j0J28k06q85j033l29N02J012J573K129
$$ 93916 94923 95914 95750 94514 93246 92553 92285 92275 92403 92197 91312 90279 89950 90452 91464 93037 95166
55026I5166J868Q07K13O42R84L75m44o62p49j115r06M65J833J807P40j46n67q01
$$ 95166 97034 97841 98054 98696 99680 100055 99611 98949 98200 97085 96179 96644 98477 100284 101024 100878 100311 99510
55008I9510o13N1K34o05j241l35J367K044J372N17J28q3j72J24M84M08K92Q26
$$ 99510 98897 98948 99182 98577 97336 97001 98368 100412 101784 102301 102429 102346 102174 102298 102782 103190 103482 104308
54990A04308J609J700J225J090J278Q93j30p72n16OK45M48Q74J244J292J095O42
$$ 104308 105917 107617 108842 109932 111210 112103 111973 111201 110685 110691 110936 111384 112258 113502 114794 115889 116531
54973A16531j90j065j322q31j18M44R34J275J152O09J66O9J3k17k91J49R43J565
$$ 116531 116341 115276 113954 113123 113005 113449 114383 115658 116810 117419 117585 117654 117667 117450 117159 117308 118251 119816
54955A19816J575P68p20k288l076k655j509o17m71o17k86N53J180J200J112J350
$$ 119816 121391 122159 121439 119151 116075 113420 111911 111294 110823 110206 109920 110473 111653 112853 113965 115315
54939A15315J369M92p52j141n52q0k85m83j39K35J63J78R27K054K779L003L106
$$ 115315 116684 117176 116424 115283 114731 114651 114366 113883 113744 113979 114142 114320 115247 117301 120080 123083 126189
54922A26189L189L209L454M148M957N424N571N580N317M603L579K372P83j202
$$ 126189 129378 132587 136041 140189 145146 150570 156141 161721 167038 171641 175220 177592 178375 177173
54908A77173l075m367n110n466n399n017m699m478l937l015k208j654r00J4K02
$$ 177173 174098 169731 164621 159155 153756 148739 144040 139562 135625 132610 130402 128748 127848 127862 128064
54893A28064o22j319q43K24O58M18L35N26K89m68q86l67O60J392J610J810K608
$$ 128064 127442 126123 125280 125504 126162 126580 126915 127441 127730 127262 126376 126009 126669 128061 129671 131481 134089
54876A34089M072N552O359O580O782O908O179M288J920j71j904l301m077m316
$$ 134089 138161 143713 150072 156652 163434 170342 176521 180809 182729 182558 180654 177353 173276 168960
54862A68960m695n439n775n106l983l207k661j895j165j032j372j655j796k028
$$ 168960 164265 158826 153051 147945 143962 140755 138094 136199 135034 134002 132630 130975 129179 127151
54848A27151k252k263k184k117j776j061n08n73r60j123r88o83k35J7m71j388
$$ 127151 124899 122636 120452 118335 116559 115498 114990 114417 113457 112334 111346 110663 110428 110445 109974 108586
54832A08586j474k05J310J915J888J898J565K98j199j651j022l05O3L82O50N65
$$ 108586 107112 106907 108217 110132 112020 113918 115483 115781 114582 112931 111909 111604 111667 112049 112699 113264
54816A13264L02K49J88k50o61m05K58O42Q30J309J709J225N8o47l41M98J299J800
$$ 113264 113566 113815 114003 113753 113092 112687 112945 113587 114417 115726 117435 118660 118718 118071 117730 118228 119527 121327
54798A21327J716J062N87Q48J137L96j021j718j268o30n57p72q58p89m85J49O09
$$ 121327 123043 124105 124692 125540 126677 127073 126052 124334 123066 122436 121879 121107 120249 119460 118975 119124 119733
54781A19733K40n77p07J92J301J971K298K325J745P58K55P25J775K930M160N388
$$ 119733 119973 119396 118689 118881 120182 122153 124451 126776 128521 129279 129534 130259 132034 134964 139124 144512
54765A44512O252O629O795O878O801O710O783O605N458L250M92k436n182o895
$$ 144512 150764 157393 164188 171066 177867 184577 191360 197965 203423 206673 207165 204729 199547 192652
54751A92652o961o145n873o319o390n558m439l486k538j874k196l079k983j541
$$ 192652 185691 179546 173673 167354 160964 155406 150967 147481 144943 143069 140873 137794 134811 133270
54737A33270l53n94j205o69O12J151P50M75P81J090J186J617K501L032K542J500
$$ 133270 132917 132323 131118 130449 131061 132212 132962 133437 134218 135308 136494 138111 140612 143644 146186 147686
54721A47686J059J943L920O006P157P045O159M998L384R51j880l972m644m392
$$ 147686 148745 150688 154608 160614 167771 174816 180975 185973 189357 190308 188428 184456 179812 175420
54707A75420m260m768n660o414o700o289n006l069j310n80q51j227r95l10K95
$$ 175420 171160 166392 160732 154318 147618 141329 136323 133254 131944 131364 130513 129286 128291 127981 128276
54692A28276N81N28N7o70j052o97q8o1p45j479j628j049N8J229J814J486O66k5
$$ 128276 128857 129385 129442 128772 127720 127023 126935 126874 126129 124650 123022 121973 122031 123260 125074 126560 127226 127201
54674A27201n67j289k042k215j582o40n4r7n41p41q8J274K358K417J771J149O99
$$ 127201 126634 125345 123303 121088 119506 118866 118812 118715 118174 117433 117345 118619 120977 123394 125165 126314 127013
54657A27013K21l2K78P47O28q8p65j132j328j203n33K08L17L6J86O85N96j93o52
$$ 127013 127234 127202 127480 128227 128855 128767 128002 126870 125542 124339 123806 124014 124331 124367 124553 125238 125834 125641 124989
54638A24989l12n8o09j292j178m97j26j57k1M25P05N39J91k9j61l77o28n81K9
$$ 124989 124677 124619 124010 122718 121540 121043 120917 120760 120739 121164 121869 122408 122599 122570 122409 122032 121404 120823 120852
54619A20852R15J378J049L56j04l36o18p59l66K99M82m1p93j358j651j418m24
$$ 120852 121767 123145 124194 124550 124446 124110 123492 122733 122367 122666 123148 123107 122314 120956 119305 117887 117463
54602A17463Q02J288R15O45J131J897K162J797J121L52l90r79j398j529r28N46
$$ 117463 118265 119553 120468 121113 122244 124141 126303 128100 129221 129573 129183 128204 126806 125277 124349 124895
54586A24895J893J809M69n32l46J19j71q16r42o93p71j038p27K49J120J308R36
$$ 124895 126788 128597 129066 128534 128188 128307 128136 127320 126378 125685 124914 123876 123149 123398 124518 125826 126762
54569A26762L55k15n67n41k11K40P77J338J599J245M15m05q57q71n19N9N83P44
$$ 126762 127117 126902 126335 125794 125583 125823 126600 127938 129537 130782 131197 130792 129935 129064 128545 128604 129187 129931
54551A29931M29j32m37j19N76Q79M15k11j07P34J505J668J388R43L80j24j30M95
$$ 129931 130360 130228 129791 129672 130248 131127 131542 131331 131224 131958 133463 135131 136519 137462 137842 137718 137588 138083
54533A38083J372K010K044J193m05j794j872p63K31K42k40m00k73l45n71m61J17
$$ 138083 139455 141465 143509 144702 144297 142503 140631 139868 140099 140341 140101 139701 139428 139083 138512 138051 138168
54516A38168P82J128J059P13L41J30J9j63m16o02p20q33p91m57j26k64p72j026
$$ 138168 138950 140078 141137 141850 142191 142321 142340 142177 141761 141159 140439 139606 138815 138358 138232 137968 137196 136170
54498A36170o44J91J129J869K006J310J69p49j243j511j511j064m76k31j75K67
$$ 136170 135526 135717 136846 138715 140721 142031 142200 141451 140208 138697 137186 136122 135646 135415 135240 135507
54482A35507J012J372J196J055J188J219J025R45R74O93K60L71J028J378J159
$$ 135507 136519 137891 139087 140142 141330 142549 143574 144519 145493 146186 146446 146817 147845 149223 150382
54467A50382J189J905K552K387J692R64J57o13o13L49J219J043K71j91m17r65
$$ 150382 151571 153476 156028 158415 160107 161071 161228 160615 160002 160351 161570 162613 162884 162693 162276 161311
54451A61311j575j527q54l08k40l68m06l18j57r3l59p96q88n88m71p72r19n53
$$ 161311 159736 158209 157355 157047 156807 156439 156033 155715 155558 155465 155106 154310 153422 152834 152363 151591 150672 150119
54433A50119j67j36K6P17J315J107M82K63M40M24J05k23m93o74m64M5N9o94j170
$$ 150119 149952 149816 149842 150559 151874 152981 153463 153726 154166 154590 154695 154472 153979 153305 152841 152886 152945 152251 151081
54414A51081m55O83R11L78K23N41M06j88j33Q27J446Q54j74m36J15P08R47J014
$$ 151081 150626 151309 152220 152598 152821 153362 153768 153580 153447 154274 155720 156574 156400 155964 156079 156787 157734 158748
54396A58748J098J222J371J452J321J008P37N82L45j03o05q65o88j51L12K33l39
$$ 158748 159846 161068 162439 163891 165212 166220 166957 167539 167884 167781 167176 166311 165623 165472 165784 166017 165678
54379A65678q25q93q57j073j295j118o38k51j17k32n90p80J3J901L610L734K431
$$ 165678 164853 163960 163103 162030 160735 159617 158979 158728 158611 158379 157789 157009 157022 158923 162533 166267 168698
54362A68698J118O89Q76J196J571J955K077J807J302O98M8m98q51j233j856k542
$$ 168698 169816 170505 171381 172577 174148 176103 178180 179987 181289 181987 182035 181537 180686 179453 177597 175055
54346A75055l049l481l864l660k412o72M47N62K44N0mj5Q1L07N79Q41R14M33n80
$$ 175055 172006 168525 164661 161001 158589 157917 158364 158926 159170 159220 159216 159201 159282 159589 160168 161009 161923 162356 161776
54327A61776j431j546j222j000p15LO81M36o23j464j498j009k61P46J493J088
$$ 161776 160345 158799 157577 156577 155862 155865 156546 156982 156359 154895 153397 152388 152127 152873 154366 155454
54311A55454l76j556j422m69J53P6k45l96l36j00K86O65P37L19m60j106j099n05
$$ 155454 155078 153522 152100 151631 151784 151860 151615 151219 150883 150783 151069 151734 152471 152790 152330 151224 150125 149620
54293A49620j5j18m26k87K33N14L80K44L17L97M31O88J215J652J695J289M01q32
$$ 149620 149605 149487 149061 148774 149007 149521 149901 150145 150462 150859 151290 151978 153193 154845 156540 157829 158230 157398
54275A57398j788j850j264q61q72o76M2O70N46r9n41n02k60j12j7K58Q55J529
$$ 157398 155610 153760 152496 151635 150763 150087 150129 150799 151345 151246 150705 150203 149943 149831 149814 150072 150927 152456
54257A52456J798J511J165J300J727J838J563J429J663J825J502R09M63K29l8
$$ 152456 154254 155765 156930 158230 159957 161795 163358 164787 166450 168275 169777 170686 171149 171378 171340
54242A71340m89j024j400j409j155j012j159j292j066o46m10k85R8P14J124J092
$$ 171340 170851 169827 168427 167018 165863 164851 163692 162400 161334 160688 160278 159993 160091 160805 161929 163021
54226A63021P56K80k27m82k61J46J96j69n18o54p97j032j084p83l65j41j57k63
$$ 163021 163777 164057 163830 163348 163087 163233 163429 163260 162742 162088 161291 160259 159175 158392 158027 157886 157729 157466
54208A57466k71j44j32n19j075j139n97j98m30o21j1R06J065M94J32J95j7n94
$$ 157466 157195 157051 156919 156400 155325 154186 153589 153391 152961 152340 152329 153235 154300 154794 154926 155121 155104 154510
54190A54510o07L95J540J828J343P23K30j38k12O6L90N42O84Q63P16P8n85o84
$$ 154510 153903 154298 155838 157666 159009 159732 159962 159824 159612 159678 160068 160610 161294 162157 162873 162951 162366 161682
54172A61682j78N37J042J031M35l40p15o48o59r59j089o47M7L47Kp39j442j748
$$ 161682 161504 162041 163083 164114 164549 164209 163494 162846 162187 161228 160139 159492 159539 159886 159888 159149 157707 155959
54154A55959j594j269r73m38O34J855K430K145J504R02L30q5m8K64K52j97m98
$$ 155959 154365 153096 152123 151685 152319 154174 156604 158749 160253 161155 161485 161400 161352 161616 161868 161671 161173
54137A61173l77l20o62r84q47n32m43l56J55Q79J114N86k29n72p6R06J610J667
$$ 161173 160796 160476 159814 158830 157983 157451 157008 156652 156807 157686 158800 159386 159157 158585 158509 159415 161025 162692
54119A62692J551J811K110J637M08o45r12o36j17O78J444J486Q05L60O36P94Q3
$$ 162692 164243 166054 168164 169801 170209 169564 168652 168016 167899 168577 170021 171507 172312 172672 173308 174102 174185
54102A74185q08p05K88J082J291J583K364L179L559L693L952M264M303L928L146
$$ 174185 173377 172672 172960 174042 175333 176916 179280 182459 186018 189711 193663 197927 202230 206158 209304
54087B09304J944L58j361k869l943m535m619m106l067j940j310j285j338r51k66
$$ 209304 211248 211606 210245 207376 203433 198898 194279 190173 187106 185166 183856 182571 181233 180282 180016
54072A80016K69N87J007J572J939J873J512J081P56P76J339K312L288L871L799
$$ 180016 180285 180872 181879 183451 185390 187263 188775 189856 190612 191388 192727 195039 198327 202198 205997
54057B05997L003J891J126P53M9j253k121j530n8Q02O52L80O15J135J759K485
$$ 205997 209000 210891 212017 212770 212819 211566 209445 207915 207857 208659 209311 209691 210306 211441 213200 215685
54041B15685K784K024Q83R18K435M035M699M929N267N191M375L787M370N521N964
$$ 215685 218469 220493 221376 222294 224729 228764 233463 238392 243659 248850 253225 257012 261382 266903 272867
54026B72867N406M383L188J887Q68M54M30N86J091J714J518J45j309j642j143
$$ 272867 278273 282656 285844 287731 288599 289053 289483 290069 291160 292874 294392 294537 293228 291586 290443
54011B90443r91j676k890m332n596n873m903l710l459l874l921l511l456l971
$$ 290443 289452 287776 284886 280554 274958 269085 264182 260472 257013 253139 249218 245707 242251 238280
53997B38280m406m356l985l372k440j553j274j549j857k029k191k132j578r70
$$ 238280 233874 229518 225533 222161 219721 218168 216894 215345 213488 211459 209268 207136 205558 204588
53983B04588r97j428j303l44P07J181J113P38J51l63l79Q3N71Q07Q50O59J43l73
$$ 204588 203591 202163 200860 200516 201223 202404 203517 204255 204406 204043 203664 203747 204318 205125 205975 206634 206777 206404
53965B06404l39L08J160J963K758L393L559L298L036L112L651M741O261P720Q738
$$ 206404 206065 206373 207533 209496 212254 215647 219206 222504 225540 228652 232303 237044 243305 251025 259763
53950B59763R446R883R460P667M975K271k94k836m637m630l083j552r25n91J50
$$ 259763 269209 279092 288552 296219 301194 303465 303171 300335 295698 291068 287985 286433 285508 284917 285067
53935B85067Q99R96P18Q96J758K713L018K434J469J047J609K503K736K269J977
$$ 285067 285966 286962 287680 288576 290334 293047 296065 298499 299968 301015 302624 305127 307863 310132 312109
53920C12109K335K952L535M411N660O540O449N936O026O831P487P369O755O202
$$ 312109 314444 317396 320931 325342 331002 337542 343991 349927 355953 362784 370271 377640 384395 390597
53906C90597N719M836L364J790P82L91L1p04j586k287k974l862m569m544m071
$$ 390597 396316 401152 404516 406306 407088 407479 407510 406806 405220 402933 399959 396097 391528 386984 382913
53891C82913m145n191o467p005o736o390o548p085p482p475p257p060o712n890
$$ 382913 378768 373577 367110 360105 353369 346979 340431 333346 325864 318389 311132 304072 297360 291470
53877B91470m765l922l571l322l004l084l790m404m041k793j513q11q22j555k746
$$ 291470 286705 282783 279212 275890 272886 269802 266012 261608 257567 254774 253261 252450 251628 250073 247327
53862B47327l625l624l110k805k739k477k017j678j375q74n36p98j227j077n75
$$ 247327 243702 240078 236968 234163 231424 228947 226930 225252 223877 223003 222467 221669 220442 219365 218790
53847B18790n18p32l77K81n5j450k182j199K36M39k94n00O7L14k67q70o86kL66
$$ 218790 218272 217540 217163 217444 217389 215939 213757 212558 212794 213233 212939 212439 212506 212820 212553 211683 210997 210995 211361
53828B11361J18l10k91L51J129J331Q11J67J0L54P90J002R05N56J90J33M58R48
$$ 211361 211479 211169 210878 211229 212358 213689 214500 214667 214677 215031 215821 216823 217728 218284 218474 218607 219065 220013
53810B20013J453K030K691L291L751M032L943L438L091L633M875N716N490M716
$$ 220013 221466 223496 226187 229478 233229 237261 241204 244642 247733 251366 256241 261957 267447 272163
53796B72163M204M022L835L663L782M146M487M686M658M124K962J513K79n39r29
$$ 272163 276367 280389 284224 287887 291669 295815 300302 304988 309646 313770 316732 318245 318524 317985 317056
53781C17056r10p14q31j463k280l023l952n203o243o471o034n432m630l325j934
$$ 317056 316146 315432 314601 313138 310858 307835 303883 298680 292437 285966 279932 274500 269870 266545 264611
53766B64611j419k055l039l559l587l390k878k000j313j481k347l034l045k775
$$ 264611 263192 261137 258098 254539 250952 247562 244684 242684 241371 239890 237543 234509 231464 228689
53752B28689k703k593j966j036n50o22m26O06J777J913R20j49n00m09n43r45j157
$$ 228689 225986 223393 221427 220391 219841 219219 218793 219399 221176 223089 224009 223860 223360 222951 222408 221463 220306
53735B20306r32n11l16n50r68j012l41P53J596J852J702J427J158J080J428K102
$$ 220306 219374 218863 218547 217997 217029 216017 215676 216429 218025 219877 221579 223006 224164 225244 226672 228774
53719B28774K611K627K310J991J772J634J566J453J156Q91J230K373L685M282
$$ 228774 231385 234012 236322 238313 240085 241719 243285 244738 245894 246785 248015 250388 254073 258355
53705B58355L962L254K690K366K186K180K422K832L272L794M520N240N349M542
$$ 258355 262317 265571 268261 270627 272813 274993 277415 280247 283519 287313 291833 297073 302422 306964
53691C06964L339K575K367K098J431P32K42l93j234j469n76M82K52j177k256k027
$$ 306964 310303 312878 315245 317343 318774 319506 319748 319355 318121 316652 316076 316558 316810 315633 313377 311350
53675C11350j118n19l87l99m07l27lL88L45j94p40j065j516k171k450j962j093
$$ 311350 310232 309713 309326 308927 308520 308193 308190 308578 308923 308729 307989 306924 305408 303237 300787 298825 297732
53658B97732l55K41O90O22%m77l09K3p0k32J68P59O05k69p40q6J129J851J647
$$ 297732 297377 297618 298308 298930 298930 298453 298144 298167 298097 297865 298033 298792 299397 299128 298388 298302 299431 301282 302929
53639C02929R29M25O29J351J871J711J213J045J373J843K201K492K773L064L458
$$ 302929 303858 304283 304912 306263 308134 309845 311058 312103 313476 315319 317520 320012 322785 325849 329307
53624C29307L892L985L561L195L631M741N642N853N676N400M826L925L296L428
$$ 329307 333199 337184 340745 343940 347571 352312 357954 363807 369483 374883 379709 383634 386930 390358
53610C90358L879L767K959K213K126K492K808K997L318L791M153M294M350M248
$$ 390358 394237 398004 400963 403176 405302 407794 410602 413599 416917 420708 424861 429155 433505 437753
53596D37753L587K245Q11Q1J96N89O65K47n24j325j782j800j786k250l162m005
$$ 437753 441340 443585 444396 444477 444673 445262 445927 446174 445650 444325 442543 440743 438957 436707 433545 429540
53580D29540m332l999l030j788j065j396k258k615k275j987k134k207j817j349
$$ 429540 425208 421209 418179 416391 415326 413930 411672 409057 406782 404795 402661 400454 398637 397288
53566C97288j134q48l22j46p17j355j251p56p45j107r74k76J09j51k61M61J587
$$ 397288 396154 395306 394984 394838 394121 392766 391515 390759 390014 388907 387933 387657 387766 387615 387354 387815 389402
53549C89402K339K629K855L074K937K279J372O59M53Q14J576K575L844N348O609
$$ 389402 391741 394370 397225 400299 403236 405515 406887 407546 407999 408813 410389 412964 416808 422156 428765
53534D28765O980O459N881O047O915P912Q769R667J0632J1326J1537J1614J2030
$$ 428765 435745 442204 448085 454132 461047 468959 477728 487395 498027 509353 520890 532504 544534
53521E44534J2788J3566J4340J5388J6598J7328J7338J7450J8632K0602K2073
$$ 544534 557322 570888 585228 600616 617214 634542 651880 669330 687962 708564 730637
53510G30637K2479K2743K3968K5984K7699K8495K8594K8298K7579K6553K5730
$$ 730637 753116 775859 799827 825811 853510 882005 910599 938897 966476 993029 1018759
53499A018759K5510K5679K5703K5361K4841K4272K3514K2433K1254K0421K0169
$$ 1018759 1044269 1069948 1095651 1121012 1145853 1170125 1193639 1216072 1237326 1257747 1277916
53488A277916K0369K0726K0979K0931K0588K0289K0353K0470J9873J8437J7164
$$ 1277916 1298285 1319011 1339990 1360921 1381509 1401798 1422151 1442621 1462494 1480931 1498095
53477A498095J7056J7763J7973J6888J4748J2040R033O157L953K274K04k772o072
$$ 1498095 1515151 1532914 1550887 1567775 1582523 1594563 1603596 1609753 1613706 1615980 1616184 1613412 1607340
53464A607340q864j1150j3473j5948j8031j9157j9189j8428j7492j7091j7625
$$ 1607340 1598476 1587326 1573853 1557905 1539874 1520717 1501528 1483100 1465608 1448517 1430892
53453A430892j9003k0851k2693k3995k4391k4061k3558k3204k2971k2866k2947
$$ 1430892 1411889 1391038 1368345 1344350 1319959 1295898 1272340 1249136 1226165 1203299 1180352
53442A180352k2835k1854j9865j7492j5282j3150j0913q713o625m399k101m50
$$ 1180352 1157517 1135663 1115798 1098306 1083024 1069874 1058961 1050248 1043623 1039224 1037123 1036673
53430A036673M5n4L06J592L539N743P905R709J0993J1893J2642J3454J4677J6607
$$ 1036673 1036718 1036664 1036970 1038562 1042101 1047844 1055749 1065458 1076451 1088344 1100986 1114440 1129117 1145724
53416A145724J8918K0879K2429K4253K6523K8364K9241L0011L1690L3842L5267
$$ 1145724 1164642 1185521 1207950 1232203 1258726 1287090 1316331 1346342 1378032 1411874 1447141
53405A447141L5839L6579L8129M0207M2440M4767M6988M8876N0824N3526N6854
$$ 1447141 1482980 1519559 1557688 1597895 1640335 1685102 1732090 1780966 1831790 1885316 1942170
53394A942170N9758O1505O2309O2672O2799O2884O3224O3678O3494O2096N9751
$$ 1942170 2001928 2063433 2125742 2188414 2251213 2314097 2377321 2440999 2504493 2566589 2626340
53383B626340N7265N5246N3721N2178M9872M6497M2532L8645L4834L0499K5388
$$ 2626340 2683605 2738851 2792572 2844750 2894622 2941119 2983651 3022296 3057130 3087629 3113017
53372C113017J9968J4868J0341O248K088k995r736j8044k7107l6109m4447n1389
$$ 3113017 3132985 3147853 3158194 3164442 3166530 3163535 3153799 3135755 3108648 3072539 3028092 2976703
53360B976703n6220n9028o0804o2426o3848o4517o4213o3208o1845o0296n8597
$$ 2976703 2920483 2861455 2800651 2738225 2674377 2609860 2545647 2482439 2420594 2360298 2301701
53349B301701n6683n4443n1940m9516m7601m6447m6017m6036m6124m5949m5284
$$ 2301701 2245018 2190575 2138635 2089119 2041518 1995071 1949054 1903018 1856894 1810945 1765661
53338A765661m3969m1929l9281l6226l2856k9302k6036k3608k1874j9954j7309
$$ 1765661 1721692 1679763 1640482 1604256 1571400 1542098 1516062 1492454 1470580 1450626 1433317
53327A433317j4487j2428j1383j1038j1286j2208j3378j3904j3430j2617j2364
$$ 1433317 1418830 1406402 1395019 1383981 1372695 1360487 1347109 1333205 1319775 1307158 1294794
53316A294794j2773j3047j2317j0509q364o623n169l277o81J938L691M397M569
$$ 1294794 1282021 1268974 1256657 1246148 1237784 1231161 1225992 1222715 1222034 1223972 1227663 1232060 1236629
53303A236629M906N906P597R396J0670J1661J3370J6185J9263K1626K3314K4842
$$ 1236629 1241535 1247441 1255038 1264434 1275104 1286765 1300135 1316320 1335583 1357209 1380523 1405365
53291A405365K6276K7511K8888L0625L1999L1997L0648K8863K7174K5366K3239
$$ 1405365 1431641 1459152 1488040 1518665 1550664 1582661 1613309 1642172 1669346 1694712 1717951
53280A717951K0931J8518J5974J3500J1248Q806N583J655k373o189r827j3048
$$ 1717951 1738882 1757400 1773374 1786874 1798122 1806928 1812511 1814166 1811793 1805604 1795777 1782729
53268A782729j5456j7301j9392k2084k4869k7074k8553k9658l0872l2377l3684
$$ 1782729 1767273 1749972 1730580 1708496 1683627 1656553 1628000 1598342 1567470 1535093 1501409
53257A501409l3990l3306l2779l3334l4434l4856l4220l3016l1617l0288k9587
$$ 1501409 1467419 1434113 1401334 1368000 1333566 1298710 1264490 1231474 1199857 1169569 1139982
53246A139982k9714k9732k8643k7011k6273k6676k7087k6798k6049k4884k2970
$$ 1139982 1110268 1080536 1051893 1024882 998609 971933 944846 918048 891999 867115 844145
53235H44145k0860j9839j9991j9763j8038j5443j3033j0929r023p818p628p840
$$ 844145 823285 803446 783455 763692 745654 730211 717178 706249 697226 689408 681780 673940
53223F73940p907q284r446j0801j1446j1488j1716j2399j3216j3963j4647j5082
$$ 673940 666033 657749 648303 637502 626056 614568 602852 590453 577237 563274 548627 533545
53211E33545j5028j4487j3547j2220j0741r517q574p586o687o478o963p296p114
$$ 533545 518517 504030 490483 478263 467522 458005 449431 441845 435158 428680 421717 414421 407307
53198D07307p153p952q779q748q178p884p724o920n511m402m137m408m737m917
$$ 407307 400154 392202 383423 374675 366497 358613 350889 343969 338458 334056 329919 325511 320774 315857
53184C15857m863m631m463m387l973l051k258k269k740k730k024j302j063j070
$$ 315857 310994 306363 301900 297513 293540 290489 288231 285962 283222 280492 278468 277166 276103 275033
53170B75033j003r94j262j602j523q06K15R13R55O25M30L63q2j139k343l004k800
$$ 275033 274030 273036 271774 270172 268649 267843 268058 268971 269926 270551 270981 271344 271262 270123 267780 264776 261976
53153B61976j847n76L43M32j03o80j163j803k384k221j305o29q06j195r03n9N94
$$ 261976 260129 259553 259896 260328 260225 259545 258382 256579 254195 251974 250669 250040 249234 248039 247136 247077 247671
53136B47671Q20Q57P27L52P1L46J081J714J888J652J266J118J481K010J930J121
$$ 247671 248491 249348 250075 250427 250498 250844 251925 253639 255527 257179 258445 259563 261044 263054 264984 266105
53120B66105M49N92J039R59M93L89P70J115J226J356J482J253O96K39o6p03j893
$$ 266105 266554 267146 268185 269144 269637 270026 270796 271911 273137 274493 275975 277228 277924 278163 278097 277394 275501
53103B75501l083l550l218k656k409k415k140j306l47J08M7l5O4J07R6L37P10
$$ 275501 272418 268868 265650 262994 260585 258170 256030 254724 254377 254485 254532 254497 254561 254668 254764 255101 255811
53086B55811O28Mn25o70r31j495j648r74k72m02r13q31k13J43J48M41J128J563
$$ 255811 256439 256443 255918 255248 254317 252822 251174 250200 249928 249526 248613 247782 247569 247712 247860 248301 249429 250992
53068B50992J371Q60L54j79q03j379j677j452o35K24K40o65j454j402j089j231
$$ 250992 252363 253223 253577 253398 252595 251216 249539 248087 247452 247676 247916 247251 245797 244395 243306 242075
53052B42075j296m38P97J133N78M41J292K261K473K019J245K18p39r96n83l57
$$ 242075 240779 240341 241138 242271 242849 243290 244582 246843 249316 251335 252580 252798 252059 251063 250480 250123
53036B50123p81j264j153o50l09k27k50m61r62j457j480q82O3Q47J046P27M60
$$ 250123 249342 248078 246925 246275 245966 245739 245489 245028 244066 242609 241129 240247 240310 241157 242203 242930 243390
53019B43390N95P20L41j08K81J441K189J760P35J55K63N59N62K16j95k43K68R53
$$ 243390 243985 244705 245046 244938 245219 246660 248849 250609 251344 251499 251762 252321 252883 253099 252904 252661 252929 253882
53001B53882J165P24L2m99p61p00l13N6j09q18j422j345n80M90J403J714J305
$$ 253882 255047 255771 255803 255304 254543 253843 253530 253586 253477 252659 251237 249892 249312 249802 251205 252919 254224
52984B54224P02O44J237J906K226K328K439K473K256J798J222P54Q03J553K406
$$ 254224 254926 255570 256807 258713 260939 263267 265706 268179 270435 272233 273455 274209 275012 276565 278971
52969B78971K354J148l40j078r02l40J58N63R81J341J457J267R42O03mj187k586
$$ 278971 281325 282473 282133 281055 280153 279813 279971 280534 281515 282856 284313 285580 286522 287125 287121 285934 283348
52952B83348l331l161k810k892k914k124p61K41N07L05k50j147j825j598p24k09
$$ 283348 280017 276856 274046 271154 268240 266116 265355 265596 266103 266408 266158 265011 263186 261588 260864 260655
52936B60655m24p77q05o75n02q5M05L92j52m72j59J97q2q34j409j462j044l96
$$ 260655 260231 259454 258649 257974 257472 257387 257792 258184 258032 257560 257401 257598 257516 256682 255273 253811 252767 252371
52918B52371J19K26Q5kj45n77q44k47Q91J321N29n96j123j169j116p03L18J341
$$ 252371 252490 252716 252801 252799 252654 252077 251233 250986 251877 253198 253727 253131 252008 250839 249723 249020 249338 250679
52900B50679J565J082N57K68O5m4jo2m50q41p69l55j12k23m72p21r21q17j68P49
$$ 250679 252244 253326 253883 254151 254216 254172 254171 254109 253659 252818 252049 251694 251582 251359 250887 250166 249245 248428 248260 249009
52880B49009J272J100O16M17P41J329J738J744J526J415J561J909K343K631K391
$$ 249009 250281 251381 251997 252414 253155 254484 256222 257966 259492 260907 262468 264377 266720 269351 271742
52865B71742J545P01N48Q78P99J4o68m14N61J305J196L71o55j540k320l138l776
$$ 271742 273287 273988 274536 275414 276213 276227 275559 275145 275706 277011 278207 278578 277923 276383 274063 270925 267149
52848B67149l682k750j741j441j711j946k147k639l021k550j534j130j520j555
$$ 267149 263467 260717 258976 257535 255824 253878 251731 249092 246071 243521 241987 240857 239337 237782
52834B37782o45K48J52m94q71j150j744k039j198K55R54N92J74L48O20M00m9q2
$$ 237782 237137 237385 237537 237043 236172 235022 233278 231239 230041 230296 231250 231842 232016 232364 232984 233384 233335 233253
52816B33253M42J102J410J204P22L01Ml23m96K7J275K316K240J245K09n18j207
$$ 233253 233695 234797 236207 237411 238133 238434 238438 238115 237619 237646 238921 241237 243477 244722 244931 244413 243206
52799B43206j799j744r30j38j73r89j874k298k260j987j572r38q2P67J269J188
$$ 243206 241407 239663 238733 238595 238422 237433 235559 233261 231001 229014 227442 226504 226422 227189 228458 229646
52783B29646M99n91j576j805r82M52J750K556K964L008K601J868J070K39o76j398
$$ 229646 230145 229554 227978 226173 225191 225643 227393 229949 232913 235921 238522 240390 241460 241699 241023 239625
52767B39625j602j569j805k079j623m58M66O32N82P68P92L69O6L34N64K0q80j138
$$ 239625 238023 236454 234649 232570 230947 230489 230955 231587 232169 232937 233729 234098 234164 234498 235062 235082 234202 233064
52749B33064n39L41J147J831K139J878J541J805K537L007K923K595K188J637J173
$$ 233064 232525 232866 234013 235844 237983 239861 241402 243207 245744 248751 251674 254269 256457 258094 259267
52734B59267J209J645J937J855J624J336Q25J42m08p12r25j061j000q60r12j163
$$ 259267 260476 262121 264058 265913 267537 268873 269698 269840 269432 268720 267795 266734 265734 264874 263962 262799
52718B62799j412j626j853j863j407p42l90m09l83j66p0l31q06j319j861k264
$$ 262799 261387 259761 257908 256045 254638 253896 253506 253097 252714 252548 252478 252147 251341 250022 248161 245897
52702B45897k096j074M88J782K043J189N2l08L24J146J390J133P59J62q76j902
$$ 245897 243801 242727 243215 244997 247040 248229 248281 247973 248297 249443 250833 251966 252725 252887 252011 250109
52686B50109k080j235o2O93Q44O08L51L75O21N79q4j001j462j224n85O7M38L53
$$ 250109 248029 246794 246732 247425 248269 248877 249228 249603 250224 250803 250719 249718 248256 247032 246447 246514 246952 247305
52668B47305N0J75R67J702J506N20m15r71j462j803j247N05K577L760L789L443
$$ 247305 247355 247530 248497 250199 251705 252225 251810 250839 249377 247574 246327 246832 249409 253169 256958 260401
52652B60401L497L874L822K916J666Q99O39J28r97k147k680k704k520j957q87
$$ 260401 263898 267772 271594 274510 276176 277075 277714 277842 276845 274698 272018 269314 266794 264837 263950
52637B63950J54O17P23Q85P85lr05q99KP97R97J095J541K081K292K016J150k45
$$ 263950 264104 264721 265444 266329 267114 267111 266206 265307 265309 266106 267103 268198 269739 271820 274112 276128 277278 277033
52619B77033j577k139j982j717j578j363j164j260j323p07L19O69o1j042j425
$$ 277033 275456 273317 271335 269618 268040 266677 265513 264253 262930 262223 262542 263211 263150 262108 260683
52604B60683j205o35K57J165J414R09L97L59M37L10K97N44M39l81j205j179m94
$$ 260683 259478 258843 259100 260265 261679 262588 262985 263344 263781 264091 264388 264932 265371 264990 263785 262606 262112
52587B62112J12M61P64Q04K39n39o62J19J252K158K645K631K114J362O97P3o80
$$ 262112 262224 262685 263449 264253 264492 263953 263291 263410 264662 266820 269465 272096 274210 275572 276269 276342 275662
52570B75662j337j442r88m45j35kj9l48r39j363j270q63o45p89r28o36kM15K67
$$ 275662 274325 272883 271895 271450 271315 271313 271294 270946 270007 268644 267374 266511 265866 265077 264149 263513 263511 263926 264193
52551B64193j54l76l82n02p19n59K14J174J660J409O75J5k7O65J452J489P24K9
$$ 264193 264039 263663 263281 262779 262060 261501 261715 262889 264549 265958 266633 266648 266621 267286 268738 270227 270951 270980
52533B70980J03O04P32K45m35r06j052p87l6R41J566J479R32N11N20P02N73N0
$$ 270980 271083 271687 272419 272664 272229 271323 270271 269484 269448 270389 271955 273434 274366 274877 275397 276099 276672 276722
52515B76722l58p4Q85J880K344K316K223K339K529K512K264K060K068J943J100
$$ 276722 276364 276290 277175 279055 281399 283715 285938 288277 290806 293318 295582 297642 299710 301653 302753
52500C02753n24k257l389l839l940l886l709l495l196k482j282k18P7j19k8M15
$$ 302753 302229 299972 296583 292744 288804 284918 281209 277714 274518 272036 270754 270536 270613 270494 270466 270881
52484B70881N09n0o37n95M0Q98J765K450K708K610K484K290J578M32k15K77J263
$$ 270881 271390 271340 270703 270108 270148 271046 272811 275261 277969 280579 283063 285353 286931 287363 287148 287425 288688
52467B88688J529P74j39k02Q68K570L983M336L605K503J699J140L84o40j595k279
$$ 288688 290217 290991 290852 290650 291518 294088 298071 302407 306012 308515 310214 311354 311738 311098 309503 307224
52451C07224k860l494m024m159l834l290k836k527k100j352m83K9k0l38n23m83
$$ 307224 304364 300870 296846 292687 288853 285563 282727 280200 278100 276748 276265 276294 276274 275936 275413 274930
52435B74930m62o79j009j054o39k01l69j048j306n39O64J279J143Q86Q39P88O70
$$ 274930 274468 273789 272780 271726 271087 270886 270517 269469 268163 267624 268288 269567 270710 271596 272435 273223 273893
52418B73893P35R10Q02N15P57J819L057L746L913L996M197M513N083O077P499
$$ 273893 274628 275538 276340 276855 277612 279431 282488 286234 290147 294143 298340 302853 307936 314013 321512
52403C21512R265J1065J2066J1244Q342M186j55m060p082q678q743p971p189o459
$$ 321512 330777 341842 353908 365152 373494 377680 377525 373465 366383 357705 348962 340991 333802 327343
52389C27343n291l577j982j346j800k484k246q35P30J336J079R18J259J694K012
$$ 327343 322052 318475 316493 315147 313347 310863 308617 307782 308512 309848 310927 311845 313104 314798 316810
52374C16810K552L305L660L451L408M052M793M847M326L834L422K711J678O84
$$ 316810 319362 322667 326327 329778 333186 337238 342031 346878 351204 355038 358460 361171 362849 363533
52360C63533o4n97r11j060j248j477j380p46Q8O35P64N81K55K13R20K152K955
$$ 363533 363469 362872 361961 360901 359653 358176 356796 356050 356138 356773 357537 358118 358373 358586 359506 361658 364613
52343C64613K783K139J705J543J554K085L312M640N444N978O835P942Q889R769
$$ 364613 367396 369535 371240 372783 374337 376422 379734 384374 389818 395796 402631 410573 419462 429231
52329D29231J0870J1846J2150J2076J2508J3677J5032J6234J7485J8775J9653
$$ 429231 440101 451947 464097 476173 488681 502358 517390 533624 551109 569884 589537
52318E89537J9943K0037K0219K0197J9555J8388J7315J7021J7750J9026J9935
$$ 589537 609480 629517 649736 669933 689488 707876 725191 742212 759962 778988 798923
52307G98923J9925J9248J8526J8109J8021J8129J8069J7446J6404J5570J5025
$$ 798923 818848 838096 856622 874731 892752 910881 928950 946396 962800 978370 993395
52296I93395J3924J1678Q911O558M552K271k02k276m004n905p747q652q576q632
$$ 993395 1007319 1018997 1027908 1034466 1039018 1041289 1041087 1038811 1034807 1028902 1021155 1012503 1003927 995295
52282I95295r521j0422j0008q088n743m067l102j941J84K889M908N523N366N575
$$ 995295 985774 975352 965344 957256 951513 947446 944344 942403 942587 945476 950384 955907 961273 966848
52268I66848O596Q216J0218J2202J3291J2940J1912J1593J2350J3372J4040J4591
$$ 966848 973444 981660 991878 1004080 1017371 1030311 1042223 1053816 1066166 1079538 1093578 1108169
52256A108169J5327J6015J6324J6198J5714J5031J4491J4090J3025J0489O942
$$ 1108169 1123496 1139511 1155835 1172033 1187747 1202778 1217269 1231359 1244384 1254873 1261815
52245A261815L671J128j361m144o571q155r384j0829j2189j2946j3246j3574j4003
$$ 1261815 1265486 1266614 1265253 1261109 1254538 1246383 1236999 1226170 1213981 1201035 1187789 1174215 1160212
52232A160212j4339j4550j4521j3852j2467j1118j0618j0787j0608r451p741o430
$$ 1160212 1145873 1131323 1116802 1102950 1090483 1079365 1068747 1057960 1047352 1037901 1030160 1023730
52220A023730o029o143n876m752l185j894j037k61N86J310J883K492L096L489
$$ 1023730 1017701 1011558 1005682 1000930 997745 995851 994814 994553 995139 996449 998332 1000824 1003920 1007409
52206A007409L870M608N375N267M100K918K795L668M760N548N905N802N382N006
$$ 1007409 1011279 1015887 1021262 1026529 1030629 1033547 1036342 1040010 1044770 1050318 1056223 1062025 1067407 1072413
52192A072413M742M250L534L336M209N522N994M998L003Q63q43k071l237m852
$$ 1072413 1077155 1081405 1084939 1088275 1092484 1098006 1104000 1108998 1112001 1112864 1112021 1109950 1106713 1101861
52178A101861o868q575r383r508r505r423q785p356n543m033l230k933k560j761
$$ 1101861 1094993 1086418 1077035 1067527 1058022 1048599 1039814 1032458 1026915 1022882 1019652 1016719 1014159 1012398
52164A012398q27j70M61J743L597M927M873L872K974K574K315J844J093J10q41
$$ 1012398 1011571 1011401 1011862 1013605 1017202 1022129 1027002 1030874 1033848 1036422 1038737 1040581 1041674 1041784 1040943
52149A040943j207p15J16N53N56O48J029J486K042K962L936L982K598O56l87M0
$$ 1040943 1039736 1039021 1039137 1039690 1040246 1040894 1041923 1043409 1045451 1048413 1052349 1056331 1058929 1059585 1059198 1059238
52133A059238J210K144K696L520N219P722J0555J3410J6209J8776K0846K2516
$$ 1059238 1060448 1062592 1065288 1068808 1074027 1081749 1092304 1105714 1121923 1140699 1161545 1184061
52121A184061K4293K6443K8567L0065L0822L1106L0940L0002K8203K6032K4123
$$ 1184061 1208354 1234797 1263364 1293429 1324251 1355357 1386297 1416299 1444502 1470534 1494657
52110A494657K2635K1219J9529J7673J6020J4619J3039J1030R075P887P390O716
$$ 1494657 1517292 1538511 1558040 1575713 1591733 1606352 1619391 1630421 1639496 1647383 1654773 1661489
52098A661489N371L810K505J009j414m539p383r635j2097j5387j8849k1232k2139
$$ 1661489 1666860 1670670 1673175 1674184 1672770 1668231 1660848 1651213 1639116 1623729 1604880 1583648 1561509
52085A561509k2226k2110k1638k0356j8263j5795j3306j0883q578o497m576k599
$$ 1561509 1539283 1517173 1495535 1475179 1456916 1441121 1427815 1416932 1408354 1401857 1397281 1394682
52073A394682n25J409L050M695O789R315J1671J3245J3990J4393J4901J5461J5690
$$ 1394682 1394157 1395566 1398616 1403311 1410100 1419415 1431086 1444331 1458321 1472714 1487615 1503076 1518766
$$ [...]
##END NTUPLES=NMR SPECTRUM
##END=
