##TITLE=AC1462_TOLI213268_8026402_mr6yncFa7V
##JCAMPDX= 6.0         $$ Bruker NMR JCAMP-DX V2.0
##DATA TYPE= NMR SPECTRUM
##DATA CLASS= NTUPLES
##ORIGIN= BRUKER
##OWNER= Administrator
$$ 1.72 TOPSPIN		Version 2.1
$$ 2013-07-11 18:20:08.594 -0700  Administrator@X
$$ Compression mode = diff/dup
##.OBSERVE FREQUENCY= 400.02188249412
##.OBSERVE NUCLEUS= ^1H
##.ACQUISITION MODE= SIMULTANEOUS (DQD)
##.ACQUISITION SCHEME= undefined
##.AVERAGES= 8
##.DIGITISER RES= 22
##SPECTROMETER/DATA SYSTEM= spect
##.PULSE SEQUENCE= zg30
##.SOLVENT NAME= COFFEE_meoh
##.SHIFT REFERENCE= INTERNAL, COFFEE_meoh, 1, 14.98509
##AUDIT TRAIL= $$ (NUMBER, WHEN, WHO, WHERE, PROCESS, VERSION, WHAT)
$$ ##TITLE= Audit trail, TOPSPIN		Version 2.1
$$ ##JCAMPDX= 5.01
$$ ##ORIGIN= Bruker BioSpin GmbH
$$ ##OWNER= Administrator
$$ $$ E:\/data/COFFEE/nmr/AC1462_TOLI213268_8026402_mr6yncFa7V/10/pdata/1/auditp.txt
$$ ##AUDIT TRAIL=  $$ (NUMBER, WHEN, WHO, WHERE, PROCESS, VERSION, WHAT)
(   1,<2013-07-11 18:20:01.641 -0700>,<Administrator>,<X>,<go>,<TOPSPIN 2.1>,
      <created by zg
	started at 2013-07-11 18:18:55.969 -0700,
	POWCHK enabled, PULCHK disabled,
       configuration hash MD5:
       C8 4E 4E 5D D3 5C D8 9E 9F 52 82 E0 59 8A DE 15
       data hash MD5: 64K
       59 BB A9 06 E3 5F 2B 75 90 0E D0 78 89 38 1E 6A>)
(   2,<2013-07-11 18:20:04.656 -0700>,<Administrator>,<X>,<proc1d>,<TOPSPIN 2.1>,
      <Start of raw data processing
       efp LB = 0 FT_mod = 6 PKNL = 1 PHC0 = 0 PHC1 = 0 SI = 32K 
       data hash MD5: 32K
       B5 A5 66 36 2E 82 AD BD E2 02 24 EE CC E7 D2 5B>)
(   3,<2013-07-11 18:20:04.985 -0700>,<Administrator>,<X>,<proc1d>,<TOPSPIN 2.1>,
      <pk PHC0 = 95.7074 PHC1 = 0 
       data hash MD5: 32K
       E6 92 7B CD 6B 0C 90 D8 A8 55 95 B2 1B 2D AE D0>)
(   4,<2013-07-11 18:20:05.063 -0700>,<Administrator>,<X>,<proc1d>,<TOPSPIN 2.1>,
      <abs ABSG = 1 
       data hash MD5: 32K
       C2 38 CF 06 96 69 D8 6D 22 13 F6 3B 7E 30 E9 17>)
(   5,<2013-07-11 18:20:05.172 -0700>,<Administrator>,<X>,<proc1d>,<TOPSPIN 2.1>,
      <abs ABSG = 2 
       data hash MD5: 32K
       35 57 E1 3D 3D F3 DA B7 85 8C A2 FA AE 7A 31 7D>)
(   6,<2013-07-11 18:20:05.219 -0700>,<Administrator>,<X>,<proc1d>,<TOPSPIN 2.1>,
      <abs ABSG = 3 
       data hash MD5: 32K
       16 7C D7 E6 67 6F E6 C8 CD 40 9E F6 86 65 58 FE>)
(   7,<2013-07-11 18:20:05.281 -0700>,<Administrator>,<X>,<proc1d>,<TOPSPIN 2.1>,
      <abs ABSG = 4 
       data hash MD5: 32K
       7D 1F 56 19 22 54 33 A9 F0 46 7C CE 63 B5 F2 97>)
(   8,<2013-07-11 18:20:05.375 -0700>,<Administrator>,<X>,<proc1d>,<TOPSPIN 2.1>,
      <abs ABSG = 5 
       data hash MD5: 32K
       F5 5A 50 C4 36 84 79 64 E2 8B A5 93 B0 68 25 4E>)
$$ ##END=
$$ 
$$ $$ hash MD5
$$ $$ D7 D2 13 27 52 78 7A 32 14 C1 10 CF 4F 23 0E C8
##$RELAX= 
##$RELAX= 
##$RELAX= 
##$RELAX= 
##$RELAX= 
##$RELAX= 
##$RELAX= 
$$ Bruker specific parameters
$$ --------------------------
##$DU= <E:\>
##$EXPNO= 10
##$NAME= <AC1462_TOLI213268_8026402_mr6yncFa7V>
$$ [...]
##$TP= (0..7)
150 150 150 150 150 150 150 150
##$TP07= 0
##$TPNAME0= <>
##$TPNAME1= <>
##$TPNAME2= <>
##$TPNAME3= <>
##$TPNAME4= <>
##$TPNAME5= <>
##$TPNAME6= <>
##$TPNAME7= <>
##$TPOAL= (0..7)
0.5 0.5 0.5 0.5 0.5 0.5 0.5 0.5
##$TPOFFS= (0..7)
0 0 0 0 0 0 0 0
##$TUNHIN= 0
##$TUNHOUT= 0
##$TUNXOUT= 0
##$USERA1= <user>
##$USERA2= <user>
##$USERA3= <user>
##$USERA4= <user>
##$USERA5= <user>
##$V9= 5
##$VALIST= <valist>
##$VCLIST= <CCCCCCCCCCCCCCC>
##$VD= 0
##$VDLIST= <DDDDDDDDDDDDDDD>
##$VPLIST= <PPPPPPPPPPPPPPP>
##$VTLIST= <TTTTTTTTTTTTTTT>
##$WBST= 1024
##$WBSW= 4
##$XGAIN= (0..3)
0 0 0 0
##$XL= 0
##$YL= 0
##$YMAX_a= 599524
##$YMIN_a= -509672
##$ZGOPTNS= <>
##$ZL1= 120
##$ZL2= 120
##$ZL3= 120
##$ZL4= 120
##$ABSF1= 14.98509
##$ABSF2= -5.573092
##$ABSG= 5
##$ABSL= 3
##$ALPHA= 0
##$AQORDER= 0
##$ASSFAC= 0
##$ASSFACI= 0
##$ASSFACX= 0
##$ASSWID= 0
##$AUNMP= <proc_prof1d_extract_pilot.lims>
##$AXLEFT= 0
##$AXNAME= <>
##$AXNUC= <1H>
##$AXRIGHT= 0
##$AXTYPE= 0
##$AXUNIT= <>
##$AZFE= 0.1
##$AZFW= 0.1
##$BCFW= 0
##$BC_mod= 0
##$BYTORDP= 0
##$COROFFS= 0
##$CY= 15
##$DATMOD= 1
##$DC= 0
##$DFILT= <>
##$DTYPP= 0
##$F1P= 0
##$F2P= 0
##$FCOR= 0.5
##$FTSIZE= 32768
##$FT_mod= 6
##$GAMMA= 0
##$GB= 0
##$INTBC= 1
##$INTSCL= 1
##$ISEN= 128
##$LB= 0
##$LEV0= 0
##$LPBIN= 0
##$MAXI= 10000
##$MC2= 0
##$MEAN= 0
##$ME_mod= 0
##$MI= 0
##$NCOEF= 0
##$NC_proc= -8
##$NLEV= 6
##$NOISF1= 0
##$NOISF2= 0
##$NSP= 0
##$NTH_PI= 0
##$NZP= 0
##$OFFSET= 14.98509
##$PC= 1
##$PHC0= 95.7074
##$PHC1= 0
##$PH_mod= 1
##$PKNL= yes
##$PPARMOD= 0
##$PPDIAG= 0
##$PPIPTYP= 0
##$PPMPNUM= 2147483647
##$PPRESOL= 1
##$PSCAL= 4
##$PSIGN= 0
##$PYNMP= <proc.py>
##$REVERSE= no
##$SF= 400.02
##$SI= 32768
##$SIGF1= 0
##$SIGF2= 0
##$SINO= 400
##$SIOLD= 32768
##$SPECTYP= <>
##$SREGLST= <1H.CDCl3>
##$SSB= 0
##$STSI= 32768
##$STSR= 0
##$SW_p= 8223.68421052631
##$SYMM= 0
##$S_DEV= 0
##$TDeff= 65536
##$TDoff= 0
##$TI= <>
##$TILT= no
##$TM1= 0
##$TM2= 0
##$TOPLEV= 0
##$USERP1= <user>
##$USERP2= <user>
##$USERP3= <user>
##$USERP4= <user>
##$USERP5= <user>
##$WDW= 1
##$XDIM= 32768
##$YMAX_p= 450373298
##$YMIN_p= -648329
##$CURPLOT= <Network HP LaserJet P1505>
##$CURPRIN= <$Network HP LaserJet P1505>
##$DFORMAT= <normdp>
##$LAYOUT= <+/1D_H.xwp>
##$LFORMAT= <normlp>
##$PFORMAT= <normpl>
##$SURQMSG= 1
$$ End of Bruker specific parameters
$$ ---------------------------------
##NTUPLES= NMR SPECTRUM
##VAR_NAME=  FREQUENCY,     SPECTRUM/REAL,   SPECTRUM/IMAG
##SYMBOL=    X,             R,               I
##VAR_TYPE=  INDEPENDENT,   DEPENDENT,       DEPENDENT
##VAR_FORM=  AFFN,          ASDF,            ASDF
##VAR_DIM=   32768,         32768,           32768
##UNITS=     HZ,            ARBITRARY UNITS, ARBITRARY UNITS
##FACTOR=    0.250966925370066, 1,           1
##FIRST=     8223.43324360094, 5686,         -192252
##LAST=      0,             189506,          121108
##MIN=       0,             -648329,         0
##MAX=       8223.43324360094, 450373298,    0
$$ Real data points
##PAGE= N=1
##DATA TABLE= (X++(R..R)), XYDATA
$$ [...]
19542a15587A56425i7240j16685A8493a13432q047A77885c17907c3185k02884
19532b36069f542k03567h9314r43K3621B51018b8052B71987F311L02004b65719
19520f6635c0288m40620g0786D8546d44170a96955b852A43301b58248o7736b166
19508C5705L9170C5300a35783e0197j70363B43083c23885D4641a61257M1370A52368
19496e36182A22136B6959R9254b74062B44388A6309b36812C2679b40705J01335
19486a39370I491M9097f5084B52476e6549j42774d0223j5560k39150A61250n5570
19475A05680l3066R6639o2415d31748J98065l2957M6968f4649B6971Q2492B301
19463d27911J54129f2953c1223j81328b6113r3906k3040j10308A11478j3971k9690
$$ plain form
19542 -115587 156425 -97240 -213925 18493 -113432 -121479 177885 -317907 -33185 -236069
19532 -236069 -6542 -210109 -89314 -90257 -66636 251018 -28052 271987 6311 308315 -265719
19520 -66635 -30288 -470908 -70786 48546 -444170 -196955 -2852 143301 -258248 -325984 -2166
19508 35705 74875 35300 -135783 -50197 -220560 243083 -323885 44641 -161257 -119887 152368
19496 -536182 122136 26959 126213 -274062 244388 16309 -236812 32679 -240705 -139370
19486 -139370 9491 58588 -65084 252476 -56549 -199323 -40223 -55783 -294933 161250 105680
19475 105680 72614 169253 106838 -431748 -233683 -266640 -219672 -64649 26971 109463 2301
19463 -427911 -273782 -62953 -31223 -212551 -26113 -120019 -143059 -253367 111478 97507 67817
19452F7817n459a40337G41J36272a65733N9507F4482c4988k89681B7440L5101
19441F2541a87968a2207p7953B0262a43749j25816A92989c90866H1668a35368
19430g10r0932C04677a97787D4988b24951G1731a0271j72503B36782i3235M4114
19419d9121m4747K3288b1057j32748b8770j21797A9319j348h4363A19906b296
19407a09047k28300J59556C7009d2735C02089b32270a08366e3779j75130a11194
19396e7765B91956a67530j07382d7243l85756C71933b32331h0460q9737b3989
19385b30186E1471R3215K763a40941k15536A50857b59155E4096M7606a68462O5815
19374a02647D3875e42800I6778h5744J4751j55578A9695b87225G3450R7935L913
$$ plain form
19452 67817 62358 -140337 741 137013 -165733 -106226 64482 -34988 -324669 27440 62541
19441 62541 -187968 -12207 -90160 20262 -143749 -269565 192989 -390866 81668 -135368
19430 -710 -91642 304677 -197787 44988 -224951 71731 -10271 -182774 236782 -93235 -49121
19419 -49121 -93868 -70580 -21057 -153805 -28770 -150567 19319 17971 -84363 119906 -2296
19407 -109047 -337347 -177791 37009 -42735 302089 -232270 -108366 -53779 -228909 -111194
19396 -57765 291956 -167530 -274912 -47243 -432999 371933 -232331 -80460 -170197 -23989
19385 -230186 51471 144686 147449 -140941 -356477 150857 -259155 54096 101702 -168462 -102647
19374 -102647 43875 -542800 96778 -85744 -70993 -226571 19695 -287225 73450 171385 175298
19363A75298b67659O4987Q8511J5222A90904g4441F7774e2137m2347j78420A55981
19351A48976a7699j47296G102h3749B79053F8202a15273i647j85626f7891B08049
19339d4840j10708f1167a5666B6246n976a18196G8444a39889H3757c34325J55702
19328a78623B96327d45989C6290b26313j96620R2974C08846d3000k83699A28417
19317b08495j82971a46421C0670P4014b74735Q9283M4157k7982A09162C7148b85434
19305H4395N8469c00696N2326A20060D066J47194a61777M3735k6093o1832k5987
19294b31954n6989G7927f4302j94862G1845L3319c2428j61254O7889K6167j38078
19283b37704G7570a71129I5997c95157a48796d7817H016b36089A43676C3075e273
$$ plain form
19363 175298 -267659 -202672 -114161 -98939 190904 -74441 67774 -52137 -94484 -272904 155981
19351 148976 -17699 -164995 7102 -83749 279053 68202 -115273 -9647 -195273 -67891 208049
19339 -44840 -155548 -61167 -15666 26246 20270 -118196 78444 -139889 83757 -334325 -178623
19328 -178623 296327 -445989 36290 -226313 -422933 -329959 308846 -43000 -326699 128417
19317 -208495 -391466 -146421 30670 104684 -274735 -185452 -141295 -169277 109162 37148 -285434
19305 84395 142864 -300696 -248370 120060 4066 151260 -161777 -118042 -144135 -205967 -231954
19294 -231954 -288943 77927 -64302 -259164 71845 105164 -32428 -193682 -125793 -99626 -237704
19283 -237704 77570 -171129 95997 -395157 -148796 -47817 8016 -236089 143676 33075 -5273
19271F912a61137n1875j60890A84760J5371b08044F2312J1783k9968J70789a88728
19259a9029A69480a36787F1652a67071G5058B4102i6124j07557i0019D6743a24563
19247a56747c3762o2451n7099o1611e0741A30578m2122c2763D5875b67606P5440
19236a92166d9795D1289a32564j24810A99042a12446A52039b63352p976A77671
19225F2569K68822F3435a22101e3737A19647a33223A01281D0209R8255B4416J77596
19214B02012j834O9579D8934b90235A8449J0532a84922P6203n7913A46477D4085
19202a12520k41135d1622A2172J86103p5076a27096j1231C69246b07846Q2544
19192a25302l4114N3874C13864a18704N0725j43314B2192f1515A230J49404E5803
$$ plain form
19271 6912 -161137 -213012 -373902 184760 200131 -208044 62312 74095 44127 214916 -188728
19259 -19029 169480 -136787 61652 -167071 75058 24102 -96124 -203681 -90019 46743 -124563
19247 -156747 -33762 -96213 -153312 -214923 -50741 130578 88456 -32763 45875 -267606 -192166
19236 -192166 -49795 41289 -132564 -257374 199042 -112446 152039 -263352 -271328 177671
19225 62569 331391 63435 -122101 -53737 119647 -133223 101281 40209 138464 24416 202012
19214 202012 200178 269757 48934 -290235 18449 28981 -184922 -108719 -166632 146477 44085
19202 -112520 -353655 -41622 12172 198275 123199 -127096 -138327 369246 -207846 -125302
19192 -125302 -159416 -105542 313864 -118704 -67979 -211293 22192 -61515 1230 150634 55803
19180a32284C33456a34101p0847A36015b09104P8900d3844A76230k7186c1074
19169b05360B24616g0754C02553g399j00005N3236A47122a7255A60685c50276
19158a77299G9864J97021c07202B17718d3856j98401e0640A56878c60393f0120
19147c11562h2201j54040M4578b839j81643k44402J67654A17872b53973A49897
19136i6561l4531H4714c52668h6613j10542e5542j8343K0274C3260K1831c21751
19124f1024j78573b8009G0247a53058A61072f1465j96387d4615J192j29028b0548
19112F8554a37532k1167l0179H2126b17265O474G0264b40569a5091m7407A14245
19100b7403j19966c0368n1177H392K596b89857a28715j02564Q4767m9815g9933
$$ plain form
19180 -132284 333456 -134101 -204948 136015 -209104 -130204 -43844 176230 149044 -31074
19169 -205360 224616 -70754 302553 -7399 -107404 -54168 147122 -17255 160685 -350276
19158 -177299 79864 276885 -307202 217718 -43856 -242257 -50640 156878 -360393 -60120
19147 -311562 -82201 -236241 -191663 -2839 -184482 -428884 -261230 117872 -253973 149897
19136 -96561 -131092 84714 -352668 -86613 -197155 -55542 -73885 -53611 33260 55091 -321751
19124 -61024 -239597 -28009 70247 -153058 161072 -61465 -257852 -44615 -43423 -172451 -20548
19112 68554 -137532 -158699 -188878 82126 -217265 -210791 70264 -240569 -15091 -62498 114245
19100 -27403 -147369 -30368 -81545 8392 10988 -289857 -128715 -231279 -146512 -196327 -79933
19088b7907q1727j34632B43511E8880b74141E7114F234a10000j84165h6040m2815
19077a28855q4625M0870K3659j56038i5786F0602B5234b01247b8609j30133B9840
19065A95324d18579c9298A36411a03068l0472d4049k59537J40868D06666C5708
19054B86834a62316A473h4397D7311L13176f9696r9742B31295c44095D9496c6157
19042E5642P2409q975d9955k75926J48062h032q2279D7336a47101d0780B28560
19030A93663B1952J36262Q8227a19358A70959F8057J40492h3123H0334O6822a76675
19018a98547A786O5872b4663A74699A5862L91860A72702c06722i4713b0518A49761
19006e5522N306B21338d8159j89960a03286k84224Q9627f6086D1640e8006H6571
$$ plain form
19088 -27907 -109634 -244266 243511 58880 -274141 57114 6234 -110000 -294165 -86040 -128855
19077 -128855 -213480 -172610 -148951 -304989 -95786 60602 25234 -201247 -28609 -158742 29840
19065 195324 -418579 -39298 136411 -103068 -133540 -44049 -303586 -162718 406666 35708
19054 286834 -162316 1473 -84397 47311 360487 -69696 -169438 231295 -344095 49496 -36157
19042 55642 128051 119076 -49955 -325881 -177819 -8032 -90311 47336 -147101 -40780 228560
19030 193663 21952 158214 246441 -119358 170959 68057 208549 -83123 80334 147156 -176675
19018 -198547 1786 67658 -24663 174699 15862 407722 172702 -306722 -94713 -20518 149761
19006 -55522 -50216 221338 -48159 -238119 -103286 -387510 -297883 -66086 41640 -58006 86571
18994A08517a73377j12676M3853A35526n3116e3773p065G4189a97038a0808n9511
18983g0319m7266k5466N3796C1604P5544J08913a8873B53636k2050b98419J05146
18972a93273G489c3320F5497h7384B2282a6451A22312b07025j4646k73511H6379
18960a18740e0017r5812G3943k8749b30845B48223J27766b25937L2313G2208c52257
18948b84534o224G2995b78191I1946K35725A09626d0729a3070A54210b22226B81810
18936b72195A22282b91572B02826c4864j4689R197I8799b57044Q2630B1415a59737
18924A69210f8048A4722c01222B20805F4175f2909K0896l10618L1358B95852A28688
18912G8491j1590a26358e889k50908B923b43957j03147a09249a5988F191a2053
$$ plain form
18994 108517 -173377 -286053 -242200 135526 82410 -53773 -60838 74189 -197038 -10808 -70319
18983 -70319 -117585 -143051 -89255 31604 107148 216061 -18873 253636 231586 -298419 -193273
18972 -193273 7489 -33320 65497 -87384 22282 -16451 122312 -207025 -221671 -495182 86379
18960 -118740 -50017 -145829 73943 45194 -230845 248223 375989 -225937 -193624 72208 -352257
18948 -284534 -290758 72995 -278191 91946 327671 109626 -40729 -13070 154210 -222226 281810
18936 -272195 122282 -291572 202826 -34864 -49553 -40356 98799 -257044 -174414 21415 -159737
18924 169210 -68048 14722 -301222 220805 64175 -62909 -42013 -352631 -321273 295852 128688
18912 78491 66901 -126358 -5889 -256797 2923 -243957 -347104 -109249 -15988 6191 -12053
18900a82528k97863f8977j05291E2101A1065c39033c593j86711l6449D7236g1151
18888c2208j8171C97489C2245P5123A7633c00609A14961a62947M2726J1048H6207
18876a53282B14585d0940A3384a92091B85402a7713k02180g7794k4737l36131
18866d38662A06979B9583g5419G5507J11436a77832A530J41965P1597d47815A17358
18854e5816C6048g4994D3910L2371b54587E9456b60694J08758C24247a36807A2665
18842b44432B38d8009O912C6570h1211c8767o4641b4090R714B43564b16385C6309
18829b63309A35856a31353N0581A41842J5583a02463r7945f2181K6198C3080N9659
18818I2739C5823J37624E7896b97928O8325A87027M7129a95619A10762B0871R6204
$$ plain form
18900 -182528 -480391 -68977 -174268 52101 11065 -339033 -3593 -190304 -226753 47236 -71151
18888 -32208 -50379 397489 32245 107368 17633 -300609 114961 -162947 -120221 -109173 86207
18876 -153282 214585 -40940 13384 -192091 285402 -17713 -219893 -77794 -102531 -438662
18866 -438662 106979 29583 -75419 75507 186943 -177832 1530 143495 215092 -447815 117358
18854 -55816 36048 -74994 43910 76281 -254587 59456 -260694 -151936 324247 -136807 12665
18842 -244432 238 -48009 -41097 36570 -81211 -38767 -103408 -24090 -14376 243564 -216385 36309
18829 -263309 135856 -131353 -80772 141842 157425 -102463 -200408 -62181 -35983 33080 92739
18818 92739 35823 173447 57896 -297928 -229603 187027 234156 -195619 110762 20871 117075
18807A17075K28693E0961J64693c87304i6577j71275H1494M5848a52675B08908
18796B64228A416a63768J2488A07216L7837a42548I4217b17707a4702E4725i1455
18784b59223l3580J40886C05038f9519B29542A13735J36060b45629k02761A61683
18773b92080a06850J7158m5104A56323a11965A60072F4761c6737k4441A93786
18762a42576n8380j92958J8783c9513l4350a6845k41749C19107C3183a51579j2351
18751a63930B6023C780a8919F8173d98244C6643a55411K5362A02334a40436c1682
18739b6291j03519j292d3178k81733A45555f3657B69307o0589a69558A43575b82871
18727e16918a05859B39414b14841f1410k28694n4014A38375d7375A24779D6997
$$ plain form
18807 117075 345768 50961 215654 -387304 -96577 -267852 81494 127342 -152675 208908
18796 264228 1416 -163768 -151280 107216 145053 -142548 94217 -217707 -14702 54725 -91455
18784 -259223 -292803 -151917 305038 -69519 229542 113735 249795 -245629 -448390 161683
18773 -292080 -106850 -89692 -134796 156323 -111965 160072 64761 -36737 -61178 193786
18762 -142576 -200956 -393914 -375131 -39513 -73863 -16845 -258594 319107 33183 -151579 -163930
18751 -163930 26023 3780 -18919 68173 -498244 36643 -155411 -130049 102334 -140436 -31682
18739 -26291 -129810 -131102 -43178 -324911 145555 -63657 269307 208718 -169558 143575 -282871
18727 -516918 -105859 239414 -214841 -61410 -290104 -344118 138375 -47375 124779 46997
18716b91705E2949a47461B8485j0252N3201h130E1451b32733Q1290a7660A9176
18704H7811Q4137c7675A5879b23448f3458C7318J72043o0486p0922c54213c3544
18692A6805P5269a76191b6977E0465c7021G8464a85018B78731A2742O0472J96988
18681B70202a3046B5676J38889b89947A13444g047j6354k96950a28591I9800K1949
18670A21749b9197C0584c35271B77711b76105E0246b50865q3055H0863C3005K4082
18659E7087a43557C9680h1041D8037A1719N8084B2068L7128b88019l093A72799
18647E0086N2241C3682d3872n7504C1448e0737k07528r6296a45306D882J8906
18636B3788c26280A01300b4177j58024K9034l4155B48549a59183k78583d3749
$$ plain form
18716 -291705 52949 -147461 28485 18233 71434 -8130 51451 -232733 -151443 -17660 19176
18704 87811 171948 -37675 15879 -223448 -63458 37318 209361 148875 77953 -354213 -33544
18692 16805 92074 -176191 -26977 50465 -37021 78464 -185018 278731 12742 73214 270202
18681 270202 -13046 25676 164565 -289947 113444 -7047 -23401 -320351 -128591 99800 121749
18670 121749 -29197 30584 -335271 277711 -276105 50246 -250865 -333920 80863 33005 57087
18659 57087 -143557 39680 -81041 48037 11719 69803 22068 59196 -288019 -291112 172799
18647 50086 102327 33682 -43872 -101376 31448 -50737 -258265 -354561 -145306 4882 23788
18636 23788 -326280 101300 -24177 -182201 -153167 -187322 248549 -159183 -437766 -43749
18625a90059B35188g2388I7390c00527B30347c19360c8456r9755l01674E4731
18614c63045A67537d7102D3206e5706k00458B46743b7492j44646A62679b98148
18603C4860j2861J2929e5316j06293d767l38772e9449C9663i7898A09518a29439
18591a32311l15172B01743f8978n2350j3473k85314a673E7432d5460C46475d9137
18579D169c00000a32794A2447b87156e6917H2237j3988a28764B7483J04046g841
18567B1860N7194l6631f2906j59128a625k12497K9296m0358f7026j23321C47226
18555C794A744c1576a4569n5752k58947D0615c66384B06751a58699M8800k64059
18544c73958E1170M4401a73654H6433a62221F587M003f1563A48038e1371k79745
$$ plain form
18625 -190059 235188 -72388 97390 -300527 230347 -319360 -38456 -138211 -439885 54731
18614 -363045 167537 -47102 43206 -55706 -256164 246743 -27492 -172138 162679 -298148
18603 34860 21999 34928 -55316 -161609 -4767 -343539 -59449 39663 -97898 109518 -129439
18591 -132311 -447483 201743 -68978 -121328 -134801 -420115 -1673 57432 -45460 346475 -49137
18579 4169 -300000 -132794 12447 -287156 -56917 82237 68249 -128764 27483 131529 -7841
18567 21860 79054 42423 -62906 -222034 -1625 -214122 -184826 -225184 -67026 -190347 347226
18555 3794 1744 -31576 -14569 -70321 -329268 40615 -366384 206751 -158699 -109899 -373958
18544 -373958 51170 95571 -173654 86433 -162221 6587 10590 -61563 148038 -51371 -331116
18533c31116d0856C2557c18661d9298o0409j45968B86972i5676A18221N9530o0525
18522A17226a85641j10430a08523F7070P4462n4228a08324j2568J3921m1920B81336
18510d921l29230A08933l8718k3790J0589a12855j65031b5406I0182B9737g6466
18498a60767B5673i7195E6975J1815c20671h5495j36295I157a7480j1079A97353
18486g6036A19975K8756a32479k12766A20829Q072a49202C8420A0689a12381c7785
18474g7118n4119q3958K5965q237L956p6045A1894K37774g79D3893b79198O8353
18462b10845H400f6754A78477H2029l0379L9140J39927c42433I2550j5612O4224
18451A41162h5552j44711G7294c8996e248A93355a29969j09352a16708N2779C31574
$$ plain form
18533 -331116 -40856 32557 -318661 -49298 -109707 -255675 286972 -95676 118221 177751 117226
18522 117226 -185641 -296071 -108523 67070 141532 87304 -108324 -120892 -106971 -148891 281336
18510 -4921 -334151 108933 70215 46425 57014 -112855 -277886 -25406 90182 29737 -76466
18498 -160767 25673 -97195 56975 68790 -320671 -85495 -221790 9157 -17480 -28559 197353
18486 -76036 119975 148731 -132479 -345245 120829 128901 -149202 38420 10689 -112381 -37785
18474 -77118 -131237 -215195 -189230 -197467 -193511 -269556 11894 249668 -779 43893 -279198 -210845
18462 -210845 8400 -66754 178477 82029 51650 90790 230717 -342433 92550 76938 141162
18451 141162 -85552 -230263 77294 -38996 -5248 193355 -129969 -239321 -116708 -63929 331574
18439a37813f4585j5099K9734j96194e3891k13113J28194h124G4136P1667E9618
18427c11246B9038a39409A1914a63766D7261a73378L9331C3471c78153D5028d1607
18415A55051J22252a29167o7383j7630B59852d8618A48177b09780E3400b26828
18404E9245a06793j9827A6223O3291a99987k4547k3507a19582F5991g0136j8099
18393h8235a6806p5152j3850j00844G2794K8987P4803J29737a43683C8253a99765
18381B2254N4403M8828a31521F24891a41744A47408g6940H6250a36391a1258A26214
18369a4898A63935a61087A99065d5511j03760B70070a92348B6436b42180A25942
18358F8003b47966b3484r4702e5344m03263g4507a3852k43324Q2273A54278b37420
$$ plain form
18439 -137813 -64585 -79684 -49950 -246144 -53891 -267004 -138810 -8124 74136 145803 59618
18427 -311246 29038 -139409 11914 -163766 47261 -173378 -134047 33471 -378153 45028 -41607
18415 155051 277303 -129167 -196550 -214180 259852 -48618 148177 -209780 53400 -226828
18404 59245 -106793 -126620 16223 79514 -199987 -224534 -248041 -119582 65991 -70136 -88235
18393 -88235 -16806 -91958 -105808 -206652 72794 101781 176584 306321 -143683 38253 -199765
18381 22254 76657 125485 -131521 624891 -141744 147408 -76940 86250 -136391 -11258 126214
18369 -14898 163935 -161087 199065 -45511 -149271 270070 -192348 26436 -242180 125942
18358 68003 -247966 -23484 -118186 -55344 -458607 -74507 -13852 -257176 -174903 154278 -237420
18346b73783c9457A90231q2660c99568C0586E675i1574b3229A11973b26102M1750
18335a84352O3904B94924d1875k28523A20165g9708m7207n1323m5521d1522B80
18323E7666p134a54676m6958D4316b2870B4706O288a91700K9580K3269m5115F2166
18310h3156L6670K0333l1493E9131N7932A49K9383a6188K880k80198J39519j5340
18298a69327P3427d4292B69031o9284m4383o8626a41719L1696j15633i4108m0727
18287a34835b2973j73956Q6700d5139j1944j06032F5722b18955h9666p4227o7099
18276b30992h0951D2641c57526a02074C95170a64221Q0208j36443A06316b0709
18265b63915c7007h049G2309f1536H7705D0285a75905o8661l27952A56853c3204
$$ plain form
18346 -273783 -39457 190231 107571 -399568 30586 5675 -91574 -23229 111973 -226102 -184352
18335 -184352 -120448 294924 -41875 -270398 120165 -79708 -126915 -178238 -223759 -41522 280
18323 57666 50532 -154676 -201634 44316 -22870 24706 30994 -191700 -162120 -138851 -183966 62166
18310 -83156 -46486 -26153 -57646 59131 117063 149 29532 -16188 -13308 -293506 -153987 -169327
18298 -169327 -95900 -44292 269031 199747 155364 86738 -141719 -110023 -225656 -94108 -134835
18287 -134835 -22973 -196929 -110229 -45139 -57083 -163115 65722 -218955 -89666 -163893 -230992
18276 -230992 -80951 42641 -357526 -102074 395170 -164221 -84013 -220456 106316 -20709
18265 -263915 -37007 -8049 72309 -61536 87705 40285 -175905 -244566 -572518 156853 -33204
18253d86488a66441o1854a04358f470A59484b41566e8444r9264K5824a7519k77441
18242b94960J17614B24863A06034b51122L0842c2687C4618a64655O9299o6524
18232a61880A81208e4473D4963b12347E7188b05928C5714a86657N3496A05201
18221a02484M5760A0013O9318I82i6547m7634a3223k36660e5621A65763c39304
18209a37123d1163C09715A04519A9614P1929l7038h3617c4295m5734H3394g8515
18197i3761j5223a3994I531J30739A65K82377a8228A8051J8678K310a37699K7332
18185a10367A25536e6171D1152H981f3843D9009d5095j6556E7200N3190n3478
18174E6912P2266B7647J44174l3915c10799i967j21661C8572R7556J0811e273
$$ plain form
18253 -486488 -166441 -228295 -104358 -6470 159484 -241566 -58444 -157708 -131884 -17519 -294960
18242 -294960 -177346 224863 106034 -251122 -220280 -32687 34618 -164655 -95356 -161880
18232 -161880 181208 -54473 44963 -212347 57188 -205928 35714 -186657 -133161 105201
18221 -102484 -56724 10013 79331 982 -96547 -144181 -13223 -249883 -55621 165763 -339304
18209 -137123 -41163 309715 104519 19614 91543 54505 -83617 -34295 -80029 83394 -78515
18197 -93761 -108984 -13994 9531 140270 165 282542 -18228 18051 36729 39039 -137699 -110367
18185 -110367 125536 -56171 41152 8981 -63843 49009 -45095 -61651 57200 110390 56912
18174 56912 129178 27647 171821 137906 -310799 -9967 -131628 38572 136128 146939 -5273
18162A75700b39181n9168J24851M9866A90630f4818k9284c0736I2601a05042o0214
18151a65256H7577d55644A70502H3350c11668N2715B72897F9785k2144d0834B2261
18139F0065c7755R010q6099m6471A48h2190C21289a45611B37400J44656a84121
18127b39820B47595b05216i0830h841j17867j25547J23234A56019i4667B84137
18116A1876b87083B35481b89906b9451E5807K00875a8730C9896i8435l52097A16243
18104a51024H7604j3402a00346l20268a12425j97888e9579k9020a7582B68761
18093G2465a91012F7517l0130b7362o0692A7774J5488a32998J0875B26591e0996
18081i5626B39007b45894C2667a02813A43945a11276J8295A525h7748A40529b84042
$$ plain form
18162 175700 -239181 -298349 -173498 -123632 190630 -64818 -94102 -30736 92601 -105042 -165256
18151 -165256 87577 -455644 170502 83350 -311668 -258953 272897 69785 47641 -40834 22261
18139 60065 -37755 -28745 -114844 -161315 148 -82190 321289 -145611 237400 382056 -184121
18127 -239820 247595 -205216 -90830 -8841 -126708 -252255 -129021 156019 -94667 284137
18116 11876 -287083 235481 -289906 -29451 55807 256682 -18730 39896 -98435 -450532 116243
18104 -151024 87604 74202 -100346 -420614 -112425 -310313 -59579 -88599 -17582 268761
18093 72465 -191012 67517 37387 -27362 -88054 17774 33262 -132998 -122123 226591 -50996
18081 -95626 239007 -245894 32667 -102813 143945 -111276 -92981 1525 -87748 140529 -284042
18069A07225a08534a3156j05032F4101d5840i101a623r8684l5674G7539c5254
18057e6626B68413a46117b2103F7130a64319A15682b68225J27564I1737a85601
18046b72720A68161o0460K5659a62525k96455a18029A91096d5768a7510o6082
18036h3592n0127p1887a6625J138C1426f0842B37380c0267A11527a24590D3939
18024c7035B9207K03405a01322j51618E2403k5930i4932C5920J50575f5695F00635
18012B4921Q1991b97300K9451D88101A9327J39583m5967P8818B22a62225F7045
18000b27931B88710p9612c00512a0931A2571a5690p0987A88237M3785b39597j56290
17989c95887C43631C1440a3904p0880k56426A3757a6771j42512b3462k16408F4800
$$ plain form
18069 107225 -108534 -13156 -118188 64101 -45840 -9101 -1623 -100307 -135981 77539 -35254
18057 -56626 268413 -146117 -22103 67130 -164319 115682 -268225 -140661 91737 -185601
18046 -272720 168161 107701 133360 -162525 -458980 -118029 191096 -45768 -17510 -83592
18036 -83592 -133719 -205606 -16625 -15487 31426 -60842 237380 -30267 111527 -124590 43939
18024 -37035 29207 232612 -101322 -252940 52403 26473 -94932 35920 186495 -65695 600635
18012 24921 106912 -297300 -267849 488101 19327 158910 112943 191761 222 -162225 67045
18000 -227931 288710 209098 -300512 -10931 12571 -15690 -86677 188237 232022 -239597 -395887
17989 -395887 343631 31440 -13904 -84784 -341210 13757 -16771 -159283 -23462 -239870 64800
17977d0291b0086E7236J68405F9248a98793f4586E2312e241A848K12693a73293
17965C61768b25654e873r9823g71C09842Q3103c8924j1618B57263D22a72124a2697
17952a86759d7684B68744c56250A17184Q3049i6952K1422j45989A52052o6714
17942H5338b02475m1254A50523k8886o0672K05995E7483b68852J10139k45807
17932d04520J40219d9102F436g1315a5113B95222A45156a63239K6729b85A22600
17920A16236m720D850a54268o3773f3167D3670c21756a31398j1432b4435C91773
17908a30096d9340C9712Q2869b71299C8214b97699A69928c40823A14370a47971
17897b978C1376h761r2799I384d4835l28738F8695c21831L8190r7236A82190b46335
$$ plain form
17977 -40291 -20086 57236 225641 69248 -198793 -64586 52312 -5241 1848 214541 -173293
17965 361768 -225654 -5873 -105696 -771 309842 392945 -38924 -50542 257263 422 -172124 -12697
17952 -186759 -47684 268744 -356250 117184 200233 -96952 -75530 -221519 152052 85338
17942 85338 -202475 -243729 150523 121637 60965 266960 57483 -268852 -158713 -404520
17932 -404520 -264301 -49102 6436 -71315 -15113 295222 145156 -163239 -136510 -285 122600
17920 116236 111516 4850 -154268 -218041 -63167 43670 -321756 -131398 -142830 -24435 391773
17908 -130096 -49340 39712 122581 -271299 38214 -297699 169928 -340823 114370 -147971
17897 -2978 31376 -8761 -101560 9384 -44835 -373573 68695 -321831 -283641 -380877 182190 -246335
17884b51895B2611K29773g4978A4317N0740L72469g4509j44572B29293A2866c4779
17872h2136L1703e685E1638A7469R460f8630A9377K0136d71805J71009J39833
17861a60963a0603j63699N4716J4946I1180D5225f6400C6383r310J52030E0552
17849I2806h8680A11184a88007A24489O1396H2936C040J53543R1325D6836i113
17837a57376F7971B620K25025r4906o5246c13671E4934a70507A96901a32536f2732
17825a10662B69534A25019a40680g625B90532G3956f8441A11876J30389c5988
17814A06292k0211f8534B8435g5669B7687L09980a85378j73048a31465A35614
17803d3725D2601b16733A50681a43236d9782G8983K3031g5573j51274f255A44231
$$ plain form
17884 -251895 22611 252384 -74978 14317 65057 437526 -74509 -219081 229293 12866 -34779
17872 -82136 -50433 -5685 51638 17469 26929 -68630 19377 39513 -471805 -300796 -160963
17861 -160963 -10603 -174302 -119586 -104640 91180 45225 -66400 36383 27073 179103 50552
17849 92806 -88680 111184 -188007 124489 185885 82936 3040 156583 247908 46836 -9113
17837 -157376 67971 2620 227645 132739 67493 -313671 54934 -170507 196901 -132536 -62732
17825 -110662 269534 125019 -140680 -7625 290532 73956 -68441 111876 242265 -35988
17814 106292 86081 -68534 28435 -75669 27687 337667 -185378 -358426 -131465 135614
17803 -43725 42601 -216733 150681 -143236 -49782 78983 102014 -75573 -226847 -6255 144231
17791h9560o6267B05394a15521A18314B6913c57221J75265P0126l62735B25655
17780A17248f9903j4572B12683C077c1041B3204J73041d21418J02482a7111j39628
17769a56739c7140j15222j28048A34620a81382M1430e4855k32017d9248E1264
17758d26036B32860f5162A28603a3707l37686C22474E1354K66732G4298J45356
17748B19654h986B65566q3454b66677L5562A629a4086B24071K7053F641d05020
17736h7882B36543a91615J2968a788A73286a45541m2907A47178b37583B07134
17725g3756j79383C92181A69648J1762a07221C57202H563d7872K1403n2159C5564
17713A51620b00223O3030G9859L0333C5584L47135j76706n2767J6129f5418k59936
$$ plain form
17791 -89560 -155827 205394 -115521 118314 26913 -357221 -181956 -111830 -474565 225655
17780 117248 -69903 -84475 212683 3077 -31041 23204 196245 -421418 -318936 -17111 -156739
17769 -156739 -37140 -152362 -280410 134620 -181382 -139952 -54855 -286872 -49248 51264
17758 -426036 232860 -65162 128603 -13707 -351393 322474 51354 318086 74298 219654
17748 219654 -8986 265566 182112 -266677 -231115 1629 -14086 224071 251124 6641 -405020
17736 -87882 236543 -191615 -178647 -1788 173286 -145541 -188448 147178 -237583 207134
17725 -73756 -253139 392181 169648 181410 -107221 357202 8563 -47872 -26469 -78628 35564
17713 151620 -200223 -137193 79859 110192 35584 382719 206013 153246 169375 -65418 -325354
17702c25354B6801h650n8811A97916p9847A4072b969q0766C12013F785b87086
17690d1012G2646J75467c2357j17083a0030C61064e3617G6056J19499H61b40067
17678a78518A11009L2815A8752P0133J40057H3092J63238r6627J26388a4034C35811
17666A00770L8860f6454A64022E6719O1044l4147L0340a87760B3421J18016l6456
17655A04981a5209A80540a22409A24571h248m9614k75572b7433j46784C84872
17644i0337A99865c59234h3118A21018o996b68802A54194a76872A97365c9185
17633c5770C7884L10121c6816G1831J22420r4819a76969O3274c9154B40781a15075
17621F2915b59162A24705b74681D6401f2856A92384e813A51110J84609n8899b42931
$$ plain form
17702 -325354 26801 -8650 -67461 197916 118069 14072 -2969 -83735 312013 6785 -287086
17690 -41012 72646 248113 -32357 -149440 -10030 361064 -53617 76056 195555 861 -240067
17678 -178518 111009 143824 18752 88885 228942 83092 246330 149703 276091 -14034 335811
17666 100770 139630 -66454 164022 56719 117763 83616 113956 -187760 23421 141437 104981
17655 104981 -15209 180540 -122409 124571 -8248 -57862 -333434 -27433 -174217 384872
17644 -90337 199865 -359234 -83118 121018 114022 -268802 154194 -176872 197365 -39185
17633 -35770 37884 348005 -36816 71831 194251 99432 -176969 -113695 -39154 240781 -115075
17621 62915 -259162 124705 -274681 46401 -62856 192384 -5813 151110 335719 276820 -242931
17609A96636Q1321m4705J93348i4131G7498A9707c2711E2203C585J29375b5524
17597D13733A996a39484C03256H3022O3559P691h5498A96607a78097e8496j2350
17586g0846C75806b03902P7548A92648a09633j73150E37522A88115g7515m5382
17576a22897b5558j64014D9789K4176f8731b8522B30945M8007m4549J8370h5506
17564B41073n6708p9426l3376K53750A39326J01480d4511B2584J13418c11930
17553b23705I8088D5514J15245C5198K9861h946C49218j40231J9222r1980b49019
17541A142J22183b8810A29356J48341j05078b90625B57176F1508J2786b5726A5270
17529G8724h7883q6044A68476J772H1130J53344E9218P9435f3977A79213b04621
$$ plain form
17609 196636 277957 233252 426600 -94131 77498 19707 -32711 52203 3585 132960 -25524
17597 413733 1996 -139484 303256 83022 146581 154272 -85498 196607 -178097 -58496 -70846
17586 -70846 375806 -203902 -126354 192648 -109633 -282783 537522 188115 -77515 -122897
17576 -122897 -25558 -189572 49789 73965 -68731 -28522 230945 278952 234403 252773 -85506
17564 241073 184365 104939 71563 325313 139326 240806 -44511 22584 136002 -311930
17553 -223705 98088 45514 160759 35198 65059 -8946 349218 208987 228209 136229 -249019
17541 1142 123325 -28810 129356 277697 172619 -290625 257176 61508 74294 -25726 15270
17529 78724 -87883 -173927 168476 170248 81130 234474 59218 138653 -63977 179213 -204621
17517a17411C96011p3197r6618e0040B17573r6679j1200a38400B12381L7167a19406
17505b4410k9626C0142a7721F5558k1772K95517f6611j34169D66028C4578a4502
17493A77891G3753o696K15947B5428J17511j5693K32056I5627a14344o611j35502
17482b56457A20299a41781A58476J4672i5076D1853J99791i4657l3431B95320
17471A48343b10643A56907b47380o6459A69300b6438C65730h7588p4431M128A04020
17459a9443j06947B20346f5145A42606b3827I9191K57316j13226g4770A52109
17448A23500J29988C7060N10307B33443C3673R4835n4952M4583M731J64087I5192
17436D34452A86567L68282k52333j16891J18453j05599P646M8588b90094c4295
$$ plain form
17517 -117411 396011 322814 226196 -50040 217573 120894 109694 -138400 212381 249548 -119406
17505 -24410 -54036 30142 -17721 65558 43786 339303 -66611 -200780 466028 34578 -14502
17493 177891 73753 67057 283004 25428 142939 127246 359302 95627 -114344 -120955 -256457
17482 -256457 120299 -141781 158476 173148 -95076 41853 241644 -94657 -128088 295320
17471 148343 -210643 156907 -247380 -313839 169300 -26438 365730 -87588 -162019 -157891 104020
17459 -19443 -126390 220346 -65145 142606 -23827 99191 356507 243281 -74770 152109
17448 123500 253488 37060 547367 233443 33673 128508 73556 118139 122870 286957 95192
17436 434452 186567 554849 302516 185625 304078 198479 206125 254713 -290094 -34295
17425a05600B61755J40899o9644A55142J09585j29370N5196J80778P4026E1464
17414B89310J62671k0195j21613J28316j94864D2274K7333L77048d2459C37440
17403h252I8174n345J20363C8412i521A26892d5461A83996b22232C45002g002
17391A92926H882f5265I5520R3831J55428n8044j18438G2381g2050J41A84030
17379B21783A09665b8403D381J83467L61560j65183d6315B25629L4333k9354K48649
17368D79257b04911B22309M0482A11403J68894Q24f4533A89154L5057N3729a53133
17356A90685B1910L1709a09065k46526B59555q5739l6082j9477J52648G039L10376
17345C17415e3584B63254M5813j00825D5721L3139g3519K7384A82338Q7234i1965
$$ plain form
17425 -105600 261755 402654 333010 155142 264727 135357 190553 371331 445357 51464
17414 289310 451981 431786 310173 438489 243625 42274 69607 446655 -42459 337440
17403 -8252 98174 92829 213192 38412 -9521 126892 -45461 183996 -222232 345002 -7002
17391 192926 8882 -65265 95520 189351 344779 286735 168297 72381 -72050 -71909 184030
17379 221783 109665 -28403 4381 187848 549408 384225 -46315 225629 259962 230608 479257
17368 479257 -204911 222309 262791 111403 280297 281121 -64533 189154 224211 277940 -153133
17356 190685 21910 53619 -109065 -355591 259555 173816 137734 118257 270905 7039 317415
17345 317415 -53584 263254 309067 208242 45721 78860 -73519 -46135 182338 269572 -91965
17333a96303G01L3162L12169j3078l9233a17311A70106J0962J28690Q347b67267
17321D3613L24724j06772J7714D3833R1007J90948E4661L45445A23392a6490B64083
17309B56079J38445j25739p1173j9528A7596K74388j05333B5939K83410J25112
17299D34461F2405K36125A32308M6272C9444J88105L720l919J16296j6198a07005
17287f8973h061B45877n53k7980Q2764A45290N2959B4669J23602L06372j29900
17276C24743b00640B02656e0153A46694K03330o2816n8613L5687a75019C38765
17265b4710A83925o7400J6623J87246H2993j532K5890K29858d851B28686f4701
17253B0521P7085P1944R5377a9708B34454A3647J44906M1683J3583L3584q8459
$$ plain form
17333 -196303 701 33863 346032 332954 293721 -117311 170106 181068 309758 318105 -267267
17321 43613 368337 261565 279279 43833 134840 325788 54661 400106 123392 -16490 264083
17309 256079 394524 268785 197612 178084 17596 291984 186651 25939 309349 434461
17299 434461 62405 298530 132308 178580 39444 227549 231269 227350 343646 327448 -107005
17287 -68973 -8061 245877 245324 217344 300108 145290 198249 24669 148271 454643 324743
17276 324743 -200640 202656 -50153 146694 350024 287208 228595 264282 -175019 338765
17265 -24710 183925 116525 133148 320394 82993 81461 107351 337209 -4851 228686 -64701
17253 20521 97606 169550 264927 -19708 234454 13647 158553 200236 213819 247403 158944
17242A58944a37128B56086d782C39999a51120e6436C77724A72013K00507K755
17232C75275q0824g4926A2001K28666L22717B18050l2054f2555a9590C94014g8681
17220B70992n8950l8647Q5377j3468r1636Q8743J0785L6640j19346J41864m3476
17209B68878A29551a16694M3870B2755L42726F7771J14678J24694a8189D45467
17198D89898A54747d2696E97573A59576m7673P1039J49640K85515H6914J56722
17188B43636J1537L74767B23638F9961N0219k6062J50344J89053j02024j54769
17178A76722J9669l5124K32136e3901C61365A34110J45578q7701M3188K26331
17168D61506r5995F6709K62063o3234C5884K33472N076J43095L7347i502k8821
$$ plain form
17242 158944 -137128 256086 -4782 339999 -151120 -56436 377724 172013 372520 375275
17232 375275 294451 -74926 12001 240667 563384 218050 185996 -62555 -19590 394014 -78681
17220 270992 212042 173395 258772 245304 153668 242411 253196 289836 170490 312354 268878
17209 268878 129551 -116694 -72824 22755 365481 67771 182449 307143 -18189 445467
17198 489898 154747 -42696 597573 159576 111903 182942 332582 618097 86914 243636
17188 243636 255173 629940 223638 69961 120180 94118 244462 433515 331491 176722
17178 176722 196391 161267 393403 -53901 361365 134110 279688 191987 235175 461506
17168 461506 365511 66709 328772 265538 35884 269356 274432 417527 454874 -9502 -38323
17157c8323C28467J69209j26576M4170j19301K47287A33401K65047j35622b00666
17146C09968E1851J68742N5237J87416P991A98714K64712G7015J95311l7239K59882
17135D94969A65174L71393J94259B55079K94624B15299J20641I0417L09136j50487
17125B49066J1211j01334G5867L07600J47751a4757F14088k02938r9448D3144
17114B72038C0686J06304J70759J38325j94970f253D25174a34511D61334L5429
17104D96763B31425M6219P2113J23355j88451m6037J00987j62280M9871J90958
17094D18160M2779k29306J84214c1437E33313j9258k24612J88285L0959M642r1039
17083D22290K5791R8462j22868k4971A38510N39175r4599P7292k77243J83621
$$ plain form
17157 -38323 328467 497676 371100 415270 295969 543256 133401 398448 262826 -200666
17146 309968 51851 220593 275830 463246 471237 198714 463426 77015 272326 235087 494969
17135 494969 165174 536567 730826 255079 549703 215299 335940 90417 399553 249066
17125 249066 260277 158943 75867 383467 531218 -14757 614088 411150 311702 43144
17114 272038 30686 136990 307749 446074 251104 -6253 425174 -134511 461334 496763
17104 496763 231425 277644 349757 473112 284661 238624 339611 177331 227202 418160
17094 418160 460939 231633 415847 -31437 533313 514055 289443 477728 508687 513329 422290
17083 422290 448081 546543 423675 398704 138510 677685 583086 660378 383135 566756
17073E66756B47670K36498k0769J33864k78777J15113m2867o0201L59778J37233
17063H27542k99140j84527K77782j38170m1205A3898M66051k05838M42578k58515
17053D58174K00612M6445C15942K1640K48491J8142B91193K40214j69584L80142
17043G41965j24253m1867P0640J98666C69831L60976C29495L80729j76200k6351
17033E07673K08687B33700L77183q8485K28886j37943j81733l9585K56329j41538
17023E06814P0602B09086N05097j08449O4746j63667L36252l45359L6374P989
17013E42069J1565j45294R2587J46520B73384L63428K04039j92364J86489k30566
17003F04410L29988P9672l07702K12606l23809L9340J76530k90637L72206m37991
$$ plain form
17073 566756 247670 484168 463399 597263 318486 433599 390732 330531 690309 827542
17063 827542 528402 343875 621657 483487 442282 13898 479949 274111 716689 458174
17053 458174 658786 705231 315942 337582 586073 604215 291193 531407 361823 741965
17043 741965 617712 575845 646485 845151 369831 730807 329495 710224 534024 507673
17033 507673 716360 233700 610883 522398 751284 613341 431608 392023 648352 506814
17023 506814 577416 209086 714183 605734 670480 506813 843065 497706 534080 542069
17013 542069 553634 408340 500927 647447 273384 636812 840851 648487 834976 604410
17003 604410 934398 1014070 706368 918974 595165 634505 811035 520398 892604 454613
16993D54613K67037k33810M56936O9460j5854l17816K27421M7482k14503j02195
16983F38771k4264K87844k91943o8436N81104m4130j46341q5277k92277O96850
16973A251901l40211L08339j95499m0956k23363N2203J83463j95562k8012M3173
16963H15476J28434j72180J74636m7807J43077j8567K2492n7074M02198o32774
16953G57911L99559q4246N8562K00662m08211K96044j90654L7932N8220r3144
16943A032635O130P5634q648k96493J79929M07023k41340J57415j64022P9086
16933A227349j96915Q2709N9130j9473j54660L16645j63491K81635J56277k20918
16923A368288n0621q7775k08031J72919J4866J41941m4626j89365N11009j26002
$$ plain form
16993 454613 721650 487840 944776 1014236 998382 680566 907987 955469 740966 638771
16983 638771 614507 902351 610408 541972 1123076 1078946 932605 847328 555051 1251901
16973 1251901 911690 1220029 1024530 983574 760211 812414 995877 800315 772303 815476
16963 815476 943910 771730 946366 898559 1041636 1023069 1045561 988487 1390685 757911
16953 757911 1157470 1073224 1131786 1332448 924237 1220281 1029627 1067559 1125779 1032635
16943 1032635 1038765 1114399 1105751 809258 989187 1396210 1154870 1312285 1148263 1227349
16933 1227349 1030434 1113143 1172273 1152800 998140 1314785 1151294 1432929 1589206 1368288
16923 1368288 1317667 1229892 1021861 1194780 1209646 1351587 1306961 1117596 1628605 1502603
16913A502603r9332J73789J73947m17469K21128q2958K34725k21966J25954J74774
16903A785195m13564J29448o3215K47702o1779K96513m88012N18838k61628L5459
16893A724957K25321Q4427o49249M26490j40085R7904J15718O4552j71038K48314
16883B027311K1417L36074m65746J38124r5511K60497j78808M00342l91604k9714
16873B022382N954R2000M33357j58573K00301k30292p134J03159K94538k94085
16863B461607j24870L04388K07057n9794k23958j658K34554K14779j33496j80130
16853B698479J28709K55254L21840j98892K21013o18886M56574K52608m12257
16844C104442K33455K41793P7460L8584K76727l32107K51253q7098j24773K80545
$$ plain form
16913 1502603 1403271 1577060 1751007 1333538 1554666 1471708 1706433 1484467 1610421 1785195
16903 1785195 1371631 1501079 1437864 1685566 1623787 1920300 1432288 1951126 1689498 1724957
16893 1724957 1950278 2034705 1385456 1811946 1671861 1769765 1885483 1950035 1778997 2027311
16883 2027311 2048728 2384802 1919056 2057180 1961669 2222166 2043358 2443700 2052096 2022382
16873 2022382 2028336 2120336 2553693 2395120 2595421 2365129 2357995 2461154 2755692 2461607
16863 2461607 2336737 2641125 2848182 2788388 2564430 2562772 2797326 3012105 2878609 2698479
16853 2698479 2827188 3082442 3404282 3205390 3426403 2807517 3264091 3516699 3104442
16844 3104442 3337897 3579690 3657150 3695734 3972461 3640354 3891607 3804509 3679736 3960281
16834C960281J28231r5702N13953P3723m25136M01338p3756j22135N09301l24438
16824D545660L24845K89196l39584N33998l49502K70164K29117k23616K49463
16815E529741K68428L3702J42437o4020M94974l9738j39065L77871O6074K96645
16805F967049R8083J09579L24137J57507q0608l2230K54825M82396j3278N3521
16795H320981L40223M83625j04625M68257K27000J4435L48477L19584M25518Q2895
16785A0926370K80648M48832K13409L19004O06358J35999N85990L27319O63038
16776A4506967N9682M91279N25469O55372J70112P92397L67702N58168J123438
16767A9250586L50844P01191P80550L58604J326519O53272J167302N46486J032324
$$ plain form
16834 3960281 4088512 3992810 4506763 4580486 4155350 4556688 4482932 4360797 4870098 4545660
16824 4545660 4870505 5159701 4820117 5354115 5004613 5274777 5503894 5280278 5529741
16815 5529741 5798169 5831871 5974308 5910288 6405262 6365524 6226459 6604330 6670404 6967049
16805 6967049 7065132 7174711 7498848 7656355 7575747 7543517 7798342 8280738 8267460 8320981
16795 8320981 8661204 9144829 9040204 9508461 9735461 9749896 10098373 10417957 10843475 10926370
16785 10926370 11207018 11655850 11869259 12188263 12794621 12930620 13516610 13843929 14506967
16776 14506967 14566649 15057928 15583397 16238769 16408881 17201278 17568980 18127148 19250586
16767 19250586 19601430 20302621 21083171 21441775 22768294 23421566 24588868 25135354 26167678
16758B6167678J280553J280785J126973J014297J396806J349159J612171J894151
16750C7122573J309985J929512K221130J936040J892623K534875K211341K679468
16742E3837547L042608L265319K642284L625237L616226L983812M156633M375881
16734H2545547M396790M900321M971951N500956N441872N448375N930930N689250
16726A24825992O073927N567288N839388N201043N045106M421657L814412K795490
16718A63584303J909810J373355N69527j117747j353858k787179l310128l733932
16710A55134151m991157m817945n738756n721898o181008n860527n835438n588771
16702A10398651n839039n440437n249809n002803m741066m479530m584879l844034
$$ plain form
16758 26167678 27448231 28729016 29855989 30870286 32267092 33616251 35228422 37122573
16750 37122573 38432558 40362070 42583200 44519240 46411863 48946738 51158079 53837547
16742 53837547 56880155 60145474 62787758 66412995 70029221 74013033 78169666 82545547
16734 82545547 86942337 91842658 96814609 102315565 107757437 113205812 119136742 124825992
16726 124825992 130899919 136467207 142306595 147507638 152552744 156974401 160788813 163584303
16718 163584303 165494113 166867468 167436995 166319248 164965390 162178211 158868083 155134151
16710 155134151 150142994 145325049 139586293 133864395 127683387 121822860 115987422 110398651
16702 110398651 104559612 99119175 93869366 88866563 84125497 79645967 75061088 71217054
16694G1217054m017300l213010l632272l275480k513618l051040k339782k471372
16686D6703180k050869k325228j900132k541023j415707j568883j160439j711217
16678C2029682j283862j022910j289517j198913j340511r94802r81154p90368
16670B3127645r93703o45131p32230o57180j019661m71655p00845o11628p15351
16661A6580261n28077l65238q50339K7301p93158m40526l46541j86884m37601
16652A2659198m15260n74214k23728q0044n18888n40822j1970k10539n63656p5572
16642I444505n12508K52039n21394J21745l72731m72680k08706m8996l62772O6040
16632G384542j84464k97567Q7511m98255K82654l42666K7110m61292q0249k27500
$$ plain form
16694 71217054 67199754 63986744 60354472 57078992 54565374 51514334 49174552 46703180
16686 46703180 44652311 42327083 40426951 37885928 36470221 34901338 33740899 32029682
16678 32029682 30745820 29722910 28433393 27234480 25893969 24899167 23918013 23127645
16670 23127645 22133942 21488811 20756581 20099401 19079740 18608085 17907240 17295612 16580261
16661 16580261 16052184 15686946 14836607 14863908 14070750 13630224 13283683 13096799 12659198
16652 12659198 12243938 11669724 11445996 11365952 10847064 10306242 10294272 10083733 9520077 9444505
16642 9444505 8931997 9184036 8662642 8784387 8411656 7938976 7730270 7681274 7318502 7384542
16632 7384542 7200078 6902511 6990022 6491767 6774421 6431755 6458865 5997573 5917324 5689824
16622E689824o3401q7982j21022m2388j47938j49741k35355q2654J99882n9343
16612D899882j3424m65804j78116J44910o8132R4765k38137j31017N1627n9346
16602D037208l14680j47505j3000K93695l10780j12476K3689k25957J94189K4687
16592C449070k92259K11918n44606O7057L54890j09471j19064J73414m16017J16655
16582B891587k75675k03874O38028o89144J82267n3802O7277j1208Q2749k01186
16572B427019j57345J44841j37344k854J77031k46763j53929J82849j53276r9550
16562A980679Q436l851K23750m05547M42194m00222M1061k03380M45903l93961
16552A735062l6924K66231j94116k34636J31130n22766M45799p7048L49222l05712
$$ plain form
16622 5689824 5626423 5538441 5417419 5375031 5227093 5077352 4841997 4759343 4959225 4899882
16612 4899882 4886458 4420654 4242538 4387448 4319316 4414081 4175944 4044927 4096554 4037208
16602 4037208 3722528 3575023 3562023 3855718 3544938 3432462 3456151 3230194 3424383 3449070
16592 3449070 3156811 3368729 2824123 2891180 3246070 3136599 3017535 3190949 2774932 2891587
16582 2891587 2615912 2412038 3050066 2360922 2543189 2489387 2556664 2545456 2628205 2427019
16572 2427019 2269674 2414515 2277171 2274317 2451348 2204585 2050656 2233505 2080229 1980679
16562 1980679 1989115 1985264 2209014 1803467 2245661 1845439 1886500 1683120 2129023 1735062
16552 1735062 1698138 1964369 1770253 1535617 1666747 1143981 1589780 1512732 1861954 1556242
16542A556242K00524j49055P542R5756n3768k75653l13398M07111m0784q4994
16532A349523J65625j91073k08556K62122M4639j2784L30095m66029j04709N23011
16522A691864l37627l23931J27498K42368l63059M21077j40521k31357o0868K875
16512A028319R3956R2855j75854K98963l77958K46046j73411K37918J4800k21936
16502A063698p7133j72615J50965K13739j42500Q9721k87139J46680J62011j00781
16492A046646j04498m2715m1056L01837n9829l18419J84216P2935j90038L6879
16482H85958p3878k16837L95008q5882N697J20040j45699j13957m4137K0605K03965
16471I50883j28734j67496k34432N94406j15055J36601l71924J43461R2876D36049
$$ plain form
16542 1556242 1756766 1607711 1615253 1711009 1657241 1381588 1068190 1475301 1434517 1349523
16532 1349523 1515148 1324075 1115519 1377641 1422280 1409496 1739591 1273562 1168853 1691864
16522 1691864 1354237 1030306 1157804 1400172 1037113 1458190 1317669 1086312 1025444 1028319
16512 1028319 1122275 1215130 1039276 1338239 960281 1206327 1032916 1270834 1285634 1063698
16502 1063698 986565 813950 964915 1178654 1036154 1125875 838736 985416 1147427 1046646
16492 1046646 942148 899433 858377 1160214 1100385 781966 966182 1039117 849079 885958
16482 885958 812080 595243 990251 904369 910066 1030106 884407 770450 726313 746918 950883
16471 950883 822149 654653 420221 1014627 899572 1036173 664249 807710 900586 436049
16460G22312P1897l20319J02167K27696l80049L97452k17206K9009j5984o9810
16450E47165O1883q2453J25758k20273k4991K70595J74963m24928P4933j23293
16440C79359j62101L15888m4051L29177l10789j23564q2751J82342j77648K74349
16430E80211J93103j72608j01838J35355j10985K24038k82986j38560L07681C12811
16419F45272l17314N26082k22541K8883j69090j19124L02232l17408K74684j2153
16409F19523k17510L85917k71763A95784N40749k01897B27436j00206J67959L77433
16399F72622A28437K57209R6808l3793j18190q23A07641L31234R1900m5625R180
16388D94330j02960K43768A86502R2916r3273K28260j46543j29314M17084n810
$$ plain form
16460 722312 794209 473890 576057 803753 423704 821156 603950 632959 616975 547165
16450 547165 609048 526595 652353 432080 407089 677684 852647 427719 502652 379359
16440 379359 217258 533146 489095 818272 507483 383919 301168 483510 305862 580211
16430 580211 773314 600706 498868 634223 523238 747276 464290 325730 633411 312811
16419 645272 327958 854040 631499 660382 491292 372168 674400 356992 631676 619523
16409 619523 402013 787930 516167 195784 736533 534636 227436 127230 295189 672622
16399 672622 128437 385646 482454 448661 330471 329648 107641 438875 530775 485150 494330
16388 494330 391370 635138 186502 279418 186145 414405 267862 138548 555632 549822
16378E49822p0466K59381l07227k15384C4256J89849M1536O8524j18572Q7569
16368C03162A4464M03272j62943J16193a47308A36686J03664R2034O6385K9481
16358D28250n2782J85355A29798o3860M77890B69754J55342E0294K4687N3135
16348A28116J43894a02735A89515O8138J20537A51873L10639j981j27405A8671
16337F4477M03430a6859D73004A89573J13056H2653J16551K3541o1164J66149
16327C27730M6677A8222M52053d3030D23186I5854J67166I7191L79909A76519
16316C16296L0787m942j69284L29589D6177J17526D9387A8802J04563R5381B7933
16304b20282A95327o0700N5375K74331j7774C7616J34580K1163O7122j24734J3199
$$ plain form
16378 549822 479356 738737 431510 216126 34256 224105 265641 334165 215593 303162
16368 303162 14464 417736 254793 370986 -147308 136686 240350 332384 398769 428250
16358 428250 375468 560823 129798 65938 543828 269754 425096 50294 74981 128116
16348 128116 272010 -102735 189515 257653 378190 151873 462512 460531 333126 18671
16337 64477 467907 -16859 473004 189573 302629 82653 199204 222745 161581 327730
16327 327730 374407 18222 470275 -43030 423186 95854 263020 97191 477100 176519
16316 316296 347083 342141 172857 502446 46177 163703 49387 18802 123365 218746 27933
16304 -220282 195327 134627 190002 464333 446559 37616 172196 193359 260481 135747 148946
16293A48946Q6382K823J01420a21178C8560O3958L40965l3532j95883P1066n9277
16282B25857M1423j20168a8803A57717O6200J0669A07672K4736J87614F4245k9482
16271C4763L0901e5518A53584a67968B40209K48116I0637B8414J51710L1954p5103
16260A36975a636K77A63467N8115j9404m0145N0154J1055N4948a62810A35079
16248B99282r5994m1811C2840O576K03204A08804L7847E1591J59165r1298K35766
16237C55224C9173C932J14895J13601b16232D32028a10948C34708G3865P5046
16227A48911J73476J34914I3961A6605M74537a76929B6512J45099P4320J38755
16217C84686E9552a40668F5990J04552c6205q8058B21478c0263o108J0520a2509
$$ plain form
16293 148946 235328 238151 339571 -121178 38560 102518 443483 409951 214068 285134 225857
16282 225857 267280 147112 -18803 157717 223917 234586 107672 132408 320022 64245 34763
16271 34763 65664 -55518 153584 -167968 240209 488325 90637 28414 180124 212078 136975
16260 136975 -1636 -1359 163467 221582 202178 162033 212187 223242 278190 -162810 135079
16248 299282 203288 161477 32840 39416 242620 108804 146651 51591 210756 119458 355224
16237 355224 39173 3932 118827 232428 -216232 432028 -110948 334708 73865 148911
16227 148911 322387 457301 93961 16605 491142 -176929 26512 171611 245931 384686
16217 384686 59552 -140668 65990 170542 -36205 -124263 221478 -30263 -36371 -25851 -12509
16205a2652B62069A24865h7475C2811J93678a62822J1725M6504B33713F5658J52145
16194B17803m393D9943e6174B2708J32141R5616b9879G8988M1795f4270q2673
16183a46943E03796e9424m2811j64578d7713A84177A3755a29707A24128L48038
16173D72166b37248h9867j19470b5413A71405K11816j41138j1874Q6208B7971
16162C32121j18570b18351l2762C20594e1352q3336B77404l4087j20300b69926
16151b43305c8864C5835a54452A65060h8232i874k31720B37813j13943L23064
16141D46934j46134j25106A5028Q1956J471f9256C76022b7188H9284l6709a31728
16129I3983b8189B1424f9788A59413R7837a1429A4050M8825J8364j0328J66987
$$ plain form
16205 -12652 262069 124865 -87475 32811 226489 -162822 -151097 -104593 233713 65658 217803
16194 217803 213410 49943 -56174 22708 154849 250465 -29879 78988 120783 -64270 -146943
16183 -146943 503796 -59424 -102235 -266813 -47713 184177 13755 -129707 124128 472166
16173 472166 -237248 -89867 -209337 -25413 171405 383221 242083 230209 316417 27971
16162 332121 213551 -218351 -251113 320594 -51352 -134688 277404 243317 123017 -269926
16151 -243305 -38864 35835 -154452 165060 -88232 -9874 -241594 237813 123870 446934
16141 446934 300800 175694 15028 96984 98455 -69256 376022 -27188 89284 52575 -131728
16129 93983 -28189 21424 -69788 159413 257250 -11429 14050 62875 81239 70911 237898
16118B37898c3673B08590l5236a40336j92282e6948C69770F2273a10866A52931
16107a03423M4128C6512J32716a20407C30919A34534P6059J23697A06244E0874
16096b13446B67317a94195B31985M9047B6838N7809a21735N9973G7702N3633a28840
16084i0992j13810A99816b68800J23194A11428M2214J90987i0499B62343c48837
16073e9017K0725A69512D659J14027b33303D71251b99452A96769a96230B04153
16062C13790b56287I2002P3947D5286b19367A16469D786B186g585G8018f3699
16050a78614c244F470a81416g952r4716k2956B87277D1632h963A90753J74301
16039C65054A05704L62943c24452a40677L3452j50465K3342a05157j03554C05564
$$ plain form
16118 237898 -33673 208590 173354 -140336 -332618 -56948 369770 62273 -110866 152931
16107 -103423 -59295 36512 169228 -120407 330919 134534 210593 334290 106244 50874
16096 -213446 267317 -194195 231985 281032 26838 84647 -121735 -61762 77702 131335 -128840
16084 -90992 -204802 199816 -268800 -145606 111428 153642 344629 -90499 262343 -348837
16073 -59017 -38292 169512 4659 118686 -233303 471251 -299452 196769 -196230 204153
16062 313790 -256287 92002 165949 45286 -219367 116469 4786 2186 -7585 78018 -63699
16050 -178614 -3244 6470 -181416 -7952 -102668 -125624 287277 41632 -8963 190753 365054
16039 365054 105704 468647 -324452 -140677 -107225 -257690 -234348 -105157 -208711 305564
16028f4648j27049d2073C7974d79423i7475A08888b63459C76501i6128A79771
16017C07893g4726B4943a47097H5293a28353B23714c585H6029K39384b08545A53352
16005a97480e6028B532f4096H2068J38142C2554a72397a6549j78250E9539a63518
15993a87347I3664g3632A21862b0898B5137k109Q3363c92j04965B92884A0975
15981B50168A09120J59373G7120J28668C0402b5025n8236m0006J8245l78781G6965
15969h0780o4318m3364M9938C12492f02C643a3533j36476A6982d19370B868d0421
15956e2336B83809h2840B57921a68036n3526i2082N193E1688b8821A68608o9838
15945I8770i8111l7699q6061R8614D027P723a16156D7224e2885o7328l7907b6379
$$ plain form
16028 -64648 -191697 -42073 37974 -479423 -97475 108888 -263459 376501 -96128 179771
16017 307893 -74726 24943 -147097 85293 -128353 223714 -3585 86029 325413 -208545 153352
16005 -197480 -56028 2532 -64096 82068 220210 32554 -172397 -16549 -194799 59539 -163518
15993 -187347 93664 -73632 121862 -20898 25137 23028 106391 -392 -105357 292884 10975
15981 250168 109120 268493 77120 205788 30402 -25025 -83261 -123267 -105022 -483803 76965
15969 -80780 -145098 -188462 -138524 312492 -602 3643 -13533 -150009 16982 -419370 2868 -40421
15956 -52336 283809 -82840 257921 -168036 -221562 -92082 -86889 51688 -28821 168608 98770
15945 98770 -98111 -135810 -221871 -123257 4027 11750 -116156 47224 -52885 -120213 -158120 -26379
15932a21536A0677b14378O6145A34292k271i3859G8091b47960A94402b59688d7618
15920e0798j33715q2052a25882B2898d1636A00846m3004M5314a06210l2730D2015
15908a47271l2119j32962A57664a47600o7511B32418a92264O856a8104E9180K70523
15897C29703j57367f1788j29644p0640C0999N6772J47438I5705a17902D26172
15886b64342A60345p5804b9377j3719I7893i5021A58176Q4425a56865h95B9154
15874i2542A65560E1567J45855d6113A41768b50112C9045i9462j2156B9464a36393
15862e4466A6061J31747C1309L5492M076e1519a0101q9177H8612L2868K32730
15851C54210E1414J29751E9864f1517k47420A26611H789O4832O4470a72376J7817
$$ plain form
15932 -121536 10677 -214378 -148233 134292 132021 -93859 78091 -247960 194402 -259688 -47618
15920 -50798 -184513 -266565 -125882 22898 -41636 100846 57842 103156 -106210 -138940 42015
15908 -147271 -179390 -312352 157664 -147600 -215111 232418 -192264 -185408 -18104 59180 329703
15897 329703 172336 -61788 -191432 -262072 30999 87771 235209 95705 -117902 426172
15886 -264342 160345 84541 -29377 -43096 97893 -95021 158176 242601 -156865 -895 29154
15874 -92542 165560 51567 197422 -46113 141768 -250112 39045 -99462 -111618 29464 -136393
15862 -54466 16061 147808 31309 66801 70877 -51519 -10101 -99278 88612 121480 354210
15851 354210 51414 181165 59864 -61517 -308937 126611 8789 73621 138091 -172376 -154559
15840a54559F8434J47229G7121c1229l46761h4881k20024A8709K3907a32289k29389
15829c61678b9253C4266a85721B29598C5220c7071G850b2161N449B6131a00187
15817E7676H576b50557C19711G4800b38969j27176i8102b5189o12k5883j54432
15806b06116e3296j27854C2376i2555j01959J9888k23384A61816F5497P6032l3548
15795A07981D5510c0749A02766D8742J94903C8799Q1406A2838e6528j74671B396
15783h0013L2831b3527A74452a48652O8586k13513d3662B446a11324A48103f6794
15771f7663j14401k0624J6541L1006g5679C25108a1308j66777o7046m252i4449
15759A36877f1696A03130j284A2811r28d3656r7425E9104e9236l75301A65890
$$ plain form
15840 -154559 68434 215663 77121 -31229 -377990 -84881 -304905 18709 42616 -132289 -361678
15829 -361678 -29253 34266 -185721 229598 35220 -37071 7850 -22161 -16712 26131 -100187
15817 57676 8576 -250557 319711 74800 -238969 -366145 -98102 -25189 -25801 -51684 -206116
15806 -206116 -53296 -181150 32376 -92555 -194514 -174626 -398010 161816 65497 141529 107981
15795 107981 45510 -30749 102766 48742 243645 38799 120205 12838 -56528 -231199 2396
15783 -80013 -47182 -23527 174452 -148652 -80066 -293579 -43662 2446 -111324 148103 -66794
15771 -67663 -182064 -202688 -186147 -155141 -75679 325108 -11308 -178085 -245131 -249383 -94449
15759 136877 -61696 103130 101846 12811 11883 -43656 -141081 59104 -59236 -434537 165890
15747c3743C3958Q1626a96915K8389a0311A1025P397E478h9048G2108e8951B00818
15734g9347j02504l37263I5992d7044A26361k2414A4774a50069B4180a4548j5638
15723c0186A20276C6851c5731n6639K0252r1043g0876B81029m9139P7219A28528
15711A91683A1646h8897A34355a29141A06748b02379a0139p1275K079B68949G7968
15699f2991A89417e16276a58584A6762e4197o416A16531J30677A08194D4518B713
15687E7639a19481k11586C8409a54234B20134b65368n5774e6357n262p1966l2983
15676a66568e0363B56023b02104B01881g2542D038P4101a42112I1538a25066H404
15664b83560f0742A07811N1905b75729i3002j1910b2429m3575e128k32933B53828
$$ plain form
15747 -33743 33958 115584 -196915 -168526 -10311 11025 18422 5478 -89048 72108 -58951 200818
15734 -79347 -181851 -519114 95992 -47044 126361 103947 14774 -150069 24180 -14548 -30186
15723 -30186 120276 36851 -35731 -92370 -72118 -163161 -70876 281029 231890 309109 128528
15711 191683 11646 -88897 134355 -129141 106748 -202379 -10139 -81414 -79335 268949 77968
15699 -62991 189417 -516276 -158584 16762 -54197 -60613 116531 247208 108194 44518 2713
15687 57639 -119481 -331067 38409 -154234 220134 -265368 -321142 -56357 -61619 -133585 -166568
15676 -166568 -50363 256023 -202104 201881 -72542 4038 78139 -142112 91538 -125066 8404
15664 -283560 -60742 107811 159716 -275729 -93002 -104912 -22429 -66004 -5128 -238061 253828
15652I3743f3748j18704a4311A57161F0166L1859C7954a56828n4927B24344r9932
15641A24412b48700h0973j84631c2265D1876c46081J29735K4696a5099A56100
15630e4572l12291A20713N7276k419a28672j5739B08075g180l2774j42701A48618
15618f0246K2718k7848j4684c6960o6538H8355d16836B65484b7600E2908Q7504
15607A40412b07720k54770b06496C9069d2742k4356l8020D7314a68202m4463A53092
15595g1419c4013I4521K33415c07417D4229L08764c23058C07164a90908A33631
15584a57740B6063a11458H6621I746J41257H559K03328b37117A92031Q6643o7127
15573B11547G8624c55251J07415A6444c2859j14450j01056G930K15106c3613j52700
$$ plain form
15652 93743 -63748 -182452 -14311 157161 60166 92025 37954 -156828 -211755 224344 124412
15641 124412 -248700 -80973 -265604 -32265 41876 -346081 -216346 -191650 -15099 156100
15630 -54572 -366863 120713 177989 175570 -128672 -144411 208075 -7180 -39954 -182655 148618
15618 -60246 -37528 -65376 -80060 -36960 -103498 88355 -416836 265484 -27600 52908 140412
15607 140412 -207720 -462490 -206496 39069 -42742 -67098 -105118 47314 -168202 -212665 153092
15595 -71419 -34013 94521 327936 -307417 44229 352993 -323058 307164 -190908 133631
15584 -157740 26063 -111458 86621 9746 151003 8559 211887 -237117 192031 278674 211547
15573 211547 78624 -355251 -247836 16444 -32859 -147309 -248365 7930 223036 -33613 -186313
15562a86313B1451L257L8360N9111a80088A31106D3438a41046A58951d7826E7229
15550H5501a95016o9406A07332K2748a61154B27447n5663D8780b68337d3837B68535
15538A97952p1259J70477b12868C0058J10186A1338K04119K5711h0840c1324p0374
15527a01698d9633B60764f4426A47099i547k92325a28940A21961b037j76617d7344
15515f9361B21428a51385A192K70384m0448b3968j9862l01097A84595J66744A48692
15503B29050c77750a88840B1263J15259B1630P2128m4459N704b81866A86275a2891
15491a69180L8719j21693a03569k15379M6333a5966F2693b4475B48458o2752d9645
15479a7737L20B07395o6367f2398l1222o6645c9161B36148i9407F1970J69143
$$ plain form
15562 -186313 21451 24708 63068 122179 -180088 131106 43438 -141046 158951 -47826 57229
15550 85501 -195016 -264422 107332 130080 -161154 227447 171784 48780 -268337 -43837 268535
15538 197952 126693 297170 -212868 30058 140244 11338 215457 241168 -80840 -31324 -101698
15527 -101698 -49633 260764 -64426 147099 -9547 -301872 -128940 121961 -2037 -178654 -47344
15515 -69361 221428 -151385 1192 271576 231128 -23968 -43830 -344927 184595 351339 148692
15503 229050 -377750 -188840 21263 136522 21630 93758 49299 55003 -281866 186275 -12891
15491 -169180 -130461 -252154 -103569 -318948 -272615 -15966 62693 -24475 248458 185706 -49645
15479 -17737 -17417 207395 141028 -62398 -93620 -160265 -39161 236148 -99407 61970 231113
15468B31113C0942R0661a06068d7476A8610L9108J94749A8587M0799a6061A30949
15456a40824f3039A60877d6441n1432m58027F1547b4894p6527A42934a95260N6675
15445a38585C32097A33810o6830a05194B7496a36405a6937B12523p3210a50508
15434b08686Q2074I7429K86186D6984c09351m491e4568A04610l6111a02154j70355
15423b72509A70058i8325k1030L9462D9623J6126b21286b9703k48951G4196J59919
15412B34115C0107M09987a21636k58698F5295J05128h5890A6374J23345a37363
15401A9910b598E6617a14934I608k855b49707J02311F3963k0815e9842j62509
15390b22351A61322a67264D8420Q9360c16383i6190A58965a08837L2737H2445
$$ plain form
15468 231113 30942 121603 -106068 -47476 18610 57718 252467 18587 59386 -16061 130949
15456 -140824 -63039 160877 -46441 -97873 -555900 61547 -24894 -101421 142934 -195260 -138585
15445 -138585 332097 133810 66980 -105194 27496 -136405 -16937 212523 139313 -150508
15434 -208686 -126612 97429 383615 46984 -309351 -313842 -54568 104610 68499 -102154 -272509
15423 -272509 170058 -98325 -119355 -79893 49623 65749 -221286 -29703 -278654 74196 234115
15412 234115 30107 440094 -121636 -380334 65295 170423 -85890 16374 139719 -137363
15401 19910 -2598 56617 -114934 9608 6753 -249707 -147396 63963 43148 -59842 -222351
15390 -222351 161322 -167264 48420 137780 -316383 -96190 158965 -108837 -76100 82445
15379d9251j25023d0590l3412C1832J88550d3212k39519b5512j3831H1764a30423
15367d5433r649A26587K74115B7831e8979a2398C42139F1119J59250a90507N6505
15356a34002r5568Q6517K8445K2547j4002l5867A48308a67811A46863a1709j44073
15345a55782A61280o4554l6466a338B73559G4397J6986J82752c3465C37850j1005
15334C26845e4330l5476K0561A16490b736j23099M0988J639J9014Q664j39649
15323a95179A34684Q7886Q744a51974M1921G0004L26796B7457g3459I0515J48569
15312B39084d1493A14688K35072A03060P6991n8042A6340d35401A48317A3749
15301A04791d2000A01723a07199k05874a43786o0616D113O0909h355B23415A05914
$$ plain form
15379 -49251 -174274 -40590 -74002 31832 220382 -43212 -282731 -25512 -39343 81764 -130423
15367 -45433 -55082 126587 400702 27831 -58979 -12398 342139 61119 220369 -190507 -134002
15356 -134002 -229570 -143053 -114608 -92061 -106063 -141930 148308 -167811 146863 -11709 -155782
15345 -155782 161280 96726 60260 -1338 273559 74397 91383 274135 -33465 337850 326845
15334 326845 -54330 -89806 -69245 116490 -2736 -125835 -84847 -83208 -64194 -55530 -195179
15323 -195179 134684 222570 231314 -151974 -110053 70004 396800 27457 -73459 90515 239084
15312 239084 -41493 114688 349760 103060 180051 122009 16340 -435401 148317 13749
15301 104791 -42000 101723 -107199 -313073 -143786 -204402 4113 65022 -8355 223415 105914
15289B06489F4477b52220I1189d3331m6430k77431D30316D5158P1642J6068b76798
15277a47930C051a5359l53971e627j04838D35036D5007e4988r9609A11617J80525
15266B92142b17682B87608l8590k9132a4541p8530k83390A06298b1587m9715j63855
15255b35157B06280B3060Q1736M6982a1241C77383J097791m49089O9806M01533
15245A497424D29657a15433o712A2813d2864B71167b0051B22111E3326P9006M9669
15234A82001c6453B67045a75679d2204j03080k01455e1224A18778J04435a23956
15223d0809B85009j31083c3708F9780J05630D6887J14272L4278J36521B1193J50840
15212A72033c63842A02259f0704G0049f7756B60896C0500a8646B81607E1219K22835
$$ plain form
15289 206489 64477 -252220 91189 -43331 -89761 -367192 430316 45158 116800 132868 -276798
15277 -147930 3051 -15359 -369330 -5627 -110465 435036 45007 -54988 -154597 111617 292142
15266 292142 -217682 287608 249018 219886 -14541 -93071 -376461 106298 -21587 -71302 -235157
15255 -235157 206280 23060 104796 151778 -11241 377383 1475174 1026085 1095891 1497424
15245 1497424 429657 -115433 -122145 12813 -42864 271167 -20051 222111 53326 132332 182001
15234 182001 -36453 267045 -175679 -42204 -145284 -346739 -51224 118778 223213 -123956
15223 -40809 285009 153926 -33708 69780 175410 46887 161159 195437 331958 21193 172033
15212 172033 -363842 102259 -60704 70049 -67756 260896 30500 -18646 281607 51219 274054
15201B74054j25426M8947H756b3095I564J47891L18925I2780J1613k8026c43262
15189C1980J62768g6715J0564K0276A50475c3324A25177c8367C45272a6181j7642
15178c3823j56600B5720f26A40423J59754E0379a22856N2173N263A25679e0598
15166B0116M54960A25221r176a44824A39476J38449j13453b78775R0220B51643
15155I3542j6678b0918k22738h2269B91476n1746A6329K67629j40083a1003A27710
15143b5932l245B52959h0309B13428j03554J64559n9074J5734a05814j61381B4507
15131D0178A1309J85449q0049K31012P0362A40277K65338J41684a62369C318J71882
15120A75200J70779F5666L8020J10763J46271a75192d001l8721A76456J83462
$$ plain form
15201 274054 148628 197575 8756 -23095 9564 157455 476380 92780 104393 76367 -343262
15189 31980 194748 -76715 -66151 -45875 150475 -33324 125177 -38367 345272 -16181 -33823
15178 -33823 -190423 25720 -626 140423 300177 50379 -122856 -70683 -65420 125679 -50598
15166 20116 475076 125221 116045 -144824 139476 277925 164472 -278775 -188555 251643
15155 93542 76864 -20918 -243656 -82269 291476 239730 16329 283958 143875 -11003 127710
15143 -25932 -29177 252959 -80309 213428 109874 274433 215359 231093 -105814 -267195 24507
15131 40178 11309 196758 116709 347721 418083 140277 405615 547299 -162369 3318 175200
15120 175200 345979 65666 103686 214449 360720 -175192 -4001 -42722 176456 359918
15110C59918G7516d1893G9443b08788l1999a00860r1718A69190E3754J9836j7301
15099E6289g877j5804A2872Q5836K94486A65022a85482A76637E1491k0407J55609
15088A86693R5701a35092D0786c2498o1456B53129h4518B22637H6325J91369J8233
15077B95927b46148B44580I4548K82720A20084n7235e2170A5490K7080J54842
15067A97412N9932j04993d2853A68016B6954J38490J64304m4131j10485h6276
15056a63754A45241o9780Q1359L6282Q1517e7868A29447m6893J32026o7474k07
15045A46899N6042j5852K96959k40435I4203L7918D8954Q4874a59968H8144C143
15033A7398O1428L19158a36510n4094B25964A03443Q6894J04702j07423J01877
$$ plain form
15110 359918 77516 -41893 79443 -208788 -240787 -100860 -192578 169190 53754 73590 56289
15099 56289 -7877 -23681 12872 98708 393194 165022 -185482 176637 51491 31084 186693
15088 186693 282394 -135092 40786 -32498 -93954 253129 -84518 222637 86325 277694 295927
15077 295927 -246148 244580 94548 377268 120084 62849 -52170 15490 42570 197412
15067 197412 257344 152351 -42853 168016 26954 165444 329748 285617 175132 -86276
15056 -163754 145241 75461 156820 193102 274619 -57868 129447 82554 214580 147106 146899
15045 146899 202941 187089 484048 243613 94203 132121 48954 133828 -159968 88144 3143
15033 17398 78826 397984 -136510 -190604 225964 103443 190337 295039 187616 289493
15023B89493p4779E9719a87600A25621Q9993E6804J55742P7131A33896N7699H2274
15011C46114K67480k51169j76099c6873D85135A7674g0501F4833K15820q3867
15001A96786r2758j6573L2613L91715J818A46301K47566A35555n975N3525p9150
14990A03955K92128a2352B56405E6537R3422j3323e6459G0848M93404j85808j64012
14979B14432a48879C33228j11957K15801c5362A64757L15368j97087B0625J07744
14969A28369J07113j12513a16072C4726K35181O7355g4557A30285B0200m959O6577
14958H1818P0793C5017K6413L91195k04373M22523B69938D6946J45742H2415Q6457
14947A68872K21550j1912p4450A32060K85715A45242K43176a33275H2112O8169
$$ plain form
15023 289493 214714 59719 -187600 125621 215614 56804 212546 289677 133896 191595 82274
15011 346114 613594 362425 186326 -36873 485135 17674 -70501 64833 280653 196786
15001 196786 104028 87455 120068 511783 513601 146301 393867 135555 129580 183105 103955
14990 103955 396083 -12352 256405 56537 149959 136636 -56459 70848 564252 378444 214432
14979 214432 -148879 333228 221271 437072 -35362 164757 480125 283038 20625 128369
14969 128369 235482 122969 -116072 34726 269907 337262 -74557 130285 20200 15241 81818
14958 81818 152611 35017 61430 452625 248252 670775 269938 46946 192688 82415 168872
14947 168872 390422 378510 304060 132060 417775 145242 388418 -133275 82112 150281
14937A50281p0433K60856n1692A19219L18640D2522A0440J70862a4899A68338
14926B61763H7882N7014E7529J99606L48965A80041n8855K59496j52040J12237
14916C40879M0739j28340K73698A76602J46656J20257B08446L5311R5209R7320
14906D36286B08332H0888J15624J84372A82172C1923J24466j1185R1024J09960
14896C46188j16245r6206K86866j90312A05510L18472J035j62255P4288j29691
14886B07359J39659J29951j22636A35711J99597O4384n8811k4006l726o3046k3016
14875B27087H2639K21560H5634C0002J31533J94883o222P2429k0912A3212L39693
14864C52905n6199J9555j4348M377K02052J6967k6870A95282J72038J11650j84394
$$ plain form
14937 150281 79848 340704 289012 119219 437859 42522 10440 181302 -14899 168338
14926 261763 87882 144896 57529 257135 606100 180041 121186 380682 228642 340879
14916 340879 381618 253278 526976 176602 323258 443515 208446 243757 338966 436286
14906 436286 208332 80888 196512 380884 182172 31923 156389 145204 236228 346188
14896 346188 229943 133737 420603 230291 105510 423982 425017 262762 337050 207359
14886 207359 347018 476969 354333 135711 335308 399692 340881 316875 313149 250103 227087
14875 227087 82639 304199 85634 30002 161535 356418 350196 422625 401713 13212 352905
14864 352905 296706 316261 301913 306290 508342 525309 498439 195282 367320 478970 294576
14853B94576K25685n4812A55232O4605n4018K27555l5119J74139A66441K14464
14843C80905k3905j28004J38799q8887J10500J34433j66888L6171o8572K07831
14833E32383J08807A21272M55126k14116P4960K01442k09637q7799L7135A1233
14822D33907j74358K9227J4978o0536J08586A44847M13640J5336F3500M61526
14812E25026j26470J644J70682G750K26869J91519j96636N63342k12491j32884
14802D47469K91178l05799J19819j44898K29571j87636J28250j80693O914A84807
14791E08571J66011j29570k41334J19887R6654r6626b9509C92381j45534K98530
14781E45377o6347J98691k59661j22201L63966j37248r1740j77237J73063J54230
$$ plain form
14853 294576 520261 465449 155232 219837 165819 393374 358255 532394 166441 380905
14843 380905 357000 228996 367795 278908 389408 523841 356953 393124 324552 532383
14833 532383 641190 121272 576398 362282 437242 638684 429047 341248 378383 11233
14822 433907 259549 288776 303754 243218 351804 144847 558487 573823 63500 525026
14812 525026 398556 400200 570882 7750 234619 426138 229502 792844 580353 447469
14802 447469 738647 432848 552667 407769 637340 449704 577954 397261 404175 184807
14791 508571 674582 545012 303678 423565 520219 423593 -29509 392381 246847 545377
14781 545377 479030 677721 418060 295859 659825 522577 430837 253600 426663 580893
14771E80893j66625m9871K7119J08062L9167m5302r1276K06617Q7756k84594L31467
14760G43413J18512k25013j38596J74955o4286J77908k26453K14020k89471M15977
14750I00966k89953j80866K85136C06996M18414n767O3038L9081J01539l68855
14740E54446j58041J30494L42519l22853K16413k72600L28418j47091l7150J29409
14730G63964k87384N5121L13025l78656L45731L9827k88164m7072j33133M59381
14720H42640j38204K22324l26259K46983j02658j41285K08133J5824k18761k47003
14710C61734O21902k80661k43252J23559K66799k86737K21355j35846O3519J52807
14700H65179l18018J07922j2783J93808j16911k42232j11861L72936K99258Q3214
$$ plain form
14771 580893 414268 364397 391516 499578 538745 493443 402167 608784 696540 411946 743413
14760 743413 861925 636912 498316 673271 608985 786893 560440 774460 484989 900966
14750 900966 611013 430147 715283 306996 725410 719643 782681 821762 923301 554446
14740 554446 396405 526899 869418 546565 762978 490378 818796 671705 634555 763964
14730 763964 476580 531701 844726 466070 811801 851628 563464 516392 383259 842640
14720 842640 704436 926760 600501 847484 744826 603541 811674 827498 608737 361734
14710 361734 983636 702975 459723 583282 850081 563344 784699 648853 712372 865179
14700 865179 547161 655083 642300 836108 719197 476965 365104 738040 1037298 1120512
14690A120512k18476j84984M195j28654K25460k6833J51706k17394K98706l64343
14680F59895J54892R5075N6421m9836M1901K90855k55304m92889M88809j71225
14670H18594O9741O1728k15549M4447K97664j44301j2609L17855E89231J15047
14660G04278J22159M838P1564j14497M7892M47060k08792l19549K69196l4424
14650I89725l37493J92514N15540j11387j80444o5961R6884N1703l85774L59759
14640A125066p9443P7457J38782j77079m9830Q2201j42858k8967K27229q5650
14630A086908J14702L36371l82972R1102j5540j12844L04599k68429N8759K36088
14620A448744k27986O4970k07582L18570K17702k29211L8969M12723n60482k00033
$$ plain form
14690 1120512 902036 717052 721247 592593 818053 791220 942926 725532 1024238 659895
14680 659895 814787 909862 966283 916447 958348 1249203 993899 501010 989819 818594
14670 818594 888335 950063 734514 778961 1076625 932324 919715 1237570 589231 704278
14660 704278 826437 831275 902839 788342 836234 1283294 1074502 754953 1024149 989725
14650 989725 652232 844746 1360286 1248899 1068455 1002494 1099378 1151081 765307 1125066
14640 1125066 1045623 1123080 1261862 1084783 1034953 1117154 974296 945329 1172558 1086908
14630 1086908 1201610 1537981 1155009 1246111 1230571 1117727 1422326 1153897 1212656 1448744
14620 1448744 1220758 1285728 1078146 1396716 1614418 1385207 1424176 1836899 1276417 1076384
14610A076384M87730k18434L34202k37853k65745K49783K84269k14209j66091
14601A330036J78808j23329r4503j64117N04757k48663J60531Q9995j26031l28251
14591A179233M79341l49354L46076L931l15723J52864k1107J54510j44193J0363
14581A495941L23269j47160n8849L61041m34404K46669J38386j99279j38272J6387
14571A603729R3154L05695l0338l76467L52995J89607j1209j49819K09189P7427
14561B263963M8938J33531j04004J24874K26606q0601K48321k50069P75002K10870
14551C597431N19762J111726K048393L791150Q269455J6695249R174352B0600298
14542G170001l575441q67367p37158j29000J71295l22188K33618j58329K35148
$$ plain form
14610 1076384 1564114 1345680 1679882 1442029 1176284 1426067 1710336 1496127 1330036
14601 1330036 1508844 1385515 1291012 1126895 1631652 1382989 1543520 1633515 1507484 1179233
14591 1179233 1658574 1309220 1655296 1659227 1343504 1496368 1475261 1629771 1485578 1495941
14581 1495941 1819210 1672050 1613201 1974242 1539838 1786507 1924893 1725614 1587342 1603729
14571 1603729 1696883 2002578 1972240 1595773 1948768 2138375 2127166 1977347 2186536 2263963
14561 2263963 2312901 2446432 2342428 2467302 2693908 2613307 2861628 2611559 3386561 3597431
14551 3597431 4117193 5228919 7277312 11068462 19337917 36033166 45207518 20600298
14542 7170001 3594560 2727193 1990035 1861035 2032330 1710142 1943760 1785431 2020579
14533B020579l38928L10141l2804J08206p8194j75275M61911J17941n37149K48299
14523B104727J29709J94985l36849K07300o5707J24669P9908k89157q5931L56720
14513B420374K00150j77162J07966K87945k52147m8031j33804K66621j82696K59659
14503B748875k81443K52045N0238R6163l95736M22888j01692J51643j61860J76417
14493B957538J52839o1473J11170j06798K27443k58817q9846J29127p4738O0817
14483C047262M14622j34658J17326j87517P0228M92087k46428K00500l64695K89147
14473C697874k51716K93654l3607P8340J35404q1601M0891r5214K39395L9545
14463D062965J33926m54298L66598L517Q6587O6847M33460k58902l9160Q6822
$$ plain form
14533 2020579 1681651 1991792 1958988 2067194 1989000 1813725 2275636 2393577 1856428 2104727
14523 2104727 2234436 2429421 2092572 2299872 2234165 2358834 2438742 2149585 2063654 2420374
14513 2420374 2620524 2443362 2551328 2839273 2587126 2539095 2405291 2671912 2489216 2748875
14503 2748875 2467432 2719477 2769715 2865878 2470142 2893030 2791338 2942981 2781121 2957538
14493 2957538 3110377 3048904 3160074 3053276 3280719 3021902 2932056 3061183 2986445 3047262
14483 3047262 3461884 3327226 3444552 3257035 3327263 3819350 3572922 3773422 3408727 3697874
14473 3697874 3446158 3739812 3706205 3784545 3919949 3838348 3879239 3784025 4023420 4062965
14463 4062965 4196891 3742593 4109191 4112708 4199295 4266142 4699602 4440700 4401540 4488362
14453D488362K81242k48020j04291K75955K55870j48034P9945K48854J1252P4203
14443E215338j78464J70813J81106k11740N42714l87538J7822N26820k82992O3260
14433E657139Q6856R5526J15510N1351J90798K24215l65949M16280m6903n2507
14423F372316M43682l09872N36877q8152l22776N18460L45842J4577J44462m06673
14413G248743K62947R4601K62993J02085j23958O21194j44200J5333k3872J81672
14403H497538j1450O10311N8532M0123j47871P41735q247j9409K85235M31110
14393A0477607Q1328R0568L20531J81744j2178K85636K429K01654P97846j20297
14383A2306868r7441k622Q21339J4370J41176K68800M53905J40517L07436K86561
$$ plain form
14453 4488362 4769604 4521584 4417293 4693248 4949118 4801084 4881029 5129883 5141135 5215338
14443 5215338 5036874 5207687 5388793 5177053 5719767 5332229 5350051 5876871 5593879 5657139
14433 5657139 5743995 5839521 5955031 6006382 6197180 6421395 6055446 6471726 6424823 6372316
14423 6372316 6815998 6506126 7043003 6954851 6632075 7150535 7496377 7510954 7655416 7248743
14413 7248743 7511690 7606291 7869284 7971369 7847411 8468605 8324405 8339738 8315866 8497538
14403 8497538 8486088 9096399 9154931 9195054 9047183 9788918 9780671 9761262 10046497 10477607
14393 10477607 10558935 10649503 10970034 11151778 11139600 11425236 11427665 11629319 12427165 12306868
14383 12306868 12209427 12206805 13028144 13042514 13183690 13452490 13906395 14046912 14354348 14640909
14373A4640909K62606L21806K75708R1254N30000K01452L27431J97776N74426
14364A7423368L75157N24972L69575j7300R82558J48553M39701K83345M77799
14355B1007728O37867N15564L25360N77170Q13107N59266N69356L99777R48844
14346B6354039Q64180L26689R83044M64135R67869O84367Q94869R19020Q59334
14337C3317546P66016P06712J423111J002591J364030O92311J706302R16861J456618
14328D3352098J227433J348858J801028J294665J696218J667933J924617J892790
14320E6205640K066699K007188K479719K099518K635091K414021K666010L233577
14312G5807463K872297L265171L686112L570060L942790M433769M213863M202951
$$ plain form
14373 14640909 14903515 15225321 15501029 15592283 16122283 16323735 16651166 16848942 17423368
14364 17423368 17798525 18323497 18693072 18675772 19658330 19806883 20246584 20529929 21007728
14355 21007728 21645595 22161159 22486519 23063689 23876796 24436062 25005418 25405195 26354039
14346 26354039 27218219 27544908 28527952 28992087 29959956 30644323 31539192 32458212 33317546
14337 33317546 34083562 34790274 36213385 37215976 38580006 39272317 40978619 41895480 43352098
14328 43352098 44579531 45928389 47729417 49024082 50720300 52388233 54312850 56205640
14320 56205640 58272339 60279527 62759246 64858764 67493855 69907876 72573886 75807463
14312 75807463 78679760 81944931 85631043 89201103 93143893 97577662 101791525 105994476
14304A05994476M880422N060462N842060N789919O452457O469494P276717O956462
14296A54722469Q370558Q312181R314281R314974J0682343J0455458J1477228
14289B22649492J2154000J2869036J3311755J4130890J4631796J4702602J5553869
14282C20003440J5665560J6089665J5535230J5423513J5197393J3812597J2625768
14275D24353166J1122886Q431234M603297J684130R4113j33867K18339l577097
14267D46796201k351374q330258j0083847j2279421j3604109j4714210j4976812
14260C70456170j5578096j6298014j6030199j5998835j4820181j4451534j3988652
14253B63290659j3703136j2965010j2664048j1567826j1056306j0047876r759105
$$ plain form
14304 105994476 110874898 115935360 121777420 127567339 134019796 140489290 147766007 154722469
14296 154722469 163093027 171405208 180719489 190034463 200716806 211172264 222649492
14289 222649492 234803492 247672528 260984283 275115173 289746969 304449571 320003440
14282 320003440 335669000 351758665 367293895 382717408 397914801 411727398 424353166
14275 424353166 435476052 443907286 448510583 450194713 450288826 450154959 450373298 446796201
14267 446796201 444444827 436114569 426030722 413751301 400147192 385432982 370456170
14260 370456170 354878074 338580060 322549861 306551026 291730845 277279311 263290659
14253 263290659 249587523 236622513 223958465 212390639 201334333 191286457 181527352
14246A81527352r346704q575295p937861p682503p073697o672477o519219n962968
14238A21756628m927208n453279m798432m804425m305612m232990l731987l342110
14230H6160585l569737l489136l147146k924075k635865k853642k970037j699080
14222F2871867k471864k281592j973378j918035j758061j723396j757287j401293
14214D7586961j273892j346232j641234j451888j386640j318707q88403l47738
14206C7932227r64104j787484r18863j067666q13717n28453n42424j126507r78469
14197B9204540p69226q91339o45312m41934m55019j006765m42071p22369r19275
14188B2911230m45345n21309l07221n40390o14404n2328n20668p46918l69053
$$ plain form
14246 181527352 172180648 163605353 155667492 147984989 140911292 134238815 127719596 121756628
14238 121756628 116829420 111376141 106577709 101773284 97467672 93234682 89502695 86160585
14230 86160585 82590848 79101712 75954566 73030491 70394626 67540984 64570947 62871867
14222 62871867 60400003 58118411 56145033 54226998 52468937 50745541 48988254 47586961
14214 47586961 46313069 44966837 43325603 41873715 40487075 39168368 38279965 37932227
14206 37932227 36968123 35180639 34261776 33194110 32380393 31851940 31309516 30183009 29204540
14197 29204540 28435314 27543975 26898663 26456729 26001710 24994945 24552874 23830505 22911230
14188 22911230 22465885 21944576 21637355 21096965 20482561 20430233 19909565 19162647 18793594
14179A8793594J2326r57451L52940r90711j44323m26152o31044O2230k45303l34996
14169A5491110m80364K25910j154726J85032l43422J33836k42535o56572l57576
14160A2800693k09112J42597m99085j23829n00068o8122q9662k80596j27767J32972
14150A1178021k82634n04577P1317J18628l17253o06632l2142l86186P66930o68289
14140I337183l84947O3230l42379P6083J6081k86629p6447l60426L61943k01977
14130H201715l79581l05484M32183k90108k72744k28526M8152j44776k9177Q2216
14120G113870O0549l76340l12827M2387j04795J53782k68247k73639M4867O2260
14110F141867j06042L26821n74856l01403L20136o8476r1J04012m68234K40448
$$ plain form
14179 18793594 18805920 17848469 18201409 17210698 17066375 16640223 16009179 16071409 15826106 15491110
14169 15491110 15010746 15236656 14081930 14266962 13923540 14057376 13814841 13158269 12800693
14160 12800693 12591581 12734178 12235093 12111264 11611196 11543074 11453412 11172816 11045049 11178021
14150 11178021 10895387 10390810 10462127 10580755 10263502 9656870 9624728 9238542 10005472 9337183
14140 9337183 8952236 9015466 8673087 8749170 8765251 8478622 8402175 8041749 8403692 8201715
14130 8201715 7822134 7516650 7948833 7658725 7385981 7157455 7205607 7060831 7031654 7113870
14120 7113870 7174419 6798079 6485252 6527639 6422844 6576626 6308379 6034740 6079607 6141867
14110 6141867 6035825 6362646 5787790 5486387 5806523 5738047 5737956 5841968 5373734 5614182
14100E614182j29255l93272K52294l29464r7591R0923O0758j7103o6908j30140
14090D854424k76240l997K7786K27353l46065P6312j24968k03377j53608K18751
14080D296371J82150m37458J56524L6357r4391k13383L23788k87572L69383k97999
14070D033770N3609j68368j30572J35230l2181k30924j80952m2316J99769j85016
14060C452049j7743j77107j17741K32876K36757l41920k86004N80429l27549r2000
14050C142047J98811m16882l8927M30681k19864K95513k65766m22944J95041k12266
14040B685444K62904l80939j19171J71070J27883o2577J75825r0816K33882j95906
14030B807599N17163n03925m9044k81114J88808k8563k37487M4574k12833J13045
$$ plain form
14100 5614182 5484927 5091655 5343949 5014485 4916894 5007817 5068575 5051472 4984564 4854424
14090 4854424 4578184 4574187 4601973 4829326 4483261 4559573 4434605 4231228 4077620 4296371
14080 4296371 4478521 4041063 4197587 4233944 4139553 3926170 4249958 3962386 4331769 4033770
14070 4033770 4087379 3919011 3788439 3923669 3891488 3660564 3479612 3437296 3637065 3452049
14060 3452049 3434306 3257199 3139458 3372334 3609091 3267171 2981167 3561596 3234047 3142047
14050 3142047 3340858 2923976 2885049 3315730 3095866 3391379 3125613 2702669 2897710 2685444
14040 2685444 2948348 2567409 2448238 2619308 2747191 2684614 2860439 2769623 3003505 2807599
14030 2807599 3324762 2820837 2771793 2490679 2679487 2650924 2413437 2458011 2245178 2358223
14020B358223K49443j03267j35050j23638k81646J83978k5200K69674M9004j82919
14010B258602l03812k46311K04100Q3399k0609q2596p1606k56766L53127Q3795
14000B001323k25560M62159k98983j20938N1790k1563M9738n6074R4961P6651
13990B013504L92205J047690K661819O194752J5884793J6679206j8197763A2000241
13981G020905k096566l72166j084974m8548n48045j88600J75243k58195m8163
13972B550891k61132j45954j6740L33067q1690j71407j78635Q2133p3772k80035
13962A756726L37127j40715l81796J67665M9795N43162q30175L96943L6899m52469
13952A483162L57622j53304K71036l58844j39874J21123J3942k86200M49142j09227
$$ plain form
14020 2358223 2607666 2504399 2369349 2245711 1964065 2148043 2122843 2392517 2441521 2258602
14010 2258602 1954790 1708479 1912579 1995978 1975369 1892773 1821167 1564401 1917528 2001323
14000 2001323 1775763 2237922 1938939 1818001 1869791 1848228 1897966 1841892 1936853 2013504
13990 2013504 2405709 3453399 6115218 12309970 28194763 44873969 26676206 12000241
13981 7020905 4924339 4552173 3467199 3418651 2870606 2682006 2857249 2599054 2550891
13972 2550891 2289759 2143805 2127065 2460132 2378442 2207035 2028400 2110533 2036761 1756726
13962 1756726 2093853 1953138 1571342 1739007 1788802 2331964 1501789 1898732 1935631 1483162
13952 1483162 1840784 1687480 1958516 1599672 1459798 1580921 1594863 1308663 1757805 1648578
13942A648578N5815p2733L7755j04828j55782L24279k78406M7025K0370l023L7367
13931A556417k02228J19630J27062l58317J10734M97848m81512p462J17696m13393
13921A066475J02170L78016J9268m00958N6811K62299m92393L40293j00675k30024
13911A001282K23997L88225l69049R1719k99802K8622J31668R8762j89489J02339
13901A208274J25682M6534m9887l66350K38478r3840K63004j99240N8330l39465
13891H91520L97731r4743N169M5533l2656O1937j22087j54612q6224K82141R9858
13880A293567j92111o0510L19355l51483l02742O38253m68788J90911J37563l08450
13870H95565R4666r483j39450l6560o394J52552K8414l68506K94527J47210j36841
$$ plain form
13942 1648578 1704393 1631660 1669415 1564587 1408805 1733084 1454678 1501703 1522073 1519050 1556417
13931 1556417 1354189 1473819 1600881 1242564 1353298 1851146 1369634 1362172 1479868 1066475
13921 1066475 1168645 1546661 1565929 1164971 1221782 1484081 991688 1331981 1231306 1001282
13911 1001282 1225279 1613504 1244455 1336174 1036372 1064994 1196662 1295424 1105935 1208274
13901 1208274 1333956 1380490 1330603 964253 1202731 1108891 1371895 1172655 1230985 891520
13891 891520 1289251 1194508 1199677 1245210 1212554 1274491 1152404 997792 911568 1193709 1293567
13880 1293567 1101456 1040946 1360301 1008818 706076 1344329 875541 1066452 1204015 895565
13870 895565 990231 980748 841298 804738 798344 950896 979310 610804 905331 1052541 915700
13859I15700J90876k76699M4613K9915p6653p7485l07058L65891r1398Q8639j3439
13848G92902k34595N0144K90328J9703D45723L11972K71020j77377O259C34276
13837I02785K99436n84109K88884j36343o1739Q3236o0338k00511K18007q1236
13827F68072l4508K26073K3929J8793j59545j01158K3875j91461L10817J01487
13817H86374q6414j43305O7759j31225N34695j01876l29122M46148l05197N0449
13807H88286m27786m1016K66203J09006R68k70062R7406l5810j17768J2339J59539
13796F41305J41774j17153o4324J59859q1070k49965M76085l49430J00548J85716
13786H43345l14940K99768j12584j7935O5644l0477j1843j75736N3232J92192
$$ plain form
13859 915700 1106576 829877 874490 904405 827752 750267 443209 809100 717702 806341 792902
13848 792902 558307 608451 898779 918482 445723 757695 1028715 851338 857597 334276
13837 902785 1202221 618112 906996 770653 708914 792150 731812 531301 749308 668072
13827 668072 633564 859637 883566 902359 742814 641656 665531 474070 784887 886374
13817 886374 799960 656655 724414 593189 1127884 1026008 696886 1143034 837837 888286
13807 888286 460500 419484 685687 794693 795661 525599 623005 587195 469427 481766 641305
13796 641305 783079 665926 601602 761461 680391 430426 906511 557081 657629 843345
13786 843345 528405 828173 715589 697654 763298 732821 720978 545242 598474 790666
13776G90666l14071L6113M68026m41873K39822j42269q8614K34260l28102J84285
13766F38243j50688j76124L22900J4124J61945o5174o4252J3679j87828L66768
13756H73593l80133M1702j34781N08705l60800J14934k51294L33350k17424L8993
13746E66845j78677L00130j01618p6822N802J35749j29776j03641p1913M06420
13736G52499r1697k04224p5329K89906O5606j17939k70023L21366K05880B54195
13725E03972j34697J57422j1898K72687l82918l9298n9757L90521k08551J96110
13715F83593C17399J59998j94616J80143j6234J64163k09635m4722K14809k30031
13705C41274J58025n3022K50827l45388J43321j40953O3759m7393M93573k35510
$$ plain form
13776 790666 476595 512708 980734 538861 778683 636414 547800 782060 453958 638243
13766 638243 487555 311431 634331 648455 810400 745226 680974 694653 506825 873593
13756 873593 493460 535162 400381 909086 548286 663220 411926 745276 527852 566845
13746 566845 388168 688298 586680 509858 515660 651409 521633 417992 346079 752499
13736 752499 660802 456578 381249 671155 736761 618822 348799 670165 876045 254195
13725 503972 369275 526697 514799 787486 404568 365270 305513 696034 487483 683593
13715 683593 317399 477397 282781 462924 446690 610853 401218 356496 571305 341274
13705 341274 499299 446277 697104 351716 495037 354084 417843 370450 864023 628513
13695F28513k4171k75376K45037l3455m995j95724K2532K20505j48341K22892
13685F57417B26080K65963J14584B08519K23204N107j54644J86669O7458q2257
13675D54056O2626K1041l2730k42746Q8371j08888J18324K87055B57049K44568
13665E01617J87165k60949Q3377l5195j52240D1105M29096j97673m5042m8045
13655A79441K00027A86410P1270J63067R2504O4027j38743Q6931n3601R6760j57985
13644D10640j63224L9146M4254P1299k015J42264B38669J38391N2769A30406K43611
13633C74017A46535Q4466m9682M27173j28693j10214j5952j10679J90459B04893
13622C17378O1167a25411G43586j25605F0943J62775J62823A65259J24260p8323
$$ plain form
13695 628513 604342 328966 574003 540548 535553 339829 362361 582866 434525 657417
13685 657417 226080 492043 606627 208519 431723 436830 282186 468855 536313 454056
13675 454056 516682 537723 504993 262247 350618 241730 360054 647109 257049 501617
13665 501617 688782 427833 511210 476015 323775 41105 470201 272528 227486 179441
13655 179441 379468 186410 257680 420747 513251 577278 438535 525466 471865 568625 410640
13644 410640 247416 286562 330816 402115 400100 542364 238669 377060 429829 130406 374017
13633 374017 146535 231001 181319 608492 479799 369585 353633 242954 433413 204893
13622 317378 378545 -125411 743586 617981 60943 223718 386541 165259 289519 211196
13612B11196J99623p6021A44815K13751J89193k01271m0919A13063K64292r2234
13602B85121K08863b8248B85102j14928J32333L2762q9764J24527j46170K50930
13592D74792L0039j4793r0540I8505J95220r0385J32390j67716J78912J4988A78866
13580e1479B93509Q0916l274B4966O5236J91269L6684J37957J54680j90309j72262
13569B48221q1998L6487j6598J87937j13640l5902J065B4203K24918j00488j0623
13558A38010M63590a76046C64767E2397K76042r0048C8860l096L77648e2362A71976
13546b23287A91066N8219K65840j60100E8585O6114J37196j13720K44711D0724
13535E29812f7944B07973o8590L2999l5698c5774A19982J78191j31849J03995
$$ plain form
13612 211196 410819 334798 144815 358566 547759 346488 305569 113063 377355 285121
13602 285121 493984 -28248 285102 170174 302507 335269 245505 370032 223862 474792
13592 474792 504831 490038 399498 98505 293725 203340 335730 168014 346926 361914 178866
13580 -51479 293509 374425 371151 24966 90202 281471 318155 456112 610792 420483 248221
13569 248221 166223 202710 186112 374049 260409 224507 225572 24203 249121 148633 138010
13558 138010 601600 -176046 364767 52397 328439 238391 38860 35764 413412 -52362 171976
13546 -223287 191066 249285 515125 355025 58585 124699 261895 148175 392886 40724
13535 529812 -67944 207973 139383 172382 136684 -35774 119982 298173 166324 270319
13525B70319L2644J62562B01268L15208k43222Q0757j23422J92106j59660j16485
13515A46550K23734A74776J61319m6389J73526k28835L64019B04046P702k390
13505B09358m5561k7841K34487L9700j64749K2396r5942J12035C0981J21571G5107
13493a23686I5983L00380j26147b01539H4229K13969a6172A28202J76199n6896
13483B47505K42502A76549q602p8550o271J38718C540N1910O65029B70920j5379
13472B55541q7141J69056D3177J36034P8658k3459M9857C4780J85962c6550A33549
13460C39413j52963f2414C75533j87360e6216H7576K48597j46942K52852G1132
13449B44284K56842l4472q0089J8252l0767j80761K3646q5257d6941B0782K83407
$$ plain form
13525 270319 302963 465525 201268 516476 273254 354011 230589 422695 263035 146550
13515 146550 370284 174776 336095 289706 463232 234397 598416 204046 211748 209358
13505 209358 163797 135956 370443 410143 245394 267790 171848 283883 30981 152552 75107
13493 -123686 95983 396363 270216 -201539 84229 298198 -16172 128202 304401 247505
13483 247505 490007 176549 167947 89397 83126 221844 3540 55450 720479 270920 255541
13472 255541 168400 337456 43177 179211 257869 234410 284267 34780 220742 -36550 133549
13460 339413 186450 -62414 375533 188173 -56216 87576 336173 189231 442083 71132
13449 244284 501126 466654 386565 404817 374050 193289 216935 131678 -46941 20782 304189
13438C04189j13475J18999J13341o2913J60148I7164J24627j02892G96g6343a4540
13426E40119A43011n3302K69843C0546L42331K9268A80500K08624A86324D2989
13415A0698o75K03766E2267N8459b97100G823J2348M52327F0747J53661J50658
13404C65066K45995A77249B9390K45023r5020a6526F4747K16029j27835K50708
13394D03649A02864J54749J34447A92441H4501a13216A35308O4442G5191A773
13383C28988A41128M7196a16474H7401C4923J07208l5088M3416b04675F8189P2390
13372A40579J34784j26935P0752f9777B03419E2746M39783I2004J76005j1856
13362B56153j5486L5732l4618l9128b18095C35260i5309A83282J04320c4225D07774
$$ plain form
13438 304189 190714 309713 423054 360141 520289 97164 221791 118899 796 -76343 -14540
13426 540119 143011 89709 359552 30546 372877 402145 180500 389124 186324 42989
13415 10698 10023 213789 52267 110726 -297100 7823 20171 472498 60747 214408 365066
13404 365066 611061 177249 29390 274413 179393 -16526 64747 280776 152941 403649
13394 403649 102864 257613 392060 192441 84501 -113216 135308 199750 75191 1773
13383 328988 141128 188324 -116474 87401 34923 142131 107043 150459 -204675 68189 140579
13372 140579 275363 148428 219180 -69777 203419 52746 492529 92004 268009 256153
13362 256153 240667 276399 241781 202653 -218095 335260 -95309 183282 287602 -34225 407774
13350C68320B0656J78014J01020M386i353j08778A04165J45046o0720Q6839O3302
13339C38632j5521J36449A95229J45012A14439J45309K28223A95905L80970j84555
13329C92320O0709d9708Q946E5897J08497o6557M38547c6948C61013A4509O36526
13318F51035k76395A18856a18827B36402b5739B63781a79280b1677A44476j3605
13308A30871K05639j60816G5805J27585O9060O6822g1358C0872K25321A10740
13297G7707k7274q437M410a18736j18075A48919Q4794E4812A6492d566D8482K18546
13285B67028k8180L4373A07431m333J22932J27122G2520Q5815J42136j38617m2211
13274A19643a92321N1904B143J21512q133a19055B90653a8519B37355a5179o3919
$$ plain form
13350 368320 20656 198670 299690 304076 -9353 -118131 104165 249211 188491 275330 338632
13339 338632 323111 459560 195229 340241 114439 259748 487971 195905 576875 392320
13329 392320 453029 -49708 -40762 55897 164394 97837 536384 -36948 361013 14509 651035
13318 651035 374640 118856 -118827 236402 -25739 263781 -179280 -21677 144476 130871
13308 130871 336510 175694 75805 203390 272450 339272 -71358 30872 256193 110740
13297 77707 50433 41996 46406 -118736 -236811 148919 233713 54812 16492 -4566 48482 267028
13285 267028 238848 273221 107431 103098 226030 353152 72520 158335 300471 161854 119643
13274 119643 -192321 -140417 2143 123655 115522 -119055 290653 -18519 237355 -15179 -79098
13263g9098C37057B1183b5975D17189A8572J30227G0831J56758a7689A70573e7190
13251D71498A26344l3404A1752D576R5440a03732l6686A94319p4345N0550a77378
13239C73658f5257A7260L08451A60553K8633F3439a20748I1590a47274l9369B12116
13227B86180b06605C32788j55418a9246A19249n2105a03889A02227a63039A38356
13216a0821A73120b18039A72075L00204m6982c21876B45685a12136o974j09779
13206b28889A98430l9722J9569D8660L52010D0697R941j3913M4103J64320A00724
13194g8256C30217p4467G4375J84456A14387o278R949O9052A2542a5627k41206
13183b56833P7722d1369F6442a2979j01786a2537B1384P2366j5173K27305P8679
$$ plain form
13263 -79098 337057 21183 -25975 417189 18572 148799 70831 227589 -17689 170573 -57190
13251 471498 126344 92940 11752 4576 100016 -103732 -140418 194319 119974 170524 -177378
13239 373658 -65257 17260 325711 160553 189186 63439 -120748 91590 -147274 -186643 212116
13227 286180 -206605 332788 177370 -19246 119249 67144 -103889 102227 -163039 138356
13216 -10821 173120 -218039 172075 472279 425297 -321876 245685 -112136 -119110 -228889
13206 -228889 198430 158708 178277 48660 400670 40697 50638 36725 80828 245148 100724
13194 -78256 330217 255750 74375 258831 114387 108109 118058 187110 12542 -15627 -256833
13183 -256833 -179111 -41369 66442 -12979 -114765 -12537 21384 93750 78577 305882 384561
13172C84561A20586M3331a91706C53198C8234Q598b12399a05641B53962o2850
13162A91112K35157j85126N830A0698K15343a09244B65663a0436q4771D27570
13151A54847E9420J23269B6178K2695J58948j2348m5373J76073f4394o6955C6660
13139d091l9070H1205a7721o4166B12433a90449I0243C8454O6361A5412J28997
13128A44409a20057J3614j63485g1248A66451g2038q7410A10444n1091b11976
13117E8808L1465B501M49256k20164b3006A31235Q315c37993d6726E0792b07490
13105B0541J87474j9845a6908j40704N7792G4751h7928A27986L9785p1773i5106
13093a81243A71355M7565J64945c745A65840a04747J7445B90376g4529l7500k5720
$$ plain form
13172 384561 120586 163917 -191706 353198 38234 46832 -212399 -105641 253962 191112
13162 191112 426269 241143 246973 10698 226041 -109244 265663 -10436 -95207 427570
13151 154847 59420 182689 26178 48873 207821 195473 150100 326173 -64394 -131349 36660
13139 -4091 -43161 81205 -17721 -81887 212433 -190449 90243 38454 104815 15412 144409
13128 144409 -120057 -106443 -269928 -71248 166451 -72038 -159448 110444 59353 -211976
13117 58808 90273 2501 451757 231593 -23006 131235 139550 -337993 -46726 50792 -207490
13105 20541 208015 188170 -16908 -157612 -99820 74751 -87928 127986 167771 95998 -95106
13093 -181243 171355 218920 383865 -3745 165840 -104747 -87302 290376 -74529 -112029 -137749
13082a37749M0685A12208L00843a3368H5932k394a50404F62293a94335c8563C6296
13070B11934H7974L39865g156A99814A3149g005H3539l2286J37729b26264a7950
13058a0433r3994r1993B18914l4537b76196A88920R7894A23801K50692C7307e9180
13046C13796A27107J55651F7317a10035l2874I8225L6685n3842f6001J0456b656
13034A09848I37K22010g6076B63304o0368a57175D43344c9276n8180I583K4201
13023C3784N3272C503J27340J0054h1790B5305a37905C05579F7869e929B51971
13011H5537G236J239J42389K36875A3321P2204a04808A6609a87981A81578f9921
12999b30344Q5856A67083H2641l4143b30382f3706A1158J0932J38199E1638H583
$$ plain form
13082 -137749 -97064 112208 413051 -13368 85932 83538 -150404 662293 -194335 -38563 36296
13070 211934 87974 427839 -7156 199814 13149 -7005 83539 51253 188982 -226264 -17950
13058 -10433 -104427 -196420 218914 184377 -276196 188920 286814 123801 374493 37307 -59180
13046 313796 127107 282758 67317 -110035 -142909 98225 134910 81068 -66001 -55545 -2656
13034 109848 937 222947 -76076 263304 202936 -157175 443344 -39276 -97456 9583 33784
13023 33784 87056 3503 130843 140897 -81790 25305 -137905 305579 67869 -5929 251971
13011 85537 7236 8475 150864 387739 13321 85525 -104808 16609 -187981 181578 -69921
12999 -230344 -144488 167083 82641 48498 -230382 -63706 11158 22090 160289 51638 8583
12987D81815A22010a08025L7820A85258A0999K35146m1960i7522B05441k8137
12977A77304a43657j44153A06404B8466i494G9806K46746D6734J68898J82449
12967C98081j90806a6277A21887E8452b30490a3157I8777m0571b94589e5806A88935
12955a85386L76n9654K0250A55116D5848d4523A05413b18621J05746a5820C05331
12943A72243D6185B291a03538A27534b0718o9243j78428Q1740A90332o5918D6594
12931C5491g600A12319r432k9915N69585I8599J50976b52635k27698a60476j02335
12920b62811f377C0697e3825O114f94j50242a9301H318M8099a25049B12511p0646
12908A41865J06448a26200K4072C74156A41048B9474J23350a63785B34055G4146
$$ plain form
12987 481815 122010 -108025 -70205 185258 10999 246145 204185 -97522 205441 177304
12977 177304 -143657 -287810 106404 28466 -9494 79806 326552 46734 215632 398081
12967 398081 207275 -16277 121887 58452 -230490 -13157 98777 58206 -294589 -55806 188935
12955 -185386 -185010 -244664 -224414 155116 45848 -44523 105413 -218621 -112875 -15820 305331
12943 172243 46185 2291 -103538 127534 -20718 -89961 -268389 -186649 190332 124414 46594
12931 35491 -7600 112319 102887 72972 642557 98599 249575 -252635 -480333 -160476 -262811
12920 -262811 -6377 30697 -53825 -47711 -694 -150936 -19301 8318 56417 -125049 212511 141865
12908 141865 248313 -126200 -102128 374156 141048 29474 152824 -163785 234055 74146
12897g1522a4367o4308I1586a7177j98273i595A67450K59003l0891A18082j4406
12886A03676a89944A94060I0135M3107n9918B3268b23434a03870I0293J24416
12876B14709I0140R843a49369A46129j9503k1168A7748f9741B8202N7179J83289
12865B68670g5773A18315A5049K6085a35484k8456b7867C38657A64560l873J22502
12854B83189a64420C633K62962c14556A26130L7671e8821n3566e4104r8798J1585
12843a41317M0988B58561e5779F5199a66941L2961B90725b24251J03480A65985
12832A8589P6989b8043o4801h867F3191f8961l359k5327C8451J39149b61072A03893
12819a9408C068L8712a49855j57844g7096B46674B993J61153m0310P2566E0081
$$ plain form
12897 -71522 -14367 -78675 91586 -17177 -215450 -9595 167450 426453 395562 118082 103676
12886 103676 -189944 194060 90135 133242 73324 23268 -223434 -103870 90293 214709
12876 214709 90140 99983 -149369 146129 126626 105458 17748 -69741 28202 85381 268670
12865 268670 -75773 118315 15049 41134 -135484 -163940 -27867 338657 164560 160687 283189
12854 283189 -164420 3633 266595 -314556 126130 163801 -58821 -112387 -54104 -152902 -141317
12843 -141317 -100329 258561 -55779 65199 -166941 -133980 290725 -224251 -120771 165985
12832 18589 95578 -28043 -92844 -8867 63191 -68961 -72320 -97647 38451 177600 -261072 103893
12819 -19408 3068 41780 -149855 -307699 -77096 246674 2993 164146 123836 196402 50081
12807B38973l7680a38374K7149j67171C5258a45254b0009j69557j46293E9253
12796a0891r9044a4803C57783e0527j23861a3935A40471f8606l1637j46384E8329
12784c7411k72249A46298A1454f8237B23J46218d99988A1133a28785C07108a48272
12772a74825c8771n6512A6013f6040l6942A60688j0760d40584Q3086a07270A92789
12760e0679A06045a41892N6771j77573A36358J61273G001g2753r179I8084b37295
12748G6578J69917b36999R7576J6155j9938F0888j0367g1806K9945C07382o5826
12737B41556I8028R2502P6935b06468J03016C13863a59368a1973A32188a8585
12726B00754O1937m5196p4732d6770B26399E279J0205J51632J26483C0141J78431
$$ plain form
12807 238973 201293 -138374 -111225 -278396 35258 -145254 -20009 -189566 -335859 59253
12796 -10891 -109935 -14803 357783 -50527 -174388 -13935 140471 -68606 -100243 -246627 58329
12784 -37411 -309660 146298 11454 -68237 223 146441 -499988 11133 -128785 307108 -148272
12772 -174825 -38771 -95283 16013 -66040 -102982 160688 149928 -440584 -357498 -107270 192789
12760 -50679 106045 -141892 -85121 -262694 136358 297631 7001 -72753 -81932 98084 -237295
12748 76578 246495 -236999 -139423 -123268 -143206 60888 50521 -71806 -41861 307382 241556
12737 241556 98028 190530 267465 -206468 -103452 313863 -159368 -11973 132188 -18585
12726 200754 262691 217495 142763 -46770 226399 5279 15484 167116 293599 30141 208572
12715B08572f8577n426F3508Q2671K71509J4160d3232C51114m8375E728K17346
12704B23074J7323F9419K50184j41384k5657L4821f5399j10384C65881a4405C39243
12692B6617f9014I821a61214A75271A7028K34390c60270H3726b67015a17549b9923
12680C5885g438A08095A4380b07429B8219e4907A25450J60250K1968A47440a47134
12668B23401c06042a33352A6117f1565A53969e5938I234a27140D0246b26472B75032
12656A49647c705F9986f5434C46252k1262c4584j2758A32028A6873d2458B13800
12644H4920J8922K39008K71348B15256d8797l7243B74911a53544B34509J77158
12634D11667a70233n1973G0261J00442E0662J12231L21984A19202K5958a2291
$$ plain form
12715 208572 -68577 -74003 63508 146179 417688 431848 -43232 351114 302739 5728 223074
12704 223074 240397 69419 319603 178219 152562 187383 -65399 -175783 365881 -14405 339243
12692 26617 -69014 9821 -161214 175271 17028 251418 -360270 83726 -267015 -117549 -29923
12680 35885 -7438 108095 14380 -207429 28219 -54907 125450 285700 307668 147440 -147134
12668 223401 -306042 -133352 16117 -61565 153969 -55938 9234 -127140 40246 -226472 275032
12656 149647 -3705 69986 -65434 346252 324990 -34584 -47342 132028 16873 -42458 213800
12644 84920 103842 342850 614198 215256 -48797 -86040 274911 -153544 234509 411667
12634 411667 -170233 -222206 70261 170703 50662 162893 484877 119202 145160 -12291
12623b7418A75512b21316O4654B00294a95823B34810c00863c5139j35663E4631
12612A93032b94496I7738a05025E5247F964K0534J49601d9419j23109I4276O5406
12601A59682C2857L17965I0579J13641a33048C820a08197A79461a12072E5315
12590G509a61822A61788a84177a5551j07192B3403J00600Q966o4267P7202b37171
12578A08977c47681g1163q454A43201e3307j61584A35950P973a40084p280b1651
12566C8050J9370K5348J07539J68297A4497a70469j08594o1811a39000A78374
12555A89713B6660J86900P7495A28956D3681a93200o1955A29697C219K34368p8267
12544A59320p773a30745C14120D1720g6597A81723A3411J68830b10285L8331N3813
$$ plain form
12623 -27418 175512 -221316 -156662 200294 -195823 234810 -300863 -35139 -170802 54631
12612 193032 -294496 97738 -105025 55247 6964 27498 177099 -49419 -172528 94276 159682
12601 159682 32857 350822 90579 204220 -133048 3820 -108197 179461 -112072 55315
12590 7509 -161822 161788 -184177 -15551 -122743 23403 124003 132969 68702 145904 -237171
12578 108977 -347681 -71163 -79617 143201 -53307 -214891 135950 143923 -140084 -147364 -21651
12566 38050 57420 82768 190307 358604 14497 -170469 -279063 -340874 -139000 178374
12555 189713 26660 213560 291055 128956 43681 -193200 -255155 129697 3219 237587 159320
12544 159320 151547 -130745 314120 41720 -76597 181723 13411 182241 -210285 -171954 -118141
12533a18141M3051A0197M8505O7791Q2340D6463J0021b1570A16905m8701j6698
12522E1506j0695b47081h5101j46531P5968A36346a82770O2476B25031r2803k0875
12511A11353c0885j55658B15630I2355l1089P0928f5088D13105b70l2368a2455
12499B03943D9816O2685d9868k4493i305j20628D24985h7922B69212D9861a50928
12487A63748f6816D5494h5788L6525G6446O1232a35882A49247a44170B27140c11599
12475A20482l3258a28258c6822l95616a12369N0564m7641A76968C0497a71440
12464B96921n1645o9178a5979r3967F7598a55456J1445k59837q1502D37734c17593
12452h0928b8653G8909K48284d2730k7218B01277J27980a7518k24291L6353K3818
$$ plain form
12533 -118141 -75090 10197 58702 126493 208833 46463 56484 -21570 116905 68204 51506
12522 51506 40811 -247081 -85101 -231632 -155664 136346 -182770 -120294 225031 132228 111353
12511 111353 -30885 -186543 215630 92355 61266 132194 -65088 413105 -270 -32638 -12455
12499 203943 49816 112501 -49868 -74361 -9305 -129933 424985 -87922 269212 49861 -150928
12487 163748 -66816 45494 -85788 -49263 76446 137678 -135882 149247 -144170 227140 -311599
12475 120482 87224 -128258 -36822 -432438 -112369 -61805 -109446 176968 30497 -171440
12464 296921 245276 176098 -15979 -109946 67598 -155456 -144011 -403848 -485350 437734 -317593
12452 -80928 -28653 78909 327193 -42730 -69948 201277 329257 -17518 -241809 -205456 -181638
12441a81638o4727A4213b43453B91248A6811K1204h9330r7330E2705f9604k73193
12430c42797a54785g208B6116a20618A6739J77172f5406E3310a05505L2180r6285
12419a69610n0888C31303A09154D475c80533B95406g2161A75816q6197k6611c933
12407A09683d4667J3171j07313j6978j0873j01878a21195b8155l8913A20353c12290
12395E6361h5633l4599B4134K68508a48542e9967K3870B22798D4959a436j59102
12384a60538F7619O0754J54070A16591i2295j5371A13556Q2678I3487g6367L7800
12373c8567l9843D8710f5124A03563J2473a92802f1472a2881A04441b78175A03207
12361A17462d4335m5423m28037a64079k13505R0501O3344D604c4288r0269G7184
$$ plain form
12441 -181638 -246365 14213 -243453 291248 16811 38015 -89330 -186660 52705 -69604 -342797
12430 -342797 -154785 -7208 26116 -120618 16739 193911 -65406 53310 -105505 -73325 -169610
12419 -169610 -220498 331303 109154 4475 -380533 295406 -72161 175816 89619 63008 -3933
12407 109683 -44667 -31496 -138809 -155787 -166660 -268538 -121195 -28155 -67068 120353 -312290
12395 56361 -85633 -120232 24134 292642 -148542 -59967 -36097 222798 44959 -1436 -160538
12384 -160538 67619 128373 282443 116591 -92295 -107666 113556 196234 93487 -76367 -38567
12373 -38567 -78410 48710 -65124 103563 116036 -192802 -61472 -12881 104441 -278175 103207
12361 117462 -44335 -89758 -517795 -164079 -377584 -287083 -223739 4604 -34288 -124557 77184
12349A82677d11802A84530k2602f2443m229k11310E1426i1125j7602l15643e3078
12337b99165C7947h9985E0636b31294A70649a36190l1893N9985I1540b0195I1165
12325a38852c1639A45354a12074A29178i2137A38460K878C3795A5N7096a58493
12313c25682c993g11A07081C9387J19301g6842C2007a2156j37321f3187j75940
12302b39127I307K28629J46032a30041F102J17056a96309A55768B002b52180A4295
12290A6760O9781A2011J1854B661d7877a7579l0343A20581i8215C20104A14635
12278G7790a6361A63332b1602A64455J0974J42489G6698j8438a05619M6611b8473
12266D3086J30601n4027J8990K93667j69415l2946J5878J14607d255B21675J67469
$$ plain form
12349 182677 -411802 184530 161928 -62443 -66672 -277982 51426 -91125 -108727 -424370 -53078
12337 -299165 37947 -89985 50636 -231294 170649 -136190 -168083 -108098 91540 -20195 91165
12325 -138852 -31639 145354 -112074 129178 -92137 138460 141338 33795 15 57111 -158493
12313 -325682 -3993 -711 107081 39387 158688 -76842 32007 -12156 -149477 -63187 -239127
12302 -239127 9307 237936 383968 -130041 6102 123158 -196309 155768 2002 -252180 14295
12290 16760 86541 12011 23865 2661 -47877 -17579 -47922 120581 -98215 320104 114635
12278 77790 -16361 163332 -21602 164455 175429 317918 76698 58260 -105619 -59008 -28473
12266 43086 173687 119660 138650 432317 262902 229956 245834 360441 -4255 221675 389144
12255C89144c2859E6150f402B14215H2077a12541D71659A38689a55949C620J72003
12244A75623D0484K34976i6198A72558J3199B1989O5026j9916j153H177K16365
12233B24542L868g561k06472B20465N1921J40427d8877A16203J45787M9958l9031
12222B72917M4097K45902q9579D0640f9047B08411J01874a27547B396J83471D6497
12210a27782A48082A4082h5945D4946C048b9778B59422M151M5771j20632b7995
12198B30720m9663O1019j18979b48160a8309A63218j1363K3491B2406b8904B55352
12186E39538H632K48791A09538l4083f9375H9971J34009a56613A89810E5863J38966
12175A94829J60201a32683B56773I6798a95008B99197a595C59379h8648M0820
$$ plain form
12255 389144 -32859 56150 -6402 214215 82077 -112541 471659 138689 -155949 3620 175623
12244 175623 40484 275460 -96198 172558 185757 21989 87015 67099 65946 8177 224542
12233 224542 228410 -7561 -214033 220465 272386 412813 -48877 116203 261990 311948 272917
12222 272917 317014 562916 473337 40640 -69047 208411 310285 -127547 2396 185867 46497
12210 -127782 148082 14082 -85945 44946 3048 -29778 259422 263573 309344 188712 -27995
12198 230720 181057 242076 123097 -248160 -18309 163218 151855 175346 22406 -28904 255352
12186 539538 8632 257423 109538 75455 -69375 89971 223980 -156613 189810 55863 194829
12175 194829 355030 -132683 256773 96798 -195008 299197 -1595 359379 -88648 -47828
12165d7828E3051a62654H9178J41797a03211m9861O3808c1885c565E6678J76514
12154B33192m6338b09371A04225I615J32654c8102C09443A31788k4743K14775
12144C21820A42705j0777J15947d4768j4508j59596i4474B47662J40778q5599
12134C02841e7532A33994a6161A60098b57480H5836i5146C54909i8814A83601
12123b31687A04094b89400C8689J49920h4559A2593L80624j60293a28290A01008
12112a12040k1849r6258a2736k26899f4116B96595K1135G0150a84410F6904b30309
12100a0841D1817f7050J6206j10418F6111a98907l9073F4702P8675a16927F716
12088H6640Q4117h350C0870a77310H3231a56976b9774A05783h757D29663A83620
$$ plain form
12165 -47828 53051 -162654 89178 230975 -103211 -153072 -89264 -31885 -3565 56678 233192
12154 233192 186854 -209371 104225 9615 142269 -38102 309443 131788 107045 321820
12144 321820 142705 131928 247875 -44768 -59276 -218872 -94474 247662 388440 302841
12134 302841 -57532 133994 -16161 160098 -257480 85836 -95146 354909 -98814 183601
12123 -231687 104094 -289400 38689 188609 -84559 12593 393217 232924 -128290 101008
12112 -112040 -133889 -230147 -12736 -239635 -64116 296595 317730 70150 -184410 66904 -230309
12100 -10841 41817 -67050 -50844 -161262 66111 -198907 -237980 64702 143377 -116927 6716
12088 86640 170757 -8350 30870 -177310 83231 -156976 -29774 105783 -8757 429663 183620
12076E60396K40223Q23687F84956C27934j54477a87042B01690a52374C01556f4716
12065G2979A4618i5996k86345B54255C2355n857J32930g0169a0223j06407p1924
12054a88554A1145b79462B17111D2032J59227b59031c5405B98925a02209A67233
12043a38048b9496B24855g1776J0704k32749C8251R2143E5434f8926B55431a97938
12031f3367G4097a68077k8526k4182g0651H8168a56416j53561P4471B44080A16452
12019c09410d2585m7947q1303O7136a60A65208e8296j92684b7612H5688c4957
12007E24940D4689K08893h5984b8896j87615F5966J2020d0782k17588b5063k49995
11996b75058A20607D2096a926m15930d0867B9330J11670J72949j13590c60179
$$ plain form
12076 560396 800619 1624306 684956 327934 173457 -187042 201690 -152374 301556 -64716
12065 72979 14618 -95996 -382341 254255 32355 26498 159428 -70169 -10223 -116630 -188554
12054 -188554 11145 -279462 217111 42032 201259 -259031 -35405 298925 -102209 167233
12043 -138048 -29496 224855 -71776 -61072 -293821 38251 130394 55434 -68926 255431 -197938
12031 -63367 74097 -168077 -196603 -220785 -70651 88168 -156416 -309977 -235506 244080 116452
12019 -309410 -42585 -90532 -171835 -104699 -160 165208 -58296 -250980 -27612 85688 -34957
12007 524940 44689 253582 -85984 -28896 -216511 65966 77986 -40782 -258370 -25063 -275058
11996 -275058 120607 42096 -1926 -417856 -40867 29330 141000 313949 200359 -360179
11985A5407J62333E7537l147K17094J72997H0014a63719q2533c9220B848c35222
11973B33986b25447A29269n7543J17791b36964J00041j05835H4042a72756j07931
11963b80687D1896i9456p3886j13109c7734B19425g5533j09425M3541f2551A49357
11951a95055k11796a84621B80300a11314A66411G6185J12015B391J9111a21443
11940d33317A23587K6703f8061o3223H5004F644J43710a13325J3388a4835D7332
11928C73179d7610A23333d13705a31340G7011J84036J52809D0183P4265d4098
11917A90118a45523A75208A8321f5484j79591A27681a14251I6287a18974A88345
11906A66770a76773P4188K6694A04851d4032p1705l969A89205H6149a50375J0394
$$ plain form
11985 15407 177740 57537 54390 271484 444481 80014 -163719 -246252 -39220 2848 -335222
11973 233986 -225447 129269 71726 189517 -236964 -136923 -242758 84042 -172756 -280687
11963 -280687 41896 -99456 -173342 -286451 -37734 219425 -75533 -184958 -141417 -62551 149357
11951 -195055 -406851 -184621 280300 -111314 166411 76185 188200 2391 21502 -121443
11940 -433317 123587 150290 -68061 -131284 85004 6644 150354 -113325 -99937 -14835 47332
11928 373179 -47610 123333 -413705 -131340 77011 261047 413856 40183 114448 -44098
11917 190118 -145523 175208 18321 -65484 -245075 127681 -114251 96287 -118974 188345
11906 166770 -176773 -102585 -75891 104851 -44032 -115737 -119706 189205 86149 -150375 -139981
11895a39981B06239o1611d1413j28671A77296m139c7149A41915e6564E348J63878
11884A69226D2821a86097p5933a02065A00398c2727k90351J32914H9437b9633
11873A79801D4153J03499K2173b88110a6980j1019e070k20191O2919p3210D1771
11861b3219A64924a78128k3698a4952B37903H8423b24993a3706D1388J42091c70765
11849c45804f2844A54713k2262d14476J86066K0593A0241a4645A74551h7074D3368
11837B61096A09588c91608h4558l28115G7599J754i1645r8267E4743J13640p9083
11826H9300b79396F4667J10887G3138a59942r768f4912k88015R6143F0306i9843
11814E2243b30409I9210f0580A07038b25057j531j2159F0448J09572a05318E1857
$$ plain form
11895 -139981 206239 144628 -41413 -170084 177296 173157 -37149 141915 -56564 5348 169226
11884 169226 42821 -186097 -262030 -102065 100398 -32727 -323078 -190164 89437 -29633
11873 179801 44153 147652 169825 -288110 -16980 -27999 -5070 -225261 -162342 -235552 41771
11861 -23219 164924 -178128 -201826 -14952 237903 88423 -224993 -13706 41388 183479 -370765
11849 -345804 -62844 154713 132451 -414476 -228410 -207817 10241 -14645 174551 -87074 43368
11837 261096 109588 -391608 -84558 -412673 77599 79353 -91645 -189912 54743 168383 89300
11826 89300 -279396 64667 175554 73138 -159942 -169710 -64912 -352927 -256784 60306 -99843
11814 52243 -230409 99210 -60580 107038 -225057 -226588 -238747 60448 170020 -105318 51857
11802A49693E6120Q5206b03369H1543a13811j39980P5996N8997k3884k22229d4892
11790g8548j58877G1990a03101I1848e440B92988a66761I6932L8039D9135b3516
11778e6114b5510F2317a71968E5960e4756k21848M0141N5684g2027H6939b77556
11766E0646h023j8210B13721r6625f0422j65550j6830A68474e3206A27436c2069
11754f8183j41681a2348j07890B88896j26265g15j24764C5119J12708c28235A8802
11742A19431f568j05852A33952Q0479I4517b82117b3425C73581A85274e5255K5153
11731c0102p3886E0668O7414R6942b45983A8618b41365O0732J1584h994A81330
11719B34801B4148d97522B76271b45622A62199B4571J00610a76653Q5655C6321
$$ plain form
11802 149693 56120 141326 -203369 81543 -113811 -253791 -177795 -118798 -142682 -364911 -44892
11790 -78548 -237425 71990 -103101 91848 -5440 292988 -166761 96932 134971 49135 -23516
11778 -56114 -25510 62317 -171968 55960 -54756 -276604 -236463 -180779 -72027 86939 -277556
11766 50646 -8023 -26233 213721 117096 -60422 -225972 -242802 168474 -53206 127436 -32069
11754 -68183 -209864 -12348 -120238 288896 162631 -715 -125479 35119 147827 -328235 18802
11742 119431 -6568 -112420 133952 214431 94517 -282117 -23425 373581 185274 -55255 -30102
11731 -30102 -103988 50668 118082 215024 -245983 18618 -241365 -180633 -169049 -8994 181330
11719 234801 24148 -497522 276271 -245622 162199 24571 125181 -176653 -90998 36321
11708a04340E48778h0568A63759b1544c907H5627e1821I2291a73065e1433F9081
11696A45132D1791K25906i9841B36100o1590M2011i8641B0413c0810a4141C55378
11684c0427A66482K15751E6121j855g3383r8984A44188l793K16924l7068a05278
11672h0370A49645N2289l9464C4479c27024D8468K21143g5495E4461K43119b16516
11660B80620e7934I8895a80785A2802O6598b7973n1230B2620O6310L4650E0485
11648A85175B8603K9552a31230E1645N7050b20120K4496A22523K6847n6211g6212
11636C45349j27844a6510C60955A28677R6592a04608A38847J72308a13639e1423
11625a41775A30261J05237A0537c59358A10928a22294l19726C6394L39309B3098
$$ plain form
11708 -104340 548778 -80568 163759 -21544 -3907 85627 -51821 92291 -173065 -51433 69081
11696 145132 41791 267697 -99841 236100 174510 216521 -98641 20413 -30810 -14141 355378
11684 -30427 166482 382233 56121 54266 -73383 -172367 144188 140395 357319 320251 -105278
11672 -80370 149645 201934 162470 34479 -327024 48468 269611 -75495 54461 297580 -216516
11660 280620 -57934 98895 -180785 12802 79400 -27973 -79203 22620 88930 123580 50485
11648 185175 28603 58155 -131230 51645 108695 -220120 -195624 122523 149370 93159 -76212
11636 345349 217505 -16510 360955 128677 225269 -104608 138847 311155 -113639 -51423
11625 -141775 130261 235498 10537 -359358 110928 -122294 -442020 36394 375703 23098
11614I8785a17563B6739a44845R35B05057a55980H1662a9742j2529k12228L471
11603b41028E116a04486I2407O8059p5618a24492A66831k9847a40760e8016K2887
11592c5129A28724F359R5961a93407F2788D517J16678L97494h4779k1201B20948
11580h0935j08840B86319e7807j9055j9855D9191K38666B21L87434f28H4451K46693
11568C31144A35927a19055B228g2758j4611G1619a26135B51757C1315e7067A18501
11556A96563I6746l2904f6477B17622k4483J77020C0585b9949j42211d4772n8937
11545a03709C2541e6441A06942b7887j13787A02430K60000a88194F1293c516m1552
11534d5068C41157A46575K49957m6717b2929k44900H6c5505F5424j9537J91126
$$ plain form
11614 98785 -117563 26739 -144845 -143910 205057 -155980 81662 -19742 -32271 -244499 -241028
11603 -241028 5116 -104486 92407 160466 84848 -124492 166831 136984 -140760 -58016 -35129
11592 -35129 128724 6359 102320 -193407 62788 4517 121195 518689 -84779 -105980 220948
11580 -80935 -189775 286319 -57807 -76862 -96717 49191 287857 221 387655 -628 84451 331144
11568 331144 135927 -119055 2228 -72758 -87369 71619 -126135 251757 31315 -57067 118501
11556 196563 96746 63842 -66477 217622 193139 370159 30585 -29949 -172160 -44772 -103709
11545 -103709 32541 -56441 106942 -27887 -141674 102430 362430 -188194 61293 -3516 -45068
11534 -45068 341157 146575 396532 349815 -22929 -267829 86 -35505 65424 45887 237013
11523B37013E3780d3282B80476F4685d4818H8240J77502c2090B60781a6809F783
11511B1170a25216B60368j00360C6251J8723P9202j0444a11980C99421j69554
11501B29867R2208a26630B47455p9481k2730a1228n7460A47348a14040B62629
11490C55349j75633a80760C40641j05848A02831i8070A20715f943A0343c01854
11479A08730r894L21447H2374a54380b8318B45450I5094L479J7711K12402d9863
11467A12765Q7205J707N4041R8319j20412l6209J30681C5633e520B19342D5987
11455a56450D4682A715b7255m4113Q566D2475a16612E5008K07401E2043J51527
11444B03570h376j14052d0822j80331C5953j2998b22595B08576a2650c446j24613
$$ plain form
11523 237013 53780 -43282 280476 64685 -44818 88240 265742 -32090 260781 -16809 6783
11511 21170 -125216 260368 160008 36251 54974 134176 123732 -111980 399421 229867
11501 229867 322075 -126630 247455 167974 145244 -11228 -68688 147348 -114040 262629
11490 355349 179716 -180760 340641 234793 102831 -98070 120715 -6943 10343 -301854
11479 108730 98836 420283 82374 -154380 -28318 245450 95094 98573 116284 328686 -49863
11467 112765 199970 201677 255718 354037 233625 197416 328097 35633 -5520 219342 45987
11455 -156450 44682 1715 -27255 -71368 -62802 42475 -116612 55008 262409 52043 203570
11444 203570 -8376 -122428 -40822 -221153 35953 22955 -222595 208576 -12650 -3446 -128059
11433a28059L7971A78828F5724d6643B12593K4757b30774A97457k8259c04760
11422b77077O9297A43798h0243B34530G5492g9671E9954B4789M41037a30197k7320
11411a57517L3209E3955a04931F5566k7791b64647D02744I2279N3984M3648p4353
11400A15558J34482K7626h3121c0878B67923g3550L3914A30272M863A0825Q7147
11389I7972c75126D3659b5737o6690j0402J8137A57245a46490c350j02456D3988
11377A02859a73526e3010m6538A77034J75209G4722P1076a88043C6197c58035
11366H3997O1863b41275o6694h1490o3729k26124E62193b21721g7129m2031L6524
11355h2636A4578J99817I6752O2120b21643F1949B1882a12193B19706r6273a1119
$$ plain form
11433 -128059 -90088 178828 65724 -46643 212593 237350 -230774 197457 169198 -304760
11422 -277077 -207780 143798 -80243 234530 75492 -79671 59954 24789 465826 -130197 -157517
11411 -157517 -124308 53955 -104931 65566 37775 -264647 402744 92279 146263 189911 115558
11400 115558 250040 277666 -83121 -30878 267923 -73550 -39636 130272 135135 10825 97972
11389 97972 -375126 43659 -25737 -92427 -102829 -84692 157245 -146490 -3350 -105806 43988
11377 102859 -173526 -53010 -99548 177034 352243 74722 145798 -188043 36197 -358035
11366 83997 145860 -241275 -307969 -81490 -145219 -371343 562193 -221721 -77129 -119160 -82636
11355 -82636 14578 214395 96752 158872 -221643 61949 21882 -112193 219706 123433 -11119
11343a4782B28086A05609a46760G5277b6638R825k79528h1395F133J17749F0722
11331a79670o2839g5558c5376D29773a36879B06436B432a94186D593J78694M7317
11320B30604c81952A60895B9744C485P0416d35570A14959c4106l90105g3673B7519
11308F6208a50046B4498a94949A48748d58262h1890I364J54423g8909l70427H6389
11296e7946L150A37039a33698q2345J02137e3649l9372A14939K334J78209r3535
11285B01947o1453e8496D5668b07035c269C02667A17603L09601A49051a60866
11274B01015b61631N5265k19830E2712J9055K92a59151B4531K6307L0690a19046
11262e9555h581j60448M3900C16623a26731p5490b4230h125k4648j75776R8638
$$ plain form
11343 -14782 228086 105609 -146760 75277 -26638 -16813 -296341 -81395 6133 123882 60722
11331 -179670 -242509 -75558 -35376 429773 -136879 206436 2432 -194186 4593 183287 230604
11320 230604 -381952 160895 29744 3485 73901 -435570 114959 -34106 -424211 -73673 27519
11308 66208 -150046 24498 -194949 148748 -458262 -81890 9364 163787 -78909 -449336 86389
11296 -57946 -54796 137039 -133698 -216043 -113906 -53649 -93021 114939 117273 295482 201947
11285 201947 140494 -58496 45668 -207035 -3269 302667 117603 427204 149051 -160866
11274 201015 -261631 -206366 -426196 52712 71767 72059 -159151 24531 50838 81528 -119046
11262 -59555 -8581 -169029 -125129 316623 -126731 -202221 -24230 -8125 -32773 -208549 -109911
11251a09911D31037A26351a04684J2636B85029a59786A96441c46114B45630b27246
11240g0202l517p8096H1358R9958a02612j2457j6161k02660E3857g2204L2400
11229c9804p1023d3052A4410J05103M2263e3885A19067j4861f618j0081l26660
11218c43359F1419J17116g6855j43856k17581J70234C51554j19940a19429a1437
11207A00443a41578k6974O1845B20481f7201j86184B66422a17064B37749a81828
11196g3205k45741n8931A61678J77392a749A41894J19030n7834q4109k4423a59160
11184A17775b10124O602B33859j12688d72138G7754B6771a55868j55613r8413
11174d09894G4420a59807n3273I8163d4144B07889b85429F3355L1041J10626i0837
$$ plain form
11251 -109911 431037 126351 -104684 -92048 285029 -159786 196441 -346114 245630 -227246
11240 -70202 -73719 -151815 81358 181316 -102612 -115069 -131230 -333890 53857 -72204 -39804
11229 -39804 -110827 -43052 14410 119513 161776 -53885 119067 104206 -6618 -16699 -343359
11218 -343359 61419 178535 -76855 -220711 -438292 -268058 351554 231614 -119429 -11437
11207 100443 -141578 -168552 -106707 220481 -67201 -253385 266422 -117064 237749 -181828
11196 -73205 -318946 -377877 161678 339070 -1749 141894 260924 203090 118981 94558 -159160
11184 117775 -210124 -203522 233859 121171 -472138 77754 26771 -155868 -311481 -409894
11174 -409894 74420 -159807 -213080 98163 -44144 207889 -285429 63355 94396 205022 -90837
11162a65174O3070r9927E6816i6642o1821A8990a7581l22465c4351J7139q6944
11151a04156l3532F3368a3780q3027M7082j05009A54169a96748B90312H626c7609
11139e5567B4442d7319A3484J1814K2682k0632a93654b3332E8666g9086L4073
11128d5013a0462j96296q9959A71466a61005H3983a9027B08954B7766K15037R5349
11117C38152A07895A0854K17603j01612J02535a89361B82587j457P026H4072J91581
11106B75653E0270h9383E1076k425K81118A55035g1205B20227K04528j10500a16341
11094A52414O526K39075a6324C37339j55423K0662j1765H3208A0726J6210K60806
11083B87742K1941J19171j79592l3977p0527L47914A28495M8285K23445j70315
$$ plain form
11162 -165174 -102104 -202031 56816 -96642 -158463 18990 -17581 -340046 -34351 -17212 -104156
11151 -104156 -137688 63368 -13780 -96807 -49725 -154734 154169 -196748 290312 8626 -37609
11139 -55567 24442 -47319 13484 25298 47980 27348 -193654 -23332 58666 -79086 -45013
11128 -45013 -10462 -206758 -296717 171466 -161005 83983 -19027 208954 27766 242803 338152
11117 338152 107895 10854 228457 126845 229380 -189361 282587 281130 288156 84072 275653
11106 275653 50270 -89383 51076 48651 329769 155035 -71205 220227 424755 314255 -116341
11094 152414 158940 398015 -16324 337339 181916 202578 190813 83208 10726 26936 287742
11083 287742 309683 428854 249262 215285 144758 492672 128495 176780 400225 229910
11073B29910a60980B39292J93864I0726J35840j03883K96746J16755k06619J89721
11063E19286B39862K61925B32860J41862K12375k37887j23168J00362K06705P732
11053E40841K22480j09681J73792k47851K95136J33901j32177l84147O7274M71260
11043A030828n12802K71610l07708K78709J5988J93030m51738O9083K13991k86831
11033E14160K29862j03051k28598M05314C98485N43434k72131p2661K64838q0545
11023G81420J10419D20293L30975Q7612k83214r0122J27566R453j68578n978j2158
11012D15849J56410j16117L61979k98731m2703J11889o7008j56606J62377l9220
11002D88119k7562J32294K47935C01928L57729k39209L3339L99544l00541J00248
$$ plain form
11073 229910 -160980 239292 433156 90726 226566 122683 419429 536184 329565 519286
11063 519286 239862 501787 232860 374722 587097 349210 226042 326404 533109 540841
11053 540841 763321 653640 827432 579581 874717 1008618 876441 492294 559568 1030828
11043 1030828 518026 789636 481928 760637 776625 969655 517917 587000 800991 514160
11033 514160 744022 640971 412373 817687 398485 941919 669788 597127 861965 781420
11023 781420 891839 420293 751268 838880 555666 465544 593110 602563 433985 428007 415849
11012 415849 572259 456142 818121 519390 476687 588576 521568 364962 527339 488119
11002 488119 460557 592851 840786 301928 659657 420448 453787 853331 552790 653038
10992F53038l11880K37747L34505m49422N30281o3378J31578C54906P84107K5717
10982A164730O8090n9667o7976J05677M25892J63104p4391N5650L91309P32698
10972B905116k11973J93469j29735l49044q8761J28789m11712k79687m00442q9890
10962A266130p96N06402k49878K8930k12774K40895J51470l33260l5861k46991
10952A114267K04658m01597J92548n40540M7487L8678m8506p7003j42281j32359
10942B55352g5422E20059B35204K40041B04728Q6482A07405M2077b5529A40025
10931C63872g1330A86181J78069a85251E1754K00002h6687j49654e5566b5179
10920a01936H2879g4174j8537E07321H8681e6688l7645E4928h5787I3895c41961
$$ plain form
10992 653038 341158 578905 913410 463988 994269 930891 1062469 354906 1139013 1164730
10982 1164730 1232820 1173153 1105177 1210854 1636746 1799850 1725459 1781109 2172418 2905116
10972 2905116 2693143 2886612 2756877 2407833 2319072 2447861 2036149 1756462 1356020 1266130
10962 1266130 1265334 1771736 1521858 1550788 1338014 1578909 1730379 1397119 1361258 1114267
10952 1114267 1318925 917328 1109876 569336 616823 655501 606995 529992 387711 255352
10942 255352 -75422 520059 235204 475245 204728 291210 107405 149482 -25529 140025
10931 363872 -71330 186181 364250 -185251 51754 251756 -86687 -236341 -55566 -25179
10920 -101936 82879 -74174 -92711 507321 88681 -56688 -94333 54928 -85787 93895 -341961
10908b31767A21096a24233C3303d2692j05622G1381a80431c3945r1758A4958a71263
10896A22391d6340I8453k5052A9749K63193A18579J7127g4318k0678A26815a05970
10884c24386A15074J55000a11042K0669j47883B78445j626a39825A33351A2738
10873b17268j57173a07501l3104D01503a48441A73157a64900L6612G8375Q8478
10863A66853a58166L5283e121k45918E1305e9894B77166E1730N3893B5969e0221
10851A86448m2211b74067a0746B70051A15718E2033J0584B3663a04260G5421a25723
10839F86f2265B47321q9752o9425a98850A8847g2297f202A63084A2764K1585f2734
10826a59209O3447a4156A16657J02603a41300l6290l28534b34793h9655A50849
$$ plain form
10908 -231767 121096 -124233 33303 -42692 -148314 71381 -180431 -33945 -125703 14958 -171263
10896 122391 -46340 98453 73401 19749 282942 118579 135706 -74318 -94996 126815 -105970
10884 -324386 115074 270074 -111042 -90373 -238256 278445 276819 -139825 133351 12738
10873 -217268 -374441 -107501 -140605 401503 -148441 173157 -164900 -128288 78375 166853
10863 166853 -158166 -122883 -5121 -251039 51305 -59894 277166 51730 105623 25969 -50221
10851 186448 144237 -274067 -10746 270051 115718 52033 62617 23663 -104260 75421 -125723
10839 686 -62265 247321 157569 88144 -198850 18847 -72297 -6202 163084 12764 34349 -62734
10826 -159209 -95762 -14156 116657 219260 -141300 -177590 -506124 -234793 -89655 150849
10815a27562C6901a47703q1898M4324C35744a62003C63319a38523j5293j96113
10805c49929J0844R46R9538g3360j42514G8142a61653a8042A59290b22693E9711
10793B77982m3826b45926D089a07846r654j3499a2968A4684a66155B16779C8125
10781b46240A60079C32b44986A93079b20438B71051a47530B95460j41838b9751
10770A77245J15801H027N2017a90652J7117C304d3237B09231b58065C2338J08834
10759A41172b14560n0852c4026k44201f7795H4641c74209a5538C36418a5527j10373
10748a25900L9647A3860c5921j91808H6038Q1743b9997A61881b18102d3919k22968
10737b66887Q7257F1522a63860j57567a7829g18j83509E8868b72963a0293k72269
$$ plain form
10815 -127562 36901 -147703 -229601 -185277 335744 -162003 363319 -138523 -153816 -349929
10805 -349929 -339085 -338139 -238601 -73360 -215874 78142 -161653 -18042 159290 -222693 59711
10793 277982 234156 -245926 4089 -107846 -117500 -130999 -12968 14684 -166155 216779 38125
10781 -246240 160079 332 -244986 193079 -220438 271051 -147530 295460 153622 -29751
10770 177245 293046 8027 60044 -190652 -173535 3304 -43237 209231 -258065 32338 141172
10759 141172 -214560 -265412 -34026 -278227 -67795 84641 -374209 -15538 336418 -15527 -125900
10748 -125900 -86253 13860 -35921 -227729 86038 167781 -29997 161881 -218102 -43919 -266887
10737 -266887 -179630 61522 -163860 -321427 -17829 -718 -184227 58868 -272963 -10293 -282562
10726b82562E3823b44879M0027R4934k8009r650b0460j10596A2428L6508O0671
10715A09607h4432C48224J7289a14873F0552N302R6497m9312a25448N1959q211
10704h1700j6725k01380J11498B356a61673K9479l7263B36889a51358C9679L01059
10693C40738g8356A86156A474b56423a27934j84030G3203c06164a6663j54886
10683a71549b7032B0216c05458d552m18920E5875a78238c5002n3605K2862D3079
10671C0795a03448I7141h4210a088C09003A32120q563b01084c8811k8441J9896
10660d7356C5311K81252b26662o9652A26070a55124c2745A44126b16472d9338
10649f9158A76864b50133C8632c88745B9183b22697e1781b618j56536n0183b7226
$$ plain form
10726 -282562 53823 -244879 -204852 -109918 -137927 -147577 -20460 -131056 12428 48936 109607
10715 109607 -84432 348224 365513 -114873 60552 65854 162351 113039 -125448 -73489 -81700
10704 -81700 -98425 -299805 -188307 2356 -161673 -132194 -169457 236889 -151358 39679 340738
10693 340738 -78356 186156 1474 -256423 -127934 -311964 73203 -306164 -16663 -171549
10683 -171549 -27032 20216 -305458 -4552 -423472 55875 -178238 -35002 -88607 -65745 43079
10671 30795 -103448 97141 -84210 -1088 309003 132120 123557 -201084 -38811 -67252 -47356
10660 -47356 35311 316563 -226662 -296314 126070 -155124 -32745 144126 -216472 -49338
10649 -69158 176864 -250133 38632 -388745 29183 -222697 -51781 -2618 -159154 -209337 -27226
10637B94231e9401a3760G0571J06201m6149a98681B31276d24670a75481k0448
10627a95929M4760B2340J57993d6622p1346B0814J58498L00C3691a01084J1316
10616h9768p9774L7768D9194a14850j22982K8428f1314b1158p5000e550r1574
10605i7124E0887a9009D1458A8153c4342D0798J04500c5815H1518J30679a8270
10593E0670b35883J9309I3127k4219c12602D3808a11162A37044B7164J19400a67374
10581b73875d1885k7920c254k0858l290k42361A03530a0202j12198A42526d7195
10569a49976k24803c6377g451F3569b92116a33376A21970m7889a48272N7435L7104
10558e3733b0805A76108d4274p3437j65071A13089a42234j98375G1950C4744K18156
$$ plain form
10637 294231 -59401 -13760 70571 176772 130623 -198681 231276 -424670 -175481 -195929
10627 -195929 -151169 22340 180333 -46622 -117968 20814 179312 179612 33691 -101084 -89768
10616 -89768 -169542 -131774 49194 -114850 -237832 -209404 -61314 -21158 -96158 -5550 -97124
10605 -97124 50887 -19009 41458 18153 -34342 40798 145298 -35815 81518 212197 -18270
10593 50670 -235883 -216574 93127 68908 -312602 43808 -111162 137044 27164 146564 -167374
10581 -273875 -41885 -69805 -3254 -24112 -27402 -269763 103530 -10202 -122400 142526 -47195
10569 -149976 -374779 -36377 -7451 63569 -292116 -133376 121970 74081 -148272 -90837 -53733
10558 -53733 -20805 176108 -44274 -117711 -282782 113089 -142234 -340609 71950 34744 252900
10547B52900A13451M3155l8655b59020c8965F1151J47445a17063N6836B92156
10536A5974e5294j65232B1791c35678F816b5983k47632J3029C44668a04221I6338
10524c13720B2553M1610f6992B49191a91200b7784C4090J06337l5436j2462c25081
10512c18471A88476a07500O569q2009B63693D4665L25686A34184a68218Q3306
10502h4912j11025F4710F44a40812A1852L3155b8277D479J86188i076j40038j08343
10490b57457J07086b1384D6051J8932a26932C80445A42071J36218K42505A47971
10479C46670o3398J48046A95731M7011b47820a8431p3102p553B57214E6134b92234
10467a82068d0265B61580G0343e5550k29737h0321C54268d7109j99726C09350
$$ plain form
10547 252900 113451 156606 117951 -259020 -38965 61151 208596 -117063 -60227 292156
10536 15974 -55294 -220526 21791 -335678 6816 -25983 -273615 -260586 344668 -104221 96338
10524 -313720 22553 64163 -66992 249191 -191200 -27784 34090 140427 104991 92529 -325081
10512 -318471 188476 -107500 -100931 -182940 263693 44665 370351 134184 -168218 -84912
10502 -84912 -195937 64710 644 -140812 11852 45007 -28277 4479 190667 -9076 -149114 -257457
10490 -257457 -150371 -21384 46051 64983 -126932 380445 142071 278289 520794 147971
10479 346670 283272 431318 195731 242742 -247820 -18431 -91533 -99086 257214 56134 -292234
10467 -182068 -40265 261580 70343 -55550 -285287 -80321 354268 -47109 -246835 309350
10456A35958a97756A33289c07320a35160d2876A29029a44623F7427J7961a96978
10445E325J5631b09898q841H8061k8851f2844A01870a15637j39343J2548D3880
10433I4631b2310k041A24553n6666E975J52407a12331b6868A99877B0704K01304
10422B22008a55526B2450R9716a1158C6680K18483j17648R9748i3633j12553O0207
10411a45979A12816D52b09940a5716o2112j15484B32269j11701b85836e3832c91
10399i3088j9688B9658a48137c1457A38793O0901l4861n839J69037j47302a63452
10387A57286b5818B8026q823J57207L08672A27280g7069B92564m8824m4361g8056
10375c6587D61364a5034A65658D2655L22488j04739j15994K93479g4233D39257
$$ plain form
10456 135958 -197756 133289 -307320 -135160 -42876 129029 -144623 67427 85388 -196978
10445 5325 20956 -209898 -218739 88061 59210 -62844 101870 -115637 -254980 -242432 43880
10433 94631 -22310 -24351 124553 67887 5975 158382 -112331 -26868 199877 20704 222008
10422 222008 -155526 22450 122166 -11158 36680 255163 137515 237263 -93633 -206186 -145979
10411 -145979 112816 452 -209940 -15716 -77828 -193312 232269 120568 -285836 -53832 -391
10399 -93088 -112776 29658 -148137 -31457 138793 199694 164833 158994 328031 180729 -163452
10387 157286 -25818 28026 19203 176410 485082 127280 -77069 292564 243740 199379 -78056
10375 -36587 461364 -15034 165658 42655 365143 260404 144410 437889 -74233 439257
10364A70115L73965B03270q517F5548K76636c9585A52692P4145c4125C19740n4976
10353B64764E4409N10261B09477M99154j95248l979A27653N5722K99856O6549
10343E49780A09330l5221a18302C34263j13867R5603I3810J05634q549A9505R0154
10332A09659j5433a72257B3927J54433Q5719K8541l024e4531j72118B89536k8832
10321B60704a11711B43082i7573c5033A94616b4476C78021j51995F2413B9410
10310B3034a50775B405d25133f6257J3265j87207a1671B08540q1720J01381D2106
10298H9519i930A55988a20156p6477i1134b9275a3970A05735c7089q0196E491
10286a79880F8686a19562A3286i3570K5355j13963A64195b27052C8072L1000a86826
$$ plain form
10364 170115 544080 203270 194753 65548 342184 -39585 152692 226837 -34125 319740 264764
10353 264764 54409 564670 209477 708631 513383 509404 127653 183375 483231 549780
10343 549780 109330 74109 -118302 334263 220396 315999 93810 199444 190895 19505 109659
10332 109659 94226 -172257 23927 178360 264079 292620 289596 -54531 -226649 289536 260704
10321 260704 -111711 243082 -97573 -35033 194616 -24476 378021 226026 62413 29410
10310 23034 -150775 2405 -425133 -66257 -52992 -240199 -11671 208540 126820 228201 42106
10298 89519 -9930 155988 -120156 -196633 -91134 -29275 -13970 105735 -37089 -117285 5491
10286 -179880 68686 -119562 13286 -93570 -68215 -182178 164195 -227052 38072 69072 -186826
10274h8630o484D4185d61353d5360J8091a328j13378j51544H9063J01133Q0442
10263B70638o7629b351A20812J53837P4850R8932I8622L62261A18432J93276j50724
10252A60984C7289i7053B29095a45464A29713a76417j20697R9488Q5473A19216
10241A08373c07657a09512j03131P3937l04880A43386i5231n7676C1535hj01248
10230a01256A36516I104c5200A34790a59723H4669D0460J7141K7899a50441I5103
10218a11276j26848O4123N4521o4559A67609r964a851m7628k372I4504c9050a2192
10205b77257N8813b270A44490P348f4959e014l39281I895a20067k9259B15871
10193A81047M67846b67480I368d4210A15866M4007c62749A29914D5822g914G3943
$$ plain form
10274 -88630 -95114 44185 -461353 -45360 -27269 -1328 -114706 -266250 89063 190196 270638
10263 270638 203009 -2351 120812 274649 349499 448431 98622 460883 118432 311708 160984
10252 160984 37289 -97053 229095 -145464 129713 -176417 -297114 -197626 -112153 119216
10241 108373 -307657 -109512 -212643 -138706 -443586 143386 -95231 -152907 31535 -8 -101256
10230 -101256 136516 9104 -35200 134790 -159723 84669 40460 57601 85500 -150441 95103
10218 -111276 -238124 -174001 -119480 -184039 167609 157645 -1851 -49479 -51851 94504 -39050 -12192
10205 -277257 -218444 -2270 144490 151838 -64959 -5014 -344295 9895 -120067 -149326 215871
10193 181047 648893 -267480 9368 -44210 115866 159873 -362749 129914 45822 -7914 73943
10181b82020d8450j84482A47634c4230j48150I2604a54838L8034L4518D3853P4048
10170A17901b41456L5475e378l9202j17266K5745B3977a25992j37355A44194P556
10159A51750c34180c5847j5708j82531J06876C5785a73217g3962k05543B39554
10148b14759h1899A20155h7961n5782P1401A70558i3313A30733a49424L1004A01474
10136b61302O0853J1767o5886a26245I5246b24162n7724A6197h3014a7425A24490
10124C1006b71675i5529k111A6697J81094h4157E9152b284A1670R5697D6844j2466
10112C4378K75148c75392C5417f3248A12331c5892j30290A16426a43272A30816
10101f326q6244C23143c49943a67289j27226A55266a03484E466J35070h7410B42854
$$ plain form
10181 -282020 -48450 -232932 147634 -34230 -182380 92604 -154838 -116804 -82286 43853 117901
10170 117901 -241456 -205981 -5378 -44580 -161846 -136101 23977 -125992 -263347 144194 151750
10159 151750 -334180 -35847 -51555 -234086 -127210 35785 -173217 -73962 -279505 239554
10148 -214759 -81899 120155 -87961 -143743 -72342 170558 -93313 130733 -149424 -118420 101474
10136 -261302 -200449 -188682 -254568 -126245 95246 -224162 -281886 16197 -83014 -17425 124490
10124 31006 -271675 -95529 -97640 16697 197791 -84157 59152 -2284 11670 107367 46844 34378
10112 34378 309526 -375392 35417 -63248 112331 -35892 -166182 116426 -143272 130816
10101 -6326 -92570 323143 -349943 -167289 -294515 155266 -103484 5466 140536 -87410 242854
10089b07487R2292q9418g9257n8981A02534n0524f1319k7007D0471a96657D33
10077b7308j11865a2730A0842J83468B8813b34094b6368j66365C0643J83907c97863
10065a23430n3214d7857A83483c5964F208c47999J59566j60604a06629j0765I3841
10053D5923J6150c86821A828b0194A22119a03157j1108B51685B8952h4339A56142
10041b38787a15605j58888R0525P9953q5715Q11r0527M7021j11823P1405f926
10029d66572a5164A83724R937o8465n3303d7328q765r1841j46178I3180j359q524
10017H3297h6658j29976R8080l78801A1841K07869a51057k5714P4141B92849b81671
10005b52426E5112a35156D6386K12221a19184j47038A92545n5701b96082B48872
$$ plain form
10089 -207487 -115195 -204613 -79257 -138238 102534 52010 -61319 -88326 40471 -196657 433
10077 -27308 -139173 -12730 10842 194310 28813 -234094 -26368 -192733 30643 214550 -397863
10065 -123430 -176644 -47857 183483 -35964 6208 -347999 -188433 -349037 -106629 -117394 93841
10053 45923 62073 -386821 1828 -20194 122119 -103157 -114265 251685 28952 -84339 156142
10041 -238787 -115605 -274493 -183968 -104015 -189730 -188919 -279446 -232425 -344248 -272843 -6926
10029 -466572 -15164 183724 193661 125196 71893 -47328 -56093 -147934 -294112 93180 91821 83297
10017 83297 -86658 -216634 -118554 -497355 11841 219710 -151057 -176771 -102630 292849 -281671
10005 -252426 55112 -135156 46386 258607 -119184 -266222 192545 136844 -296082 248872
9994I3937c50876J18699C1323l69a17164B38989H5299K498l6514N5794b27217
9982a19770G1042f6009k42616F6336b98070a34544f058o42271A26937A7891b64502
9970e3608B0871a96128b2000C0893a09528E438b54644F5262c24085J32453b3022
9958c1340D2776b14428O6368R901H0882a57267I8987b24071A58043d04273a95510
9946e9758m31319e2886A28523a0593A17045a03862A42127g4972C3179a31578d6825
9934b83087J27066A73857E5412E387f3513G5198c35017J45364i1595a1819j65649
9923a77468J6075c2369j47953k48633K10809C9963c07284g9794j96880i6751K4870
9912g1881a7452k2844B50067a27855K3825f248l73323A05635i814m21289D14112
$$ plain form
9994 93937 -350876 -232177 31323 30954 -117164 238989 85299 87797 51283 107077 -227217
9982 -119770 71042 -66009 -308625 66336 -298070 -134544 -6058 -648329 126937 17891 -264502
9970 -53608 20871 -196128 -22000 30893 -109528 5438 -254644 65262 -324085 -191632 -23022
9958 -31340 42776 -214428 -148060 -138159 80882 -157267 98987 -224071 158043 -404273 -195510
9946 -59758 -491077 -52886 128523 -10593 117045 -103862 142127 -74972 33179 -131578 -46825
9934 -283087 -156021 173857 55412 5387 -63513 75198 -335017 -189653 -91595 -11819 -177468
9923 -177468 -161393 -32369 -180322 -428955 -218146 39963 -307284 -79794 -276674 -96751 -71881
9912 -71881 -17452 -40296 250067 -127855 -104030 -6248 -379571 105635 -9814 -431103 414112
9900B86339b26336k1900Q6364f5764o0798j20619i1811k71470B09494N8887A12102
9888E455b33646A75102a37679A0547J740a90285k9620B40919l9356b44603p9144
9877c23747d2670A83404H3497Q5566D1394b9599j18177e1238j91000I9591J74210
9866B73801g8185I0593a24235L1706o4004J4014C10785f7403j27374o6074i4393
9854d6278J8630k22588b9625B35184b75802c3094o786G6219d50776a01054A14795
9842g0946k89450a7781k16804D2774l464M9912A2824J83115l3203c3916O141j14289
9830a42064A4949e1107A81981d7005m2351c7364A91358K1603a86401B21676a16446
9818c1993j09917D8442K40565B0243J63003a0007j7346k45963B93933G0750C3843
$$ plain form
9900 286339 -226336 -248236 -161872 -65764 -126562 -247181 -91811 -363281 209494 268381 112102
9888 5455 -233646 175102 -137679 10547 12287 -190285 -219905 240919 201563 -244603 -323747
9877 -323747 -42670 183404 83497 169063 41394 -29599 -147776 -51238 -242238 99591 273801
9866 273801 -78185 90593 -124235 -92529 -156533 -142519 310785 -67403 -194777 -260851 -94393
9854 -46278 -27648 -250236 -29625 235184 -275802 -33094 -39880 76219 -450776 -101054 114795
9842 -70946 -360396 -17781 -234585 42774 39310 89222 12824 195939 162736 -33916 -27775 -142064
9830 -142064 14949 -51107 181981 -47005 -89356 -37364 191358 212961 -186401 221676 -116446
9818 -31993 -141910 48442 289007 20243 183246 -10007 -27353 -273316 293933 70750 33843
9806d7279A43470c08915c9776B1225b84909p8883B62233q9182b81165J07868j56546
9795c29843G7411A4246L0781b6758F9154N9934b19232j1474E9897b3815o0089
9784h3904A11657a52682p9372D8740i3783E6126a66061L6872A64476c98590A86039
9772d7841k40124A42600e2995A48134a37556A06695c30307b5049j62114j6569
9762b03732O8395O0966C7712b68257A61987l4916J70555A7321a16061j85104a08234
9750a87081O8593B66307A0127a85042M2825P1084G3216a99422J6467F5068i7645
9738a74567p8765J2901F9884C786a01379j48323G4955C1556b48039B881a12166
9726A65778b70184F661a33629l41467D8168a875k76312D9574N8848c1885G767
$$ plain form
9806 -47279 143470 -308915 -39776 21225 -284909 -363792 262233 173051 -281165 -173297 -329843
9795 -329843 77411 14246 45027 -26758 69154 129088 -219232 -230706 59897 -23815 -83904
9784 -83904 111657 -152682 -232054 48740 -93783 56126 -166061 -129189 164476 -398590 186039
9772 -47841 -287965 142600 -52995 148134 -137556 106695 -330307 -25049 -187163 -203732
9762 -203732 -135337 -74371 37712 -268257 161987 127071 297626 17321 -116061 -301165 -108234
9750 -187081 -118488 266307 10127 -185042 -142217 -71133 73216 -199422 -182955 65068 -97645
9738 -174567 -253332 -240431 69884 3786 -101379 -249702 74955 31556 -248039 2881 -112166
9726 165778 -270184 6661 -133629 -475096 48168 -1875 -278187 49574 108422 -31885 7767
9714B54718f5165j4711A71681R0559a20394A26470b24894j52006F4619d38659
9703a15399j61716G108a81487K6424I4034N1716e3153a6027k46992K4393B6884
9691G7294B9500h0530G6176a58553G9800k4358K08472c1327G2881d6161m180k87340
9679c37681a15944E5382J12247F1348e8788k8132j35297d787j1091A35922P2688
9668B08610g6604K1522k0685k48798a54894J7191j1474k2050f1333m13357A65108
9656d71634b2709k99323J59367F598d80848g1391j36035R8798e4258j68971I6677
9644g6596j6636p6273d8366j35311P4617j05090Q4428M217k57352a51758j0364
9633a62122A55242a29691N9454C45410i1076k13945A46808b22299a03030j28553
$$ plain form
9714 254718 -65165 -79876 171681 262240 -120394 126470 -224894 -376900 64619 -438659
9703 -115399 -277115 7108 -181487 -155063 94034 145750 -53153 -16027 -263019 -238626 26884
9691 77294 29500 -80530 76176 -158553 79800 55442 263914 -31327 72881 -46161 -50341 -337681
9679 -337681 -115944 55382 167629 61348 -58788 -86920 -222217 -4787 -15878 135922 208610
9668 208610 -76604 -55082 -75767 -324565 -154894 -137703 -149177 -171227 -61333 -474690 165108
9656 -471634 -22709 -322032 -162665 6598 -480848 -71391 -207426 -108628 -54258 -223229 96677
9644 -76596 -93232 -169505 -48366 -183677 -109060 -214150 -129722 -125505 -382857 -151758 -162122
9633 -162122 155242 -129691 -70237 345410 -91076 -305021 146808 -222299 -103030 -231583
9623b31583h5862f628A64172a01402F8760b58393J7544A8572J90017a94975h7098
9611a59019m6304a0417n5488A00902a44470j07137p9789a42106E9301J12808b33057
9599b20388R2961j37369H2395a61064B12863a28817A29939J68982a26462A6825
9588e4783l11356J70615d4856j27161c9759k67739d2552D5536a22018j79325f4794
9576C9911a25435A00856e1032o966A2729P9672b21411D4753a49229J5235G7827
9564a63857P4797B08399a30913H2113d5499l02942A0411i2332B89886A32753J0061
9553A42814L60075a03606m0088l35817a2678D644d9896k18047g8315j25839j7425
9542b21579C0007j2411L9650K1884a98093k44738A81785K2834a62924l5010g8869
$$ plain form
9623 -231583 -85862 -6628 164172 -101402 68760 -258393 -240849 18572 208589 -194975 -87098
9611 -159019 -205323 -10417 -65905 100902 -144470 -251607 -331396 -142106 59301 172109 -233057
9599 -220388 -127427 -264796 82395 -161064 212863 -128817 129939 298921 -126462 16825
9588 -54783 -366139 -195524 -44856 -172017 -39759 -307498 -42552 45536 -122018 -301343 -64794
9576 39911 -125435 100856 -51032 -57998 12729 92401 -221411 44753 -149229 -133994 77827
9564 -163857 -89060 208399 -130913 82113 -45499 -348441 10411 -92332 289886 132753 142814
9553 142814 502889 -103606 -143694 -479511 -12678 4644 -49896 -267943 -78315 -204154 -221579
9542 -221579 30007 17596 57246 79130 -198093 -442831 181785 204619 -162924 -197934 -78869
9530c2531l1481b7857A75904p0647K65102a42195n1192B08922c41409R6073A09272
9518C73540a08091k0075K2404A10505d7953k79768a36523k5118E4656N220A1768
9506g967A062L0866a32849d1077A77574e0733J0393B01355b0803p919k39500p2875
9494c41097c9665A79343d8051E9413b8856k17983i7717A73964p8008d92359a52882
9482e8722b2729A05458a1748B65443r0919c7773B121K79628a19400k2954I0136
9470i7791A05056C9725K957A1860b5001l04328A13297f9842A94607F0377m508
9459E5869a56988m69236C9399b13091L4880b0645q1666j87143B20071k5065a2229
9447a13458D7603J24556b03932B27936b12786L0832H5406g6383A46003i0295A40600
$$ plain form
9530 -32531 -64012 -27857 175904 105257 370359 -142195 -193387 208922 -341409 -245336 109272
9518 373540 -108091 -128166 -105762 110505 -47953 -327721 -136523 -161641 54656 59876 11768
9506 -7967 1062 31928 -132849 -41077 177574 -50733 -40340 201355 -20803 -28722 -268222 -341097
9494 -341097 -39665 179343 -48051 59413 -28856 -246839 -97717 173964 95956 -492359 -152882
9482 -58722 -22729 105458 -11748 265443 174524 -37773 2121 281749 -119400 -142354 90136
9470 -97791 105056 39725 42682 11860 -25001 -329329 113297 -69842 194607 60377 55869
9459 55869 -156988 -626224 39399 -213091 -178211 -20645 -102311 -289454 220071 195006 -12229
9447 -113458 47603 172159 -203932 227936 -212786 -181954 85406 -76383 146003 -90295 140600
9435A92780I3032l4507M0200e6037l5806o1550o2592d5433k92445C893R9545R1838
9423A95276b9398k29174a01192L8074j69676j04650a57651K409G7269a87154q660
9412a95814K5683k38790A10887l4906i9485b0741j78106Q0181B8568a28415k43622
9401c72037a60068P8651A30879f4944F6734a0048A43652a65705o0729B04040b8212
9389a32184N6986o810l0654L9572F5488h4515n3170A22379c83204J58015f7383
9377G2832R258l2820a87527n8036c0789A67012a95486B5107a02091F8557c43353
9365b13968e7670k11741P5693A8997J08949b56857h2455m768j50914f8542C857
9353a85827a5203A0140J49356D5166a77030m1612C2057J10606o1398J2642c68327
$$ plain form
9435 192780 93032 58525 98725 -56037 -91843 -153393 -215985 -45433 -337878 3893 103438 195276
9423 195276 -29398 -258572 -101192 -63118 -232794 -337444 -157651 -155242 77269 -187154 -195814
9412 -195814 -170131 -408921 110887 75981 -99485 -20741 -198847 -118666 28568 -128415 -372037
9401 -372037 -160068 -81417 130879 -64944 66734 -10048 143652 -165705 -226434 204040 -28212
9389 -132184 -75198 -82008 -112662 -73090 65488 -84515 -137685 122379 -383204 -225189 -67383
9377 72832 82090 49270 -187527 -245563 -30789 167012 -195486 25107 -102091 68557 -343353
9365 -213968 -57670 -269411 -193718 18997 127946 -256857 -82455 -87223 -238137 -68542 3857
9353 -185827 -15203 10140 159496 45166 -177030 -218642 32057 142663 81265 93907 -368327
9341a82028E79858b03728B46732b64916f093j42117c2200p8629K44k66954G1270
9329e7836p2826f4366H0012Q8674G0662b98123g9627G2576C1263h84k08282D3983
9316A04614J23631a52476o6005b9881D0557c19366J46334I6409e4891D7234c8722
9304A57520c59909a7867p3228D6931K22793J49727F6972N0100l7891M9927P6272
9293B05380a8953m77007a10460J2955k3151C5328c56450a75070A1377J7263b69903
9281C19448a98606k237C5085a41261E1189a64947e3730j57943N7034j57826A3568
9269a20146L7226B2083c94066R4505L1935R6700A89418F4905N0880b37401b7771
9257h4663j13985h9576j1762D4786J07198f5787I172a00320M450a6720j82088
$$ plain form
9341 -182028 579858 -203728 246732 -264916 -6093 -148210 -32200 -110829 -110585 -377539 71270
9329 -57836 -130662 -64366 80012 168686 70662 -298123 -79627 72576 31263 -884 -209166 43983
9316 104614 228245 -152476 -218481 -29881 40557 -319366 -173032 96409 -54891 47234 -38722
9304 157520 -359909 -17867 -91095 46931 269724 419451 66972 117072 79181 129108 205380
9293 205380 -18953 -495960 -110460 -97505 -120656 35328 -356450 -175070 11377 28640 -269903
9281 319448 -198606 -200843 35085 -141261 51189 -164947 -53730 -211673 -154639 -312465 13568
9269 -120146 -82920 22083 -394066 -299561 -267626 -170926 189418 64905 115785 -237401 -27771
9257 -84663 -198648 -89576 -101338 44786 151984 -65787 9172 -100320 -95870 -16720 -198808
9246a98808A40041Q824f1217k04185r147A31748e0045o7302l6086c5143r0922
9235a26065C47127d2324k8912k08678C70753A08505J46515b29311A14595m74C2679
9223a24968j20435J3517e7256m5612c104q1721L9933j24444A29239l8057Q4977
9212A76159a18907q3036d2144A11162l0883a52792n3495J02661A78260f9916m3143
9201a13059E375e0129k60401C8088J00969K30246A1291a18436j36859J20441A08096
9189b77222a18943B6595c10385A13978a08044q2407a1133C1412O1322m4219a14326
9177a57969A14544G253a35008K0848j6602A1920L9030k5009d4237l18725J27650
9166b35312Q9813A32469Q7871o7916J31a00672o7993r0110C9956a45665A62654
$$ plain form
9246 -198808 140041 148865 -61217 -265402 -274549 131748 -50045 -117347 -153433 -35143 -126065
9235 -126065 347127 -42324 -71236 -279914 370753 108505 255020 -229311 114595 114121 32679
9223 -124968 -245403 -231886 -57256 -102868 -3104 -84825 -44892 -169336 129239 91182 176159
9212 176159 -118907 -201943 -42144 111162 80279 -152792 -206287 -103626 178260 -69916 -113059
9201 -113059 5375 -50129 -310530 38088 139057 369303 11291 -118436 -255295 -134854 108096
9189 -277222 -118943 26595 -310385 113978 -108044 -190451 -11133 31412 92734 48515 -114326
9177 -157969 114544 7253 -135008 -114160 -130762 11920 50950 25941 -44237 -362962 -235312
9166 -235312 -145499 132469 220340 152424 152555 -100672 -168665 -258775 39956 -145665 162654
9154h2399k4471o0815j21260L8279J24649e7248j37080M3282M1663A59542D1380
9142A60527f1755k7759A50684b9225n2659J3198I1854J02464b19769B6415K55784
9131B82199a23424d6546G8544P3808K5014n8746a06719j89335C7485a39601H4666
9119D4816a77025K7199j23048f2001B38453a97134e518A87274a16653j9655A18845
9107B6103J60028d5918F9631b21071q232A85369i1263E2164c01265A29668J8786
9096A48454a64180E3915a06487b4829r4090G3379a85096R0198K0611p3165k80336
9085d27788A46525M9785c72700D3244i8229b3985D939f3111l58150I2933a05233
9073b88307E8819i284j19489G1659k0679J00540i7596F6352K9758c13038C37600
$$ plain form
9154 -82399 -106870 -167685 -288945 -250666 -126017 -57248 -194328 -151046 -109383 159542 41380
9142 160527 -61755 -89514 150684 -29225 -81884 -68686 91854 194318 -219769 26415 282199
9131 282199 -123424 -46546 78544 152352 177366 118620 -106719 -296054 37485 -139601 84666
9119 44816 -177025 -149826 -272874 -62001 238453 -197134 -5518 187274 -116653 -136308 118845
9107 26103 186131 -45918 69631 -221071 -229303 185369 -91263 52164 -301265 129668 148454
9096 148454 -164180 53915 -106487 -24829 -118919 73379 -185096 -94898 -74287 -147452 -427788
9085 -427788 146525 196310 -372700 43244 -98229 -23985 4939 -63111 -421261 92933 -105233
9073 -288307 58819 -9284 -128773 71659 50980 151520 -97596 66352 96110 -313038 337600
9061D6850L7228b5655k05332O82f9110b6445q6390c8189k49179C7389K41181i2605
9048B65887b04358f1469D8968J0372i4937B06141a66412j45114B34593a2369B15148
9036I4749e9877q7311L8977j95092a17750j31158i4213m0573A55686b24846C9082
9024g3058A05002P8128a17150A53234a10166L7968k12042I0111J18766J4550a23649
9012a31201n1023P3704l5968E9239J1620b37989R3007A06788a45397q9479G4417
9000b09491A85779a1212j01650r1421h3023j89785J21360H780Q7476b97493o2850
8989c60343I3805i4735A36108m4342J09172o9060k6406g9291G4026J4260a28551
8977e3754j4741N934b0740k50024a08615j30434P1310G9803a19005p48l3958a6657
$$ plain form
9061 46850 84078 -25655 -230987 -230305 -69110 -26445 -112835 -38189 -287368 37389 278570 -92605
9048 265887 -204358 -61469 48968 59340 -94937 206141 -166412 -311526 234593 -12369 215148
9036 94749 -59877 -147188 -108211 -303303 -117750 -248908 -94213 -134786 155686 -224846 39082
9024 -73058 105002 183130 -117150 153234 -110166 -72198 -284240 90111 208877 223427 -123649
9012 -131201 -182224 -108520 -144488 59239 70859 -237989 -144982 106788 -145397 -234876 74417
9000 -209491 185779 -11212 -112862 -204283 -83023 -272808 -151448 8780 96256 -297493 -360343
8989 -360343 93805 -94735 136108 91766 200938 131878 105472 -79291 74026 88286 -128551
8977 -53754 -68495 -62561 -20740 -270764 -108615 -239049 -167739 79803 -119005 -119753 -153711 -16657
8964A18649f7500B33360a17908j45117d7615B58906g6090D6632K39545i9092A49815
8952C1616h1144J4447j27210b3744A66213L7083d96823b9623A3321a10468M9608
8941f0860F9263a44166K9907L3269n8910I7852b27448A26948e913k22694b2712
8929A55631f2834A95652q6114K6967b222j71610I8352K30870A45782P718k9040
8918A24460a6316k834k43917i1747p493d8710j52531C03583j29417B0576g3799
8906g617C126R2230K78866a92791A72531q5144i4680L7880l97378e8654A1589
8894a13427n7341M0322o8414m6733M526G5282k1713a58294j91507B7289J84950
8883B12239b17559B6922p35a29945j57431B71641b7920j78922L6064g6682B10357
$$ plain form
8964 118649 -67500 233360 -117908 -263025 -47615 258906 -76090 46632 286177 -99092 149815
8952 31616 -81144 -66697 -193907 -23744 166213 203296 -496823 -29623 13321 -110468 -60860
8941 -60860 69263 -144166 -114259 -80990 -139900 97852 -227448 126948 -5913 -228607 -22712
8929 155631 -62834 195652 109538 136505 -2222 -173832 98352 329222 145782 153500 124460
8918 124460 -16316 -19150 -263067 -91747 -99240 -48710 -201241 303583 174166 20576 -73799
8906 -7617 3126 95356 374222 -192791 172531 87387 -94680 -56800 -454178 -58654 11589
8894 -113427 -170768 -130446 -198860 -245593 -241067 75282 53569 -158294 -349801 27289 212239
8883 212239 -217559 26922 26187 -129945 -287376 271641 -27920 -206842 -170778 -76682 210357
8871b97508P0883D66511a45618j20637h8952j06165K4558A49176L7666c59964
8860A83880f3600p5806B4700L0149L4227J0165J6011a14811e2576l57j68927H9724
8847d37382A3577n240a16454q1679P0426B44861a43545C7748c78041a83130N7795
8836a25335L0510G3684l0460J93593d21699a0483j68753J412A15218a03642j54159
$$ plain form
8871 -297508 -226625 466511 -145618 -266255 -88952 -195117 -170559 149176 186842 -359964
8860 183880 -63600 -139406 24700 54849 89076 99241 115252 -114811 -52576 -52933 -221860 89724
8847 -437382 13577 8337 -116454 -198133 -127707 244861 -143545 37748 -378041 -183130 -125335
8836 -125335 -94825 73684 43224 236817 -421699 -10483 -179236 -177824 115218 -103642 -257801
$$ [...]
##END NTUPLES=NMR SPECTRUM
##END=
