##TITLE=AC1462_TOLI213268_8026402_mr6yncFa7V
##JCAMPDX= 6.0         $$ Bruker NMR JCAMP-DX V2.0
##DATA TYPE= NMR SPECTRUM
##DATA CLASS= NTUPLES
##ORIGIN= BRUKER
##OWNER= Administrator
$$ 1.72 TOPSPIN		Version 2.1
$$ 2013-07-11 18:33:09.219 -0700  Administrator@X
$$ Compression mode = diff/dup
##.OBSERVE FREQUENCY= 400.02188249412
##.OBSERVE NUCLEUS= ^1H
##.ACQUISITION MODE= SIMULTANEOUS (DQD)
##.ACQUISITION SCHEME= undefined
##.AVERAGES= 64
##.DIGITISER RES= 22
##SPECTROMETER/DATA SYSTEM= spect
##.PULSE SEQUENCE= noesygpps1d.comp
##.SOLVENT NAME= COFFEE_meoh
##.SHIFT REFERENCE= INTERNAL, COFFEE_meoh, 1, 14.96096
##AUDIT TRAIL= $$ (NUMBER, WHEN, WHO, WHERE, PROCESS, VERSION, WHAT)
$$ ##TITLE= Audit trail, TOPSPIN		Version 2.1
$$ ##JCAMPDX= 5.01
$$ ##ORIGIN= Bruker BioSpin GmbH
$$ ##OWNER= Administrator
$$ $$ E:\/data/COFFEE/nmr/AC1462_TOLI213268_8026402_mr6yncFa7V/12/pdata/1/auditp.txt
$$ ##AUDIT TRAIL=  $$ (NUMBER, WHEN, WHO, WHERE, PROCESS, VERSION, WHAT)
(   1,<2013-07-11 18:33:04.156 -0700>,<Administrator>,<X>,<go>,<TOPSPIN 2.1>,
      <created by zg
	started at 2013-07-11 18:21:33.860 -0700,
	POWCHK enabled, PULCHK disabled,
       configuration hash MD5:
       C8 4E 4E 5D D3 5C D8 9E 9F 52 82 E0 59 8A DE 15
       data hash MD5: 64K
       1A AF A5 71 4E 9E 5D EB 63 8E 60 6F 63 7E FB FA>)
(   2,<2013-07-11 18:33:07.094 -0700>,<Administrator>,<X>,<proc1d>,<TOPSPIN 2.1>,
      <Start of raw data processing
       efp LB = 0.3 FT_mod = 6 PKNL = 1 PHC0 = 0 PHC1 = 0 SI = 128K 
       data hash MD5: 128K
       95 6B 05 52 31 F9 F0 A7 2D AD 41 D9 83 BA A5 5A>)
(   3,<2013-07-11 18:33:08.125 -0700>,<Administrator>,<X>,<proc1d>,<TOPSPIN 2.1>,
      <pk PHC0 = -82.38098 PHC1 = 0 
       data hash MD5: 128K
       0E B1 2F 5F 24 A3 CD A8 6D 32 43 FA 02 5C B4 66>)
(   4,<2013-07-11 18:33:08.610 -0700>,<Administrator>,<X>,<proc1d>,<TOPSPIN 2.1>,
      <abs ABSG = 1 
       data hash MD5: 128K
       07 5A 57 1A A3 10 8B 9F C8 30 05 56 C1 3D 14 D7>)
(   5,<2013-07-11 18:33:08.719 -0700>,<Administrator>,<X>,<proc1d>,<TOPSPIN 2.1>,
      <abs ABSG = 2 
       data hash MD5: 128K
       2E E9 A2 8E BA 54 FA 25 D8 FE E3 ED 32 5A 10 8C>)
(   6,<2013-07-11 18:33:08.844 -0700>,<Administrator>,<X>,<proc1d>,<TOPSPIN 2.1>,
      <abs ABSG = 3 
       data hash MD5: 128K
       DF D9 EB 46 05 26 EE 24 1A 50 5B B7 E0 1B A2 BD>)
(   7,<2013-07-11 18:33:08.906 -0700>,<Administrator>,<X>,<proc1d>,<TOPSPIN 2.1>,
      <abs ABSG = 4 
       data hash MD5: 128K
       05 B2 A8 CC D2 81 EF B7 EE 15 E0 AA 17 05 5D EC>)
(   8,<2013-07-11 18:33:09.063 -0700>,<Administrator>,<X>,<proc1d>,<TOPSPIN 2.1>,
      <abs ABSG = 5 
       data hash MD5: 128K
       37 6A EC D9 1B 41 3F D4 17 C5 E2 8C 24 26 FB 1E>)
$$ ##END=
$$ 
$$ $$ hash MD5
$$ $$ F0 2E FE BD 57 3F 0D 43 AB 88 92 48 39 7C A2 9F
##$RELAX= 
##$RELAX= 
##$RELAX= 
##$RELAX= 
##$RELAX= 
##$RELAX= 
##$RELAX= 
##$RELAX= 
$$ Bruker specific parameters
$$ --------------------------
##$DU= <E:\>
##$EXPNO= 12
$$ [...]
150 150 150 150 150 150 150 150
##$TP07= 0
##$TPNAME0= <>
##$TPNAME1= <>
##$TPNAME2= <>
##$TPNAME3= <>
##$TPNAME4= <>
##$TPNAME5= <>
##$TPNAME6= <>
##$TPNAME7= <>
##$TPOAL= (0..7)
0.5 0.5 0.5 0.5 0.5 0.5 0.5 0.5
##$TPOFFS= (0..7)
0 0 0 0 0 0 0 0
##$TUNHIN= 0
##$TUNHOUT= 0
##$TUNXOUT= 0
##$USERA1= <user>
##$USERA2= <user>
##$USERA3= <user>
##$USERA4= <user>
##$USERA5= <user>
##$V9= 5
##$VALIST= <valist>
##$VCLIST= <CCCCCCCCCCCCCCC>
##$VD= 0
##$VDLIST= <DDDDDDDDDDDDDDD>
##$VPLIST= <PPPPPPPPPPPPPPP>
##$VTLIST= <TTTTTTTTTTTTTTT>
##$WBST= 1024
##$WBSW= 4
##$XGAIN= (0..3)
0 0 0 0
##$XL= 0
##$YL= 0
##$YMAX_a= 5888232
##$YMIN_a= -11320749
##$ZGOPTNS= <>
##$ZL1= 120
##$ZL2= 120
##$ZL3= 120
##$ZL4= 120
##$ABSF1= 14.96096
##$ABSF2= -5.597221
##$ABSG= 5
##$ABSL= 3
##$ALPHA= 0
##$AQORDER= 0
##$ASSFAC= 0
##$ASSFACI= 0
##$ASSFACX= 0
##$ASSWID= 0
##$AUNMP= <proc_prof1d_extract.lims>
##$AXLEFT= 0
##$AXNAME= <>
##$AXNUC= <1H>
##$AXRIGHT= 0
##$AXTYPE= 0
##$AXUNIT= <>
##$AZFE= 0.1
##$AZFW= 0.1
##$BCFW= 0
##$BC_mod= 0
##$BYTORDP= 0
##$COROFFS= 0
##$CY= 15
##$DATMOD= 1
##$DC= 0
##$DFILT= <>
##$DTYPP= 0
##$F1P= 0
##$F2P= 0
##$FCOR= 0.5
##$FTSIZE= 131072
##$FT_mod= 6
##$GAMMA= 0
##$GB= 0
##$INTBC= 1
##$INTSCL= 1
##$ISEN= 128
##$LB= 0.3
##$LEV0= 0
##$LPBIN= 0
##$MAXI= 10000
##$MC2= 0
##$MEAN= 0
##$ME_mod= 0
##$MI= 0
##$NCOEF= 0
##$NC_proc= -2
##$NLEV= 6
##$NOISF1= 0
##$NOISF2= 0
##$NSP= 0
##$NTH_PI= 0
##$NZP= 0
##$OFFSET= 14.96096
##$PC= 1
##$PHC0= -82.38098
##$PHC1= 0
##$PH_mod= 1
##$PKNL= yes
##$PPARMOD= 0
##$PPDIAG= 0
##$PPIPTYP= 0
##$PPMPNUM= 2147483647
##$PPRESOL= 1
##$PSCAL= 4
##$PSIGN= 0
##$PYNMP= <proc.py>
##$REVERSE= no
##$SF= 400.02000965389
##$SI= 131072
##$SIGF1= 0
##$SIGF2= 0
##$SINO= 400
##$SIOLD= 131072
##$SPECTYP= <>
##$SREGLST= <1H.CDCl3>
##$SSB= 0
##$STSI= 131072
##$STSR= 0
##$SW_p= 8223.68421052631
##$SYMM= 0
##$S_DEV= 0
##$TDeff= 65536
##$TDoff= 0
##$TI= <>
##$TILT= no
##$TM1= 0
##$TM2= 0
##$TOPLEV= 0
##$USERP1= <user>
##$USERP2= <user>
##$USERP3= <user>
##$USERP4= <user>
##$USERP5= <user>
##$WDW= 1
##$XDIM= 131072
##$YMAX_p= 434638660
##$YMIN_p= -12554
##$CURPLOT= <Network HP LaserJet P1505>
##$CURPRIN= <$Network HP LaserJet P1505>
##$DFORMAT= <normdp>
##$LAYOUT= <+/1D_H.xwp>
##$LFORMAT= <normlp>
##$PFORMAT= <normpl>
##$SURQMSG= 1
$$ End of Bruker specific parameters
$$ ---------------------------------
##NTUPLES= NMR SPECTRUM
##VAR_NAME=  FREQUENCY,     SPECTRUM/REAL,   SPECTRUM/IMAG
##SYMBOL=    X,             R,               I
##VAR_TYPE=  INDEPENDENT,   DEPENDENT,       DEPENDENT
##VAR_FORM=  AFFN,          ASDF,            ASDF
##VAR_DIM=   131072,        131072,          131072
##UNITS=     HZ,            ARBITRARY UNITS, ARBITRARY UNITS
##FACTOR=    0.0627417313425164, 1,          1
##FIRST=     8223.62146879497, 1141,         -52952
##LAST=      0,             2368,            -53331
##MIN=       0,             -12554,          0
##MAX=       8223.62146879497, 434638660,    0
$$ Real data points
##PAGE= N=1
##DATA TABLE= (X++(R..R)), XYDATA
$$ [...]
63938B944571K21565K20046K13904K01994J84348J61838J35338J05626P3689M0560
63928D503479O860k7116o0898r3751j24955j53760j79030j99291k13312k20735
63918C237491k22358k19881k14963k08200j99148j87457j73627j58536j42783
63909A510538j26945j11915r8363q6204p5173o5565n7774n1389m5576m0151l5524
63898G15959l1714k8244k5005k2388k0448j8703j6929j5403j4169j2786j1119
63887D99051r650q624p569o084m517l387k518j301N18K663M708O296P348Q264
63873D85198R655J1614J3609J5181J6317J7031J7215J7146J7434J8000J7824J6284
63861F72508J4154J2505J1174R212O506L917J820m68l540o930r742j1748j3455
$$ y = [2944571, 3166136, 3386182, 3600086, 3802080, 3986428, 4148266, 4283604, 4389230, 4462919, 4503479, 4510339, 4483223, 4422325, 4328574, 4203619, 4049859, 3870829, 3671538, 3458226, 3237491, 3015133, 2795252, 2580289, 2372089, 2172941, 1985484, 1811857, 1653321, 1510538, 1383593, 1271678, 1173315, 1087111, 1011938, 946373, 888599, 837210, 791634, 751483, 715959, 684245, 656001, 630996, 608608, 588160, 569457, 552528, 537125, 522956, 510170, 499051, 489401, 480777, 473208, 467124, 462607, 459220, 456702, 455401, 455919, 458582, 463290, 469586, 476934, 485198, 494853, 506467, 520076, 535257, 551574, 568605, 585820, 602966, 620400, 638400, 656224, 672508, 686662, 699167, 710341, 719553, 726059, 729976, 731796, 731328, 727788, 720858, 711116, 699368, 685913]
63848F85913j5349j7410j9252k0544k1240k1498k1404k0929k0241j9783j9763
63837D68500j9747j9147j7973j6760j5790j4849j3750j2680j1854j1130j0180
63826C04640q868p383o088n318n147n248n147m728m378m480m859m843l937k408
63812B31808j096o31r00j314j454j277q80m10j83m35q90r54n70m63j173k251k783
63795B14144k477j814j318j153j267j493j516j170p87q32j279j600j419q37j88
63780A94994J67r6r38j673j498m72M81O55L07R7K68N63P07N61J04m71q05p69o56
63761A91526p45q20m62L00Q96Q24J23p17j151r33k95K01K20Q9M51J417K330K520
63743A95774K139J909K166K514K545K418K445K388J806R93Q95J804K780K807K147
$$ y = [685913, 670564, 653154, 633902, 613358, 592118, 570620, 549216, 528287, 508046, 488263, 468500, 448753, 429606, 411633, 394873, 379083, 364234, 350484, 337804, 325950, 314820, 304640, 295772, 288389, 282301, 276983, 271836, 266588, 261441, 256713, 252335, 247855, 242996, 238153, 234216, 231808, 230712, 230081, 229181, 227867, 226413, 225136, 224256, 223846, 223663, 223228, 222338, 221384, 220814, 220351, 219178, 216927, 214144, 211667, 209853, 208535, 207382, 206115, 204622, 203106, 201936, 201149, 200317, 199038, 197438, 196019, 195182, 194994, 195161, 195065, 194127, 192454, 190956, 190484, 190965, 191620, 191927, 192024, 192292, 192855, 193562, 194123, 194227, 193756, 192951, 192182, 191526, 190781, 189961, 189499, 189799, 190695, 191519, 191642, 190925, 189774, 188841, 188546, 188747, 188967, 189056, 189507, 190924, 193254, 195774, 197913, 199822, 201988, 204502, 207047, 209465, 211910, 214298, 216104, 217097, 217992, 219796, 222576, 225383, 227530]
63728B27530J908K483L212L551L830M538N460O011O042N844N506M795L629K227
63714B86566Q42l90j311j810k055k458l185l963m434m508m305l844l006j756l31
63699B50052P96J189Q65M04M84J187J967K374K523K684K710K298J647J393J749
63684B74322K115J801R16K59M23J177J686J317L21l05K18J522K454K376J810J625
63668B94037J983K437K689K721K387J492K81o58j117j496k183l057l787m295m715
63653B86719n122n388n225m385l072k033j885k328k439j753o33M24J297J921K066
63638B58164J830J801K374L242L924M365M627M517M040L848M563N870O993P826
63624C17984Q878J0205J1212J1753J2632J4537J7038J9145K0544K1809K3469K5459
$$ y = [227530, 229438, 231921, 235133, 238684, 242514, 247052, 252512, 258523, 264565, 270409, 275915, 280710, 284339, 286566, 287408, 287018, 285707, 283897, 281842, 279384, 276199, 272236, 267802, 263294, 258989, 255145, 252139, 250383, 250052, 250848, 252037, 252902, 253306, 253790, 254977, 256944, 259318, 261841, 264525, 267235, 269533, 271180, 272573, 274322, 276437, 278238, 279154, 279413, 279836, 281013, 282699, 284016, 284337, 284032, 284250, 285772, 288226, 290602, 292412, 294037, 296020, 298457, 301146, 303867, 306254, 307746, 308027, 307369, 306252, 304756, 302573, 299516, 295729, 291434, 286719, 281597, 276209, 270984, 266599, 263527, 261494, 259609, 257281, 254842, 253089, 252456, 252880, 254177, 256098, 258164, 259994, 261795, 264169, 267411, 271335, 275700, 280327, 284844, 288884, 292732, 297295, 303165, 310158, 317984, 326862, 337067, 348279, 360032, 372664, 387201, 404239, 423384, 443928, 465737, 489206, 514665]
63612E14665K7488K9512L1541L3193L3884L3404L1994K9668K5895K0294J3444
63601H24982O528L33m904q812j0811j0934j0081r127q333p928q595j0737j3793
63588G27788j6902j9814k2573k4684k5522k5269k4647k3747k1965j9117j5877
63577D87671j2981j0613q677p003n195k940o40R19J786K979N076P260Q363Q363
63563D74368Q335R116J0549J1966J2973J3708J4544J5701J7168J8965K1263K4147
63551F52803K7538L1549L6501M2000M6309M7336M4223L7447K7698J5665K957q004
63539A004022j5608j9904k1536k0689j7699j3768j0261p688o156o169q114j1326
63527H45104j4648j7842k1568k5972l0095l2815l3771l3295l1991l0528k9271
$$ y = [514665, 542153, 571665, 603206, 636399, 670283, 703687, 735681, 765349, 791244, 811538, 824982, 831510, 831843, 826939, 818127, 807316, 796382, 786301, 777174, 768841, 760913, 752318, 741581, 727788, 710886, 691072, 668499, 643815, 618293, 593024, 568377, 544630, 522665, 503548, 487671, 474690, 464077, 455400, 448397, 443202, 440262, 439622, 440541, 442327, 445306, 450382, 457642, 466005, 474368, 482703, 491819, 502368, 514334, 527307, 541015, 555559, 571260, 588428, 607393, 628656, 652803, 680341, 711890, 748391, 790391, 836700, 884036, 928259, 965706, 993404, 1009069, 1012026, 1004022, 988414, 968510, 946974, 926285, 908586, 894818, 884557, 876869, 870713, 864544, 856430, 845104, 830456, 812614, 791046, 765074, 734979, 702164, 668393, 635098, 603107, 572579, 543308]
63516E43308k7834k5473k2088j8545j5813j4046j2745j1494j0233q999p693o238
63504C62107m864m045l995m310m305l759l075k653k441k264k192k305k355k084
63490C17460j605j109m18P00J950K719K913L050L531M163M555M709M959N512O067
63475C59156O009N017L462K020Q58m09j909l194m003m749n750o439o109n092m456
63460C34412m551m664m083k873j469j85P49J221J504K019K818L719M907O751Q970
63445C49245J0723J1728J2598J3904J5601J7672K0513K4238K8241L1890L4907
63434E71260L6553L5286L0265K2697J4895Q229K884q24k097o99K595O922J2020
63421G39986J7789K3810K9538L4531L8276M0239M0200L8139L3718K6551J7218
$$ y = [543308, 515474, 490001, 467913, 449368, 433555, 419509, 406764, 395270, 385037, 376038, 368345, 362107, 357243, 353198, 349203, 344893, 340588, 336829, 333754, 331101, 328660, 326396, 324204, 321899, 319544, 317460, 315855, 314746, 314328, 315028, 316978, 319697, 322610, 325660, 329191, 333354, 337909, 342618, 347577, 353089, 359156, 365165, 370182, 373644, 375664, 376522, 376113, 374204, 371010, 367007, 362258, 356508, 350069, 343960, 338868, 334412, 329861, 325197, 321114, 318241, 316772, 316587, 317336, 318557, 320061, 322080, 324898, 328617, 333524, 340275, 349245, 359968, 371696, 384294, 398198, 413799, 431471, 451984, 476222, 504463, 536353, 571260, 607813, 643099, 673364, 696061, 710956, 719185, 722069, 721245, 719148, 718449, 721044, 727966, 739986, 757775, 781585, 811123, 845654, 883930, 924169, 964369, 1002508, 1036226, 1062777, 1079995]
63410A079995P458j062p716j2461j5072j5449j4294j2810j1809j1603j2567j5169
63398I57441j9335k4240k8879l2601l5142l6490l6828l6316l4846l2300k9065
63387F11399k5912k3259k0805j8075j5060j2077r343o931m909l171j339Q54L155
63374D74527N142O849Q635J0452J1832J2712J3776J5648J8104K0452K2386K3999
63362F44514K5329K6430K7833L0234L3564L6836L9082L9955L9288L6655L1794
63351A011514K5084J7186Q568j41p717j2943j5627j6427j5884j4299j2558j2092
63339I54664j3572j6304j9416k3008k7373l1631l4146l4332l3197l1832l0157
63328F59696k7505k3890j9939j5916j1480o557k011P87R05j726o498j2405j8138
$$ y = [1079995, 1087453, 1086391, 1078675, 1066214, 1051142, 1035693, 1021399, 1008589, 996780, 985177, 972610, 957441, 938106, 913866, 884987, 852386, 817244, 780754, 743926, 707610, 672764, 640464, 611399, 585487, 562228, 541423, 523348, 508288, 496211, 486868, 479937, 475028, 471857, 470518, 471372, 474527, 479669, 486518, 495153, 505605, 517437, 530149, 543925, 559573, 577677, 598129, 620515, 644514, 669843, 696273, 724106, 754340, 787904, 824740, 863822, 903777, 943065, 979720, 1011514, 1036598, 1053784, 1062352, 1062211, 1054494, 1041551, 1025924, 1009497, 993613, 979314, 966756, 954664, 941092, 924788, 905372, 882364, 854991, 823360, 789214, 754882, 721685, 689853, 659696, 632191, 608301, 588362, 572446, 560966, 554409, 552398, 553185, 554090, 552364, 545866, 533461, 515323]
63315E15323k2248k3692k2441j9562j6472j4022j2199j0557q787o904n233m216
63303C48990m068m428m546l942k859j942j631j906k448k858k848k497k244k422
63289C08351k814k876k383j734j495j823k309k375j771p97l0J83qk18k29j35j78
63272B87359n66j245j740j470m22O50R92O94M17M65N37L99K64M00P57J240J933
63255B90664K786L431L627L615L730L896L941M162M999O244P140P391P552Q176
63241C61354R060R750J0436J1798J4013J6371J8044J8876J9338J9926K0818K1863
63229E51647K2651K2736K2054K1099K0483K0334K0321K0190J9965J9677J9232
63218G80389J8755J8674J9185J9879K0079J9389J7645J4669J0439N365j9n561
$$ y = [515323, 493075, 469383, 446942, 427380, 410908, 396886, 384687, 374130, 365343, 358439, 353206, 348990, 344922, 340494, 335948, 332006, 329147, 327205, 325574, 323668, 321220, 318362, 315514, 313017, 310773, 308351, 305537, 302661, 300278, 298544, 297049, 295226, 292917, 290542, 288771, 287974, 287944, 288127, 288119, 287901, 287672, 287537, 287359, 286793, 285548, 283808, 282338, 281916, 282566, 283558, 284252, 284669, 285134, 285671, 286070, 286334, 286734, 287491, 288731, 290664, 293450, 296881, 300508, 304123, 307853, 311749, 315690, 319852, 324851, 331095, 338235, 345626, 353178, 361354, 370414, 380164, 390600, 402398, 416411, 432782, 450826, 469702, 489040, 508966, 529784, 551647, 574298, 597034, 619088, 640187, 660670, 681004, 701325, 721515, 741480, 761157, 780389, 799144, 817818, 837003, 856882, 876961, 896350, 913995, 928664, 939103, 944468, 944449, 938888]
63206I38888j1314j6920k1638k5033k7261k8674k9463k9740k9504k8431k6106
63195F64804k2726j9090j5737j2453q965n625l004j037R24L352O146Q831J0906
63182F06326J2170J3078J4444J6448J8114J8364J7391J6455J6333J6563J6351
63171G82037J5622J4851J4303J3752J2744J0869P991M441P71k836o730j1141j5690
63158H40984j9776k3210k6111k8339k9457k9340k8365k7042k5668k4365k3085
63147E56226k1471j9122j6214j3570j1764j0460q988p341o113n536n181m668m195
63134D21603l975l708k994j986j176o90k16M36J154J845K507K967K983K657K446
63119D23853K602K906L068L042K844K423J876J549J631J895J990J890J863K091
$$ y = [938888, 927574, 910654, 889016, 863983, 836722, 808048, 778585, 748845, 719341, 690910, 664804, 642078, 622988, 607251, 594798, 585833, 580208, 577204, 576167, 577091, 580443, 586589, 595420, 606326, 618496, 631574, 646018, 662466, 680580, 698944, 716335, 732790, 749123, 765686, 782037, 797659, 812510, 826813, 840565, 853309, 864178, 872169, 876610, 877381, 874545, 867815, 856674, 840984, 821208, 797998, 771887, 743548, 714091, 684751, 656386, 629344, 603676, 579311, 556226, 534755, 515633, 499419, 485849, 474085, 463625, 454637, 447296, 441183, 435647, 430466, 425798, 421603, 417628, 413920, 410926, 408940, 407764, 407074, 406858, 407294, 408448, 410293, 412800, 415767, 418750, 421407, 423853, 426455, 429361, 432429, 435471, 438315, 440738, 442614, 444163, 445794, 447689, 449679, 451569, 453432, 455523]
63105D55523K429K468J869P72j75m50k60k27n03o40l56L3J07j15l47m15l42k76
63087D59095m36p38o14L02J417J838J740K135L125L536K861K330L145M686N604
63072D90026N889O446P284P687P850Q727J0226J1190J1420J2186J4185J6458J8107
63059F27681J9802K2526K5844K8622L0804L3290L6390L9484M2105M4446M6777
63048I97771M9066N1216N3104N4334N4460N3572N2227N0864M9556M8347M7429
63037A561946M6946M6883M7080M7110M6326M4350M1466L8104L3977K8074J9696
63026B001958R219k243j3796k5192l6470m7265n6632o3608o7896o9914p0275o9397
63014A488489o7506o4548o0090n3729m5822l7502k9754k2743j6117r614l150L240
$$ y = [455523, 457952, 460420, 462289, 463061, 462886, 462436, 462176, 461949, 461446, 460806, 460450, 460483, 460590, 460475, 460128, 459713, 459371, 459095, 458659, 457921, 457307, 457609, 459026, 460864, 462604, 464739, 467864, 471400, 474261, 476591, 479736, 484422, 490026, 495915, 502361, 509645, 517332, 525182, 533909, 544135, 555325, 566745, 578931, 593116, 609574, 627681, 647483, 670009, 695853, 724475, 755279, 788569, 824959, 864443, 906548, 950994, 997771, 1046837, 1098053, 1151157, 1205491, 1259951, 1313523, 1365750, 1416614, 1466170, 1514517, 1561946, 1608892, 1655775, 1702855, 1749965, 1796291, 1840641, 1882107, 1920211, 1954188, 1982262, 2001958, 2011177, 2008934, 1995138, 1969946, 1933476, 1886211, 1829579, 1765971, 1698075, 1628161, 1557886, 1488489, 1420983, 1356435, 1296345, 1242616, 1196794, 1159292, 1129538, 1106795, 1090678, 1081064, 1077914, 1081154]
63002A081154R157J3930J7343K0011K2651K5233K7262K8606K9545L0215L0491
62991A335598L0396L0108K9616K8693K7277K5572K3714K1500J8479J4130Q181
62980A593264R36o942j5067k3507l2057l9802m5908n0487n4094n6665n7613n6873
62968A155185n5113n2926n0384m7490m4441m1318l7987l4487l1097k7991k5273
62957G06678k3300k2319k1739k0498j8428j6593j5920j6102j6215j5826j4977
62946E04761j3667j1977j0429r570r326r223r029q741q141o960n436m259l909
62933C94094m317n011n392m999l896k717k044j899k021k303k574k396j693j218
62919C51614j698k662k953k318j601j366j244r81j097j888k561k180r55Q7L88
$$ y = [1081154, 1090311, 1104241, 1121584, 1141595, 1164246, 1189479, 1216741, 1245347, 1274892, 1305107, 1335598, 1365994, 1396102, 1425718, 1454411, 1481688, 1507260, 1530974, 1552474, 1570953, 1585083, 1593264, 1594200, 1587258, 1572191, 1548684, 1516627, 1476825, 1430917, 1380430, 1326336, 1269671, 1212058, 1155185, 1100072, 1047146, 996762, 949272, 904831, 863513, 825526, 791039, 759942, 731951, 706678, 683378, 661059, 639320, 618822, 600394, 583801, 567881, 551779, 535564, 519738, 504761, 491094, 479117, 468688, 459118, 449792, 440569, 431540, 422799, 414658, 407698, 402262, 398003, 394094, 389777, 384766, 379374, 374375, 370479, 367762, 365718, 363819, 361798, 359495, 356921, 354525, 352832, 351614, 349916, 347254, 344301, 341983, 340382, 339016, 337772, 336791, 335694, 333806, 331245, 329065, 328110, 328197, 328585]
62904C28585J57k51n84n59j67Q0j47k91L57J445J896J421Q23O94O99M23O5j41
62886C34505m09q08q41k81K37Q5k96j9Q96J582J583J279J086R47P10M30J52j42
62868C40696k98j49M7j95q64j380j374j044o61j99L73Q82J253J646K046K177K008
62851C44964J858J800J452Q03N60J129J725J363L87J13R68J922J972J362Q54N73
62835C63805K45R3N52J291J431Q39M08O76R30L69m30j65J209K266K091J550J946
62818C79106L110L727L186K237J829K106K709L375L879L973L780L896M680N718
62804D27311O313O339O302O671P468Q366R006R273R463J0132J1533J3318J4959
62791E46454J6512J8720K2238K6793L1273L4805L7715M1188M5894N1289N6504
$$ y = [328585, 328742, 328491, 327907, 327348, 327181, 327261, 327114, 326823, 327180, 328625, 330521, 331942, 332765, 333459, 334158, 334581, 334646, 334505, 334096, 333288, 332447, 332166, 332403, 332488, 332192, 332173, 333069, 334651, 336234, 337513, 338599, 339546, 340256, 340686, 340838, 340696, 340398, 340249, 340296, 340101, 339237, 337857, 336483, 335439, 334778, 334579, 334952, 335834, 337087, 338733, 340779, 342956, 344964, 346822, 348622, 350074, 350877, 351437, 352566, 354291, 355654, 356041, 356154, 357122, 359044, 361016, 362378, 363232, 363805, 364050, 364143, 364695, 365986, 367417, 368256, 368664, 369340, 370270, 370639, 370209, 370044, 371253, 373519, 375610, 377160, 379106, 382216, 385943, 389129, 391366, 393195, 395301, 398010, 401385, 405264, 409237, 413017, 416913, 421593, 427311, 433624, 439963, 446265, 452936, 460404, 468770, 477776, 487049, 496512, 506644, 518177, 531495, 546454, 562966, 581686, 603924, 630717, 661990, 696795, 734510, 775698, 821592, 872881, 929385]
62780I29385O1535O6999P2881P8220Q2112Q4465Q5537Q5249Q3292P9489P3719
62769A782883O5777N5585M3349K9338J3843k387j8076l2180m4507n5353o4766
62758A773506p2416p7975q1316q2490q1792p9746p6868p3533o9996o6204o1637
62747I49533n5924m9759m4553m0893l7895l4523l0828k7425k4308k1066j7853
62736E64506j5281j3425j1756j0015q498p440o653n869n015m152l434l035k792
62723D67141k107o61J014K144K695L253M136N250O591Q226R884J1263J2651J4557
62709E46037J6831J8897K0827K3337K6622L0028L3140L6374M0148M4136M7810
62698H84187N1192N4617N8127O1407O3990O5323O5070O3432O0735N6570M9993
$$ y = [929385, 990920, 1057919, 1130800, 1209020, 1291132, 1375597, 1461134, 1546383, 1629675, 1709164, 1782883, 1848660, 1904245, 1947594, 1976932, 1990775, 1988388, 1970312, 1938132, 1893625, 1838272, 1773506, 1701090, 1623115, 1541799, 1459309, 1377517, 1297771, 1220903, 1147370, 1077374, 1011170, 949533, 893609, 843850, 799297, 758404, 720509, 685986, 655158, 627733, 603425, 582359, 564506, 549225, 535800, 524044, 514029, 505531, 498091, 491438, 485569, 480554, 476402, 472968, 469933, 467141, 465034, 464373, 465387, 467531, 470226, 473479, 477615, 482865, 489456, 497682, 507566, 518829, 531480, 546037, 562868, 581765, 602592, 625929, 652551, 682579, 715719, 752093, 792241, 836377, 884187, 935379, 989996, 1048123, 1109530, 1173520, 1238843, 1303913, 1367345, 1428080, 1484650, 1534643]
62687A534643M0781K9852J8209O071o570j9201l1115m1914n1212n8373o3139o6084
62675A291948o7822o8148o6647o3778o0610n7542n4034m9649m4788m0218l6324
62664F82388l2986k9924k6956k4058k1296j8679j6158j3788j1752j0212r213q744
62652D58622q652q553q154p671p520p572p209o225n073m021k706r75M48P92L30
62637C85861M5M36J191J778J844J241K24n17n43k50l35q67j366j532j369p29N59
62620C85671K095L088L154K612J969J633J989L163M590N357N165M567M298M739
62606D34090O050Q154J0479J2264J3418J4656J6561J8962K1436K4007K6947L0179
62594F37203L3299L5994L8235M0060M1346M1694M0586L7820L3814K9158K3915
$$ y = [1534643, 1575424, 1605276, 1623485, 1629556, 1622986, 1603785, 1572670, 1530756, 1479544, 1421171, 1358032, 1291948, 1224126, 1155978, 1089331, 1025553, 964943, 907401, 853367, 803718, 758930, 718712, 682388, 649402, 619478, 592522, 568464, 547168, 528489, 512331, 498543, 486791, 476579, 467366, 458622, 449970, 441417, 433263, 425592, 418072, 410500, 403291, 397066, 391993, 387972, 385266, 384291, 384739, 385531, 385861, 385906, 386342, 387533, 389311, 391155, 392396, 392620, 392103, 391560, 391310, 390975, 390108, 388742, 387210, 385841, 385112, 385671, 387766, 390854, 394008, 396620, 398589, 400222, 402211, 405374, 409964, 415321, 420486, 425053, 429351, 434090, 440140, 448294, 458773, 471037, 484455, 499111, 515672, 534634, 556070, 580077, 607024, 637203, 670502, 706496, 744731, 784791, 826137, 867831, 908417, 946237, 980051, 1009209, 1033124]
62583A033124J7698J0410K460n801j4221k2203k8558l2645l5165l7258l9026l9659
62571H09156l8838l7312l5890l4490l2545k9950k7199k4748k2618k0590j8526
62560D86450j6387j4165j1944r975q522p625p052o550o012n423m722l899l090
62547C81084k475k066j760j481j161o58N4O70Q31O04L70K20j33o60p16J78J566
62530C74467K592L153L943N368O995Q323R551J1177J3153J4951J6371J7830J9766
62517E07640K2121K4540K6839K9102L1475L4038L6714L9112M0552M0462L8791
62506H71386L5968L2527K8776K4657J9787J3830P054L99n272r877j3788j6936
62494I88511j8700j8723j7413j5387j2754r190m486J196P336J3158J8009K1886
$$ y = [1033124, 1050822, 1061232, 1063692, 1057891, 1043670, 1021467, 992909, 960264, 925099, 887841, 848815, 809156, 770318, 733006, 697116, 662626, 630081, 600131, 572932, 548184, 525566, 504976, 486450, 470063, 455898, 443954, 433979, 425457, 417832, 410780, 404230, 398218, 392795, 388073, 384174, 381084, 378609, 376543, 374783, 373302, 372141, 371483, 371537, 372207, 373038, 373642, 374012, 374232, 374099, 373439, 372723, 372901, 374467, 377059, 380212, 384155, 389523, 396518, 404841, 414392, 425569, 438722, 453673, 470044, 487874, 507640, 529761, 554301, 581140, 610242, 641717, 675755, 712469, 751581, 792133, 832595, 871386, 907354, 939881, 968657, 993314, 1013101, 1026931, 1033985, 1034384, 1029112, 1019235, 1005447, 988511, 969811, 951088, 933675, 918288, 905534, 896344, 891858, 893054, 900390, 913548, 931557, 953443]
62482I53443K5380K8789L1564L2912L2572L0601K6740K0742J3257N656j236p765
62470A192655j4693k2272l0184l7779m4071m8110m9846n0320n0516n0286m8835
62459G45743m5944m2179l8066l3755k9458k5602k2320j9291j6331j3754j1867
62448D47176j0423q867o968n014l581l148l641m203l809k389r37k22J74R48J716
62433C96812J401j76j966l114l783m292m315l580k728k666l344l892l758l125
62419C57474k363j689j333j402j579j460j218j401k068k640k717k402j811q80
62405C32511P4L47k17q27p26j08M25Q60J625K705L515L659L305K877K677K756
62389C55458K883K725K354K432L447M952N983O157N952N951O252O719P316Q003
$$ y = [953443, 978823, 1007612, 1039176, 1072088, 1104660, 1135261, 1162001, 1182743, 1196000, 1201656, 1200420, 1192655, 1177962, 1155690, 1125506, 1087727, 1043656, 995546, 945700, 895380, 844864, 794578, 745743, 699799, 657620, 619554, 585799, 556341, 530739, 508419, 489128, 472797, 459043, 447176, 436753, 427886, 420918, 415904, 412323, 409175, 405534, 401331, 397522, 395133, 394196, 393974, 394148, 395096, 396812, 398213, 398037, 396071, 392957, 389174, 384882, 380567, 376987, 374259, 371593, 368249, 364357, 360599, 357474, 355111, 353422, 352089, 350687, 349108, 347648, 346430, 345029, 342961, 340321, 337604, 335202, 333391, 332511, 332585, 332932, 332715, 331888, 331162, 331054, 331479, 332339, 333964, 336669, 340184, 343843, 347148, 350025, 352702, 355458, 358341, 361066, 363420, 365852, 369299, 374251, 380234, 386391, 392343, 398294, 404546, 411265, 418581, 426584]
62375D26584Q624R101R573J0197J0995J1932J2986J4071J5076J6114J7571J9863
62363E82687K3195K7526L2553L7694M2322M6205M9650N3142N6742N9832O1390
62352A072938O0630N7420N2026M4610L5253K4623J4072M683l610j1516j9206k6096
62340A305827l1780l6561m0858m4497m6966m8096m8147m7321m5583m2931l9696
62329H33391l6335l3031k9632k6063k2736k0290j8894j8039j7174j6327j5839
62318E79031j5649j5263j4424j3481j2885j2558j1953j0731r200q023p471p094
62306D40299o308n225m557m601m738m232l159k172j563j072n32r0K02N42R56J251
62290D05001J467J960K759L288L097K619K730L721N021N926O282O457O852P597
$$ y = [426584, 435208, 444309, 453882, 464079, 475074, 487006, 499992, 514063, 529139, 545253, 562824, 582687, 605882, 633408, 665961, 703655, 745977, 792182, 841832, 894974, 951716, 1011548, 1072938, 1133568, 1190988, 1243014, 1287624, 1322877, 1347500, 1361572, 1366255, 1362645, 1351129, 1331923, 1305827, 1274047, 1237486, 1196628, 1152131, 1105165, 1057069, 1008922, 961601, 916018, 873087, 833391, 797056, 764025, 734393, 708330, 685594, 665304, 646410, 628371, 611197, 594870, 579031, 563382, 548119, 533695, 520214, 507329, 494771, 482818, 472087, 462887, 454864, 447393, 440299, 433991, 428766, 424209, 419608, 414870, 410638, 407479, 405307, 403744, 402672, 402140, 402050, 402252, 402794, 403750, 405001, 406468, 408428, 411187, 414475, 417572, 420191, 422921, 426642, 431663, 437589, 443871, 450328, 457180, 464777]
62276D64777Q587R688J0862J2084J3215J4082J4732J5553J7043J9373K2159K4706
62264F46861K6654K8370L0587L3613L7091M0581M4055M7595N0927N3648N5685
62253A095667N7080N7341N5528N1022M3891L4566K3659J2184J377q063j6263k3570
62241A384419l0060l5840m1341m6806n1734n5370n7545n8538n8255n6175n2336
62230H40419m7763m3546l9858l6225l2488k8958k5698k2358j8894j5961j4082
62219E14588j2835j1374r563p994o978o184n378m801m536m049k924j581p69o07
62205D35015o34n04j66M46J371K355L095L623M062M280M302M789O348Q399R544
62190D86325R260Q554Q716R902J1252J1916J1742J1244J1184J1747J2091J1115
$$ y = [464777, 473364, 483052, 493914, 505998, 519213, 533295, 548027, 563580, 580623, 599996, 622155, 646861, 673515, 701885, 732472, 766085, 803176, 843757, 887812, 935407, 986334, 1039982, 1095667, 1152747, 1210088, 1265616, 1316638, 1360529, 1395095, 1418754, 1430938, 1432315, 1424252, 1407989, 1384419, 1354359, 1318519, 1277178, 1230372, 1178638, 1123268, 1065723, 1007185, 948930, 892755, 840419, 792656, 749110, 709252, 673027, 640539, 611581, 585883, 563525, 544631, 528670, 514588, 501753, 490379, 480816, 472822, 465844, 459660, 454282, 449481, 444945, 440896, 437972, 436391, 435622, 435015, 434381, 433877, 433711, 434157, 435528, 437883, 440978, 444601, 448663, 452943, 457245, 462034, 468382, 476781, 486325, 495585, 504139, 512855, 522757, 534009, 545925, 557667, 568911, 580095, 591842, 603933, 615048]
62178F15048Q875O826O321P276Q592R529J0307J1648J4082J7713K2293K7489L3011
62165G99010L8380M2828M5721M7027M6958M5257M1371L5374K8100K0284J2122
62154A202432L868l736j0058j5122j9261k2762k6107k9953l4249l7793l9356l9036
62142I28867l7986l6946l5518l2870k8798k4067j9910j7027j4980j2702r770o853
62130F51440m784l615k791j835n16J201L009M441N622P365R984J2366J2993J1597
62116G06477R226O825M519K288N86j13J6J95l96k121m728p615j0292j2533j3976
62101F78358j4033j2478r922p252m778k343KJ973L583N104O484P358P715Q070
62087F67841Q756R454R692R516R470R997J1086J2378J3569J4721J6153J7978J9884
$$ y = [615048, 623923, 630749, 637070, 644346, 652938, 662467, 672774, 684422, 698504, 716217, 738510, 765999, 799010, 837390, 880218, 925939, 972966, 1019924, 1065181, 1106552, 1141926, 1170026, 1190310, 1202432, 1206300, 1202564, 1192506, 1177384, 1158123, 1135361, 1109254, 1079301, 1045052, 1007259, 967903, 928867, 890881, 853935, 818417, 785547, 756749, 732682, 712772, 695745, 680765, 668063, 658293, 651440, 646656, 643041, 640250, 638415, 637899, 639100, 642109, 646550, 652172, 659537, 669521, 681887, 694880, 706477, 715703, 722528, 727047, 729335, 729921, 729808, 729824, 730019, 729623, 727502, 722774, 715159, 704867, 692334, 678358, 664325, 651847, 641925, 634673, 629895, 627552, 627554, 629527, 633110, 638214, 644698, 652056, 659771, 667841, 676597, 686051, 695743, 705259, 714729, 724726, 735812, 748190, 761759, 776480, 792633, 810611, 830495]
62074H30495K1484K2751K3941K5172K6253K6836K6736K6279K6316K7531K9594
62063A113388L1426L2388L2642L2113K9896K5414J9462J3272O945p9p257j2966
62051A316644j6457j8780k1389k4682k8381l2413l6634m0272m2480m3273m3288
62040I68595m2824m1665l9751l7469l5186l2930l0607k8246k5844k3265k0465
62029F10343j7692j5226j3021j0869q919p764p781q578r380r831j0022r894r187
62016D72179q099p338p140o857n928m764m004l372k092k06J452K462L213L986
62002D33492M474M531M646N270O115O490N966M530K478M04j059j828k434l382
61988D69693m709o218p727q941r505r451r240r170r038q557p719o597n243l942
$$ y = [830495, 851979, 874730, 898671, 923843, 950096, 976932, 1003668, 1029947, 1056263, 1083794, 1113388, 1144814, 1177202, 1209844, 1241957, 1271853, 1297267, 1316729, 1330001, 1336946, 1336867, 1329610, 1316644, 1300187, 1281407, 1260018, 1235336, 1206955, 1174542, 1137908, 1097636, 1055156, 1011883, 968595, 925771, 884106, 844355, 806886, 771700, 738770, 708163, 679917, 654073, 630808, 610343, 592651, 577425, 564404, 553535, 544616, 536852, 529071, 520493, 511113, 501282, 491260, 481366, 472179, 464080, 456742, 449602, 442745, 436817, 432053, 428049, 424677, 422585, 422379, 423831, 426293, 429506, 433492, 437966, 442497, 447143, 452413, 458528, 465018, 470984, 475514, 477992, 478396, 477337, 475509, 473075, 469693, 464984, 458766, 451039, 442098, 432593, 423142, 413902, 404732, 395694, 387137, 379418, 372821, 367578, 363636]
61974C63636l135k823k495j927j526j586j721j462r76o49m07QL98M81O07J355
61958C47778K453K909K353J620J760K939M586O152P362Q082Q410Q804R813J1555
61944D26576J3599J5410J6801J8012J9353K0849K2230K3256K3967K4514K4866
61933F49433K4802K4183K3051K1444J9273J6556J3595J0764Q129N439K489o07
61921H18551l586o283q649j0556j1764j2004j1077q953n917k518Q61M280P918
61908G50303J1544J4607J6804J8187J8671J7869J5552J1973P552K602k542p460
61896H75662j1928j5905j9109k1115k2017k2454k2633k2039k0524j8947j8078
61885F60913j7542j6657j5666j5125j4693j3694j2548j2264j2620j2319j1027
$$ y = [363636, 360501, 357678, 355183, 353256, 351730, 350144, 348423, 346961, 345985, 345336, 344929, 344937, 345335, 345816, 346423, 347778, 350231, 353140, 355493, 357113, 358873, 361812, 366398, 372550, 379912, 387994, 396404, 405208, 415021, 426576, 440175, 455585, 472386, 490398, 509751, 530600, 552830, 576086, 600053, 624567, 649433, 674235, 698418, 721469, 742913, 762186, 778742, 792337, 803101, 811230, 816669, 819158, 818551, 814965, 808682, 800033, 789477, 777713, 765709, 754632, 745679, 739762, 737244, 738105, 742385, 750303, 761847, 776454, 793258, 811445, 830116, 847985, 863537, 875510, 883062, 885664, 883122, 875662, 863734, 847829, 828720, 807605, 785588, 763134, 740501, 718462, 697938, 678991, 660913, 643371, 626714, 611048, 595923, 581230, 567536, 554988, 542724, 530104, 517785, 506758]
61874E06758r781r136q314o779n245m319l386j797j25R08J826L549N825P722R236
61859D86942J1126J3476J5697J7760K0249K3146K5716K7833L0331L3666L7060
61848G43002L9442M0595M0881M0396L8897L6251L2523K7739K1868J4979P408q5
61836A083896o433j0943j3856j5883j7068j6583j3814r300m285M36M954R583J4052
61823A004756J7406J8760J8029J5780J2321P294L70p826j5961k3066k9047l4159
61811I84657l8378m1361m2765m2483m0783l8300l5682l3170l0646k8037k5360
61800E87692k2511j9380j6331j4159j3250j2951j2161j0514q680p467o879o286
61788D37123n284m096l105k383j862j623j711j900k036k334k919l224k536j127
$$ y = [506758, 496977, 487841, 479527, 472748, 467503, 463184, 459798, 458001, 457876, 458784, 460610, 464159, 469984, 477706, 486942, 498068, 511544, 527241, 545001, 565250, 588396, 614112, 641945, 672276, 705942, 743002, 782444, 823039, 863920, 904316, 943213, 979464, 1011987, 1039726, 1061594, 1076573, 1083981, 1083896, 1077463, 1066520, 1052664, 1036781, 1019713, 1003130, 989316, 980016, 975731, 976167, 981121, 990704, 1004756, 1022162, 1040922, 1058951, 1074731, 1087052, 1094346, 1094716, 1086890, 1070929, 1047863, 1018816, 984657, 946279, 904918, 862153, 819670, 778887, 740587, 704905, 671735, 641089, 613052, 587692, 565181, 545801, 529470, 515311, 502061, 489110, 476949, 466435, 457755, 450288, 443409, 437123, 431839, 427743, 424638, 422255, 420393, 418770, 417059, 415159, 413123, 410789, 407870, 404646, 402110, 400983]
61774D00983j51k48q99j344j464j370q76L7Q52J193J422J884K123J616R21J117
61758D05796K276L443M007M196M161L520K142O11m69j111j584k002k435k967l357
61743D16227l151k411j853j928k200j974j167k76J66j31j031j762j381J31J649
61728C98908K207K073K111K484K712K690K792L032K935K455K242K665L114K827
61714D35247J999J441J324R62q0j253j753j620j676k437l509m130m012l479l030
61699D13994k929l158l507l718l610l157k502j889j509j308j023n70l23p93j961
61684C82037l196l807l604k913k277k135k421k504j840p53j48l99r61j199j057
61669C52823p09j73L79M46r1o15n47j14K10M64Q60J172J202J356J896K064J055
$$ y = [400983, 400832, 400584, 399685, 398341, 396877, 395507, 394631, 394668, 395520, 396713, 398135, 400019, 402142, 403758, 404679, 405796, 408072, 411515, 415522, 419718, 423879, 427399, 429541, 430152, 429683, 428572, 426988, 424986, 422551, 419584, 416227, 413076, 410665, 408812, 406884, 404684, 402710, 401543, 401267, 401433, 401302, 400271, 398509, 397128, 397259, 398908, 401115, 403188, 405299, 407783, 410495, 413185, 415977, 419009, 421944, 424399, 426641, 429306, 432420, 435247, 437246, 438687, 440011, 440973, 440893, 439640, 437887, 436267, 434591, 432154, 428645, 424515, 420503, 417024, 413994, 411065, 407907, 404400, 400682, 397072, 393915, 391413, 389524, 388015, 386707, 385684, 385114, 384791, 383998, 382037, 378841, 375034, 371430, 368517, 366240, 364105, 361684, 359180, 357340, 356587, 356439, 356040, 355079, 353880, 352823, 352114, 351941, 352320, 352766, 352675, 352060, 351513, 351399, 351609, 352073, 352933, 354105, 355307, 356663, 358559, 360623, 361678]
61652C61678m23p83K15J193J233J049J576K574L330L883M621N284N220M375L318
61637C98343K445J662O85p27k585m396n348n136m357l806l684l767l906m012l856
61622C57555l395k939k646k122j031K09Q25O07On40r08j126j307j720k542l561
61606C35365m406m915n069m810m234l722l555l621l725l870l878l249j953r92
61592B83366j371k713l600l284k325j522j038p50p41j032j274j166q61o88p04
61577B60297p73q47r51j045j085j120j145j072r20q10p55n94k72N5K98N49P97
61560B50607P82L67j40k07L81J338K107K224J609O52o0j98P6L34K73k5j58K42
61542B60204J011J471J162N06M06J165K181K775K914K898K709K175J491J127J148
$$ y = [361678, 361255, 360472, 360687, 361880, 363113, 364162, 365738, 368312, 371642, 375525, 380146, 385430, 390650, 395025, 398343, 400788, 402450, 403135, 402408, 399823, 395427, 390079, 384943, 380586, 376780, 373096, 369329, 365423, 361411, 357555, 354160, 351221, 348575, 346453, 345422, 345631, 346456, 347063, 347069, 346529, 345621, 344495, 343188, 341468, 338926, 335365, 330959, 326044, 320975, 316165, 311931, 308209, 304654, 301033, 297308, 293438, 289560, 286311, 284358, 283366, 281995, 279282, 275682, 272398, 270073, 268551, 267513, 266763, 266022, 264990, 263716, 262550, 261689, 261001, 260297, 259524, 258677, 257726, 256681, 255596, 254476, 253331, 252259, 251339, 250529, 249774, 249180, 248908, 248963, 249261, 249810, 250607, 251389, 251756, 251616, 251409, 251790, 253128, 255235, 257459, 259068, 259720, 259660, 259462, 259538, 259872, 260145, 260120, 259962, 260204, 261215, 262686, 263848, 264354, 264760, 265925, 268106, 270881, 273795, 276693, 279402, 281577, 283068, 284195, 285343]
61527B85343J059M93k39n49m02m14j038j924k323k039j662j698j810j258M4J291
61511B72874J717J415J070J061J138Q24L3q22j234j159j044j249j516j296n74
61496B71238L5J23J22O92J805K750K983K589J964J436J202J249J234P59Rk41M45
61479B90394J449J713R58o7n76n68n13n97o61o68p88r07n46N18J729K226J722
61462B94818O60l96j139j339p77K80J014R12N15P43J592K011J305N1o63n54k04
61445B98829r7o5K26P50J214J449J554J759K212K844L384L610L562L417L211K804
61429C30663K146J442J004R83J199J273J015P17Q53J446J967K015J771J590J499
61414C51583J407J438J545J185l2j576k578k990l372l704l446k735k435k655k434
$$ y = [285343, 286402, 286895, 286656, 286107, 285705, 285291, 284253, 282329, 280006, 277967, 276305, 274607, 272797, 271539, 271583, 272874, 274591, 276006, 277076, 278137, 279275, 280099, 280132, 279310, 278076, 276917, 275873, 274624, 273108, 271812, 271238, 271273, 271396, 271518, 272210, 274015, 276765, 279748, 282337, 284301, 285737, 286939, 288188, 289422, 290181, 290190, 289949, 290394, 291843, 293556, 294514, 294447, 293871, 293303, 292790, 292193, 291532, 290864, 290076, 289169, 288623, 289141, 290870, 293096, 294818, 295478, 295082, 293943, 292604, 291827, 292107, 293121, 294033, 294548, 295291, 296883, 298894, 300199, 300250, 299587, 299033, 298829, 298732, 298667, 298893, 299643, 300857, 302306, 303860, 305619, 307831, 310675, 314059, 317669, 321231, 324648, 327859, 330663, 332809, 334251, 335255, 336238, 337437, 338710, 339725, 340442, 341295, 342741, 344708, 346723, 348494, 350084, 351583, 352990, 354428, 355973, 357158, 357126, 355550, 352972, 349982, 346610, 342906, 339460, 336725, 334290, 331635, 329201]
61399C29201j373m92o36j120r52n44q61j542j323j04Q44Q24N38P02J013R30N56
61382C25661J80l09r74j374j098l22N26J288J912K183K017J699J631J971K636
61367C37627L306L461K859K035J792K172K502K480K559L096L910M883O218P700
61353C86600Q572Q664Q847R714J0528J0222Q878P368O045M680L368K570K340K296
61339D80692K304K512K738K539J870J131M93k72j307k494l747n026n972o121n603
61324D63737n195n489o236o600n957m492l137k729l046k991j954n96J37L94J118
61309D16964K699M606O229P381Q002P996P486O668N403L464J186p94k440m226
61295D70624n997o724n848m248l319l428l732l343k321j577j919l116l893l140
$$ y = [329201, 327828, 327336, 326700, 325580, 324628, 324084, 323223, 321681, 320358, 320254, 321098, 321922, 322460, 323162, 324175, 325105, 325661, 325841, 325532, 324558, 323184, 322086, 321764, 322290, 323578, 325490, 327673, 329690, 331389, 333020, 334991, 337627, 340933, 344394, 347253, 349288, 351080, 353252, 355754, 358234, 360793, 363889, 367799, 372682, 378900, 386600, 395172, 403836, 412683, 422397, 432925, 443147, 452025, 459393, 465438, 470118, 473486, 476056, 478396, 480692, 482996, 485508, 488246, 490785, 492655, 493786, 494279, 494007, 492700, 490206, 486459, 481433, 475461, 469340, 463737, 458542, 453053, 446817, 440217, 434260, 429768, 426631, 423902, 420856, 417865, 415911, 415315, 415452, 415846, 416964, 419663, 424269, 430498, 437879, 445881, 453877, 461363, 468031, 473434, 476898, 478084, 477290, 474850, 470624, 464627, 457903, 452055, 447807, 444488, 441060, 437328, 433985, 431664, 430087, 428168, 425052, 421159, 418019]
61281D18019j126Q44J926K492L318M522N612O171O185N976N954O242O386N822
61267D78343M705L861L822M310M945N917P589R798J1952J3528J4095J3247J1080
61254E87192Q539O717N721M700K993Q81r08k136l247m723o407p626q000p980q285
61239E67431q889r083q554p946p926q206p968o967n654m370l122k068j574j610
61225D83494j604j149n21j54j08k35n75j125j504j317p30k60l7K43O75R25P29
61208D76747K02m99j374k165k266j405n9J264K850N266Q281J1021J3201J5452
61194E26516J8110K0400K1201K0209J7888J4749J1226P982N735M648M312M216
61182F77192M076L798L412L029K598J869P40n02j553k498l591m790n865o745p544
$$ y = [418019, 416893, 417737, 419663, 422155, 425473, 429995, 435607, 441778, 447963, 453939, 459893, 466135, 472521, 478343, 483048, 486909, 490731, 495041, 499986, 505903, 513492, 523290, 535242, 548770, 562865, 576112, 587192, 595731, 602448, 608169, 612869, 615862, 616743, 615835, 613699, 610452, 605729, 599322, 591696, 583696, 575716, 567431, 558542, 549459, 540905, 532959, 525033, 516827, 508859, 501892, 496238, 491868, 488746, 486678, 485104, 483494, 481890, 480741, 480220, 480066, 479958, 479723, 479148, 478023, 476519, 475202, 474472, 474212, 474175, 474418, 475093, 476018, 476747, 476949, 476450, 475076, 472911, 470645, 469240, 469181, 470445, 473295, 478561, 486842, 497863, 511064, 526516, 544626, 565026, 586227, 606436, 624324, 639073, 650299, 658281, 664016, 668664, 672976, 677192, 681268, 685066, 688478, 691507, 694105, 695974, 696714, 696212, 694659, 692161, 688570, 683780, 677915, 671170, 663626]
61167F63626q303r024r745j0321j0432j0140j0125j0828j1594j1343r991q563
61155E43217p812p339o251m184j487J239L437M687M734L464R96k092m894o895
61141E20820q381r782j0819j0825r727q079o264m284k354r26jR54K210L476M560
61126D60578N704P057Q342R333J0150J0900J1593J2514J4053J5894J7139J7610
61114F00867J8181J9375K0347K0077J8940J8146J7971J7520J6182J4459J3177
61103G95242J2418J1507R660O523K359k108o182r563j2264j4374j5964j7027j7370
61090G42857j6853j5842j5080j4911j4984j4933j4867j4865j4472j3254j1533
61079E81263j0018q891p823o702n787n148m459l432k128q31J39N76O08P46J433
$$ y = [663626, 655323, 646299, 636554, 626233, 615801, 605661, 595536, 584708, 573114, 561771, 551780, 543217, 535405, 528066, 521815, 517631, 516144, 517383, 520820, 525507, 530241, 533705, 534701, 532609, 527715, 520820, 512439, 502657, 491838, 481013, 471286, 463207, 456943, 452659, 450305, 449379, 449378, 450332, 452542, 456018, 460578, 466282, 473339, 481681, 491014, 501164, 512064, 523657, 536171, 550224, 566118, 583257, 600867, 619048, 638423, 658770, 678847, 697787, 715933, 733904, 751424, 767606, 782065, 795242, 807660, 819167, 828827, 835350, 837709, 835601, 829419, 819856, 807592, 793218, 777254, 760227, 742857, 726004, 710162, 695082, 680171, 665187, 650254, 635387, 620522, 606050, 592796, 581263, 571245, 562354, 554531, 547829, 542042, 536894, 532435, 529003, 526875, 526044, 526183, 526759, 527367, 528113, 529546]
61064E29546K620L958N251O418P256P634P814Q230Q969R755J0407J1064J1979
61051F30901J3287J4916J6564J7931J9123K0625K2682K4932K6834K8254K9354
61040H65403L0259L1038L1804L2580L3360L4463L6399L9082M1678M3600M5132
61029A264798M6623M7672M7856M7813M8757N1234N5113O0563O8109P7710Q8563
61018A904811R9873J11370J23347J36978J54392J77577K07270K43709K88102L42229
61008C789658M06948M82893N73057O83101Q18742R84762J186347J424226J677778
60999A2027512J888008J964550J826454J454485R16028L42209j26335l90077m16184
60990A9486650k42217L2606K70361L37467J57745k52574p91537j317663j709181
$$ y = [529546, 532166, 536124, 541375, 547793, 555049, 562683, 570497, 578727, 587696, 597451, 607858, 618922, 630901, 644188, 659104, 675668, 693599, 712722, 733347, 756029, 780961, 807795, 836049, 865403, 895662, 926700, 958504, 991084, 1024444, 1058907, 1095306, 1134388, 1176066, 1219666, 1264798, 1311421, 1359093, 1406949, 1454762, 1503519, 1554753, 1609866, 1670429, 1738538, 1816248, 1904811, 2004684, 2116054, 2239401, 2376379, 2530771, 2708348, 2915618, 3159327, 3447429, 3789658, 4196606, 4679499, 5252556, 5935657, 6754399, 7739161, 8925508, 10349734, 12027512, 13915520, 15880070, 17706524, 19161009, 20077037, 20419246, 20292911, 19902834, 19486650, 19244433, 19277039, 19547400, 19884867, 20042612, 19790038, 18998501, 17680838, 15971657]
60981A5971657j905181j912042j780075j570771j334640j105333r02118p32496
60973D729001n94827m83346l93192l21302k64485k19143j83055j55583j35660
60964A978408j20833j08817r8713r0034q1647p2691o3715n5902m9433m3476l7563
60953A155584l2197k8132k5701k4838k5136k5734k5659k4592k3014k1508k0184
60942H78889j8864j7573j6571j6141j6417j7264j8163j8511j8301j8268j8974
60931F83842j9933k0047j8898j7111j5371j3622j1574r566q331q036p900o957
60919E26496m998k790j471j509k154k118j010K05N03J84M11J589K932L666L879
60904E23815L973L919L517K958K622K563K511K238J624N43r76k574l747m256m256
$$ y = [15971657, 14066476, 12154434, 10374359, 8803588, 7468948, 6363615, 5461497, 4729001, 4134174, 3650828, 3257636, 2936334, 2671849, 2452706, 2269651, 2114068, 1978408, 1857575, 1748758, 1650045, 1560011, 1478364, 1405673, 1341958, 1286056, 1236623, 1193147, 1155584, 1123387, 1095255, 1069554, 1044716, 1019580, 993846, 968187, 943595, 920581, 899073, 878889, 860025, 842452, 825881, 809740, 793323, 776059, 757896, 739385, 721084, 702816, 683842, 663909, 643862, 624964, 607853, 592482, 578860, 567286, 557720, 549389, 541353, 533453, 526496, 521498, 518708, 517237, 515728, 513574, 511456, 510446, 510651, 511154, 511338, 511749, 513338, 516270, 519936, 523815, 527788, 531707, 535224, 538182, 540804, 543367, 545878, 548116, 549740, 550283, 549307, 546733, 542986, 538730, 534474]
60889E34474m147m310m819n410n958o818q306r902j0596j0229r792j0037j0383
60876D33767r773q188o590n642n201m968m905m853m367l202j646j79R87J935K770
60861C79945L452L718L293K327J454J093Q90K89m14k17J271L146M216M225L735
60846D12423L152K402J528J018J223J744J720Q12l65r31p95p63j573l010m112
60831D14473m199l452k595k166k162k236k073j609r30j84L44K42o05j687k298
60816C88863k370k504l037l532l534l374l648m208m346l922l674m130m816m845
60802C36923l998k877k265k514l380m129m016k981j806j312j443j455r46l51k29
60787C03221l83r4Q07J536J248J70n72k07R20J875K092J647R55N50R40K237L866
$$ y = [534474, 530327, 526017, 521198, 515788, 509830, 503012, 494706, 484804, 474208, 463979, 454187, 444150, 433767, 423994, 415806, 409216, 403574, 398373, 393405, 388500, 383647, 379280, 376078, 374432, 374253, 375240, 377175, 379945, 383397, 387115, 390408, 392735, 394189, 395282, 396172, 396461, 396047, 395830, 397101, 400247, 404463, 408688, 412423, 415575, 417977, 419505, 420523, 421746, 423490, 425210, 426022, 425657, 424726, 423931, 423168, 421595, 418585, 414473, 410274, 406822, 404227, 402061, 399899, 397663, 395590, 393981, 393051, 392867, 393211, 393453, 392848, 391161, 388863, 386493, 383989, 380952, 377420, 373886, 370512, 366864, 362656, 358310, 354388, 350714, 346584, 341768, 336923, 332925, 330048, 327783, 325269, 321889, 317760, 313744, 310763, 308957, 307645, 306202, 304747, 303801, 303450, 303221, 302838, 302744, 303551, 305087, 306335, 306505, 305933, 305726, 306646, 308521, 310613, 312260, 313215, 313765, 314705, 316942, 320808]
60770C20808M913M921M268L745L802M133L971K892J376L68K36M33L19r8m87q47
60754C54753j308j669j721j803k433l396l880l492k551j402j37Q53Q67k54j860
60739C30567l335m643n723o098n577m745m157l591k708j922j812k114k132j893
60725B80117j948k188j881r37j82j12k14J33P47J098J119J086J171J456J959K303
60709B83727J881P84P0N92J883K758K695K106J580J480J990K881L331K725J610
60694C12093J128J504J860J632J366J667K202K269J838J346Q43J02o98j036q42
60679C27274n79n32n43n08n89q39j048j139j294j539j678j803k325l206l669l229
60663C02754k480k281k506k350j666j132j034q08l6Q31J185J134J141J315J575
$$ y = [320808, 325721, 330642, 334910, 338655, 342457, 346590, 350561, 353453, 354829, 355197, 355433, 355866, 356185, 356087, 355600, 354753, 353445, 351776, 350055, 348252, 345819, 342423, 338543, 335051, 332500, 331098, 330961, 331814, 332681, 332427, 330567, 327232, 322589, 316866, 310768, 305191, 300446, 296289, 292698, 289990, 288068, 286256, 284142, 282010, 280117, 278169, 275981, 274100, 273163, 272981, 272869, 272655, 272788, 273535, 274633, 275752, 276838, 278009, 279465, 281424, 283727, 285608, 286392, 286462, 287054, 288937, 291695, 294390, 296496, 298076, 299556, 301546, 304427, 307758, 310483, 312093, 313221, 314725, 316585, 318217, 319583, 321250, 323452, 325721, 327559, 328905, 329748, 329850, 329152, 328116, 327274, 326695, 326163, 325620, 325112, 324523, 323684, 322636, 321497, 320203, 318664, 316986, 315183, 312858, 309652, 305983, 302754, 300274, 297993, 295487, 293137, 291471, 290339, 289305, 288497, 288461, 289292, 290477, 291611, 292752, 294067, 295642]
60648B95642K079K831L221K710J726J119Q33J5j502k725k890k513k561l156l696
60633B91133l793l487k825j882j016n22j65M27J042J099O20L18O13J092J212J051
60617B84917J035J219J228P86O8m75m83R5R96J815K172J799P20n36j149p85J0
60600B93432M49M03L09M14N58O70R15J292J585J747J896J908J603J255J296J376
60584C11108O82o39j295o65K20K77O3P86K230L052K845K590L003L694M297N227
60568C37475O712P994Q296P998Q068Q678R040Q463P023N182L125O60k258m972
60554D11484o352n930m594l658l311k651j219L51J505K679M408O285P585Q466
60540D15048R664J1287J2761J3842J4824J5644J5500J3660J0248O086K136r40
$$ y = [295642, 297721, 300552, 303773, 306483, 308209, 309328, 310161, 310176, 308674, 305949, 303059, 300546, 297985, 294829, 291133, 287340, 283853, 281028, 279146, 278130, 277608, 277443, 277870, 278912, 280011, 280631, 280949, 281562, 282654, 283866, 284917, 285952, 287171, 288399, 289185, 289253, 288778, 288295, 288390, 289386, 291201, 293373, 295172, 295892, 295356, 294207, 293422, 293432, 293881, 294284, 294593, 295007, 295565, 296235, 297150, 298442, 300027, 301774, 303670, 305578, 307181, 308436, 309732, 311108, 311790, 311151, 309856, 309191, 309411, 309688, 309751, 310537, 312767, 315819, 318664, 321254, 324257, 327951, 332248, 337475, 344187, 352181, 360477, 368475, 376543, 385221, 394261, 402724, 409747, 414929, 418054, 418714, 416456, 411484, 405132, 399202, 394608, 390950, 387639, 384988, 383769, 384120, 385625, 388304, 392712, 398997, 406582, 415048, 424712, 435999, 448760, 462602, 477426, 493070, 508570, 522230, 532478, 538564, 540700, 539760]
60528E39760l096m976p135r177j0034r279p645o074m777l589k679k347k367k132
60514D64453j411n37J89Q27J517K237L064M281N937P552Q706R812J1926J5592
60500E34145K0183K4620K8450L1918L5134L7759L9563M0822M1731M1659L9482
60489I15466L4642K7615J9227R882m04j1350k2100l1596l9083m4278m7159m7816
60477G63046m6507m3724m0105l6242l2534k9152k6010k2917j9855j7050j4650
60466D34300j2494j0411q652p650p321o910n762m026k452j666j761k343k830k912
60452C57110k856l145l767m117l784l001k118j033K82J149Q18k98r06m45J73j29
60436C33933j195j998k013j588j146o52K6O91J021R39O12K32q9l14n41q95j265
$$ y = [539760, 536664, 531688, 524553, 515376, 505342, 496063, 488418, 482344, 477567, 473978, 471299, 468952, 466585, 464453, 463042, 462505, 462694, 463521, 465038, 467275, 470339, 474620, 480557, 488109, 496815, 506627, 518553, 534145, 554328, 578948, 607398, 639316, 674450, 712209, 751772, 792594, 834325, 875984, 915466, 950108, 977723, 996950, 1006832, 1006428, 995078, 972978, 941382, 902299, 858021, 810862, 763046, 716539, 672815, 632710, 596468, 563934, 534782, 508772, 485855, 466000, 448950, 434300, 421806, 411395, 402743, 395093, 387772, 380862, 375100, 371074, 368622, 366956, 365195, 362852, 360022, 357110, 354254, 351109, 347342, 343225, 339441, 336440, 334322, 333289, 333571, 334720, 335538, 335240, 334334, 333889, 334062, 333933, 332738, 330740, 328727, 327139, 325993, 325341, 325367, 326058, 327079, 328018, 328630, 328862, 328773, 328459, 327918, 327023, 325758]
60419C25758j307q81l38j01m3L41J123J752J821J625J560J350M93o67j051k02
60403C31233J022J515J205Q78J056J611K262K912L395L464L194L049L266L453
60389C63515L081K239J531J291J228R96P87J063J817K528K894L208L734M111L791
60374C97814K916K208K050K150K173K121J969J491P47K97N85J383K197K834L251
60359D26186L310L103L241M202N683P075Q309R653J0800J0943R805P952N997L995
60345E20254J786n29k745m779o544p832q478q417p617o264m938m175l810l265
60331D52647k531k285k884l765m214m180l947l485k665j780j269j005m26O51J818
60316D20680K716L464M360N501O863Q495J0331J1979J2979J3312J3434J3717J3973
$$ y = [325758, 324451, 323570, 323232, 323131, 323088, 323429, 324552, 326304, 328125, 329750, 331310, 332660, 333153, 332486, 331435, 331233, 332255, 333770, 334975, 335853, 336909, 338520, 340782, 343694, 347089, 350553, 353747, 356796, 360062, 363515, 366596, 368835, 370366, 371657, 372885, 373881, 374668, 375731, 377548, 380076, 382970, 386178, 389912, 394023, 397814, 400730, 402938, 404988, 407138, 409311, 411432, 413401, 414892, 415639, 415936, 416521, 417904, 420101, 422935, 426186, 429496, 432599, 435840, 440042, 445725, 452800, 461109, 470762, 481562, 492505, 502310, 510262, 516259, 520254, 522040, 521511, 518766, 513987, 507443, 499611, 491133, 482716, 475099, 468835, 463897, 459722, 455912, 452647, 450116, 447831, 444947, 441182, 436968, 432788, 428841, 425356, 422691, 420911, 419642, 418637, 418211, 418862, 420680, 423396, 426860, 431220, 436721, 443584, 452079, 462410, 474389, 487368, 500680, 514114, 527831, 541804]
60303E41804J3673J2542J0740Q534N987L035l95m387q821j3017j6008j7380j7583
60290E18724j7090j5765j3510j0979q974p372n554l635k386j893j445r32j192
60277D27997k480l632l557k716k262k331k292k157k602l604m198l776k827k123
60263C87440j811j566j195p96n57o08q33q95o54m44n64o83l12L00L76j95o06k82
60245C76115L38N10J97o3Q8N69J056J120M68n97j157o17N56J377J536J587K033
60228C85116K677L119L449L993M542M288K843J029K29R51K329L225L452L610M069
60213D28921M598M919N121N424N865O369O809O947O543N634M489L379K566K372
60199D99956K763L010K432J464J233J919K375J801Q81N49M67k83j553k350k443
$$ y = [541804, 555477, 568019, 578759, 587293, 593280, 596315, 595920, 591533, 582712, 569695, 553687, 536307, 518724, 501634, 485869, 472359, 461380, 452406, 445034, 439480, 435845, 433459, 431566, 430121, 429189, 427997, 425517, 421885, 418328, 415612, 413350, 411019, 408727, 406570, 403968, 400364, 396166, 392390, 389563, 387440, 385629, 384063, 382868, 382072, 381515, 380907, 380074, 379179, 378525, 378081, 377517, 376834, 376522, 376822, 377198, 377003, 376397, 376115, 376453, 376963, 377160, 377097, 377185, 377754, 378810, 379930, 380398, 379801, 378644, 378027, 378583, 379960, 381496, 383083, 385116, 387793, 390912, 394361, 398354, 402896, 407184, 410027, 411056, 411285, 412236, 414565, 417790, 421242, 424852, 428921, 433519, 438438, 443559, 448983, 454848, 461217, 468026, 474973, 481516, 487150, 491639, 495018, 497584, 499956, 502719, 505729, 508161, 509625, 510858, 512777, 515152, 516953, 517834, 518383, 518850, 518567, 517014, 514664, 512221]
60184E12221k561k958l040k639k452k829l062k651k275k652l239l043k254j891
60170D74675k136k151j566j022j020j170j020q01q02p12k12L02K63j07q3N09J142
60153D64089J412J366J087N62J22L42J206J866J642R18O48J147J903K496L225
60138D84031M550O262P528P821P481P261P324P007N723L905K626K300K115J157
60124E57091k69r73n26L6m70j787k494j761k66P18P16K07k10l46k54l5P3k54j100
60105E48096k170l076l661m016m272m393m133l239j844o09j33k76k87L88J665
60090E18040L212M785O089O738O638O107N352M240K827J678J163Q09n1j265k123
60075E64239k519l054m037n120o010o887p801q338q285q051q015p905p283o313
$$ y = [512221, 509660, 506702, 503662, 501023, 498571, 495742, 492680, 490029, 487754, 485102, 481863, 478820, 476566, 474675, 472539, 470388, 468822, 467800, 466780, 465610, 464590, 463789, 462987, 462275, 462063, 462365, 462628, 462521, 462438, 462947, 464089, 465501, 466867, 467954, 468516, 468638, 468980, 470186, 472052, 473694, 474612, 475260, 476407, 478310, 480806, 484031, 488581, 494843, 502371, 510192, 517673, 524934, 532258, 539265, 544988, 548893, 551519, 553819, 555934, 557091, 556822, 555849, 555323, 555359, 554889, 553102, 550608, 548847, 548581, 549299, 550015, 550222, 550012, 549666, 549412, 549377, 549450, 549196, 548096, 545926, 542850, 539189, 535173, 530901, 526508, 522375, 519136, 517292, 516683, 516550, 516274, 515987, 516375, 518040, 521252, 526037, 532126, 538864, 545502, 551609, 556961, 561201, 564028, 565706, 566869, 567678, 567627, 566362, 564239, 561720, 558666, 554629, 549509, 543499, 536612, 528811, 520473, 512188, 504137, 496122, 488217, 480934, 474621]
60061D74621n528n151n089n319n784o011n419m009k355r78n7L68M20N76J283K294
60045D33862K923L076L498M655N910O334N930N442N092M246K531N79p16j256j569
60030D80537j915k157k395l029m019m680m549m021l817m136m743n465o160o447
60016D23004o085n459n116m925m353l507l165l598m056l738k701j534o33j79k50
60001C73705n64n74k20p7l65m08L19J224J462J307J696K627L183L052K998L469
59985C92834L764L167K109J499J443J290P15Q6j98j99k67p39j695k804l381k961
59969C94663j812o61O8N29R68J355J534J538J532J542J460J298J258J434J614
59954D08320J507J141P71M17k52j341k287k383j660r04p47j068j380j498j597
$$ y = [474621, 469093, 463942, 458853, 453534, 447750, 441739, 436320, 432311, 429956, 428978, 428921, 429289, 429709, 430285, 431568, 433862, 436785, 439861, 443359, 448014, 453924, 460258, 466188, 471630, 476722, 480968, 483499, 484078, 483362, 482106, 480537, 478622, 476465, 474070, 471041, 467022, 462342, 457793, 453772, 449955, 445819, 441076, 435611, 429451, 423004, 416919, 411460, 406344, 401419, 397066, 393559, 390394, 386796, 382740, 379002, 376301, 374767, 374134, 373955, 373705, 373141, 372567, 372347, 372270, 371905, 371497, 371816, 373040, 374502, 375809, 377505, 380132, 383315, 386367, 389365, 392834, 396598, 399765, 401874, 403373, 404816, 406106, 406821, 406907, 406709, 406510, 406243, 405504, 403809, 401005, 397624, 394663, 392851, 392190, 392258, 392787, 393755, 395110, 396644, 398182, 399714, 401256, 402716, 404014, 405272, 406706, 408320, 409827, 410968, 411739, 412156, 411904, 410563, 408276, 405893, 404233, 403329, 402582, 401514, 400134, 398636, 397039]
59939C97039j804k046k183k165k018j833j690j478r20J30J388K344K744K809K942
59924C93259L340L942M672N543O410O765N992M014J562l52j263j449j360j047
59910D30028k59J011K286L058L354L594L841L536K335R70O53J465K026J156n76
59895D58478j565j106O3J055J801K558L174L308L053K822K872L223L913M902N838
59880D94389O212N880N238M880N107N669N904N224L665J860M30n29j238j745j868
59865E39078j578j205j155j565k231k801k970k569j597l07Q65J656K396L759N849
59850E35625P728Q250P270N560L614J250j479l651m330l605k223o58Q18J516P24
59835E56409j241l167m330n055n691n811m961l589k574k080j607r72o16q60j412
$$ y = [397039, 395235, 393189, 391006, 388841, 386823, 384990, 383300, 381822, 380902, 381032, 382420, 384764, 387508, 390317, 393259, 396599, 400541, 405213, 410756, 417166, 423931, 429923, 433937, 435499, 435147, 433884, 432435, 431075, 430028, 429769, 430780, 433066, 436124, 439478, 443072, 446913, 450449, 452784, 453754, 454407, 455872, 457898, 459054, 458478, 456913, 455807, 455870, 456925, 458726, 461284, 464458, 467766, 470819, 473641, 476513, 479736, 483649, 488551, 494389, 500601, 506481, 511719, 516599, 521706, 527375, 533279, 538503, 542168, 544028, 544458, 543929, 542691, 540946, 539078, 537500, 536295, 535140, 533575, 531344, 528543, 525573, 523004, 521407, 521100, 521965, 523621, 526017, 529776, 535625, 543353, 551603, 558873, 564433, 568047, 569297, 567818, 564167, 559837, 556232, 554009, 553351, 554169, 555685, 556409, 555168, 552001, 547671, 542616, 536925, 531114, 526153, 522564, 519990, 517910, 516303, 515331, 514715, 513855, 512443]
59820E12443j754j720j509j515k150l489m958n686n368m502l699l077k561k334
59806D68121k608l159l499l424l086k662k241j943j804j588j138p76r91j632j935
59791D35635j434m96K34M90L10k68j024j408j010q3P03R85R21Q42R82J397J927
59774D38703K270K295K195K119J911J451J067J191J773K408K903L230L134K386
59760D69036J516J550K690L839L871K976K301K533L355M193M834N307N573N599
59746E19173N494N357N140M859M710M784M746M186L322K958L431L904L252J577
59732E76893K16R2O24O92J08m91q11j135j551j805j959k397k982k953k080j194
59716E59267j134j722k296k664k874k604j631n71k42m41k17O57J383J469J426
$$ y = [512443, 510689, 508969, 507460, 505945, 503795, 500306, 495348, 489662, 484294, 479792, 476093, 473016, 470455, 468121, 465513, 462354, 458855, 455431, 452345, 449683, 447442, 445499, 443695, 442107, 440969, 440193, 439202, 437570, 435635, 434201, 433705, 433939, 434429, 434739, 434471, 433447, 432039, 431029, 430946, 431649, 432634, 433555, 434397, 435379, 436776, 438703, 440973, 443268, 445463, 447582, 449493, 450944, 452011, 453202, 454975, 457383, 460286, 463516, 466650, 469036, 470552, 472102, 474792, 478631, 482502, 485478, 487779, 490312, 493667, 497860, 502694, 508001, 513574, 519173, 524667, 530024, 535164, 540023, 544733, 549517, 554263, 558449, 561771, 564729, 568160, 572064, 575316, 576893, 577109, 577201, 577825, 578517, 578625, 578134, 577323, 576188, 574637, 572832, 570873, 568476, 565494, 562541, 560461, 559267, 558133, 556411, 554115, 551451, 548577, 545973, 544342, 543771, 543529, 543088, 542871, 543528, 544911, 546380, 547806]
59701E47806J724J955J619J149J334K066K491K313K127K330K368J471k91k131
59687E68331l478m341m777m515l417k060j401j812k693l259l471l841m513m936
59673E19817m644l931l456l350l147k563j962j820k040k071j623r99o07m16j20
59658D87068L58P84J052J344J738J955J817J704K126K885L212K727J874J114K28
59643E11986j248l204n038o326o919o601n294l545k209j532j049n11k86n87r26
59628D66711q61p83j345k410l267l725m272n057n455m950l960l323l243l140k464
59613D18456j357m17m8j52l70m05q2P06J763K433K076R10o2j82K33O69J229K087
59595D27487K579J875M04l32L84J583J919J231M12K04N34P24R4j321k526k487
$$ y = [547806, 549530, 551485, 553104, 554253, 555587, 557653, 560144, 562457, 564584, 566914, 569282, 570753, 570462, 568331, 564853, 560512, 555735, 551220, 547803, 545743, 544342, 542530, 539837, 536578, 533107, 529266, 524753, 519817, 515173, 511242, 507786, 504436, 501289, 498726, 496764, 494944, 492904, 490833, 489210, 488211, 487604, 487188, 487068, 487426, 488210, 489262, 490606, 492344, 494299, 496116, 497820, 499946, 502831, 506043, 508770, 510644, 511758, 511986, 510738, 507534, 502496, 496170, 489251, 482650, 477356, 473811, 471602, 470070, 469021, 468510, 468224, 467637, 466711, 465850, 465067, 463722, 461312, 458045, 454320, 450048, 444991, 439536, 434586, 430626, 427303, 424060, 420920, 418456, 417099, 416682, 416634, 416482, 416112, 415707, 415625, 416331, 418094, 420527, 422603, 423513, 423451, 423269, 423502, 424171, 425400, 427487, 430066, 431941, 432345, 432013, 432397, 433980, 435899, 437130, 437542, 437746, 438280, 439004, 439098, 437777, 435251, 432764]
59579D32764j468q57j517k843l798m101l985l483k644j938j755j742j333n46J82
59564D00936N91N39k16j445k201j826q49j32L24R38J420J265R97J619K925L708
59548D08593L676L846M729N526N703O042P338R116J0632J2322J5012J8164J9915
59535E30614J8790J4669Q369J172n280r512j1039j0381q285n278j983O99K111
59522E24666K508K843L719M595M339K657M98j191k609m391o232p219p357p583
59508E09243q184q377p835p395p554p416o109m361l498l498l311k653k228k239
59494D34585k014j227m35l3L64J109J810J951J723J682J961K255K433K684L116
59479D51964L467L385K919K553K640K892K723K123J709J791J833J207J11p65j145
$$ y = [432764, 431296, 430439, 428922, 426079, 422281, 418180, 414195, 410712, 408068, 406130, 404375, 402633, 401300, 400754, 400936, 401527, 402066, 401850, 400405, 398204, 396378, 395529, 395397, 395721, 396659, 398079, 399344, 400341, 401960, 404885, 408593, 412269, 416115, 420844, 426370, 432073, 438115, 445453, 454569, 465201, 477523, 492535, 510699, 530614, 549404, 564073, 572442, 573614, 568334, 558822, 547783, 537402, 529117, 523839, 521856, 522555, 524666, 527174, 530017, 533736, 538331, 542670, 545327, 545825, 544634, 542025, 537634, 531402, 524183, 516826, 509243, 501059, 492682, 484847, 477452, 469898, 462482, 456373, 452012, 448514, 445016, 441705, 439052, 436824, 434585, 432571, 431344, 430909, 430876, 431240, 432349, 434159, 436110, 437833, 439515, 441476, 443731, 446164, 448848, 451964, 455431, 458816, 461735, 464288, 466928, 469820, 472543, 474666, 476375, 478166, 479999, 481206, 481317, 480552, 479407]
59464D79407j221j010k94Q95K169L179L780L935L877M133N009O167P157P993Q716
59449E33892Q797P786O322N497N223M227J869r81l230m820o212p411q062q061
59435E34836p377n938m192l220l500l987l330j694m49q6M80K272M831P005Q551
59420E24202J0195J2368J4619J6366J7723J9376K1887K5189K8442L0005K7857
59409G48229K0759R551k834j2977j8901k0576j8893j4568q093m33O743J1540J2477
59396G12024Q917J366q291j7271k3217k5435k4829k2635j9527j5883j2342r504
59384E43373p212m736j880M62J198L82n97k72J507L494M431M321M178M535M767
59369E57951M128K902J913J296N56k46l32N36J504J756J563J715K437L399M376
$$ y = [479407, 478186, 477176, 476882, 477777, 479946, 483125, 486905, 490840, 494717, 498850, 503859, 510026, 517183, 525176, 533892, 542689, 550475, 556797, 562294, 567517, 571744, 573613, 572632, 569402, 564582, 558370, 550959, 542897, 534836, 527459, 521521, 517329, 514109, 510609, 506622, 503292, 501598, 501149, 501063, 501543, 503815, 508646, 515651, 524202, 534397, 546765, 561384, 577750, 595473, 614849, 636736, 661925, 690367, 720372, 748229, 768988, 778539, 775705, 762728, 743827, 723251, 704358, 689790, 681697, 681264, 688007, 699547, 712024, 720941, 722307, 714016, 696745, 673528, 648093, 623264, 600629, 581102, 565219, 552877, 543373, 536161, 531425, 529545, 530007, 531205, 531587, 530990, 530718, 532225, 535719, 540150, 544471, 548649, 553184, 557951, 562079, 564981, 566894, 568190, 568746, 568500, 568168, 568704, 570208, 571964, 573527, 575242, 577679, 581078, 585454]
59354E85454N298O003O469P106Q284R750J0941J1718J2404J3241J4148J4891J5136
59341G20843J4535J3094J1257R337P140M443J519j221l729o045p855q939r652
59328G44727j0434j1093j1244j1117j1155j1107j0354r079q173p848p283n904
59316F29936m269l272l054l134l191l229l267l172k725j751k89J402L263N656
59302F08904Q609J0897J0625P028J291m653r665j3590j6445j7973j7930j6391
59290E50707j3820j0939q457o767n811n205m412l030j131P25K052K856L394L746
59276E03908L917M212N038O477Q259J0025J1350J1820J1442J0722R930Q749P067
59263F12916N589M879M250K608J68j793k811l707n031o121o229n669n267n219
$$ y = [585454, 590752, 596755, 603224, 610330, 618614, 628364, 639305, 651023, 663427, 676668, 690816, 705707, 720843, 735378, 748472, 759729, 769066, 776206, 780649, 782168, 780947, 777218, 771173, 763318, 754379, 744727, 734293, 723200, 711956, 700839, 689684, 678577, 668223, 659144, 650971, 643123, 635840, 629936, 625667, 622395, 619341, 616207, 613016, 609787, 606520, 603348, 600623, 598872, 598583, 599985, 603248, 608904, 617513, 628410, 639035, 646063, 647354, 642701, 633036, 619446, 603001, 585028, 567098, 550707, 536887, 525948, 517491, 510724, 504913, 499708, 495296, 492266, 491135, 491860, 493912, 496768, 500162, 503908, 507825, 512037, 517075, 523552, 531811, 541836, 553186, 565006, 576448, 587170, 597100, 605849, 612916, 618505, 623384, 627634, 630242, 630410, 628617, 625806, 622099, 617068, 610947, 604718, 599049, 593782, 588563]
59249E88563n074m407l213j904r98n06K96J861L445L963L652L807M776N502N325
59234F05088N011N319N728N358M269K998J557k12j958l304m450n587o320o386
59220F07111o329o616o800o422o089o515p107o687n338m235l884l782l716m144
59206E29447m971n238m478l485l124l155k814j997j250r03p39m41N0O08J188J918
59190E00616K921L963M525M428M176M319M706M754M338L960L993M273M503M653
59176E60128M826N010N134N197N281N510N891O173N985N347M772M615M569M113
59162F32551L225K244J282K21q75j884l004m506o198p599q630r547j0236j0214
59148E76830r441q575q179q136q081p960p833p489o639n368m157l496l597m222
$$ y = [588563, 583489, 579082, 575869, 573965, 572967, 572461, 572757, 574618, 578063, 582026, 585678, 589485, 594261, 599763, 605088, 610099, 615418, 621146, 626504, 630773, 633771, 635328, 635116, 633158, 629854, 625404, 619817, 613497, 607111, 600782, 594166, 587366, 580944, 574855, 568340, 561233, 554546, 549208, 544973, 541089, 537307, 533591, 529447, 524476, 519238, 514760, 511275, 508151, 504996, 502182, 500185, 498935, 498032, 497293, 496852, 496902, 497510, 498698, 500616, 503537, 507500, 512025, 516453, 520629, 524948, 529654, 534408, 538746, 542706, 546699, 550972, 555475, 560128, 564954, 569964, 575098, 580295, 585576, 591086, 596977, 603150, 609135, 614482, 619254, 623869, 628438, 632551, 635776, 638020, 639302, 639523, 638648, 636764, 633760, 629254, 623056, 615457, 606827, 597280, 587044, 576830, 567389, 558814, 550635, 542499, 534418, 526458, 518625, 511136, 504497, 499129, 494972, 491476, 487879, 483657]
59134D83657m678m229k856j443r46j296j374k37J752L219L281K564K547L947O029
59119D89937P530P942P763P783Q381R411J0420J1073J1364J1461J1348J0846J0081
59106F15340R540R496R632R433Q734P668O364M892L389J967O26n54j404j910k243
59091F80970k388k115j500j111j354j950k422k748l212l924m880o145p567q657
59077F30997r165r449r830r936r246p974o787n857m921m099l841m055m030l465
59063E38342k863k679k615k228j752j823k515l131l077k654k731l617m560m566
59049D97531l559k393j760j601j619j740j857j643j026l56K45J181K555L663L946
59034D91567L892M259M798M710M109M040N005O414P639Q919J0810J3270J5603
$$ y = [483657, 478979, 474750, 471894, 470451, 469505, 468209, 466835, 466598, 468350, 471569, 474850, 477414, 479961, 483908, 489937, 497467, 505409, 513172, 520955, 529336, 538747, 549167, 560240, 571604, 583065, 594413, 605259, 615340, 624880, 634376, 644008, 653441, 662175, 669843, 676207, 681099, 684488, 686455, 687081, 686527, 685123, 683213, 680970, 678582, 676467, 674967, 673856, 672502, 670552, 668130, 665382, 662170, 658246, 653366, 647221, 639654, 630997, 621832, 612383, 602553, 592617, 583371, 575397, 568610, 562753, 557832, 553733, 549892, 545837, 541807, 538342, 535479, 532800, 530185, 527957, 526205, 524382, 521867, 518736, 515659, 513005, 510274, 506657, 502097, 497531, 493972, 491579, 489819, 488218, 486599, 484859, 483002, 481359, 480333, 479977, 480222, 481403, 483958, 487621, 491567, 495459, 499718, 504516, 509226, 513335, 517375, 522380, 528794, 536433, 545352, 556162, 569432, 585035]
59021E85035J7013J7224J6695J6231J6044J5422J3651J0843P482L557r76n225
59009G12996p810q355p784p054o333n497m599l606k319p76P61K273L775M643L993
58994F74308K000l8j257k091l171m144m318l969m154n351o894p817p870p534p230
58979F10470o747n621m007k696k006j221K66J749K067J490J597L094M789N249
58965F08473M621M182M656N643O360O394N871N271M928M504L235Q54k032m627
58951F58333o613q006q874r376r696r745r342q802q722q946q456o749m698l464
58937E46844l065k688k025j507j424j494j363j014o99p08j215j973k351k044j623
58922E21651j925k885l504l107k247j989k496k822k176r84k90l05j43Q92K391
$$ y = [585035, 602048, 619272, 635967, 652198, 668242, 683664, 697315, 708158, 715640, 719197, 718221, 712996, 705186, 696831, 689047, 681993, 675660, 670163, 665564, 661958, 659639, 658863, 659624, 661897, 665672, 670315, 674308, 676308, 676270, 675013, 672922, 669751, 665607, 661289, 657320, 653166, 647815, 640921, 633104, 625234, 617700, 610470, 603723, 598102, 594095, 591399, 589393, 588172, 588438, 590187, 592254, 593744, 595341, 598435, 603224, 608473, 613094, 617276, 621932, 627575, 633935, 640329, 646200, 651471, 656399, 660903, 664138, 664992, 662960, 658333, 651720, 643714, 634840, 625464, 615768, 606023, 596681, 587879, 579157, 570211, 561755, 555006, 550308, 546844, 543779, 541091, 539066, 537559, 536135, 534641, 533278, 532264, 531565, 530857, 529642, 527669, 525318, 523274, 521651, 519726, 516841, 513337, 510230, 507983, 505994, 503498, 500676, 498500, 497516, 497226, 496921, 496778, 497670, 500061]
58907E00061L548M287N083O103P176Q410J0001J1491J2005J1329J0084Q764P373
58894F05715O152N782O435P396Q149R207J1256J3929J6155J7389J7876J7809J6886
58881G60136J4736J1514P952M915K769J081q62l167n268o772p969r248j0270j0182
58867G49365q627o294m451l861m111m157l600l173l686m882n980o922q295j0062
58853F71264j1344j1633j1404j1166j0650r422p692o066m951m501m726n301n736
58840E66672n995o446p049p231o871o681p111p570p241o253n338m800m409l962
58826D79715l430k772k019j360q18k16L78N94M56N30R76J128N63J7M68J754K802
58809D78766K942K374J573R53Q86J378J768J351K38p65j066p17j73L6l98j184
$$ y = [500061, 503609, 507896, 512979, 519082, 526258, 534668, 544669, 556160, 568165, 579494, 589578, 598342, 605715, 611867, 617649, 624084, 631480, 639629, 648836, 660092, 674021, 690176, 707565, 725441, 743250, 760136, 774872, 786386, 794338, 799253, 802022, 803103, 802241, 799074, 793806, 787034, 779065, 769817, 759547, 749365, 740738, 734444, 729993, 726132, 722021, 717864, 714264, 711091, 707405, 702523, 696543, 689621, 681326, 671264, 659920, 648287, 636883, 625717, 615067, 605645, 597953, 591887, 586936, 582435, 577709, 572408, 566672, 560677, 554231, 547182, 539951, 533080, 526399, 519288, 511718, 504477, 498224, 492886, 488086, 483677, 479715, 476285, 473513, 471494, 470134, 469316, 469100, 469478, 470072, 470528, 471058, 472034, 473162, 473725, 473742, 474210, 475964, 478766, 481708, 484082, 485655, 486608, 487494, 488872, 490640, 491991, 492229, 491464, 490398, 489681, 489508, 489544, 489146, 487962]
58793D87962j541j055k04K57J94j8j00R5P59J900L071L805M171M536N030N567
58777E14429O060O331O147N637N283N069M150J898j149l841n569o388o469o132
58763E25456n939o091o035n261m146l302k542j301K44J391K008K572L194L471
58749E03719L279K934K610K325K409L166M094M322L916L879M667N589O021O285
58735E59215O854P469P759Q184R513J1509J2920J2862J1756J0698J0212R845Q862
58722F87658P152N380M399M512N304O048O389O641P330Q394R090Q931Q282P590
58708G83100O399L882K65l299o259r146j2246j4869j6532j7902j9741k1620k2566
58695F49466k2426k1724k0662j9174j7534j6039j4358j2115r816q273p275n902
$$ y = [487962, 486421, 485366, 485162, 485419, 485613, 485595, 485495, 485590, 486349, 488249, 491320, 495125, 499296, 503832, 508862, 514429, 520489, 526820, 532967, 538604, 543887, 548956, 553106, 555004, 553855, 550014, 544445, 538057, 531588, 525456, 519517, 513426, 507391, 502130, 497984, 494682, 492140, 490839, 491083, 492474, 494482, 497054, 500248, 503719, 506998, 509932, 512542, 514867, 517276, 520442, 524536, 528858, 532774, 536653, 541320, 546909, 552930, 559215, 566069, 573538, 581297, 589481, 598994, 610503, 623423, 636285, 648041, 658739, 668951, 678796, 687658, 694810, 700190, 704589, 709101, 714405, 720453, 726842, 733483, 740813, 749207, 758297, 767228, 775510, 783100, 789499, 793381, 793646, 790347, 784088, 774942, 762696, 747827, 731295, 713393, 693652, 672032, 649466, 627040, 605316, 584654, 565480, 547946, 531907, 517549, 505434, 495618, 487345, 480070, 474168]
58683D74168m097k900k929l525l707l252k554j961j569j234o14M91J810K881L721
58668D54729M743O083P403Q457R373J0324J1161J1478J0896R334P163M907K659
58655E58710J07k692m982o170o479o399n997n292m766m782m896m506l858l581
58641D94417l534l080k275j801j728j310j91J028J666J729J521J160P48N50O37
58626D89537O53K58m10r00r31o35l41r6N55J971L650M571M448M106M289M689M592
58609E20006L884K889J814R08O29R87J215P61O3k88n62j243k012k250k084j976
58593E22741j796j214n60k53J01J070K294L193M193N979P980Q996R108R426J0139
58578E81397J0359R902R656R861R611Q495P403P170P574Q226R441J1639J4684
$$ y = [474168, 470071, 467171, 464242, 460717, 457010, 453758, 451204, 449243, 447674, 446440, 445826, 446317, 448127, 451008, 454729, 459472, 465555, 472958, 481415, 490788, 501112, 512273, 523751, 534647, 543981, 551144, 556051, 558710, 558817, 556125, 551143, 544973, 538494, 532095, 526098, 520806, 516040, 511258, 506362, 501856, 497998, 494417, 490883, 487803, 485528, 483727, 481999, 480689, 480498, 481526, 483192, 484921, 486442, 487602, 488350, 488900, 489537, 490190, 490448, 490038, 489138, 488207, 487572, 487231, 487135, 487690, 489661, 493311, 497882, 502330, 506436, 510725, 515414, 520006, 523890, 526779, 528593, 529501, 530130, 531117, 532332, 533093, 533156, 532868, 532306, 531063, 529051, 526801, 524717, 522741, 520945, 519731, 519171, 518918, 519019, 520089, 522383, 525576, 529769, 535748, 543728, 552724, 561832, 571258, 581397, 591756, 601658, 611314, 621175, 630786, 639281, 646684, 653854, 661428, 669654, 679095, 690734, 705418]
58565G05418J8233K1967K5265K7511K8948L0400L1906L2527L1596K9273K5718
58554A008762K0892J5419J0518O556K746j349m959p358q986j0704j2714j4730
58542A004093j6542j7981j8965j9956k1704k4158k6280k7166k6701k5002k2150
58531G57488j8743j5812j3699j1764r526p346n620m126k649j498j027j205j918
58518F62555l060m134m470m071l571l243k795k244k051k261k434k549k992l533
58504F19147l356k354j353p77k58K05j9q46j144l69N91R37J177K101L467M571
58488F21720N316N935O351O603P244Q598J0135J1182J1814J2562J3788J5564J7619
58475G54431J9071J8885J6872J3717R931N543Q48l502p275j0619j3168j4236j4027
$$ y = [705418, 723651, 745618, 770883, 798394, 827342, 857742, 889648, 922175, 953771, 983044, 1008762, 1029654, 1045073, 1055591, 1062147, 1064893, 1063544, 1058585, 1051227, 1042241, 1031537, 1018823, 1004093, 987551, 969570, 950605, 930649, 908945, 884787, 858507, 831341, 804640, 779638, 757488, 738745, 722933, 709234, 697470, 687944, 680598, 674978, 670852, 668203, 666705, 665678, 664473, 662555, 659495, 655361, 650891, 646820, 643249, 640006, 637211, 634967, 632916, 630655, 628221, 625672, 622680, 619147, 615791, 613437, 612084, 611307, 611049, 611254, 611235, 610389, 609245, 608876, 609467, 610404, 611581, 613682, 617149, 621720, 627036, 632971, 639322, 645925, 653169, 661767, 671902, 683084, 694898, 707460, 721248, 736812, 754431, 773502, 792387, 809259, 822976, 832907, 838450, 839298, 835796, 828521, 817902, 804734, 790498, 776471]
58462G76471j3423j2499j0431p157l768r42J668M193O120P540R259J1073J1527
58449G79631J0022P647N229K183j757n295p270q209q972r182q224o604n034l293
58435G40872j222K89O44Q72K259M584O988R665J3144J6629J8512J8150J6004J2569
58421H59959Q287M046O05k184m780p081q866j0338j1459j1543j0342q877q261
58408G89166q413q660q772q620p746o126m549l369j903J09J604J867J969L213
58394G39770N075O051N831N295M916M468L867L312K801K301J969J717J223Q19
58380G89415J468L262N028N899O143N879M473K035j1q39j237j751j384N70L033
58365H21983M926O965J0116J3585J5938J7026J7278J6369J4202J2005J0773R679
$$ y = [776471, 763048, 750549, 740118, 732961, 729193, 728251, 729919, 734112, 740232, 747772, 757031, 768104, 779631, 789653, 797300, 802529, 804712, 802955, 797660, 790390, 782181, 773209, 764027, 755803, 749199, 744165, 740872, 739650, 739939, 740583, 741455, 743714, 748298, 755286, 764951, 778095, 794724, 813236, 831386, 847390, 859959, 868246, 872292, 872897, 870713, 865933, 858852, 849986, 839648, 828189, 816646, 806304, 797427, 789166, 780753, 772093, 763321, 754701, 746955, 740829, 736280, 732911, 731008, 731117, 732721, 734588, 736557, 739770, 744845, 750896, 756727, 762022, 766938, 771406, 775273, 778585, 781386, 783687, 785656, 787373, 788596, 789415, 790883, 794145, 799173, 805072, 811215, 817094, 821567, 823602, 823591, 822752, 821515, 819764, 818380, 818950, 821983, 826909, 833874, 843990, 857575, 873513, 890539, 907817, 924186, 938388, 950393, 961166, 970845]
58353I70845P682N479M230L518K384J255J095J615K036K655L976N345O051O729
58339A024895Q024R134R387R910J1809J4024J4988J5206J5960J6709J6126J4670
58327A180842J3722J2953J0971P970N503M124L279K919L340M001M353M973O279
58314A265229P218P027P020Q575J0696J1741J2195J3379J4761J5141J5229J6326
58302A404537J7644J7625J6815J6666J6689J5661J4584J5237J6766J6881J5743
58291A584848J5522J6796J8415K0202K2641K4617K4638K3795K4353K5948K6442
58280A828217K5896K6386K8303L0083L1331L2988L4802L5751L6599L8902M1983
58269B191241M3985M5243M7454N0305N2282N3999N7159O1044O3645O5374O7840
$$ y = [970845, 978527, 984006, 988236, 991754, 994138, 995393, 996488, 998103, 1000139, 1002794, 1006770, 1012115, 1018166, 1024895, 1032919, 1042053, 1051440, 1061350, 1073159, 1087183, 1102171, 1117377, 1133337, 1150046, 1166172, 1180842, 1194564, 1207517, 1218488, 1226458, 1231961, 1236085, 1239364, 1242283, 1245623, 1249624, 1253977, 1258950, 1265229, 1272447, 1279474, 1286494, 1295069, 1305765, 1317506, 1329701, 1343080, 1357841, 1372982, 1388211, 1404537, 1422181, 1439806, 1456621, 1473287, 1489976, 1505637, 1520221, 1535458, 1552224, 1569105, 1584848, 1600370, 1617166, 1635581, 1655783, 1678424, 1703041, 1727679, 1751474, 1775827, 1801775, 1828217, 1854113, 1880499, 1908802, 1938885, 1970216, 2003204, 2038006, 2073757, 2110356, 2149258, 2191241, 2235226, 2280469, 2327923, 2378228, 2430510, 2484509, 2541668, 2602712, 2666357, 2731731, 2799571]
58258B799571O9983O9541O7452O6477O6320O4599O1991O1612O3715O5780O7504
58247C524545P0947P5965Q0331Q4289R0188R7733J04407J10216J17252J24931
58237D480804J30970J36544J45063J56287J67166J77933J91456K07154K21910
58228F015287K36564K54811K75928K95621L13996L35592L61580L89271M19348
58219H897998M55709M98145N43046N91483O48379P13997P85175Q64586R59211
58210A4957729J070154J194627J337564J509634J714169J949464K225180K563244
58202B8521765K981741L491457M107805M849922N729001O757244P969470R416501
58194G3824906J1142132J3196838J5673140J8689175K2332597K6650908L1636829
$$ y = [2799571, 2869554, 2939095, 3006547, 3073024, 3139344, 3203943, 3265934, 3327546, 3391261, 3457041, 3524545, 3595492, 3671457, 3751788, 3836077, 3926265, 4023998, 4128405, 4238621, 4355873, 4480804, 4611774, 4748318, 4893381, 5049668, 5216834, 5394767, 5586223, 5793377, 6015287, 6251851, 6506662, 6782590, 7078211, 7392207, 7727799, 8089379, 8478650, 8897998, 9353707, 9851852, 10394898, 10986381, 11634760, 12348757, 13133932, 13998518, 14957729, 16027883, 17222510, 18560074, 20069708, 21783877, 23733341, 25958521, 28521765, 31503506, 34994963, 39102768, 43952690, 49681691, 56438935, 64408405, 73824906, 84967038, 98163876, 113837016, 132526191, 154858788, 181509696, 213146525]
58187B13146525L7008422M1795029M4166739M1965653L3805243K0011145K739904
58180D34638660j4784263k9447716l9252441m3736195m3715054m0615742l5848947
58173A87238302l0506164k5324702k0728075j6871452j3728545j1203189r193415
58166E9682760p598101o321153n290797m461135l792255l244072k789531k416186
58158B3769530k110801j854958j636828j453752j300674j167260j048043r44467
58150A2252747q54997p73191o96908o29790n71980n18459m68044m25264l91478
58141F922636l62230l34991l11847k92863k74207k54708k37566k23925k11075
58132D419224j98216j87676j79226j69470j58066j48483j41444j33658j24247
$$ y = [213146525, 250154947, 291949976, 336116715, 378082368, 411887611, 431898756, 434638660, 419854397, 390406681, 351154240, 307418045, 263702991, 223087249, 187238302, 156732138, 131407436, 110679361, 93807909, 80079364, 68876175, 59682760, 52084659, 45763506, 40472709, 36011574, 32219319, 28975247, 26185716, 23769530, 21658729, 19803771, 18166943, 16713191, 15412517, 14245257, 13197214, 12252747, 11397750, 10624559, 9927651, 9297861, 8725881, 8207422, 7739378, 7314114, 6922636, 6560406, 6225415, 5913568, 5620705, 5346498, 5091790, 4854224, 4630299, 4419224, 4221008, 4033332, 3854106, 3684636, 3526570, 3378087, 3236643, 3102985, 2978738]
58123B978738j16259j10535j04078r6119q9865q6380q2420p6343p0838o7651o4705
58112B013545o0626n7299n5672n3591n0022m7223m6467m5683m3431m1342m0575
58101A471614l9575l7392l5615l5006l3727l0922k8656k8302k8154k6566k4491
58090A123208k3083k1634j9673j8255j7541j5901j3023j1079j1354j2405j3034
58079I46226j4196j6433j8237j8687j8991j9864k0049j8990j8322j8937j9205
58068G44315j7848j6073j5171j4345j2705j1048r977q561o489n321n853o565o337
58055F08022o411p871r423r622r238r423r539q709p687p261o636n269m478n255
58041E01200o249n971n330n836o833o765n879n479n505n030m273m192m728n270
$$ y = [2978738, 2862479, 2751944, 2647866, 2551747, 2461882, 2375502, 2293082, 2216739, 2145901, 2078250, 2013545, 1952919, 1895620, 1839948, 1786357, 1736335, 1689112, 1642645, 1596962, 1553531, 1512189, 1471614, 1432039, 1394647, 1359032, 1324026, 1290299, 1259377, 1230721, 1202419, 1174265, 1147699, 1123208, 1100125, 1078491, 1058818, 1040563, 1023022, 1007121, 994098, 983019, 971665, 959260, 946226, 932030, 915597, 897360, 878673, 859682, 839818, 819769, 800779, 782457, 763520, 744315, 726467, 710394, 695223, 680878, 668173, 657125, 647148, 638587, 632098, 626777, 620924, 614359, 608022, 601611, 593740, 584317, 574695, 565457, 556034, 546495, 537786, 530099, 522838, 516202, 510933, 506455, 501200, 494951, 488980, 483650, 477814, 470981, 464216, 458337, 452858, 447353, 442323, 438050, 433858, 429130, 423860]
58027D23860o091p664r190r466q681p930p534p129o741o486n761m099k258j431
58013C33399j723k407l020l333k940j784n73P7L36M58L57L35J127K490K979J990
57997C27768Q67J002K021K792L135L402L453L129K875K862K424J296L82K83J90
57982C57881p28j934k664l302m359n203n167m966n534o246n818m336l021k401
57968C02202k074j793j586j201n60k86p49j091l69Q87J400R94N08K26l30j260
57952B94918j996k267k391k630k890l003k764j933o37N83J532K723M454O136P119
57937B96954P619Q208Q980R808J0819J1871J2166J1078Q879O099K820p84l923
57924C90594o017p479q967j0418j1445j2014j2107j1373r792q051o620n266l981
$$ y = [423860, 417769, 410105, 400915, 391449, 382768, 374838, 367304, 360175, 353434, 346948, 341187, 337088, 334830, 333399, 331676, 329269, 326249, 322916, 319976, 318192, 317619, 317696, 318032, 318490, 318847, 319182, 320309, 322799, 325778, 327768, 328635, 329637, 331658, 334450, 337585, 340987, 344440, 347569, 350444, 353306, 355730, 357026, 357408, 357691, 357881, 357153, 355219, 352555, 349253, 344894, 339691, 334524, 329558, 324024, 317778, 311960, 307624, 304603, 302202, 300128, 298335, 296749, 295548, 294988, 294702, 293953, 292862, 292493, 293380, 294780, 295774, 296282, 296508, 296178, 294918, 292922, 290655, 288264, 285634, 282744, 279741, 276977, 275044, 274407, 274990, 276522, 279245, 283699, 289835, 296954, 304573, 312781, 321761, 331569, 342388, 354259, 366425, 377503, 386382, 392481, 395301, 394517, 390594, 384577, 377098, 368131, 357713, 346268, 334254, 322147, 310774, 300982, 292931, 286311, 281045, 277064]
57911B77064l419l645l507k232o27K80Q13J599K040J283L6k26N70J227J291J438
57895B73985J985K398K369K307K581L188M098N121N597N053L991L217K631J607
57881C20128K08q97j517j932k094j897k042l401n574p162p526p224o658n515l792
57866B63105k272j416p08M28J730K647L200L768M361M688M698M639M705M826M859
57851C03258M781M674M546M276L786L164K414J270l69j928k672k655k524k488
57837C19533k221j864k097k893l218k548j705j510j546j090m87n15r51q49M7J098
57821B97184J766J993J818J305P15J33q27k466m518o590q596j0277j0938j0352
57807B50350r318q622q014o972n808n165m945m694m431m185l330j438O42J755
$$ y = [277064, 273645, 270000, 266493, 264261, 263634, 263914, 264727, 266326, 268366, 269649, 269685, 269459, 270029, 271256, 272547, 273985, 275970, 278368, 280737, 283044, 285625, 288813, 292911, 298032, 303629, 308682, 312673, 315890, 318521, 320128, 320336, 319439, 317922, 315990, 313896, 311999, 309957, 306556, 300982, 293820, 286294, 279070, 272412, 266897, 263105, 260833, 259417, 258709, 259137, 260867, 263514, 266714, 270482, 274843, 279531, 284229, 288868, 293573, 298399, 303258, 308039, 312713, 317259, 321535, 325321, 328485, 330899, 332169, 331800, 329872, 327200, 324545, 322021, 319533, 317312, 315448, 313351, 310458, 307240, 304692, 302987, 301477, 299931, 298841, 298354, 297839, 296888, 296039, 296086, 297184, 298950, 300943, 302761, 304066, 304781, 304914, 304087, 301621, 297103, 290513, 281917, 271640, 260702, 250350, 241032, 232410, 224396, 217424, 211616, 206451, 201506, 196812, 192381, 188196, 184866, 183428, 184070, 185825]
57793A85825K004K275K577K208J289P82R88J261J291J560K376L517M880O527Q010
57778B27370Q634Q566Q679R143R074P876O078M563L646L105K478J210q47k971
57764B96604m239m655m892n101m860m260l991m132l878k911k074k173k802l005
57750B43631k534j862j360r56m95m1J79Mm29p41p56o90p39p63o76p41r68p10M56
57731B29809J782K116J466R00J017J380J593J914K520K927K629J831J188J072
57717B54144J333J494J156M76J74P28J664K006J291j65j751k820k850j955j064
57702B53861r98j480j653j265p13k12K51L24m64j929l377m470n244n517n158m780
57686B17176n189o054o146m956l237j743m07J062K570L985N500P300R438J2118
$$ y = [185825, 187829, 190104, 192681, 194889, 196178, 196960, 197948, 199209, 200500, 202060, 204436, 207953, 212833, 219360, 227370, 236004, 244570, 253249, 262392, 271466, 279342, 285420, 289983, 293629, 296734, 299212, 300422, 299575, 296604, 292365, 287710, 282818, 277717, 272857, 268597, 264606, 260474, 256596, 253685, 251611, 249438, 246636, 243631, 241097, 239235, 237875, 236919, 236424, 236383, 236562, 236566, 236137, 235396, 234640, 233950, 233211, 232448, 231772, 231031, 230063, 229353, 229809, 231591, 233707, 235173, 236073, 237090, 238470, 240063, 241977, 244497, 247424, 250053, 251884, 253072, 254144, 255477, 256971, 258127, 258603, 258777, 259505, 261169, 263175, 264466, 264301, 262550, 259730, 256880, 254925, 253861, 252863, 251383, 249730, 248465, 247752, 247540, 247791, 248115, 247651, 245722, 242345, 237875, 232631, 227114, 221956, 217176, 211987, 205933, 199787, 194831, 191594, 189851, 189444, 190506, 193076, 197061, 202561, 209861, 219299, 231417]
57672B31417J5559J9564K3864K8857L5153M2213M8233N1362N0312M3768L0553
57661F20855J1284j0689l0659m4869n1823n2262m8371m2470l5898k9179k2916
57650B63003j7902j4350j1757r673q014o602n112l660k825k868l378l733l458
57637A69671k264m30J092J572J482J731K226K110J302O05L14j10q39j363j589
57622A75510k051k663k574j683j024j098j025j99M69n6j224j662j060l21k63r82
57606A58094k051k746k475j456n96l00p4L32L10n53j648k289k681l124l090k093
57590A33560q66n82j282k006k178j993j688j288r50q47q03o82p99j387j942j819
57574A12448j210q54r87j236j349j387j366j293j399j706j711j049k97l06j000
$$ y = [231417, 246976, 266540, 290404, 319261, 354414, 396627, 444860, 496222, 546534, 590302, 620855, 632139, 621450, 590791, 545922, 494099, 441837, 393466, 350996, 315098, 285919, 263003, 245101, 230751, 218994, 209321, 201307, 194705, 189593, 185933, 183108, 180240, 176862, 173129, 169671, 167407, 166977, 168069, 169641, 171123, 172854, 175080, 177190, 178492, 179097, 179411, 179301, 178462, 177099, 175510, 173459, 170796, 168222, 166539, 165515, 164417, 163392, 163193, 163662, 163606, 162382, 160720, 159660, 159339, 159076, 158094, 156043, 153297, 150822, 149366, 148770, 148470, 148396, 148728, 149038, 148485, 146837, 144548, 141867, 138743, 135653, 133560, 132694, 132112, 130830, 128824, 126646, 124653, 122965, 121677, 120727, 119880, 119077, 118395, 117596, 116209, 114267, 112448, 111238, 110384, 109397, 108161, 106812, 105425, 104059, 102766, 101367, 99661, 97950, 96901, 96604, 96298, 95298]
57559I5298j498j345q94m98j09K63L93L23M74J066J821K363K564K427J968J308
57543A05924O03j38q51j080l01J278K610K766J876Q81M16K13l10j095j470j168
57527A10154p75q25r17l67N44Q77M17q5j87k17l17m5N60N52m51j279o83Q07J590
57508A09353J180N41M12L79j45r54j430j317p82j38K07j28j076j973k112j509
57492A00508r16r74j392j291m52K18j15r34j055m09j86j053k174k416j744q42
57476H4773r3M40N65J95k79n11o86j061j343j138n90j07K26M45L55p5l63j78R1
57457H0666l2l04k51j9l8k08j92j74m77o92j19J017J681J406Q09O19Q97J308J510
57438H7407J199L43m88o22k11q5n63r66n99L28J021J012M57k34p45r50q88o33
$$ y = [95298, 93800, 92455, 91561, 91063, 90954, 91217, 91610, 91933, 92407, 93473, 95294, 97657, 100221, 102648, 104616, 105924, 106527, 106389, 105538, 104458, 104157, 105435, 108045, 110811, 112687, 113568, 113984, 114197, 113887, 112792, 111322, 110154, 109379, 108554, 107637, 107270, 107814, 108691, 109108, 109023, 108836, 108619, 108302, 108257, 108817, 109369, 108918, 107639, 106956, 107763, 109353, 110533, 111074, 111486, 111865, 111720, 110766, 109336, 108019, 107237, 107099, 107306, 107178, 106102, 104129, 102017, 100508, 99592, 98618, 97226, 95935, 95483, 95701, 95586, 94652, 93597, 93188, 93002, 91949, 89775, 87359, 85615, 84773, 84680, 85120, 85685, 85880, 85601, 85090, 84404, 83343, 82000, 80862, 80272, 80165, 80391, 80836, 81191, 81116, 80753, 80575, 80666, 80634, 80330, 80079, 80060, 80022, 79814, 79622, 79448, 78971, 78279, 78160, 79177, 80858, 82264, 83073, 83692, 84589, 85897, 87407, 88606, 88949, 88461, 87839, 87628, 87543, 86980, 86014, 85415, 85743, 86764, 87776, 88233, 87999, 87254, 86304, 85416, 84783]
57420H4783k24K88Q04J230J472J340P75J66Q6N63R76R10O48N53M50P4l83o42q81
57401I2988j320j552r92J24Q31N56k67p26l52N15J028O85o4l08J34N27M05K40
57383I2452N19Q78P90N39O64R76R51P82J054J571J492O25k52n23m45n22q18j084
57365I9649j138r06m36M0L41N70Q75J087R19M26j1m4M43J213J643J222L90L21
57347A06604J477K876L308K722J883J294J108J485K142K123R10n75j024m13K74
57332A26194N69P32P09J26o91q14K9J145J927K369K568K451K114J687R71q7p80
57315A41219l86O59J272J224J180J341J277J028J229J916K325K130J846J781J618
57300A61659J332J426J949K245K055J910K112K275K282K654L477L970L689L247
$$ y = [84783, 84559, 84847, 85651, 86881, 88353, 89693, 90468, 90634, 90720, 91283, 92259, 93169, 93817, 94370, 94820, 94894, 94511, 93869, 92988, 91668, 90116, 89124, 89248, 90079, 90635, 90368, 89642, 89290, 89805, 90833, 91518, 91454, 91146, 91280, 91807, 92212, 92452, 92971, 93849, 94639, 95178, 95842, 96818, 97769, 98551, 99605, 101176, 102668, 103293, 103041, 102518, 102073, 101551, 100733, 99649, 98511, 97605, 97169, 97209, 97550, 98120, 98995, 100082, 101001, 101427, 101416, 101372, 101815, 103028, 104671, 105893, 106283, 106604, 108081, 110957, 114265, 116987, 118870, 120164, 121272, 122757, 124899, 127022, 127932, 127357, 126333, 125920, 126194, 126763, 127495, 128204, 128330, 127639, 126825, 126854, 127999, 129926, 132295, 134863, 137314, 139428, 141115, 142086, 141999, 141219, 140833, 141492, 142764, 143988, 145168, 146509, 147786, 148814, 150043, 151959, 154284, 156414, 158260, 160041, 161659, 162991, 164417, 166366, 168611, 170666, 172576, 174688, 176963, 179245, 181899, 185376, 189346, 193035, 196282]
57286A96282L281L557L666L722L713L049J534J03l20j65n87j964l701n166o077
57271B00927o198n380l849k093n04O57J256J463J673K120K824L912N425O829P346
57256B16408P022O797P332Q376R415J0207J0451R796Q603P899Q095Q450Q236P722
57242C34809P432P259O971O954P628Q598R092Q920Q364P540O470N500N031N053
57228D35621N461O477Q165R809J0469J0133R755J0090J0875J1278J0938J0386
57216E49457J0420J1125J1732J1641J1241J1341J2102J3024J3773J4281J4305
57205F84442J3648J2757J2302J2221J1977J1605J1526J1478J0853J0012R965J0564
57193H23350J0504R536R122J0157J1484J1688J1137J1089J1725J2272J2405J2424
$$ y = [196282, 199563, 203120, 206786, 210508, 214221, 217270, 218804, 218907, 218587, 218422, 217835, 215871, 212170, 207004, 200927, 194729, 189349, 185500, 183407, 182903, 183560, 184816, 186279, 187952, 190072, 192896, 196808, 202233, 209062, 216408, 223430, 230227, 237559, 245935, 255350, 265557, 276008, 285804, 294407, 302306, 310401, 318851, 327087, 334809, 342241, 349500, 356471, 363425, 371053, 379651, 388743, 397663, 406027, 413567, 420037, 425537, 430568, 435621, 441082, 447559, 455724, 465533, 476002, 486135, 495890, 505980, 516855, 528133, 539071, 549457, 559877, 571002, 582734, 594375, 605616, 616957, 629059, 642083, 655856, 670137, 684442, 698090, 710847, 723149, 735370, 747347, 758952, 770478, 781956, 792809, 802821, 812786, 823350, 833854, 843390, 852512, 862669, 874153, 885841, 896978, 908067, 919792, 932064, 944469, 956893]
57181I56893J2535J2774J3206J3545J3167J2180J1631J1940J2019J0850R093Q056
57169A097889P816P517O984O866P426Q255R005R591R879R893R981J0183R913Q952
57155A220150Q170Q458R442J0052R905R320Q559P803P466P665P830P538P172P111
57141A336641O980O521O441P472R196J0840J2412J4059J4976J4250J2424J1170
57129A463382J1786J4768K0155K7138L3982L9489M4057M8430N2175N4537N5911
57118A865810N7131N8075N8430N9162O1695O6151P1923P9407Q9657J02861J18658
57107B688960J37488J59984J85763K14505K47854K88645L38924M00522M76868
57098E139513N72078O88568Q27424R90596J180719J399262J646477J921642K220458
$$ y = [956893, 969428, 982202, 995408, 1008953, 1022120, 1034300, 1045931, 1057871, 1069890, 1080740, 1089833, 1097889, 1105705, 1113222, 1120206, 1127072, 1134498, 1142753, 1151758, 1161349, 1171228, 1181121, 1191102, 1201285, 1211198, 1220150, 1228320, 1236778, 1246220, 1256272, 1266177, 1275497, 1284056, 1291859, 1299325, 1306990, 1314820, 1322358, 1329530, 1336641, 1343621, 1350142, 1356583, 1364055, 1373251, 1384091, 1396503, 1410562, 1425538, 1439788, 1452212, 1463382, 1475168, 1489936, 1510091, 1537229, 1571211, 1610700, 1654757, 1703187, 1755362, 1809899, 1865810, 1922941, 1981016, 2039446, 2098608, 2160303, 2226454, 2298377, 2377784, 2467441, 2570302, 2688960, 2826448, 2986432, 3172195, 3386700, 3634554, 3923199, 4262123, 4662645, 5139513, 5711591, 6400159, 7227583, 8218179, 9398898, 10798160, 12444637, 14366279, 16586737]
57089A6586737K532768K845312L145516L419866L650683L818249L902804L877957
57081D3779892L706264L356262K831948K178624J452278O87225j01395q91994
57073E6999104j646937k328106k910586l377325l709699l891645l921425l815550
57065C1397831l602998l317632k992241k653428k319495k002903j713223j456565
57057A1339346j234059j043399q81657p45738o31648n35573m55448l90058l36936
57048E084830k92516k54198k21238j94015j73642j61719j58586j61335j64714
57039C302867j64594j59963j51547j39782j24866j07753q9726p1169n1752l1974
57029B209741j3755M06P981O177p006k9807n5349p5174q4952q6243q2929p7329
$$ y = [16586737, 19119505, 21964817, 25110333, 28530199, 32180882, 35999131, 39901935, 43779892, 47486156, 50842418, 53674366, 55852990, 57305268, 57992493, 57891098, 56999104, 55352167, 53024061, 50113475, 46736150, 43026451, 39134806, 35213381, 31397831, 27794833, 24477201, 21484960, 18831532, 16512037, 14509134, 12795911, 11339346, 10105287, 9061888, 8180231, 7434493, 6802845, 6267272, 5811824, 5421766, 5084830, 4792314, 4538116, 4316878, 4122863, 3949221, 3787502, 3628916, 3467581, 3302867, 3138273, 2978310, 2826763, 2686981, 2562115, 2454362, 2364636, 2293467, 2241715, 2209741, 2195986, 2196392, 2204373, 2210550, 2203544, 2173737, 2118388, 2043214, 1958262, 1872019, 1789090, 1711761]
57017A711761p0160o2439n5663n0448m6275m2561l9201l6162l3375l0975k9087
57006A215415k7402k5551k3695k2129k0567j8602j6700j5811j5923j5893j4957
56995I98185j3683j3001j2917j2674j1792j0493r249q217p095n457l243q95J090
56982H90559K471K858J386k661q865j5746k1777k5938k7628k6789k4275k1422
56970G22173j8907j6474j3862j1412r453p644n439k895n31J425L299N541Q300
56957F54121J1288J3697J4332J2197P180J45p646j5111k1420k5827k7780k7335
56945E87841k5291k2680k0011j7104j3651r747n830k245R71M008P137J0582J4431
56932E08411J8584K2703K6033K7248K4838J7943P084n816j8065k7351l2765l4846
$$ y = [1711761, 1641601, 1579162, 1523499, 1473051, 1426776, 1384215, 1345014, 1308852, 1275477, 1244502, 1215415, 1188013, 1162462, 1138767, 1116638, 1096071, 1077469, 1060769, 1044958, 1029035, 1013142, 998185, 984502, 971501, 958584, 945910, 934118, 923625, 914376, 906159, 899064, 893607, 890364, 889469, 890559, 893030, 895888, 897274, 894613, 885748, 870002, 848225, 822287, 794659, 767870, 743595, 722173, 703266, 686792, 672930, 661518, 652065, 644421, 638982, 636087, 635556, 636981, 640280, 645821, 654121, 665409, 679106, 693438, 705635, 712815, 712960, 705314, 690203, 668783, 642956, 615176, 587841, 562550, 539870, 519859, 502755, 489104, 479357, 473527, 471282, 472253, 476261, 483398, 493980, 508411, 526995, 549698, 575731, 602979, 627817, 645760, 652844, 647028, 628963, 601612, 568847, 534001]
56920E34001l4529l2208k8177k3521j9687j7119j5050j2865j0863r443q349p265
56908C14925o423n995n542m751m156m259m432l620j843o6J221K348L498M377M948
56893B90230N656O644P571Q443R988J2816J6676K0757K4141K5775K4623K0307
56881D73627J3425N078l566j1194j6486j8793j8490j6490j3643j0594p735m964
56869C70175j885J671N578R919J4991K0667K6345L1894L8053M5283N2461N7089
56857F72241N6600M9260L4604J4153q196k7532m0483m6644m7625m5159m0214l3322
56845E37683k5055j6081p111J165Q420J5132K2318L0635L9873M9663O0341P2347
56833G89330Q4458R3054R3627Q3157O1355L0547m765l8618o5302q1642q7930q6628
$$ y = [534001, 499472, 467264, 439087, 415566, 395879, 378760, 363710, 350845, 339982, 330539, 322190, 314925, 308502, 302507, 296965, 292214, 288058, 283799, 279367, 275747, 273904, 273838, 275059, 277407, 280905, 285282, 290230, 295886, 302530, 310101, 318544, 328532, 341348, 358024, 378781, 402922, 428697, 453320, 473627, 487052, 492130, 488564, 477370, 460884, 442091, 423601, 407111, 393468, 382874, 375139, 370175, 368290, 369961, 375539, 385458, 400449, 421116, 447461, 479355, 517408, 562691, 615152, 672241, 728841, 778101, 812705, 826858, 818662, 791130, 750647, 704003, 656378, 611219, 571005, 537683, 512628, 496547, 489436, 490601, 499021, 514153, 536471, 567106, 606979, 656642, 716983, 789330, 873788, 966842, 1060469, 1143626, 1204981, 1235528, 1230763, 1192145, 1126843, 1045201, 957271, 870643]
56821H70643q0228p0330n8233m5632l4206k4572j6009p439J463J0296J8850K7567
56809E92170L6972M6947N6517O3885O6522O1807M8341K6999P79k6197m9689o6254
56797H58799p4208p4140o8391n9801n0580m1779l3527k5783j8856j2945p441j343
56785C90005N435J1905J7485K2858K8723L4171L7013L5433K8748J7171J889j4560
56773F16276k9027l9299m4881m6400m4805m1073l6090l0634k5542k1611j8915
56762B37999j6635j4091j1651r984q823p446n938m970m411l419k129j861l111
56749A43530m418m104k373q08l17m86o97q73j106j235j080o95k30K78P88J066
56733A27240P78j54j257j779j418n97P7M80Q07J019R29P23P89J064J038N25q1
$$ y = [870643, 790415, 720085, 661852, 616220, 582014, 557442, 541433, 533994, 535457, 545753, 564603, 592170, 629142, 676089, 732606, 796491, 863013, 924820, 973161, 1000160, 1000939, 974742, 925053, 858799, 784591, 710451, 642060, 582259, 531679, 489900, 456373, 430590, 411734, 398789, 391348, 390005, 395440, 407345, 424830, 447688, 476411, 510582, 547595, 583028, 611776, 628947, 630836, 616276, 587249, 547950, 503069, 456669, 411864, 370791, 334701, 304067, 278525, 256914, 237999, 221364, 207273, 195622, 185638, 176815, 169369, 163431, 158461, 154050, 150631, 148502, 146641, 143530, 139112, 135008, 132635, 131827, 131510, 131024, 130327, 129454, 128348, 127113, 126033, 125338, 125108, 125386, 126174, 127240, 128018, 127864, 126607, 124828, 123410, 122813, 122890, 123370, 124177, 125196, 126125, 126848, 127637, 128701, 129739, 130264, 130183]
56716A30183l97m86m87l24P7N74R85J214J165Q32N11N74J012J489J729J567Q23
56699A41041l24j101r23k57J1j14R1O52P51J43l43j32L09M55O01J109J566J428
56681A44963Q93N23N14Q00J335J747J401L18o06q29q99j301j412n17Q48J575J498
56664A50851J209Q36J09n87m70L93J076J126J006J109J202J013O32J39m91r63
56648A58190q11j59K70J25j48n2K45K40k05p61r63o31p9J55n6k35q2j2m94j154
56628A53383j281r30p28p88o49k80k47o86j000q38o38q68j383j832k058j862j030
56611A36285M5N12J76j73nJ78j50m80r3O57Q01K47j24K62J031J568J659J368Q47
56592A44611L78J66M1k13l10J98J014J199M25m76n96n5L64L30J54J21K40O03J418
$$ y = [130183, 129786, 129300, 128813, 128489, 128566, 129140, 130125, 131339, 132504, 133336, 133847, 134421, 135433, 136922, 138651, 140218, 141041, 140717, 139616, 138693, 138436, 138447, 138333, 138424, 139076, 139827, 139970, 139627, 139495, 139804, 140259, 140860, 141969, 143535, 144963, 145856, 146379, 146893, 147693, 149028, 150775, 152176, 152494, 151888, 151059, 150160, 148859, 147447, 146930, 147778, 149353, 150851, 152060, 152896, 153005, 152418, 151948, 152341, 153417, 154543, 155549, 156658, 157860, 158873, 159505, 159644, 159153, 158190, 157379, 157220, 157490, 157615, 157467, 157415, 157660, 157900, 157695, 156934, 155971, 155340, 155261, 155416, 155360, 155125, 155043, 155031, 154537, 153383, 152102, 151172, 150444, 149656, 149007, 148727, 148480, 147794, 146794, 145956, 145318, 144450, 143067, 141235, 139177, 137315, 136285, 136330, 136842, 137018, 136845, 136840, 137018, 136868, 136388, 136295, 136952, 137753, 138000, 137876, 138138, 139169, 140737, 142396, 143764, 144611, 144989, 145155, 145196, 144983, 144673, 144871, 145885, 147084, 147509, 147033, 146437, 146382, 146746, 147076, 147230, 147351, 147591, 148194, 149612]
56573A49612K514L274L322L035L040L382L541L272L048L537M779O215P381Q337
56559B08289R303J0198J0681J0506R579P874N579L299J736J042Q21P70R27J132
56545B81736Q21k11j294j766k007k813m014m647m557m667n384n820n316m656m774
56530B30631n095m535l514l501m617n308m710l792l569l505k662j490j191j958
56516A81184k873l306l313k898j850m67M19M55J51J22L84O46Q23R14O43l04j712
56499A69018k726k554j365k91k88j003j216l96O48R32N42K44K74J85l07r13j180
56482A59604q84j18O55P91K44j26M47J479J793J158N43O44R76Q25L55J87L80N11
56464A69464M94O42J019J265J196J050J034R73O48K58K00N55R66J024O15r2p89
$$ y = [149612, 152126, 155400, 158722, 161757, 164797, 168179, 171720, 174992, 178040, 181577, 186356, 192571, 199952, 208289, 217592, 227790, 238471, 248977, 258556, 266430, 272009, 275308, 277044, 278086, 278907, 279677, 280604, 281736, 282557, 282346, 281052, 279286, 277279, 274466, 270452, 265805, 261248, 256581, 251197, 245377, 240061, 235405, 230631, 225536, 221001, 217487, 213986, 209369, 204061, 199351, 195559, 191990, 188485, 185823, 184333, 183142, 181184, 178311, 175005, 171692, 168794, 166944, 166477, 166896, 167351, 167502, 167624, 168008, 168654, 169477, 170391, 171034, 170730, 169018, 166292, 163738, 162373, 162082, 161794, 160791, 159575, 159179, 159827, 160759, 161301, 161545, 161819, 162004, 161697, 160784, 159604, 158720, 158602, 159257, 160048, 160292, 160166, 160613, 162092, 163885, 165043, 165586, 166230, 167206, 168031, 168386, 168573, 168953, 169464, 169958, 170600, 171619, 172884, 174080, 175130, 176164, 177137, 177785, 178043, 178243, 178798, 179764, 180788, 181403, 181311, 180522]
56447A80522j114q53j78M27O15M76K75Q8j26k46q6K74N08L46k81j226j967j769
56429A75685m53J112J858J776J726K045K105J428M53k29o85j157j442j271r35
56414A82016q14o72l3R62J652J653J092K83l65l76K84R10P90N8n93q36q02n11
56396A84698J49R67J510J635J494J119N37J45L87J107J715J912J782J343O59K05
56380B01364M61J131J393R57K75k77p28r95p61p7N73R83J412J852J737P51n27
56363B09524j163p88K12J085J225O35k9j87o5j86k90M57K011L090K701J358K58
56346B19848j63k19n7M65J131J389J066N58K63J66J25J54K89M29M94N85Q03J055
56328B28381J205J386J894K732L410L424K821K114J680J438J151P14J27n35j060
$$ y = [180522, 179408, 178555, 178377, 178804, 179419, 179895, 180170, 180258, 180132, 179886, 179800, 180074, 180582, 180928, 180647, 179421, 177454, 175685, 175232, 176344, 178202, 179978, 181704, 183749, 185854, 187282, 187735, 187506, 186821, 185664, 184222, 182951, 182016, 181202, 180530, 180497, 181459, 183111, 184764, 185856, 186139, 185774, 185398, 185682, 186592, 187382, 187440, 186847, 186011, 185209, 184698, 184847, 185814, 187324, 188959, 190453, 191572, 192109, 192254, 192641, 193748, 195463, 197375, 199157, 200500, 201159, 201364, 201825, 202956, 204349, 205306, 205581, 205304, 204576, 203581, 202820, 202743, 203316, 204299, 205711, 207563, 209300, 210051, 209524, 208361, 207573, 207785, 208870, 210095, 210730, 210701, 210514, 210449, 210263, 209973, 210430, 212441, 215531, 218232, 219590, 219848, 219685, 219466, 219409, 219874, 221005, 222394, 223460, 224018, 224281, 224447, 224572, 224726, 225015, 225444, 225938, 226523, 227326, 228381, 229586, 230972, 232866, 235598, 239008, 242432, 245253, 247367, 249047, 250485, 251636, 252350, 252477, 251942, 250882]
56313B50882j232j130r63o77l4Q52J563K049K677L489L980L880L520L130K507
56298B74493J737J474J928K361K233K031K182K072J167K91M91J266J360Q80J015
56283B96981J858K208J677J383K086K998L171K861K856L257L673L939M064L988
56269C37000L805L797L974M132M457N359O613P433P579P673Q214R090J0260J1966
56255D31352J3967J5475J6300J7368J9561K2689K5935K8699L0688L1899L2782
56244F86715L3853L4896L5175L4596L3825L3039L1451K8360K3838J8200J1754
56233A005702N293k43m956r804j4804j8614k0541k1730k3553k5756k7151k7342
56221H16501k6812k5938k4873k3937k3319k2742k1906k0860j9606j7988j6342
$$ y = [250882, 249650, 248520, 247557, 246880, 246846, 247698, 249261, 251310, 253987, 257476, 261456, 265336, 268856, 271986, 274493, 276230, 277704, 279632, 281993, 284226, 286257, 288439, 290511, 291678, 291969, 292460, 293726, 295086, 295966, 296981, 298839, 301047, 302724, 304107, 306193, 309191, 312362, 315223, 318079, 321336, 325009, 328948, 333012, 337000, 340805, 344602, 348576, 352708, 357165, 362524, 369137, 376570, 384149, 391822, 400036, 409126, 419386, 431352, 445319, 460794, 477094, 494462, 514023, 536712, 562647, 591346, 622034, 653933, 686715, 720568, 755464, 790639, 825235, 859060, 892099, 923550, 951910, 975748, 993948, 1005702, 1010995, 1010752, 1005796, 995992, 981188, 962574, 942033, 920303, 896750, 870994, 843843, 816501, 789689, 763751, 738878, 714941, 691622, 668880, 646974, 626114, 606508, 588520, 572178]
56210E72178j5404j5079j4215j2235j0148r134q953q553p587o449n418m547l970
56197D50486l617l060k211j544j227o54N39J791K460K634K548K025J118M50K54
56182D51992n4p42j084n86J50N12Q67J636K413K922L735N037N778N248M470M715
56166D87009N638O206O603P615Q888R416R283R419J0059J0749J1507J2623J3796
56153F08811J4740J6101J8524K1384K3913K6912L1751L8127M4644N1305N9652
56142I55864P0412Q2701R5564J08537J20295J28294J30348J25763J14890R8953
56132B031621Q0643O3660N0902M3298M0029L8970L7093L1859K2766J1241p44j1461
56120B439877j9647k5361l0511l7539m7612o0671p6390r3715j09893j21522j26718
$$ y = [572178, 556774, 541695, 527480, 515245, 505097, 495963, 487010, 478457, 470870, 464421, 459003, 454456, 450486, 446869, 443809, 441598, 440054, 438827, 438173, 438712, 440503, 442963, 445597, 448145, 450170, 451288, 451738, 451992, 451938, 451196, 450112, 449526, 449676, 450188, 451055, 452691, 455104, 458026, 461761, 466798, 472576, 477824, 482294, 487009, 492647, 498853, 505456, 513071, 521959, 531375, 540658, 550077, 560136, 570885, 582392, 595015, 608811, 623551, 639652, 658176, 679560, 703473, 730385, 762136, 800263, 844907, 896212, 955864, 1026276, 1108977, 1204541, 1313078, 1433373, 1561667, 1692015, 1817778, 1932668, 2031621, 2112264, 2175924, 2226826, 2270124, 2310153, 2349123, 2386216, 2418075, 2440841, 2452082, 2451338, 2439877, 2420230, 2394869, 2364358, 2326819, 2279207, 2218536, 2142146, 2048431, 1938538, 1817016, 1690298]
56109A690298j25420j18155j05990r1330p7042o4418n3067m2727l3973k7157k1920
56098I29099j7853j4690j1857q869o086m152k915j774p41q1N91J715K757L009
56084H68153K937L502M566N371O026P040P965Q099Q040Q900J0343J1102J1082
56071I63126J1232J1713J1947J2151J2966J3846J3761J3228J3723J5237J6386
56060A109316J6735J7017J7161J6320J4822J4048J4153J3937J3079J2511J2566
56049A271665J2725J3199J4672J6480J7162J6947J7454J8936K0069K0575K1621
56038A461505K3384K4600K4969K5728K7400K9056L0223L1385L2519L3232L4336
56027A778337L6936L9992M1329M1018M1072M1965M2393M2532M4165M7215M9463
$$ y = [1690298, 1564878, 1446723, 1340733, 1249403, 1172361, 1107943, 1054876, 1012149, 978176, 951019, 929099, 911246, 896556, 884699, 875830, 869744, 865592, 862677, 860903, 860162, 860081, 860672, 862387, 865144, 868153, 871090, 874592, 879158, 884529, 890555, 897595, 905560, 913659, 921699, 930599, 940942, 952044, 963126, 974358, 986071, 998018, 1010169, 1023135, 1036981, 1050742, 1063970, 1077693, 1092930, 1109316, 1126051, 1143068, 1160229, 1176549, 1191371, 1205419, 1219572, 1233509, 1246588, 1259099, 1271665, 1284390, 1297589, 1312261, 1328741, 1345903, 1362850, 1380304, 1399240, 1419309, 1439884, 1461505, 1484889, 1509489, 1534458, 1560186, 1587586, 1616642, 1646865, 1678250, 1710769, 1744001, 1778337, 1815273, 1855265, 1896594, 1937612, 1978684, 2020649, 2063042, 2105574, 2149739, 2196954, 2246417]
56016B246417N0399N2049N5249N8361O0540O3064O6504O9655P2241P5572P9685
56005B949736Q2975Q5429Q8984R3947R8499J02367J07352J13430J18403J22327
55995C963449J28196J37004J46329J55080J65340J78066J91412K04834K20418
55986E490128K38470K56377K73539K92826L15501L39662L65301L95544M31068
55977H398416M68922N08964N55547O10706O72006P39414Q17642R09328J013444
55968A4694389J133417J278860J455951J664655J909750K206213K569674L010394
55960B9923303L540054M173824M922399N795392O818307Q033391R482053J1208186
55952H3896909J3286076J5818908J8895582K2567015K6834363L1509574L5905757
$$ y = [2246417, 2296816, 2348865, 2404114, 2462475, 2523015, 2586079, 2652583, 2722238, 2794479, 2870051, 2949736, 3032711, 3118140, 3207124, 3301071, 3399570, 3501937, 3609289, 3722719, 3841122, 3963449, 4091645, 4228649, 4374978, 4530058, 4695398, 4873464, 5064876, 5269710, 5490128, 5728598, 5984975, 6258514, 6551340, 6866841, 7206503, 7571804, 7967348, 8398416, 8867338, 9376302, 9931849, 10542555, 11214561, 11953975, 12771617, 13680945, 14694389, 15827806, 17106666, 18562617, 20227272, 22137022, 24343235, 26912909, 29923303, 33463357, 37637181, 42559580, 48354972, 55173279, 63206670, 72688723, 83896909, 97182985, 113001893, 131897475, 154464490, 181298853, 212808427, 248714184]
55945B48714184L8636324L7910380L2337665K1757809P535506p848664k1659797
55938C57383407l1805381l7393288l8744677l6940620l3241210k8707884k4095411
55931A26454936j9871010j6251430j3265188j0846680q909265p365689o130238
55924D3815436n132975m327701l678451l148199k707040k339716k036167j782223
55916A8662964j565311j380619j224800j090332r71503q69129p83884p10770o44914
55907I421702n86883n37612m93653m52011m14522l82937l54407l25995k99093
55898E574589k75429k53070k30509k10455j95468j83502j71617j60591j52039
55889C741909j44328j35238j25780j17953j11435j05667j02313j02301j03006
$$ y = [248714184, 287350508, 325260888, 357598553, 379356362, 386891868, 379043204, 357383407, 325578026, 288184738, 249440061, 212499441, 179258231, 150550347, 126454936, 106583926, 90332496, 77067308, 66220628, 57311363, 49945674, 43815436, 38682461, 34354760, 30676309, 27528110, 24821070, 22481354, 20445187, 18662964, 17097653, 15717034, 14492234, 13401902, 12430399, 11561270, 10777386, 10066616, 9421702, 8834819, 8297207, 7803554, 7351543, 6937021, 6554084, 6199677, 5873682, 5574589, 5299160, 5046090, 4815581, 4605126, 4409658, 4226156, 4054539, 3893948, 3741909, 3597581, 3462343, 3336563, 3218610, 3107175, 3001508, 2899195, 2796894, 2693888]
55880B693888j01527r8349r4930r0356q3573p6418p1234o7520o3886o1077o0061
55869A824957n9171n6340n2397m9204m6250m2048l7441l4575l3662l3386l3361
55858A347122l3766l3637l1955k9538k7749k6366k4613k3080k2622k2583k2093
55847A049120k1894k2827k3781k3328k2211k2019k2369k1706j9999j8514j7498
55836H12974j6129j4311j2738j1671j1054j1279j2311j2929j2241j1046j0329
55825F76936r515p852o334o390p579q511r196j0495j1938j2165j1125r950r009
55812E56877p790o385n373m474k954j139%N39J439K876M198N343O899Q838J0409
55797E69303J1202J1221J0167P781M643J589j389m601p514r201r681r688r548
$$ y = [2693888, 2592361, 2494012, 2399082, 2308726, 2225153, 2148735, 2077501, 2009981, 1946095, 1885018, 1824957, 1765786, 1709446, 1657049, 1607845, 1561595, 1519547, 1482106, 1447531, 1413869, 1380483, 1347122, 1313356, 1279719, 1247764, 1218226, 1190477, 1164111, 1139498, 1116418, 1093796, 1071213, 1049120, 1027226, 1004399, 980618, 957290, 935079, 913060, 890691, 868985, 848986, 830472, 812974, 796845, 782534, 769796, 758125, 747071, 735792, 723481, 710552, 698311, 687265, 676936, 667421, 659569, 653235, 646845, 639266, 630755, 621559, 611064, 599126, 586961, 575836, 565886, 556877, 549087, 542702, 537329, 532855, 529901, 528762, 528762, 529301, 530740, 533616, 537814, 543157, 550056, 558894, 569303, 580505, 591726, 601893, 609674, 614317, 615906, 614517, 609916, 602402, 593201, 583520, 573832, 564284]
55784E64284r354r703j0994j2389j2732j2182j1613j0789q440m099J362O915J1975
55771D82241J5777J7198J5363R895J127r163j7819k2406k3138k1912j9953j7476
55759D09734j4977j3284j2313j1102r253p341n898m946m494m623n029n228n092
55746C06154m615l545j970p27l82k86L46J033Q54O6m14p92k065m112n578n755
55730B78212n286m802m187l371k751k456k150j776j705j949k082j985j840j395
55716B40477j87J536L027M227N656P122P597O578M649K438M0k296l879m435m489
55701B68061m554m613m640m926n552o168o543o750o658n842m241k410r94l22n00
55686B03348j203j563r06L36J202J562K115L097L880M011L743L341K669J674O10
$$ y = [564284, 554930, 545227, 534233, 521844, 509112, 496930, 485317, 474528, 466088, 461989, 463351, 470266, 482241, 498018, 515216, 530579, 540474, 541601, 532438, 514619, 492213, 469075, 447163, 427210, 409734, 394757, 381473, 369160, 358058, 348805, 341464, 335566, 330620, 326126, 321503, 316474, 311246, 306154, 301539, 297994, 296024, 295297, 294915, 294629, 294975, 296008, 296862, 296928, 296514, 295722, 293657, 289545, 283967, 278212, 272926, 268124, 263937, 260566, 257815, 255359, 253209, 251433, 249728, 247779, 245697, 243712, 241872, 240477, 240290, 241826, 244853, 249080, 254736, 261858, 269455, 276033, 280682, 283120, 283160, 280864, 276985, 272550, 268061, 263507, 258894, 254254, 249328, 243776, 237608, 231065, 224315, 217657, 211815, 207574, 205164, 204170, 203848, 203348, 202145, 200582, 199676, 200012, 201214, 202776, 204891, 207988, 211868, 215879, 219622, 222963, 225632, 227306, 227916]
55671B27916m48j618k574k689j996j283r86p25j97K51L21L29P08J372K002K416
55655B22799K452K026J612K054L547N157N796N264M140K983J933Q65l75j796l303
55640B55154m912o668q199q802q448q162q672r134q163n840l648k506k005j616
55626A68379j447j497j268o81m05p64j175j194j267j791k213j854j066p61j192
55611A49804j868k389k731k910k894k709k313j546n44J03m3p42j386j659j558
55596A24615j149o44m75q80j465j521p16O08J691J904J258M70K81O76J043J094
55580A26790J160J585K199K635K803K943L422M537O141P536Q074P856P436O894
55566A92011N796M042K091K65j566l374m766n589o184o707o785o223n508n162
$$ y = [227916, 227468, 225850, 223276, 220587, 218591, 217308, 216322, 215597, 215400, 215651, 215972, 216301, 217009, 218381, 220383, 222799, 225251, 227277, 228889, 230943, 234490, 239647, 245443, 250707, 254847, 257830, 259763, 260628, 260253, 258457, 255154, 250242, 243574, 235375, 226573, 218125, 209963, 201291, 192157, 183994, 178154, 174506, 172000, 169995, 168379, 166932, 165435, 164167, 163486, 163081, 162317, 161142, 159948, 158681, 156890, 154677, 152823, 151757, 150996, 149804, 147936, 145547, 142816, 139906, 137012, 134303, 131990, 130444, 129900, 130003, 129960, 129218, 127832, 126173, 124615, 123466, 122822, 122347, 121467, 120002, 118481, 117765, 118373, 120064, 121968, 123226, 123696, 123977, 124653, 125696, 126790, 127950, 129535, 131734, 134369, 137172, 140115, 143537, 148074, 154215, 161751, 169825, 177681, 185117, 192011, 197807, 201849, 203940, 204205, 202639, 199265, 194499, 188910, 182726, 176019, 169234, 163011, 157503, 152341]
55552A52341n033m636l848k965k304k004j907j538o11K95K13q54j667j236L6J043
55536A25325J311J105P19L02O8R3L5m39j057j212p04K4K98k61j433k486k831k716
55518A16141k846l261l172k178j010o10r92j489j668j438p26K34O58j2j199j748
55502I4684j318o18k88j98Q2O28J196J521J407Q30R2l69m13k60q1J83N32P17M89
55483I8816l4m61n40m50n86j098j678j911j705j264p44k07J17m5n65q72n81N9
55465H6251N20N79M21L60N79R89J221R80M50J01Q8Q8q6k13j36j46n49j109j296
55446H9092r47l72Q2L12L96M60N52N15R8o78j334j287m25P01J265Q50j28p44n12
55427H7896J76O83R34J213J402J096L84p9M6M54Q46J358K059K572K567K170J595
$$ y = [152341, 147308, 142672, 138824, 135859, 133555, 131551, 129644, 128106, 127495, 127790, 128003, 127149, 125482, 124246, 124282, 125325, 126636, 127741, 128460, 128762, 128830, 128923, 128958, 128519, 127462, 126250, 125546, 125570, 125868, 125607, 124174, 121688, 118857, 116141, 113295, 110034, 106862, 104684, 103674, 103064, 102072, 100583, 98915, 97477, 96751, 96985, 97643, 97631, 96432, 94684, 93366, 92748, 92460, 92262, 92344, 92972, 94168, 95689, 97096, 97926, 98018, 97649, 97236, 96976, 96895, 97078, 97610, 98327, 98816, 98782, 98321, 97781, 97331, 96745, 95647, 93969, 92058, 90353, 89089, 88345, 88138, 88255, 88210, 87645, 86773, 86192, 86251, 86771, 87350, 87771, 88131, 88710, 89699, 90920, 91900, 92350, 92451, 92539, 92627, 92541, 92328, 92192, 92046, 91497, 90388, 89092, 88145, 87773, 87855, 88167, 88563, 89023, 89575, 90090, 90188, 89510, 88176, 86889, 86464, 87165, 88430, 89280, 89152, 88408, 87896, 88072, 88755, 89689, 90902, 92304, 93400, 93784, 93705, 93751, 94205, 95051, 96409, 98468, 101040, 103607, 105777, 107372]
55410A07372P91k35j129j562j523j086l57R3n77k279l604l286j742m75k33m18
55394H9750k17M23J021J161P31Nl84Q1J215K202K425J992J415R74N58L0m53n84
55376A02345l18K7J39P0N1R2L6j57m63j000j764k338k285j832j567j543j251n94
55358H7648j67l39p18q12p11o91o64m39j00K52P11J251J497J219O23ln57q51o78
55339H6471l48n33j218j565j121m34ON49J456K010J514N17N7J41l2o50j144j229
55321H4447j161j064q61p32q50p62J01J370K073J896J340P02j35q70q05M7P24
55304H5460N30j70o64p61o55n20m89o13o50l75o2j47l60O1J127J872J597O83k12
55285H5652r57j503j417n36L94N65K57M33J249J733J108j36q21m31M61J019J030
$$ y = [107372, 108163, 107928, 106799, 105237, 103714, 102628, 102271, 102364, 101787, 99508, 95904, 92618, 90876, 90401, 90168, 89750, 89533, 89956, 90977, 92138, 92869, 92874, 92490, 92571, 93786, 95988, 98413, 100405, 101820, 102794, 103352, 103382, 102929, 102345, 102027, 102054, 102193, 102263, 102314, 102406, 102442, 102285, 101822, 100822, 99058, 96720, 94435, 92603, 91036, 89493, 88242, 87648, 87481, 87142, 86424, 85612, 84901, 84210, 83546, 83107, 83007, 83259, 83970, 85221, 86718, 87937, 88560, 88557, 88000, 87149, 86471, 86123, 85590, 84372, 82807, 81686, 81252, 81258, 81807, 83263, 85273, 86787, 87304, 87361, 87502, 87470, 86820, 85676, 84447, 83286, 82222, 81361, 80629, 79779, 79017, 79118, 80488, 82561, 84457, 85797, 86499, 86364, 85494, 84689, 84736, 85460, 85990, 85820, 85156, 84395, 83740, 83220, 82731, 82118, 81468, 81093, 81031, 80884, 80524, 80585, 81712, 83584, 85181, 85864, 85652, 84695, 83192, 81775, 81239, 81633, 82198, 82455, 82888, 84137, 85870, 86978, 86842, 86021, 85590, 86051, 87070, 88100]
55268H8100Q38O87M64Q2l29p31j316k037k357j836q48k04k12m64m78j63K64M97
55250G9957L09j16j71M58J256J450J068Q43J177J631J527O70n22j255r26J22O28
55233H8106k09j601k038j226l07k26o67q86p18l66J59Q51J468J856K176K404K051
55216I0827P99q33j851j737q25R3M01J12k46k97l00o90j249j283n69L35Q72J031
55198H4590J050J038J102J322J472J176M92j01m10o59q19n15J68M36j91j106j384
55181H7661r04k56Q3J25J25L73R60J545J505N96p66j928k308j495L31J981K138
55164H9766R91J86P08J622J571O65J9N1K95M72P02P95L40m71r78j049j093j085
55146I3507m38Q68J869J772R21J61k49o01r73j093q23l58N7K83J63m20j221j525
$$ y = [88100, 88938, 89625, 90089, 90171, 89842, 89111, 87795, 85758, 83401, 81565, 80717, 80513, 80301, 79837, 79359, 79196, 79460, 79957, 80266, 80150, 79979, 80437, 81693, 83143, 84211, 85054, 86231, 87862, 89389, 90059, 89537, 88282, 87356, 87478, 88106, 87897, 86296, 84258, 83032, 82725, 82499, 81832, 80946, 80228, 79862, 80021, 80872, 82340, 84196, 86372, 88776, 90827, 91626, 90793, 88942, 87205, 86380, 86473, 86874, 86986, 86740, 86443, 86143, 85453, 84204, 82921, 82352, 82687, 83559, 84590, 85640, 86678, 87780, 89102, 90574, 91750, 92242, 92141, 91731, 91072, 90253, 89738, 89906, 90342, 90151, 89045, 87661, 86757, 86501, 86584, 86709, 86834, 87207, 88167, 89712, 91217, 91813, 91047, 89119, 86811, 85316, 85647, 87628, 89766, 90757, 90943, 91651, 93273, 94844, 95509, 95528, 95579, 95874, 96346, 97048, 97843, 98183, 97712, 96734, 95685, 94592, 93507, 93069, 93937, 95806, 97578, 98499, 98660, 98411, 97810, 96837, 95744, 94921, 94563, 94620, 94903, 95066, 94646, 93425, 91900]
55128I1900p73O51J469P59r05j918j371k0P28M01l46q09r42r44q04n08l37n22
55110H5709p95o16J09Q27J023Q66R05J244J396J037N11L17M09M22L53N19Q79J002
55092I6117O97K67k0j90k61r7K04L25K61M04P96Q69K56n98j052j059r55q55p28
55073I4381o95p64n89k7M29K95j07j70j6k44q10r31k74N31P81N61L64K89K7n64
55053I2467j200j454j128l95M01J075J635K009J923J271L55m01q23q17k34O84
55037I5368J063K21j255j905j073L66J127R53N92O70J016J078O59P2k54k67k14
55020I8217k52l14l87n47o09j08R94J842J497J32j029j104m12J52K02L6M1K57
55002I8608N14O77P11O11M02J81Q0J33K55M00N87P25N65O4m15o09q56j575k399
$$ y = [91900, 91127, 91778, 93247, 94006, 93101, 91183, 89812, 89792, 90520, 90921, 90575, 89766, 88824, 87880, 87076, 86568, 86231, 85709, 84914, 84298, 84407, 85234, 86257, 87123, 88028, 89272, 90668, 91705, 92216, 92533, 92942, 93364, 93717, 94236, 95115, 96117, 96814, 97081, 97061, 96871, 96610, 96513, 96717, 97042, 97303, 97707, 98503, 99372, 99628, 99030, 97978, 96919, 95964, 95109, 94381, 93686, 92922, 92333, 92306, 92735, 93030, 92923, 92753, 92737, 92493, 91683, 90752, 90478, 91009, 91790, 92351, 92715, 93004, 93031, 92467, 91267, 89813, 88685, 88290, 88691, 89766, 91401, 93410, 95333, 96604, 96959, 96558, 95735, 94918, 94684, 95368, 96431, 96652, 95397, 93492, 92419, 92785, 93912, 94865, 95457, 96127, 97143, 98221, 98880, 98952, 98698, 98431, 98217, 97965, 97651, 97264, 96717, 96108, 96000, 96994, 98836, 100333, 100465, 99436, 98332, 97920, 98072, 98274, 98310, 98351, 98608, 99122, 99799, 100510, 101121, 101523, 101704, 101784, 101917, 102172, 102572, 103159, 103884, 104449, 104513, 104098, 103489, 102633, 101058, 98659]
54983I8659k441j473j90Q21J573J972J553N12J3O67J456J192L34K06Q58J136O89
54966A07537M29Q34J129O32j72n47n46n63n23j97K68O67J029J188O64n00j419
54949A09910j398p78k32J63N19M74j76p10l18N50O93r8p71o06j00Jk07j87J87
54930A06916O75J190J758K197K311K365K890L918M729M592L703L113L601M722
54916A48680N230M395K655Q64o39j998l160l827m003m125m493m839m643l768k652
54901A23677j905j770j900j808j427j086r07n51J63P65P35L53L43P49Q53L64q
54884A16640M36J302J636J249R43J435K636M004N184O032O317N786M487K876J490
54869A62453N28k49j134k053k690l064l632m602n378n188m148l216k975l001k680
$$ y = [98659, 96218, 94745, 94555, 95376, 96949, 98921, 100474, 100986, 100999, 101666, 103122, 104314, 104648, 104854, 105712, 106848, 107537, 107966, 108800, 109929, 110561, 110389, 109842, 109296, 108733, 108210, 108013, 108281, 108948, 109977, 111165, 111829, 111329, 109910, 108512, 107734, 107502, 107665, 108184, 108658, 108482, 107772, 107454, 108004, 108697, 108599, 107828, 107222, 107122, 107123, 106916, 106729, 106916, 107591, 108781, 110539, 112736, 115047, 117412, 120302, 124220, 128949, 133541, 137244, 140357, 143958, 148680, 153910, 158305, 160960, 161824, 161185, 159187, 156027, 152200, 148197, 144072, 139579, 134740, 130097, 126329, 123677, 121772, 120002, 118102, 116294, 114867, 113781, 112874, 112323, 112486, 113251, 113986, 114339, 114682, 115431, 116284, 116648, 116640, 117076, 118378, 120014, 121263, 122206, 123641, 126277, 130281, 135465, 141497, 147814, 153600, 158087, 160963, 162453, 162981, 162732, 161598, 159545, 156855, 153791, 150159, 145557, 140179, 134991, 130843, 127627, 124652, 121651, 118971]
54854A18971k122j819j790j668j462j555j967k163j815j260r56q87p49m52j19
54839I8187K11N78R86J463K005K299J791M65p72r59k67K22q1o14n74nM06K76j34
54820A05483m52o00o34n17k26R2L08N47J023J587J743J236M47o9k36l84n98n96
54802A08154l41k54n63p65k10R14J625J234N5r49j060l01P07J311J347J143J025
54785A13072R90R12Q63R14Q54M63ol3M67J029J296J459J834K386K835L017K947
54768A35299K794K949L813N230O299O197N107L977L368K883J843J66j693l372
54754A74860m792n860o411o479o272n746m655l197k208k271k845k854k006j014
54740A18250n14l51j45L3j06m97p21m43L50J265J683J342Q89J293K535L517L582
$$ y = [118971, 116849, 115030, 113240, 111572, 110110, 108555, 106588, 104425, 102610, 101350, 100394, 99507, 98758, 98306, 98187, 98398, 98976, 99962, 101425, 103430, 105729, 107520, 107985, 107213, 106254, 105987, 106209, 106128, 105514, 104940, 104935, 105341, 105617, 105483, 105031, 104431, 103797, 103280, 103054, 103146, 103454, 104001, 105024, 106611, 108354, 109590, 110037, 109968, 109732, 109348, 108750, 108154, 107813, 107559, 106996, 106231, 106021, 106935, 108560, 109794, 109849, 108900, 107840, 107539, 108246, 109557, 110904, 112047, 113072, 114062, 114974, 115837, 116751, 117605, 118068, 118062, 118029, 118496, 119525, 120821, 122280, 124114, 126500, 129335, 132352, 135299, 138093, 141042, 144855, 150085, 156384, 162581, 167688, 171665, 175033, 177916, 179759, 179925, 178232, 174860, 170068, 164208, 157797, 151318, 145046, 139300, 134645, 131448, 129240, 126969, 124124, 121270, 119264, 118250, 117736, 117385, 117240, 117273, 117167, 116670, 115949, 115506, 115856, 117121, 118804, 120146, 121035, 122328, 124863, 128380, 131962]
54723A31962L399L789M384M356L892L849M137L583J582j065l213m504n155n308
54709A45688n026m499l876l184k577k213j833r73K06Q72N30l46j024j287j256
54694A19202r52m59j48k58n52p15q17j001j075q00l59j71l28o05p63o38j05O62
54676A10118J111Q66K50q0O8L38M44N21Q02J134J020J80r90j638j364p65p27j257
54658A10031j449p60K81Q67J013J298J820J881Q74q13j968j743o57j19p24j395
54642A08437q00P55J680J304N58K55r4j025j759j292j60J81n67j235r55j60L58
54625A05481M51L68K43J79L48O74P97N82K69N7j02j27K34R24J409J286P28J51
54607A13952l00p39j191j451j235m73M28P92L86j71j01N42J006Q28K34m63j176
$$ y = [131962, 135361, 139150, 143534, 147890, 151782, 155631, 159768, 163351, 164933, 163868, 160655, 156151, 150996, 145688, 140662, 136163, 132287, 129103, 126526, 124313, 122480, 121507, 121713, 122585, 123115, 122769, 121745, 120458, 119202, 118250, 117791, 117643, 117385, 116833, 116118, 115301, 114300, 113225, 112425, 112066, 111895, 111567, 110962, 110199, 109561, 109456, 110118, 111229, 112095, 112345, 112265, 112333, 112671, 113115, 113636, 114438, 115572, 116592, 116772, 115782, 114144, 112780, 112015, 111288, 110031, 108582, 107822, 108103, 108970, 109983, 111281, 113101, 114982, 115856, 115043, 113075, 111332, 110675, 110556, 109832, 108437, 107637, 108392, 110072, 111376, 111934, 112189, 112095, 111070, 109311, 108019, 107859, 108040, 107473, 106238, 105283, 105123, 105481, 105932, 106300, 106543, 106722, 107070, 107744, 108541, 109123, 109392, 109449, 109347, 109220, 109454, 110378, 111787, 113073, 113801, 113952, 113652, 112913, 111722, 110271, 109036, 108563, 108991, 109783, 110169, 109998, 109897, 110439, 111445, 112273, 112507, 112044, 110868]
54590A10868j633j324k16Q91J184P86M63N79Q00P25M57M27Q17J316J407Q90O9
54573A18506n45p28n96l66j43Q0L73P70J136J219R83O73M22N9m36o02p6P40J107
54554A22576Q97N43K17l02q79r67m36J34L04L11M42N30M51N61J056J407J085M56
54536A28386K90O24Q52P54O42N14p7j055j533r85j60j44q83j321r05k49j20m32
54518A24198o05m76l60l97l84k42j64k19j58J86O06P93O35J45o41j460j852j602
54500A18003r82l41K86R05J310J397J396J435J203N57N2K55Q20R53N79L01K93
54483A28422J33k14j66M65J005R00N25N27R16J268J425J478J426J260J162J232
54467A41764J267J078P36L32j73o19o30j84K05K39K59N09N09k35j284j663j106
$$ y = [110868, 109235, 107911, 107695, 108586, 109770, 110556, 111019, 111598, 112398, 113123, 113580, 114007, 114824, 116140, 117547, 118437, 118506, 117961, 117233, 116637, 116271, 116128, 116208, 116581, 117351, 118487, 119706, 120689, 121362, 121784, 121843, 121407, 120805, 120729, 121469, 122576, 123473, 124016, 124233, 123931, 123052, 122085, 121649, 121783, 122087, 122398, 122840, 123370, 123821, 124382, 125438, 126845, 127930, 128386, 128676, 129300, 130152, 130906, 131548, 132062, 131985, 130930, 129397, 128412, 128252, 128108, 127225, 125904, 124999, 124750, 124630, 124198, 123593, 123117, 122757, 122360, 121976, 121734, 121570, 121351, 121193, 121379, 121985, 122778, 123413, 123558, 122917, 121457, 119605, 118003, 117021, 116680, 116966, 117871, 119181, 120578, 121974, 123409, 124612, 125169, 125221, 125476, 126296, 127249, 127828, 128129, 128422, 128555, 128341, 128175, 128640, 129645, 130545, 131070, 131597, 132513, 133781, 135206, 136684, 138110, 139370, 140532, 141764, 143031, 144109, 144845, 145177, 145004, 144385, 143755, 143571, 143776, 144015, 144274, 144783, 145292, 145057, 143773, 142110, 141004]
54450A41004l47k13p84j405j258j34J153J412L92q73j341j071o79l53oJ18j82
54433A35433m45j52L49L77J13K77P80P66J07k84J31P39Q38O07M97M30J82q2j84
54414A40479l29o23o71k29K43K22m5J5L31L45o3l51n3P46J562J931J713J258J110
54395A47591J328J305N63n78j356j451j128p59n73o24p21n33q7J35j11m09l24
54378A42268o6M7L13J095J853J697P80K01M34Q09Q01Q53J393J909J698R53L56
54361A57394K2l55o19k50O87J426J413Q67K57k75q37j472k138k700k870k422j574
54344A46554r07p30p90p19n50n41p32q54o78k66Q4R3k27m87k71L61Q29O84J06
54325A40959l81n57o14o99o91m64j44N7J30K32M66P85J009Q87L06m46q18n90j88
$$ y = [141004, 140657, 140444, 139660, 138255, 136997, 136863, 138016, 139428, 139820, 138947, 137606, 136535, 135856, 135503, 135497, 135615, 135433, 134988, 134836, 135185, 135562, 135675, 135952, 136732, 137498, 137605, 137321, 137452, 138191, 139029, 139636, 140133, 140563, 140745, 140663, 140479, 140150, 139527, 138856, 138627, 138870, 139092, 139047, 139062, 139393, 139738, 139675, 139324, 139271, 140017, 141579, 143510, 145223, 146481, 147591, 148919, 150224, 150787, 150209, 148853, 147402, 146274, 145515, 144942, 144318, 143597, 143064, 142977, 143112, 143001, 142592, 142268, 142202, 142249, 142562, 143657, 145510, 147207, 147987, 148188, 148622, 149431, 150232, 151085, 152478, 154387, 156085, 157038, 157394, 157416, 157061, 156442, 156192, 156879, 158305, 159718, 160585, 160842, 160567, 159730, 158258, 156120, 153420, 150550, 148128, 146554, 145647, 144917, 144127, 143408, 142858, 142317, 141585, 140731, 140053, 139787, 139871, 139964, 139737, 139250, 138979, 139340, 140169, 140853, 140959, 140578, 140021, 139407, 138708, 138017, 137553, 137409, 137466, 137596, 137828, 138294, 139079, 140088, 140975, 141281, 140835, 140017, 139427, 139239]
54306A39239k06o74j096j105p65k69K35M34k6r30j405r04M3N32M68M61P32Q17
54288A35581M91K17L63N82L52k55q18j145j199p87N4O83M73k10l35M90J556J984
54270A38077J626Q85K05j14KK48K23K3J33O45J092J269J591K238K518J748L76
54253A52785m89m45o5P3p5m32j020j631j825j475r46n70l57k78l89m94k22L43
54235A42488N90K04m16q51j200j482j133J55J478J557M47m79l84J10Q8l27n34
54218A40311n99j052j721j715p06M54P16P4n68m63K90R75R42J64o73p28J26J072
54200A36899J211N58n6qN19R78J125J076R50P48M15j14q38j465j537r94l71j51
54182A38945j12K47Q39J082Q33O01O89P52M49O4n9j85p05j321j303n38L34P71
$$ y = [139239, 139033, 138359, 137263, 136158, 135393, 135124, 135359, 135793, 135767, 134837, 133432, 132528, 132571, 133103, 133571, 134032, 134764, 135581, 136072, 136289, 136652, 137234, 137586, 137331, 136513, 135368, 134169, 133382, 133436, 134119, 134592, 134382, 134047, 134537, 136093, 138077, 139703, 140588, 140793, 140679, 140681, 140929, 141152, 141175, 141308, 141953, 143045, 144314, 145905, 148143, 150661, 152409, 152785, 152296, 151851, 151786, 151859, 151784, 151352, 150332, 148701, 146876, 145401, 144455, 143885, 143528, 143250, 142861, 142367, 142145, 142488, 143078, 143282, 142866, 142015, 140815, 139333, 138200, 138355, 139833, 141390, 141837, 141358, 140974, 141084, 141172, 140845, 140311, 139712, 138660, 136939, 135224, 134518, 134972, 135688, 135762, 135194, 134731, 135021, 135996, 136938, 137102, 136429, 135701, 135827, 136899, 138110, 138668, 138612, 138604, 139123, 140101, 141226, 142302, 143252, 144000, 144415, 144301, 143463, 141998, 140461, 139467, 139096, 138945, 138833, 139080, 139919, 141001, 141834, 142435, 143124, 143876, 144325, 144389, 144330, 144145, 143440, 142119, 140816, 140278, 140612, 141383]
54164A41383Q28P84O84M87J84l05r27j173m90Q00J570J202L27j34j19r6j03J27
54146A45029L72J29m06m59J12M70J4p28q64k81M69J004J297J292R14L31j85n73
54128A47937q17o94j61K25j74j153j805j618r47l34J22M83O66P03R35J510K006
54111A46884J926J307N55j04o03p35l54K62O82R23J373K029K372K153J894K275
54095A62839L238M080M282L950L400K618J381k24j665k548l080l706m279m010
54081A66276k479m50P41N45l46r44r00m49K33J129K051K612K658K499K508K709
54065A78393K859K792K449J635J85j522k607k602k089k017k445k506j652l87M64
54050A70950P44Q43R66J060J230J664K256K704L005L401L923M429N000N772O364
$$ y = [141383, 142211, 142995, 143679, 144166, 144350, 144045, 143118, 141945, 141455, 142255, 143825, 145027, 145354, 145220, 145101, 145005, 144902, 145029, 145401, 145530, 145124, 144665, 144777, 145247, 145261, 144533, 143669, 143388, 143857, 144861, 146158, 147450, 148364, 148695, 148510, 147937, 147120, 146426, 146265, 146490, 146316, 145163, 143358, 141740, 140793, 140459, 140581, 141064, 141730, 142433, 143368, 144878, 146884, 148810, 150117, 150672, 150568, 149965, 149230, 148876, 149138, 149820, 150743, 152116, 154145, 156517, 158670, 160564, 162839, 166077, 170157, 174439, 178389, 181789, 184407, 185788, 185564, 183899, 181351, 178271, 174565, 170286, 166276, 163797, 163347, 164088, 164633, 164287, 163343, 162443, 161994, 162227, 163356, 165407, 168019, 170677, 173176, 175684, 178393, 181252, 184044, 186493, 188128, 188313, 186791, 184184, 181582, 179493, 177476, 175031, 172525, 170873, 170486, 170950, 171694, 172537, 173503, 174563, 175793, 177457, 179713, 182417, 185422, 188823, 192746, 197175, 202175, 207947, 214311]
54035B14311O124N143M386M477M847M543L475K363J746J504J227O06l86j321j501
54020B51544p56J03J39n55j113j209j389k011k646k930l302m229n200n185l992
54005B17269k539j759j792k254k756k975k734k207j801j615j345q75n31n36o27
53990A90923n71o76j294k065k235j598o04L26J021J165L84j066k219k412j849
53975A77230j000N4J281K188K280J790J435J500J655J573J352J292J604K333L345
53960A99912M370N326O464P936R317R871R224P469M829J572j735m391o004o584
53946B47576o255n242m049l132k387j358j5J137J805K227K580K660K377K212K638
53931B42774L396L747L347K557K007K054K644L440M123M565M777M740M519M427
$$ y = [214311, 220435, 225578, 229964, 234441, 239288, 243831, 247306, 249669, 251415, 252919, 254146, 254752, 254366, 253045, 251544, 250788, 250891, 251030, 250475, 249362, 248153, 246764, 244753, 242107, 239177, 235875, 231646, 226446, 221261, 217269, 214730, 212971, 211179, 208925, 206169, 203194, 200460, 198253, 196452, 194837, 193492, 192617, 192086, 191550, 190923, 190352, 189676, 188382, 186317, 184082, 182484, 181880, 182206, 183227, 184392, 184776, 183710, 181491, 179079, 177230, 176230, 176284, 177565, 179753, 182033, 183823, 185258, 186758, 188413, 189986, 191338, 192630, 194234, 196567, 199912, 204282, 209608, 216072, 224008, 233325, 243196, 252420, 259889, 264718, 266290, 264555, 260164, 254160, 247576, 241321, 236079, 232030, 228898, 226511, 225153, 225138, 226275, 228080, 230307, 232887, 235547, 237924, 240136, 242774, 246170, 249917, 253264, 255821, 257828, 259882, 262526, 265966, 270089, 274654, 279431, 284171, 288690, 293117]
53917B93117M770N361N644N370M874M604M669M936N185M993L929K108L09q05j321
53902C47743j746k283k701k772k579k488k861l651m306m373m169m450n334o135
53888B97895o404o470o690o809o542o187o072n881n264m602m395m244l353j897
53874B23085r69j077j578j753j706j852k164k304k097j517n96L38O69Q2j004j850
53858B03707k083j864j551j322j111p92m61m21p70j194j370j350j315j151p28
53843A86224l21k36j80L05R09Q13l3p15o67m29o57j115j130n81J64Q54J383J588
53825A86176J547J719K211K306J380ro97m06Q5K51M21R58J552J751J601J402J295
53808B03543J359J792K554L202L429L532L951M574M933M867M589M216L719L321
$$ y = [293117, 297887, 303248, 308892, 314262, 319136, 323740, 328409, 333345, 338530, 343523, 347452, 349560, 349869, 349064, 347743, 345997, 343714, 341013, 338241, 335662, 333174, 330313, 326662, 322356, 317983, 313814, 309364, 304030, 297895, 291491, 285021, 278331, 271522, 264980, 258793, 252721, 246840, 241576, 236974, 232579, 228335, 224982, 223085, 222116, 221039, 219461, 217708, 216002, 214150, 211986, 209682, 207585, 206068, 205472, 205810, 206479, 206561, 205557, 203707, 201624, 199760, 198209, 196887, 195776, 194984, 194523, 194102, 193332, 192138, 190768, 189418, 188103, 186952, 186224, 185903, 185667, 185487, 185792, 186701, 187514, 187481, 186766, 186099, 185670, 185013, 183898, 182768, 182187, 182351, 183205, 184588, 186176, 187723, 189442, 191653, 193959, 195339, 195330, 194633, 194227, 194312, 194563, 194984, 195942, 197494, 199245, 200846, 202248, 203543, 204902, 206694, 209248, 212450, 215879, 219411, 223362, 227936, 232869, 237736, 242325, 246541, 250260, 253581]
53794B53581L405L903M166L677K617J509O00j69p14q27n86n34j142k229l099l321
53778B60837l206l363l853m126l902l609l678l734l175k333k230l020l580l105
53764B13923k334k430l164l228k094o37J35J27k51p35j123j153q64o74p86r64
53748A93748j068j309j637j459m13R15J552J164K54m30m41J40P44Q93Q46J216
53732A94715J853J838R16Q3J16M08J34k05M45J804K550K321K037K145J971J219
53716B14350P70J225J746J389P65J191K609L531L057J961J527K056K876L291L034
53701B45378K142R23K4P7J107K454L446L970M254M263L703K591J441P17M06K63
53685B77159J77R2j46n94j029j227j171q46j75O18R95P74M18K22j97j090j754
$$ y = [253581, 256986, 260889, 265055, 268732, 271349, 272858, 273458, 273289, 272575, 271748, 271162, 270628, 269486, 267257, 264158, 260837, 257631, 254268, 250415, 246289, 242387, 238778, 235100, 231366, 228191, 225858, 223628, 220608, 217028, 213923, 211589, 209159, 205995, 202767, 200673, 200036, 200171, 200298, 200047, 199312, 198189, 197036, 196172, 195498, 194712, 193748, 192680, 191371, 189734, 188275, 187862, 188777, 190329, 191493, 191747, 191317, 190876, 191016, 191760, 192653, 193499, 194715, 196568, 198406, 199322, 199405, 199521, 199929, 200063, 199858, 200303, 202107, 204657, 206978, 209015, 211160, 213131, 214350, 215120, 216345, 218091, 219480, 220245, 221436, 224045, 227576, 230633, 232594, 234121, 236177, 239053, 242344, 245378, 247520, 248443, 248467, 248544, 249651, 252105, 255551, 259521, 263775, 268038, 271741, 274332, 275773, 276490, 276896, 277159, 277336, 277428, 277282, 276688, 275659, 274432, 273261, 272415, 272240, 272858, 273853, 274627, 275045, 275267, 275070, 273980, 272226]
53668B72226j450o73n26j043j208o81k85n41p74k72N25O78K6q47j421j499j037
53651B61198k41L99O22O73Q46R99R15P68Q51J080J145J020R85J229J701K198K478
53634B78866K383K030J691J516J466J554J857K368L068M066N291O177O194N540
53620C24067M788L995K864J706J312J677J860J382R21J183J879K362K567K766
53606C55329K958L149L632M435M968M724L885K850J728P83O59J480K290K080R42
53591C95892l28j267j801j841j487j231j314j359j175j266j938k534k415j972
53577C73964j834j801j531j615k654l811l652k163o99j08j33m82j119j518r54
53562C49890K71J064J073R04P26J0j122j607r71k7M71P02Q99P07J14p3N51J187
$$ y = [272226, 270776, 270103, 269577, 268534, 267326, 266645, 266360, 265819, 265045, 264773, 265298, 265976, 266002, 265155, 263734, 262235, 261198, 260957, 261356, 261978, 262651, 263497, 264496, 265411, 266179, 267030, 268110, 269255, 270275, 271260, 272489, 274190, 276388, 278866, 281249, 283279, 284970, 286486, 287952, 289506, 291363, 293731, 296799, 300865, 306156, 312333, 318527, 324067, 328855, 332850, 335714, 337420, 338732, 340409, 342269, 343651, 344572, 345755, 347634, 349996, 352563, 355329, 358287, 361436, 365068, 369503, 374471, 379195, 383080, 385930, 387658, 388441, 389100, 390580, 392870, 394950, 395892, 395564, 394297, 392496, 390655, 389168, 387937, 386623, 385264, 384089, 382823, 380885, 378351, 375936, 373964, 372130, 370329, 368798, 367183, 364529, 360718, 357066, 354903, 354204, 354096, 353963, 353481, 352362, 350844, 349890, 350161, 351225, 352298, 353202, 353928, 353938, 352816, 351209, 350238, 350211, 350682, 351384, 352283, 352990, 353104, 353031, 353582, 354769]
53544C54769J111R13J531K681L292L097K906L380M298N050N353N436N721O355
53530D05893P077P747Q773J0449J2034J2381J1537J0854J1207J2038J2579J3003
53518E35572J3739J4566J5200J6105J7752J9608K0798K1410K2295K3739K5120
53507G45904K5794K5666K4954K3994K3231K2924K2889K2782K2475K1951K1127
53496A003691K0176J9605J9652J9971K0237K0586K0979K0762J9532J7973J7019
53485A220183J6624J6133J5500J5250J5449J5694J5912J6260J6268J5161J3140
53474A391574J1354J0299R163P095M349J588j109l953o748r183j1424j3687j5560
53461A373758j6406j6379j6354j6844j7540j8070j8634j9572k0701k1509k1807
$$ y = [354769, 355880, 356793, 358324, 361005, 364297, 367394, 370300, 373680, 377978, 383028, 388381, 393817, 399538, 405893, 412970, 420717, 429490, 439939, 451973, 464354, 475891, 486745, 497952, 509990, 522569, 535572, 549311, 563877, 579077, 595182, 612934, 632542, 653340, 674750, 697045, 720784, 745904, 771698, 797364, 822318, 846312, 869543, 892467, 915356, 938138, 960613, 982564, 1003691, 1023867, 1043472, 1063124, 1083095, 1103332, 1123918, 1144897, 1165659, 1185191, 1203164, 1220183, 1236807, 1252940, 1268440, 1283690, 1299139, 1314833, 1330745, 1347005, 1363273, 1378434, 1391574, 1402928, 1413227, 1422390, 1429485, 1433834, 1435422, 1434313, 1430360, 1423612, 1414429, 1403005, 1389318, 1373758, 1357352, 1340973, 1324619, 1307775, 1290235, 1272165, 1253531, 1233959, 1213258, 1191749, 1169942]
53450A169942k1756k1400k0623j9751j9498k0006k0305j9409j7738j6615j6301
53439I56540j5344j2535q725n946m966m590l458j648j44P11J559L006M891O639
53425I15990P962Q926R626J0153J0857J2183J4146J6265J8170J9944K1605K2793
53413A088620K3424K4272K6162K8685L0530L1099L1061L1216L1724L2706L4708
53402A414207L7912M1526M4626M7115M9321N1156N2369N3266N4324N5435N6167
53391A957424N6618N7225N7827N7662N6389N4510N2702N1134M9536M7588M5197
53380B543812M2587L9966L7005L3071K8286K3820K0432J7276J3022P787K854j406
53368B808512o155j2422j9869k7638l5418m3071m9847n4813n7746n9132n9525
$$ y = [1169942, 1148186, 1126786, 1106163, 1086412, 1066914, 1046908, 1026603, 1007194, 989456, 972841, 956540, 941196, 928661, 919936, 913990, 909024, 904434, 900976, 899328, 899184, 899895, 901454, 904460, 909351, 915990, 923952, 932878, 942504, 952657, 963514, 975697, 989843, 1006108, 1024278, 1044222, 1065827, 1088620, 1112044, 1136316, 1162478, 1191163, 1221693, 1252792, 1283853, 1315069, 1346793, 1379499, 1414207, 1452119, 1493645, 1538271, 1585386, 1634707, 1685863, 1738232, 1791498, 1845822, 1901257, 1957424, 2014042, 2071267, 2129094, 2186756, 2243145, 2297655, 2350357, 2401491, 2451027, 2498615, 2543812, 2586399, 2626365, 2663370, 2696441, 2724727, 2748547, 2768979, 2786255, 2799277, 2807064, 2809918, 2808512, 2802357, 2789935, 2770066, 2742428, 2707010, 2663939, 2614092, 2559279, 2501533, 2442401, 2382876]
53357B382876n9290n8737n8056n7237n6196n4817n2870n0232m7327m4938m3447
53346A799729m2623m2208m2214m2449m2370m1674m0483l8721l5974l2458k9335
53335A369220k7399k5905k3581k0407j7502j5421j3640j1781j0371r923j0107
53324A183183j0364j0762j1559j2332j2340j1588j0777j0187r305p789o116m805
53312A065259l555j828J00J438K114K936M355N857O903P767Q909J0101J0902J1628
53298A132886J3118J5616J8473K0934K2708K3868K4684K5587K6741K7741K8073
53287A380429K7823K7377K6575K4822K2144J9387J7230J5494J3656J1512R080
53276A595529O317L220j31l738p476j0749j2936j4359j6090j8570k1053k2822
$$ y = [2382876, 2323586, 2264849, 2206793, 2149556, 2093360, 2038543, 1985673, 1935441, 1888114, 1843176, 1799729, 1757106, 1714898, 1672684, 1630235, 1587865, 1546191, 1505708, 1466987, 1431013, 1398555, 1369220, 1341821, 1315916, 1292335, 1271928, 1254426, 1239005, 1225365, 1213584, 1203213, 1193290, 1183183, 1172819, 1162057, 1150498, 1138166, 1125826, 1114238, 1103461, 1093274, 1083969, 1076180, 1070064, 1065259, 1061704, 1059876, 1059976, 1061414, 1063528, 1066464, 1070819, 1076676, 1083579, 1091346, 1100255, 1110356, 1121258, 1132886, 1146004, 1161620, 1180093, 1201027, 1223735, 1247603, 1272287, 1297874, 1324615, 1352356, 1380429, 1408252, 1435629, 1462204, 1487026, 1509170, 1528557, 1545787, 1561281, 1574937, 1586449, 1595529, 1601846, 1605066, 1604935, 1601197, 1593721, 1582972, 1570036, 1555677, 1539587, 1521017, 1499964, 1477142]
53264A477142k4236k6052k8213k9967l0937l1456l2035l2827l3500l3392l2161
53253A142366l0431k9288k8923k8348k6893k5240k4386k4267k4246k4363k5068
53242H50913k5957k5944k4695k3008k1668k0642j9504j8008j6115j4088j2587
53231F28697j1997j1634j0367q187o379n935o520p315q059q789r230r135q837
53218E16313q918r526j0430j1403j2173j2332j1764j0924j0307r838r107q041
53206C91550o935o037n455n249n297n269n093n232o099p371q257q336p809p124
53192C01987o709o820p188o998n804m309l585l596l228j980q17q94k018k952k958
53177B42131k430k128k293k586k579k134j448p79j93L32N84K21o31j240j056m09
$$ y = [1477142, 1452906, 1426854, 1398641, 1368674, 1337737, 1306281, 1274246, 1241419, 1207919, 1174527, 1142366, 1111935, 1082647, 1053724, 1025376, 998483, 973243, 948857, 924590, 900344, 875981, 850913, 824956, 799012, 774317, 751309, 729641, 708999, 689495, 671487, 655372, 641284, 628697, 616700, 605066, 594699, 586512, 580133, 574198, 567678, 560363, 552304, 543515, 534285, 525150, 516313, 507395, 497869, 487439, 476036, 463863, 451531, 439767, 428843, 418536, 408698, 399591, 391550, 384615, 378578, 373123, 367874, 362577, 357308, 352215, 346983, 340884, 333513, 325256, 316920, 309111, 301987, 295278, 288458, 281270, 274272, 268468, 264159, 260574, 256978, 253750, 251770, 250953, 250059, 248041, 245089, 242131, 239701, 237573, 235280, 232694, 230115, 227981, 226533, 225754, 225561, 225893, 226477, 226698, 226067, 224827, 223771, 223362]
53161B23362k6m0K8L56M78M6n68p64n26l69o01j023j345j528j678j778j689j255
53143B11080m19O45J485J682J311R07Q56J006J076J200J682K294K328J508M56
53128B29097o6o0p2l01m02j44K57N16N58L55l8k12L55J455K093J635N69l13r65
53109B34317j631j858j010L80Q49j85j707k567k717k595k128j172l20k87q43j125
53093B15401q57m24L8P83J592J661O93n18j013p18k14J21L41N26N70L62Jk08l7
53074B18100L16K37o09j725k247j955j404j037o71m5O33R10N38n01j943k981k585
53057B03031o24J625K681K352J624J272J178R64O29L79J96r8n12p80n53K41J140
53040B14745J403P98mj52K72L61l64j280j514j122r08j244j579j248l84L22N52
$$ y = [223362, 223336, 223296, 223324, 223680, 224158, 224204, 223636, 222872, 222346, 221977, 221376, 220353, 219008, 217480, 215802, 214024, 212335, 211080, 210661, 211306, 212791, 214473, 215784, 216691, 217547, 218553, 219629, 220829, 222511, 224805, 227133, 228641, 229097, 229031, 228971, 228899, 228598, 228196, 228052, 228309, 228825, 229383, 229738, 229700, 229488, 229843, 231298, 233391, 235026, 235595, 235282, 234317, 232686, 230828, 229818, 230198, 231047, 230862, 229155, 226588, 223871, 221276, 219148, 217976, 217656, 217369, 216526, 215401, 214544, 214120, 214158, 214941, 216533, 218194, 218887, 218369, 217356, 216638, 216424, 216545, 216886, 217412, 217982, 218344, 218345, 218137, 218100, 218416, 218653, 218044, 216319, 214072, 212117, 210713, 209676, 209005, 208960, 209593, 210503, 211041, 210540, 208597, 205616, 203031, 202407, 204032, 206713, 209065, 210689, 211961, 213139, 214103, 214732, 215111, 215307, 215209, 214697, 213917, 213364, 213605, 214745, 216148, 216946, 216942, 216790, 217062, 217423, 217059, 215779, 214265, 213143, 212235, 210991, 209412, 208164, 207780, 208102, 208654]
53023B08654O36Q95J136J024O64M41M28M02L54N00P19N26j69p24o10j63q4m59
53005B14170q22r57j013r81o35p4K39J54l0j86n84j137j105o3J254J715J214P26
52987B11885R43J514J772J664J630J834J932J550P64Q3M8P14J522J777J349P58
52971B31739N41P02R67J267J670J970J788J124M13p2n24j101j543j574j449j645
52955B34273k140k457k356k134k067k036j807j449j204j104r49o07j81J27K82
52940B14191M61P53Q49K75q29j529j087J4O09K75l61p23q76q40k61P12J049J91
52922B12873q79p96K44Q16L07l73l17K42O26P63Q74Q03K65n23r96q71k98L89Q30
52903B13979P36K08k79m29m82p32r82p87n8Q09J362J385R90N79M85N48K97k53
$$ y = [208654, 209290, 210185, 211321, 212345, 213009, 213450, 213878, 214280, 214634, 215134, 215853, 216379, 216210, 215486, 214876, 214713, 214629, 214170, 213348, 212391, 211378, 210397, 209762, 209688, 209927, 210081, 210051, 209865, 209281, 208144, 207039, 206976, 208230, 209945, 211159, 211885, 212828, 214342, 216114, 217778, 219408, 221242, 223174, 224724, 225488, 225571, 225619, 226333, 227855, 229632, 230981, 231739, 232280, 232982, 233949, 235216, 236886, 238856, 240644, 241768, 242181, 242109, 241585, 240484, 238941, 237367, 235918, 234273, 232133, 229676, 227320, 225186, 223119, 221083, 219276, 217827, 216623, 215519, 214570, 213963, 213782, 213909, 214191, 214652, 215405, 216254, 216529, 215700, 214171, 213084, 213098, 213707, 213982, 213621, 212898, 212022, 211182, 210921, 211633, 212682, 212873, 211994, 211198, 211442, 212258, 212565, 212192, 211875, 212117, 212743, 213506, 214380, 215183, 215448, 214925, 213929, 213058, 212760, 213149, 213979, 214715, 214923, 214644, 214215, 213733, 213001, 212019, 211232, 211174, 211983, 213345, 214730, 215720, 216299, 216784, 217332, 217629, 217376]
52885B17376n05j97J43R0J46Q76J730J661P50J42L51O48M47K66P56J622K207K493
52867B31002K707K496J396j59j158j246q91m59O7M41J53p14j389j520j669k298
52851B26759k967l074k851k933l304l297k532j335l05Q1l25j074j220k89R93J475
52835B03802R88M05L02L13Ql41k85Jj8m89j069j417j412j051m70O4M29Q08J315
52816B01883J648J432Q02K94K33N10R23J414J746J385oj950l319l330k324j357
52800A99984j038j046q39m56k60k36j32n6l10o42l71N23J183J066O84O90Q85O91
52782B00320J52k52m18n56n71k55J54K41J38K15K58k69j141j444r08l48m75r79
52764A93862j150q35l14K58Q07J101R78O82O18R34J493K050K309K095J638J370
$$ y = [217376, 216871, 216674, 216817, 216907, 217053, 217929, 219659, 221320, 222070, 222212, 222563, 223211, 223658, 223924, 224680, 226302, 228509, 231002, 233709, 236205, 237601, 237442, 236284, 235038, 234147, 233688, 233755, 234196, 234349, 233635, 232246, 230726, 229057, 226759, 223792, 220718, 217867, 214934, 211630, 208333, 205801, 204466, 204161, 204242, 203917, 202843, 201623, 201334, 202327, 203802, 204790, 205195, 205497, 205810, 205818, 205477, 205192, 205193, 205175, 204686, 203617, 202200, 200788, 199737, 199267, 199331, 199760, 200568, 201883, 203531, 204963, 205765, 206059, 206292, 206802, 207725, 209139, 210885, 212270, 212264, 210314, 206995, 203665, 201341, 199984, 198946, 197900, 197061, 196605, 196345, 196109, 195977, 195921, 195611, 194969, 194598, 195121, 196304, 197370, 198054, 198744, 199629, 200320, 200472, 200220, 199802, 199246, 198675, 198420, 198574, 198815, 198953, 199168, 199426, 199157, 198016, 196572, 195664, 195316, 194841, 193862, 192712, 191877, 191563, 191821, 192628, 193729, 194707, 195389, 196007, 196941, 198434, 200484, 202793, 204888, 206526, 207896]
52748B07896J356J265R60O70N05L34K80P76J773K480K336J714J228Q60L56m6r
52731B24734J54q2m04L8J305K302K044P13p44j658j990j986j783j361p77l96o11
52714B19498j248j550j049k22J45l4k82m39p32j039q12R2J050J420J150N35j65
52697B16318o46n54N9O46Q38Q14P99N82k4n81m79J60N55K88k13l49q7J76K01Q8
52677B18591n4k96o31q09n58J8M70M61J08j82j14K69O18N49L4m25k45N08J113
52658B19425J134J003J412K380L354L952M102L597K180J57j628k588k837k768
52644B32875k614k461k281j815q85J11N33M19M86R82J200N70l50n69O2R25J560
52627B28748J930J911J290K43p07j276j596j830j980k044j977j634j040o15o40
$$ y = [207896, 209252, 210517, 211477, 212147, 212652, 212986, 213266, 214042, 215815, 218295, 220631, 222345, 223573, 224433, 224789, 224743, 224734, 224888, 224806, 224402, 224440, 225745, 228047, 230091, 230804, 230060, 228402, 226412, 224426, 222643, 221282, 220505, 220109, 219498, 218250, 216700, 215651, 215429, 215574, 215540, 215258, 214819, 214087, 213048, 212236, 212328, 213378, 214798, 215948, 216483, 216318, 215672, 215118, 215177, 215823, 216661, 217475, 218274, 218856, 218832, 218251, 217772, 217932, 218487, 218775, 218562, 218213, 218126, 218302, 218503, 218591, 218537, 218241, 217610, 216801, 216243, 216261, 216731, 217192, 217300, 217118, 217004, 217273, 217891, 218440, 218474, 218049, 217804, 218312, 219425, 220559, 221562, 222974, 225354, 228708, 232660, 236762, 240359, 242539, 242696, 241068, 238480, 235643, 232875, 230261, 227800, 225519, 223704, 222819, 222930, 223463, 223882, 224368, 225350, 226550, 227120, 226770, 226201, 226263, 227188, 228748, 230678, 232589, 233879, 234122, 233415, 232139, 230543, 228713, 226733, 224689, 222712, 221078, 220038, 219423, 218783]
52612B18783p09k60M48N88N1l19L6N93O50M04N06R71J185Q92N03M24N87Q08J122
52593B27263J539J734J383P02K94L96N62L24q4l7N23Q55L62o11j189r64k55M43
52575B33240Q53Q92O51M36M21K96l98j511k244j977r13K06P23M56k37o73m88j42
52557B29591m15j361k207k348j960j426o78M28J544K104J963J408P72L28L37P64
52541B28844J135R88M04j50l29r0L64O04K51m42o57j3Q48J131R46R59J307J549
52523B37649J425J002K26q96j717j431j96Q86J149R99R95J045Q78P04R13J462
52507B45093K011K281K086J334L80q4J20J91p44k502l939m146l252k181j727j840
52491B33081j740r25R5M10K0j07N98J551J939J751J454J175P81L46K9k34m59m02
$$ y = [218783, 218074, 217814, 218262, 218850, 218901, 218582, 218618, 219211, 219861, 220265, 220771, 221742, 222927, 223819, 224322, 224746, 225333, 226141, 227263, 228802, 230536, 231919, 232621, 232915, 233311, 233873, 234197, 234113, 234076, 234599, 235454, 235816, 235205, 234016, 233052, 232797, 233240, 234093, 234985, 235636, 236072, 236493, 236789, 236391, 234880, 232636, 230659, 229746, 229952, 230675, 231131, 230894, 230221, 229733, 229591, 229176, 227815, 225608, 223260, 221300, 219874, 219196, 219624, 221168, 223272, 225235, 226643, 227415, 227743, 228080, 228844, 229979, 230967, 231371, 231221, 230892, 230802, 231166, 231770, 232021, 231579, 230922, 230909, 231757, 232888, 233834, 234793, 236100, 237649, 239074, 240076, 240302, 239406, 237689, 236258, 236062, 236948, 238097, 239096, 240091, 241136, 242014, 242718, 243631, 245093, 247104, 249385, 251471, 252805, 253185, 253101, 253221, 253412, 252668, 250166, 246227, 242081, 238829, 236648, 234921, 233081, 231341, 230416, 230511, 230921, 230941, 230834, 231432, 232983, 234922, 236673, 238127, 239302, 240083, 240429, 240458, 240224, 239765, 239363]
52473B39363LL37L41M00Q64J333J338J250J676K285K228J524J042J121J176P66
52457B57047J49m15j097j914k533k868l159l157k208n63L44l46j587j737o95J88
52441B35449K8p01j137j076q49p41q29j016j047o57J48R99J430J176L91l95o67
52424B30506l57J90P39J318J880K153K083J972J998J959J834K115L173M589N631
52409B61783O223O929Q157R733J1085J1366R705N961J225k965n903p780q748q665
52395B98106p790o925o472n983m927l517k299j420p04k17j90m53l96L94J649K635
52379B61491K813K308J768J695K039K503L033L735M380M555M286M085M121L938
52365C06750L177K215J581J172N09l86r88j000o70l42j02J15L84P97J293J527
$$ y = [239363, 239366, 239703, 240044, 240444, 241308, 242641, 243979, 245229, 246905, 249190, 251418, 252942, 253984, 255105, 256281, 257047, 257196, 256781, 255684, 253770, 251237, 248369, 245210, 242053, 239845, 239282, 239626, 239280, 237693, 235956, 235261, 235449, 235477, 234776, 233639, 232563, 231714, 230973, 230144, 229128, 228081, 227424, 227572, 228571, 230001, 231177, 231568, 231173, 230506, 230149, 230339, 231078, 232396, 234276, 236429, 238512, 240484, 242482, 244441, 246275, 248390, 251563, 256152, 261783, 268006, 274935, 283092, 292825, 303910, 315276, 324981, 330942, 332167, 329202, 323299, 315519, 306771, 298106, 290316, 283391, 276919, 270936, 266009, 262492, 260193, 258773, 258069, 257852, 257662, 257209, 256813, 257207, 258856, 261491, 264304, 266612, 268380, 270075, 272114, 274617, 277650, 281385, 285765, 290320, 294606, 298691, 302812, 306750, 309927, 312142, 313723, 314895, 315404, 315018, 314030, 313030, 312360, 312018, 311916, 312031, 312415, 313212, 314505, 316032]
52349C16032J206N63J28N8J35L88J189K502L629M052M167M686N541N965N640N283
52333C61164N907P709R861J1293J1636J1407J1374J1858J2679J3655J4735J5735
52321D99013J6303J6401J6443J6704J6952J7020J7275J7930J8338J7734J6525
52310F86638J5877J6018J5898J4848J3596J3092J3078J2652J1643J0575R628Q586
52298H42129P625P199P076O307M363J675j117l771o083p626q270q475q649q601
52284H23782q028p141o357n639m636l266j760k29J367K930M269N403O575P917
52270H15187R327J0592J1415J1530J1036J0532J0569J1012J1287J1201J1150J1478
52258I46316J2062J2598J2979J3094J2597J1278R540Q147P359O575N010K520l72
$$ y = [316032, 317238, 317801, 317929, 317987, 318122, 318510, 319699, 322201, 325830, 329882, 334049, 338735, 344276, 350241, 355881, 361164, 367071, 374780, 384641, 395934, 407570, 418977, 430351, 442209, 454888, 468543, 483278, 499013, 515316, 531717, 548160, 564864, 581816, 598836, 616111, 634041, 652379, 670113, 686638, 702515, 718533, 734431, 749279, 762875, 775967, 789045, 801697, 813340, 823915, 833543, 842129, 849754, 856953, 864029, 870336, 874699, 876374, 875257, 871486, 865403, 857777, 849507, 841032, 832383, 823782, 815754, 808613, 802256, 796617, 791981, 788715, 786955, 786726, 788093, 791023, 795292, 800695, 807270, 815187, 824514, 835106, 846521, 858051, 869087, 879619, 890188, 901200, 912487, 923688, 934838, 946316, 958378, 970976, 983955, 997049, 1009646, 1020924, 1030464, 1038611, 1045970, 1052545, 1057555, 1060075, 1059703]
52245A059703l134n577p635r151j0136j0958j1937j2878j3297j3051j2450j1757
52233I37742j0940j0038r362r109r006q581p676o562n589m915m459m012l402k619
52219H41472j742q08J58J065J885K725L557M008L823L379L275L454L293K600J950
52204H74094J834K116K597L384M343M851M673M515N009N678N703N215M950M869
52190I33831M197K864J847J697J610M51j799m179n958p205q238q972q968q105
52176H93073o935o177n866n379m416l475l017k681j871p60O7N69J130J631J618
52161H57511J330J572K413K906K447J596J166J231J446J649J646J085Q7n18j74
52146H77393O82J376J879K369K455J692N00k45l36k75k81L4R88K472M320O468
$$ y = [1059703, 1056569, 1050992, 1043357, 1034206, 1024070, 1013112, 1001175, 988297, 975000, 961949, 949499, 937742, 926802, 916764, 907402, 898293, 889287, 880706, 873030, 866468, 860879, 855964, 851505, 847493, 844091, 841472, 839730, 838922, 839080, 840145, 842030, 844755, 848312, 852320, 856143, 859522, 862797, 866251, 869544, 872144, 874094, 875928, 878044, 880641, 884025, 888368, 893219, 897892, 902407, 907416, 913094, 918797, 924012, 928962, 933831, 938028, 940892, 942739, 944436, 946046, 946497, 944698, 940519, 934561, 927356, 919118, 910146, 901178, 893073, 886138, 879961, 874095, 868716, 864300, 860825, 857808, 855127, 853256, 852496, 852563, 853132, 854262, 855893, 857511, 858841, 860413, 862826, 865732, 868179, 869775, 870941, 872172, 873618, 875267, 876913, 877998, 878085, 877567, 877393, 878075, 879451, 881330, 883699, 886154, 887846, 888346, 888101, 887765, 887490, 887209, 887243, 888231, 890703, 895023, 901491]
52130I01491Q631J0360J1629J3006J5014J7561K0091K2101K3447K4338K5040K5552
52118A118261K5627K5288K5020K5182K5380K4800K3102K0730J8355J6295J4394
52107A362434J2292R813P282N262L879K661J294J15o04j433l187n672p804r046
52093A377286j0092j1867j4351j6685j8093j8418j7956j7087j5933j4353j2348
52082A210103j0329q721p406n911m164k509r74R61L574O337Q505R994J1278J2600
52068A223338J3684J4176J4122J3899J3860J4027J4116J3815J3093J2147J1174
52057A371451J0297R633R125Q321O679M215J519r83l524o491r706j2563j4764
52044A373209j6531j8079j9205j9616j9447j9215j9133j8789j7672j5964j4476
$$ y = [901491, 910122, 920482, 932111, 945117, 960131, 977692, 997783, 1019884, 1043331, 1067669, 1092709, 1118261, 1143888, 1169176, 1194196, 1219378, 1244758, 1269558, 1292660, 1313390, 1331745, 1348040, 1362434, 1374726, 1384539, 1391821, 1397083, 1400962, 1403623, 1404917, 1405032, 1404428, 1402995, 1399808, 1394136, 1386332, 1377286, 1367194, 1355327, 1340976, 1324291, 1306198, 1287780, 1269824, 1252737, 1236804, 1222451, 1210103, 1199774, 1191053, 1183647, 1177736, 1173572, 1171063, 1170089, 1171050, 1174624, 1180961, 1189466, 1199460, 1210738, 1223338, 1237022, 1251198, 1265320, 1279219, 1293079, 1307106, 1321222, 1335037, 1348130, 1360277, 1371451, 1381748, 1391381, 1400506, 1408827, 1415506, 1419721, 1421240, 1420257, 1416733, 1410242, 1400536, 1387973, 1373209, 1356678, 1338599, 1319394, 1299778, 1280331, 1261116, 1241983, 1223194, 1205522, 1189558, 1175082]
52033A175082j3693j3268j2685j2112j2110j2691j3146j2900j2081j1204j0675
52022A038517j0611j0781j0589r608q210p232o881o562o007n811o390p135p338
52009I35362p480q569j0506j2182j3204j4365j6066j7345j7177j6018j5159j4934
$$ y = [1175082, 1161389, 1148121, 1135436, 1123324, 1111214, 1098523, 1085377, 1072477, 1060396, 1049192, 1038517, 1027906, 1017125, 1006536, 996928, 988718, 981486, 974605, 968043, 962036, 956225, 949835, 942700, 935362, 927882, 919313, 908807, 896625, 883421, 869056, 852990, 835645, 818468, 802450, 787291, 772357]
$$ [...]
##END NTUPLES=NMR SPECTRUM
##END=
