##TITLE=AC1462_TOLI213268_7819399_Jd6nq9Xnnw
##JCAMPDX= 6.0         $$ Bruker NMR JCAMP-DX V2.0
##DATA TYPE= NMR SPECTRUM
##DATA CLASS= NTUPLES
##ORIGIN= BRUKER
##OWNER= Administrator
$$ 1.72 TOPSPIN		Version 2.1
$$ 2013-04-30 22:59:13.993 -0700  Administrator@X
$$ Compression mode = diff/dup
##.OBSERVE FREQUENCY= 400.02188249412
##.OBSERVE NUCLEUS= ^1H
##.ACQUISITION MODE= SIMULTANEOUS (DQD)
##.ACQUISITION SCHEME= undefined
##.AVERAGES= 8
##.DIGITISER RES= 22
##SPECTROMETER/DATA SYSTEM= spect
##.PULSE SEQUENCE= zg30
##.SOLVENT NAME= COFFEE_meoh
##.SHIFT REFERENCE= INTERNAL, COFFEE_meoh, 1, 14.98509
##AUDIT TRAIL= $$ (NUMBER, WHEN, WHO, WHERE, PROCESS, VERSION, WHAT)
$$ ##TITLE= Audit trail, TOPSPIN		Version 2.1
$$ ##JCAMPDX= 5.01
$$ ##ORIGIN= Bruker BioSpin GmbH
$$ ##OWNER= Administrator
$$ $$ E:\/data/COFFEE/nmr/AC1462_TOLI213268_7819399_Jd6nq9Xnnw/10/pdata/1/auditp.txt
$$ ##AUDIT TRAIL=  $$ (NUMBER, WHEN, WHO, WHERE, PROCESS, VERSION, WHAT)
(   1,<2013-04-30 22:59:07.227 -0700>,<Administrator>,<X>,<go>,<TOPSPIN 2.1>,
      <created by zg
	started at 2013-04-30 22:58:00.649 -0700,
	POWCHK enabled, PULCHK disabled,
       configuration hash MD5:
       F7 49 AB AC A2 8D 51 76 73 8D C1 9A A6 38 9F DE
       data hash MD5: 64K
       A3 FB FE F2 A8 1C E0 2A 5C E1 B1 E8 D7 D8 93 FC>)
(   2,<2013-04-30 22:59:10.164 -0700>,<Administrator>,<X>,<proc1d>,<TOPSPIN 2.1>,
      <Start of raw data processing
       efp LB = 0 FT_mod = 6 PKNL = 1 PHC0 = 0 PHC1 = 0 SI = 32K 
       data hash MD5: 32K
       81 1A EF A5 CD 64 19 17 2A 0D B5 F2 C5 47 A4 C7>)
(   3,<2013-04-30 22:59:10.539 -0700>,<Administrator>,<X>,<proc1d>,<TOPSPIN 2.1>,
      <pk PHC0 = 96.61377 PHC1 = 0 
       data hash MD5: 32K
       94 80 CF 9C 7B A6 CB E8 40 79 D3 2B 3B 7F 84 83>)
(   4,<2013-04-30 22:59:10.664 -0700>,<Administrator>,<X>,<proc1d>,<TOPSPIN 2.1>,
      <abs ABSG = 1 
       data hash MD5: 32K
       B9 39 1C 7D E9 8C C1 78 94 CF C1 23 4F 09 65 01>)
(   5,<2013-04-30 22:59:10.727 -0700>,<Administrator>,<X>,<proc1d>,<TOPSPIN 2.1>,
      <abs ABSG = 2 
       data hash MD5: 32K
       71 36 1B 39 7D F9 65 CC DD 1F 6F 6B 2D 7A 47 05>)
(   6,<2013-04-30 22:59:10.805 -0700>,<Administrator>,<X>,<proc1d>,<TOPSPIN 2.1>,
      <abs ABSG = 3 
       data hash MD5: 32K
       A3 83 39 B9 E8 1E E3 74 82 D2 B6 A9 46 98 19 A7>)
(   7,<2013-04-30 22:59:10.852 -0700>,<Administrator>,<X>,<proc1d>,<TOPSPIN 2.1>,
      <abs ABSG = 4 
       data hash MD5: 32K
       F1 82 72 7F 5A 2B 85 78 DD BD 89 E6 4A F9 39 4E>)
(   8,<2013-04-30 22:59:10.899 -0700>,<Administrator>,<X>,<proc1d>,<TOPSPIN 2.1>,
      <abs ABSG = 5 
       data hash MD5: 32K
       BD C4 44 02 A6 1F ED CB 0F 8E B1 27 1C 1D E7 2D>)
$$ ##END=
$$ 
$$ $$ hash MD5
$$ $$ FF 8C 26 A5 DC 12 BD EE 91 D4 4E 79 33 2C A1 53
##$RELAX= 
##$RELAX= 
##$RELAX= 
##$RELAX= 
##$RELAX= 
##$RELAX= 
##$RELAX= 
$$ Bruker specific parameters
$$ --------------------------
##$DU= <E:\>
##$EXPNO= 10
##$NAME= <AC1462_TOLI213268_7819399_Jd6nq9Xnnw>
$$ [...]
150 150 150 150 150 150 150 150
##$TP07= 0
##$TPNAME0= <>
##$TPNAME1= <>
##$TPNAME2= <>
##$TPNAME3= <>
##$TPNAME4= <>
##$TPNAME5= <>
##$TPNAME6= <>
##$TPNAME7= <>
##$TPOAL= (0..7)
0.5 0.5 0.5 0.5 0.5 0.5 0.5 0.5
##$TPOFFS= (0..7)
0 0 0 0 0 0 0 0
##$TUNHIN= 0
##$TUNHOUT= 0
##$TUNXOUT= 0
##$USERA1= <user>
##$USERA2= <user>
##$USERA3= <user>
##$USERA4= <user>
##$USERA5= <user>
##$V9= 5
##$VALIST= <valist>
##$VCLIST= <CCCCCCCCCCCCCCC>
##$VD= 0
##$VDLIST= <DDDDDDDDDDDDDDD>
##$VPLIST= <PPPPPPPPPPPPPPP>
##$VTLIST= <TTTTTTTTTTTTTTT>
##$WBST= 1024
##$WBSW= 4
##$XGAIN= (0..3)
0 0 0 0
##$XL= 0
##$YL= 0
##$YMAX_a= 645723
##$YMIN_a= -548713
##$ZGOPTNS= <>
##$ZL1= 120
##$ZL2= 120
##$ZL3= 120
##$ZL4= 120
##$ABSF1= 14.98509
##$ABSF2= -5.573092
##$ABSG= 5
##$ABSL= 3
##$ALPHA= 0
##$AQORDER= 0
##$ASSFAC= 0
##$ASSFACI= 0
##$ASSFACX= 0
##$ASSWID= 0
##$AUNMP= <proc_prof1d_extract_pilot.lims>
##$AXLEFT= 0
##$AXNAME= <>
##$AXNUC= <1H>
##$AXRIGHT= 0
##$AXTYPE= 0
##$AXUNIT= <>
##$AZFE= 0.1
##$AZFW= 0.1
##$BCFW= 0
##$BC_mod= 0
##$BYTORDP= 0
##$COROFFS= 0
##$CY= 15
##$DATMOD= 1
##$DC= 0
##$DFILT= <>
##$DTYPP= 0
##$F1P= 0
##$F2P= 0
##$FCOR= 0.5
##$FTSIZE= 32768
##$FT_mod= 6
##$GAMMA= 0
##$GB= 0
##$INTBC= 1
##$INTSCL= 1
##$ISEN= 128
##$LB= 0
##$LEV0= 0
##$LPBIN= 0
##$MAXI= 10000
##$MC2= 0
##$MEAN= 0
##$ME_mod= 0
##$MI= 0
##$NCOEF= 0
##$NC_proc= -8
##$NLEV= 6
##$NOISF1= 0
##$NOISF2= 0
##$NSP= 0
##$NTH_PI= 0
##$NZP= 0
##$OFFSET= 14.98509
##$PC= 1
##$PHC0= 96.61377
##$PHC1= 0
##$PH_mod= 1
##$PKNL= yes
##$PPARMOD= 0
##$PPDIAG= 0
##$PPIPTYP= 0
##$PPMPNUM= 2147483647
##$PPRESOL= 1
##$PSCAL= 4
##$PSIGN= 0
##$PYNMP= <proc.py>
##$REVERSE= no
##$SF= 400.02
##$SI= 32768
##$SIGF1= 0
##$SIGF2= 0
##$SINO= 400
##$SIOLD= 32768
##$SPECTYP= <>
##$SREGLST= <1H.CDCl3>
##$SSB= 0
##$STSI= 32768
##$STSR= 0
##$SW_p= 8223.68421052631
##$SYMM= 0
##$S_DEV= 0
##$TDeff= 65536
##$TDoff= 0
##$TI= <>
##$TILT= no
##$TM1= 0
##$TM2= 0
##$TOPLEV= 0
##$USERP1= <user>
##$USERP2= <user>
##$USERP3= <user>
##$USERP4= <user>
##$USERP5= <user>
##$WDW= 1
##$XDIM= 32768
##$YMAX_p= 460192502
##$YMIN_p= -717662
##$CURPLOT= <Network HP LaserJet P1505>
##$CURPRIN= <$Network HP LaserJet P1505>
##$DFORMAT= <normdp>
##$LAYOUT= <+/1D_H.xwp>
##$LFORMAT= <normlp>
##$PFORMAT= <normpl>
##$SURQMSG= 1
$$ End of Bruker specific parameters
$$ ---------------------------------
##NTUPLES= NMR SPECTRUM
##VAR_NAME=  FREQUENCY,     SPECTRUM/REAL,   SPECTRUM/IMAG
##SYMBOL=    X,             R,               I
##VAR_TYPE=  INDEPENDENT,   DEPENDENT,       DEPENDENT
##VAR_FORM=  AFFN,          ASDF,            ASDF
##VAR_DIM=   32768,         32768,           32768
##UNITS=     HZ,            ARBITRARY UNITS, ARBITRARY UNITS
##FACTOR=    0.250966925370066, 1,           1
##FIRST=     8223.43324360094, 101829,       -259400
##LAST=      0,             -210564,         -147179
##MIN=       0,             -717662,         0
##MAX=       8223.43324360094, 460192502,    0
$$ Real data points
##PAGE= N=1
##DATA TABLE= (X++(R..R)), XYDATA
$$ [...]
$$ plain form
19514 118292 193389 219448 469844 22199 -88524 146604 -195113 -252610 42722 -31978 -109052
19503 -109052 -204453 -126357 177060 -184685 -137107 -159651 200199 -44642 -3865 -28397 -34497
19492 -34497 -111370 -203550 -462318 186593 -103568 -244347 -256866 -322312 -22659 -107679 -658543
19481 -658543 91255 187041 -202626 -116617 275443 101378 84847 137662 -219547 -222840 346209
19469 -105011 424704 86947 -236465 7748 -89441 125320 64670 -98899 -149581 -174025 -114616
19458 -114616 152202 -19557 6023 -439474 -281468 274674 142591 81143 -28195 40215 -182600
19446 12704 -52027 -154945 169962 -176748 178477 237862 -103170 -25894 -49078 -130529 -251610
19435 -251610 6875 763 1926 285842 437529 -147472 6305 -39760 -121152 92691 138971 -355173
$$ packed form
19514A18292P5097K6059K50396B2199h8524A46604a95113n7497D2722c1978p7074
19503a09052r5401P8096A77060a84685M7578k2544B00199d4642c865k4532o100
19492c4497p6873r2180k58768A86593a03568j40779j2519o5446b2659q5020n50864
19481f58543I1255R5786b02626Q6009B75443A01378j6531N2815b19547l293C46209
19469a05011D24704H6947b36465G748h9441A25320o0650i8899n0682k4444N9409
19458a14616A52202a9557F023d39474J58006B74674j32083o1448b8195D0215a82600
19446A2704e2027j02918A69962a76748A78477N9385a03170b5894k3184q1451j21081
19435b51610F875G63J163K83916J51687a47472F305c9760q1392I2691M6280c55173
$$ plain form
19422 -114044 125426 -302530 142358 -194754 -223074 -254254 240299 -370924 -107342 -316473
19412 -316473 21951 140950 11163 -127443 14227 187829 -113979 -109478 211786 -28463 -211807
19401 -211807 -116612 81817 -283925 342196 -175924 278453 9307 61321 -232995 -12451 -688
19389 -127005 369467 -110995 -444071 -22088 -394430 -224829 133689 123786 -199610 156979
19378 37892 4301 -21349 -377395 -251790 -109365 -228540 104936 -193840 -238848 -314726 -78906
19366 376132 -115832 -281145 95229 -192866 87267 251157 -125111 59574 -412788 -249042
19356 -249042 -204725 100146 -192313 86672 93233 95541 -206295 -280306 -235082 -207169 125872
19344 -158692 -151000 -222915 -324121 -153910 -87213 -65150 224186 49949 -77696 -142036 -112546
$$ packed form
19422a14044A25426c02530A42358a94754k8320l1180B40299c70924a07342k09131
19412c16473B1951J18999A1163a27443A4227J73602a13979M501B11786b8463j83344
19401b11807R5195H1817b83925C42196a75924B78453I307N2014b32995a2451f88
19389a27005C69467a10995l33076b2088l72342J69601A33689r903a99610A56979
19378C7892D301b1349l56046J25605a09365j19175A04936a93840m5008p5878g8906
19366C76132a15832j65313I5229a92866H7267J63890a25111E9574d12788J63746
19356b49042M4317A00146a92313H6672O561K308b06295p4011M5224K7913A25872
19344a58692P692p1915j01206a53910O6697K2063B24186D9949g7696o4340K9490
$$ plain form
19333 -112546 -23436 -179972 -66882 62465 -9087 -232130 -75195 -203497 -121867 -314626 -252925
19322 -252925 8631 -94588 95869 -263115 130725 -87123 205101 259255 27920 179647 -177595
19310 1536 -70151 -410613 29158 -203708 -278838 -166742 127702 -26231 -170273 -140709 -81766
19299 -81766 69578 -110299 -241813 -451574 261397 116871 28937 125434 -29397 -171039
19289 -171039 -192084 211480 97379 -233729 -141434 -118547 -339413 47775 -20909 -100414 -207888
19278 -207888 -198195 183180 127954 -1608 -141500 -140078 -42999 -132323 -119831 -269668 -170966
19267 -170966 -174803 -143433 172681 -80065 260377 -56096 -294481 -205823 122770 -382413 220670
19255 -85474 -121945 -352378 -291462 40269 -270007 -67356 20343 -184161 33455 47552 -232544
$$ packed form
19333a12546b3436j56536f6882F2465i087k23043g5195j28302Q1630j92759O1701
19322b52925H631i4588I5869b63115A30725h7123B05101N4154B7920J51727a77595
19310A536g0151l40462B9158b03708p5130J12096A27702b6231j44042K9564N8943
19299h1766F9578a10299j31514k09761B61397A16871B8937R6497b9397j41642
19289a71039k1045B11480I7379b33729R2295K2887k20866D7775b0909p9505j07474
19278b07888R693A83180n5226a608j39892J422d2999q9324J2492j49837R8702
19267a70966l837L1370A72681h0065B60377e6096k38385Q8658A22770c82413B20670
19255h5474l6471k30433O0916D0269b70007f7356B0343a84161C3455J4097b32544
$$ plain form
19243 109575 -311716 -155272 108999 6471 120699 416434 62643 -347972 -26922 15246
19232 127116 -219609 -351461 185440 -192863 180620 -130836 -255470 -251230 15425 187 240706
19221 240706 -87910 -86962 91745 119866 -233465 -70068 45190 -15378 -28609 242629 2758 70888
19209 70888 -162338 -1926 4757 -278214 100015 243700 114140 -327432 -170889 -31826 -19929
19198 -19929 -217524 64809 -119851 -164810 -214515 -208407 -108310 100085 -119990 -206794 -335797
19187 -335797 -19235 -374387 268917 305377 -419430 -124235 -277603 66900 -14884 -282932
19177 -282932 59429 -93219 195598 -329449 -245026 72641 -66807 43841 5896 318669 119264
19165 -279855 38941 -182038 15144 -151051 -179365 -189273 -256042 52795 260123 278698 227929
$$ packed form
19243A09575c11716a55272A08999F471J14228K95735F2643c47972b6922A5246
19232A27116b19609j31852A85440a92863A80620a30836j24634M240A5425A87K40519
19221B40706h7910R48I1745K8121b33465g0068D5190a5378j3231B42629B758O8130
19209G0888a62338a926D757b78214A00015J43685A14140c27432J56543c1826J1897
19198a9929j97595F4809a19851m4959m9705O108J00097A00085a19990q6804j29003
19187c35797a9235l55152B68917L6460d19430a24235j53368F6900a4884k68048
19177b82932E9429i3219A95598c29449Q4423G2641f6807D3841E896L12773A19264
19165b79855C8941a82038A5144a51051k8314r908o6769E2795K07328J8575n0769
$$ plain form
19154 227929 -30357 32145 147477 -219404 -23874 158256 161442 -186028 66312 42266 -167931
19142 -120976 63207 -354565 -63569 221528 82949 189262 9294 -60721 -112714 -50084 -120842
19131 -120842 -144826 -245113 -421416 -167843 -334296 -144098 286715 49238 -208260 232295
19120 38822 148921 -137929 -90737 -189559 24055 -186834 -372961 -168581 768 -7099 -233715
19109 -233715 -22706 158329 46681 -280965 77384 -20624 169067 11410 -34397 -332850 -266049
19098 -266049 -42884 -263916 -255609 -173934 -212620 -298058 163838 59638 -249637 -178510 30067
19086 -292944 -181516 -44355 45581 -175217 -43376 158731 -113872 -122502 -128249 -129595 -277429
19075 -277429 62008 -427924 187694 -196401 43336 211210 55188 -392314 11487 34572
$$ packed form
19154B27929c0357C2145J15332b19404b3874A58256L186a86028F6312k4046a67931
19142a20976F3207c54565f3569B21528H2949J06313I294f0721n1993e0084p0758
19131a20842k3984j00287j76303a67843j66453a44098B86715D9238b08260B32295
19120C8822J10099a37929M7192r8822B4055a86834j86127a68581G68g099k26616
19109b33715b2706A58329D6681b80965G7384b0624A69067A1410c4397k98453O6801
19098b66049d2884k21032Q307Q1675l8686q5438A63838E9638b49637P1127C0067
19086b92944J11428d4355D5581a75217d3376A58731a13872q630n747j346j47834
19075b77429F2008d27924A87694a96401D3336J67874E5188c92314A1487K3085
$$ plain form
19065 34572 -133811 55322 -233064 -304828 19894 -211382 46122 -221572 -590178 -161781
19054 110141 70653 -52286 91166 175553 136582 -39031 108255 -211563 -56192 -285966 95387
19042 -34537 282502 -277833 29997 -36958 65213 -63628 -248628 -35968 -429602 44898 154200
19031 154200 43742 105195 63369 221575 60921 452813 23561 139896 -136128 -48402 417216
19019 141297 100901 67656 3577 -152434 -63496 142955 120099 -25076 208458 134046 -168564
19007 266110 -211987 -240596 38113 -108851 367408 103055 -70531 -200420 109942 65646
18997 65646 -263723 40048 -160933 -64831 -74569 -223902 464187 106197 1881 -133847 -18082
18985 -37428 94309 158971 -174157 25846 92439 -201232 93076 44759 -197592 -299765 -19454
$$ packed form
19065C4572a33811E5322b33064p1764A9894b11382D6122b21572l68606a61781
19054A10141l9488e2286I1166Q4387l8971c9031A08255b11563e6192k29774I5387
19042c4537B82502b77833B9997c6958F5213f3628j85000c5968l93634D4898J09302
19031A54200D3742O1453m1826J58206F0921L91892B3561J16335a36128d8402D17216
19019A41297m0396l3245C577a52434f3496A42955k2856b5076B08458p4412a68564
19007B66110b11987k8609C8113a08851C67408A03055g0531j29889A09942m4296
18997F5646b63723D0048a60933f4831r738j49333D64187A06197A881a33847a8082
18985c7428I4309O4662a74157B5846O6593b01232I3076D4759a97592j02173a9454
$$ plain form
18973 -75756 -26143 50273 63099 -354804 102270 -260198 31903 -42263 75555 -128620 -73788
18962 -73788 -300255 -148571 -292355 -195010 -262174 262256 -256906 9356 -118095 -49901 -111101
18951 -111101 -215266 -139729 -317760 -81484 -142810 -205334 -66640 -126234 -56343 124153 138517
18940 138517 77677 -55254 58567 18835 -94092 -244797 -2639 -443400 198350 -15500 -59005
18929 -59005 -46774 -218770 213846 81571 -119141 53838 31562 -243790 276322 100870
18918 -188600 59672 -259922 -100338 -203524 -159888 -246106 -100380 -44579 -293523 -193070
18908 -193070 65380 -187385 178800 -228381 -289756 -277480 75466 -80423 -13678 -179903 162991
18896 -233050 -5111 -228102 -71420 1814 14280 287759 189026 -21757 -104345 -261369 -296012
$$ packed form
18973g5756b6143E0273J2826c54804A02270b60198C1903d2263G5555a28620N4832
18962g3788k26467a48571j43784R7345o7164B62256b56906I356a18095d9901o1200
18951a11101j04165P5537j78031h1484o1326o2524f6640n9594e6343A24153J4364
18940A38517o0840e5254E8567A8835i4092j50705b639m40761A98350a5500m3505
18929e9005J2231j71996B13846H1571a19141E3838k2276b43790B76322A00870
18918a88600E9672b59922a00338j03186M3636q6218a00380d4579k48944J00453
18908a93070F5380a87385A78800b28381o1375J2276G5466h0423a3678j66225A62991
18896b33050e111k22991g1420A814J2466K73479r8733b1757q2588j57024l4643
$$ plain form
18885 -296012 -214875 -62724 -52568 -163636 25287 -38885 -293833 134242 3722 352877 46684
18873 249488 -163550 -64117 94747 165237 -203676 -165820 256912 -109332 -207859 -46776 -145030
18862 -145030 -23804 65470 -160663 -260014 217517 196171 344843 245461 -14655 34925 -120733
18850 -51612 -104663 933 32391 -11002 153210 -80453 -67638 271605 -71314 -117881 -229914
18839 -229914 -165745 264393 10404 155141 -159760 -74166 -247573 -96630 -78094 -172121 70097
18827 -139423 -187468 14035 121487 224613 -110797 -8966 60391 -2674 47580 127673 245643
18816 245643 -63845 170235 94643 197314 60913 189221 72035 -64472 -134040 457343 19283
18804 146768 -110532 -495747 27133 194049 122350 -273312 -41418 -148665 329214 -671904
$$ packed form
18885b96012Q1137f2724J0156j11068B5287c8885k54948A34242C722L49155D6684
18873B49488a63550f4117I4747P0490b03676L7856B56912a09332r8527d6776r8254
18862a45030b3804F5470a60663r9351B17517k1346J48672r9382a4655C4925a20733
18850e1612n3051I33L1458a1002A53210h0453J2815B71605g1314m6567j12033
18839b29914O4169B64393A0404J44737a59760g4166j73407i6630J8536r4027G0097
18827a39423m8045A4035J07452J03126a10797h966F0391b674D7580Q0093J17970
18816B45643f3845A70235p5592J02671F0913J28308G2035f4472o9568D57343A9283
18804A46768a10532l85215B7133J66916p1699b73312d1418j07247C29214f71904
$$ plain form
18793 -16638 -4598 -47507 227742 -581108 -309232 -3772 67441 72259 -564967 -114305 -59661
18782 -59661 -226990 -66452 -216687 -16469 -355923 42113 -291102 -204604 -354807 107650
18771 -57253 -12976 414461 27626 -265398 30157 -178608 47447 -10132 85759 3085 14801
18760 14801 151143 -348421 1295 -93664 196287 179739 -317027 -380983 185332 229971 -59218
18748 28826 -87644 -41477 -158717 59792 -208067 68061 194763 -439744 185955 -61201 -209984
18737 -209984 -313715 4809 -237235 -147659 312894 123915 -271046 -106234 -93908 -250450
18727 -250450 -183685 -138851 -44133 -421235 -154034 -380832 -375361 107381 -173521 353927
18716 -149102 -104400 -234551 8901 -61271 11342 16516 -46091 194651 -197 -97446 110065 57311
$$ packed form
18793a6638d598m2909B27742e81108K71876c772F7441M818e64967a14305N4644
18782e9661j67329f6452j50235a6469l39454D2113b91102Q6498j50203A07650
18771e7253a2976D14461B7626b65398C0157a78608D7447a0132H5759C085J1716
18760A4801J36342c48421A295i3664A96287j6548c17027o3956A85332M4639e9218
18748B8826h7644d1477j17240E9792b08067F8061J26702d39744A85955f1201j48783
18737b09984j03731D809b37235Q9576C12894A23915b71046a06234J2326j56542
18727b50450O6765M4834d4133l77102a54034k26798N471A07381a73521C53927
18716a49102M4702j30151H901f1271A1342N174d6091A94651a97r7249A10065n2754
$$ plain form
18704 57311 150491 -59338 -167840 -165625 11957 56973 -35815 -96597 -175235 14548 -254145
18692 304922 137737 130821 -330696 20715 -145291 87610 -100573 -43928 216802 143452 -16905
18680 59066 18147 -69286 -18611 -59595 -238399 19357 -62076 142964 -130452 -92814 -55792
18669 -55792 97735 -148078 -111233 -88805 106502 -404934 70339 120883 -119513 -211110 -161748
18658 -161748 20999 221699 -380765 -181437 -200715 241897 90281 -127584 -235848 -6415
18647 -123934 -74499 5549 -2866 -489835 -11381 -160659 -93191 96786 228854 201778 365403
18636 365403 -136502 -76012 -232215 117254 23664 -112481 -257450 224751 109651 -160404
18625 -102169 -107318 178603 -133260 -367961 -162060 -143336 97394 -194600 163008 93271
$$ packed form
18704E7311R3180e9338j08502K215A1957M5016c5815o0782p8638A4548b54145
18692C04922A37737o916c30696B0715a45291H7610a00573d3928B16802p3350a6905
18680E9066A8147f9286a8611m0984j78804A9357f2076A42964a30452L7638L7022
18669e5792I7735a48078L6845K2428A06502d04934G0339N0544a19513r1597M9362
18658a61748B0999K00700c80765a81437j9278B41897I0281a27584j08264f415
18647a23934M9435E549b866m86969a1381j49278O7468I6786J32068k7076J63625
18636C65403a36502O0490j56203A17254B3664a12481j44969B24751A09651a60404
18625a02169n149A78603a33260k34701a62060J8724I7394a94600A63008o9737
$$ plain form
18615 93271 -137496 -329377 -40854 -23927 -155581 -18949 -190149 -194490 -37832 112929 -36952
18603 -1041 -102541 -43740 -12006 -97512 31477 32849 -204779 -82088 -17112 -9101 -303752 -111481
18590 -54460 -97697 -262117 -98602 -53469 -69388 -112589 -169616 -57363 -84896 -228231 -20921
18578 99346 94184 -263328 -232485 -31001 40967 -411064 -104858 -154168 421801 62102 13165
18566 165788 3400 -177682 -166086 -35284 122120 -1990 -158556 -60755 -266590 -18823 -122811
18555 -122811 159389 -13637 -317312 -112718 144569 37478 118158 -124390 31911 -106744
18544 -3352 262868 -194690 50214 -460715 29603 -143296 -94661 -158297 -21775 36115 -295
18532 67307 72521 14846 161221 -111142 72089 -141291 -23658 133088 63545 -83261 -59038
$$ packed form
18615I3271a37496j91881d0854J6927j31654a8949j71200m341c7832A12929c6952
18603a041j01500d3740a2006q5506C1477J372b04779h2088a7112Q011k94651a11481
18590e4460m3237j64420i8602M5133j5919m3201n7027e7363k7533j43335b0921
18578I9346n162b63328L0843c1001D0967d11064a04858m9310D21801F2102A3165
18566A65788C400a77682J1596c5284A22120a990j56566f0755k05835a8823j03988
18555a22811A59389a3637l03675a12718A44569C7478Q0680a24390C1911a06744
18544c352B62868a94690E0214d60715B9603a43296M8635o3636b1775C6115b95
18532F7307N214A4846J46375a11142G2089a41291b3658A33088F3545h3261K4223
$$ plain form
18521 -59038 -208199 20389 -232245 83296 -216116 -494395 225927 -186872 205400 70046
18510 -119482 73643 149754 -53538 -389788 -231864 -464818 -249113 140474 282920 -90684
18499 103084 -207656 -85965 -104602 -343843 -170652 52016 -97328 -307198 -62880 243569
18488 -16065 162449 38195 -115750 -364284 26382 -307261 -194539 225017 227868 -322347
18477 -188960 -78609 97848 -206794 -276229 237297 23925 -132064 152289 -135663 -75388
18467 -75388 -54474 -113503 112210 -93360 -4020 81955 -246616 73429 -401387 76663 -182246
18455 -115913 -173464 -437952 -350651 -5275 -85970 -28599 114126 -172417 287049 181896 -77539
18443 115267 -40585 12136 -63461 -86601 -91365 -130485 -65920 147915 139259 -11278 -186377
$$ packed form
18521e9038j49161B0389b32245H3296b16116k78279B25927a86872B05400G0046
18510a19482G3643P6111e3538l36250J57924k32954K15705A40474J42446i0684
18499A03084b07656h5965j8637k39241a70652E2016i7328k09870f2880B43569
18488a6065A62449C8195a15750k48534B6382c07261J12722B25017K851c22347
18477a88960g8609I7848b06794o9435B37297B3925a32064A52289a35663O0275
18467g5388K0914n9029A12210i3360d020H1955b46616G3429d01387G6663a82246
18455a15913n7551k64488Q7301e275q0695b8599A14126a72417B87049j05153g7539
18443A15267d0585A2136f3461k3140m764l9120O4565A47915q656a1278j75099
$$ plain form
18432 -186377 246576 -132988 -112052 34843 -99221 110659 272364 -247153 -106873 -23725
18421 157293 -406157 -57227 -148442 -104634 -27949 -29763 42159 -178857 -120029 165569 -89680
18409 -287937 202452 -45279 -60789 -142625 -78178 14512 218998 285673 29 -449381 123529
18397 -14341 -51390 -262521 -278892 -106872 -86924 -215839 256216 245195 -242600 63133 10691
18385 -105743 202316 -20871 -224119 -13725 -218084 -266486 66228 1394 -103491 -41460 -332250
18374 -332250 175573 -112603 -215691 4616 74110 -252339 -190700 70967 183356 50173 -359671
18362 191072 -394537 39879 12295 2088 -72962 -45389 -262178 -13951 -75386 -147056 -149948
18351 -149948 -66348 339223 72400 15719 -190140 -366389 125489 -254595 123567 309138
$$ packed form
18432a86377B46576a32988K0936C4843i9221A10659J61705b47153a06873b3725
18421A57293d06157e7227r1215M3808b7949j814D2159a78857N8828A65569h9680
18409b87937B02452d5279j5510q1836O4447A4512K04486O6675B9d49381A23529
18397a4341l7049k11131j6371a06872J9948j28915B56216j1021b42600F3133A0691
18385a05743B02316b0871k03248a3725k04359m8402F6228A394a03491d1460k90790
18374c32250A75573a12603j03088D616O9494b52339O1639G0967J12389E0173c59671
18362A91072c94537C9879A2295B088g2962K7573k16789a3951o1435p1670k892
18351a49948f6348C39223G2400A5719a90140j76249A25489b54595A23567J85571
$$ plain form
18341 309138 210362 -29890 239669 -165056 -55305 -78384 68513 -86098 -168175 -90375 107748
18329 49271 91148 -128052 -175820 -117979 143868 214007 120913 -414118 47816 -167693 -104733
18318 -104733 -118029 132620 29918 253154 44401 273769 -14083 133134 -147447 20468
18307 -235682 -339862 54751 -118098 117077 -9505 -211014 125704 -434257 62436 184657
18297 184657 -27621 -146129 115681 174079 70872 -296054 -719 26095 -22265 37266 16988
18285 -132031 18263 -264210 150060 24069 101394 -284908 -135833 59209 178656 33120
18274 -94755 59326 -155475 -62059 39233 32935 -151233 -72839 -113879 52486 -83212 129880
18262 143351 -102809 -124303 7971 63526 203957 207809 71179 82754 -313869 106912 -152566
$$ packed form
18341C09138r8776b9890B39669a65056e5305k3079F8513h6098q2077P7800A07748
18329D9271M1877a28052m7768N7841A43868P0139r3094d14118D7816a67693O2960
18318a04733j3296A32620B9918K23236D4401K29368a4083A33134a47447B0468
18307b35682j04180E4751a18098A17077i505k01509A25704d34257F2436J22221
18297A84657b7621j18508A15681N8398G0872b96054g19B6095b2265C7266A6988
18285a32031A8263b64210A50060B4069P7325b84908a35833E9209J19447C3120
18274i4755E9326a55475f2059C9233o298a51233g2839m1040E2486h3212A29880
18262A43351a02809k1494G971N5555J40431L852G1179J1575c13869A06912a52566
$$ plain form
18250 -190856 224897 -264915 -484141 39228 141052 303205 -67938 3242 22819 128949
18240 128949 -236668 -148317 -80395 -96005 149421 119194 -295171 -116435 -234305 22893
18229 -261749 62541 116235 -208563 122323 -82277 -343635 -116094 11516 -81658 217210
18218 -445668 12976 -8238 -84998 171050 -95308 -274401 280096 -521008 10303 41691 -125591
18206 -7284 -61871 -69505 -235322 43194 26249 120739 -274051 -156408 -200060 230350 -87193
18194 -158264 -313187 -349356 -232408 -87684 10733 -79544 21032 -263424 -139702 19429 -170671
18182 74814 63386 -103688 -161319 -71878 -89062 275605 26980 -142628 121922 39521 -173575
18170 38596 -53765 -330237 260424 -172901 221516 36554 189140 -129528 -224037 -130858
$$ packed form
18250a90856B24897b64915k19226C9228J01824J62153f7938C242J9577J06130
18240A28949b36668Q8351O7922j5610A49421l0227b95171a16435j17870B2893
18229b61749F2541N3694b08563A22323h2277k61358a16094A1516h1658B17210
18218d45668A2976h238p6760A71050i5308j79093B80096e21008A0303L1388a25591
18206g284n4587p634j65817D3194j6945R4490b74051J17643m3652B30350h7193
18194a58264j54923l6169J16948h7684A0733g9544B1032b63424J23722A9429a70671
18182G4814j1428a03688n7631g1878j7184B75605B6980a42628A21922C9521a73575
18170C8596e3765k76472B60424a72901B21516C6554J52586a29528r4509R3179
$$ plain form
18160 -130858 187724 -123228 -156464 148086 90508 69590 -111159 -260217 80619 96957
18150 96957 150099 -224159 121328 -160482 83599 -416357 26304 25836 -165654 126429 -166726
18138 6254 160965 -160157 216620 -4341 -75717 40096 26461 134673 196219 -3474 -177257
18127 -177257 130066 -13511 -93271 -116138 -38027 85041 -40231 77327 -183270 33166 -197531
18115 47605 -5286 -99937 22822 -198396 153729 -9324 257475 105385 299968 -92502 94891
18103 38612 385526 223525 -36089 -198004 -151776 -143549 -229243 31569 -204639 124818 -267545
18091 307616 -150622 560725 -131899 58746 -54604 -41195 -132330 110573 -338693 -182289
18081 -182289 70178 -277033 297174 -420509 107521 236509 127224 -107043 -243844 -254697
$$ packed form
18160a30858A87724a23228l3236A48086n7578k0918a11159j49058H0619J6338
18150I6957N3142b24159A21328a60482H3599d16357B6304m68a65654A26429a66726
18138F254J54711a60157B16620d341p1376D0096j3635J08212O1546c474j73783
18127a77257A30066a3511p9760k2867c8027H5041d0231G7327a83270C3166a97531
18115D7605e286r4651B2822a98396A53729i324B57475A05385J94583i2502I4891
18103C8612L46914j62001c6089j61915M6228Q227q5694C1569b04639A24818b67545
18091C07616a50622E60725a31899E8746e4604J3409r1135A10573c38693J56404
18081a82289G0178b77033B97174d20509A07521J28988j09285a07043j36801j0853
$$ plain form
18071 -254697 301555 19650 26609 -103757 -401034 -121842 -365893 -86061 96971 -55174 -8278
18059 -23696 212197 -39368 27444 116655 188356 280532 3888 -230876 -132455 -61526 116005
18047 79815 214078 -79971 -14925 191628 5867 -128623 -112763 45342 -75195 -18253 -84408
18036 -84408 414465 -263935 -139157 -78945 83441 46584 -24654 -86109 -85202 -85989 13829 36413
18024 36413 43474 23644 6387 -74064 -51206 -325947 -20444 59460 -48702 -261336 325824
18012 156509 227906 -107103 61706 8797 -151672 -701 232165 160613 107003 12126 38092
18001 38092 -142153 78984 -46021 -181300 -119377 -108530 -97846 -218882 195053 -242030 -82775
17989 -251505 -453456 -60392 33926 -227722 69510 -122237 -103158 76581 -90360 -152745 1294
$$ packed form
18071b54697C01555A9650O959a03757k97277a21842k44051h6061I6971e5174h278
18059b3696B12197c9368B7444Q9211P1701R2176C888b30876R8421f1526A16005
18047G9815J34263g9971a4925A91628E867a28623J5860D5342g5195a8253o6155
18036h4408D14465b63935J24778O0212H3441l6857b4654o1455R07p87A3829K2584
18024C6413P061j9830F387g4064K2858k74741b0444E9460d8702k12634C25824
18012A56509P1397a07103F1706H797a51672g01B32165p1552n3610A2126K5966
18001C8092a42153G8984d6021j35279O1923J0847J0684j21036A95053b42030h2775
17989b51505k01951f0392C3926b27722F9510a22237J9079G6581i0360o2385A294
$$ plain form
17977 112454 196549 -383612 -241905 -24167 89044 -13818 -42935 49874 -172093 -266867 350351
17965 64946 -103530 -188850 -78952 -275756 -154616 110177 222905 -131502 -365435 -229742
17955 -229742 -17060 -207543 -171243 -121600 -32343 55637 -203122 -244252 -199461 213349 20316
17943 -107497 268322 58536 -149489 -280505 -169227 365862 34366 256719 -124565 24440
17932 99197 118178 75409 74422 67474 411786 171108 -25495 61909 274700 -113970 -64845
17921 -64845 8076 206565 -57971 63481 -140843 -70157 -295512 -6179 132984 168989 141738
17910 141738 -10412 124248 296331 296845 -154987 -65985 39012 205411 -127752 -27225 -62506
17899 -62506 -32116 12005 430645 -186368 -244908 19156 92177 -37266 -65511 -117747 103033
$$ packed form
17977A12454Q4095c83612J41707b4167H9044a3818k9117D9874a72093r4774C50351
17965F4946a03530q5320g8952j96804J21140A10177J12728a31502k33933J35693
17955b29742a7060j90483L6300M9643c2343E5637b03122m1130M4791B13349B0316
17943a07497B68322E8536a49489j31016J11278C65862C4366K22353a24565B4440
17932I9197J8981m2769r87o948L44312A71108b5495F1909K12791a13970M9125
17921f4845H076J98489e7971F3481a40843g0157k25355f179A32984L6005k7251
17910A41738a0412A24248J72083N14a54987f5985C9012J66399a27752b7225l5281
17899f2506L0390A2005M18640a86368n8540A9156P3021c7266k8245n2236A03033
$$ plain form
17887 -83586 12372 -104700 -21316 -180290 -135569 -219954 -47576 -192204 29338 162138 -273724
17875 -94577 9187 -173740 -38678 -186542 206211 -152446 19539 73417 -55318 -114899 71548
17863 -120100 -114556 245884 -193093 -80292 -229499 -167346 96268 -622008 -166678 173574
17852 66147 -121915 12185 12131 -12266 -247185 111373 236422 134406 -43301 -62647 -227426
17841 -227426 12132 74541 -44709 97075 -399530 -105290 108822 -65414 75867 5237 -194720
17829 -282779 -114998 118873 -18642 -760 100032 25460 -54128 -214617 -106352 108175 24085
17817 102066 -14250 40651 56266 -170734 -87811 -10841 -123436 113184 -217412 -46332 -149014
17806 -149014 -266522 267629 -171480 44824 -9712 54727 65487 60014 -34706 -112866 -121712
$$ packed form
17887h3586A2372a04700b1316j58974M4721q4385d7576j44628B9338J32800b73724
17875i4577I187a73740c8678j47864B06211a52446A9539N3878e5318n9581G1548
17863a20100N544B45884a93093h0292j49207O2153I6268f22008a66678A73574
17852F6147a21915A2185n4a2266k34919A11373J25049j02016d3301j9346j64779
17841b27426A2132O2409d4709I7075c99530a05290A08822f5414G5867E237a94720
17829b82779a14998A18873a8642g60A00032B5460e4128j60489a06352A08175B4085
17817A02066a4250D0651J5615a70734Q2923a0841j12595A13184b17412d6332j02682
17806a49014j17508B67629a71480D4824i712E4727J0760n473c4706p8160q846
$$ plain form
17795 -121712 -247045 197757 -37866 -273870 168868 125845 -59802 -176906 283349 -76111
17784 -80037 125048 -41872 68541 261549 98726 -37882 -52562 -391553 -6702 -253475 5395
17772 -213314 -2801 -46189 -123098 -107491 -160602 -95157 66056 157481 67219 -94341 290387
17760 77795 -82949 283471 -96380 127732 -102538 -127901 -178698 -22096 103870 159629 239547
17749 239547 -8068 153180 325695 -157524 94093 87381 58920 -92790 246696 51358 -15092
17737 -343047 27262 -103514 29509 189977 226430 -190997 191942 -234035 -280672 296157
17726 -197933 233166 105050 290050 172315 -195852 -49626 -38351 -20626 174972 81186
17715 125157 -79030 150822 -173423 -150508 -75848 -137329 53086 -150911 -189368 -172058 76833
$$ packed form
17795a21712j25333A97757c7866k36004A68868m3023e9802j17104B83349g6111
17784h0037A25048d1872F8541J93008I8726c7882j4680l38991f702k46773E395
17772b13314b801m3388p6909J5607n3111O5445F6056R1425F7219i4341B90387
17760G7795h2949B83471i6380A27732a02538k5363n0797b2096A03870N5759P9918
17749B39547h068A53180J72515a57524I4093o712k8461i2790B46696E1358a5092
17737c43047B7262a03514B9509J60468L6453a90997A91942b34035m6637B96157
17726a97933B33166A05050J85000j17735a95852d9626J1275J7725A74972H1186
17715A25157g9030A50822a73423K2915P4660o1481E3086a50911l8457J7310G6833
$$ plain form
17703 81353 79854 -21551 30587 -120634 -78615 152312 281125 142281 -326153 -241192 44603
17691 -96570 305626 78739 198638 88406 -29492 268247 18901 -25639 -36998 278670 181367
17680 181367 198843 -139365 -127041 83337 263509 185566 256781 66938 393433 51714 -48689
17668 117522 155155 -341982 -108631 44436 59716 -54504 133668 451715 -63139 276864
17657 60827 -77171 201275 -148454 332432 -97816 -149494 299102 56775 -43602 -39889 -186861
17646 -186861 10821 206196 -107860 14449 -101040 269596 -125407 359743 99947 143798
17636 143798 -420350 -104149 7886 -156984 193572 -63056 266990 56292 51505 -93506 -67319
17625 -67319 5090 -160679 111136 -37586 -142661 31003 -13946 219866 222650 -119823 -210501
$$ packed form
17703H1353j499b1551C0587a20634M2019A52312J28813j38844c26153Q4961D4603
17691i6570C05626G8739J19899H8406b9492B68247A8901b5639j1359B78670r7303
17680A81367J7476a39365J2324H3337J80172p7943P1215F6938L26495E1714d8689
17668A17522L7633c41982a08631D4436J5280e4504A33668L18047f3139B76864
17657F0827g7171B01275a48454C32432i7816n1678B99102E6775d3602L713j46972
17646a86861A0821J95375a07860A4449a01040B69596a25407C59743I9947M3851
17636A43798d20350a04149G886a56984A93572f3056B66990E6292m787i3506K6187
17625f7319E090a60679A11136c7586j05075C1003a3946B19866K784a19823r0678
$$ plain form
17614 -210501 7232 102390 41880 45821 150800 -212949 -57801 -83977 -83773 -37994 261090 -281642
17601 103470 25126 -130248 -178995 -22655 -145949 217746 59731 258137 -14662 155657
17590 10281 86440 -131846 267842 -57301 -79757 69113 250229 -491101 -187445 -116765 21265
17578 -18533 141516 56495 315781 145135 -262093 41888 195022 49990 -236466 244358
17567 167792 165340 -124430 -137484 43616 -174831 205079 141172 99285 -105790 306470 13535
17555 -153357 185100 139883 -172045 146639 -314897 -49824 -116996 210180 -210484 -33308
17544 -99247 161372 27337 212784 408356 -25997 241992 -49536 -36469 -202045 252470
17533 62737 -172399 106361 -209567 184107 409093 -216231 -391598 88199 54017 192468
$$ packed form
17614b10501G232R5158D1880L941J04979b12949e7801k6176K04c7994B61090b81642
17601A03470B5126a30248m8747b2655j23294B17746E9731J98406a4662A55657
17590A0281P6159a31846B67842e7301k2456F9113J81116d91101a87445P0680B1265
17578a8533A41516E6495K59286A45135b62093D1888J53134D9990b36466B44358
17567A67792k452a24430j3054D3616a74831B05079o3907m1887a05790C06470A3535
17555a53357A85100m5217a72045A46639c14897d9824o7172B10180b10484c3308
17544i9247A61372B7337J85447J95572b5997B41992d9536J3067j65576B52470
17533F2737a72399A06361b09567A84107K24986b16231j75367H8199l4182J38451
$$ plain form
17523 192468 -91273 20545 -61183 -81052 376494 143641 189875 146610 -96972 -25146 183482
17511 -141507 291167 5920 98325 16952 20000 320219 -148058 100990 -13515 163347 477115
17500 477115 284964 129014 -906 263605 29756 26618 -15182 219483 940 123003 285159
17489 285159 -47148 564343 28333 165060 87838 108626 -12508 265520 196494 53310 112689
17478 112689 154859 72185 209537 64779 -27275 206386 145737 -186156 -67210 417566 -127509
17466 -46090 248928 3467 121777 177879 92575 -221362 16197 353117 275355 -5201 -166029
17455 -166029 89007 69068 -156475 3959 345793 203300 357441 431089 234474 127456
17445 127456 57977 314626 198560 3441 277436 322156 186262 223983 -119581 197330
$$ packed form
17523A92468i1273B0545f1183j9869C76494A43641M6234m3265i6972b5146A83482
17511a41507B91167E920R2405A6952L048L00219a48058A00990a3515A63347L13768
17500D77115j92151A29014i06B63605B9756l138a5182B19483I40J22063J62156
17489B85159d7148E64343B8333J36727p7222K0788a2508B65520o9026E3310N9379
17478A12689M2170G2185J37352F4779b7275B06386o0649a86156f7210D17566a27509
17466d6090B48928C467J18310N6102q5304b21362A6197L36920p7762e201j60828
17455a66029H9007j9939a56475C959L41834j42493J54141P3648j96615j07018
17445A27456E7977K56649j16066C441K73995M4720j35894L7721a19581A97330
$$ plain form
17434 -20429 152208 56916 190936 -38872 444446 32241 265875 236339 264252 412585 417363
17423 417363 259039 364629 -60961 88699 408236 361370 139980 354008 344122 206778
17413 206778 123592 70267 5601 200209 387307 -120532 217846 189154 123327 170798 151220
17402 151220 212704 119217 205610 450706 -82018 55085 172297 12831 175044 326092 628
17390 101463 34038 114621 -90072 201851 45561 251489 -316635 86664 -189364 320859
17379 131489 -183170 152536 -149686 96546 -137420 534324 211627 134873 248938 -129153
17368 314885 212831 94907 213849 228393 -40530 73421 352115 158241 -70153 -132802 243395
17356 410337 159434 95846 70702 188227 218093 210034 19440 43439 218281 60449 249501
$$ packed form
17434b0429A52208E6916J34020c8872D44446C2241K33634k9536K7913J48333M778
17423D17363j58324J05590f0961H8699L19537m6866A39980K14028r886j37344
17413B06778q3186n3325E601J94608J87098a20532B17846k8692o5827M7471j9578
17402A51220O1484r3487Q6393K45096h2018E5085J17212A2831J62213J51048F28
17390A01463C4038Q0583i0072B01851D5561K05928c16635H6664a89364C20859
17379A31489a83170A52536a49686I6546a37420E34324B11627p6754J14065a29153
17368C14885j02054I4907J18942J4544d0530G3421K78694A58241g0153o2649B43395
17356D10337A59434o3588k5144J17525K9866q059A9440K3999J74842F0449J89052
$$ plain form
17345 249501 -3971 -312661 208858 -69860 194233 347186 160340 314116 44862 198403
17335 198403 230805 -4591 145606 53045 284680 140254 184529 194456 -33911 58110 288512
17324 288512 -8835 151928 186956 313672 104467 271685 259794 136391 -108633 -70707
17314 -70707 80966 95680 15763 207540 -184597 166967 199712 178812 238565 167421 223182
17303 223182 35818 -50222 153517 189348 399585 381991 224787 -1266 88404 187 58070
17292 58070 142170 77352 3805 143514 257878 226845 434730 -5397 -47822 441627 22984
17280 -302731 -125290 572425 188875 163513 269500 312370 102914 132261 -24186 397620
17269 182495 209700 333430 612846 354838 6760 42147 105083 203629 504602 -11917 -7377
$$ packed form
17345B49501c971l08690B08858f9860A94233J52953A60340J53776D4862J53541
17335A98403L2402d591A45606E3045K31635A40254M4275R927c3911E8110K30402
17324B88512h835A51928L5028J26716A04467J67218j1891j23403a08633L7926
17314g0707H0966J4714A5763J91777a84597A66967L2745k0900N9753p1144N5761
17303B23182C5818e0222A53517L5831K10237j7594j57204a266H8404A87N7883
17292E8070Q4100o4818C805J39709J14364l1033K07885e397m2425D41627B2984
17280c02731a25290E72425A88875k5362J05987M2870A02914K9347b4186C97620
17269A82495K7205J23730K79416k58008F760L5387O2936R8546L00973a1917M540
$$ plain form
17258 -7377 128033 139842 -59910 412028 63120 198601 5193 182784 121446 -139634 96666
17246 -127664 9548 304714 276641 -97086 194750 230653 117215 395798 356755 215368 397579
17235 397579 254899 80423 -142196 367479 66674 320112 176564 135413 86357 -56852
17224 309927 356800 187170 90891 33507 478012 197526 201425 207757 288046 305162 40703
17212 249669 100145 69263 464054 291840 383083 94152 261331 50779 466806 374884
17202 374884 151882 189172 -140912 -51772 458471 94228 252458 -374255 185719 102112
17192 102112 -74527 162544 359714 255934 340944 374368 341189 235287 -123639 354628
17181 277989 476651 258264 64916 308745 80771 -148716 111737 176623 46059 245895
$$ packed form
17258g377A28033J1809e9910D12028F3120J35481E193J77591o1338a39634I6666
17246a27664I548K95166k8073i7086A94750L5903j13438K78583l9043j41387J82211
17235C97579j42680H0423a42196C67479F6674K53438j43548m1151m9056e6852
17224C09927M6873j69630I0891C3507M44505A97526L899O332Q0289J7116D0703
17212B49669A00145l0882L94791j72214R1243I4152J67179E0779M16027r1922
17202C74884A51882L7290a40912e1772D58471I4228J58230c74255A85719q3607
17192A02112g4527A62544J97170j03780Q5010L3424l3179j05902a23639C54628
17181B77989J98662k18387F4916K43829H0771a48716A11737O4886D6059J99836
$$ plain form
17171 245895 212991 345431 226373 405499 185906 175277 182087 266095 625859 524807
17161 524807 105376 150482 300408 413915 137956 297070 -10503 335954 -38177 399915
17150 661759 349235 537209 7374 28764 435706 141960 24513 135516 483807 370015
17140 370015 396844 272471 86840 712800 217537 716474 46982 295924 325563 460227
17130 460227 65648 159250 255619 327452 273213 317780 325029 442164 362466 243735 -190624
17118 469653 409736 214817 507644 359855 635094 418288 118193 310070 215850 265500
17108 265500 54856 301773 203596 572130 128936 286524 233611 157756 233503 272793 179849
17097 179849 335343 303964 379315 46056 397071 286141 415548 589961 390338 563366
$$ packed form
17171B45895l2904J32440j19058J79126A85906j0629O810Q4008L59764j01052
17161E24807A05376M5106J49926J13507A37956J59114a0503C35954c8177C99915
17150F61759l12524J87974G374K1390M06942A41960B4513J11003L48291j13792
17140C70015K6829j24373H6840O25960B17537M98937D6982K48942K9639J34664
17130D60227F5648R3602R6369P1833n4239M4567P249J17135p9698j18731a90624
17118D69653n9917j94919K92827j47789K75239k16806A18193J91877r4220M9650
17108B65500E4856K46917r8177L68534A28936J57588n2913p5855P5747L9290r2944
17097A79849J55494l1379P5351D6056L51015j10930J29407J74413j99623J73028
$$ plain form
17087 563366 45756 177637 440663 313295 518866 482193 347987 625977 191604 445683
17077 445683 363420 471517 541548 382007 168929 805686 31924 188600 317214 609980
17067 609980 521395 406597 152149 712964 531886 161459 429638 182563 335624 394303
17057 394303 425954 335367 275987 503215 298272 448587 723467 623709 604877 475051
17047 475051 450283 505687 466460 430665 582971 218437 785589 762798 680193 787788 468857
17036 468857 607897 664791 370116 352084 618018 398086 731244 576365 738873 686553
17026 686553 623267 587949 833219 950606 568245 904410 873061 366778 677267 886570
17016 886570 843368 809595 734688 554333 399137 773018 450719 484601 429104 885632
$$ packed form
17087E63366D5756J31881K63026j27368K05571l6673j34206K77990A91604K54079
17077D45683q2263J08097P0031j59541A68929O36757C1924J56676J28614K92766
17067F09980q8585j14798A52149N60815j81078A61459K68179A82563J53061N8679
17057C94303L1651r0587n9380K27228k04943J50315K74880r9758j8832j29826
17047D75051k4768N5404l9227l5795J52306B18437N67152k2791q2605J07595l18931
17036D68857J39040N6894k94675j8032K65934k19932L33158j54879J62508n2320
17026F86553o3286l5318K45270J17387l82361L36165l1349C66778L10489K09303
17016H86570m3202l3773p4907j80355j55196L73881l22299L3882n5497M56528
$$ plain form
17006 885632 271234 794950 798663 817783 725208 611638 701590 824620 709140 899402
16996 899402 938708 640196 740969 650799 1115832 575655 779372 723941 899190 805206
16986 805206 271633 790377 810713 682952 619848 697230 827494 737816 801683 686535
16976 686535 813103 1110734 448709 719848 528249 588638 719750 768342 802750 805133
16966 805133 1186886 937126 1154838 947801 1137102 840598 674722 812944 826954 889837
16956 889837 679227 1211700 1103264 1071304 797997 926953 1042013 1155182 1137480 1123889
16946 1123889 1158548 938878 1150751 1384260 1151550 793400 1000696 1398691 956219 1156011
16936 1156011 800184 1279250 1219566 1145455 1078483 1430012 1141519 1182616 1374216 1051633
$$ packed form
17006H85632B71234N23716L713J9120r2575j13570Q9952J23030j15480J90262
16996H99402L9306k98512J00773r0170M65033n40177K03717n5431J75249r3984
16986H05206B71633N18744K0336j27761o3104P7382J30264q9678O3867j15148
16976F86535J26568K97631D48709K71139j91599O0389J31112M8592L4408K383
16966H05133L81753k49760K17712k07037J89301k96504j65876J38222J4010O2883
16956H89837k10610N32473j08436l1960k73307J28956J15060J13169j7702j3591
16946A123889L4659k19670K11873K33509k32710l58150K07296L97995m42472J99792
16936A156011l55827M79066n9684p4111o6972L51529k88493M1097J91600l22583
$$ plain form
16926 1051633 1145382 1422879 1493151 1584597 1422214 1120730 1566201 1550402 1398135 1143335
16916 1143335 1418738 1500746 1399408 1276870 1718699 1269950 1571156 1766617 1615852 1684327
16906 1684327 1744459 1806307 1511333 1615226 1994226 1202310 1585051 1823638 1887666 2005016
16896 2005016 1811787 1620237 1649844 1886169 1612649 1751501 2016784 2171622 1488776 2211472
16886 2211472 1959663 2172552 2156553 1787084 2244382 2130283 2295835 2260581 1781517 2599911
16876 2599911 2086882 2248943 2113848 2154661 2252874 2611506 2587623 2356678 2603282 2348635
16866 2348635 2316859 2427337 2747672 2592504 2609108 2762876 2366274 2484346 2591132 2842404
16856 2842404 2666513 2903186 3009133 2720753 3258152 3399629 3233592 3257607 3308331 3434450
$$ packed form
16926A051633R3749K77497P0272R1446j62383l01484M45471j5799j52267k54800
16916A143335K75403Q2008j01338j22538M41829m48749L01206J95461j50765O8475
16906A684327O0132O1848k94974J03893L79000p91916L82741K38587O4028J17350
16896B005016j93229j91550K9607K36325k73520J38852K65283J54838o82846P22696
16886B211472k51809K12889j5999l69469M57298j14099J65552l5254m79064Q18394
16876B599911n13029J62061j35095M0813R8213L58632k3883k30945K46604k54647
16866B348635l1776J10478L20335j55168J6604J53768l96602J18072J06786K51272
16856B842404j75891K36673J05947k88380N37399J41477j66037K4015N0724J26119
$$ plain form
16846 3434450 3419517 3090335 3596374 3472946 3331365 3350404 3564743 3394803 3547247 3886338
16836 3886338 3842179 3826958 3880751 3866980 4198915 4413169 4389090 4248765 4656871 4421215
16826 4421215 4663175 4924660 4511865 4765187 4845223 5140415 5341343 5198218 5506076 5594382
16816 5594382 5564009 5578037 5576373 5929470 5867300 6087771 6291546 6460612 6602160 6696546
16806 6696546 6821675 6795106 6784211 6829903 7398736 7408903 7930300 8113931 8096412 8521202
16796 8521202 8578699 8776511 9182810 8709915 9365927 9517917 9888246 9900550 10092986 10240152
16786 10240152 10910003 11132122 11447449 11552405 12167045 12391590 12425522 13067412 13370133
16777 13370133 13987698 14362502 14974804 15154199 15817631 16204601 16779552 17250604 17978501
$$ packed form
16846C434450j4933l29182N06039j23428j41581J9039K14339j69940J52444L39091
16836C886338m4159j5221N3793j3771L31935K14254k4079j40325M08106k35656
16826D421215K41960K61485m12795K53322Q0036K95192K00928j43125L07858Q8306
16816E594382l0373J4028j664L53097o2170K20471K03775J69066J41548R4386
16806F696546J25129k6569j0895M5692N68833J0167N21397J83631j7519M24790
16796H521202N7497J97812M06299m72895O56012J51990L70329J2304J92436J47166
16786A0240152O69851K22119L15327J04956O14640K24545L3932O41890L02721
16777A3370133O17565L74804O12302J79395O63432L86970N74951M71052P27897
$$ plain form
16768 17978501 18523957 19427469 19875759 20459826 21378922 21743732 22839503 23733111 24595788
16759 24595788 25790075 26434270 27676849 28785696 30288128 31080894 32856062 33971458
16751 33971458 35590068 37034848 38896168 40825284 42806582 44883285 47257511 49664980
16743 49664980 52357753 54738016 57963771 60838187 64786311 68353709 72244459 76187301
16735 76187301 80726891 85130560 90502508 95691221 100985611 107247154 113224421 119810230
16727 119810230 126751337 133370227 140496565 147429342 154323322 160851433 167137678 172902796
16719 172902796 178039058 182102102 185346440 187722254 188715910 188566470 187352691 184801477
16711 184801477 181270547 176209801 170917179 164914837 158326792 151790061 144727209 137841465
$$ packed form
16768A7978501N45456R03512M48290N84067R19096L64810J095771Q93608Q62677
16759B4595788J194287O44195J242579J108847J502432P92766J775168J115396
16751C3971458J618610J444780J861320J929116J981298K076703K374226K407469
16743D9664980K692773K380263L225755K874416L948124L567398L890750L942842
16735G6187301M539590M403669N371948N188713N294390O261543N977267O585809
16727A19810230O941107O618890P126338O932777O893980O528111O286245N765118
16719A72902796N136262M063044L244338K375814R93656j49440j213779k551214
16711A84801477l530930n060746n292622o002342o588045o536731p062852o885744
$$ plain form
16703 137841465 130418439 123428380 116688824 110112256 103899948 98083644 92651903 87367188
16695 87367188 82286988 77972267 73645730 69344501 65213887 62027773 58527021 55425877
16687 55425877 52685914 50020416 47379428 44939818 42800541 40976760 38934849 37107478
16679 37107478 35135318 34139182 32282554 30585325 29507133 28124846 27283737 25908863
16671 25908863 24836678 23841844 23012530 21980502 21206753 20215984 19921803 19162119 18311622
16662 18311622 17555032 17023623 16522085 16002881 15056050 14799234 14447752 14047588 13484825
16653 13484825 13280981 12774839 12230103 11789638 11680133 11376480 10775683 10325042 10338009
16644 10338009 9962143 9593895 9616537 9431627 9281006 8888213 8650241 8205500 8043593
$$ packed form
16703A37841465p423026o990059o739556o576568o212308n816304n431741n284715
16695H7367188n080200m314721m326537m301229m130614l186114l500752l101144
16687E5425877k739963k665498k640988k439610k139277j823781k041911j827371
16679C7107478j972160r96136j856628j697229j078192j382287q41109j374874
16671B5908863j072185r94834q29314j032028p73749r90769k94181p59684q50497
16662A8311622p56590n31409n01538n19204r46831k56816l51482m00164n62763
16653A3484825k03844n06142n44736m40465j09505l03653o00797m50641J2967
16644A0338009l75866l68248K2642j84910j50621l92793k37972m44741j61907
$$ plain form
16635 8043593 8018818 7772275 7614091 7612030 7143910 7193202 7004861 6598403 6444518 6326593
16625 6326593 6449521 6104002 5981340 6092395 5819958 5860852 5426216 5310393 5168617 5064621
16615 5064621 5163378 4931381 4766062 4534534 4916909 4749211 4380775 4499696 4517295 4270160
16605 4270160 4245115 4098327 3642040 3992597 3990831 3792100 3556588 3990210 3763392 3486318
16595 3486318 3484227 3289780 3392416 3133833 3415766 2987329 3421693 2944541 2915167 2967774
16585 2967774 3062393 2900417 2933319 2823592 2830403 2891350 2909531 2993896 2329021 2360251 2340900
16574 2340900 2382262 2357049 2684494 2393054 2378494 2497383 2307270 2017867 2208231 1879639
16564 1879639 2166110 2105189 2016555 2122974 2382543 1925724 2407789 1820604 2061989 1685643
$$ packed form
16635H043593k4775k46543j58184k061m68120M9292j88341m06458j53885j17925
16625F326593J22928l45519j22662J11055k72437M0894m34636j15823j41776j03996
16615E064621R8757k31997j65319k31528L82375j67698l68436J18921J7599k47135
16605D270160k5045j46788m56287L50557j766j98731k35512M33622k26818k77074
16595C486318k091j94447J02636k58583K81933m28437M34364m77152k9374N2607
16585B967774R4619j61976L2902j09727O811O0947J8181Q4365o64875L1230j9351
16574B340900M1362k5213L27445k91440j4560J18889j90113k89403J90364l28592
16564A879639K86471o0921q8634J06419K59569m56819M82065n87185K41385l76346
$$ plain form
16554 1685643 1792209 2107988 1811919 1364934 1802499 1960446 1875640 1855616 1791770 1560181
16544 1560181 1843420 1613120 1812459 1282746 1258403 1660004 1721106 1372126 1660696 1349109
16534 1349109 1121940 1548727 1574513 1511866 1391181 1501018 1559658 1569698 1464079 1473185
16524 1473185 1069766 1421332 1434161 1058529 1653056 1328729 1195504 1379149 836485 1168150
16514 1168150 985330 1106026 1206737 1161815 1021690 866332 1232024 897530 1009461 1134849
16504 1134849 782684 868460 997417 1037160 950712 902629 663970 801607 1166957 1108298
16494 1108298 981156 1174772 973088 1004619 1324280 766503 1020601 659907 752751 905013
16484 905013 992272 853756 892882 755554 732616 840525 799858 425313 993010 773730
$$ packed form
16554A685643J06566L15779k96069m46985M37565J57947q4806k0024o3846k31589
16544A560181K83239k30300J99339n29713k4343M01601O1102l48980K88570l11587
16534A349109k27169M26787K5786o2647j20685J09837N8640J0040j05619R106
16524A473185m03419L51566J2829l75632N94527l24327j33225J83645n42664L31665
16514A168150j82820J20696J00711m4922j40125j55358L65692l34494J11931J25388
16504A134849l52165Q5776J28957L9743q6448m8083k38659J37637L65350n8659
16494A108298j27142J93616k01684L1531L19661n57777K54098l60694R2844J52262
16484I05013Q7259j38516L9126j37328k2938J07909m0667l74545N67697k19280
$$ plain form
16474 773730 576997 953851 568688 627043 737902 900353 491871 897813 628594 599721
16464 599721 799435 950822 914313 690449 561336 637685 834979 562823 690960 564266
16454 564266 484609 764534 434482 518390 509355 700233 622028 472858 663372 517560
16444 517560 693946 681113 645060 359745 498482 539877 874099 688907 741298 538834
16434 538834 437156 231677 600259 562566 703234 623816 405167 736906 342765 296753
16424 296753 866405 562333 283614 737946 421092 575708 242710 597573 713825 355304
16413 585570 432719 441450 618862 493646 679689 632490 421240 357636 744930 467519
16403 467519 669620 145446 5024 476969 473791 354376 149507 543826 473170 521409 547677
$$ packed form
16474G73730j96733L76854l85163N8355J10859J62451m08482M05942k69219k8873
16464E99721J99714J51387l6509k23864j29113P6349J97294k72156J28137j26694
16454E64266p9657K79925l30052Q3908r035J90878p8205j49170J90514j45812
16444E17560J76386j2833l6053k85315J38737M1395L34222j85192N2391k02464
16434E38834j01678k05479L68582l7693J40668p9418k18649L31739C42765m6012
16424B96753N69652l04072k78719M54332l16854J54616B42710L54863J16252C55304
16413E85570j52851Q731J77412j25216J86043m7199k11250o3604L87294k77411
16403D67519K02101A45446E024M71945l178j19415A49507L94319p0656M8239K6268
$$ plain form
16392 547677 265601 313052 135878 424790 355668 335085 444420 386826 581414 637223
16382 637223 393610 230128 369284 330334 398221 94920 408767 451398 282636 669116
16372 669116 123159 299499 398002 179709 220442 112994 73349 362318 591403 369305
16362 369305 384686 439550 340875 137367 473801 1487 303593 391142 121633 460022 490308
16351 490308 207685 75893 399032 176186 406960 529122 296571 295288 88320 396951
16341 396951 333005 256415 57470 123205 228416 220576 48514 445456 -94075 347548 228781
16330 228781 343287 118827 217271 328780 219024 102732 249866 137951 296394 266587
16320 266587 11746 546380 485459 -105569 55338 117226 218956 499713 365104 464712
$$ packed form
16392E47677B65601M7451A35878K88912o9122k0583J09335n7594J94588N5809
16382F37223k43613j63482J39156l8950O7887I4920L13847M2631j68762L86480
16372F69116A23159J76340R8503A79709M0733j07448l9645K88969K29085k22098
16362C69305J5381N4864r8675A37367L36434A487L02106Q7549A21633L38389L0286
16351D90308B07685G5893L23139A76186K30774J22162k32551j283H8320L08631
16341C96951o3946p6590E7470O5735J05211p840D8514L96942i4075C47548j18767
16330B28781J14506A18827R8444J11509j09756A02732J47134j11915J58443k9807
16320B66587A1746N34634o0921a05569E5338O1888J01730K80757j34609R9608
$$ plain form
16310 464712 121388 71985 344470 523467 280897 58569 210763 543596 255432 61625
16299 208394 502335 124278 131996 493014 -79962 45461 -42949 443620 -263630 102927
16288 59754 -15966 76653 73564 184522 288527 25945 277841 393299 37411 131999 272448
16277 272448 289747 366384 204924 -24985 253210 -147435 6846 -71591 66260 -90894 309893
16265 124326 -22049 336008 52104 5721 134287 232322 80137 234593 78484 562665 133271
16253 192760 422193 132745 294374 452956 481899 304294 -78999 125576 80296 89241
16243 89241 122563 -36127 46279 246500 19254 -45373 147309 -57780 -21670 267170 -85262
16231 288620 151676 122082 -26194 11878 55962 208664 -81187 -161098 383134 45537 276444
$$ packed form
16310D64712A21388m9403K72485J78997k42570E8569J52194L32833B55432F1625
16299B08394K93941A24278P718L61018g9962D5461d2949D43620b63630A02927
16288E9754a5966G6653l089J10958J04005B5945K51896J15458C7411R4588J40449
16277B72448J7299P6637j61460b4985B53210a47435F846g1591F6260i0894C09893
16265A24326b2049C36008E2104E721J28566R8035H0137J54456G8484M84181A33271
16253A92760K29433A32745J61629J58582K8943j77605g8999A25576m5280Q945
16243H9241L3322c6127D6279K00221A9254d5373A47309e7780b1670B67170h5262
16231B88620j36944k9594b6194A1878M4084J52702h1187p9911C83134D5537K30907
$$ plain form
16220 276444 55003 -52980 283502 -51824 73386 27970 36508 62634 424142 -176713 -118220
16209 -118220 -83949 210755 53581 93021 136327 -12973 -138714 -110183 118394 293053 197601
16198 197601 40026 129756 353709 305075 -1238 -124977 153752 257732 58201 -144160 34444
16186 41676 227997 161595 97433 121088 110706 229257 -9221 -32382 -9434 123471 -19305
16174 18806 -147392 -169803 146881 -149592 166593 -88154 78172 74167 181806 -54956 -198624
16163 -198624 220121 -107675 1279 146703 -257150 279617 41850 110443 -122022 38094
16152 275156 -83303 -209619 12955 -77644 173792 196936 44216 -141878 -99744 -84409 -42526
16141 -42526 63998 55309 -63502 208466 -176468 90900 16328 11732 414423 -21655 -150148
$$ packed form
16220B76444E5003e2980B83502e1824G3386B7970Q538K6126L61508a76713N8493
16209a18220L4271B10755E3581L9440M3306a2973j25741K8531A18394J74659r5452
16198A97601D0026Q9730K23953m8634a238j23739A53752J03980E8201a44160C4444
16186D1676J86321o6402o4162K3655j0382J18551i221k3161i434A23471a9305
16174A8806a47392k2411A46881a49592A66593h8154G8172m005J07639e4956j43668
16163a98624B20121a07675A279J45424b57150B79617D1850O8593a22022C8094
16152B75156h3303j26316A2955g7644A73792K3144D4216a41878M2134J5335M1883
16141d2526F3998q689f3502B08466a76468I0900A6328m596M02691b1655j28493
$$ plain form
16130 -150148 -78841 -19426 104890 214356 -26564 -126044 307221 421575 -4994 -137543 258452
16118 -62489 161963 -60196 295952 48342 177523 -101762 -82064 164795 267104 41946
16107 75584 48631 142572 158405 202 -101093 176386 434155 -192568 -71233 8797 94474
16096 94474 344765 271027 -107627 304281 -222500 -123188 -80124 -192722 -214139 117377
16085 240449 -195826 62355 -123792 15371 243946 59177 -135112 108415 133597 196019
16075 196019 116622 346928 -13128 -27160 82297 157019 100358 -61752 16534 -166868 158040
16063 -208313 88860 126944 191340 176371 37039 -180085 -10343 362322 303015 146420 234421
16052 234421 25910 -26793 -243841 338706 -164633 -202791 -52942 -170220 -70639 298269
$$ packed form
16130a50148P1307a9426A04890J09466b6564r9480C07221J14354d994j32549B58452
16118f2489A61963f0196B95952D8342J29181a01762J9698A64795J02309D1946
16107G5584k6953R3941J5833B02a01093A76386K57769a92568g1233H797Q5677
16096I4474K50291p3738a07627C04281b22500R9312M3064j12598k1417A17377
16085B40449a95826F2355a23792A5371K28575E9177a35112A08415K5182O2422
16075A96019p9397K30306a3128j4032H2297P4722n6661f1752A6534a66868A58040
16063b08313H8860L8084O4396j4969C7039a80085a0343C62322n9307A46420Q8001
16052B34421B5910b6793k17048C38706a64633l8158e2942j17278g0639B98269
$$ plain form
16041 219182 -207197 -39227 -114725 99738 -230857 -300953 243241 -126659 -275557 -118118
16030 38649 122130 -24598 25915 112651 -136775 92821 -213441 -219473 238201 343765 78748
16018 -342158 41050 56529 22616 82655 -283534 72741 -95255 132659 85596 -308126 -98076
16006 34222 62782 25642 163618 -74613 -210927 241491 -10009 -90243 131044 250859 -178315
15994 85051 -282044 -72789 -90147 -274195 -174304 90157 186704 -136441 5385 40205 316500
15983 316500 88052 615996 119618 160865 41589 114169 -96449 -174694 -147600 96440 33937
15971 -225357 -173266 26018 -187473 -126766 2760 31916 115751 106882 -58845 57798 -21821 252107
15958 170520 121336 -254320 -405010 98172 141889 76597 -165223 -148192 -232744 61507 -99682
$$ packed form
16041B19182b07197c9227p5498I9738b30857p0096B43241a26659j48898a18118
16030C8649Q3481b4598B5915Q6736a36775I2821b13441o032B38201J05564G8748
16018c42158D1050J5479B2616O0039b83534G2741i5255A32659m7063c08126i8076
16006C4222K8560B5642J37976g4613j36314B41491a0009q0234A31044J19815a78315
15994H5051b82044g2789j7358j84048R9891I0157R6547a36441E385L4820K76295
15983C16500H8052N27944A19618M1247D1589P2580i6449p8245K7094I6440C3937
15971b25357N2091B6018a87473O0707B760K9156Q3835q869e8845E7798b1821B52107
15958A70520m9184b54320j50690I8172M3717o5292a65223J7031q4552F1507i9682
$$ plain form
15946 61913 -40502 239410 -248441 -142466 -13332 -209379 -338368 177434 -154651 -144388
15936 -144388 110457 -426088 114859 -167888 -191070 -44900 -205523 5911 199262 210316
15926 210316 -214626 75053 6962 21260 54655 -242233 -135925 -78902 -569956 -200277 -103009
15915 -103009 -121406 134933 254841 -201362 132587 -121981 -10885 -250478 -165872 -147363
15905 -147363 167056 -204905 -286721 -139752 -365136 -45409 253972 109689 -32630 146626
15894 314903 189327 155999 110959 225231 54067 341091 102995 146865 -114757 -312490
15884 -312490 -143659 -365579 168589 -1660 -45634 -43793 -144935 -58267 77178 -514474 -12407
15872 -189593 -48769 -72186 16193 78510 67898 -65363 -147120 111654 -145694 -67455 -297256
$$ packed form
15946F1913d0502B39410b48441J05975a3332j96047j28989A77434a54651J0263
15936a44388A10457d26088A14859a67888k3182d4900j60623E911J93351J1054
15926B10316b14626G5053F962J4298L3395b42233J06308N7023m91054b00277R7268
15915a03009j8397A34933J19908b01362A32587a21981a0885k39593Q4606J8509
15905a47363A67056b04905q1816a39752k25384d5409B53972A09689c2630A46626
15894C14903j25576l3328m5040J14272E4067K87024A02995M3870a14757j97733
15884c12490a43659k21920A68589a660m3974J841j01142e8267G7178e14474a2407
15872a89593d8769k3417A6193O2317j0612f5363q1757A11654a45694f7455k29801
$$ plain form
15861 -297256 -168062 -2454 207735 103321 194331 -260287 -166418 47756 -207150 81559 -118331
15849 153714 -154777 310189 240559 44649 -156430 -4284 118914 366397 -267255 23809
15838 -138394 -191080 172590 55176 154216 -103082 -268301 -200665 30829 -185918 -136995 -3695
15826 13071 23422 -216290 -55616 1547 229521 97042 -110452 5071 -195881 -207589 -149653
15815 -149653 -327849 -171266 -136992 -320344 -12439 -42745 80441 -160081 -135050 -24790 -194826
15804 -194826 270646 204200 46456 -95424 41977 98781 69644 -360644 -27523 -37 173155
15792 -55817 -181719 -262123 388465 -129854 550 325708 -66778 12509 -31583 100433 -191923
15780 25666 -55015 -97836 -163408 -331509 149657 -2423 370306 46908 -96260 7347 -80363
$$ packed form
15861b97256J29194b454B07735A03321R1010b60287R3869D7756b07150H1559a18331
15849A53714a54777C10189o9630D4649a56430d284A18914K47483b67255B3809
15838a38394n2686A72590E5176R9040a03082j65219O7636C0829a85918M8923c695
15826A3071J0351b16290e5616A547K27974I7042a10452E071a95881j1708N7936
15815a49653j78196J56583L4274j83352a2439l0306H0441a60081K5031b4790j70036
15804a94826B70646o6446D6456i5424D1977N6804k9137c60644b7523c7A73155
15792e5817j25902q0404C88465a29854E50L25158f6778A2509c1583A00433a91923
15780B5666e5015m2821o5572j68101A49657b423C70306D6908i6260G347h0363
$$ plain form
15768 132215 -100456 -64624 -11586 65787 47756 68629 38923 276257 157560 -165437 -60091
15756 -150686 -126729 3095 143171 81672 -249188 154328 -130257 245663 50158 34392 -80018
15744 -222052 300267 250888 123045 -105997 -121587 28018 9254 123851 127424 261889 -196006
15732 -28172 -63788 -46875 -38253 -207186 90626 -218142 61504 -324634 -50104 11375 -250706
15720 -46059 139385 -1994 32307 -193026 18987 -278846 64621 62448 -130135 224126 -281595
15708 -52842 1489 -69051 -4603 -19244 -193071 -88919 5095 -115925 170293 210376 48730 -141581
15695 -246309 471241 -94493 131058 -218195 -227692 -39130 -192191 -18199 242280 112616
15684 -125579 177261 -146626 93110 -316933 -189319 -115236 -154036 -241153 171957 -20062
$$ packed form
15768A32215a00456L5832a1586F5787j8031K0873k9706K37334j18697a65437f0091
15756a50686K3957C095J40076o1499b49188A54328a30257B45663E0158j5766h0018
15744b22052C00267m9379A23045a05997j5590B8018I254J14597L573J34465a96006
15732b8172l5616J6913Q622j68933I0626b18142F1504c24634e0104A1375b50706
15720d6059A39385a994C2307a93026A8987b78846F4621k173a30135B24126b81595
15708e2842A489f9051d603j4641j73827h8919E095a15925A70293M0083D8730a41581
15695b46309D71241i4493A31058b18195r497c9130j53061a8199B42280A12616
15684a25579A77261a46626I3110c16933J27614P4083l8800q7117A71957b0062
$$ plain form
15673 -137273 -321281 227277 -143071 -16292 124836 -98507 -232867 -95673 57903 362737
15663 362737 94487 -49107 34845 147267 -124385 -29184 -270468 -152306 7362 -139805 36945
15651 117378 -132803 197941 107077 159946 81384 330038 -138306 -259293 -44385 -66947
15641 -66947 130241 -138473 164700 -113214 -3095 -365815 93994 -4673 -47703 -188709 -190947
15630 -190947 -215542 -92151 -269821 52134 179215 86802 -142470 -103 -159099 -7212 -21200
15619 -21200 104426 2304 234004 -13376 37386 -166437 212856 -157101 -8150 -110397 -53745
15607 -57526 182654 -172543 -177938 -284360 272458 -147216 174749 120506 162326 231495 -56047
15595 131250 -65286 186383 206310 225576 -116093 -250731 58114 162282 131380 -297003
$$ packed form
15673a37273j84008B27277a43071a6292A24836i8507j34360i5673E7903L04834
15663C62737I4487d9107C4845J12422a24385b9184k41284J18162G362a39805C6945
15651A17378a32803A97941r0864N2869p8562K48654a38306j20987d4385k2562
15641f6947A30241a38473A64700a13214c095l62720I3994d673m3030j41006k238
15630a90947k4595i2151j77670E2134J27081H6802a42470a03j58996g212j3988
15619b1200A04426B304K31700a3376C7386a66437B12856a57101h150j02247e3745
15607e7526A82654a72543n395j06422B72458a47216A74749n4243M1820O9169e6047
15595A31250f5286A86383J9927J9266a16093j34638E8114J04168l0902b97003
$$ plain form
15584 -64840 279823 -81469 15012 179536 -42239 -146617 13581 -1826 155979 301134 592
15572 -291016 -38776 91470 -205311 117058 -131582 333153 -126710 -138387 -210880 -171427
15562 -171427 9174 -128323 60348 213938 -68295 -83002 17431 138227 43774 -9111 264383
15550 -34810 -155127 -127709 -43275 -260181 190566 -241894 159509 -221181 120503 -66190
15539 -216378 -127670 290544 215286 375468 -141542 -54962 -4496 -10283 -54137 119394 292773
15528 292773 219919 -199367 157712 -60415 -104268 -6201 200663 -293563 -61931 -154633 -162718
15517 -162718 -43035 -91257 -148463 163734 -97719 -183637 210396 213446 -202470 293213 289505
15506 289505 -267574 -89564 11840 156487 200080 -316550 -90548 -35682 -4191 338038 -177460
$$ packed form
15584f4840B79823h1469A5012J64524d2239j04378A3581a826A55979J45155E92
15572b91016c8776I1470b05311A17058a31582C33153a26710j1677p2493L9453
15562a71427I174a28323F0348J53590f8295j4707A7431J20796D3774i111B64383
15550c4810j20317K7418d3275k16906A90566b41894A59509b21181A20503f6190
15539b16378Q8708B90544p5258J60182a41542e4962d496n787m3854A19394J73379
15528B92773p2854a99367A57712f0415m3853f201B00663b93563f1931r2702q085
15517a62718d3035m8222n7206A63734i7719q5918B10396L050b02470B93213l708
15506B89505b67574h9564A1840J44647M3593c16550i0548c5682d191C38038a77460
$$ plain form
15494 -124102 -31858 -262653 38539 309561 -208571 -87643 -29423 -312494 15452 101881 340110
15483 340110 -224103 20854 31193 13906 -190418 -272049 27589 213074 413481 96664 161304
15472 161304 -211090 68458 35920 -415826 25083 -151291 91795 -162640 141549 -356851
15461 -199723 67173 120066 411688 207393 -169725 -51985 263930 131140 -193352 -54618
15450 -22467 50398 -169658 -100281 160659 111228 54134 -358397 329000 -70566 60944 58935
15439 58935 87211 19933 334497 18434 26840 242250 -9510 115396 -54984 -324266 8842
15427 44517 -75597 346032 -56618 -237956 12639 -38724 16014 -146853 -10075 65771 52439
15416 52439 35059 -46912 11736 -2629 60993 78898 5562 125028 -245793 33567 13403 32797
$$ packed form
15494a24102c1858k30795C8539K71022b08571h7643b9423k83071A5452Q6429K38229
15483C40110b24103B0854J0339A3906a90418q1631B7589J85485K00407I6664O4640
15472A61304b11090F8458l2538d15826B5083a51291I1795a62640A41549c56851
15461a99723F7173N2893K91622k04295a69725e1985B63930A31140a93352e4618
15450b2467E0398a69658O9377A60659m9431E4134c58397C29000g0566F0944k009
15439E8935K8276A9933L14564A8434Q406K15410i510A15396e4984k69282H842
15427D4517g5597C46032e6618j81338A2639c8724A6014a46853a0075F5771j3332
15416E2439j7380d6912A1736b629F0993J7905E562J19466b45793C3567A3403J9394
$$ plain form
15404 32797 -69473 -150424 -92200 -113184 -46502 213807 -821 323852 146851 -155667 -157252
15393 -157252 -28646 -92894 -191496 404684 -50555 -219047 32979 -32491 -133140 -424149 -230163
15382 -230163 -109383 -198774 127824 -107644 -423873 -60785 171740 -36252 -26307 109573
15371 -97088 -269421 22438 65103 -108874 -106930 33800 20993 -271640 237885 102853 140145
15360 140145 -53158 196699 -212080 -118670 -45703 -205891 -282235 353653 -141215 317779
15349 94403 -282468 -75393 102706 -33356 79769 256306 -191689 -113370 -25541 136715 295414
15338 295414 -53663 14148 -43998 227150 -248679 -21295 190946 35800 99984 102475 324789
15327 324789 -34500 -181141 -81209 308058 124617 46120 281814 -161659 -165178 253232
$$ packed form
15404C2797f9473q0951N8224k0984d6502B13807h21C23852A46851a55667j585
15393a57252b8646o4248r8602D04684e0555j68492C2979c2491j00649k91009J93986
15382b30163a09383q9391A27824a07644l16229f0785A71740c6252R945A09573
15371i7088j72333B2438M2665a08874J944C3800j2807b71640B37885A02853L7292
15360A40145e3158A96699b12080R3410d5703j60188p6344C53653a41215C17779
15349I4403b82468g5393A02706c3356G9769J76537a91689P8319b5541A36715J58699
15338B95414e3663A4148d3998B27150b48679b1295A90946C5800O4184K491K22314
15327C24789c4500j46641h1209C08058A24617D6120K35694a61659l519B53232
$$ plain form
15316 -79017 93164 -149862 -261178 187496 57219 -440962 -16439 44182 105085 264958 28879
15304 85932 217932 181640 -34456 72126 72168 61629 271927 246590 -240740 94352 18439 26410
15292 26410 -30238 198417 135079 -24928 -105246 178226 158741 -84007 -53130 -80543 90150
15280 110272 -92331 119604 53151 -19714 20446 -41697 -8466 12402 268624 360558 175524
15268 -285813 114317 85885 274539 -132524 -327275 12962 -13570 278062 192110 184126 -153899
15256 -131069 -18649 246425 126243 26693 345199 356242 626056 983390 1744584 1048077
15246 1048077 1142309 1154202 509281 165803 114054 327766 88498 -151366 -133221 63267
15235 250386 262135 263567 239717 -151241 119245 389886 125624 64131 130419 4668 227192
$$ packed form
15316g9017I3164a49862j11316A87496E7219d40962a6439D4182O0903J59873B8879
15304H5932J32000l6292c4456G2126M2j0539K10298k5337b40740I4352A8439P971
15292B6410c0238A98417o3338b4928q0318A78226j9485h4007L0877k7413I0150
15280A10272i2331A19604E3151a9714B0446d1697h466A2402K56222R1934A75524
15268b85813A14317k8432J88654a32524j94751A2962a3570B78062q5952p984a53899
15256a31069a8649B46425j20182B6693L18506J1043K69814L57334P61194o96507
15246A048077R4232J1893E09281A65803n1749K13712H8498a51366J8145F3267
15235B50386J1749J432k3850a51241A19245K70641A25624o1493O6288D668K22524
$$ plain form
15224 227192 -38093 141395 3655 -171393 -58719 -79206 -32281 33381 -21212 -16133 -356935
15213 -356935 543124 13163 -263123 -84570 -91655 -70771 -76670 6126 -61208 -223408 323273
15201 148387 -40344 62803 8900 94464 194036 19936 -98365 230088 29575 -74450 -106045
15190 -106045 -150114 5115 -74209 -17505 106090 410188 -72799 96574 122554 -101501 143754
15178 173674 -372895 45749 276642 221150 74896 -83374 181894 -86277 -43482 -180497 -47104
15166 -15661 222999 274557 184276 -57234 190263 227568 -132847 260799 8643 -256236 198286
15154 -244947 -28250 -354653 -242317 -69141 -62166 5715 433231 -187567 -151434 -38465 249963
15142 124714 248746 220233 271921 310260 480536 160655 180794 319741 86064 -137459
$$ packed form
15224B27192c8093A41395C655a71393e8719k0487c2281C3381b1212N079l40802
15213c56935E43124A3163b63123h4570p085K0884n899F126f1208j62200C23273
15201A48387d0344F2803H900Q5564R9572A9936i8365B30088B9575g4450l1595
15190a06045m4069E115g4209a7505A06090L04098g2799I6574K5980a01501A43754
15178A73674c72895D5749K30893n5492G4896h3374A81894h6277M2795j37015d7104
15166a5661B22999N1558r0281e7234A90263L7305a32847B60799H643b56236A98286
15154b44947b8250l26403J12336f9141O975E715M27516a87567L6133c8465B49963
15142A24714J24032k8513N1688L8339J70276A60655K0139J38947H6064a37459
$$ plain form
15131 103617 29830 34317 -182023 86286 -25755 398560 45929 109580 147810 -131033 40511
15119 29959 367039 211947 129569 147375 240440 -309765 191019 208938 -19870 39981 495446
15108 495446 268661 327818 153988 303558 127480 -166730 -127960 44885 139618 237400
15098 237400 -125893 204750 152752 227646 36396 -732 68910 295797 -172973 213937 487262
15087 487262 372172 -319140 402318 316133 504334 -145210 415878 23605 -108357 192969
15076 356358 25842 118089 138510 430206 95590 -46787 -121126 133187 279047 173840 -159550
15064 -66994 -214837 20960 105445 284300 -58029 22842 121314 17295 22075 -50396 402273
15052 160286 466946 163000 -15183 160915 41739 494233 -4210 168629 328124 176191
$$ packed form
15131A03617B9830M487a82023H6286b5755C98560D5929O3651L8230a31033D0511
15119B9959L37080j55092q2378J7806R3065c09765A91019J7919a9870C9981M55465
15108D95446k26785N9157A53988J49570A27480a66730L8770D4885R4733R7782
15098B37400a25893B04750n1998P4894C6396g32F8910K26887a72973B13937K73325
15087D87262j15090c19140D02318q6185J88201a45210D15878B3605a08357A92969
15076C56358B5842R2247K0421K91696I5590d6787p4339A33187J45860j05207a59550
15064f6994j47843B0960Q4485J78855e8029B2842R8472A7295M780e0396D02273
15052A60286L06660A63000a5183A60915D1739M52494d210A68629J59495j51933
$$ plain form
15042 176191 9782 340869 50769 78229 -259311 44112 123013 3629 -106804 22926 128231
15031 128231 103623 372740 360139 298871 -34135 398402 133640 238722 -47439 374799
15020 448333 148448 322435 299644 -134330 572474 535465 24365 504161 152376 157415
15010 157415 217371 238222 -105823 55241 24178 232123 -42126 -11620 -270145 -157587 -9963
14998 522381 255161 204496 67971 262009 220016 541633 282685 462381 362924 205013
14988 205013 534647 323987 127694 378226 231825 84955 289199 172602 105122 262844
14978 262844 7844 381912 82825 112446 195531 257686 421648 242058 17211 286857 331177
14967 331177 474128 47819 456073 79077 196729 350896 -294951 254228 190338 138568
$$ packed form
15042A76191I782L31087E0769K7460b59311D4112P8901C629a06804B2926J05305
15031A28231k4608K69117j2601o1268c4135C98402A33640J05082d7439C74799
15020D48333A48448J73987k2791a34330E72474l7009B4365M79796A52376N039
15010A57415N9956K0851a05823E5241B4178K07945d2126a1620k58525J12558i963
14998E22381B55161n0665F7971J94038m1993L21617k58948J79696r9457j57911
14988B05013L29634k10660A27694K50532j46401H4955K04244j16597o7480J57722
14978B62844G844L74068H2825K9621Q3085O2155J63962j79590A7211K69646M4320
14967C31177J42951D7819M08254G9077J17652J54167b94951B54228o3890n1770
$$ plain form
14957 138568 322532 667834 126762 298187 182815 97226 -86745 -36638 9609 18893 384020
14946 384020 171427 313737 401663 98752 186631 6354 110942 109686 198831 621936 257387
14934 214542 373198 312342 211773 12066 18160 82876 278775 272011 190499 391627 56431
14922 394810 58105 53473 347817 500085 304200 615075 246257 514964 269492 258667
14912 258667 365643 71709 196226 261632 464582 151039 195769 271729 123822 149664
14902 149664 -16858 326241 232584 249318 475430 167612 358596 428351 -90222 218390
14891 374036 175724 288899 253135 256945 229670 331932 298047 46226 251179 -130998 397293
14879 563709 98280 160218 236296 480916 393248 358402 553024 316627 317541 434443 435138
$$ packed form
14957A38568J83964L45302A26762J71425j15372q5589h6745c6638I609R284L65127
14946C84020A71427J42310Q7926I8752Q7879F354J04588j256Q9145M23105B57387
14934B14542J58656o0856j00569A2066O094O4716J95899o764q1512K01128E6431
14922C94810E8105m632K94344J52268j95885L10875B46257K68707k45472j0825
14912B58667J06976G1709J24517O5406K02950A51039M4730P5960A23822K5842
14902A49664a6858C26241r3657J6734K26112A67612J90984O9755i0222B18390
14891C74036A75724J13175l5764L810k7275J02262l3885D6226K04953a30998C97293
14879E63709I8280O1938P6078K44620q7668l4846J94622k36397R14J16902O95
$$ plain form
14868 435138 704519 308358 362192 230587 154092 415953 176717 148393 286443 486584
14858 486584 441511 786620 226792 249865 288344 456841 253208 455455 484575 513991
14848 513991 175927 527535 317252 605191 629904 236323 380000 528354 573161 511439
14838 511439 227383 687115 712635 290410 496747 299481 232637 259052 242859 250291 207151
14827 207151 664594 648961 328554 94264 346532 518342 361302 630069 394920 667607
14817 667607 271142 556240 759546 370137 455627 354929 375133 110797 749471 638341
14807 638341 494192 307458 590181 440873 284133 514838 384975 291849 989555 628738
14797 628738 820893 389446 460493 740894 478939 502289 539945 612283 603028 500592 773369
$$ packed form
14868D35138K69381C08358N3834j31605p6495K61861A76717k8324J38050K00141
14858D86584m5073L45109B26792K3073L8479J68497k03633K02247K9120K9416
14848E13991A75927L51608k10283K87939K4713B36323J43677J48354M4807o1722
14838E11439B27383M59732K5520B90410K06337j97266o6844K6415j6193P432m3140
14827B07151M57443j5633l20407I4264K52268J71810j57040K68767k35149K72687
14817F67607B71142K85098K03306C70137Q5490j00698K0204A10797O38674j11130
14807F38341j44149j86734K82723j49308j56740K30705j29863r3126O97706l60817
14797F28738J92155C89446P1047K80401k61955K3350L7656P2338r255j02436K72777
$$ plain form
14786 773369 353739 555254 445247 978261 203670 452457 437022 632834 796052 335993
14775 357124 726948 479982 593592 667268 176122 625530 357808 554018 435942 709981
14765 709981 591221 678220 400644 599347 749992 705176 641426 840677 500734 465172
14755 465172 198657 551078 446949 684172 697214 502965 686515 545446 979774 890440
14745 890440 400399 733111 484143 668572 473061 979140 790692 387890 749917 788823
14735 788823 531079 711065 675891 787657 558840 711769 966823 713263 937031 907107
14725 907107 704717 754908 716540 795613 736964 521044 939721 1135000 841589 721224
14715 721224 1111791 705234 728426 959534 629806 984592 844099 563444 631425 760993
$$ packed form
14786G73369C53739K01515j10007N33014B03670K48787j5435J95812J63218C35993
14775C57124L69824k46966J13610P3676A76122M49408k67722J96210j18076K74039
14765G09981j18760Q6999k77576J98703J50645m4816o3750J99251l39943l5562
14755D65172A98657L52421j04129K37223J3042j94249J83550j41069M34328q9334
14745H90440D00399L32712k48968J84429j95511N06079j88448C87890L62027L8906
14735G88823k57744J79986l5174J11766k28817J52929K55054k53560K23768k9924
14725I07107k02390N0191l8368P9073n8649k15920M18677J95279k93411j20365
14715G21224L90567m06557K3192K31108l29728L54786j40493k80655O7981J29568
$$ plain form
14705 760993 743569 881087 900330 993649 966333 1219144 822387 1016028 799721 963897
14695 963897 838676 978128 1041334 881915 1003528 685930 787558 708646 897591 814425
14685 814425 1060817 958765 887223 867310 798033 824139 983416 817940 1084569 717127
14675 717127 1000853 1077183 1082392 681198 1028438 616782 744872 1216340 937422 807362
14665 807362 1021205 1057830 912876 894163 1099217 892860 972067 1118242 742103 690390
14655 690390 1189419 711903 1253613 795408 919662 1252239 1096985 979767 1077378 1277061
14645 1277061 1139262 1434084 1330603 1144437 1181998 1320778 1368645 1284358 1087486 1119951
14635 1119951 1452290 1666466 831660 843714 1247351 904728 1478831 1370169 1166294 1209037
$$ packed form
14705G60993j7424J37518J9243R3319k7316K52811l96757J93641k16307J64176
14695I63897j25221J39452O3206j59419J21613l17598J01628p8912J88945q3166
14685H14425K46392j02052p1542j9913o9277K6106J59277j65476K66629l67442
14675G17127K83726P6330N209m01194L47240m11656J28090M71468k78918j30060
14665H07362K13843L6625j44954j8713K05054k06357P9207J46175l76139n1713
14655F90390M99029m77516N41710m58205J24254L32577j55254j17218R7611J99683
14645A277061j37799K94822j03481j86166L7561J38780M7867q4287j96872L2465
14635A119951L32339K14176H31660J2054M03637l42623N74103j08662k03875M2743
$$ plain form
14625 1209037 1506281 1106879 1112549 1391105 1349621 1264419 1765488 1193890 1245176 1288324
14615 1288324 1336908 1495471 1634548 1430647 1192953 1480640 1269323 1354488 1248826 1675346
14605 1675346 1382856 1427203 1676281 1678241 1633761 1603149 1577030 1808216 1436667 1294531
14595 1294531 1599749 1496277 1442983 2035877 1904877 1752191 1753004 1901800 2073358 1775677
14585 1775677 1739055 2015890 1806028 1727879 1763139 1607634 2072623 1749310 2117103 1641161
14575 1641161 1966807 2388893 2240197 2215871 1971032 2140632 2195119 2232007 2237850 2278423
14565 2278423 2236736 2290393 2132626 2675693 2348733 2459755 2614738 2878081 2976627 3180447
14555 3180447 3478167 3314082 3891541 4082933 4602443 6330595 8656477 13378995 22524799
$$ packed form
14625A209037K97244l99402N670K78556m1484q5202N01069n71598N1286M3148
14615A288324M8584J58563J39077k03901k37694K87687k11317Q5165j05662M26520
14605A675346k92490M4347K49078J960m4480l0612k6119K31186l71549j42136
14595A294531L05218j03472n3294N92894j31000j52686Q13J48796J71558k97681
14585A775677l6622K76835k09862p8149L5260j55505M64989l23313L67793m75942
14575A641161L25646M22086j48696k4326k44839J69600N4487L6888N843M0573
14565B278423m1687N3657j57767N43067l26960J11022J54983K63343R8546K03820
14555C180447K97720j64085N77459J91392N19510J728152K325882M722518R145804
$$ plain form
14546 22524799 37489386 44104450 21406469 8021228 4368589 3344610 2241545 2036658
14538 2036658 2045002 2155204 1969857 1732280 2052197 1744698 2044384 2012189 2177988 2202246
14528 2202246 2295700 2017297 2398373 2133897 2153742 2469734 2686665 2479352 2381385 2574920
14518 2574920 2499720 2581016 2560161 2529726 2644612 2690286 2530537 2551187 2599245 2618389 2920056
14507 2920056 3151300 3178089 2902764 2849552 2856317 2981076 3105808 2912264 3148054 3225777
14497 3225777 2493831 3358219 3112949 3276944 3149597 3327095 3032269 3520700 3389860
14488 3389860 3618060 3468881 3731051 3531950 3430776 3649291 3598882 3891546 3802159 3733517
14478 3733517 4057204 3946522 3985216 4206546 4081914 3753536 4186095 3981998 4112667 3923675
$$ packed form
14546B2524799J4964587O615064B1406469H021228l652639j023979j103065k04887
14538B036658Q344J10202j85347k37577L19917l07499K99686l2195J65799K4258
14528B202246R3454k78403L81076k64476J9845L15992K16931k07313r7967J93535
14518B574920p5200Q1296k0855l0435J14886M5674j59749K0650M8058J9144L01667
14507B920056K31244K6789k75325n3212O765J24759J24732j93544K35790P7723
14497C225777p31946Q64388k45270J63995j27347J77498k94826M88431j30840
14488C389860K28200j49179K62170j99101j01174K18515n0409K92664q9387o8642
14478C733517L23687j10682L8694K21330j24632l28378M32559k04097J30669j88992
$$ plain form
14468 3923675 4232454 4422370 4205884 4569720 4636211 4553683 4697417 4953697 4972639 4827339
14458 4827339 4785553 4767477 4979370 4651575 5104176 4787981 4949532 5133369 5350367 5450477
14448 5450477 5672391 5990595 5390206 5415433 5792781 5657118 6006287 5826601 5886053 5789545
14438 5789545 5970268 6380143 6462779 6414115 6372677 6845759 6606710 6383497 6601291 6914489
14428 6914489 7034705 6921124 7412480 7124066 7266555 7467755 7628103 7817844 7717312
14419 7717312 7981989 7789705 8312867 8537830 8374694 8537708 8494354 8602190 8866462 9050661
14409 9050661 9250255 9256834 9572040 9387702 9930269 9725551 10018671 9935729 10068215 10631968
14399 10631968 10535908 11094028 11315033 11318423 11292522 11400098 11633385 12031081 12338540 12385719
$$ packed form
14468C923675L08779J89916k16486L63836O6491q2528J43734K56280J8942j45300
14458D827339m1786j8076K11893l27795M52601l16195J61551J83837K16998J00110
14448E450477K21914L18204o00389K5227L77348j35663L49169j79686N9452r6508
14438E789545J80723M09875Q2636m8664m1438M73082k39049k23213K17794L13198
14428F914489J20216j13581M91356k88414J42489K01200J60348J89741j00532
14419G717312K64677j92284N23162K24963j63136J63014m3354J07836K64272J84199
14409I050661J99594O579L15206j84338N42567k04718K93120q2942J32486N63753
14399A0631968r6060N58120K21005L390k5901J07576K33287L97696L07459M7179
$$ plain form
14389 12385719 12442611 12572100 13024898 13243203 13360473 13596007 13869967 14305704 14173660
14380 14173660 14546238 14607020 15617075 15305128 15813446 15837005 16178153 16740485 16846682
14371 16846682 17641657 17481186 18045571 18485716 18693874 19120284 19512985 19887957 20220188
14362 20220188 20730059 21228223 21657669 22086548 22476454 23269129 23725650 24376601 24802234
14353 24802234 25258176 26060003 26555260 26854959 27921949 28778224 29345892 30385113 30897186
14344 30897186 31526909 32348414 33468703 34542067 35150507 36074529 36983753 38264542 39297729
14335 39297729 40889036 41778840 42934959 44021835 45555078 46670203 48131907 49904182
14327 49904182 51801578 52730921 54805904 57094864 58375232 60726367 62640499 65135123
$$ packed form
14389A2385719N6892J29489M52798K18305J17270K35534K73960M35737j32044
14380A4173660L72578O0782J010055l11947N08318K3559L41148N62332J06197
14371A6846682P94975j60471N64385M40145K08158M26410L92701L74972L32231
14362B0220188N09871M98164M29446M28879L89906P92675M56521O50951M25633
14353B4802234M55942Q01827M95257K99699J066990Q56275N67668J039221N12073
14344C0897186O29723Q21505J120289J073364O08440R24022R09224J280789J033187
14335C9297729J591307Q89804J156119J086876J533243J115125J461704J772275
14327D9904182J897396R29343K074983K288960J280368K351135J914132K494624
$$ plain form
14319 65135123 67472668 69528821 72326833 74771310 78060857 80851591 84125501 87191979
14311 87191979 90538791 94548933 98510943 102821782 107257198 111682287 116836806 122269428
14303 122269428 128027768 133563911 139847889 146625651 153784092 161057701 169220015 177768714
14295 177768714 186526619 196458505 206105943 216827944 227953740 239601759 252055030
14288 252055030 264769034 278472826 292360617 306754837 321647471 336993745 352598377
14281 352598377 367496606 382895685 397723988 412019979 425342442 437089852 447057275
14274 447057275 453550688 456572034 457181660 457709961 459307939 460192502 458517130 453930718
14266 453930718 447531561 438691299 427913291 416474110 403003312 388654978 373611730
$$ packed form
14319F5135123K337545K056153K798012K444477L289547K790734L273910L066478
14311H7191979L346812M010142L962010M310839M435416M425089N154519N432622
14303A22269428N758340N536143O283978O777762P158441P273609Q162314Q548699
14295A77768714Q757905R931886R647438J0722001J1125796J1648019J2453271
14288B52055030J2714004J3703792J3887791J4394220J4892634J5346274J5604632
14281C52598377J4898229J5399079J4828303J4295991J3322463J1747410R967423
14274D47057275O493413L021346O09626N28301J597978Q84563j675372m586412
14266D53930718o399157q840262j0778008j1439181j3470798j4348334j5043248
$$ plain form
14259 373611730 357704537 342198601 326476108 311562815 297181341 282874420 268920432
14252 268920432 255387804 243091213 230983107 219099338 208378362 198151536 188406843
14245 188406843 179578929 171093889 162840329 155032720 147914802 141231878 134488321 128976119
14237 128976119 123502669 118138379 113066724 108052143 103572996 99534665 95556500 91641010
14229 91641010 88112532 84793172 81274546 78131693 75548775 72658690 70048660 67646936
14221 67646936 65213822 63093628 60927327 58905526 56851267 55018784 53295619 52018490
14213 52018490 50830353 48603872 47290013 45871219 44155546 43263392 42508600 41622738
14205 41622738 40019955 38706455 37443373 36534757 36021422 34900465 34201794 32895131
$$ packed form
14259C73611730j5907193j5505936j5722493j4913293j4381474j4306921j3953988
14252B68920432j3532628j2296591j2108106j1883769j0720976j0226826r744693
14245A88406843q827914q485040q253560p807609p117918o682924o743557n512202
14237A28976119n473450n364290n071655n014581m479147m038331l978165l915490
14229I1641010l528478l319360l518626l142853k582918k890085k610030k401724
14221F7646936k433114k120194k166301k021801k054259j832483j723165j277129
14213E2018490j188137k226481j313859j418794j715673q92154p54792q85862
14205D1622738j602783j313500j263082r08616n13335j120957o98671j306663
$$ plain form
14197 32895131 32106838 31407085 30642303 29717078 29418070 28458064 27654080 26995076 26363227
14188 26363227 25725193 25015093 24674919 24460648 23561050 22880601 22566974 21938298 21359816
14179 21359816 21119626 20635984 20290923 19792026 19337645 18742808 18636076 18530768 18087558
14170 18087558 17634795 17281073 16871327 16807360 16385303 16033970 15688705 15428812 15135420
14161 15135420 14860210 14681458 14553324 14150898 13913695 13629262 13574644 13108073 12673517
14152 12673517 12764334 12470376 12521481 12021386 12096959 11699014 11429141 11544929 10981120 10996444
14142 10996444 11054029 10805071 10243614 10450159 10161163 10142840 9737755 9588042 9569681 9435721
14132 9435721 9275305 9380999 9007786 8903236 8999392 8599020 8343652 8762547 8304967 8566967
$$ packed form
14197C2895131p88293o99753p64782r25225k99008r60006q03984o59004o31849
14188B6363227o38034p10100l40174k14271q99598o80449l13627o28676n78482
14179B1359816k40190m83642l45061m98897m54381n94837j06732j05308m43210
14170A8087558m52763l53722m09746o3967m22057l51333l45265k59893k93392
14161A5135420k75210j78752j28134m02426k37203k84433n4618m66571m34556
14152A2673517R0817k93958N1105n00095P5573l97945k69873J15788n63809J5324
14142A0996444N7585k48958n61457K06545k88996j8323m05085j49713j8361j33960
14132I435721j60416J05694l73213j04550R6156m00372k55368M18895m57580K62000
$$ plain form
14122 8566967 8577067 8005230 7968071 7812577 8013538 7651851 7402665 7347827 7253062 7249508
14112 7249508 7064792 7059865 7203926 6892552 7071938 6479543 6498406 6474120 6475948 6570275 6708380
14101 6708380 6532219 5969936 5831656 6282915 5714220 5800813 5562556 5588197 5557991 5426062
14091 5426062 5545803 5590477 5441348 5216563 5331826 5244969 5162477 5302645 4940102 5047412
14081 5047412 4995676 4953094 4730238 4987542 4916504 4759606 4607523 4361803 4290515 4404230
14071 4404230 4190100 4487136 4398412 4467951 4327369 4300499 4516894 4278605 4008052 4467930
14061 4467930 4080845 4265252 3765583 3831598 4004123 4055923 3812738 3768031 3818801 3539368
14051 3539368 3787644 3534251 3431351 3687113 3693973 3482203 3584737 3474578 3519457 2970910
$$ packed form
14122H566967J0100n71837l7159j55494K00961l61687k49186n4838r4765l554
14112G249508j84716m927J44061l11374J79386n92395J8863k4286J828R4327J38105
14101F708380j76161n62283j38280M51259n68695Q6593k38257K5641l0206j31929
14091E426062J19741M4674j49129k24785J15263q6857q2492J40168l62543J07310
14081E047412n1736m2582k22856K57304p1038j56898j52083k45720p1288J13715
14071D404230k14130K97036q8724O9539j40582k6870K16395k38289k70553M59878
14061D467930l87085J84407m99669O6015J72525N1800k43185m4707N0770k79433
14051C539368K48276k53393j02900K55762O860k11770J02534j10159M4879n48547
$$ plain form
14041 2970910 3356222 3341492 3169173 3281588 3493313 3520294 3408714 3290597 2961896 3198232
14031 3198232 3193491 2999831 3077463 3157630 3050339 3005605 2848667 3190781 3038233 2580338
14021 2580338 2672210 2407398 2688352 2798735 2563664 2704853 2762798 2605277 2900943 2834448
14011 2834448 2469413 2585608 2595404 2310267 2159976 2254065 2438409 2530599 2310828 2002507
14001 2002507 2524568 2094359 2437414 2119750 1842546 2272038 2450753 2197368 2280618 2459248
13991 2459248 2684283 3056841 4947886 8370085 15966868 31122257 43939653 26123893
13983 26123893 12866351 8058320 6022069 5103320 4223375 4138555 3839945 3192226 3265692
13974 3265692 2681275 3260533 2577788 2440222 2761972 2573217 2611832 2280284 2462887 2583961
$$ packed form
14041B970910L85312j4730j72319J12415K11725K6981j11580j18117l28701K36336
14031C198232m741j93660P7632Q0167j07291m4734j56938L42114j52548m57895
14021B580338R1872k64812K80954J10383k35071J41189N7945j57521K95666o6495
14011B834448l65035J16195R796k85137j50291R4089J84344R2190k19771l08321
14001B002507N22061m30209L43055l17664k77204M29492J78715k53385Q3250J78630
13991B459248K25035L72558J891045L422199P596783J5155389J2817396j7815760
13983B6123893A2866351m808031k036251r18749q79945q4820k98610o47719P3466
13974C265692n84417N79258o82745j37566L21750j88755L8615l31548J82603J21074
$$ plain form
13964 2583961 2217333 2256528 2311508 2116590 2100276 2170705 2150068 1955915 2247351 2286894
13954 2286894 1968578 1992614 1990334 2020874 1785068 1931886 1948385 1936067 1916098 1796155 2127599
13943 2127599 1792961 1887347 1883180 1835229 1767819 1528972 1873848 2106832 1966232 1758367
13933 1758367 1863686 1771980 1962065 1606151 1851470 1548615 1733438 1631238 1818194 1956430
13923 1956430 1427033 1872484 1700670 1363357 1913346 1795236 1216268 1756030 1459722
13914 1459722 1840124 1328965 1741750 1708445 1671881 1253710 1384608 1393183 1254202 1390595
13904 1390595 1531929 1440116 1224511 1521818 1596035 1275394 1260121 1559351 1463960 1279725
13894 1279725 1250364 1365594 1230186 1192855 1395066 1367711 1304377 1436266 1248193 1462416
$$ packed form
13964B583961l66628L9195N4980j94918j6314P0429k0637j94153K91436L9543
13954B286894l18316K4036k280L0540k35806J46818J6499j2318j9969j19943L31444
13943B127599l34638R4386m167m7951o7410k38847L44876K32984j40600k07865
13933A758367J05319r1706J90085l55914K45319l02855J84823j02200J86956J38236
13923A956430n29397M45451j71814l37313N49989j18110n78968N39762k96308
13914A459722L80402n11159M12785l3305l6564m18171J30898Q575j38981J36393
13904A390595J41334r1813k15605K97307P4217l20641j5273K99230r5391j84235
13894A279725k9361J15230j35408l7331K02211k7355o3334J31889j88073K14223
$$ plain form
13884 1462416 1062709 1287976 1429941 1607693 1241987 1286564 1163847 1342309 1251639 1260972
13874 1260972 1320171 1509439 1303532 915284 1313128 1219706 1203986 1188825 933547 1511528
13864 1511528 1259099 1224854 1421043 1133307 1187614 1042636 1361471 1195273 1130666 936450
13854 936450 1148040 1362588 1234724 1130717 1147528 652917 991391 1113325 962474 831329
13844 831329 727062 1409225 681836 951390 1309217 754354 1038321 988361 937484 1078843
13834 1078843 772490 1077334 1038369 1209302 960529 1198059 755921 764262 945330 792178
13824 792178 1109900 1250636 942279 786499 795441 822239 660632 973872 912973 1233442
13814 1233442 920234 640812 788494 932670 885124 798015 693970 649323 936379 901751
$$ packed form
13884A462416l99707K25267J41965J77752l65706M4577j22717J78462r0670R333
13874A260972N9199J89268k05907l88248L97844r3422j5720j5161k55278N77981
13864A511528k52429l4245J96189k87736N4307j44978L18835j66198o4607j94216
13854I36450K11590K14548j27864j04007J6811m94611L38474J21934j50851j31145
13844H31329j04267O82163F81836K69554L57827n54863K83967m9960n0877J41359
13834A078843l06353L04844l8965J70933k48773K37530m42138Q341J81068j53152
13824G92178L17722J40736l08357j55780Q942K6798j61607L13240o0899L20469
13814A233442l13208k79422J47682J44176m7546q7109j04045m4647K87056l4628
$$ plain form
13804 901751 608547 961359 609138 852510 792381 1269395 814956 592864 1169143 1068304
13794 1068304 841949 538992 537283 815091 809201 915195 641747 829709 904318 878277
13784 878277 858303 699146 694527 781999 984240 655077 832445 663235 724603 564504
13774 564504 843891 361538 757830 691641 869973 850875 945888 481967 704261 566111
13764 566111 755194 673955 868165 435311 823375 886562 959923 554158 447098 435623
13754 435623 331217 1262024 436809 640202 477030 763094 464010 720903 591254 664118
13744 664118 723830 731588 974141 548051 445910 734612 515140 506882 563138 495580 693711
13733 693711 725799 605619 715265 761619 666858 575175 463272 533678 485742 494526 682637
$$ packed form
13804I01751k93204L52812l52221K43372o0129M77014m54439k22092N76279j00839
13794A068304k26355l02957j709K77808n890J05994k73448J87962P4609k6041
13784H78277j9974j59157m619Q7472K02241l29163J77368j69210O1368j60099
13774E64504K79387C61538L96292o6189J78332j9098R5013m63921K22294j38150
13764E66111J89083q1239J94210m32854L88064O3187P3361m05765j07060j1475
13754D35623j04406R30807D36809K03393j63172K86064k99084K56893j29649P2864
13744F64118N9712P758K42553m26090j02141K88702k19472q258N6256o7558J98131
13733F93711L2088j20180J09646M6354r4761r1683j11903P0406m7936Q784J88111
$$ plain form
13722 682637 572378 526907 949833 564197 753087 612544 736162 541639 630017 721338
13712 721338 524945 791131 593465 652213 648723 595851 794771 300283 579326 525514
13702 525514 510622 811133 499329 720360 584027 815025 428231 419241 412520 423591 483252
13691 483252 399697 598738 871872 390340 224536 643718 795476 429098 768940 314394
13680 449813 583203 754058 430731 519648 719985 651018 522784 490150 559742 764806
13670 764806 272978 293120 576044 496166 643529 542668 581698 449826 397993 603653
13660 603653 608846 333030 258180 897270 223652 461704 633322 510510 600077 403703
13650 403703 613696 266907 707186 661899 357566 314631 323188 358181 569691 364996
$$ packed form
13722F82637j10259m5471M22926l85636J88890j40543J23618j94523Q8378R1321
13712G21338j96393K66186j97666N8748l490n2872J98920C00283K79043n3812
13702E25514j4892L00511l11804K21031j36333K30998l86794q990o721J1071N9661
13691D83252q3555J99041K73134C90340j65804M19182J51758l66378L39842C14394
13680D49813J33390J70855l23327Q8917K00337o8967j28234l2634O9592K05064
13670G64806B72978K0142K82924p9878J47363j00861L9030j31872n1833K05660
13660F03653N193k75816p4850O39090B23652K38052J71618j22812Q9567j96374
13650D03703K09993B66907M40279m5287l04333m2935Q557L4993K11510k04695
$$ plain form
13640 364996 220936 424685 330406 206065 529812 479193 389821 726096 236599 228230
13630 228230 559481 223553 529527 650637 141108 391136 546595 420164 588289 442667
13620 442667 439123 413500 457652 547865 594530 491698 396227 362892 632104 584705 311190
13609 311190 294905 407642 265106 743454 454189 519524 606870 282275 142377 628344
13599 628344 350740 84947 82416 228996 276215 507414 567355 511822 515322 112358 631471
13588 631471 381514 271616 511778 263539 488315 484699 381385 296679 447413 643869
13578 643869 459672 252034 -91502 756471 264529 143196 282922 301236 437649 364198
13568 364198 544645 473023 356134 276449 414827 466866 524242 488698 -64852 -67583 252462
$$ packed form
13640C64996j44060K03749r4279j24341L23747n0619q9372L36275B36599q369
13630B28230L31251B23553L05974J21110A41108K50028J55459j26431J68125j45622
13620D42667l544k5623M4152R0213M6665j02832r5471l3335K69212m7399k73515
13609C11190j6285J12737j42536M78348k89265O5335Q7346B82275j39898M85967
13599F28344k77604H4947k531J46580M7219K31199N9941n5533L500A12358N19113
13588F31471k49957j09898K40162k48239K24776l616j03314q4706J50734J96456
13578F43869j84197k07638i1502G56471B64529j21333J39726J8314J36413p3451
13568C64198J80447p1622j16889p9685J38378N2039N7376l5544f4852k731B52462
$$ plain form
13556 324787 320866 198893 283911 393889 567721 128618 58471 54868 328009 -4074 303963
13544 492639 385313 413402 151571 321716 153463 422871 183006 318619 316343 387457
13534 387457 309306 241084 99045 289925 119145 332424 358547 219959 280967 151415
13524 151415 577479 264238 446381 304146 282185 520415 148335 173775 113652 416927
13514 416927 407405 209905 408823 82132 414109 136217 583742 138981 274142 481303
13504 481303 551413 468382 166923 285120 307442 89109 268273 250794 613222 234964
13493 111697 -27514 215220 46352 146877 130190 426556 228599 97106 460596 121410
13482 225320 416623 457293 79709 269467 300845 416139 64979 416211 39808 284392
$$ packed form
13556C24787l921j21973Q5018J09978J73832A28618E8471l603K73141d074C03963
13544D92639j07326K8089A51571J70145A53463K69408A83006J35613k276P1114
13534C87457p8151o8222I9045J90880A19145K13279K6123j38588O1008j29552
13524A51415M26064B64238J82143j42235k1961K38230A48335K5440o0123L03275
13514D16927r522j97500J98918H2132L31977A36217M47525A38981J35161K07161
13504D81303P0110q3031A66923J18197K2322H9109J79164j7479L62428B34964
13493A11697b7514B15220D6352J00525j6687K96366j97957I7106L63490A21410
13482B25320J91303M0670G9709J89758L1378J15294F4979L51232C9808K44584
$$ plain form
13472 284392 238775 -89641 -100774 84993 272073 612478 61476 600317 260459 364510
13462 364510 437217 264439 38511 279406 451644 341176 22844 280786 -3447 325454
13451 139039 376828 317981 135774 -27591 113087 268342 341413 230850 348302 434579
13441 434579 346593 107971 145426 232997 256701 268143 487928 312539 452045 18795 295666
13430 295666 596512 209707 352516 450561 226475 412911 466597 165059 493736 391890
13420 391890 156654 -64892 390380 29297 420605 71060 9674 105083 96765 216129 126860
13409 126860 -90759 209294 113744 249767 -76133 226890 336984 290219 55623 468321
13399 468321 113881 568762 404970 361983 209235 155963 321747 177751 23274 115995
$$ packed form
13472B84392m5617h9641j1133H4993J87080L40405F1476N38841B60459J04051
13462C64510P2707j72778C8511K40895J72238j10468B2844K57942c447C25454
13451A39039K37789n8847A35774b7591A13087J55255P3071j10563J17452Q6277
13441D34579q7986A07971L7455Q7571K3704J1442K19785j75389J39506A8795K76871
13430B95666L00846B09707J42809R8045k24086J86436N3686A65059L28677j01846
13420C91890A56654f4892C90380B9297L91308G1060I674R5409q318J19364q9269
13409A26860i0759B09294r5550J36023g6133B26890J10094m6765E5623M12698
13399D68321A13881M54881j63792m2987j52748n3272J65784j43996B3274R2721
$$ plain form
13389 115995 211481 -36818 284963 285141 345213 234427 196391 67754 211068 376806 264208
13378 264208 179553 -3995 272993 240090 265965 73581 202792 501539 -46194 131179 585670
13367 585670 241632 284019 313452 61053 -28586 278842 90002 424154 79837 469762 279173
13356 279173 132816 367633 -154365 158474 599134 400531 65125 169942 378603 358709
13346 358709 216502 226053 122493 271712 206517 369602 531575 352002 509289 209250
13335 351854 320681 280005 200818 414796 547768 95367 273044 102776 581599 149520
13324 201734 232886 47533 135743 292184 145885 216187 153666 323692 -39946 -125851 305625
13312 375260 369891 88137 443357 247332 431353 344571 -69464 -20875 249669 63782 450262
$$ packed form
13389A15995R5486c6818B84963J78O0072j10786l8036F7754J43314J65738j12598
13378B64208q4655c995B72993l2903K5875G3581J29211K98747d6194A31179M54491
13367E85670B41632M2387K9433F1053b8586B78842I0002L34152G9837L89925j90589
13356B79173A32816K34817a54365A58474M40660j98603F5125J04817K08661j9894
13346C58709j42207R551j03560J49219o5195J63085J61973j79573J57287B09250
13335C51854l1173m0676p9187K13978J32972I5367J77677A02776M78823A49520
13324B01734L1152D7533Q8210J56441A45885P0302o2521J70026c9946q5905C05625
13312C75260n369H8137L55220j96025J84021q6782f9464b0875B49669F3782L86480
$$ plain form
13301 450262 392161 -122275 209541 172373 302869 451284 365666 369604 62853 35559 431288
13290 431288 102842 23268 203575 -34781 142354 -74540 -38420 -148125 43710 261701
13280 261701 2568 224322 113669 32463 74906 331854 483927 -19195 106396 98156 402590
13269 402590 -3976 -53313 135846 300460 345326 -117145 229005 -10052 219453 144598 304142
13258 304142 223769 493502 285578 -1300 -7224 124953 -279038 81347 33675 54338 201343
13247 201343 305053 -123585 189084 100756 318796 194115 -78494 391059 -319151 -30708
13236 -56644 381076 6800 34636 -45713 116249 -73334 486272 496511 330112 32367 -121001
13224 -49111 9437 389308 177371 -14578 -131885 185324 145699 323205 -60559 16927 84303
$$ packed form
13301D50262n8101a22275B09541l7168J30496J48415q5618L938F2853k7294L95729
13290D31288A02842B3268J80307c4781A42354g4540L6120j09705D3710K17991
13280B61701B568K21754j10653C2463M2443K56948J52073a9195A06396q240L04434
13269D02590c976m9337A35846J64614M4866a17145B29005a0052B19453p4855J59544
13258C04142q0373K69733k07924a300n924A24953b79038H1347C3675K0663J47005
13247B01343J03710a23585A89084q8328K18040j24681g8494C91059c19151c0708
13236e6644C81076F800K7836d5713A16249g3334D86272J0239j66399C2367a21001
13224d9111I437L79871A77371a4578j17307A85324l9625J77506f0559A6927O7376
$$ plain form
13213 84303 207160 424996 92376 7156 48843 -14044 153174 176183 198412 214850 223852
13202 223852 109379 -204184 -280102 297691 92688 -1344 98684 110817 34788 214492 -120311
13190 -106326 86433 -46430 313707 277172 376251 197703 -145597 -242824 214527 -82951 435939
13178 69257 206298 207536 149067 55845 -103077 488998 -22690 26587 332637 127474 259269
13167 259269 13304 35016 248159 36971 108662 141569 -73762 165811 307021 -58418 246143
13155 238826 249452 8707 319071 -332953 270161 -52015 -106890 -27316 87541 -80225 -61903
13144 -61903 55350 458526 115622 261002 -86861 101325 -204466 18472 -328548 66736
13133 -187602 338887 138246 290090 -31181 8687 -84646 -307157 -204055 -87920 224377
$$ packed form
13213H4303J22857K17836I2376G156M1687a4044A53174K3009K2229J6438R002
13202B23852A09379b04184p5918B97691I2688a344I8684J2133C4788J79704a20311
13190a06326H6433d6430C13707l6535R9079j78548a45597r7227B14527h2951D35939
13178F9257J37041J238n8469E5845a03077D88998b2690B6587L06050A27474J31795
13167B59269A3304K1712K13143C6971P1691L2907g3762A65811J41210e8418B46143
13155B38826J0626H707L10364c32953B70161e2015n4875b7316H7541h0225J8322
13144f1903E5350M03176A15622J45380h6861A01325b04466A8472c28548F6736
13133a87602C38887A38246J51844c1181H687h4646k22511J03102h7920B24377
$$ plain form
13122 154170 -40952 -28708 206765 -36436 98147 -279008 -172383 269947 6309 187560 -148439
13110 145621 304193 281106 -57956 -67996 342572 -132179 90155 117347 69812 -306960 64126
13098 351119 107587 -61809 52163 233777 185447 -113695 -55410 123977 -49873 118513
13087 299089 84401 180380 326554 344176 -21585 181351 -13630 42151 -22511 -15642 -4361
13075 -41120 430623 192551 -268615 291268 -7115 21670 -6479 -1638 104669 609206 -256703
13063 65828 328868 221049 182755 -64378 57586 -14881 -190294 74516 461181 -108701 77860
13051 98637 411981 -136014 32102 27817 -38848 -163565 38042 246431 296963 -8332 211674
13039 -121046 -50897 250813 354054 70866 323579 38307 -230648 51623 67671 236722
$$ packed form
13122A54170d0952J2244B06765c6436I8147b79008J06625B69947F309J81251a48439
13110A45621J58572k3087e7956j0040C42572a32179I0155K7192m7535c06960F4126
13098C51119A07587f1809E2163J81614m8330a13695e5410A23977d9873A18513
13087B99089H4401R5979J46174J7622b1585A81351a3630D2151b2511O869d361
13075d1120D30623A92551b68615B91268g115B1670f479a638A04669N04537b56703
13063F5828K63040j07819l8294f4378E7586a4881j75413G4516L86665a08701G7860
13051I8637L13344a36014C2102m285c8848j24717C8042K08389N0532h332B11674
13039a21046e0897B50813J03241G0866K52713C8307b30648E1623J6048J69051
$$ plain form
13029 236722 -175456 449489 -3114 551203 202183 -19995 93585 -246575 -104097 159651
13018 293156 132686 478605 -29284 11393 113166 16001 -243502 -178854 126053 103470
13008 103470 -81152 201806 -128347 51225 209785 -144208 89534 9349 124220 391866
12998 391866 392821 174076 137251 -68226 -49060 192048 181627 301343 242329 -225350 -164160
12987 -164160 -50363 -137418 67249 326054 33087 166632 351678 -35534 105760 182016 357126
12976 357126 -18283 -44792 458403 -28461 -172259 -92254 235832 131025 120811 -101566
12965 35775 159366 369025 303849 -214365 237497 294698 145272 50848 -111947 -14896
12954 -401141 120394 -85944 100130 313567 -90491 -260359 -122123 -747 -123457 474422
$$ packed form
13029B36722a75456D49489c114E51203B02183a9995I3585b46575a04097A59651
13018B93156A32686L45919b9284A1393J01773A6001b43502O4648A26053k2583
13008A03470h1152B01806a28347E1225J58560a44208H9534I349J14871K67646
12998C91866R55A74076l6825f8226J9166A92048j0421J19716n9014b25350O1190
12987a64160e0363q7055F7249K58805C3087J33545J85046c5534A05760P6256J75110
12976C57126a8283k6509D58403b8461j43798Q0005B35832j04807j0214a01566
12965C5775J23591K09659o5176b14365B37497N7201A45272E0848a11947a4896
12954d01141A20394h5944A00130K13437i0491j69868a22123g47j22710D74422
$$ plain form
12943 363216 129358 26967 105975 93890 -103748 351255 -98421 87140 -21427 -288746 167924
12931 -2398 46098 131254 107219 241766 208364 258654 48810 1827 -339038 267634 -304468
12919 105446 -383969 236456 280525 -200250 169375 199223 -23087 81466 246006 80515
12908 -118588 280757 381380 -194861 -124801 76546 -184083 -12115 359702 -78943 19970
12897 16456 -300325 -23792 -206312 -215787 -26252 -11680 155964 -224659 106854 263767 201845
12886 201845 186537 -70806 -14904 1282 124867 284726 326998 161688 159581 246488 67695
12874 -190653 215733 369501 116115 103104 94202 53705 201202 291956 35300 271651 106354
12862 243617 163519 -86296 357337 71512 -438118 -247509 -88542 33587 -234001 332221
$$ packed form
12943C63216A29358B6967P9008j2085a03748C51255i8421H7140b1427k67319A67924
12931b398D6098Q5156k4035J34547l3402N0290D8810A827c39038B67634c04468
12919A05446c83969B36456M4069b00250A69375K9848b3087H1466J64540H0515
12908a18588B80757J00623a94861P0060G6546a84083a2115C59702g8943A9970
12897A6456c00325b3792j82520r475b6252a1680A55964b24659A06854J56913o1922
12886B01845j5308g0806a4904A282J23585J59859M2272A61688k107Q6907F7695
12874a90653B15733J53768A16115j3011q902m0497J47497R0754C5300K36351A06354
12862B43617q0098h6296C57337G1512d38118J90609h8542C3587b34001C32221
$$ plain form
12851 -73397 -112297 147220 214175 258932 -9746 -118630 -52353 2975 257904 38785 -91801
12839 -202250 -98055 203409 -85142 249797 209624 326536 -31481 258415 34501 -47605 -187536
12828 -187536 -353327 117923 37538 -210874 145264 -120052 -376553 126402 301738 129603
12817 83573 70949 101570 -108121 25019 -186070 -27331 161225 -203783 -305868 33283 -38517
12805 -76455 -128562 -167231 65786 132667 18203 -65599 -88518 64469 358959 62967 -2530 -50581
12793 -50581 192231 100738 54532 143070 -111590 -102592 574 212176 -239076 -82862 52051
12781 33117 100580 -191167 -29754 43866 -31797 190990 -1445 199785 -227380 -109075 -94446
12770 -94446 -64897 -121953 148173 -203760 48087 93437 -273464 -8415 68880 81789 -125441
$$ packed form
12851g3397l8900A47220O6955M4757i746j08884e2353B975K54929C8785i1801
12839b02250i8055B03409h5142B49797m0173J16912c1481B58415C4501d7605j39931
12828a87536j65791A17923C7538b10874A45264a20052k56501A26402J75336A29603
12817H3573j2624L0621a08121B5019a86070b7331A61225b03783j02085C3283c8517
12805g6455n2107l8669F5786O6881A8203f5599k2919F4469K94490F2967b530m8051
12793e0581A92231r1493m6206Q8538a11590Q998E74K11602b39076h2862E2051
12781C3117O7463a91167b9754D3866c1797A90990a445A99785b27380a09075J4629
12770i4446K9549n7056A48173b03760D8087M5350b73464h415F8880J2909a25441
$$ plain form
12758 -4611 -229354 14007 137222 -110889 -104807 -103683 84968 4337 259232 115749 91099
12747 91099 26131 97164 119014 -6975 21857 -130542 492340 -114045 38688 73367 -97919
12735 278551 163044 134915 -180495 -100492 130439 -226853 -99423 306679 552343 238068
12724 -35283 -154433 -93812 43408 -168846 132418 54657 195831 135995 5342 100410 146618
12713 146618 -188434 28775 79737 101768 385349 70225 -3605 316556 164329 -13507 -27094
12702 -27094 246696 356530 -46627 240123 -42460 -179598 81262 -17271 169079 -191649
12691 33199 129015 181265 156833 -46890 82485 -62754 -86918 -97193 378068 27006 331343
12680 331343 85003 95390 227265 303618 -57131 -22145 65824 103080 114140 40297 131582
$$ packed form
12758d611k24743A4007J23215a10889O082J124H4968D337K54895A15749k4650
12747I1099B6131P1033K1850f975B1857a30542D92340a14045C8688L4679i7919
12735B78551j15507k8129a80495Q0003A30439b26853i9423C06679K45664B38068
12724c5283j19150O0621D3408a68846A32418E4657J41174n9836E342R5068M6208
12713A46618a88434B8775N0962K2031K83581G0225c605C16556j52227a3507j3587
12702b7094B46696J09834d6627B40123d2460j37138H1262a7271A69079a91649
12691C3199R5816N2250k4432d6890H2485f2754k4164j0275C78068B7006L04337
12680C31343H5003J0387J31875P6353e7131b2145F5824L7256J1060D0297R1285
$$ plain form
12669 131582 43978 132933 15793 -206506 -228179 52720 -40992 58354 244418 -153355 -124980
12658 -124980 114 380685 211303 309140 54892 156166 126820 248052 -49270 -511691 -65411
12646 271321 113991 519831 162554 233406 -48267 147813 90159 398522 -207373 375784
12635 73519 67405 206145 415350 208237 130322 48949 157764 42626 149304 -7717 294028
12623 196815 -94884 369976 114733 -27766 89620 -106726 18228 439031 -126754 195398
12612 97744 -184589 -15306 135527 35549 239244 78825 18420 -311481 94408 159756 -15549
12600 168337 11731 302340 318124 132841 430815 -57184 26688 -19095 195503 76369 -31377
12588 24764 26283 257122 -261216 -4870 -152701 -348214 7079 78734 -211524 131672 -184788
$$ packed form
12669A31582D3978Q8955A5793b06506k1673E2720d0992E8354J86064a53355K8375
12658a24980A14L80571j69382R7837E4892J01274k9346J21232d9270m62421f5411
12646B71321A13991M05840A62554P0852d8267A47813n7654L08363b07373C75784
12635G3519o114J38740K09205k07113p7915D8949J08815D2626J06678g717B94028
12623A96815i4884C69976A14733b7766H9620a06726A8228M20803a26754A95398
12612I7744a84589a5306A35527C5549K03695G8825A8420c11481I4408O5348a5549
12600A68337A1731K90609J5784A32841K97974e7184B6688a9095A95503G6369c1377
12588B4764J519K30839b61216d870j47831j95513G079P1655b11524A31672a84788
$$ plain form
12576 68594 -98337 -108295 96699 65056 22463 -83170 35862 -207740 227173 -44215 402709
12564 -76770 2476 187540 102854 45391 417799 508325 237388 186608 -387751 3058 216197
12553 216197 154978 220723 -10690 102005 174931 -143706 -212148 68385 29005 -51241 -254218
12542 -254218 227392 27314 -178924 58919 -205159 70124 -158143 78495 139791 -161823
12531 127491 338530 278682 125515 -79190 212365 98470 19550 -105955 -87111 308900
12520 132768 173100 109381 91834 8574 18417 97015 155430 -619 -104905 108954 -215629 90689
12507 71120 -129725 -290293 -320438 -341794 38290 139824 369797 166092 210975 -39269 -69849
12496 -69849 154054 201245 217685 60209 79349 89972 -173727 188778 -247057 -95673 -242981
$$ packed form
12576F8594i8337r958I6699l1643B2463h3170C5862b07740B27173d4215D02709
12564g6770B476J85064q4686D5391L72408R0526B37388n0780c87751C058K13139
12553B16197o1219O5745a0690A02005P2926a43706o8442F8385B9005e1241k02977
12542b54218B27392B7314a78924E8919b05159G0124a58143G8495O1296a61823
12531A27491K11039n9848A25515g9190B12365I8470A9550a05955J8844C08900
12520A32768M0332o3719j7547H574R843P8598N8415f19j04286A08954b15629I0689
12507G1120a29725j60568l0145k1356C8290J01534K29973A66092M4883c9269l0580
12496f9849A54054M7191J6440F0209J9140J0623a73727A88778b47057i5673j47308
$$ plain form
12485 -242981 213711 -1092 -5007 107443 -11867 226885 -24009 -145786 -275448 -60016 -484799
12474 -484799 -55675 -166053 169527 -208441 -136842 18691 -126835 64244 160191 -143286
12463 31040 235157 -349152 50913 -146148 264341 245040 96085 226166 181912 346517
12453 346517 91797 -45232 -28274 -48047 246954 169976 238149 144227 152253 95900 -239093
12441 -18974 301708 167596 -90563 -106706 213197 -71911 -21678 -121498 -90812 58919 100289
12430 100289 -207376 -292959 -22546 268417 -36248 -68929 -26202 86279 156577 63203 -23541
12418 -90840 -31265 -48250 -51044 196125 179014 -3033 23012 399596 -227051 62975 178566
12407 178566 -105466 159501 -100705 134404 -80270 -45837 299481 212382 -162383 42105
$$ packed form
12485b42981B13711a092l915A07443a1867B26885b4009j21777j29662f0016m24783
12474d84799e5675j10378A69527b08441P1599A8691a26835F4244R5947a43286
12463C1040K04117c49152E0913a46148B64341j9301I6085J30081m4254J64605
12453C46517I1797d5232J6958j9773B46954p6978O8173r3922Q026n6353b39093
12441a8974C01708j34112i0563j6143B13197g1911b1678r9820L0686E8919M1370
12430A00289b07376q5583b2546B68417c6248l2681b6202H6279P0298F3203b3541
12418i0840c1265j6985k794A96125j7111c033B3012L76584b27051F2975J15591
12407A78566a05466A59501a00705A34404h0270L4433B99481q7099a62383D2105
$$ plain form
12396 154513 171955 -10278 47449 23337 -114940 -7023 -44508 354430 172211 5170 -32873
12384 -56037 41179 223418 -332750 408300 249531 214648 -220495 38782 85051 -160680
12373 -175307 -349702 -300985 309948 157711 200599 120635 60653 -142350 95814 -330091
12362 77796 -42713 266871 -255237 341916 -7689 113442 -241896 154701 -2998 97997 -73963
12350 -16531 -134921 -127456 -124468 109995 489328 -13376 -343565 13002 -162574 -60507 139985
12338 -22070 162686 32435 154937 -301859 -176431 45491 -99215 -105740 7860 158332 -130484
12326 -54135 38076 -285656 334821 180557 -155585 350536 601849 -99855 -103679 -70903 -77764
12315 -77764 185433 -250825 -24749 -45131 65126 105084 1061 -340662 -179455 342581 -143253
$$ packed form
12396A54513J7442a0278D7449B3337a14940g023l7485C54430A72211E170c2873
12384e6037D1179J82239c32750D08300j58769l4883b20495C8782M6269a60680
12373a75307j74395M8717C09948j52237M2888p9964n9982a42350I5814c30091
12362G7796d2713B66871b55237C41916g689A13442b41896A54701b998I7997g3963
12350a6531j18390P465K988A09995L79333a3376l30189A3002a62574f0507A39985
12338b2070A62686C2435J22502c01859J25428D5491i9215o525G860J50472a30484
12326e4135C8076b85656C34821j54264a55585C50536K51313i9855l824L2776o861
12315g7764A85433b50825b4749k0382F5126L9958A061c40662J61207C42581a43253
$$ plain form
12303 283942 -167405 162083 -198249 137719 -49548 -222002 -549164 40250 88388 167343
12293 167343 -163791 63800 -92872 -82632 -101972 -235051 242060 -177434 -93202 -171195 218906
12281 263659 208584 208026 -75794 190705 229629 193533 -49809 305420 -3088 182400 294005
12270 294005 402792 137585 206782 89650 18644 -64063 -21397 -129751 167019 -10192 271063
12258 59573 130215 296863 26454 77437 -18482 62984 -3728 165011 302422 247263 -197370
12246 -61762 16362 -183643 59013 -129733 29776 296928 119366 -20195 42085 106996 -17600
12234 -48732 66797 190571 236990 284038 204021 49497 -53135 384836 191614 433872 110108
12222 486105 259548 404755 337539 224913 197132 224972 281061 19002 143044 146345 32181
$$ packed form
12303B83942a67405A62083a98249A37719d9548j72454l27162D0250M8138P8955
12293A67343a63791F3800i2872J0240j9340j33079B42060a77434Q4232p7993B18906
12281B63659n5075n58g5794A90705L8924l6096d9809C05420c088A82400J11605
12270B94005J08787A37585O9197H9650A8644f4063b1397j08354A67019a0192B71063
12258E9573P0642J66648B6454N0983a8482F2984c728A65011J37411n5159a97370
12246f1762A6362a83643E9013a29733B9776K67152A19366b0195D2085O4911a7600
12234d8732F6797J23774M6419M7048q0017D9497e3135C84836A91614K42258A10108
12222D86105k26557J45207o7216j12626k7781K7840N6089A9002J24042L301C2181
$$ plain form
12210 84722 2576 369156 -187986 170676 -162331 101627 83819 137662 500709 152511
12199 18728 -94938 476044 -93134 140340 303298 -48037 300301 43597 344442 -85703 155550
12187 143204 440545 436167 248958 10259 211972 13782 243417 48241 -101276 126468
12176 249033 2907 285054 106811 62995 27939 13321 222686 215526 177025 284718 166054
12165 166054 267161 -162254 338302 185537 -166823 120525 1852 183498 119302 -71822
12154 -82338 154395 61889 457322 -11869 255332 67646 51691 79297 348050 182446 256137
12143 256137 -121168 219646 -67306 -211477 249188 140007 258133 -235428 -180331 -90049
12132 -26911 24441 -13105 320796 233407 32869 -86400 -87533 -34302 -94822 -112084 352871
$$ packed form
12210H4722B576L66580a87986A70676a62331A01627j7808N3843L63047A52511
12199A8728i4938D76044i3134A40340J62958d8037C00301D3597L00845h5703A55550
12187A43204K97341m378j87209A0259K01713A3782K29635D8241a01276A26468
12176B49033B907K82147A06811m3816B7939A3321K09365p160l8501J07693j18664
12165A66054J01107a62254C38302j52765a66823A20525A852J81646o4196g1822
12154h2338A54395F1889L95433a1869B55332F7646j5955K7606K68753j65604P3691
12143B56137a21168B19646f7306j44171B49188j09181J18126b35428N5097i0049
12132b6911B4441a3105C20796q7389C2869h6400j133c4302o0520j7262C52871
$$ plain form
12120 -4351 8611 98783 38581 -14784 113148 -59679 219822 254479 168575 -187776 273405
12108 -392614 -187300 -52275 88937 121745 -14984 155803 -216097 196098 -105639 -207890
12098 -207890 88967 -200084 9609 -282664 -20097 35512 -93056 -160154 -96242 165937 -309818
12086 -54088 113049 -195979 31827 170329 -854 -75611 28791 -300729 256559 4228 168763
12075 168763 509118 1410970 1846180 299182 296573 -52569 35737 135878 -242939 428429
12064 -270603 46124 32164 56465 -110624 23717 257638 286907 -191913 158281 34090 54136
12053 54136 2604 -98259 -124587 69028 17034 364563 105315 450512 -190066 -37572 -106712
12042 -106712 -150272 80189 -50238 207418 1981 175953 -113462 137234 70929 -171600 68840
$$ packed form
12120d351H611R0172C8581a4784A13148e9679B19822L4657q5904a87776B73405
12108c92614a87300e2275H8937L2808a4984A55803b16097A96098a05639j02251
12098b07890H8967b00084I609b82664b0097C5512i3056o7098O3912A65937c09818
12086e4088A13049a95979C1827J38502h54p4757B8791c00729B56559D228J64535
12075A68763L40355R01852M35210B99182k609e2569C5737J00141b42939D28429
12064b70603D6124j3960K4301a10624B3717K33921K9269a91913A58281C4090K0046
12053E4136B604i8259k6328F9028A7034L47529A05315L45197a90066c7572o9140
12042a06712m3560H0189e0238B07418A981J73972a13462A37234o6305a71600F8840
$$ plain form
12030 -99819 72404 -303659 -74059 301792 -53918 -147672 -185948 181704 -25364 -25827 179031
12018 -8872 27806 -43828 -72902 65636 161195 -88149 -9210 -15274 92539 151805 -19490 -27420
12006 -27420 218046 -191632 -132027 -256488 -74288 67109 159797 23931 39017 -192814 128699
11994 -18344 362230 -107224 -287103 92891 95858 -5796 127045 -240231 -325736 153828 157271
11983 157271 180240 -206492 57441 66666 -255258 -28026 19335 174153 201295 -3643 -8089
11972 -8089 -218591 -16169 14240 -105608 34383 -3970 -277903 -88743 -399176 156616 -28053
11960 80820 52223 -47672 -168726 116095 -148042 -150635 -278295 384319 429668 28816 67580
11949 67580 114405 -12263 79877 253329 97765 232692 -49118 66359 -33832 -209366 -151766
$$ packed form
12030i9819G2404c03659g4059C01792e3918r3754l8276A81704b5364m63A79031
12018h872B7806d3828k9074F5636R5559h8149i210o064I2539N9266a9490p930
12006b7420B18046a91632N9605j24461g4288F7109R2688B3931J5086a92814A28699
11994a8344C62230a07224j79879I2891K967e796A27045b40231q5505A53828L443
11983A57271K2969b06492E7441R225b55258b8026A9335J54818K7142c643m446
11972h089k10502a6169A4240a05608C4383c970k73933h8743l10433A56616b8053
11960H0820k8597d7672j21054A16095a48042k593j27660C84319M5349B8816L8764
11949F7580M6825a2263G9877J73452I7765J34927d9118F6359c3832j75534N7600
$$ plain form
11938 -151766 -4827 71031 -104194 -121316 -83502 134736 -140207 156558 -206073 215495
11927 126756 117584 -341839 -23245 -241353 -56224 90375 -40336 -9353 -13482 89865 -275231
11915 -184711 56560 42991 -179346 -204600 -82711 -118408 -161319 -371954 124158 -53710 -126226
11904 -126226 -57664 -460463 89469 -171815 241683 248908 -206306 188180 161156 122767 174817
11893 174817 5303 230800 227006 65900 102365 -71495 61322 322011 -8037 66921 -183258
11881 147797 -175494 -186349 145944 84193 152222 25327 -771 216180 -88561 -74663 -112398
11870 -112398 68816 109647 -213890 -62407 2472 -119998 -36603 81863 -125122 -123039 -375011
11859 -375011 399055 68219 86467 -120196 -69229 124764 292845 59158 -178268 73000
$$ packed form
11938a51766d827G1031a04194j7122L7814A34736a40207A56558b06073B15495
11927A26756r172c41839b3245k18108e6224I0375d0336i353m129H9865b75231
11915a84711E6560j3569a79346k5254h2711l5697m2911k10635A24158e3710p2516
11904a26226e7664m02799H9469a71815B41683P225b06306A88180k7024l8389N2050
11893A74817E303K25497l794F5900L6465g1495F1322K60689h037F6921a83258
11881A47797a75494j0855A45944o1751O8029B5327g71B16180h8561J3898l7735
11870a12398F8816M0831b13890f2407B472a19998c6603H1863a25122K083k51972
11859c75011C99055F8219J8248a20196N0967A24764J68081E9158a78268G3000
$$ plain form
11848 -35182 -229750 143862 278123 -101910 125864 -186538 -382273 -29276 279144 397182
11838 397182 57869 258061 68460 -3148 63003 -279541 -191519 -94466 67777 -88279 -285780
11827 -285780 257698 155 -86426 -293914 165549 -203274 -106013 33768 -1517 246845 160449
11816 160449 7582 -182297 -118204 297671 -131063 -148562 -81739 156466 -75230 -75072 -197676
11805 -197676 -62106 68233 -138170 -183150 -114413 196296 53042 1074 45402 236668 -229484
11793 -249005 173156 -94311 19092 -260195 -109894 -82470 135345 -212087 -327273 -205525
11783 -205525 -44537 54188 191596 -148109 -157524 -54663 -4488 219019 -186523 -222140 -194081
11772 -194081 11787 93115 -298486 -54213 -44324 -14453 -167453 -59194 3455 300025 -7154
$$ packed form
11848c5182j94568A43862J34261a01910A25864a86538j95735b9276B79144J18038
11838C97182E7869K00192F8460c148F3003b79541Q8022i4466F7777h8279j97501
11827b85780B57698A55h6426k07488A65549b03274R7261C3768a517B46845q6396
11816A60449G582a82297O4093B97671a31063j7499O6823A56466g5230J58j22604
11805a97676f2106F8233a38170m4980O8737A96296E3042A074M4328J91266b29484
11793b49005A73156i4311A9092b60195a09894K7424A35345b12087j15186J21748
11783b05525d4537E4188J37408a48109r415e4663d488B19019a86523l5617K8059
11772a94081A1787Q1328b98486e4213R889a4453j53000e9194C455K96570g154
$$ plain form
11760 119919 -37808 -64508 67977 137642 318773 170431 -139368 -384217 50047 -144745
11749 6489 104867 -27263 193012 -72313 90159 -164986 81765 131463 67501 83254 45952
11738 45952 -44614 75508 160455 -75599 697224 -226530 -75714 280542 -25580 34934 -87752
11726 83316 37067 -256580 146128 19621 97520 -306571 608249 -5783 265069 -35178 -126866
11715 -126866 155090 72158 116957 185695 110483 130618 -183081 -12654 269769 85770 219936
11704 219936 34355 320768 -8026 18925 -236032 -28315 -28907 -253485 -627 -35037 105413 -39631
11691 111149 -54004 -111547 -61951 28761 -133973 307926 202506 133527 58266 -94920 340947
11679 -184480 186822 -146754 -94149 217902 86619 121123 -261431 239174 26111 97122
$$ packed form
11760A19919c7808k6700F7977O9665J81131j48342a39368k44849E0047a44745
11749F489R8378b7263A93012g2313I0159a64986H1765M9698o3962J5753l7302
11738D5952d4614G5508Q4947g5599F97224b26530g5714B80542b5580C4934h7752
11726H3316C7067b56580A46128A9621P7899c06571F08249e783B65069c5178r1688
11715a26866A55090G2158M4799O8738p5212K0135a83081a2654B69769H5770J34166
11704B19936C4355K86413h026A8925b36032b8315n92k24578f27l4410A05413c9631
11691A11149e4004n7543M9596B8761a33973C07926j05420o8979E8266i4920C40947
11679a84480A86822a46754N2605B17902H6619L4504b61431B39174B6111P1011
$$ plain form
11669 97122 -60516 291375 -88560 51390 28803 -204185 -72383 -42930 294593 -15518 9563
11657 19286 1290 -66011 -85423 124334 -209586 377 618914 302217 55357 83541 185115
11646 185115 42879 -3153 221627 -256967 152109 20031 -62686 20691 -60895 132848 166051
11635 166051 54266 -22028 -193621 -154371 30197 -7042 136372 -73662 283136 -164042 -31192
11623 -86753 107306 242533 36620 47900 343590 -69040 -30398 75377 348592 141996 81419
11612 81419 35686 -151097 -139077 43209 235539 93413 -33573 199047 -77554 175720 -155870
11600 109156 -157008 35225 -36172 -62491 69942 -91676 362346 -128307 -567 8256 131925
11589 131925 55009 -49013 -41710 74650 1196 39737 309998 157434 222963 270342 277558 173088
$$ packed form
11669I7122f0516B91375h8560E1390k2587b04185g2383K9453B94593a5518I563
11657A9286A290f6011j9412A24334b09586C77O18537C02217E5357K8184J01574
11646A85115D2879c153B21627b56967A52109B0031f2686B0691f0895A32848L3203
11635A66051E4266b2028j71593L9250C0197g042A36372g3662B83136a64042c1192
11623h6753A07306J35227C6620J1280K95690f9040c0398G5377K73215A41996o0577
11612H1419C5686a51097J2020D3209J92330I3413c3573A99047g7554A75720a55870
11600A09156a57008C5225c6172k6319F9942i1676C62346a28307e67H256J23669
11589A31925E5009d9013P303G4650A196L8541K70261j52564O5529M7379P216j04470
$$ plain form
11577 173088 133831 182834 -100494 218436 -55027 265954 92048 369139 35033 22240 234404
11566 234404 -38157 -340211 703 -13629 82898 196063 338431 -26577 466683 74831 -217326
11554 -94545 239397 -31556 -14510 276257 89232 145816 -34007 63591 261448 -291419 235857
11542 -8061 279471 54264 85714 450778 351596 231393 126321 -201488 -39435 117776 12192
11530 176643 447961 310801 304978 -11299 419075 209174 230087 135612 283284 25954 51067
11519 51067 472434 91024 -53442 194344 55210 103931 365735 108370 252327 355696
11509 355696 20333 -44984 198464 285587 -175481 -172030 84990 150556 -387140 260711 15245
11497 75326 175766 169372 389792 -1406 200214 -284455 54548 96647 157453 127723 134887
$$ packed form
11577A73088l9257M9003a00494B18436e5027B65954I2048K77091C5033j2793K12164
11566B34404c8157l02054G03a3629H2898J13165J42368b6577D66683G4831b17326
11554i4545B39397c1556a4510B76257H9232N6584c4007F3591J97857b91419B35857
11542h061B79471E4264L1450L65064r9182j20203j05072b01488c9435A17776A2192
11530A76643K71318j37160n823a1299D19075B09174K0913r4475J47672B5954K5113
11519E1067M21367I1024e3442A94344E5210M8721K61804A08370J43957J03369
11509C55696B0333d4984A98464Q7123a75481L451H4990O5566c87140B60711A5245
11497G5326J00440o394K20420a406B00214b84455E4548M2099O0806k9730P164
$$ plain form
11486 134887 76504 334857 425007 -104485 -108649 -17125 34354 137649 235645 75369 27314
11474 349856 10234 -283759 -26938 289119 113582 209045 149919 -174394 373234 528758
11464 528758 31436 -136724 230112 190648 273220 -24043 -283919 284082 -36532 108628
11453 152642 -209380 158858 240206 33309 -18210 293355 -41355 244392 135084 -154266
11442 283156 183344 247417 199452 -13925 12287 8436 -12522 41310 531767 99597 215397
11431 215397 387269 35873 -57267 -168740 -214492 84715 124528 -68182 127215 -169192 -67152
11419 -67456 10816 -43933 -263906 -84985 5361 285364 -93960 -164511 -44051 23292 22089 -26151
11406 -19769 -195531 37703 -43176 126010 397054 -32399 130953 43680 3677 23899 -33767
$$ packed form
11486A34887n8383K58353R0150a04485m164a7125C4354J03295R7996G5369B7314
11474C49856A0234b83759b6938B89119A13582R5463n9126a74394C73234J55524
11464E28758C1436a36724B30112l9464Q2572b4043k59876B84082c6532A08628
11453A52642b09380A58858Q1348C3309a8210B93355d1355B44392j09308a54266
11442B83156r9812O4073m7965a3925A2287l851a2522D1310M90457I9597J15800
11431B15397J71872C5873e7267j11473m5752H4715L9813f8182A27215a69192f7152
11419f7456A0816d3933k19973h4985E361K80003i3960p0551d4051B3292j203b6151
11406a9769j75762C7703d3176A26010K71044c2399A30953D3680C677K0222c3767
$$ plain form
11394 110191 -192287 163414 -74398 2433 85858 -225296 171442 204976 -177228 56331 -297649
11382 158240 163431 -84854 -48074 52653 65586 206389 145292 68009 14310 240103 -133342
11370 -122932 134641 -47322 10739 8439 18898 156366 -97738 -323294 -265770 125736 47379
11358 -250753 -171129 -124588 162423 -129543 280564 -313359 -180838 -129360 101577 36971
11347 -68724 112858 215543 99123 198979 267040 -244386 122799 27005 -269412 149679
11336 -9210 -359458 -50938 -45409 13869 22371 -114311 9125 -13725 -330784 169255 32978 -272949
11323 -162975 12658 74363 242294 158585 73673 125937 180311 95183 132557 -237304 312873
11311 25968 6218 -32339 -130440 -5891 7336 -12889 203052 8189 -203692 -38676 115877 86676
$$ packed form
11394A10191a92287A63414g4398B433Q3425b25296A71442L3534a77228E6331b97649
11382A58240N191h4854L6780E2653J2933J40803o1097F8009A4310K25793a33342
11370a22932A34641d7322A0739k300J0459J37468i7738k25556N7524A25736D7379
11358b50753P9624M6541A62423a29543B80564c13359J32521N1478A01577C6971
11347f8724A12858J02685I9123R9856O8061b44386A22799B7005b69412A49679
11336i210l50248e0938N529A3869Q502a14311I125a3725l17059A69255C2978b72949
11323a62975A2658O1705J67931q3709G3673N2264N4374q5128L7374b37304C12873
11311B5968F218c2339r8101e891G336a2889B03052H189b03692c8676A15877k9201
$$ plain form
11299 86676 500473 16650 128159 -283372 -37974 -54585 -122300 -37323 -117191 82489 -64780
11287 -73407 -67935 34831 61282 3876 -35522 -83253 -72325 33585 -262497 187244 -189011
11275 124892 -391617 50578 -3833 -109332 -53827 35538 -85004 48904 28138 -378222 -65587
11263 14433 389471 163004 -30123 -128049 -379684 -303324 -326554 297483 47574 -178437 -387013
11252 -387013 341053 -274585 5947 -206495 153648 15767 -12236 5285 -186204 43762 -353129
11240 -108263 -455568 -211771 -174931 -84573 -56574 422409 -55073 -29755 -271768 -112312
11229 148545 211371 -136587 80516 -375875 -113339 58590 148469 59940 -8664 -32133 68412
11217 -56730 -102452 -136457 -56005 96558 122821 167389 37719 2394 -15905 -85390 2361 42389
$$ packed form
11299H6676M13797A6650J11509b83372c7974j6611o7715c7323p9868H2489f4780
11287g3407N472C4831K6451C876c5522m7731J0928C3585b62497A87244a89011
11275A24892c91617E0578c833j05499e3827C5538h5004D8904k0766c78222f5587
11263A4433L75038A63004c0123r7926k51635P6360k3230B97483D7574a78437k08576
11252c87013C41053b74585E947b06495A53648A5767a2236E285a86204D3762c53129
11240a08263l47305b11771L6840h4573K7999D22409e5073K5318k42013a12312
11229A48545O2826a36587H0516c75875a13339E8590Q9879E9940h664k3469F8412
11217e6730m5722l4005e6005I6558K6263M4568C7719B394a5905o9485B361M0028
$$ plain form
11205 42389 -138072 199456 -212587 235870 -145802 -526453 -267164 -186902 -93447 191500
11194 -295080 -212632 33897 385307 42527 170445 -24725 -62723 -260877 187114 463035
11184 463035 -429024 -153339 96841 113968 194395 -87418 -110776 -80604 100612 -214813 131606
11172 -188601 204610 -126244 28157 338864 -180246 88413 325096 -217949 -779 -135511
11162 -135511 25473 80080 103690 -38506 32684 41860 12489 -60799 54813 70548 244509
11151 244509 262803 99089 -96030 -211870 -58611 -155921 249823 -196540 264287 49544 69349
11140 69349 -209525 169755 -173371 -68795 59861 229931 17649 -42613 -276739 116605
11129 36568 -43269 10339 209149 244995 331162 -91533 211169 -251791 93986 166338 -63722
$$ packed form
11205D2389a38072A99456b12587B35870a45802l80651K59289Q0262i3447A91500
11194b95080Q2448C3897L51410D2527J27918b4725l7998j98154A87114K75921
11184D63035d29024a53339I6841J7127Q0427h7418k3358L0172A00612b14813A31606
11172a88601B04610a26244B8157L10707a80246H8413K36683b17949g79j34732
11162a35511B5473N4607K3610c8506C2684R176A2489f0799E4813J5735J73961
11151B44509J8294I9089i6030j15840e8611r7310B49823a96540B64287D9544J9805
11140F9349b09525A69755a73371f8795E9861J70070A7649d2613k34126A16605
11129C6568d3269A0339J98810L5846Q6167i1533B11169b51791I3986P2352f3722
$$ plain form
11117 372906 172562 126215 136957 -9385 172009 83460 -109350 -10413 -91250 60990 -206613
11105 212312 -2857 476517 -137557 -92167 213149 358414 171395 -34619 -122450 447589
11094 -7120 146733 -136654 249850 69506 309829 89517 225427 115552 321108 302315
11084 302315 49671 83743 219470 412500 294678 189803 107531 19245 348613 318744
11074 318744 23495 273894 702764 233913 340208 273904 727432 140833 402461 615118
11064 615118 546726 266217 403001 537655 425947 409117 450773 786075 757139 527637
11054 527637 496411 685343 612586 563584 513114 853876 585700 603686 781838 491602
11044 491602 927538 524693 828708 371259 596215 1131116 897154 621307 983544 694544
$$ packed form
11117C72906A72562m6347J0742i385A72009H3460a09350a0413q0837F0990b06613
11105B12312b857D76517a37557M5390B13149J45265A71395c4619q7831D47589
11094g120A46733a36654B49850F9506K40323H9517J35910j09875K05556j8793
11084C02315D9671L4072J35727J93030j17822j04875q2272A9245L29368k9869
11074C18744B3495K50399M28870B33913J06295o6304M53528A40833K61628K12657
11064F15118o8392B66217J36784J34654j11708j6830M1656L35302k8936k29502
11054E27637l1226J88932p2757m9002n0470L40762k68176J7986J78152k90236
11044D91602M35936m02845L04015C71259K24956N34901k33962k75847L62237k89000
$$ plain form
11034 694544 1016210 658261 379402 353875 459051 329326 1160680 1025357 762649 795799
11024 795799 606144 930655 723521 529902 704632 668095 712398 721277 868249 585030
11014 585030 293261 586714 616813 763112 447860 529471 685797 713701 663638 603261
11004 603261 711088 800208 655959 667722 420100 518487 506811 862699 660053 1089134
10994 1089134 404772 595176 882141 831689 801853 928459 1028462 887416 1130419 1220197
10984 1220197 923258 1036667 1244701 1256582 1478000 1252231 1487095 1471329 1572629 2253555
10974 2253555 2408983 2905679 3016346 2755780 3223580 3059839 2536416 2438471 2004724 1693556
10964 1693556 1607926 1585245 1644262 1759666 1526294 1622060 1898264 1615034 1657319 1878906
$$ packed form
11034F94544L21666l57949k78859k5527J05176j29725Q31354j35323k62708L3150
11024G95799j89655L24511k07134j93619J74730l6537M4303Q879J46972k83219
11014E85030k91769K93453L0099J46299l15252Q1611J56326K7904n0063o0377
11004F03261J07827Q9120j44249J1763k47622R8387j1676L55888k02646M29081
10994A089134D04772J90404K86965n0452k9836J26606J00003j41046K43003Q9778
10984A220197k96939J13409K08034J1881K21418k25769K34864j5766J01300O80926
10974B253555J55428M96696J10667k60566M67800j63741n23423r7945m33747l11168
10964A693556q5630k2681N9017J15404k33372R5766K76204k83230M2285K21587
$$ plain form
10954 1878906 1504998 1265852 1223636 840009 1058770 529609 628954 217090 273471 559609
10944 559609 387539 259675 150661 139304 218486 248681 308060 268874 66452 219213 230680
10933 230680 306367 80069 -239598 -9025 -336911 -47878 45411 -124990 83545 -130389 -217220
10922 -217220 -3931 -79545 306018 338452 -117944 193065 132700 -187765 -44721 127321 162964
10911 162964 229296 -157068 183780 -8003 169815 32034 171891 43737 -333565 -321641 96923
10899 -198499 258235 -145300 -127946 213797 62213 79464 174177 212417 92990 137152 -38865
10887 -405913 -127960 102371 106261 103146 184257 -126397 -168154 127571 -189253 86953 -109239
10875 -39901 -54815 -244752 23714 -146140 -172552 48199 -144933 -38948 -124224 -413546 -199534
$$ packed form
10954A878906l73908k39146m2216l83627K18761n29161R9345B17090N6381K86138
10944E59609j72070j27864j09014j1357P9182L0195N9379l9186F6452J52761J1467
10933B30680P5687H0069b39598i025l27886d7878D5411a24990H3545a30389q6831
10922b17220c931p5614C06018L2434a17944A93065o0365a87765d4721A27321L5643
10911A62964O6332a57068A83780h003A69815C2034J39857D3737c33565J1924I6923
10899a98499B58235a45300J7354B13797F2213J7251R4713L8240I2990M4162c8865
10887d05913a27960A02371L890l115Q1111a26397m1757A27571a89253H6953a09239
10875c9901j4914j89937B3714a46140k6412D8199a44933c8948q5276k89322a99534
$$ plain form
10863 280142 281895 260513 258297 869 -182371 52066 -21635 -116178 35656 100761 33417 -107446
10850 -393871 -15055 141243 -183991 48124 84287 83992 100587 -92895 155701 -24525 -50329
10839 -50329 -91944 84926 -395586 -23012 -216171 60610 -241477 135843 -161264 41494 -27672
10827 -258586 161078 452887 51796 -187557 -19724 -156624 338273 -225343 -128437 -118975
10817 -118975 271322 47100 -18744 -100944 263508 -359974 175660 -104360 226939 28997
10806 106022 -225416 -199731 197040 -367551 -101068 -1894 129775 -1971 -102137 376232
10795 -297161 -334485 -502517 -49018 236879 -149840 2853 64385 -88594 -74591 189634 -219891
10783 57513 -85750 -86468 154345 -288865 59594 -188265 76418 103173 -30258 -83482 2603 18983
$$ packed form
10863B80142J753k1382k216H69a82371E2066b1635r4543C5656O5105C3417a07446
10850c93871a5055A41243a83991D8124L6163k95J6595i2895A55701b4525k5804
10839e0329m1615H4926c95586b3012j93159F0610b41477A35843a61264D1494b7672
10827b58586A61078K91809E1796a87557a9724j36900C38273b25343R6906R462
10817a18975B71322D7100a8744q2200B63508c59974A75660a04360B26939B8997
10806A06022b25416K5685A97040c67551a01068a894A29775a971j00166C76232
10795b97161l7324j68032d9018B36879a49840B853O1532h8594J4003A89634b19891
10783E7513h5750p18A54345b88865E9594a88265G6418K6755c0258n3224B603J6380
$$ plain form
10771 18983 53656 5466 132720 -126837 -54227 -160941 -118804 -66470 157979 -113277 -34519
10759 -131292 6218 -47588 8555 357449 -90107 92723 165856 -89174 -30316 111455 -83597
10747 -132412 108599 186428 82596 141294 340285 108358 -36526 -96315 -356754 19866 -176234
10735 175456 193175 -262903 517725 83600 -248831 7895 370302 -66809 23904 -3069 -53805
10724 -53805 -107769 9977 -1554 -165175 -157811 -103914 59107 -19011 38938 1192 -180404 5805
10711 -6215 60460 -283853 -10650 -17766 -341824 -307894 263830 33581 177122 -204529 23810
10699 -97351 48229 37806 -101519 -167480 -400017 -124947 -148704 -228632 17282 -35558 -60813
10688 -60813 -23812 -214753 -178309 -76664 298471 -291334 -148718 -34698 -185561 14371 -253938
$$ packed form
10771A8983L4673E466J27254a26837e4227j06714M2137N2334A57979a13277c4519
10759a31292F218d7588H555L48894i0107I2723P3133h9174c0316A11455h3597
10747a32412A08599P7829H2596N8698J98991A08358c6526n9789k60439A9866a76234
10735A75456J7719b62903E17725H3600b48831G895L62407f6809B3904c069n0736
10724e3805n3964I977a554j63621P364N3897E9107a9011C8938A192a80404E805
10711f215F0460b83853a0650p116l24058L3930B63830C3581J43541b04529B3810
10699i7351D8229j0423a01519o5961k32537a24947k3757p9928A7282c5558k5255
10688f0813b3812j90941L6444g6664B98471b91334J42616c4698j50863A4371b53938
$$ plain form
10676 -42854 155629 -152749 -127050 49659 7985 10941 110147 -148359 44107 -379606 -283484
10665 -283484 42875 -375247 87086 -187407 -229960 -270071 42105 -31409 -149238 208505 -8520
10653 57017 -191819 98741 -244152 -132787 203195 -363850 -120314 91660 268238 29355
10642 41850 -79963 -9044 163129 -40678 -129237 -24297 -357756 -73569 -29065 -213272 59132
10630 96258 -366964 172101 129886 35906 -56210 -560245 -119275 14599 -90884 -167980 321136
10618 94940 -203894 -372614 -168610 -140279 197990 -308339 236287 -118663 -97581 -241061
10608 -241061 96834 -83309 50326 -121557 117593 32353 -239695 67423 109752 -58451 27551
10596 -74848 328276 -68319 -30529 -177080 155829 -290455 -79079 -163678 36153 210470 171057
$$ packed form
10676d2854A55629a52749K5699D9659G985K956R9206a48359D4107c79606R6122
10665b83484D2875c75247H7086a87407m2553m0111D2105c1409j17829B08505h520
10653E7017a91819I8741b44152J11365B03195c63850a20314I1660J76578B9355
10642D1850g9963i044A63129d0678q8559b4297l33459g3569b9065j84207E9132
10630I6258c66964A72101m2215C5906e6210n04035a19275A4599i0884p7096C21136
10618I4940b03894j68720a68610K8331A97990c08339B36287a18663K1082j43480
10608b41061I6834h3309E0326a21557A17593C2353b39695F7423M2329e8451B7551
10596g4848C28276f8319c0529j46551A55829b90455g9079q4599C6153J74317l9413
$$ plain form
10585 171057 187614 56197 153314 -1879 170640 -298581 55027 -187548 -239961 100311 -227720
10573 -111476 -304251 62765 -4635 67702 283523 -86680 138009 -4468 105708 -153827 -253607
10562 -253607 98333 24059 -41427 -264795 -9667 260800 15701 93654 -29971 199877 -232104
10550 -250257 170366 -68061 -13061 -29118 -74272 312239 326874 39348 -38842 211094 67841
10538 -130359 -90606 -517403 -15274 -154594 -335074 36274 -76978 -59128 -485243 14107 -119973
10526 144815 -201846 -90355 21441 186222 -218870 -209087 105485 138855 116636 78177 168913
10515 168913 -8794 -248843 52765 119044 -2603 47647 231430 14225 -233544 -151921 79715
10503 -162205 -293040 -30563 -140864 -109036 -151651 -193836 -206312 -34770 259999 -278237 14580
$$ packed form
10585A71057J6557E6197R7117a879A70640b98581E5027a87548n2413A00311b27720
10573a11476j92775F2765d635F7702K15821h6680A38009d468A05708a53827r9780
10562b53607I8333B4059d1427k23368i667B60800A5701P7953b9971A99877b32104
10550b50257A70366f8061a3061j6057m5154C12239J4635C9348c8842B11094F7841
10538a30359L9753m26797a5274j39320j80480C6274g6978J7850m26115A4107a19973
10526A44815b01846i0355B1441J64781b18870R783A05485L3370k2219l8459R0736
10515A68913h794k40049E2765O6279b603D7647J83783A4225b33544Q1623G9715
10503a62205j30835c0563j10301L1828m2615m2185j2476c4770B59999b78237A4580
$$ plain form
10491 -43840 -82475 124707 -466499 57409 235069 -366368 -69415 345316 240380 268405
10481 268405 315483 527249 311605 166577 33999 86893 183000 160202 134477 -168003 -136092
10470 -136092 184969 65186 154208 -42742 294530 -156346 -158421 162800 81760 -34069 -61110
10459 -61110 -28893 -84419 -27550 -320360 254139 110108 -112513 -105471 334767 -102395 86179
10447 -118750 -124565 75493 -97332 109545 -107740 68156 -95602 281006 -14255 213522 220707
10436 220707 -202896 -374230 -280709 -22469 78050 81503 27462 -109932 99092 -179100 239400
10424 173386 363622 61720 31801 13786 -88553 -305160 -107303 131802 96894 -35813 -105104
10413 -105104 263710 -65418 82531 109819 -172628 -167822 -40072 -130972 121505 -35931 -213163
$$ packed form
10491d3840l8635A24707d66499E7409J77660c66368f9415C45316j04936K8025
10481B68405M7078K11766k15644j45028C3999N2894R6107k2798k5725a68003L1911
10470a36092A84969F5186Q9022d2742B94530a56346k075A62800q1040c4069k7041
10459f1110b8893n5526b7550k92810B54139A10108a12513P042C34767a02395H6179
10447a18750n815G5493i7332A09545a07740F8156i5602B81006a4255B13522P185
10436B20707b02896j71334R3521b2469G8050L453B7462a09932I9092a79100B39400
10424A73386J90236F1720k9919A3786h8553k16607a07303A31802l4908c5813o9291
10413a05104B63710f5418H2531K7288a72628M806d0072r0900A21505c5931j77232
$$ plain form
10402 -213163 58076 -256430 -136702 -99064 166752 -5745 58608 168779 36612 -184021 -112267
10391 -112267 405080 180885 337305 -70819 -90787 -227108 123650 32036 156871 -222354
10380 -1384 334759 122525 135736 269569 429049 55071 152640 144845 260542 367380 618123
10369 618123 369508 209485 417977 663360 563694 443061 326448 275024 1844 18957
10359 18957 331350 127342 153435 246866 -151133 430201 101459 618718 582385 626488
10349 626488 125939 555528 383621 197582 306571 117304 315398 329311 203146 373996
10339 373996 389602 199711 343129 124178 60052 24150 339471 219072 24448 -202171
10328 -191203 32273 -16558 255046 249780 173230 491378 100732 72150 229246 198252 542006
$$ packed form
10402b13163E8076b56430J19728L7638A66752e745E8608J10171C6612a84021P1754
10391a12267D05080A80885J56420g0819j9968j36321A23650C2036J24835b22354
10380a384C34759A22525J3211J33833J59480E5071R7569p795J15697J06838K50743
10369F18123k48615j60023K08492K45383r9666j20633j16613n1424A844J7113
10359A8957L12393A27342K6093R3431a51133D30201A01459N17259l6333M4103
10349F26488A25939M29589j71907j86039J08989A17304J98094J3913j26165J70850
10339C73996J5606j89891J43418A24178F0052B4150L15321j20399B4448b02171
10328a91203C2273a6558B55046n266p6550L18148A00732k8582J57096l0994L43754
$$ plain form
10317 542006 53175 399433 129643 137011 -38075 27683 -29928 133697 12699 -266554 -443593
10306 -443593 140462 75000 -5142 216637 33073 -63621 184321 74911 34796 118323 237432
10295 237432 -49401 137618 19178 236874 -48727 -233120 -215595 -299633 -85076 -23775 63040
10283 100918 31949 -131510 245240 100406 -156245 -142529 66700 -23799 -250051 201633
10272 84059 -22565 -157768 166559 -164946 6696 -313781 150169 187943 -63035 208725 326662
10261 326662 258967 324731 159347 145322 188401 106342 36990 226400 36454 548146 313223
10250 313223 -458980 218245 -259845 -271627 125822 -177336 -388988 -127071 -108307 -151819
10240 -151819 -274868 -81852 -81582 118852 -218690 324278 -56623 66516 -104834 34806 -174511
$$ packed form
10317E42006E3175L46258A29643P368c8075B7683b9928A33697A2699b66554j77039
10306d43593A40462o5462e142B16637C3073f3621A84321G4911C4796Q3527J19109
10295B37432d9401A37618A9178K17696d8727j84393J7525q4038h5076b3775F3040
10283A00918C1949a31510B45240A00406a56245J3716F6700b3799k26252B01633
10272H4059b2565j35203A66559a64946F696c13781A50169L7774f3035B08725J17937
10261C26662o7695O5764A59347j4025M3079q2059C6990J89410C6454N11692k34923
10250C13223d58980B18245b59845j1782A25822a77336k11652a27071J8764m3512
10240a51819j23049h1852K70A18852b18690C24278e6623F6516a04834C4806a74511
$$ plain form
10228 60320 -227707 52421 -1098 110372 90018 -94642 -60013 77655 57083 -159750 -84235
10217 -84235 -98718 -35147 -102448 -74263 -30745 71575 50404 125931 236440 169428 -20944
10205 -33879 244372 203899 146693 -29832 -131742 -42084 -94870 -2729 -426740 136623 852
10193 38603 -120832 -169377 -99500 220361 -195275 166632 -180477 -92419 149628 -85553
10182 -326885 -197540 -83679 -21347 85237 -282732 -282874 10064 127562 117991 -217651 157669
10170 -180281 119295 -279313 -293039 -17990 -273105 166079 -2299 71876 -31004 -328524 -223177
10159 -223177 -136192 -11124 139575 -117731 -83399 -92688 401047 -287579 -270058 62949 -240715
10147 -72720 -202513 -73574 286271 -181378 -215108 80245 -168248 32044 -101705 -48150 16354
$$ packed form
10228F0320b27707E2421a098A10372k0354i4642L4629G7655k0572a59750P5515
10217h4235j4483c5147o7301K8185c0745G1575k1171P5527J10509o7012b0944
10205c3879B44372m0473n7206b9832j01910d2084n2786b729m24011A36623H52
10193C8603a20832m8545O9877B20361a95275A66632a80477Q8058A49628h5553
10182c26885J29345h3679b1347H5237b82732j42A0064J17498r571b17651A57669
10170a80281A19295b79313j3726a7990k55115A66079b299G1876c1004k97520J05347
10159b23177Q6985a1124A39575a17731L4332r289D01047b87579J7521F2949b40715
10147g2720j29793g3574B86271a81378l3730H0245a68248C2044a01705d8150A6354
$$ plain form
10135 -13112 -97481 -205362 -93538 115188 -32973 245157 -20237 -202067 -86307 -380031 -207923
10124 -207923 133301 -43085 -206749 105642 -346399 -126772 -16686 -36225 -304427 -79863
10113 -271779 -113087 425524 -393262 -440015 -333186 -77658 -290617 -111019 -106267 -214142
10103 -214142 -232490 435868 104517 -882 -62411 -248721 6688 230468 -42627 -154394 74200
10091 -286935 -40358 90182 32501 -172717 -39317 -47286 1550 -380471 -48874 -39247 -23240 -285452
10079 -285452 96570 -119884 -529170 114116 35347 -270890 -67904 280617 359021 16904
10068 100900 -63411 -127257 661 -150571 97863 220591 -59200 -120557 -52624 290705 -96124
10056 -219275 -105482 -199970 -101558 -133885 13740 -51120 -300599 -325546 156268 -30154 -248102
$$ packed form
10135a3112q4369j07881i3538A15188c2973B45157b0237j81830h6307k93724J72108
10124b07923A33301d3085j63664A05642c46399a26772a6686j9539k68202g9863
10113b71779a13087D25524c93262m6753J06829g7658k12959a11019M752j07875
10103b14142j8348D35868A04517h82o1529j86310F688K23780d2627j11767G4200
10091b86935d0358I0182C2501a72717c9317p969A550c80471d8874R627J6007k62212
10079b85452I6570a19884m09286A14116C5347b70890f7904B80617P8404A6904
10068A00900f3411o3846F61a50571I7863J22728e9200o1357e2624B90705i6124
10056b19275a05482r4488R8412l2327A3740e1120k49479k4947A56268c0154k17948
$$ plain form
10045 -248102 1125 22359 -88148 130047 146527 242437 -185586 17965 -88943 -152012 -274536
10034 -274536 -33723 63870 -43289 104852 -292838 137798 -250716 -119100 -379253 -111748
10023 196917 41282 34214 -126919 -299601 91760 -310393 27601 -128826 -250915 -365642
10013 -365642 -16019 142087 -122414 -141452 -148806 191580 47301 110245 -285176 8828 133003
10002 133003 -157643 -141275 52034 -342197 -177921 166048 -31681 -206557 170514 -73192
9991 -116426 148461 43805 -197494 134769 4851 -54656 147346 258321 148715 -195834
9980 -109925 -85546 321565 -82532 -110379 -115975 -104235 -74837 -152234 45753 -7878 -131650 -81213
9968 -81213 -340249 -44344 61610 253194 -65617 -241109 -14761 32053 -189430 -177566 66855
$$ packed form
10045b48102A125K1234h8148A30047J6480R5910a85586A7965h8943o3069j22524
10034b74536c3723F3870d3289A04852b92838A37798b50716a19100k60153a11748
10023A96917D1282p068a26919j72682I1760c10393B7601a28826j22089j14727
10013c65642a6019A42087a22414j9038p354A91580D7301O2944b85176H828J24175
10002A33003a57643J6368E2034c42197J64276A66048c1681j74876A70514g3192
9991a16426A48461D3805a97494A34769D851e4656A47346J10975j09606a95834
9980a09925K4379C21565h2532k7847n596J1740K9398p7397D5753g878j23772N0437
9968h1213k59036d4344F1610J91584f5617j75492a4761C2053a89430J1864F6855
$$ plain form
9956 -297238 -125675 3881 -126574 -170227 94351 -183464 33119 -228088 -91733 -375835 138810
9944 -239645 -55519 -291043 -280886 -541427 22185 -29976 -927 34781 -79811 -135489 249484
9932 82089 -38416 121524 124374 -185813 148129 -69844 -157785 32597 -88916 -94688 -420405
9921 -420405 218511 -95990 25363 -260312 -80113 322000 -52388 -50791 104371 -61087 -26298
9909 20631 -3155 17120 5184 -16122 -198679 -27367 -280551 -99528 -85574 156830 60654 81709
9897 81709 119947 -2945 -8583 46086 -41797 -116349 60839 13886 32885 19919 -25285 364197
9884 -178045 -64386 280455 -177519 -141523 -269745 12145 -263460 -406957 -76155 -107271 -68336
9873 -68336 17747 102032 51726 43577 -105080 -355129 304784 -367743 -108219 -443914 -2889
$$ packed form
9956b97238a25675C881a26574m3653I4351a83464C3119b28088i1733k84102A38810
9944b39645e5519k35524J0157k60541B2185b9976i27C4781g9811n5678B49484
9932H2089c8416A21524K850a85813A48129f9844q7941C2597h8916n772l25717
9921d20405B18511i5990B5363b60312h0113C22000e2388J597A04371f1087b6298
9909B0631c155A7120E184a6122j82557b7367k53184i9528J3954A56830F0654K1055
9897H1709L8238b945n638D6086d1797p4552F0839A3886J8999j2966b5285C64197
9884a78045f4386B80455a77519L5996j28222A2145b63460j43497g6155l1116L8935
9873f8336A7747Q4285n0306q149a05080k50049C04784c67743a08219l35695b889
$$ plain form
9861 124092 -118601 122502 -84309 22845 -158971 -160705 -354463 -337835 20324 -148411 94267
9849 71522 -24008 -233564 158718 -161804 -463212 -2417 354134 44092 56795 -2340 -33086
9838 -33086 -121446 154707 119724 -27534 -185957 -170513 111888 15675 -99575 80251 -108052
9826 73500 2712 124132 -116135 36111 -61451 67975 -45232 -273512 -29357 -75076 -33437
9814 -179316 -184149 -115030 -87351 -183163 -126308 -232052 36668 226783 -206836 -174514 -49265
9802 -25 -216726 -138357 -48371 -183011 85694 -6 15910 -173586 -345694 155211 -164134 -283173
9790 -283173 -46711 -171517 -132180 57551 -239148 -120259 -99888 126206 -72621 -158046 -165307
9779 -165307 -112716 -96802 179197 305312 -80707 -60577 -144230 -399568 -79496 161251 -63129
$$ packed form
9861A24092a18601A22502h4309B2845a58971j734j93758J6628B0324a48411I4267
9849G1522b4008k09556A58718a61804l01408b417C54134D4092J2703b340l0746
9838c3086q8360A54707l4983b7534j58423J5444A11888A5675i9575H0251a08052
9826G3500B712J21420a16135C6111f1451F7975d5232k28280b9357m5719c3437
9814a79316m833O9119K7679r5812N6855j05744C6668J90115b06836L2322d9265
9802b5k16701P8369d8371j34640H5694fA5910a73586j72108A55211a64134j19039
9790b83173d6711j24806L9337E7551b39148J18889K0371A26206g2621q5425p261
9779a65307N2591J5914A79197J26115h0707K0130q3653k55338g9496A61251f3129
$$ plain form
9767 -61614 -470417 199366 208577 -3394 -148610 -90709 -300547 -64498 -204916 -82542 -106627
9756 -106627 8838 -205170 -86492 -28705 171494 129232 -253163 13140 -397758 259131 -145325
9744 -153753 3947 -178662 -447281 -93217 -143710 -30638 -103867 19596 -314907 -241066 -347739
9733 -347739 -131180 -206189 -143711 136891 -190163 211652 -43445 -93797 -115502 -150384 -99751
9722 -99751 132069 101887 -89704 101959 -107720 -541 -64407 -74332 68529 -27213 -61197 -111428
9710 -111428 152081 -212249 202572 166190 -261017 -300012 -335862 110878 -273715 -126347
9699 126650 119129 -127100 139754 -158375 -50123 -193541 -122153 -148504 -131496 -1697 -77361
9688 -77361 -167150 -454709 15836 -88096 -157645 -131538 -108219 -356005 156988 100706 -196214
$$ packed form
9767f1614m08803A99366R211c394j45216N7901k09838f4498j40418h2542k4085
9756a06627H838b05170h6492b8705A71494m2262b53163A3140c97758B59131a45325
9744a53753C947a78662k68619i3217n0493c0638p3229A9596c14907P3841j06673
9733c47739a31180p5009O2478A36891a90163B11652d3445n0352k1705l4882N0633
9722i9751A32069l0182h9704A01959a07720e41o3866r925F8529b7213l3984n0231
9710a11428A52081b12249B02572l6382b61017l8995l5850A10878b73715a26347
9699A26650p521a27100A39754a58375e0123j43418P1388k6351J7008a697p5664
9688g7361q9789k87559A5836h8096o9549K6107K3319k47786A56988n6282a96214
$$ plain form
9676 -34427 226652 -210693 25233 -482180 -6517 325882 -17657 -22287 7434 29834 62237 28943
9663 -28633 -77035 -224068 -72316 -204420 22105 -186531 -291824 38922 163060 -309746 -77311
9651 215666 99851 -307861 -36324 -308415 219491 -190306 177731 25813 73993 -192268
9640 38873 29117 -132236 -80560 235046 -341376 -150708 -80872 -185337 -46317 -132643 181251
9628 -244063 38535 -79369 110702 215575 -125772 214404 79480 168211 -95653 87424 167845
9617 167845 17144 -230502 161086 -232 13625 18944 128460 -157268 79724 -104157 -257374
9606 -257374 -274458 73259 -247821 -160820 286363 -57419 72054 -229055 -723 -332048 217900
9594 -329726 -9260 221752 -125795 -39109 130334 -125380 -241750 61942 -583331 67328 -308008
$$ packed form
9676c4427B26652b10693B5233d82180f517C25882a7657m630G434K2400L2403B8943
9663b8633m8402j47033g2316j32104B2105a86531j05293C8922J24138c09746g7311
9651B15666I9851c07861c6324k72091B19491a90306A77731B5813M8180a92268
9640C8873r756a32236N1676B35046c41376a50708O9836j04465d6317q6326A81251
9628b44063C8535g9369A10702J04873a25772B14404G9480Q8731i5653H7424Q0421
9617A67845A7144b30502A61086b32A3625N319J09516a57268G9724a04157j53217
9606b57374j7084G3259b47821Q7001B86363e7419G2054b29055g23l31325B17900
9594c29726i260B21752a25795c9109A30334a25380j16370F1942e83331F7328c08008
$$ plain form
9582 -15360 -47075 -30524 -61886 152123 114404 -211758 89066 -336864 29355 330996 -45740
9570 -165475 -178766 136059 110315 -57368 60400 -68111 -175030 -219998 -281175 134705 -15695
9558 -214685 -147360 -142891 -17743 -146467 -6756 -101836 -1113 -490995 -59032 101152 72903 -127282
9545 -201114 80027 -30873 246867 -294815 -331313 -141586 -199854 46645 4713 -49334 24569
9533 -42610 -170956 4529 -15270 -30697 -190786 -111124 -325898 33946 242135 -218371 313873
9521 -284743 -63924 -458718 322811 -297678 -23440 151760 -181065 -66244 -87769 98555 245381
9510 245381 -408497 168606 -34285 100444 -184263 -87409 -3407 17298 -50401 -134260 -354741
9499 -354741 -69941 -42883 32659 212287 -168164 -97623 -119121 48204 -69190 19638 110935
$$ packed form
9582a5360l1715J6551l1362A52123l7719b11758H9066c36864B9355L01641d5740
9570a65475j3291A36059k5744e7368F0400f8111j06919m4968o1177A34705a5695
9558b14685O7325M469a7743j28724f756r5080a113m89882e9032A01152k8249a27282
9545b01114H0027c0873B46867b94815l6498a41586n8268D6645D713d9334B4569
9533d2610j28346D529a5270j5427j60089P9662k14774C3946K08189b18371C13873
9521b84743f3924l94794C22811b97678b3440A51760a81065f6244k1525I8555J46826
9510B45381d08497A68606c4285A00444a84263h7409c407A7298e0401q3859k20481
9499c54741f9941K7058C2659J79628a68164P0541k1498D8204f9190A9638R1297
$$ plain form
9488 110935 239408 106625 23703 -191977 135868 -164369 -46491 -224812 -115418 -230523
9478 -230523 146760 -40577 -51177 241959 -98295 -39801 56011 -66814 -117390 -319613 -156667
9466 157148 -340553 -32545 -15917 262602 269539 132244 -142546 -72947 -184290 181818 199648
9455 199648 -91155 -165002 1102 -116849 130863 219566 89109 10380 -57119 -34603 58451
9443 -258766 -237909 -118270 17389 -8204 35998 629 -96544 -241303 137183 -126681 28368
9431 -243132 53429 275578 -140422 144927 -230674 260412 -181996 -158610 17584 -106953
9420 -275292 53337 102532 -109035 -110375 -95564 -385593 -313133 38995 203373 -76894 -176530
9409 -176530 -228215 -79994 -255111 -78265 214 -110453 -163996 212122 94627 -223802 564 -57691
$$ packed form
9488A10935J28473A06625B3703a91977A35868a64369d6491j78321J09394j15105
9478b30523A46760d0577j0600B41959i8295c9801E6011f6814n0576k02223a56667
9466A57148c40553c2545a5917B62602O937A32244a42546O9599j11343A81818J7830
9455A99648i1155p3847A102a16849A30863Q8703H9109A0380e7119K2516E8451
9443b58766K0857a18270A7389h204C5998F29i6544j44759A37183a26681B8368
9431b43132E3429K22149a40422A44927b30674B60412a81996K3386A7584a06953
9420b75292E3337M9195a09035j340J4811k90029P2460C8995J64378g6894r9636
9409a76530n1685g9994j75117g8265B14a10453n3543B12122I4627b23802E64e7691
$$ plain form
9396 -365487 138370 -140221 -5015 -139660 -54155 -222923 -133523 -113893 36733 -37785 -88684
9385 -88684 -2097 -258465 -211180 -158625 3123 -186904 45147 -33918 109036 -153290 -223119
9374 -223119 -236118 -129074 -222892 -306678 74481 -392572 -174049 -202201 -231021 105566 -104903
9362 178145 75088 -152385 32554 -11257 -155450 -349288 -275296 -69601 -69459 96360 -75657
9350 -202445 -94973 -102743 16986 27320 111218 -187041 -94687 -112242 69274 68532 -116839 -156690
9338 -156690 64235 25273 -36984 -95531 56273 111595 226917 106780 -293559 -103571 46299
9326 -60543 -368784 -3977 -157641 -314695 -439337 -242732 -161607 29746 89533 -26159 -111085
9315 -111085 298296 -10565 159012 -195965 -37938 -102363 4389 34829 -174017 -139182 -221562
$$ packed form
9396c65487A38370a40221e015j34645e4155j68768Q9400J9630C6733c7785n0899
9385h8684b097k56368M7285N2555C123a86904D5147c3918A09036a53290o9829
9374b23119j2999J07044r3818q3786G4481c92572a74049k8152k8820A05566a04903
9362A78145G5088a52385C2554a1257j44193j93838P3992f9601J42I6360g5657
9350b02445i4973p770A6986J0334Q3898a87041R2354j7555F9274p42a16839l9851
9338a56690F4235B5273c6984n8547E6273N5322J15322A06780b93559a03571D6299
9326f0543l08241c977j53664j57054j24642J96605Q1125B9746N9787b6159q4926
9315a11085B98296a0565A59012a95965c7938o4425D389L0440a74017L4835q2380
$$ plain form
9304 -221562 -386552 -432443 103906 -18521 -69294 53775 -165434 67550 -432609 -203213 32552
9292 -140398 165896 -24444 -117186 25174 44895 -318346 -119175 -178128 6991 40896 -76937
9280 104761 105368 89664 108313 191786 -199829 -217904 -134502 156822 12885 4035 -135486 -30916
9267 93456 89891 -32082 -108438 12270 -10204 -223813 -190427 -163747 -425171 -79495 -117826 -101978
9255 -101978 -386849 -251881 175503 -49739 -503478 21227 11435 22472 -99684 46403 161598
9244 161598 -392527 -200007 -230523 167115 -48564 -464255 1079 69733 -103416 -2441 -58105
9233 -58105 -2629 -70500 -20582 -178886 651 -318364 54683 4569 -431266 76809 34106 258748
9221 258748 -300585 -86291 -13171 187108 -138429 282003 158581 229631 143976 -360623
$$ packed form
9304b21562j64990m5891A03906a8521n0773E3775a65434F7550d32609b03213C2552
9292a40398A65896b4444r2742B5174J9721c18346a19175n8953F991L3905g6937
9280A04761O07j5704J8649Q3473a99829j8075Q3402A56822A2885D035a35486c0916
9267I3456l565c2082p6356A2270a0204k13609L3386K6680k61424g9495l8331J5848
9255a01978k84871J34968A75503d9739m53739B1227r792J1037i9684D6403J15195
9244A61598c92527J92520l0516A67115d8564m15691A079O8654a03416b441n5664
9233e8105b629o7871b0582j58304F51c18364E4683D569d31266G6809C4106K24642
9221B58748c00585h6291a3171A87108a38429B82003j23422P1050q5655c60623
$$ plain form
9210 92869 -16902 140039 -143228 -73210 282238 89392 -61375 -110435 26932 171054 76082
9198 -209106 22225 -140301 52436 -188063 -23211 -48639 -43673 -3173 252591 317118 -257438
9186 39318 -116678 -204686 -299020 -63190 -121415 242740 -71157 -75181 -19322 296095 2230 -72367
9173 -136665 -99847 -613 -225315 -436326 -77278 24457 -5383 105079 -24224 165265 -380054
9161 -58114 164214 -13137 145155 -12309 -123662 94963 12279 47303 -77141 7357 -367360
9149 -12781 46855 216375 -13699 -215432 87444 -133269 -97765 -67515 193315 -173059 -233217
9138 -233217 -13841 -182378 149010 34140 60874 -83745 -119560 -34511 -171745 29740 80852
9127 80852 83882 308687 -191435 302935 -86180 -27006 -79971 38415 -174781 78059 -322631
$$ packed form
9210I2869a6902A40039a43228P0018B82238H9392f1375m9060B6932J44122G6082
9198b09106B2225a40301E2436a88063b3211k5428M966c173B52591O4527b57438
9186C9318a16678q8008r4334f3190n8225B42740g1157m024a9322B96095B230g2367
9173a36665L6818f13k24702k11011g7278B4457e383A05079b4224A65265c80054
9161e8114A64214a3137A45155a2309j11353I4963A2279L5024g7141G357c67360
9149a2781D6855J69520a3699k01733H7444a33269L5504L0250A93315a73059o0158
9138b33217a3841j68537A49010C4140K6734h3745l5815c4511j37234B9740N1112
9127H0852L030K24805a91435C02935h6180b7006n2965C8415a74781G8059c22631
$$ plain form
9115 -290930 136025 -73857 -117080 -163100 220867 31335 74565 -220967 157407 -192131 -144027
9104 -144027 -607384 75307 31239 -9543 -207390 -111047 -142769 -104705 -2481 -157752 -301026
9093 -301026 -289884 -218018 -158252 -211495 -15180 -38145 -30370 -129525 -242610 51850 29870 -214547
9080 -200516 -31231 200920 -159702 -244084 41693 -326262 -186298 -370483 -208789 79477
9069 -32287 89222 312910 -96904 -248470 -4124 225657 -24563 -390356 -29990 -48193 -10290
9057 -274779 25218 -283593 36630 222519 126619 -415250 -115535 -195019 9107 1436 -77388
9045 5121 -102636 138788 -38848 300365 -101967 21094 -6179 -33607 180482 -217504 -100269
9033 -315852 -414255 32644 169547 50063 -119219 -197839 241661 -56524 -86131 -4114 -2974
$$ packed form
9115b90930A36025g3857m3223m6020B20867C1335M3230b20967A57407a92131M8104
9104a44027m63357G5307C1239i543j97847R6343l1722L8064b481j55271j43274
9093c01026J1142P1866N9766n3243a5180k2965P775r9155j13085E1850k1980b14547
9080b00516c1231B00920a59702q4382D1693c26262J39964j84185J61694G9477
9069c2287H9222K23688i6904j51566d124B25657b4563l65793b9990j8203a0290
9057b74779B5218b83593C6630J85889r5900d15250a15535p9484I107A436g7388
9045E121a02636A38788c8848C00365a01967B1094f179k7428A80482b17504a00269
9033c15852r8403C2644J36903E0063a19219p8620B41661e6524k9607d114J140
$$ plain form
9022 -2974 -345083 -143725 -296867 58436 147965 -168278 4633 196417 -59803 -31656 223645
9010 -133630 -186557 -199024 137873 196654 -126051 -41171 356564 -54293 119717 -33505 -64271
8999 -64271 3426 -130069 -40759 -181220 48741 -151365 205857 -233842 -125880 -279228 -224664
8988 -224664 8501 -25468 457216 13365 -3044 75666 -205647 -298187 -87514 51193 -186590
8976 38352 -109801 -84417 -20289 -35978 283884 -161142 106130 -33003 -373904 -139806 -17228
8964 -76760 -66512 -264964 136145 -141883 -224051 112874 104509 -212768 2256 -125134 -330456
8953 -330456 -117191 -16946 -56142 74471 -75265 201870 51834 23178 -183666 105927 111037
8942 111037 49519 -238896 70536 14953 -365964 3557 138991 -70840 -29610 -280501 -104636
$$ packed form
9022b974l42109a43725j53142E8436Q9529a68278D633J91784e9803K8147B23645
9010a33630n2927j2467A37873N8781a26051d1171C56564e4293A19717c3505l0766
8999f4271C426a30069d0759j40461D8741a51365B05857b33842J07962j53348N4564
8988b24664H501b5468D57216A3365c044G5666b05647r2540h7514E1193a86590
8976C8352a09801K5384b0289j5689B83884a61142A06130c3003l40901a39806a7228
8964g6760J0248j98452A36145a41883q2168A12874q365b12768B256a25134k05322
8953c30456a17191a6946l9196G4471g5265B01870E1834B3178a83666A05927N110
8942A11037D9519b38896G0536A4953c65964C557J35434g0840b9610k50891a04636
$$ plain form
8930 -147062 -259117 -51885 -44774 -229425 -177670 161764 118046 624360 1568919 1108385 269750
8918 99513 -83905 119871 87117 -110055 -234289 32555 -401038 47826 365825 -235295 -65698
8906 -411595 212127 -75493 -129878 502154 -61073 429789 -130409 10390 129171 -464858
8895 -273628 -311416 40581 -20463 149564 104493 51758 -264957 -199254 -78330 -58059 -185066
8884 -185066 73033 -40958 70362 -256005 351794 225237 -93562 -117919 314834 -182319 203072
8872 13953 49671 -254333 -70127 -233953 -3994 172366 -350724 -48813 -156375 224563 -128698
8860 -103474 -107274 -439271 164289 -81632 7266 57226 -72738 324634 -27103 147731 43127
$$ packed form
8930a47062j12055e1885P111j84651N1755A61764m3718N06314R44559m60534B69750
8918I9513h3905A19871l2754a10055j24234C2555d01038D7826L17999b35295f5698
8906d11595B12127g5493n4385E02154f1073D29789a30409A0390J18781d64858
8895b73628l7788D0581b0463A49564m5071E1758b64957O5703g8330K0271j27007
8884a85066G3033d0958G0362b56005C51794j26557i3562k4357C14834a82319B03072
8872A3953L5718b54333g0127j63826c994A72366c50724d8813j07562B24563a28698
8860a03474l800l31997A64289h1632G266M9960g2738C24634b7103A47731D3127
$$ [...]
##END NTUPLES=NMR SPECTRUM
##END=
