##TITLE=AC1462_TOLI213268_7819399_Jd6nq9Xnnw
##JCAMPDX= 6.0         $$ Bruker NMR JCAMP-DX V2.0
##DATA TYPE= NMR SPECTRUM
##DATA CLASS= NTUPLES
##ORIGIN= BRUKER
##OWNER= Administrator
$$ 1.72 TOPSPIN		Version 2.1
$$ 2013-04-30 23:12:12.649 -0700  Administrator@X
$$ Compression mode = diff/dup
##.OBSERVE FREQUENCY= 400.02188249412
##.OBSERVE NUCLEUS= ^1H
##.ACQUISITION MODE= SIMULTANEOUS (DQD)
##.ACQUISITION SCHEME= undefined
##.AVERAGES= 64
##.DIGITISER RES= 22
##SPECTROMETER/DATA SYSTEM= spect
##.PULSE SEQUENCE= noesygpps1d.comp
##.SOLVENT NAME= COFFEE_meoh
##.SHIFT REFERENCE= INTERNAL, COFFEE_meoh, 1, 14.96071
##AUDIT TRAIL= $$ (NUMBER, WHEN, WHO, WHERE, PROCESS, VERSION, WHAT)
$$ ##TITLE= Audit trail, TOPSPIN		Version 2.1
$$ ##JCAMPDX= 5.01
$$ ##ORIGIN= Bruker BioSpin GmbH
$$ ##OWNER= Administrator
$$ $$ E:\/data/COFFEE/nmr/AC1462_TOLI213268_7819399_Jd6nq9Xnnw/12/pdata/1/auditp.txt
$$ ##AUDIT TRAIL=  $$ (NUMBER, WHEN, WHO, WHERE, PROCESS, VERSION, WHAT)
(   1,<2013-04-30 23:12:07.664 -0700>,<Administrator>,<X>,<go>,<TOPSPIN 2.1>,
      <created by zg
	started at 2013-04-30 23:00:38.336 -0700,
	POWCHK enabled, PULCHK disabled,
       configuration hash MD5:
       F7 49 AB AC A2 8D 51 76 73 8D C1 9A A6 38 9F DE
       data hash MD5: 64K
       4E 37 3D 89 2E 0E BD 7D 90 3B 69 B1 84 3E D1 81>)
(   2,<2013-04-30 23:12:10.586 -0700>,<Administrator>,<X>,<proc1d>,<TOPSPIN 2.1>,
      <Start of raw data processing
       efp LB = 0.3 FT_mod = 6 PKNL = 1 PHC0 = 0 PHC1 = 0 SI = 128K 
       data hash MD5: 128K
       51 E7 58 DD 9A 21 CB EB 1A 4D 91 67 43 C4 B6 81>)
(   3,<2013-04-30 23:12:11.618 -0700>,<Administrator>,<X>,<proc1d>,<TOPSPIN 2.1>,
      <pk PHC0 = -81.0791 PHC1 = 0 
       data hash MD5: 128K
       04 92 4E EB 80 C8 0D 6B D7 0C 20 2E 00 FE 7B 90>)
(   4,<2013-04-30 23:12:12.086 -0700>,<Administrator>,<X>,<proc1d>,<TOPSPIN 2.1>,
      <abs ABSG = 1 
       data hash MD5: 128K
       30 DF 40 E7 D3 08 1A 2D 74 4C 95 60 ED 76 38 50>)
(   5,<2013-04-30 23:12:12.180 -0700>,<Administrator>,<X>,<proc1d>,<TOPSPIN 2.1>,
      <abs ABSG = 2 
       data hash MD5: 128K
       5F A4 4B E4 1E 4E 19 F4 B3 5A F5 CC 06 05 CD 99>)
(   6,<2013-04-30 23:12:12.289 -0700>,<Administrator>,<X>,<proc1d>,<TOPSPIN 2.1>,
      <abs ABSG = 3 
       data hash MD5: 128K
       3B 60 E0 1A 65 2E 0E 11 E5 7A 83 46 31 CD F8 0F>)
(   7,<2013-04-30 23:12:12.399 -0700>,<Administrator>,<X>,<proc1d>,<TOPSPIN 2.1>,
      <abs ABSG = 4 
       data hash MD5: 128K
       38 9B CA D2 59 0A 58 A4 3E 3F 95 D3 08 88 F3 D1>)
(   8,<2013-04-30 23:12:12.477 -0700>,<Administrator>,<X>,<proc1d>,<TOPSPIN 2.1>,
      <abs ABSG = 5 
       data hash MD5: 128K
       CF 4D A7 75 42 3D B7 48 13 8A 2F 28 AA BC A5 79>)
$$ ##END=
$$ 
$$ $$ hash MD5
$$ $$ 60 FB E4 AB 45 2B 4E 58 A4 B4 6D 8D FA 15 CD CA
##$RELAX= 
##$RELAX= 
##$RELAX= 
##$RELAX= 
##$RELAX= 
##$RELAX= 
##$RELAX= 
##$RELAX= 
$$ Bruker specific parameters
$$ --------------------------
##$DU= <E:\>
##$EXPNO= 12
$$ [...]
150 150 150 150 150 150 150 150
##$TP07= 0
##$TPNAME0= <>
##$TPNAME1= <>
##$TPNAME2= <>
##$TPNAME3= <>
##$TPNAME4= <>
##$TPNAME5= <>
##$TPNAME6= <>
##$TPNAME7= <>
##$TPOAL= (0..7)
0.5 0.5 0.5 0.5 0.5 0.5 0.5 0.5
##$TPOFFS= (0..7)
0 0 0 0 0 0 0 0
##$TUNHIN= 0
##$TUNHOUT= 0
##$TUNXOUT= 0
##$USERA1= <user>
##$USERA2= <user>
##$USERA3= <user>
##$USERA4= <user>
##$USERA5= <user>
##$V9= 5
##$VALIST= <valist>
##$VCLIST= <CCCCCCCCCCCCCCC>
##$VD= 0
##$VDLIST= <DDDDDDDDDDDDDDD>
##$VPLIST= <PPPPPPPPPPPPPPP>
##$VTLIST= <TTTTTTTTTTTTTTT>
##$WBST= 1024
##$WBSW= 4
##$XGAIN= (0..3)
0 0 0 0
##$XL= 0
##$YL= 0
##$YMAX_a= 6128300
##$YMIN_a= -12458387
##$ZGOPTNS= <>
##$ZL1= 120
##$ZL2= 120
##$ZL3= 120
##$ZL4= 120
##$ABSF1= 14.96071
##$ABSF2= -5.597472
##$ABSG= 5
##$ABSL= 3
##$ALPHA= 0
##$AQORDER= 0
##$ASSFAC= 0
##$ASSFACI= 0
##$ASSFACX= 0
##$ASSWID= 0
##$AUNMP= <proc_prof1d_extract.lims>
##$AXLEFT= 0
##$AXNAME= <>
##$AXNUC= <1H>
##$AXRIGHT= 0
##$AXTYPE= 0
##$AXUNIT= <>
##$AZFE= 0.1
##$AZFW= 0.1
##$BCFW= 0
##$BC_mod= 0
##$BYTORDP= 0
##$COROFFS= 0
##$CY= 15
##$DATMOD= 1
##$DC= 0
##$DFILT= <>
##$DTYPP= 0
##$F1P= 0
##$F2P= 0
##$FCOR= 0.5
##$FTSIZE= 131072
##$FT_mod= 6
##$GAMMA= 0
##$GB= 0
##$INTBC= 1
##$INTSCL= 1
##$ISEN= 128
##$LB= 0.3
##$LEV0= 0
##$LPBIN= 0
##$MAXI= 10000
##$MC2= 0
##$MEAN= 0
##$ME_mod= 0
##$MI= 0
##$NCOEF= 0
##$NC_proc= -2
##$NLEV= 6
##$NOISF1= 0
##$NOISF2= 0
##$NSP= 0
##$NTH_PI= 0
##$NZP= 0
##$OFFSET= 14.96071
##$PC= 1
##$PHC0= -81.0791
##$PHC1= 0
##$PH_mod= 1
##$PKNL= yes
##$PPARMOD= 0
##$PPDIAG= 0
##$PPIPTYP= 0
##$PPMPNUM= 2147483647
##$PPRESOL= 1
##$PSCAL= 4
##$PSIGN= 0
##$PYNMP= <proc.py>
##$REVERSE= no
##$SF= 400.020009750944
##$SI= 131072
##$SIGF1= 0
##$SIGF2= 0
##$SINO= 400
##$SIOLD= 131072
##$SPECTYP= <>
##$SREGLST= <1H.CDCl3>
##$SSB= 0
##$STSI= 131072
##$STSR= 0
##$SW_p= 8223.68421052631
##$SYMM= 0
##$S_DEV= 0
##$TDeff= 65536
##$TDoff= 0
##$TI= <>
##$TILT= no
##$TM1= 0
##$TM2= 0
##$TOPLEV= 0
##$USERP1= <user>
##$USERP2= <user>
##$USERP3= <user>
##$USERP4= <user>
##$USERP5= <user>
##$WDW= 1
##$XDIM= 131072
##$YMAX_p= 409513010
##$YMIN_p= -13156
##$CURPLOT= <Network HP LaserJet P1505>
##$CURPRIN= <$Network HP LaserJet P1505>
##$DFORMAT= <normdp>
##$LAYOUT= <+/1D_H.xwp>
##$LFORMAT= <normlp>
##$PFORMAT= <normpl>
##$SURQMSG= 1
$$ End of Bruker specific parameters
$$ ---------------------------------
##NTUPLES= NMR SPECTRUM
##VAR_NAME=  FREQUENCY,     SPECTRUM/REAL,   SPECTRUM/IMAG
##SYMBOL=    X,             R,               I
##VAR_TYPE=  INDEPENDENT,   DEPENDENT,       DEPENDENT
##VAR_FORM=  AFFN,          ASDF,            ASDF
##VAR_DIM=   131072,        131072,          131072
##UNITS=     HZ,            ARBITRARY UNITS, ARBITRARY UNITS
##FACTOR=    0.0627417313425164, 1,          1
##FIRST=     8223.62146879497, -23,          -55673
##LAST=      0,             1940,            -55933
##MIN=       0,             -13156,          0
##MAX=       8223.62146879497, 409513010,    0
$$ Real data points
##PAGE= N=1
##DATA TABLE= (X++(R..R)), XYDATA
$$ [...]
63890F19024j5477j4175j3294j2539j1489j0097q575o904m956k956j250L98K556
$$ 619024 603547 589372 576078 563539 552050 541953 533378 526474 521518 518562 517312 517710 520266
63877E20266N082P045Q067R020J0856J3252J5139J6150J6861J7783J8829J9685
$$ 520266 525348 532393 540460 549480 560336 573588 588727 604877 621738 639521 658350 678035
63865F78035K0106J9850J8878J7594J6401J5070J3099J0583Q093N745L110P7k963
$$ 678035 698141 717991 736869 754463 770864 785934 799033 809616 817709 823454 826564 826641 823678
63852H23678n914r072j2203j4498j5892j7527k0073k2503k3388k2900k2433k2629
$$ 823678 817764 808692 796489 781991 766099 748572 728499 705996 682608 659708 637275 614646
63840F14646k2905k2710k2182k1489k0539j9523j8868j8418j7486j6012j4851
$$ 614646 591741 569031 546849 525360 504821 485298 466430 448012 430526 414514 399663
63829C99663j4510j4367j3664j2558j1592j0678r384p826o530n612m785m024l603
$$ 399663 385153 370786 357122 344564 332972 322294 312910 305084 298554 292942 288157 284133 280530
63816B80530l472l211k679k167j846j581j344j339j518j464j055q11j164j747
$$ 280530 277058 273847 271168 269001 267155 265574 264230 262891 261373 259909 258854 258043 256879 255132
63802B55132j847j415j038r99r04m84k01o08j477k087k295k655l361l701k994
$$ 255132 253285 251870 250832 249833 248929 248445 248244 247636 246159 244072 241777 239122 235761 232060 229066
63787B29066j701r57j183j717j831j519j119p36l41j00j56l13k39R5M20M85J63
$$ 229066 227365 226408 225225 223508 221677 220158 219039 218303 217962 217862 217706 217393 217154 217249 217669 218154 218317
63770B18317m66r81p67K61J290J407O88Q7K47Q17J011M80m94j283j316n11N11
$$ 218317 217851 216870 216103 216364 217654 219061 219749 219836 220083 220900 221911 222391 221897 220614 219298 218787 219298
63753B19298R07N10j7k6M50J000J436J823K155K391K581K703K544K057J619J552
$$ 219298 220205 220715 220698 220672 221122 222122 223558 225381 227536 229927 232508 235211 237755 239812 241431 242983
63737B42983J689J802K163L036L794L368J759L32K73J355K628L671M596N352N852
$$ 242983 244672 246474 248637 251673 255467 258835 260594 260926 261199 262554 265182 268853 273449 278801 284653
63722B84653O432P341P922P174N310L831L671L970L256J372n38j653k342l287
$$ 284653 291085 298426 306348 313522 318832 322663 326334 330304 333560 334932 334394 332741 330399 327112
63708C27112m381m915m625m101m052m415m485l798k641j585q14j84L81R34J653
$$ 327112 322731 317816 313191 309090 305038 300623 296138 292340 289699 288114 287300 287116 287497 288431 290084
63693B90084K516L016K764K269K382K979L032K169J292J163J263P74k1k37J91
$$ 290084 292600 295616 298380 300649 303031 306010 309042 311211 312503 313666 314929 315703 315682 315445 315636
63678C15636N75O96R53J381J555J544K027L183M271M624M364L841L078K180J627
$$ 315636 316211 316907 317860 319241 320796 322340 324367 327550 331821 336445 340809 344650 347728 349908 351535
63663C51535J608J591R97r5j385k898m605n900o176n708n401n704o210o214n344
$$ 351535 353143 354734 355731 355636 354251 351353 346748 340848 334672 328964 323563 317859 311649 305435 300091
63648C00091l752k047q89l62J03R44J854K333K481K759L164L321L230L342L858
$$ 300091 296339 294292 293403 293041 293144 294088 295942 298275 300756 303515 306679 310000 313230 316572 320430
63633C20430M466M885N162N394N577N911O765Q113R358J0000J0254J0767J1834
$$ 320430 324896 329781 334943 340337 345914 351825 358590 366703 376061 386061 396315 407082 418916
63620D18916J3136J4160J4842J5739J7549K0339K3374K5870K7815K9770L2013
$$ 418916 432052 446212 461054 476793 494342 514681 538055 563925 591740 621510 653523
63609F53523L4254L6094L7324L7708L6795L4199K9820K3795J6512Q765J582m219
$$ 653523 687777 723871 761195 798903 835698 869897 899717 923512 940024 948789 950371 946152
63597I46152q225j0319j0774j0379j0041j0069j0277j0802j2311j5130j8679k2080
$$ 946152 937927 927608 916834 906455 896414 886345 876068 865266 852955 837825 819146 797066
63585G97066k4948k7206k8572k8737k7818k6230k4196k1736j9004j6209j3391
$$ 797066 772118 744912 716340 687603 659785 633555 609359 587623 568619 552410 539019
63574E39019j0571q003n892m051k180l27J325K932M694O279P145P444P961R034
$$ 539019 528448 520445 514553 510502 508322 507995 509320 512252 516946 523225 530370 537814 545775 554809
63560E54809J0161J0916J1664J2958J4746J6664J8749K1341K4459K7817L1295
$$ 554809 564970 575886 587550 600508 615254 631918 650667 672008 696467 724284 755579
63549G55579L5003L8952M3018M7045N0438N1672M8832M1052K9274J5583K114r368
$$ 755579 790582 829534 872552 919597 970035 1021707 1070539 1111591 1140865 1156448 1158562 1149194
63537A149194j7518k1708k2264k0104j6197j1577p637n779o590r536j3659j8323
$$ 1149194 1131676 1109968 1087704 1067600 1051403 1039826 1032189 1026410 1019820 1010284 996625 978302
63525I78302k3257k8195l2765l6569l9141m0079l9499l8170l6762l5042l2346
$$ 978302 955045 926850 894085 857516 818375 778296 738797 700627 663865 628823 596477
63514E96477k8850k5647k3318k1156j8372j5487j3583j2536j1038q563o224n215
$$ 596477 567627 541980 518662 497506 479134 463647 450064 437528 426490 417927 411703 406488
63502D06488n201m974m131l255k775k487k182k024k130k300k316k071j435m17
$$ 406488 401287 396313 392182 388927 386152 383665 381483 379459 377329 375029 372713 370642 369207 368790
63488C68790M85O77L44M05J395K863M105M969N600N901N755N367M881M025K698
$$ 368790 369275 369952 370296 370701 372096 374959 379064 384033 389633 395534 401289 406656 411537 415562 418260
63473D18260J545J218J239M55j331l008l696l880m521n557o034n464m381l514
$$ 418260 419805 421023 422262 422717 421386 418378 414682 410802 406281 400724 394690 389226 384845 381331
63459C81331k975k480j946j474r40rJ341K558L057K913K893L739N513P632R399
$$ 381331 378356 375876 373930 372456 371516 371507 372848 375406 378463 381376 384269 388008 393521 401153 410552
63444D10552J0494J1168J2091J3818J6252J8677K0499K1999K4204K7911L2761
$$ 410552 421046 432214 444305 458123 474375 493052 513551 535550 559754 587665 620426
63433F20426L7140L9030L7224L2056K5044J7794J1305O165L028K483M528Q468
$$ 620426 657566 696596 733820 765876 790920 808714 820019 826184 829212 831695 836223 844691
63421H44691J3441J8991K5021L1257L6859M0757M2454M2298M0679L7173L0991
$$ 844691 858132 877123 902144 933401 970260 1011017 1053471 1095769 1136448 1173621 1204612
63410A204612K2279J2383K762n734j2370j6281j7400j6965j6294j5568j4692j4726
$$ 1204612 1226891 1239274 1242036 1236302 1223932 1207651 1190251 1173286 1156992 1141424 1126732 1112006
63398A112006j7176k1940k7248l1758l5587l8976m1230m1639m0527l8611l6039
$$ 1112006 1094830 1072890 1045642 1013884 978297 939321 898091 856452 815925 777314 741275
63387G41275l2799k9402k6330k3321k0000j6814j4450j2616j0313p229m077j511
$$ 741275 708476 679074 652744 629423 609423 592609 578159 565543 555230 548001 543924 542413
63375E42413N59K508M477O483Q554J0541J2264J3908J5916J8316K0556K2216K3550
$$ 542413 542972 545480 549957 556440 564994 575535 587799 601707 617623 635939 656495 678711 702261
63362G02261K5191K7512L0467L3829L7339M0633M3215M4597M4561M3202M0525
$$ 702261 727452 754964 785431 819260 856599 897232 940447 985044 1029605 1072807 1113332
63351A113332L6066K9287K0443J0812J801n856j1871j5852j7562j7515j6799j6221
$$ 1113332 1149398 1178685 1199128 1209940 1211741 1205885 1194014 1178162 1160600 1143085 1126286 1110065
63339A110065j6011j6316j7566k0217k4241k8956l3305l6441l8164l8717l8164
$$ 1110065 1094054 1077738 1060172 1039955 1015714 986758 953453 917012 878848 840131 801967
63328H01967l6332l3325k9616k5423k0530j5030r711n244j631R52J387j377o807
$$ 801967 765635 732310 702694 677271 656741 641711 632000 626756 625125 626077 627464 626087 619280
63315F19280j3072j8612k2721k4943k5000k3358k0931j8147j5046j2169j0312
$$ 619280 606208 587596 564875 539932 514932 491574 470643 452496 437450 425281 414969
63304D14969r333q229o691n487n038m653l770k938k844l166l185k877k601k367
$$ 414969 405636 397407 390716 385229 380191 375538 371768 368830 365986 362820 359635 356758 354157 351790
63290C51790k132k350l270m124l961l099k796l509m277l969k537q97j6k47j204
$$ 351790 349658 347308 344038 339914 335953 332854 330058 326549 322272 318303 315766 314869 314853 314606 313402
63275C13402k078k261j684n94O73J564J519P27K22P07J646K074J942J889J999
$$ 313402 311324 309063 307379 306785 307458 309022 310541 311268 311490 312197 313843 315917 317859 319748 321747
63260C21747J782J284J308K250L510M350M732M981N181N361N738O394P006P278
$$ 321747 323529 324813 326121 328371 331881 336231 340963 345944 351125 356486 362224 368618 375624 382902
63246C82902P350P477P695Q211R613J2152J4990J6886J7609J8077J9007K0037
$$ 382902 390252 397729 405424 413635 423248 435400 450390 467276 484885 502962 521969 542006
63234E42006K0585K0967K2024K3795K5222K5337K4333K3191K2583K2424K2282
$$ 542006 562591 583558 605582 629377 654599 679936 704269 727460 750043 772467 794749
63223G94749K1916K1443K1224K1508K2049K2297K2076K1855K1899K1464J9400
$$ 794749 816665 838108 859332 880840 902889 925186 947262 969117 991016 1012480 1031880
63212A031880J5487J0549N278l69o410j2264j7346k1682k5480k8472l0246l0885
$$ 1031880 1047367 1057916 1063194 1062825 1056415 1044151 1026805 1005123 979643 951171 920925 890040
63200H90040l0833l0295k9237k7631k5329k1987j7656j3255r845p511n372k671
$$ 890040 859207 828912 799675 772044 746715 724728 707072 693817 683972 676461 671089 668418
63188F68418N68L851O709Q977J0907J2979J5285J7286J8494J9121J9648K0012
$$ 668418 668986 672837 679546 688523 699430 712409 727694 744980 763474 782595 802243 822255
63176H22255J9792J9026J8185J7411J6471J5418J4604J3883J2481R880O396K606
$$ 822255 842047 861073 879258 896669 913140 928558 943162 957045 969526 979406 985802 988408
63164I88408j309n481r981j4707j9360k3408k6424k8573l0349l1800l2416l1839
$$ 988408 987099 981618 971637 956930 937570 914162 887738 859165 828816 797016 764600 732761
63152G32761l0220k7889k5179k2632k0788j9530j8226j6677j5284j4104j2525
$$ 732761 702541 674652 649473 626841 606053 586523 568297 551620 536336 522232 509707
63141E09707j0306q175o832n971n009m172l968m013l365j942o63q1K92J083K120
$$ 509707 499401 491226 484394 478423 473414 469242 465274 461261 457896 455954 455291 455210 455502 456585 458705
63126D58705K809K967K910K980L306L856M463M934N194N250M942M061K756J661
$$ 458705 461514 464481 467391 470371 473677 477533 481996 486930 492124 497374 502316 506377 509133 510794
63112E10794J298J543J886K125K530L206L672L339K367J581J406J302O25k88n07
$$ 510794 512092 513635 515521 517646 520176 523382 527054 530393 532760 534341 535747 537049 537674 537386 536879
63097E36879P5M85M5o05m33M73R74L72p49j299q99j33K75K51L07P64J240J218
$$ 536879 536954 537439 537484 536879 536446 536919 537893 538265 537516 536217 535318 535185 535460 535711 536018 536782 538022 539240
63079E39240R43J292K608M193N226N720O150O581O812P165Q313J0300J2314J3666
$$ 539240 540183 541475 544083 548276 553502 559222 565372 571953 578765 585930 594243 604543 616857 630523
63065F30523J4487J5392J6769J8610K0670K2644K4499K6699K9815L3794L7957
$$ 630523 645010 660402 677171 695781 716451 739095 763594 790293 820108 853902 891859
63054H91859M1793M5334M8636N1338N3184N4634N6497N8931O1116O1936O0970
$$ 891859 933652 978986 1027622 1078960 1132144 1186778 1243275 1302206 1363322 1425258 1486228
63043A486228N8940N7175N6434N6196N5394N3867N2659N2577N3003N2504N0383
$$ 1486228 1545168 1602343 1658777 1714973 1770367 1824234 1876893 1929470 1982473 2034977 2085360
63032B085360M7014M2786L7391L0309K1431J0956r82j4131k7736m0633n1828o0945
$$ 2085360 2132374 2175160 2212551 2242860 2264291 2275247 2274265 2260134 2232398 2191765 2139937 2078992
63020B078992o8178p3861p7923p9720p8549p4485o8577o2116n5712m9209m2280
$$ 2078992 2010814 1936953 1859030 1779310 1700761 1626276 1557699 1495583 1439871 1390662 1348382
63009A348382l4895k7277j9592j1898m308K803Q876J3588J7298K0822K4537K7832
$$ 1348382 1313487 1286210 1266618 1254720 1250412 1253215 1262091 1275679 1292977 1313799 1338336 1366168
62997A366168K9776L0277L0259L0635L1426L2006L1869L0949K9496K7936K6602
$$ 1366168 1395944 1426221 1456480 1487115 1518541 1550547 1582416 1613365 1642861 1670797 1697399
62986A697399K5228K2880J8789J3124O596n19q464j7187k6069l4567m2553m9819
$$ 1697399 1722627 1745507 1764296 1777420 1784016 1783497 1775033 1757846 1731777 1697210 1654657 1604838
62974A604838n5717n9754o2116o3242o3170o1732n9142n5939n2520m9008m5440
$$ 1604838 1549121 1489367 1427251 1364009 1300839 1239107 1179965 1124026 1071506 1022498 977058
62963I77058m1680l7508l3220k9844k8104k7333k6152k4168k2252k1007j9874
$$ 977058 935378 897870 864650 834806 806702 779369 753217 729049 706797 685790 665916
62952F65916j8171j6238j4889j4255j3847j3480j3387j3582j3689j3430j2776
$$ 665916 647745 631507 616618 602363 588516 575036 561649 548067 534378 520948 508172
62941E08172j1661j0087q511p609p501p596p327o663n821m960m298m055m038l678
$$ 508172 496511 486424 477913 470304 462803 455207 447880 441217 435396 430436 426138 422083 418045 414367
62927D14367k889k384k730l392l314k291j173p16q29j069j304j584j764j656j338
$$ 414367 411478 409094 406364 402972 399658 397367 396194 395478 394649 393580 392276 390692 388928 387272 385934
62912C85934j032q09o70o95q44q14m12oj94j059k087k745k829k258j011N14J510
$$ 385934 384902 384093 383423 382728 381884 381070 380658 380652 380458 379399 377312 374567 371738 369480 368469 368983 370493
62895C70493J502R32O46R43J392J464J019K11p23j479j747j471r26m63k21q0J92
$$ 370493 371995 372927 373573 374516 375908 377372 378391 378602 377879 376400 374653 373182 372256 371793 371572 371492 371684
62878C71684P78J578K093J778O99l32n23L4M89K31m97r84r19o45o64j044j349
$$ 371684 372462 374040 376133 377911 378610 378278 377755 377789 378278 378509 378012 377028 376109 375464 374800 373756 372407
62861C72407j136l90N14J240J749K064K017J458O66K84O36J320J649J378Q15L46
$$ 372407 371271 370881 371395 372635 374384 376448 378465 379923 380589 380873 381509 382829 384478 385856 386671 387017
62845C87017J84M56J173J977K265J809J055O01N60O44O94Q10J000J084R94R30
$$ 387017 387201 387657 388830 390807 393072 394881 395936 396537 397097 397741 398435 399245 400245 401329 402323 403253
62829D03253J131J590K097K380K291J971J863K308L097L637L582L099K508K008
$$ 403253 404384 405974 408071 410451 412742 414713 416576 418884 421981 425618 429200 432299 434807 436815
62815D36815J858K419L668M890N253M651L815L587M250N471O629P282P508P862
$$ 436815 438673 441092 444760 449650 454903 459554 463369 466956 471206 476677 483306 490588 498096 505958
62801E05958Q903J0661J2656J4266J5074J5049J4654J4652J5622J7600K0245K3247
$$ 505958 514861 525522 538178 552444 567518 582567 597221 611873 627495 645095 665340 688587
62789F88587K6428K9754L3471L8045M3574M9413N4759N9592O4599P0213P6160
$$ 688587 715015 744769 778240 816285 859859 909272 964031 1023623 1088222 1158435 1234595
62778A234595Q1953Q7211R1350R3603R3772R2492R0205Q6156P9025O8414N5187
$$ 1234595 1316548 1403759 1495109 1588712 1682484 1774976 1865181 1951337 2030362 2098776 2153963
62767B153963M0445K4685Q116q823k5470m1103n4932o6235p4856q1329q6181q9285
$$ 2153963 2194408 2219093 2227209 2218386 2192916 2151813 2096881 2030646 1955790 1874461 1788280 1698995
62755A698995r0282q9438q7602q5202q1744p6702p0609o4788n9921n5394n0297
$$ 1698995 1608713 1519275 1431673 1346471 1264727 1188025 1117416 1052628 992707 937313 887016
62744H87016m4801m0012l6556l3831l0837k7334k3835k0715j7906j5411j3583
$$ 887016 842215 802203 765647 731816 700979 673645 649810 629095 611189 595778 582195
62733E82195j2569j1857j0719r012p220n769m600l468k381j497p74K2R58J870
$$ 582195 569626 557769 547050 538038 530818 525049 520449 516981 514600 513103 512329 512351 513309 515179
62719E15179K751L998N962Q335J0258J1226J1620J2283J3686J5833J8658K2094
$$ 515179 517930 521928 527890 536225 546483 557709 569329 581612 595298 611131 629789 651883
62707F51883K5712K8836L1366L4145L8125M3226M8381N2645N5991N9016O2186
$$ 651883 677595 706431 737797 771942 810067 853293 901674 954319 1010310 1069326 1131512
62696A131512O5486O8525P0781P1829P1423O9300O4983N8115M9039L8633K7449
$$ 1131512 1196998 1265523 1336304 1408133 1479556 1548856 1613839 1671954 1720993 1759626 1787075
62685A787075J5262J856j2100k5410l7387m8014n7198o4478o9592p2758p4163
$$ 1787075 1802337 1804193 1792093 1766683 1729296 1681282 1624084 1559606 1490014 1417256 1343093
62674A343093p3701p1600o8750o5820o2462n8065n3032m8530m4990m1640l7786
$$ 1343093 1269392 1197792 1129042 1063222 1000760 942695 889663 841133 796143 754503 716717
62663G16717l3744l0112k6814k3489k0359j7971j6283j4689j2942j1392j0313
$$ 716717 682973 652861 626047 602558 582199 564228 547945 533256 520314 508922 498609
62652D98609r517q849q457q325q011p183o096n166m452l844l393l002k151m99
$$ 498609 489092 480243 471786 463461 455450 448267 442171 437005 432553 428709 425316 422314 420163 419664
62638D19664J368K399K302J737J257P04j08p95r28p83r72j523j926j875j536r98
$$ 419664 421032 423431 425733 427470 428727 429431 429323 428528 427600 426817 425845 424322 422396 420521 418985 417987
62622D17987j07J048J978K393K659L287M235N005N323N341N274N231N378N963
$$ 417987 417880 418928 420906 423299 425958 429245 433480 438485 443808 449149 454423 459654 465032 470995
62608D70995O974Q121R263J0637J2458J4462J6242J7843J9770K2351K5456K8880
$$ 470995 477969 486090 495353 505990 518448 532910 549152 566995 586765 609116 634572 663452
62596F63452L2557L6294L9591M2080M3873M5138M5542M4517M2006L8503L4323
$$ 663452 696009 732303 771894 813974 857847 902985 948527 993044 1035050 1073553 1107876
62585A107876K9267K3058J5693P280j979j1353j9590k5856l0485l4418l8068m1046
$$ 1107876 1137143 1160201 1175894 1183174 1181195 1169842 1150252 1124396 1093911 1059493 1021425 980379
62573I80379m2860m3411m2906m1676m0109l8386l6266l3403k9941k6420k3217
$$ 980379 937519 894108 851202 809526 769417 731031 694765 661362 631421 605001 581784
62562E81784k0354j7947j6259j5204j4155j2546j0432q333o765o023o028o129
$$ 581784 561430 543483 527224 512020 497865 485319 474887 466554 459789 453766 447738 441609
62550D41609n543m295l369l468l967l649k310r14k14J23P90J809K642K954K814
$$ 441609 436066 431771 428402 424934 420967 417318 415008 414094 413880 414003 414793 416602 419244 422198 425012
62535D25012K375J815J497J782K536L220L614M191N558P630R692J1170J2179J3266
$$ 425012 427387 429202 430699 432481 435017 438237 441851 446042 451600 459230 468922 480092 492271 505537
62521E05537J4864J7049J9623K2239K4718K7313L0514L4272L7681L9802M0700
$$ 505537 520401 537450 557073 579312 604030 631343 661857 696129 733810 773612 814312
62510H14312M1255M1933M2244M1448L9300L5828L0958K4831J8125J1512N000j696
$$ 814312 855567 897500 939744 981192 1020492 1056320 1087278 1112109 1130234 1141746 1146746 1145050
62498A145050q180j3425j6836j8762j9751j9698j8148j5083j1069o673k081K781
$$ 1145050 1136870 1123445 1106609 1087847 1068096 1048398 1030250 1015167 1004098 997425 995344 998125
62486I98125P945J3357J8904K4381K9473L3848L7310L9828M1391M1769M0387L6480
$$ 998125 1006070 1019427 1038331 1062712 1092185 1126033 1163343 1203171 1244562 1286331 1326718 1363198
62474A363198K9698K0819J1698L985k466r585j9014l0201m0954m9634n6105o0585
$$ 1363198 1392896 1413715 1425413 1429398 1426932 1417347 1398333 1368132 1327178 1277544 1221439 1160854
62462A160854o2750o2545o1020n9323n7264n3863m9159m4389m0330l6450l2075
$$ 1160854 1098104 1035559 974539 915216 857952 804089 754930 710541 670211 633761 601686
62451F01686k7449k3106j9001j4986j1627r696r017q584p713o511n310m245l440
$$ 601686 574237 551131 532130 517144 505517 495821 486804 478220 470507 463996 458686 454441 451001
62438D51001k960k495j575l52L58Q4o84j163j257j432j878k301k445k439k480
$$ 451001 448041 445546 443971 443619 443977 444061 443377 442214 440957 439525 437647 435346 432901 430462 427982
62423D27982k535k487k417k577l101l790m172l889l109k470k435k703k565j850
$$ 427982 425447 422960 420543 417966 414865 411075 406903 403014 399905 397435 395000 392297 389732 387882
62409C87882j237j415k184k672k339j489p59m71n15o59p38n97p6Q86K114L221
$$ 387882 386645 385230 383046 380374 378035 376546 375787 375316 374801 374142 373404 372807 372731 373617 375731 378952
62393C78952L842L874L463K823K153J770K005K776L516L834M064M741N653O109
$$ 378952 382794 386668 390131 392954 395107 396877 398882 401658 405174 409008 413072 417813 423466 429575
62379D29575O075O418P689R244J0087J0190J0395J1257J2566J3916J5237J6695
$$ 429575 435650 442068 449757 459001 469088 479278 489673 500930 513496 527412 542649 559344
62367E59344J8426K0506K2891K5420K8055L1060L4692L8889M3505M8599N4063
$$ 559344 577770 598276 621167 646587 674642 705702 740394 779283 822788 871387 925450
62356I25450N9153O2968O5323O6498O6169O3309N7416M9134L9368K8521J7086
$$ 925450 984603 1047571 1112894 1179392 1245561 1308870 1366286 1415420 1454788 1483309 1500395
62345A500395O281k874j0767j8517k6206l2673l7331m1211m5573n0093n3243n4186
$$ 1500395 1506676 1503802 1493035 1474518 1448312 1415639 1378308 1337097 1291524 1241431 1188188 1134002
62333A134002n3444n1733m8982m5060m0694l6929l3858l0706k7162k3930k1725
$$ 1134002 1080558 1028825 979843 934783 894089 857160 823302 792596 765434 741504 719779
62322G19779k0346j9124j7841j6750j6074j5862j6062j6290j5877j4638j3253
$$ 719779 699433 680309 662468 645718 629644 613782 597720 581430 565553 550915 537662
62311E37662j2315j1358r652p628o491o413o165m924l388k552k260j753r89m65
$$ 537662 525347 513989 504337 496709 490218 483805 477640 472716 469328 466776 464516 462763 461774 461309
62297D61309j54L80R64R18K56l3O52J635J917J605J723K716L829M179L941L963
$$ 461309 461155 461535 462499 463417 463673 463640 464292 465927 467844 469449 471172 473888 477717 481896 485837 489800
62281D89800M450M731M453M360N275O807P728P548O983O916P558Q701J0134J1584
$$ 489800 494250 498981 503434 507794 513069 519876 527604 535152 542135 549051 556609 565310 575444 587028
62267E87028J2944J4786J7978K2369K6585K9713L2529L6458M1785M7656N3425
$$ 587028 599972 614758 632736 655105 681690 711403 743932 780390 822175 869831 923256
62256I23256N9037O4237O8314P0775P1619P0780O7770O2070N3575M2685L0309
$$ 923256 982293 1046530 1114844 1185619 1257238 1328018 1395788 1457858 1511433 1554118 1584427
62245A584427J7745O147m016j2817k0457k7401l4526m2413n0392n6911o0961o2804
$$ 1584427 1602172 1608319 1604303 1591486 1571029 1543628 1509102 1466689 1416297 1359386 1298425 1235621
62233A235621o3247o2695o1056n8188n4189m9543m4993m0978l7232l3267k9176
$$ 1235621 1172374 1109679 1048623 990435 936246 886703 841710 800732 763500 730233 701057
62222G01057k5558k2721k0412j8376j6588j4926j3167j1458j0274r665r027p955
$$ 701057 675499 652778 632366 613990 597402 582476 569309 557851 547577 537912 528885 520930
62210E20930o806o129n840n362m363k997j580l06P55J597K215K564K740L052L748
$$ 520930 514124 507995 502155 496793 492430 489433 487853 487547 488302 489899 492114 494678 497418 500470 504218
62195E04218M717N730O856Q240R549J0237J0370J0634J1350J1995J2035J1658
$$ 504218 508935 514665 521521 529761 539310 549547 559917 570551 581901 593896 605931 617589
62183F17589J1419J1501J1697J1791J1537J0636R166P815P314P737Q660R912J1841
$$ 617589 629008 640509 652206 663997 675534 686170 695336 703151 710465 718202 726862 736774 748615
62170G48615J4931J9331K4699L0370L5762M0704M5167M8742N0789N1079M9851
$$ 748615 763546 782877 807576 837946 873708 914412 959579 1008321 1059110 1110189 1160040
62159A160040M7010M1852L4031K4436J4675N872j731q385j4482k0415k6235l1586
$$ 1160040 1207050 1248902 1282933 1307369 1322044 1327916 1326185 1317800 1303318 1282903 1256668 1225082
62147A225082l6187m0156m3500m5601m5740m4024m1331l8390l5351l2116k8664
$$ 1225082 1188895 1148739 1105239 1059638 1013898 969874 928543 890153 854802 822686 794022
62136G94022k5007k1256j7755j4809j2245r595o771m193k206n61J285L564N950
$$ 794022 769015 747759 730004 715195 702950 693355 686584 682391 680185 679624 680909 684473 690423
62123F90423P944R484J1145J3471J6099J7845J7905J6585J4604J2093Q833N189
$$ 690423 698367 707851 718996 732467 748566 766411 784316 800901 815505 827598 836431 841620
62111H41620K114K16o74j010j149j573k837n057p658r839j1083j1213j0302q685
$$ 841620 843734 843950 843276 842266 841117 839544 836707 831650 823992 814153 803070 791857 781555 772870
62097G72870o756m615k168L66K420L727M639N643O756P686Q365R004R719J0360
$$ 772870 766114 761499 759331 759697 762117 765844 770483 776126 782882 790568 798933 807937 817656 828016
62083H28016J0770J1027J1399J2147J3417J5230J7428J9566K1077K1790K2217
$$ 828016 838786 849813 861212 873359 886776 902006 919434 939000 960077 981867 1004084
62072A004084K3018K4201K5196K5734K6169K6752K7225K7604K8711L1118L3864
$$ 1004084 1027102 1051303 1076499 1102233 1128402 1155154 1182379 1209983 1238694 1269812 1303676
62061A303676L5063L3816L0736K6580K1222J4375O601r18p319j2462j6679k0538
$$ 1303676 1338739 1372555 1403291 1429871 1451093 1465468 1472069 1471151 1463832 1451370 1434691 1414153
62049A414153k4569k8906l3267l7376m1110m4189m6071m6441m5615m4252m2807
$$ 1414153 1389584 1360678 1327411 1290035 1248925 1204736 1158665 1112224 1066609 1022357 979550
62038I79550m1305l9437l6814l3420k9882k6919k4488k1855j8702j5607j3281
$$ 979550 938245 898808 861994 828574 798692 771773 747285 725430 706728 691121 677840
62027F77840j1730j0556r587q830q148p423o817o521o477o652p200p995q442q201
$$ 677840 666110 655554 645967 637137 628989 621566 614749 608228 601751 595099 587899 579904 571462 563261
62013E63261p703p433p052n993m539l569l214k677j429J38J567L021M747O287
$$ 563261 555558 548125 541073 535080 530541 526972 523758 521081 519652 519790 521357 524378 529125 535412
61999E35412O812O074M626L280K480K026J223m29k584m307n207n913p144q593
$$ 535412 542224 548298 552924 556204 558684 560710 561933 561504 558920 554613 549406 543493 536349 527756
61985E27756r253q780q037q095r011r912j0049r480q711p952o969n541l765j970
$$ 527756 518503 509723 501686 493591 484580 474668 464619 455139 446428 438476 431507 425966 422201 420231
61971D20231n56M8l58j313j881j614j092j160j814k277k016j211k51O00J014P35
$$ 420231 419675 419723 419365 418052 416171 414557 413465 412305 410491 408214 406198 404987 404736 405336 406350 407085
61955D07085J91L68J690L404M478M812N101N887P205Q951J0957J2811J4158J5223
$$ 407085 407276 407644 409334 412738 417216 422028 427129 433016 440221 449172 460129 472940 487098 502321
61941E02321J6609J8458K0244K1425K2022K2305K2403K2332K2129K1725K0865
$$ 502321 518930 537388 557632 579057 601079 623384 645787 668119 690248 711973 732838
61930G32838J9408J7528J5529J3508J1404R091O314K847j004m314o261o962p255
$$ 732838 752246 769774 785303 798811 810215 819306 825620 828467 827463 823149 816888 809926 802671
61917H02671p706q117p925o709m307q33L137O780R765J2539J5560J8397K0045
$$ 802671 794965 786848 778923 772214 767907 767074 770211 776991 786756 799295 814855 833252 853297
61904H53297K0070J8884J6802J3482Q782L648n71l648o576j0094j3741j6642j8580
$$ 853297 873367 892251 909053 922535 931317 934965 934394 930746 924170 914076 900335 883693 865113
61891H65113j9764k0109j9517j8595j8197j8203j7519j5642j3542j2543j2863
$$ 865113 845349 825240 805723 787128 768931 750728 733209 717567 704025 691482 678619
61880F78619j3729j4552j5241j5580j5064j3571j1728j0309r510q994q365p404
$$ 678619 664890 650338 635097 619517 604453 590882 579154 568845 559335 550341 541976 534572
61868E34572n975m019j667P16K695M117N371P151R674J2254J3981J4890J6048
$$ 534572 528597 524578 522911 523627 526322 530439 535810 542961 552635 564889 578870 593760 609808
61855F09808J8359K1628K5013K8069L0907L3514L5453L6422L6716L6809L6644
$$ 609808 628167 649795 674808 702877 733784 767298 802751 839173 875889 912698 949342
61844I49342L5596L3116K9195K4183J8405J2109N655n18o104j0962j4859j7318
$$ 949342 984938 1018054 1047249 1071432 1089837 1101946 1107601 1107083 1100979 1090017 1075158 1057840
61832A057840j7855j6301j2941q469l725P25M905R082J3089J6207J7824J7848
$$ 1057840 1039985 1023684 1010743 1002274 998549 999274 1004179 1013261 1026350 1042557 1060381 1078229
61820A078229J6281J2849P464P70o337j3502k0686k7369l2698l6431l8984m0449
$$ 1078229 1094510 1107359 1114823 1115593 1109256 1095754 1075068 1047699 1015001 978570 939586 899137
61808H99137m0315l8456l5704l3007l0549k8136k5835k3779k1746j9559j7508
$$ 899137 858822 820366 784662 751655 721106 692970 667135 643356 621610 602051 584543
61797E84543j5842j4215j2271j0437r407q979q173o571m937m300m865n873o327
$$ 584543 568701 554486 542215 531778 522371 513392 505219 498648 493711 489411 484546 478673 472346
61784D72346n740m480l289k409j467m03Q2m45j177r67R4Q38O65R2l11n10m60Q0
$$ 472346 466606 462126 458837 456428 454961 454558 454640 454195 453018 452051 452145 452983 453648 453740 453429 452919 452459 452539
61766D52539Q36J022N03J54O44J527K074K288K560K888L059L109L099K867K462
$$ 452539 453375 454397 454900 455054 455698 457225 459299 461587 464147 467035 470094 473203 476302 479169 481631
61751D81631K248K147J387l33k059k728k580k645l237l833m127m229m025l243
$$ 481631 483879 486026 487413 487080 485021 482293 479713 477068 473831 469998 465871 461642 457617 454374
61737D54374k092j055j61P67J345J038K39m0M01Q53J122J870L180L961L468K497
$$ 454374 452282 451227 451066 451833 453178 454216 454455 454415 454816 455669 456791 458661 461841 465802 469270 471767
61721D71767K243K679K983K972L168L620L665K932J829Q97K04m51j169j989k974
$$ 471767 474010 476689 479672 482644 485812 489432 493097 496029 497858 498755 498959 498508 497339 495350 492376
61706D92376m039m847n091m845m461m170l837l241k550k312k776l440l521k884
$$ 492376 488337 483490 478399 473554 469093 464923 461086 457845 455295 452983 450207 446767 443246 440362
61692D40362k126j767j682j439r33m48l60q36j651k313k490k366k267k131j702
$$ 440362 438236 436469 434787 433348 432415 431967 431607 430771 429120 426807 424317 421951 419684 417553 415851
61677D15851j162r80j143j123p86o33r23j183j016p48p46p12k92J30K6l12k03
$$ 415851 414689 413709 412566 411443 410657 410024 409101 407918 406902 406154 405408 404696 404404 404534 404560 404248 404045
61660D04045K15J71m47q30m07M17R40R74P64N96P08J224J968K571K919L161L309
$$ 404045 404260 404431 403984 403154 402747 403164 404104 405078 405842 406438 407146 408370 410338 412909 415828 418989 422298
61643D22298L228L015K920K827K413J802J552J723J616P36n19j519k228k906l408
$$ 422298 425526 428541 431461 434288 436701 438503 440055 441778 443394 444130 443611 442092 439864 436958 433550
61628D33550l453l233l193l319l262l030k975l110k963k278j389p46m51m74r25
$$ 433550 430097 426864 423671 420352 417090 414060 411085 407975 405012 402734 401345 400599 400148 399674 398749
61613C98749j817k831l591m078m539n033n343n290n000m717m570m550m617m680
$$ 398749 396932 394101 390510 386432 381893 376860 371517 366227 361227 356510 351940 347390 342773 338093
61599C38093m554m140l657l466l535l296k408j400j190j887k601k553j978j575
$$ 338093 333539 329399 325742 322276 318741 315445 313037 311637 310447 308560 305959 303406 301428 299853
61585B99853j579j732j932k268k550k404j909j596j654j645j237p89q04j109j118
$$ 299853 298274 296542 294610 292342 289792 287388 285479 283883 282229 280584 279347 278558 277754 276645 275527
61570B75527p19l62k43M8Q03J543J532Q01J97L10P54P73L24R5N14J167J366J019
$$ 275527 274808 274446 274203 274251 275054 276597 278129 278930 279127 279437 280191 280964 281288 281383 281897 283064 284430 285449
61552B85449O09N17P29J081J481J752J638J120N48L44O68J396K276K991L288L121
$$ 285449 286058 286575 287304 288385 289866 291618 293256 294376 294924 295268 295936 297332 299608 302599 305887 309008
61536C09008K630J930J178P20Q37J233J214O04jj76l72j127k000k111j547j311
$$ 309008 311638 313568 314746 315466 316303 317536 318750 319354 319353 319177 318805 317678 315678 313567 312020 310709
61520C10709j757j980j181R6P14L87k65p80j244j745k028j817j093o0Q83J208
$$ 310709 308952 306972 305791 305887 306601 306988 306723 305943 304699 302954 300926 299109 298016 297956 298839 300047
61504C00047O84k91j085j483j606j408p06K97J056J311J263J100P72L65K00L87
$$ 300047 300731 300440 299355 297872 296266 294858 294152 294449 295505 296816 298079 299179 299951 300316 300516 300903
61488C00903O38O76M73M1n19p13%J333K259K313K209K676L313L264K535J844J422
$$ 300903 301541 302217 302690 302731 302212 301499 301499 302832 305091 307404 309613 312289 315602 318866 321401 323245 324667
61471C24667Q49M2m09q1N77P15o8j345k220k082j284q28j117j391q59Q6M98L95
$$ 324667 325516 325558 325149 325068 325645 326360 326292 324947 322727 320645 319361 318533 317416 316025 315166 315252 315750 316145
61453C16145O41J445K048K042J949K103J998J303O73Q54J607K242K614K878K828
$$ 316145 316786 318231 320279 322321 324270 326373 328371 329674 330347 331201 332808 335050 337664 340542 343370
61438C43370K299J899K347L343L923L814L588L528L207K404J590J160Q52L20j91
$$ 343370 345669 347568 349915 353258 357181 360995 364583 368111 371318 373722 375312 376472 377324 377644 377453
61423C77453k15J98N39M93K68K87P26J295J540J376J240J454J612R94m61j983
$$ 377453 377238 377436 377975 378468 378736 379023 379749 381044 382584 383960 385200 386654 388266 389260 388799 386816
61407C86816k820k934k751k632k756l142l611l911l972l851l431k571j567r92
$$ 386816 383996 381062 378311 375679 372923 369781 366170 362259 358287 354436 351005 348434 346867 345875
61393C45875r59r56o81n14q16j167p89L97J637K144J764R34L49N46J416K226K367
$$ 345875 344916 343960 343279 342765 341949 340782 339993 340390 342027 344171 345935 346869 347218 347764 349180 351406 353773
61376C53773K055J959K262K470K201J723J548J786K137K340K336K120J622R27
$$ 353773 355828 357787 360049 362519 364720 366443 367991 369777 371914 374254 376590 378710 380332 381259
61362C81259M45O81J657K733L245L360L937N374O984P878Q198Q866J0197J1403
$$ 381259 381704 382385 384042 386775 390020 393380 397317 402691 409675 417553 425751 434617 444814 456217
61348D56217J1682J1217J0705J0230R208P335N086L238K205J966K252K633K687
$$ 456217 467899 479116 489821 500051 509259 516594 521680 524918 527123 529089 531341 533974 536661
61335E36661K386K092J953J509K54j568l118l964m439m948n411n626n721n775
$$ 536661 539047 541139 543092 544601 544855 543287 540169 536205 531766 526818 521407 515781 510060 504285
61321E04285n381m249l006k652l188l480k791j729j220j077l41J257K916L941
$$ 504285 498904 494655 491649 488997 485809 482329 479538 477809 476589 475512 475171 476428 479344 483285
61307D83285M608N609P068Q478R365R582R002P291M288N17k922n098n904o009
$$ 483285 487893 493502 500570 509048 518413 527995 536997 544288 548576 549093 546171 541073 535169 529160
61293E29160o166o647p206p393o887n748m487l781l946m583m843m075k318k29
$$ 529160 522994 516347 509141 501748 494861 489113 484626 480845 476899 472316 467473 463398 461080 460851
61279D60851J516K810M080N570O915P622P773P877Q039P880P319O905P011P214
$$ 460851 462367 465177 469257 474827 481742 489364 497137 505014 513053 520933 528252 535157 542168 549382
61265E49382O937O372O278O984Q168R454J0744J1877J2410J1983J0695Q999P271
$$ 549382 556319 562691 568969 575953 584121 593575 604319 616196 628606 640589 651284 660283 667554
61252F67554N553L632J497l05j095j008j109k196l836n091n844o706p793q385
$$ 667554 673107 676739 678236 677931 676836 675828 674719 672523 668687 663596 657752 651046 643253 634868
61238F34868p970o902n893n337n378n975o594o385n101l422k056r97l6N42L43
$$ 634868 626898 619996 614103 608766 603388 597413 590819 584434 579333 575911 573855 572858 572822 573364 573707
61223E73707l78r29j011q85q84j145j633k054j936j234o14o53r96q71l48l41j319
$$ 573707 573329 572400 571389 570504 569620 568475 566842 564788 562852 561618 561004 560351 559355 558484 558136 557795 556476
61206E56476k592l064k259m99J486K933L569L999N266P729J0658J3171J5168J7040
$$ 556476 553884 550820 548561 548062 549548 552481 556050 560049 565315 573044 583702 596873 612041 629081
61192F29081J8752J9699J9354J7747J5285J2462R722P427N788M842M467M377M201
$$ 629081 647833 667532 686886 704633 719918 732380 742102 749529 755317 760159 764626 769003 773204
61179G73204L680K774J624M98k76n79p48j401k790m505n890o658o956p049p105
$$ 773204 776884 779658 781282 781780 781504 780925 780177 778776 775986 771481 765591 758933 751977 744928 737823
61164G37823p268p665q357r307j0379j1336j1904j1925j1416j0458r145p596n897
$$ 737823 730555 722890 714533 705226 694847 683511 671607 659682 648266 637808 628663 621067 615170
61151F15170l973j736O01K545L697L860K787K40l462p282j0186j1852j2502j2317
$$ 615170 611197 609461 610062 612607 616304 620164 622951 623191 619729 612447 602261 590409 577907 565590
61137E65590j1376r932q293o545m666k780j011P15K315L347L668M007N236P141
$$ 565590 554214 544282 535989 529444 524778 521998 520987 521702 524017 527364 531032 535039 540275 547416
61123E47416Q763R861J1144J2922J4544J5601J6762J8622K0529K1438K1497K1747
$$ 547416 556179 566040 577184 590106 604650 620251 637013 655635 676164 697602 719099 740846
61111G40846K2424K2617K1734K0453J9863K0158K0551K0137J8568J6049J2893
$$ 740846 763270 785887 807621 828074 847937 868095 888646 908783 927351 943400 956293
61100I56293R101M509n58n155q573j1088j3409j5597j7106j7761j8048j8417j8942
$$ 956293 965394 969903 969345 964190 955617 944529 931120 915523 898417 880656 862608 844191 825249
61087H25249j9624k0392k0691j9861j8197j6853j6347j5807j4286j2137j0439
$$ 825249 805625 785233 764542 744681 726484 709631 693284 677477 663191 651054 640615
61076F40615r564q987q229p254o140m974m060l573l158k368j424q66n21M49K326
$$ 640615 631051 622064 613835 606581 600441 595467 591407 587834 584676 582308 580884 580018 579497 579946 582272
61061E82272M301N522O105O707P490Q120Q572R360J0817J2556J3948J4867J5734
$$ 582272 586573 592095 598200 604907 612397 620517 629089 638449 649266 661822 675770 690637 706371
61048G06371J6834J7973J8892J9698K0666K1852K3269K5171K7692L0279L2087
$$ 706371 723205 741178 760070 779768 800434 822286 845555 870726 898418 928697 960784
61037I60784L2988L3694L4769L6172L7811L9831M1966M3487M4323M5478M7569
$$ 960784 993772 1027466 1062235 1098407 1136218 1176049 1218015 1261502 1305825 1351303 1398872
61026A398872M9578N0129M9540M9635N1748N5948O2050P0149P9975R0727J01930
$$ 1398872 1448450 1498579 1548119 1597754 1649502 1705450 1767500 1837649 1917624 2008351 2110281
61015B110281J13906J27402J43672J64944J93701K31207K77621L33690M01055
$$ 2110281 2224187 2351589 2495261 2660205 2853906 3085113 3362734 3696424 4097479
61006D097479M80717N73010O80175Q07567R61196J145562J363589J610883J858128
$$ 4097479 4578196 5151206 5831381 6638948 7600144 8745706 10109295 11720178 13578306
60997A3578306K035492K046789J821084J368215P89957K34064j71583l58496l22102
$$ 13578306 15613798 17660587 19481671 20849886 21639843 21873907 21702324 21343828 21021726
60988B1021726j15770J52376L38157L13027K7383m62023j023692j516761j845183
$$ 21021726 20905956 21058332 21396489 21709516 21736899 21274876 20251184 18734423 16889240
60979A6889240j977114j935136j772931j550084j313637j091722q97294p34150
$$ 16889240 14912126 12976990 11204059 9653975 8340338 7248616 6351322 5617172
60971E617172o00566m91746m02763l30433k72777k27791j93280j67191j47453
$$ 5617172 5016606 4524860 4122097 3791664 3518887 3291096 3097816 2930625 2783172
60962B783172j31971j19300j08962j00764r4118q8238q2533p6524o9847o2802
$$ 2783172 2651201 2531901 2422939 2322175 2228057 2139819 2057286 1980762 1910915 1848113
60952A848113n6564n2356n0385m9762m9331m8501m7390m6397m5536m4312m2356
$$ 1848113 1791549 1739193 1688808 1639046 1589715 1541214 1493824 1447427 1401891 1357579 1315223
60941A315223m0026l8078l6815l6004l5506l5442l5642l5484l4572l3235l2029
$$ 1315223 1275197 1237119 1200304 1164300 1128794 1093352 1057710 1022226 987654 954419 922390
60930I22390l1071l0042k8642k6809k4684k2523k0509j8593j6683j4991j3895
$$ 922390 891319 861277 832635 805826 781142 758619 738110 719517 702834 687843 673948
60919F73948j3345j2693j1289r121o816n134m364m034l277j744p7Q55J039J263
$$ 673948 660603 647910 636621 627500 620684 615550 611186 607152 603875 602131 602054 602909 603948 605211
60905F05211J987K836L225L136L001L164L553L659K921J366j77r55j157j509k179
$$ 605211 607198 610034 613259 616395 619396 622560 626113 629772 632693 634059 633882 632927 631770 630261 628082
60890F28082k793l377m397n704o445o365o357p206q463r239r433r494r453q989
$$ 628082 625289 621912 617515 611811 605366 599001 592644 585438 576975 567736 558303 548809 539356 530367
60876E30367q139p308o698o290o127o158o046n676n474n689n712m766l028j371
$$ 530367 522228 514920 508222 501932 495805 489647 483601 477925 472451 466762 461050 456284 453256 451885
60862D51885j87P63J509J713J318O53j29r79j386q05K68N84q2m00O51K170K399
$$ 451885 451698 452461 453970 455683 457001 457654 457525 456546 455160 454355 454623 455207 455125 454725 455376 457546 459945
60845D59945R34r34j935k020j861j838j812j576j225j089j337j624j385n79J38
$$ 459945 460879 459945 458010 455990 454129 452291 450479 448903 447678 446589 445252 443628 442243 441664 441802
60830D41802K14o9o2K87N09N04P30J358J853J724J157N50k13j352k407k587j939
$$ 441802 442016 441947 441885 442172 442681 443185 443915 445273 447126 448850 450007 450557 450344 448992 446585 443998 442059
60813D42059j427j654k120k145j977k368l370m185m191l556k800k219j959k210
$$ 442059 440632 438978 436858 434713 432736 430368 426998 422813 418622 415066 412266 410047 408088 405878
60799D05878k962l752l983l501k823k693l367m283m522l791k786k391k648k888
$$ 405878 402916 399164 395181 391680 388857 386164 382797 378514 373992 370201 367415 365024 362376 359488
60785C59488k697k329k130k079k002j817j422p17O2L92J47j06K60J187K058K363
$$ 359488 356791 354462 352332 350253 348251 346434 345012 344295 344357 344749 344896 344790 345050 346237 348295 350658
60769C50658K106J841K346L851N455N797M603L085K465K609K654K395K387K879
$$ 350658 352764 354605 356951 360802 366257 372054 376657 379742 382207 384816 387470 389865 392252 395131
60755C95131L414L451K816J628K60o77q54p25j016j738k209k064j665j480j656
$$ 395131 398545 401996 404812 406440 406700 406023 405169 404444 403428 401690 399481 397417 395752 394272 392616
60740C92616k277l501n067o250o578o314n953n574m981m175l400k939l014l597
$$ 392616 390339 386838 381771 375521 368943 362629 356676 351102 346121 341946 338546 335607 332593 328996
60726C28996m113l687k111l26M38m6q69j077n64J39N49N83L49n5n11p96p20l96
$$ 328996 324883 321196 319085 318759 319197 319151 318282 317205 316641 316780 317329 317912 318261 318206 317695 316899 316179 315783
60708C15783j91k63l29l2N41R40R47P80O93O46N23N29J035K073L121L536L229
$$ 315783 315592 315329 315000 314968 315509 316449 317396 318176 318869 319515 320038 320567 321602 323675 326796 330332 333561
60691C33561K817K921L432L680L421L210L625M383M662M094L015J933J212J218
$$ 333561 336378 339299 342731 346411 349832 353042 356667 361050 365712 369806 372821 374754 375966 377184
60677C77184K058L038L040J799L48k36j30l19j151k059k618l183m077m810m631
$$ 377184 379242 382280 385320 387119 387467 387231 387101 386782 385631 383572 380954 377771 373694 368884 364253
60662C64253l710l133l585m540m958m418l200j647n4J022J099N52L46P80J112
$$ 364253 360543 357410 353825 349285 344327 339909 336709 335062 335008 336030 337129 337681 338027 338807 339919
60647C39919Q49O36J237K157K148Q94p31j950k768l344l482l131k719k618k704
$$ 339919 340768 341404 342641 344798 346946 347840 347109 345159 342391 339047 335565 332434 329715 327097 324393
60632C24393k711k628k496k149j437m38O30J400J326K73q59p60O63J993J948Q01
$$ 324393 321682 319054 316558 314409 312972 312534 313164 314564 315890 316163 315304 314544 315207 317200 319148 319949
60616C19949l21q63r72p06K3R23J457J528J459J308Q18M5m42k17N36J274J646
$$ 319949 319628 318765 317793 317087 317110 318033 319490 321018 322477 323785 324603 324648 324206 323989 324525 325799 327445
60599C27445J720J820K139K390K033J078L85P19J723K248J721P00O3P8M32P66
$$ 327445 329165 330985 333124 335514 337547 338625 339010 339729 341452 343700 345421 346121 346184 346262 346694 347460
60583C47460R31R48R34R89J041R26O86O25J093K169L609M939N773O179O701P749
$$ 347460 348391 349339 350273 351262 352303 353229 353915 354540 355633 357802 361411 366350 372123 378302 385003 392752
60567C92752R050R993J0402J0619J0777J0408R015O754M235J823n85l073n314
$$ 392752 401802 411795 422197 432816 443593 454001 463016 469770 474005 475828 475243 472170 466856
60554D66856o761p145o613n411l587j180J358L266M197M719N795P753R940J1481
$$ 466856 460095 452950 446337 440926 437339 436159 437517 440783 444980 449699 455494 463247 473187 484668
60540D84668J2171J2513J3032J3773J4450J4801J4593J3426J0897P197L234j04
$$ 484668 496839 509352 522384 536157 550607 565408 580001 593427 604324 611521 614755 614651
60528F14651k773n248p516q809q606p484o569o333o281n792m885m024l451k943
$$ 614651 611878 606630 599114 590305 581699 574215 567646 561313 555032 549240 544355 540331 536880 533937
60514E33937k203j232j94J021K713M656N892N744M992N412P885J1576J5190J8536
$$ 533937 531734 530502 530308 531329 534042 538698 544590 550334 555326 560738 568623 580199 595389 613925
60500F13925K2323K6791L1283L5122L8313M1188M3760M5570M5989M4543M1093
$$ 613925 636248 663039 694322 729444 767757 808945 852705 898275 944264 988807 1029900
60489A029900L5757K8686K0042J0215k53j1079k2212l3074m2222m8337n1328n1939
$$ 1029900 1065657 1094343 1114385 1124600 1124347 1113268 1091056 1057982 1015760 967423 916095 864156
60477H64156n0594m7303m2653l8003l4338l1498k8789k5921k3001k0117j7356
$$ 864156 813562 766259 723606 685603 651265 619767 590978 565057 542056 521939 504583
60466E04583j4959j3053j1434r876q503p538o845o036n014m131l767l905m112
$$ 504583 489624 476571 465137 455261 446758 439220 432375 426339 421325 417194 413427 409522 405410
60453D05410l925l279k571k241k356k643k879k931k613j862j103r23j248j266
$$ 405410 401485 398206 395635 393394 391038 388395 385516 382585 379972 378110 377007 376084 374836 373570
60439C73570m76N98J075P77K05l06q33j413j829j997k108k222k018j228j53N29
$$ 373570 373094 373692 374767 375544 375749 375443 374610 373197 371368 369371 367263 365041 363023 361795 361642 362171
60423C62171M64Rj94M0K44Jl89k42N43J298J497J457J758K295K389J736P25j13
$$ 362171 362635 362644 362450 362490 362734 362735 362346 362104 362647 363945 365442 366899 368657 370952 373341 375077 375802 375689
60405C75689n10l16N28J678K451K532K317K281K311K059J701J778K377K889K817
$$ 375689 375179 374863 375391 377069 379520 382052 384369 386650 388961 391020 392721 394499 396876 399765 402582
60390D02582K464K503L053L482L131K092J127R15J395J954K172K259K640L266
$$ 402582 405046 407549 410602 414084 417215 419307 420434 421349 422744 424698 426870 429129 431769 435035
60376D35035L630L456L041K829K864K918K880K815K715K528K346K251K052J530
$$ 435035 438665 442121 445162 447991 450855 453773 456653 459468 462183 464711 467057 469308 471360 472890
60362D72890R43R36J763K906L668L902M052M654N986P966J0144J1858J2653J2543
$$ 472890 473833 474769 476532 479438 483106 487008 491060 495714 501700 509666 519810 531668 544321 556864
60348E56864J1814J0706R265P285M414O13l326o229p723q563r435r937r339p897
$$ 556864 568678 579384 588649 595934 600348 600961 597635 591406 583683 575120 565685 555748 546409 538512
60334E38512o626n892n168m200l543l595l836l572k896k450k570l135l884m393
$$ 538512 531886 525994 520826 516626 513083 509488 505652 502080 499184 496734 494164 491029 487145 482752
60320D82752m071k687p78Q86K100L120M043M858N916P695J0073J2365J4219J5911
$$ 482752 478681 475994 475216 476102 478202 481322 485365 490223 496139 503834 513907 526272 540491 556402
60306E56402J7713J9361K0459K0868K0461J8870J5835J1509O184L3o489j2414
$$ 556402 574115 593476 613935 634803 655264 674134 689969 701478 707662 707695 701206 688792
60294F88792j6948k0192k2592k3823k2951j9843j5724j2061r364p373n892m868
$$ 688792 671844 651652 629060 605237 582286 562443 546719 534658 525294 517921 512029 507161
60282E07161m018l093k373k320k808l266l552m039m745n071m634l773k939k169
$$ 507161 503143 500050 497677 495357 492549 489283 485731 481692 476947 471876 467242 463469 460530 458361
60268D58361j571j618k360k898k450j558j325j793k065j885j919k297k162j178
$$ 458361 456790 455172 452812 449914 447464 445906 444581 442788 440723 438838 436919 434622 432460 431282
60254D31282l49n43j060p45R1O1j201k428k394j250K9Q25J099J024Q21P29Q26
$$ 431282 430933 430390 429330 428585 428676 428737 427536 425108 422714 421464 421493 422318 423417 424441 425262 425991 426817
60237D26817J032J304J574J560J072N89R15K069L063L193K975L257L827L684K603
$$ 426817 427849 429153 430727 432287 433359 433948 434863 436932 439995 443188 446163 449420 453247 456931 459534
60222D59534J625J810L024M243M655M250L622L513M304N606O516O552O182O149
$$ 459534 461159 462969 465993 470236 474891 479141 482763 486276 490580 496186 502702 509254 515436 521585
60208E21585O454O492O096N869O251O714O441N463M620M434M561M424L896L152
$$ 521585 528039 534531 540627 546496 552747 559461 565902 571365 575985 580419 584980 589404 593300 596452
60194E96452K237J236N30M46P05O09j17j041j666k041k585l470m396m913m860
$$ 596452 598689 599925 600455 600901 601606 602215 602098 601057 599391 597350 594765 591295 586899 581986 577126
60179E77126m488m265m465m938n220m898l886k509j360r29j152j398j165o56m30
$$ 577126 572638 568373 563908 558970 553750 548852 544966 542457 541097 540168 539016 537618 536453 535797 535367
60164E35367o09q25r62j342j968k109j156L83J342J233O86N37R63J586K025K178
$$ 535367 534758 533933 532971 531629 529661 527552 526396 526779 528121 529354 530040 530577 531540 533126 535151 537329
60148E37329K177K236K349K184J498O69M62J223K607M155N705P081P963Q314Q571
$$ 537329 539506 541742 544091 546275 547773 548442 548904 550127 552734 556889 562594 569675 577638 585952 594523
60133E94523Q971R096Q540P684P143O672N358K974M97r43j163p62l16o4p6k61
$$ 594523 603494 612590 621130 628814 635957 642629 647987 650961 651458 650515 649352 648590 648274 648210 648134 647873
60117F47873l28n0M33P64P55M77L1n88j347k069k533k717k839l070l308l379l422
$$ 647873 647545 647495 647928 648692 649447 649924 649955 649367 648020 645951 643418 640701 637862 634792 631484 628105 624683
60100F24683l817m556n041m702l541j928j71J333K034J891J754K396L348L550
$$ 624683 620866 616310 611269 606567 603026 601098 600927 602260 604294 606185 607939 610335 613683 617233
60086F17233K953K537K703K790K465K418L000L262K272N69p01j510k684m358n852
$$ 617233 620186 622723 625426 628216 630681 633099 636099 639361 641633 642202 641501 639991 637307 632949 627097
60071F27097o947q076r214r630r017q025p386p228p420p884q243p929o994o243
$$ 627097 620150 612074 602860 593230 584213 576188 568802 561574 554154 546270 538027 530098 523104 516861
60057E16861o217o528o463n751m475k822j250l81k61j09P98K373M089N610O675
$$ 516861 510644 504116 497653 491902 487427 484605 483355 482974 482713 482604 483402 485775 489864 495474 502149
60042E02149O920O356N753N833O317O273N346M134L338K956K410J235m35j957
$$ 502149 509069 515425 521178 527011 533328 539601 544947 549081 552419 555375 557785 559020 558585 556628
60028E56628k765k932l031l497m318n317o287o829o555n714n101n111n379n628
$$ 556628 553863 550931 547900 544403 540085 534768 528481 521652 515097 509383 504282 499171 493792 488164
60014D88164o214p268p952p373n883m618l984l495k960k816l115l090k177q04
$$ 488164 481950 474682 466730 459357 453474 448856 444872 441377 438417 435601 432486 429396 427219 426415
60000D26415K70Q51J174J303J200J100J342J948K688L363L798L777L387L241L889
$$ 426415 426685 427536 428710 430013 431213 432313 433655 435603 438291 441654 445452 449229 452616 455857 459746
59985D59746M967N353M316K339N92k52m93p75j289j773k096k423k709k517j646
$$ 459746 464713 470066 474382 476721 477313 477061 476568 475793 474504 472731 470635 468212 465503 462986 461340
59970D61340p82q92j962k774k193l79J498K494K562K229K087K473L280L908L728
$$ 461340 460558 459666 457704 454930 452737 452358 453856 456350 458912 461141 463228 465701 468981 472889 476617
59955D76617K742J644R99O08j10j200k020k034j471j012j074j613k399l194l738
$$ 476617 479359 481003 482002 482610 482500 481300 479280 477246 475775 474763 473689 472076 469677 466483 462745
59940D62745l852l639l319k928k346j685j254j066o82K01J242J851J899J819K068
$$ 462745 458893 455254 451935 449007 446661 444976 443722 442656 441974 442175 443417 445268 447167 448986 451054
59925D51054K775L838N092O261P020P226P060O825O625O288N573M486L319K412
$$ 451054 453829 457667 462759 469020 476040 483266 490326 497151 503776 510064 515637 520123 523442 525854
59911E25854J904J778J987K413K758K755K530K479K771L185L455L506L213K330
$$ 525854 527758 529536 531523 533936 536694 539449 541979 544458 547229 550414 553869 557375 560588 562918
59897E62918Q78n82j414j470j076n52l1M73J035J798K723L445L641L425L230L282
$$ 562918 563796 563214 561800 560330 559254 558702 558671 559144 560179 561977 564700 568145 571786 575211 578441 581723
59881E81723L427L437L301L208L389L903M463M566L906K648J230l4j105k090l051
$$ 581723 585150 588587 591888 595096 598485 602388 606851 611417 615323 617971 619201 619167 618062 615972 612921
59866F12921l829m034l424k360j580j436j577j553j315r51l28O29J574K186K736
$$ 612921 609092 605058 601634 599274 597694 596258 594681 593128 591813 590862 590534 591163 592737 594923 597659
59851E97659L805N521P437R018R839R473P739N083K342O8j589k512k556j914j127
$$ 597659 601464 606985 614422 623440 633279 642752 650491 655574 657916 657984 656395 653883 651327 649413 648286
59836F48286o19n58j163k714n067p428q879r046q227p051o036n298m653m002l504
$$ 648286 647667 647109 645946 643232 638165 630737 621858 612812 604585 597534 591498 586200 581547 577545 574041
59821E74041l269l104k796k468k378k527k789l141l463l393k861k511k953l786
$$ 574041 570772 567668 564872 562404 560026 557499 554710 551569 548106 544713 541852 539341 536388 532602
59807E32602m001l316k353j490m24Q50J460P16p74j717j562q86m79o09j053j446
$$ 532602 528601 525285 522932 521442 521018 521868 523328 524044 523270 521553 519991 519105 518626 518017 516964 515518
59791E15518j507j190p15l89l92p26j229j645j810j848j969k141k146j962j747
$$ 515518 514011 512821 512106 511717 511325 510599 509370 507725 505915 504067 502098 499957 497811 495849 494102
59776D94102j479r57k60K23L58M55O61O29J96J4R11K690M093M234L638L578M509
$$ 494102 492623 491666 491406 491629 491987 492442 493103 493732 493928 493942 494853 497543 501636 505870 509508 513086 517595
59759E17595N600N938N689N756O523P522Q287Q871R281R139Q370P648P537P686
$$ 517595 523195 529133 534822 540578 547101 554623 562910 571781 581062 590201 598571 606219 613756 621442
59745F21442P495P169P285P585P247O138M892L683K018p4j617j936j527j266j409
$$ 621442 628937 636106 643391 650976 658223 664361 669253 672936 674954 674880 673263 671327 669800 668534 667125
59730F67125j809k407l047l346l277l379l983m687m926m612l939l118k605k910
$$ 667125 665316 662909 659862 656516 653239 649860 645877 641190 636264 631652 627713 624595 621990 619080
59716F19080l740m008l218k168j781j919j905j556r98j01J118K057K283K248K495
$$ 619080 615340 611332 608114 605946 604165 602246 600341 598785 597787 597686 598804 600861 603144 605392 607887
59701F07887K741K545K367K870L673L863L475L287L370L041K208J525J150M15
$$ 607887 610628 613173 615540 618410 622083 625946 629421 632708 636078 639119 641327 642852 644002 644417
59687F44417r45k263k955l198l246k965k421k158k460k936l193l325l467l541
$$ 644417 643472 641209 638254 635056 631810 628845 626424 624266 621806 618870 615677 612352 608885 605344
59673F05344l704m363n362n811n249m334l903l885l673l119k548k130j674q96
$$ 605344 601640 597277 591915 586104 580855 576521 572618 568733 565060 561941 559393 557263 555589 554693
59659E54693L89K044L413L783L268K724K568K357J840J666K352L200L107K022
$$ 554693 555082 557126 560539 564322 567590 570314 572882 575239 577079 578745 581097 584297 587404 589426
59645E89426P44m00j749l336m624n416o129o978p435o934n643m211l075k229j487
$$ 589426 590170 589770 588021 584685 580061 574645 568516 561538 554103 547169 541526 537315 534240 532011 530524
59630E30524p71j92j5m06j149j834k286k693l242l871m380m664m746m701m582
$$ 530524 529753 529561 529546 529140 527991 526157 523871 521178 517936 514065 509685 505021 500275 495574 490992
59615D90992m341l886l260k650k092j406o06r6j03q4O85K045K976K899K376K222
$$ 490992 486651 482765 479505 476855 474763 473357 472751 472655 472552 472468 473153 475198 478174 481073 483449 485671
59599D85671K381K159J332M63J94N97J283J814J926J671J426J491J583J038k62
$$ 485671 488052 490211 491543 492006 492200 492797 494080 495894 497820 499491 500917 502408 503991 505029 504767
59584E04767j499j806j344j066j455k095k549l060l993m947n098m314l343k823
$$ 504767 503268 501462 500118 499052 497597 495502 492953 489893 485900 480953 475855 471541 468198 465375
59570D65375k547j961j057m14m85j092j631j653j267r47r12q21k48O10J065Q06
$$ 465375 462828 460867 459810 459396 458911 457819 456188 454535 453268 452321 451409 450588 450340 450950 452015 452821
59554D52821L16K47P13J473K417L556M667N353N452N164M903N176O368Q276J0158
$$ 452821 453137 453384 454097 455570 457987 461543 466210 471563 477015 482179 487082 492258 498626 506902 517060
59539E17060J1639J3350J5979J8758J9625J7174J1950N653k97n049p945q719p845
$$ 517060 528699 542049 558028 576786 596411 613585 625535 631188 630891 625842 617897 609178 601333
59526F01333o074l719r08J716L336M000M471M917M508K714K65j784l401n200p146
$$ 601333 595259 591540 590632 592348 595684 599684 604155 609072 613580 616294 616559 614775 611374 606174 599028
59511E99028q435q706q556q710r157r423r192q436p274o031n137m690m271l441
$$ 599028 590593 581887 573331 564621 555464 546041 536849 528413 521139 515108 509971 505281 501010 497569
59497D97569k303j318p57n16l85k46m9K29N72R64J425J920K294K419K379K397
$$ 497569 495266 493948 493191 492675 492290 492044 491995 492224 492796 493760 495185 497105 499399 501818 504197 506594
59481E06594K634L077L616M108M497M883N450O189O742O543N259L155J074j52
$$ 506594 509228 512305 515921 520029 524526 529409 534859 541048 547790 554333 559592 562747 563821 563669
59467E63669m42n13r89j589j515n53O97J700K614L803N167O324P106P536P594
$$ 563669 563227 562714 561725 560136 558621 558068 558765 560465 563079 566882 572049 578373 585479 593015 600609
59452F00609P392P365P823Q459Q742Q658Q543Q146O489L031j394n147p282q204
$$ 600609 608001 615366 623189 631648 640390 649048 657591 665737 672226 675257 673863 668716 661434 653230
59438F53230q856r550r769r086p930p177p084p002o268n044l965l256k483j126
$$ 653230 644374 634824 625055 615969 608039 600862 593778 586776 580508 575464 571499 568243 565760 564634
59424E64634J037L863O949R699J1728J3209J4647J6269J7874J9344K1093K3717
$$ 564634 565671 569534 576483 586182 597910 611119 625766 642035 659909 679253 700346 724063
59412G24063K7123K9905K9727K4781J5272L513p536j5753k0169k0645j7793j2825
$$ 724063 751186 781091 810818 835599 850871 854384 846848 831095 810926 790281 772488 759663
59400G59663o797j36O449J0895J0624M872m344j3823k1240k5614k6737k5068k1781
$$ 759663 752866 752730 759179 770074 780698 785570 781226 767403 746163 720549 693812 668744 646963
59387F46963j8143j4700j1443q525o269m564k882j047M93J356J768K194K732L216
$$ 646963 628820 614120 602677 594152 587883 583319 580437 579390 579883 581239 583007 585201 587933 591149
59373E91149L643M157M651M833M637M277L892L454L107L211L809M386M478M304
$$ 591149 594792 598949 603600 608433 613070 617347 621239 624693 627800 631011 634820 639206 643684 647988
59359F47988M438N004N586N871O018O372P175Q536J0298J1903J2828J3196J3565
$$ 647988 652426 657430 663016 668887 674905 681277 688452 696988 707286 719189 732017 745213 758778
59346G58778J4078J4280J3947J3514J3352J3131J2312J0839Q950O626L772P22
$$ 758778 772856 787136 801083 814597 827949 841080 853392 864231 873181 879807 883579 884301
59334H84301j979m147o014p819r667j1578j3311j4368j4489j3970j3213j2284
$$ 884301 882322 878175 872161 864342 854675 843097 829786 815418 800929 786959 773746 761462
59322G61462j1227j0357r772q961p528n938m832l975k707j225m30m97n76q5N89
$$ 761462 750235 739878 730106 721145 713617 707679 702847 698872 696165 694940 694510 694013 693437 693352 693941
59307F93941J021J549K595L888M924N876P372R468J1148J0863P581J566n637j2183
$$ 693941 694962 696511 699106 702994 707918 713794 721166 730634 741782 752645 760226 761792 756155 743972
59293G43972j6903j9469j9947j8711j6560j4303j2168j0045q193p051o386n262
$$ 743972 727069 707600 687653 668942 652382 638079 625911 615866 607673 600622 594236 588974
59281E88974l199p68J137K220K835L569M872O669Q302R305J0081J1251J2432J2582
$$ 588974 585775 585007 586144 588364 591199 594768 599640 606309 614611 623916 633997 645248 657680 670262
59267F70262J1561J0413R805R159P743N687L331M82k902n946p659q132q194q256
$$ 670262 681823 692236 702041 711200 718943 724630 727961 728443 725541 719595 711936 703804 695610 687354
59253F87354q139p742p220o634o019n577n290m633l127j078P51K016K946L742
$$ 687354 679215 671473 664253 657619 651600 646023 640733 636100 632973 631895 632646 634662 637608 641350
59239F41350M326M609M688M788N148N737O039N471M118K671J518M75m47p90n88
$$ 641350 645676 650285 654973 659761 664909 670646 676685 682156 686274 688945 690463 690938 690491 689701 689113
59224F89113p36j855l416m650n674o933q071q330p656o594n392m054k973k550
$$ 689113 688377 686522 683106 678456 672782 665849 657778 649448 641792 635198 629806 625752 622779 620229
59210F20229k366j650m96K08L5o12j328k083k716k905k783k849l133l081k450
$$ 620229 617863 616213 615717 615925 615960 615348 614020 611937 609221 606316 603533 600684 597551 594470 592020
59195E92020j657j074o24k50j60l42l47J82J130K189L172L873M125M064L950L693
$$ 592020 590363 589289 588665 588415 588255 587913 587566 587748 588878 591067 594239 598112 602237 606301 610251 613944
59179F13944L085K492K666L636M440M339L825L958N033O397P371P951Q518R183
$$ 613944 617029 619521 622187 625823 630263 634602 638427 642385 647418 653815 661186 669137 677655 686838
59165F86838R619R512R039Q642Q371P709O226M101J823l60k412m342o293q426
$$ 686838 696457 705969 715008 723650 732021 739730 745956 750057 751880 751520 749108 744766 738473 730047
59151G30047j0327j1038j0278r115q750r064r156q922r038r579r812r473r119
$$ 730047 719720 708682 698404 689289 680539 671475 662319 653397 644359 634780 624968 615495 606376
59138F06376q976q478p376o398o206o408o156n204l857k390r50L14J496K881M397
$$ 606376 597400 588922 581546 575148 568942 562534 556378 551174 547317 544927 543977 544291 545787 548668 553065
59123E53065N532O082O534P375Q465R439J0232J0857J1115J0966J0795J0903J1059
$$ 553065 558597 564679 571213 578588 587053 596492 606724 617581 628696 639662 650457 661360 672419
59110F72419J0970J0793J0743J0577J0022R388R180R237Q792P406N465L752K755
$$ 672419 683389 694182 704925 715502 725524 734912 744092 753329 762121 769527 774992 778744 781499
59097G81499K357J980J104j96j330j882k025k187k508k807k793k318j606j373
$$ 781499 783856 785836 786940 786744 785414 783532 781507 779320 776812 774005 771212 768894 767288 765915
59083G65915k302m259o376q022r241j0174j0634j0618j0597j0790j0619r501p824
$$ 765915 763613 759354 752978 744956 735715 725541 714907 704289 693692 682902 672283 662782 654958
59070F54958o544n969n631n170m795m815n213n759o161o084n363m298l436l014
$$ 654958 648414 642445 636814 631644 626849 622034 616821 611062 604901 598817 593454 589156 585720 582706
59056E82706k799k543k322k415k948l687m081l715k828k180k157k264j777q11
$$ 582706 579907 577364 575042 572627 569679 565992 561911 558196 555368 553188 551031 548767 546990 546179
59042E46179k09l74o64j61J175K464K944K787K835L608M856N997O788P357P846
$$ 546179 545970 545596 544932 544771 545946 548410 551354 554141 556976 560584 565440 571437 578225 585582 593428
59027E93428Q383R340J1076J3336J5247J6216J6561J7012J7823J8559J8636J7707
$$ 593428 601811 611151 622227 635563 650810 667026 683587 700599 718422 736981 755617 773324
59015G73324J5695J2647Q679M041p28m788p467q813r432r622q973p071m317j723
$$ 773324 789019 801666 810345 814386 813658 808870 801403 792590 783158 773536 764563 757492 753175 751452
59001G51452J02J469L004M719N817N512L966K222J068K14j145l165n177o586p474
$$ 751452 751554 753023 756027 760746 766563 772075 776041 778263 779331 779545 778400 775235 770058 763472 755998
58986G55998q195q833r276r445r295q795q050p214o209m877l368k072j083r6J108
$$ 755998 747803 738970 729694 720249 710954 702159 694109 686895 680686 675809 672441 670369 669286 669190 670298
58971F70298K448L856N271O307O548O293O413P175P858P813P275O711O021M885
$$ 670298 672746 676602 681873 688180 694728 701021 707434 714609 722467 730280 737555 744266 750287 755172
58957G55172L383J664m50k961n321p182r043j1378j3513j4316j3760j2864j2232
$$ 755172 758555 760219 759769 756808 751487 744305 735262 723884 710371 696055 682295 669431 657199
58944F57199j1525j0472r406q536p433n728l854k609k238k311k236j737r32j85
$$ 657199 645674 635202 625796 617260 609827 604099 600245 597636 595398 593087 590851 589114 588182 587997
58930E87997K22K94K20J56J51J19j97r46j717j843j428j536k751m092m184l166
$$ 587997 588219 588513 588733 588889 589040 589159 588962 588016 586299 584456 583028 581492 578741 574649 570465 567299
58914E67299k367k264j878n51R74J810K340L438M961O006O416O999Q273R814J0971
$$ 567299 564932 562668 560790 560239 561213 563023 565363 568801 573762 579768 586184 593183 601456 611270 622241
58899F22241J1589J1761J1498J0932J0411J0085R732R325R324J0122J1501J3089
$$ 622241 633830 645591 657089 668021 678432 688517 698249 707574 716898 727020 738521 751610
58887G51610J4982J7280J9253J9808J8838J7312J5822J3818J0780P364M606K495
$$ 751610 766592 783872 803125 822933 841771 859083 874905 888723 899503 906867 911473 913968
58875I13968K23k461n074p443r884j2147j3147j2250j0190q252o962o060n342
$$ 913968 914191 911730 906656 899213 889329 877182 864035 851785 841595 833343 826381 820321 814979
58862H14979n041n464o611q053r177r797j0435j1573j2734j2955j2199j1509j1451
$$ 814979 809938 804474 797863 789810 780633 770836 760401 748828 736094 723139 710940 699431 687980
58849F87980j1298j0228q578p229o366n631n085n107n663o351p009p727q377q777
$$ 687980 676682 666454 657876 650647 644281 638650 633565 628458 622795 616444 609435 601708 593331 584554
58835E84554r023r143q619p010m870l348k933l165l445l519l252k625j957j582
$$ 584554 575531 566388 557769 550759 545889 542541 539608 536443 532998 529479 526227 523602 521645 520063
58821E20063j330q63l34p7J66R32J931K205J547R17J092J602J559R30M78P21J445
$$ 520063 518733 517870 517536 517459 517625 518557 520488 522693 524240 525157 526249 527851 529410 530340 530818 531539 532984
58804E32984K046J999J152j29j128j270m91P68J771J902J171K96j02k38p52j668
$$ 532984 535030 537029 538181 538052 536924 535654 535163 535931 537702 539604 540775 541071 540969 540731 539979 538311
58788E38311k235j830n04J362L385N142O283O929P388P506O783N405M460M751
$$ 538311 536076 534246 533742 535104 538489 543631 549914 556843 564231 571737 578520 583925 588385 593136
58774E93136N775O269N427L290L95k505m642n709o078o340o671o779o272m956
$$ 593136 598911 605180 610607 613897 614292 611787 607145 601436 595358 589018 582347 575568 569296 564340
58760E64340l011j111l9P5MO36K063L684M898N482N440M867M033L267K694K262
$$ 564340 561329 560218 560179 560254 560258 560894 562957 566641 571539 577021 582461 587328 591361 594628 597322 599584
58744E99584K065K451L642N259O408O444N718N343O001P165P829P879Q262R638
$$ 599584 601649 604100 607742 613001 619409 625853 631571 636914 642915 650080 657909 665788 674050 683688
58730F83688J1366J2268J2107J1773J1920J1989J0950Q771O565N287M843M764
$$ 683688 695054 707322 719429 731202 743122 755111 766061 774832 781397 786684 791527 796291
58718G96291N224O644Q599R932J0157R973J0000R730Q302N764K887O0k875n901
$$ 796291 801515 808159 816758 826690 836847 846820 856820 866550 874852 880616 883503 883563 880688 874787
58704H74787q709j1360j4374j7900k1222k3387k4102k3929k3677k3632k3343k2231
$$ 874787 866078 854718 840344 822444 801222 777835 753733 729804 706127 682495 659152 636921
58692F36921k0425j8549j6733j4368j1287q480o933o316n609m701m358m804n356
$$ 636921 616496 597947 581214 566846 555559 547079 540146 533830 528221 523520 519162 514358 509002
58679E09002n478n324n074m584l835l018k005m49J455L060M246N461O683P332
$$ 509002 503524 498200 493126 488542 484707 481689 479684 479235 480690 483750 487996 493457 500140 507472
58665E07472P526Q339J0202J1927J2109J0833R152P508N493K891P8k508m643o115
$$ 507472 514998 523337 533539 545466 557575 568408 577560 585068 590561 593452 593530 591022 586379 580264
58651E80264o792o884o797o722o578o202n425m231l033k476k740l281l451l044
$$ 580264 573472 566588 559791 553069 546491 540289 534864 530633 527600 525124 522384 519103 515652 512608
58637E12608k127q21N22J396J776K116K455K172J033j55n25k59m4LJ19J65m0L3
$$ 512608 510481 509660 510182 511578 513354 515470 517925 520097 521130 520975 520450 520191 520147 520150 520269 520434 520394 520427
58619E20427R56K250K915K979L387M391N176N369N689O500O783N424K868O09n02
$$ 520427 521383 523633 526548 529527 532914 537305 542481 547850 553539 560039 566822 572246 575114 575723 575221
58604E75221p02m64q4K7m30j082j286j177j497k294k629k030j348j401j444m6
$$ 575221 574519 574055 573971 573998 573568 572486 571200 570023 568526 566232 563603 561573 560225 558824 557380 557334
58588E57334K749N262O338O730P810R728J1498J2393J2466J1953J0925R691Q917
$$ 557334 560083 565345 571683 578413 586223 595951 607449 619842 632308 644261 655186 664877 673794
58575F73794R079R980J1025J1889J2804J4217J6157J8077J9488K0649K2262K4509
$$ 673794 682873 692853 703878 715767 728571 742788 758945 777022 796510 817159 839421 863930
58563H63930K6895K9121L1406L3607L4685L3731L1069K7681K3890J9354J4112
$$ 863930 890825 919946 951352 984959 1019644 1053375 1084444 1112125 1136015 1155369 1169481
58552A169481Q808L945m12m267p686j0987j4252j6717j7568j7352j7721j9533
$$ 1169481 1178289 1182234 1181822 1177555 1169869 1158882 1144630 1127913 1110345 1092993 1075272 1055739
58540A055739k1963k3872k5221k6616k8035k8736k8254k7008k5769k4742k3205
$$ 1055739 1033776 1009904 984683 958067 930032 901296 873042 846034 820265 795523 772318
58529G72318k0319j6262j2299r403p300n347l796l289l442l045j793q02j081k288
$$ 772318 751999 735737 723438 714035 706735 701388 697592 694303 690861 687816 686023 685221 684140 681852
58515F81852l358l685l413l063l159l696l926l167j873j204j519k082k227j897
$$ 681852 678494 674809 671396 668333 665174 661478 657552 654385 652512 651308 649789 647707 645480 643583
58501F43583j059L63J738K012J219O09Q54J176Q41L78N08R54J233J811L324N314
$$ 643583 642524 642887 644625 646637 647856 648465 649319 650495 651336 651714 652222 653176 654409 656220 659544 664858
58485F64858O813P817R159J1218J3653J6146J8567K0516K1517K1632K1272K0506
$$ 664858 671671 679488 688647 699865 713518 729664 748231 768747 790264 811896 833168 853674
58473H53674J8969J6300J2315O987Q42m949r403j2480j4614j5812j5719j4362
$$ 853674 872643 888943 901258 908245 909087 904138 894735 882255 867641 851829 836110 821748
58461H21748j2302j0114q048n985l501k16L607P077R512J0966J1771J1868J0892
$$ 821748 809446 799332 791284 785299 781798 781582 785189 792266 801778 812744 824515 836383 847275
58448H47275Q529M731K0m354p233q716r892j1289j2292j2271j1319r568o774l163
$$ 847275 855804 860535 860555 856201 848968 840252 830360 819071 806779 794508 783189 773621 766847 763684
58434G63684K36K674M373N652O334O703P890J0451J3384J5501J6863J7847J7707
$$ 763684 763920 766594 770967 776619 782953 789656 797546 807997 821381 836882 853745 871592 889299
58421H89299J5381J1167O300J338l805q554j1760j3029j3022j2423j1556j0813
$$ 889299 904680 915847 922147 923485 919680 911126 899366 886337 873315 860892 849336 838523
58409H38523j0558j0546j0259r717r355r181q721p677o077m001j715J96J333J895
$$ 838523 827965 817419 807160 797443 788088 778907 770186 762509 756432 752431 750716 750912 752245 754140
58395G54140K236K419K597L174M026M291L562K612K186J929J351J077J930L403
$$ 754140 756376 758795 761392 764566 768592 772883 776445 779057 781243 783172 784523 785600 787530 790933
58381G90933M284M393M582N250N946O246O061N300M108L201L139L582L954M407
$$ 790933 795217 799610 804192 809442 815388 821634 827695 832995 837103 840304 843443 847025 850979 855386
58367H55386N313O360P085P765Q783R684R905R982J0817J2196J3078J3057J2439
$$ 855386 860699 867059 874144 881909 890692 900376 910281 920263 931080 943276 956354 969411 981850
58354I81850J1235R198O655M252K192N36k06K14R85J233J354K295M002N634O874
$$ 981850 993085 1002283 1008938 1013190 1015382 1015918 1015712 1015926 1016911 1018144 1019498 1021793 1025795 1031429 1038303
58339A038303P956Q900R729J0872J2308J3129J3057J3423J5236J7196J7328J5757
$$ 1038303 1046259 1055159 1064888 1075760 1088068 1101197 1114254 1127677 1142913 1160109 1177437 1193194
58327A193194J4050J2582J0550Q097O249N038L643K299K065K774L180L179L916
$$ 1193194 1207244 1219826 1230376 1238473 1244722 1249760 1253403 1255702 1257767 1260541 1263721 1266900 1270816
58314A270816N533O748P016P371Q632J0286J1615J2586J3313J3750J4080J4548
$$ 1270816 1276349 1283097 1290113 1297484 1306116 1316402 1328017 1340603 1353916 1367666 1381746 1396294
58302A396294J4998J5458J6591J8438J9581J9005J7901J7899J8462J8130J7384
$$ 1396294 1411292 1426750 1443341 1461779 1481360 1500365 1518266 1536165 1554627 1572757 1590141
58291A590141J7766J8923J9194J8814J9727K2222K4504K5755K7011K8716K9961
$$ 1590141 1607907 1626830 1646024 1664838 1684565 1706787 1731291 1757046 1784057 1812773 1842734
58280A842734L0507L1164L1831L1579L0903L1481L3444L5366L7103L9899M3432
$$ 1842734 1873241 1904405 1936236 1967815 1998718 2030199 2063643 2099009 2136112 2176011 2219443
58269B219443M5694M6426M7811N0983N4561N7421O0249O3490O6332O8583P1088
$$ 2219443 2265137 2311563 2359374 2410357 2464918 2522339 2582588 2646078 2712410 2780993 2852081
58258B852081P3444P3888P2166P0082O8573O6838O4897O4195O5008O6124O7683
$$ 2852081 2925525 2999413 3071579 3141661 3210234 3277072 3341969 3406164 3471172 3537296 3604979
58247C604979P1400P7285Q3347Q9139R6249J04627J12004J17997J25069J34222
$$ 3604979 3676379 3753664 3837011 3926150 4022399 4127026 4239030 4357027 4482096 4616318
58237D616318J43395J51510J60330J70881J81657J92058K03964K18300K33560
$$ 4616318 4759713 4911223 5071553 5242434 5424091 5616149 5820113 6038413 6271973
58228F271973K49227K66997K87259L08274L30196L55700L85298M16535M49324
$$ 6271973 6521200 6788197 7075456 7383730 7713926 8069626 8454924 8871459 9320783
58219I320783M87289N32129N81626O35094O95620P65137Q42916R30826J034161
$$ 9320783 9808072 10340201 10921827 11556921 12252541 13017678 13860594 14791420 15825581
58210A5825581J155291J293076J450723J637133J858457K116870K421004K789156
$$ 15825581 16980872 18273948 19724671 21361804 23220261 25337131 27758135 30547291
58202C0547291L239086L784416M444683N247181O213335P355525Q694174J0265804
$$ 30547291 33786377 37570793 42015476 47262657 53475992 60831517 69525691 79791495
58194G9791495J2108129J4253018J6742625J9634004K2972761K6759237L0883032
$$ 79791495 91899624 106152642 122895267 142529271 165502032 192261269 223144301
58187B23144301L4939222L7974932L8473933L4865607K6390698J3724317j126018
$$ 223144301 258083523 296058455 334532388 369397995 395788693 409513010 408386992
58180D08386992j5569622k7337167l5095451l8614420l8548333l6000884l2093705
$$ 408386992 392817370 365480203 330384752 291770332 253221999 217221115 185127410
58173A85127410k7709495k3430628j9578319j6274458j3513444j1235970r373781
$$ 185127410 157417915 133987287 114408968 98134510 84621066 73385096 64011315
58166F4011315p857943o620314n604533m770346m083859l512479l032379k631216
$$ 64011315 56153372 49533058 43928525 39158179 35074320 31561841 28529462 25898246
58158B5898246k298295k018948j781329j580686j412612j268549j141561j030268
$$ 25898246 23599951 21581003 19799674 18218988 16806376 15537827 14396266 13365998
58150A3365998r33503q46632p66361o93837o29684n70948n15911m67074m26168
$$ 13365998 12432495 11585863 10819502 10125665 9495981 8925033 8409122 7942048 7515880
58141G515880l90706l58511l31355l10864k94570k79098k63960k49517k34533
$$ 7515880 7125174 6766663 6435308 6124444 5829874 5550776 5286816 5037299 4802766
58132D802766k18468k03246j90183j77881j65223j53626j44242j35704j26752
$$ 4802766 4584298 4381052 4190869 4012988 3847765 3694139 3549897 3414193 3287441
58123C287441j18390j11488j05017r8469r3329r0155q6941q2368p7962p5022p2110
$$ 3287441 3169051 3057563 2952546 2854077 2760748 2670593 2583652 2501284 2423322 2348300 2276190
58112B276190o7821o3445o0489n7902n4225n0415m8084m6733m5093m3530m2878
$$ 2276190 2208369 2144924 2084435 2026533 1972308 1921893 1873809 1827076 1781983 1738453 1695575
58101A695575m2382m1000l9429l8736l8250l6747l4604l2976l1822l0426k8830
$$ 1695575 1653193 1612193 1572764 1534028 1495778 1459031 1424427 1391451 1359629 1329203 1300373
58090A300373k7295k5314k2603k0031j8245j6578j4509j3007j3048j3967j4601
$$ 1300373 1273078 1247764 1225161 1205130 1186885 1170307 1155798 1142791 1129743 1115776 1101175
58079A101175j4987j5659j6403j6964j7862j9267k0191j9975j9451j9464j9448
$$ 1101175 1086188 1070529 1054126 1037162 1019300 1000033 979842 959867 940416 920952 901504
58068I01504j8624j7367j6172j4564j2400j0920j0960j1288j0306q409p093o696
$$ 901504 882880 865513 849341 834777 822377 811457 800497 789209 778903 770494 763401 756705
58056G56705o586o771p675q936r851j0446j0900j0618r211p677p181p338p010
$$ 756705 750119 743348 735673 726737 716886 706440 695540 684922 675711 668034 660853 653515 646505
58043F46505o208n765n781n750n809o399p037o830n995n586n886o233o283o381
$$ 646505 640297 634532 628751 623001 617192 610793 603756 596926 590931 585345 579459 573226 566943 560562
58029E60562o750p337q326r846j1254j1528j0423q616o893n756n448n682n671
$$ 560562 553812 546475 538149 528303 517049 505521 495098 486482 479589 473833 468385 462703 457032
58016D57032n034m347m185m154l591k758k436k683k839k549k008j409p85l05j02
$$ 457032 451998 447651 443466 439312 435721 432963 430527 427844 425005 422456 420448 419039 418254 417949 417847
58001D17847j6J40L28O84J582K884L698L497K961L048L679M062L884L397K692
$$ 417847 417831 417971 418299 418983 420565 423449 427147 430644 433605 436653 440332 444394 448278 451675 454367
57986D54367J654M62m87j130j790k802m279o030p464q001p701p100o352n189l854
$$ 454367 456021 456483 455996 454866 453076 450274 445995 439965 432501 424500 416799 409699 403347 398158 394304
57971C94304l128l195l271k886k523k557k454j716p77k04K01P53J071P26P9k90
$$ 394304 391176 387981 384710 381824 379301 376744 374290 372574 371797 371593 371794 372547 373618 374344 374423 374133
57955C74133m83q85j411j793k073k275k102j573j237j252r76j0J116J920K791
$$ 374133 373650 372765 371354 369561 367488 365213 363111 361538 360301 359049 358073 358063 359179 361099 363890
57940C63890M126N532O645P885R553J0990J1509J1417J1257J0863R956Q787P297
$$ 363890 368016 373548 380193 388078 397631 408621 420130 431547 442804 453667 463623 472410 479707
57927D79707M677P84k976n400p111r128j0889j1273j0732j0606j0782r954p969
$$ 479707 484384 485168 482192 476792 469681 460553 449664 438391 427659 417053 406271 396317 388348
57914C88348o166n306m733l795k718j795q79N9Q12J520K507L544L993L648K729
$$ 388348 382182 376876 372143 368348 365630 363835 362956 363015 363827 365347 367854 371398 375391 379039 381768
57899C81768J350k12j097p62J21N29N30Q15J336J583J699K014J937P83o20q16
$$ 381768 383118 382906 381809 381047 381168 381697 382227 383042 384378 385961 387660 389674 391611 392394 391774 390958
57883C90958m3o5j620l649n102n924o069n211l943l624m419m848l922k480j669
$$ 390958 390915 390850 389230 385581 380479 374555 368486 363275 359332 355708 351289 346441 342519 340039 338370
57868C38370j370r12l31J8L26R83J950L064M402N917P196P949Q255Q252Q090Q152
$$ 338370 337000 336088 335757 335775 336101 337084 339034 342098 346500 352417 359613 367562 375817 384069 392159 400311
57852D00311Q518Q366O893M732L239K367P35j935m104m769m975n988p295p628
$$ 400311 408829 417195 424088 428820 432059 434426 435161 433226 429122 424353 419378 413390 406095 398467
57838C98467p041o646o900p280p241o622n403l854k600j931j446p81j67K11P00
$$ 398467 391426 384780 377880 370600 363359 356737 351334 347480 344880 342949 341503 340722 340555 340766 341466
57823C41466J460J919J707J430J726K116J704N22o72j608k653l937n240o489p757
$$ 341466 342926 344845 346552 347982 349708 351824 353528 354050 353378 351770 349117 345180 339940 333451 325694
57808C25694q827r421r676r791r420q113o196m548l507k598j412j52P51J166J282
$$ 325694 316867 307446 297770 287979 278559 270446 264250 259702 256195 253597 252185 252033 252784 253950 255232
57793B55232J360J589J978K399K831L421M189M865N209N343N615O287P376Q538
$$ 255232 256592 258181 260159 262558 265389 268810 272999 277864 283073 288416 294031 300318 307694 316232
57779C16232R133Q837Q271Q429R354R896R089P144M812K482M05q96j259j565k927
$$ 316232 325365 334202 342473 350902 360256 370152 379241 386385 391197 393679 394084 393188 391929 390364 387437
57764C87437n348p750r225r705r565r149q697q272p693o865o023n399m842m089
$$ 387437 382089 374339 365114 355409 345844 336695 327998 319726 312033 305168 299145 293746 288904 284815
57750B84815l165k199j106P7Q82R62P40R42J516J725J232N25J39N8Q8L02P94J355
$$ 284815 281650 279451 278345 278422 279304 280266 281006 281948 283464 285189 286421 286946 287085 287143 287231 287533 288327 289682
57732B89682J802K382L434M705N366M886L717K875K781K838K230R75j46o26p26
$$ 289682 291484 293866 297300 302005 307371 312257 315974 318849 321630 324468 326698 327673 327527 326901 326175
57717C26175q98j152j258j305j653k458l450m187m431m352m386m711m888m311
$$ 326175 325277 324125 322867 321562 319909 317451 314001 309814 305383 301031 296645 291934 287046 282735
57703B82735l099k180k209k758k825j980o71M62J169J431J054k28k191l925m583
$$ 282735 279636 277456 275247 272489 269664 267684 267013 267475 268644 270075 271129 270901 268710 264785 260202
57688B60202m349m218m636m855m041k538j286l22J157L398N724P750R966J2726
$$ 260202 255853 251635 246999 242144 238103 235565 234279 233957 235114 238512 244236 251986 261952 274678
57674B74678J5610J8335K1478K5659L0683L6206M2428M9120N4238N4571M7845
$$ 274678 290288 308623 330101 355760 386443 422649 465077 514197 568435 623006 670851
57663F70851L3919J4443p581k8169m3593n2120n4422n2341m7581m1357l4600k7987
$$ 670851 704770 719213 711632 683463 639870 587750 533328 480987 433406 392049 357449 329462
57651C29462k2037j7154j3406j0360p560n139l600l012k791k384j792j296j020
$$ 329462 307425 290271 276865 266505 258945 253806 250206 247194 244403 242019 240227 238931 237911
57638B37911q76p45n52l06j37j07p5Q5J86j14q31j548j890j910j935k095k181
$$ 237911 237035 236290 235738 235432 235295 235188 235113 235198 235384 235270 234439 232891 231001 229091 227156 225061 222880
57621B22880k007j822k108k891l467l222k561k499l279l954l675k729j905j288
$$ 222880 220873 219051 216943 214052 210585 207363 204802 202303 199024 195070 191395 188666 186761 185473
57607A85473l88P46J349R92J99k32j76j13l67p00p20m47l10o11j172j564j579
$$ 185473 185085 185831 187180 188172 188371 188139 187963 187850 187483 186783 186063 185616 185306 184695 183523 181959 180380
57590A80380j275q03m43o37j547k625l043k657k021j459p00L85J246J239L81q44
$$ 180380 179105 178302 177859 177222 175675 173050 170007 167350 165329 163870 163170 163555 164801 166040 166421 165577
57574A65577k028k903l258l179l051l035k832k283j738j521j414j112p58n96m36
$$ 165577 163549 160646 157388 154209 151158 148123 145291 143008 141270 139749 138335 137223 136465 135869 135433
57559A35433J8N84Q71Q38O58L29j56m73k86L29J146K084K847K773J685M31r5j09
$$ 135433 135451 136035 136906 137744 138402 138731 138575 138102 137816 138145 139291 141375 144222 146995 148680 149111 149016 148907
57541A48907l28o06j85Q39J442J149N66K14k51j093j641j095K02J002N78n10j164
$$ 148907 148579 147973 147788 148627 150069 151218 151784 151998 151747 150654 149013 147918 148120 149122 149700 149190 148026
57524A48026r64n02m60o13j09J205K308K256J444J004J299J690J705J562J572
$$ 148026 147062 146560 146100 145487 145378 146583 148891 151147 152591 153595 154894 156584 158289 159851 161423
57509A61423J665J712J736J635J165L85l46q33j157j341j385j610k251k796k468
$$ 161423 163088 164800 166536 168171 169336 169721 169375 168542 167385 166044 164659 163049 160798 158002 155534
57494A55534j519j202k016k872k527j318o30j019j620j432m94M03P19N59K23k34
$$ 155534 154015 152813 150797 147925 145398 144080 143450 142431 140811 139379 138885 139288 140007 140566 140789 140555
57478A40555q26j221r60j56L87R9n83q12m56j34k69o67j000j144q97m5J145J918
$$ 140555 139729 138508 137548 137392 137779 137878 137295 136483 136027 135893 135624 134957 133957 132813 131916 131871 133016 134934
57460A34934J835J202N18p1n74p80n18l0K28R1j86k41rJ47k10r54j365r89k68
$$ 134934 136769 137971 138489 138418 137844 137064 136546 136516 136744 136835 136649 136408 136399 136546 136336 135382 134017 133028 132760
57441A32760O2K1J80N59N51Nl89j33L49M54L61N99J042R33q4j420k094j673o19
$$ 132760 132822 132843 133023 133582 134133 134138 133749 133616 133965 134419 134780 135379 136421 137354 137270 135850 133756 132083 131464
57422A31464J91L09M6r5j28l96q54j002o09n8J64O3J3L37J014J582J416M16o95
$$ 131464 131655 131964 132010 131915 131787 131391 130537 129535 128926 128868 129032 129095 129108 129445 130459 132041 133457 133873 133178
57403A33178j094q23n81o76q27q32q19p06j89O15J155J273J326J371J045N04O02
$$ 133178 132084 131261 130680 130004 129177 128345 127526 126820 126631 127246 128401 129674 131000 132371 133416 133920 134522
57386A34522J631K706L017K909K995K923K012O57J5M22R92Q29j04j315k308k697
$$ 134522 136153 138859 141876 144785 147780 150703 152715 153372 153387 153809 154801 155630 155526 154211 151903 149206
57370A49206k474k240k656l445l576k654j607j583k479l030k298o28R14J704J870
$$ 149206 146732 144492 141836 138391 134815 132161 130554 128971 126492 123462 121164 120536 121450 123154 125024
57355A25024J741J454J117R46R66R62R80J460K474L205K868J835J156J104J040
$$ 125024 126765 128219 129336 130282 131248 132210 133190 134650 137124 140329 143197 145032 146188 147292 148332
57340A48332O12J93L9p6j51J28N36L25m86q53l74o8p18j386q28M22P03m11j653
$$ 148332 148944 149137 149176 149100 148949 149077 149613 149938 149452 148599 148225 148157 147439 146053 145225 145647 146350 145939 144286
57321A44286j909j343o70l20m81j054j331o03P06J250M88n70o73J68J053J443
$$ 144286 142377 141034 140364 140044 139563 138509 137178 136575 137281 138531 139019 138449 137776 137944 138997 140440
57305A40440J496J443J268J032R80J196J420J409J331J545K042K356K203J889
$$ 140440 141936 143379 144647 145679 146659 147855 149275 150684 152015 153560 155602 157958 160161 162050
57291A62050J825J879J711J571K063L027L393K515J097K84L18N95O23L56j72r42
$$ 162050 163875 165754 167465 169036 171099 174126 177519 180034 181131 181415 181733 182328 182951 183307 183135 182193
57275A82193j767k374k682k741k605k386k218k056j830j830k405l173l266k563
$$ 182193 180426 178052 175370 172629 170024 167638 165420 163364 161534 159704 157299 154126 150860 148297
57261A48297j862j459n59J200K682K739K021K030K914L520L344L051L085L022
$$ 148297 146435 144976 144417 145617 148299 151038 153059 155089 158003 161523 164867 167918 171003 174025
57247A74025K593K340K815L830M772N149M800M054L616L731L731L045K256K310
$$ 174025 176618 178958 181773 185603 190375 195524 200324 204378 207994 211725 215456 218501 220757 223067
57233B23067L000L324L104L016L112K737K006K021L111M170M304L996M013M231
$$ 223067 226067 229391 232495 235511 238623 241360 243366 245387 248498 252668 256972 260968 264981 269212
57219B69212M307M608N538O616P050O741O099N392M864M962N758O600O910O920
$$ 269212 273519 278127 283665 290281 297331 304072 310171 315563 320427 325389 331147 337747 344657 351577
57205C51577P084P264P148P002P385Q329R384J0187J0632J0796J1034J1743J2702
$$ 351577 358661 365925 373073 380075 387460 395789 405173 415360 425992 436788 447822 459565 472267
57192D72267J3189J3107J3366J4615J6284J7459J8174J9090K0481K2299K4781
$$ 472267 485456 498563 511929 526544 542828 560287 578461 597551 618032 640331 665112
57181F65112K8082L1597L4538L6877L8865L9895L8918L6024L2565K9405K5961
$$ 665112 693194 724791 759329 796206 835071 874966 913884 949908 982473 1011878 1037839
57170A037839K1360J5910J0981P756O484O587P266Q083R153J0607J2033J2825
$$ 1037839 1059199 1075109 1086090 1093846 1100330 1106917 1114183 1122266 1131419 1142026 1154059 1166884
57158A166884J3087J3728J5403J7715J9710K0968K1896K3054K4477K5780K6770
$$ 1166884 1179971 1193699 1209102 1226817 1246527 1267495 1289391 1312445 1336922 1362702 1389472
57147A389472K7645K8496K8858K8169K6701K5616K5881K7261K8649K9232K9130
$$ 1389472 1417117 1445613 1474471 1502640 1529341 1554957 1580838 1608099 1636748 1665980 1695110
57136A695110K9026K9435L0387L1707L3438L5764L8513M1113M3348M5785M8959
$$ 1695110 1724136 1753571 1783958 1815665 1849103 1884867 1923380 1964493 2007841 2053626 2102585
57125B102585N2410N5293N7795O1074O5689P1027P6558Q2785R0402R9266J08905
$$ 2102585 2154995 2210288 2268083 2329157 2394846 2465873 2542431 2625216 2715618 2814884 2923789
57114B923789J19411J31167J44151J58230J73846J91822K12736K37092K65774
$$ 2923789 3043200 3174367 3318518 3476748 3650594 3842416 4055152 4292244 4558018
57105D558018K99797L39829L86588M41698N07686N87064O81509P91847R18929
$$ 4558018 4857815 5197644 5584232 6025930 6533616 7120680 7802189 8594036 9512965
57096I512965J064811J232836J425617J642762J880920K135799K403026K677266
$$ 9512965 10577776 11810612 13236229 14878991 16759911 18895710 21298736 23976002
57088B3976002K952027L220462L474406L701890L886634M008602M040490L943288
$$ 23976002 26928029 30148491 33622897 37324787 41211421 45220023 49260513 53203801
57080E3203801L673947L207830K555585J754244Q43474j42064j155960k126251
$$ 53203801 56877748 60085578 62641163 64395407 65238881 65096817 63940857 61814606
57072F1814606k969786l623943m064995m301968m360857m274545m078408l806205
$$ 61814606 58844820 55220877 51155882 46853914 42493057 38218512 34140104 30333899
57064C0333899l486879l144492k799146k466238k155594j872695j620547j400027
$$ 30333899 26847020 23702528 20903382 18437144 16281550 14408855 12788308 11388281
57056A1388281j209555j046072r06676p89043o90643o08267n38417m77989m24759
$$ 11388281 10178726 9132654 8225978 7436935 6746292 6138025 5599608 5121619 4696860
57047D696860l77554l35927k99465k67445k39077k13796j91220j71068j53184
$$ 4696860 4319306 3983379 3683914 3416469 3177392 2963596 2772376 2601308 2448124
57038B448124j37399j23256j10059r7316q4991p3256o2063n0959l9156k6058j2293
$$ 2448124 2310725 2187469 2077410 1980094 1895103 1821847 1759784 1708825 1669669 1643611 1631318
57027A631318m26N785L486p549k4843m4615o3279p8186q7642r0809q7970q0792
$$ 1631318 1630892 1636677 1640163 1632614 1607771 1563156 1499877 1421691 1334049 1243240 1155270 1074478
57015A074478p1783o2962n5079m8142m2258l7538l3546k9638k5874k2964k1134
$$ 1074478 1002695 939733 884654 836512 794254 756716 723170 693532 667658 644694 623560
57004F23560j9674j7976j6440j5909j6420j7076j6995j6034j4585j3067j1653
$$ 623560 603886 585910 569470 553561 537141 520065 503070 487036 472451 459384 447731
56993D47731j0297q960p754o721n531l685j162J447L688N773P937R575R515P168
$$ 447731 437434 428474 420720 413999 408468 404783 403621 405068 408756 414529 422466 432041 441556 448724
56979D48724K966k193p453j1904j4691j5575j5064j3787j2041j0114q508p396
$$ 448724 451690 449497 442044 430140 415449 399874 384810 371023 358982 348868 340360 332964
56967C32964o176m143j430J154L176M933O836Q923J1139J3623J6288J8329J8458
$$ 332964 326788 322645 321215 322369 325545 330478 337314 346237 357376 370999 387287 405616 424074
56954D24074J5722J0126K637n314j2409j7717k0621k0904j9109j6507j4170j2071
$$ 424074 439796 449922 452559 447245 434836 417119 396498 375594 356485 339978 325808 313737
56942C13737r509o346l276p71J635M599Q090J1653J5204J8967K2769K5938K7725
$$ 313737 304228 297882 294606 293835 295470 300069 308159 319812 335016 353983 376752 402690 430415
56929D30415K7409K4111J7246P407l606j3842k2055k7626l0202k9834k7277k3701
$$ 430415 457824 481935 499181 506588 502982 489140 467085 439459 409257 379423 352146 328445
56917C28445k0094j6909j4152j1670r418p573o264n265m123k670j196K0J086K203
$$ 328445 308351 291442 277290 265620 256202 248629 242365 237100 232977 230307 229111 229131 230217 232420
56903B32420L230L907M396N192O458P729Q536R028R712J0751J1802J2642J3505
$$ 232420 235650 239557 243953 249145 255603 263332 271868 280896 290608 301359 313161 325803 339308
56890C39308J4707J6209J7786J9395K0994K2033K1492J8521J2868M842m678j4067
$$ 339308 354015 370224 388010 407405 428399 450432 471924 490445 503313 508155 503477 489410
56878D89410k1387k5487k6565k5436k2573j8207j3112q468m797j444K584P519
$$ 489410 468023 442536 415971 390535 367962 349755 336643 328175 323378 321934 324518 332037
56866C32037J2794J7839K2659K7695L3394L9873M6638N2342N4899N2164M2955
$$ 332037 344831 362670 385329 413024 446418 486291 532929 585271 640170 692334 735289
56855G35289K7753Q758j0670k7011l7825m2651m2761l9766l4515k7407j9362j1676
$$ 735289 763042 771800 761130 734119 696294 653643 610882 571116 536601 509194 489832 478156
56843D78156m804K051R770J8206K6704L5212M4297N4206O4543P4692Q3548Q8611
$$ 478156 473352 475403 485173 503379 530083 565295 609592 663798 728341 803033 886581 975192
56831I75192Q6067P2810M8807J7573j5388m4781o6897q0065q4478q1704p3979
$$ 975192 1061259 1134069 1182876 1200449 1185061 1140280 1073383 993318 908840 827136 753157
56820G53157o3530n2106m0843l0331k0712j1774l160N359J3793K2090L0322L8735
$$ 753157 689627 637521 596678 566347 545635 533861 530701 536060 549853 571943 602265 641000
56808F41000M7497N6094O2561O3541N5875L8854J5064j0940l4717n3173o4787
$$ 641000 688497 744591 807152 870693 926568 965422 980486 969546 934829 881656 816869
56797H16869o9583o8824o4241n7247m8796l9690l0701k2416j5157q888l129K771
$$ 816869 747286 678462 614221 556974 508178 468488 437787 415371 400214 391326 388197 390968
56785C90968Q943J4818J9880K4351K8664L2268L3366L0072K1796R670m174j7624
$$ 390968 399911 414729 434609 458960 487624 519892 553258 583330 605126 614796 610622 592998
56773E92998k9077l7302m1446m1683l9490l6525l3199k9023k4337k0563j8383
$$ 592998 563921 526619 485173 443490 404000 367475 334276 305253 280916 260353 241970
56762B41970j6760j4535j2086j0392r258p742n791m164l049k085j609k353l764
$$ 241970 225210 210675 198589 188197 178939 171197 165406 161242 158193 156108 154499 152146 148382
56749A48382m121k856j462j338j840j473k15N42M9r05j199p48l47n41r59q36m2
$$ 148382 144261 141405 139943 138605 136765 135292 135077 135619 135668 134763 133564 132816 132469 131928 130969 130133 130091
56732A30091P13Q13N43N30P30O53L67M80J039J348J065P37Q51J113J048P81P53
$$ 130091 130804 131617 132160 132690 133420 134073 134440 134920 135959 137307 138372 139109 139960 141073 142121 142902 143655
56715A43655J082J541J774J370K31r33j071p1J042J418J298J257J296J204J149
$$ 143655 144737 146278 148052 149422 149653 148720 147649 147578 148620 150038 151336 152593 153889 155093 156242
56700A56242J255J170O47Q5j20k98q28j234p83K46P68L51k91l01L15R51J203J206
$$ 156242 157497 158667 159314 159399 159279 158981 158153 156919 156136 156382 157150 157501 157210 156909 157224 158175 159378 160584
56682A60584J280J400J158M20k19m1P42J191Q74K54l05j023j841j976j020K50
$$ 160584 161864 163264 164422 164842 164623 164582 165324 166515 167389 167643 167338 166315 164474 162498 161478 161728
56666A61728R17J177J715K417K583K036J192L16m38o35p9N89O77N68J102K035
$$ 161728 162645 163822 165537 167954 170537 172573 173765 174081 173643 173008 172929 173518 174195 174763 175865 177900
56650A77900K272J560Q04M57j48j478k766l092k705k520k693k524j672q15q70
$$ 177900 180172 181732 182536 182993 182845 181367 178601 175509 172804 170284 167591 165067 163395 162580 161710
56635A61710j832k692k534j515n59j50P9M55N62n0r13j112n13J30K04j82n89p19
$$ 161710 159878 157186 154652 153137 152578 152428 152507 152962 153524 153474 152561 151449 150936 151066 151270 151088 150499 149780
56617A49780m62m0l7p51j566j544o48K25M53L22L82P49J310J939K332K059J127
$$ 149780 149318 149278 149241 148490 146924 145380 144732 144957 145410 145732 146114 146863 148173 150112 152444 154503 155630
56600A55630J18m71o92p61o16j97J68M2n45j023q04J39J174J534J073M30L41R31
$$ 155630 155748 155277 154585 153824 153208 153011 153179 153221 152676 151653 150849 150988 152162 153696 154769 155199 155540 156471
56582A56471J813K597K982K695J814R98Q82J319J647J597J466J538J879K622L830
$$ 156471 158284 160881 163863 166558 168372 169370 170252 171571 173218 174815 176281 177819 179698 182320 186150
56567A86150N090N796N952O198O990Q311J0137J2505J4911J6284J5909J3960J1006
$$ 186150 191240 197036 202988 209186 216176 224487 234624 247129 262040 278324 294233 308193 319199
56554C19199P562M299K073J149Q10J57q55j611j785j752k044k732l401l620l388
$$ 319199 326761 331060 333133 334282 335092 335249 334394 332783 330998 329246 327202 324470 321069 317449 314061
56539C14061l137l281l913m893o000o807o801o038n425n719o438o357n091l579
$$ 314061 310924 307643 303730 298837 292837 286030 279229 273191 267766 262047 255609 249252 244161 240582
56525B40582k803k694k564k104j542j131q75o82n03l70l28l57l56l53n59j013
$$ 240582 237779 235085 232521 230417 228875 227744 226869 226187 225684 225314 224986 224629 224273 223920 223361 222348
56509B22348j373j314j008q83j077j467j983k473k492j790q76m98o78q38q33j118
$$ 222348 220975 219661 218653 217770 216693 215226 213243 210770 208278 206488 205612 205114 204436 203598 202765 201647
56493B01647j756k048j500n61q0l19q33j049p27p8M65O87P89R93J133R17M31n
$$ 201647 199891 197843 196343 195782 195702 195383 194550 193501 192774 192696 193161 193848 194637 195630 196763 197680 198111 198106
56475A98106k45k47J14P19R92N90L2j8K75L09J35J67J96l17j073j187n99j04P8
$$ 198106 197861 197614 197728 198447 199439 200029 200061 200043 200318 200627 200762 200929 201125 200808 199735 198548 197949 197845 197923
56456A97923N68J413J751J262P77R03J090P80M25N82R09Q39N37L92K11l09r02
$$ 197923 198491 199904 201655 202917 203694 204597 205687 206467 206892 207474 208383 209222 209759 210151 210362 210053 209151
56439B09151j238j490j787j739j175o43n25l27K77M58o22k219k747j881p97l84
$$ 209151 207913 206423 204636 202897 201722 201079 200554 200227 200504 200962 200340 198121 195374 193493 192696 192312
56423A92312k67K30J020J510J432J097J040J502K148K430K270K109K119J891J152
$$ 192312 192045 192275 193295 194805 196237 197334 198374 199876 202024 204454 206724 208833 210952 212843 213995
56408B13995K62l78q50j231j143m43K49L49K24N63J245J657J767J993K228J935
$$ 213995 214257 213879 213029 211798 210655 210212 210461 210810 211034 211597 212842 214499 216266 218259 220487 222422
56392B22422J207Q12J083J484J478J141P41K76k58n77l97K02Q60J231J085M19
$$ 222422 223629 224441 225524 227008 228486 229627 230368 230644 230386 229809 229412 229614 230474 231705 232790 233209
56376B33209m86j172j270p36K7L19k77j247j445l19J380K365K111J183M78L68
$$ 233209 232723 231551 230281 229545 229572 229891 229614 228367 226922 226603 227983 230348 232459 233642 234120 234488
56360B34488N26M42K11O09K062L672L973K686J066L45N14R03J170J266J115Q92
$$ 234488 235014 235456 235667 236276 238338 242010 245983 248669 249735 250080 250594 251497 252667 253933 255048 255940
56344B55940J000J321J140L01k88P4P97J009R35J340K135K612K767L278M261M987
$$ 255940 256940 258261 259401 259702 259414 259488 260285 261294 262229 263569 265704 268316 271083 274361 278622 283609
56328B83609M953M390L679K938K296J981J895J620R46J28m89q17j022j345j846
$$ 283609 288562 292952 296631 299569 301865 303846 305741 307361 308307 308435 307946 307129 306107 304762 302916
56313C02916k213k018j278m25K56P58R02N14J67Q40K415L559L634L673M587N406
$$ 302916 300703 298685 297407 296982 297238 297996 298898 299412 299579 300419 302834 306393 310027 313700 318287 323693
56297C23693M602K432N97j1R5L76Q51J292J100K73m22m72o9N60J491K591L375
$$ 323693 328295 330727 331324 331313 331408 331784 332635 333927 335027 335300 334878 334406 334337 334897 336388 338979 342354
56280C42354L574L337K880K416K304K730L307L565L658M018M502M647M536M697
$$ 342354 345928 349265 352145 354561 356865 359595 362902 366467 370125 374143 378645 383292 387828 392525
56266C92525N200N640N907O335P057P934Q946J0133J1245J2101J3141J4916J7274
$$ 392525 397725 403365 409272 415607 422664 430598 439544 449677 460922 473023 486164 501080 518354
56253E18354J9707K2234K5133K8072L0414L2257L4184L6114L7365L7934L8589
$$ 518354 538061 560295 585428 613500 643914 676171 710355 746469 783834 821768 860357
56242H60357L9516L9764L8362L5295L1224K6804K2446J8079J3045O866J49n933
$$ 860357 899873 939637 977999 1013294 1044518 1071322 1093768 1111847 1124892 1131758 1131907 1125974
56230A125974j0972j5459j9625k3022k5396k7121k8481k9281k9408k9165k8720
$$ 1125974 1115002 1099543 1079918 1056896 1031500 1004379 975898 946617 917209 888044 859324
56219H59324k7832k6377k4732k3327k2208k1205k0215j9197j8131j7018j5781
$$ 859324 831492 805115 780383 757056 734848 713643 693428 674231 656100 639082 623301
56208F23301j4237j2469j0945r965r255q450p621o963o345n638n040m620l978
$$ 623301 609064 596595 585650 575685 566430 557980 550359 543396 537051 531413 526373 521753 517775
56195E17775k932j955j391q41rN05J23o44r20o72k70M85J731K637K338J381R58
$$ 517775 514843 512888 511497 510656 510647 511152 511275 510631 509711 509039 508769 509254 510985 513622 515960 517341 518299
56178E18299J204J413J556K134K934L320L549M381N571O179O209O478P033P221
$$ 518299 519503 520916 522472 524606 527540 530860 534409 538790 544361 550540 556749 563227 570260 577481
56164E77481P180P784R032R990J0487J1323J2707J3898J4685J5848J7875K0457
$$ 577481 584661 592445 601477 611467 621954 633277 645984 659882 674567 690415 708290 728747
56152G28747K3380K6790L0486L4243L8743M4850N2140N9617O7782P8241R1188
$$ 728747 752127 778917 809403 843646 882389 927239 979379 1038996 1106778 1185019 1276207
56141A276207J04994J18277J30439J39906J43904J40870J31555J17506J00224
$$ 1276207 1381201 1499478 1629917 1769823 1913727 2054597 2186152 2303658 2403882
56132B403882Q2314O7396N7556N1993M8612M5531M0724L2203J9826N732p715j9322
$$ 2403882 2486196 2553592 2611148 2663141 2711753 2757284 2798008 2830211 2850037 2855769 2848054 2828732
56120B828732k8419l4952m1031n0349o4742q2481j00687j17703j32099j41327
$$ 2828732 2800313 2765361 2724330 2673981 2609239 2526758 2426071 2308368 2176269 2034942
56110B034942j43290j38341j28476j15423j00534q5430p1416n8822m7748l8738
$$ 2034942 1891652 1753311 1624835 1509412 1408878 1323448 1252032 1193210 1145462 1106724
56100A106724l2014k6869k2461j8505j4782j1001p561n320m185l055j475j15P29
$$ 1106724 1074710 1047841 1025380 1006875 992093 981092 973531 968211 964026 960971 959496 959381 960110
56087I60110J683K946L863M343N169O375O893O429O156O887Q030Q920R685J0285
$$ 960110 961793 964739 968602 972945 978114 984489 991382 997811 1003967 1010854 1018884 1027804 1037489 1047774
56073A047774J0307J0194J0979J2327J2768J2257J2441J3751J4579J4139J3859
$$ 1047774 1058081 1068275 1079254 1091581 1104349 1116606 1129047 1142798 1157377 1171516 1185375
56062A185375J4783J5881J6221J6630J7818J8823J8745J8216J7850J7128J5963
$$ 1185375 1200158 1216039 1232260 1248890 1266708 1285531 1304276 1322492 1340342 1357470 1373433
56051A373433J5566J6408J7328J7669J8364J9734K0566K0540K1243K3367K5323
$$ 1373433 1388999 1405407 1422735 1440404 1458768 1478502 1499068 1519608 1540851 1564218 1589541
56040A589541K6073K6854K8504K9651K9410K9348L0736L2291L2713L3099L4726
$$ 1589541 1615614 1642468 1670972 1700623 1730033 1759381 1790117 1822408 1855121 1888220 1922946
56029A922946L6733L8126L9772M2246M3981M3886M3589M4869M7041M8932N1140
$$ 1922946 1959679 1997805 2037577 2079823 2123804 2167690 2211279 2256148 2303189 2352121 2403261
56018B403261N4156N6679N8078O0053O3626O7037O8902P0696P3774P6871P9086
$$ 2403261 2457417 2514096 2572174 2632227 2695853 2762890 2831792 2902488 2976262 3053133 3132219
56007C132219Q2249Q7517R2785R6428J00442J06730J13488J18764J24257J31980
$$ 3132219 3214468 3301985 3394770 3491198 3591640 3698370 3811858 3930622 4054879 4186859
55997D186859J40318J47179J53976J62683J72082J80818J90839K03862K17776
$$ 4186859 4327177 4474356 4628332 4791015 4963097 5143915 5334754 5538616 5756392
55988E756392K30789K45540K64754K86473L08185L31705L59186L88471M17717
$$ 5756392 5987181 6232721 6497475 6783948 7092133 7423838 7783024 8171495 8589212
55979H589212M50408M90202N35087N82569O36108P00124P73294Q53657R45543
$$ 8589212 9039620 9529822 10064909 10647478 11283586 11983710 12757004 13610661 14556204
55970A4556204J054386J179780J321500J487294J686926J924592K206206K548060
$$ 14556204 15610590 16790370 18111870 19599164 21286090 23210682 25416888 27964948
55962B7964948K968862L480148M094630M835543N725433O774944P997396R425954
$$ 27964948 30933810 34413958 38508588 43344131 49069564 55844508 63841904 73267858
55954G3267858J1102070J3059323J5336987J7994653K1086962K4622628K8518841
$$ 73267858 84369928 97429251 112766238 130760891 151847853 176470481 204989322
55947B04989322L2458695L5623747L6575512L3673236K5982729J4038086j87852
$$ 204989322 237448017 273071764 309647276 343320512 369303241 383341327 383153475
55940C83153475j4091067k5421218l2890437l6285037l6234999l3812887l0117266
$$ 383153475 369062408 343641190 310750753 274465716 238230717 204417830 174300564
55933A74300564k5999594k1999486j8405175j5326359j2753967j0625280q875256
$$ 174300564 148300970 126301484 107896309 92569950 79815983 69190703 60315447
55926F0315447p446693o280720n322462m533225l885101l348912k897941k517465
$$ 60315447 52868754 46588034 41265572 36732347 32847246 29498334 26600393 24082928
55918B4082928k199412j931536j700589j501053j331458j185769j056567r42874
$$ 24082928 21883516 19951980 18251391 16750338 15418880 14233111 13176544 12233670
55910A2233670q46777p65307o92808o28214n73087n25296m81191m41364m08019
$$ 12233670 11386893 10621586 9928778 9300564 8727477 8202181 7720990 7279626 6871607
55901F871607l79028l50478l22816k98839k77847k57145k37196k20065k04752
$$ 6871607 6492579 6142101 5819285 5520446 5242599 4985454 4748258 4528193 4323441
55892D323441j89074j74188j62357j52143j40634j28561j18522j09981j00913
$$ 4323441 4134367 3960179 3797822 3645679 3505045 3376484 3257962 3147981 3047068
55883C047068r2777q8846q8726q9180q9272r0172r0873q8754q4022p9365p5550
$$ 3047068 2954291 2865445 2776719 2687539 2598267 2508095 2417222 2328468 2244446 2165081 2089531
55872B089531p1231o6607o3404o1389n8597n4896n1908m9545m5976m1107l6990
$$ 2089531 2018300 1951693 1888289 1826900 1768303 1713407 1661499 1611954 1565978 1524871 1487881
55861A487881l4712l3582l3306l4179l5208l4704l2872l1398l0590k9286k7443
$$ 1487881 1453169 1419587 1386281 1352102 1316894 1282190 1249318 1217920 1187330 1158044 1130601
55850A130601k6311k6107k5703k4773k4138k3970k3545k2688k1773k0545j8635
$$ 1130601 1104290 1078183 1052480 1027707 1003569 979599 956054 933366 911593 891048 872413
55839H72413j6873j6296j6315j5603j4356j3733j3638j3008j1913j1382j1400
$$ 872413 855540 839244 822929 807326 792970 779237 765599 752591 740678 729296 717896
55828G17896j0887r519q009o812o053o273p679r167r654r811j0841j2237j2484
$$ 717896 707009 697490 689481 682669 676616 670343 662664 653497 643843 634032 623191 610954 598470
55815E98470j1455j0219r000p188n038l521k619j495q3R85J744K735L846M769
$$ 598470 587015 576796 567796 560608 555570 552049 549430 547935 547852 548837 550581 553316 557162 561931
55801E61931O111Q507J1072J2306J2081J1306J0123Q074N492L039L52l153o625
$$ 561931 568042 576549 587621 599927 612008 623314 633437 641511 647003 650042 650394 647241 640616
55788F40616q665r455j0260j1234j1518j1255j1656j3092j4780j6086j6690j5784
$$ 640616 631951 622496 612236 601002 589484 578229 566573 553481 538701 522615 505925 490141
55776D90141j2825q775m956r89M336J0369J4600J5225J2231O241j746r614j5100
$$ 490141 477316 468541 463585 462596 466932 477301 491901 507126 519357 525598 523852 514238 499138
55763D99138j7850j9062j9264j8081j5951j4180j3127j2055j0805r917r052p268
$$ 499138 481288 462226 442962 424881 408930 394750 381623 369568 358763 348846 339794 332526
55751C32526n009l885m160m320l561k905l116l384k889k094j555q17M43J368R93
$$ 332526 327517 323632 319472 315152 311591 308686 305570 302186 299297 297203 295648 294831 295274 296642 297635
55736B97635m20j939l151m134m812m987m615l777k767k185k400k949l166l177
$$ 297635 297215 295276 292125 287991 283179 278192 273577 269800 267033 264848 262448 259499 256333 253156
55722B53156l546m070l916k907j706p54Q5Q62J515K414M018N941P222P396O617
$$ 253156 249610 245540 241624 238717 237011 236257 236342 237204 238719 241133 245151 251092 258314 265710 272327
55707B72327M962K589K58j323k457l802n128n825o150o755p321p043o184n719
$$ 272327 277289 279878 280136 278813 276356 272554 267426 261601 255451 248696 241375 234332 228148 222429
55693B22429n693n319m534l910l241j791K5R04O29L20O02J083J660K694L775L943
$$ 222429 216736 211417 206883 202973 199732 197941 197966 198870 199499 199819 200421 201504 203164 205858 209633 213576
55677B13576L413L424M146M368L601K745K205J063j106l206m104l881l038j801
$$ 213576 216989 220413 224559 228927 232528 235273 237478 238541 237435 234229 230125 226244 223206 221405
55663B21405p55o57j063n32J135K382K231J669J901K726L459M130M741M703L971
$$ 221405 220650 219993 218930 218398 219533 221915 224146 225815 227716 230442 233901 238031 242772 247475 251446
55648B51446L548L842L774K478P50l68j267k908n185p292q909r957j0020r077
$$ 251446 254994 258836 262610 265088 265838 265470 264203 261295 256110 248818 239909 229952 219932 210855
55634B10855q077p761p621o895n834n035m272l073j804j127r33p48o60q92j067
$$ 210855 202778 195017 187396 180501 174667 169632 165360 162287 160483 159356 158423 157675 157015 156123 155056
55619A55056p97n57r50j662j992k049k334k644k363j630j223j346j420j102p70
$$ 155056 154259 153702 152752 151090 149098 147049 144715 142071 139708 138078 136855 135509 134089 132987 132217
55604A32217q70j321j694j687j392j165j148r47k29N42N40k15q19p91o06p27r69
$$ 132217 131347 130026 128332 126645 125253 124088 122940 121993 121764 122306 122846 122631 121812 121021 120415 119688 118719
55587A18719j117j269j196l25J177K252K379K270K578K910K894L102M032N005
$$ 118719 117602 116333 115137 114812 115989 118241 120620 122890 125468 128378 131272 134374 138406 143411
55573A43411N130M709M652N034N151M646L723K631J540N93m68k203m443o024o145
$$ 143411 148541 153250 157902 162936 168087 172733 176456 179087 180627 181220 180752 178549 174106 168082 161937
55558A61937n348m517l692k686k031k284k935l047k538j993j616j250r74q55n39
$$ 161937 156589 152072 148380 145694 143663 141379 138444 135397 132859 130866 129250 128000 127026 126171 125632
55543A25632J38N91L58%K83R74J375J460J527J320N74m6K29Q72P40j55q39j093
$$ 125632 125770 126361 126719 126719 127002 127976 129351 130811 132338 133658 134232 134186 134415 135287 136027 135872 135033 133940
55525A33940j655k625l090k624k019k052k480k666k507k311k281k440k641k556
$$ 133940 132285 129660 126570 123946 121927 119875 117395 114729 112222 109911 107630 105190 102549 99993
55511I9993k048j561j589j882j713r42j75P8j17m61o36k60P27J648J689R24J85
$$ 99993 97945 96384 94795 92913 91200 90258 90083 90161 90044 89583 88947 88687 89414 91062 92751 93675 93860
55494I3860j11l10o79r45q64o70o44o68m02L49J457K415K576J828Q57L57J29l94
$$ 93860 93749 93439 92760 91815 90951 90281 89637 88969 88567 88916 90373 92788 95364 97192 98049 98406 98535 98141
55476I8141j037j036l01K97J65k86m39m22p23j257j371p56N0K54l13j027j223
$$ 98141 97104 96068 95767 96064 96229 95943 95504 95082 94359 93102 91731 90975 91025 91279 90966 89939 88716
55459H8716r17n75m13k83k15m73r43j051o36k19j49J0O49J305J299P78L67J70
$$ 88716 87799 87224 86811 86528 86313 85840 84897 83846 83210 82991 82842 82852 83501 84806 86105 86883 87250 87420
55441H7420j43n24o13m21k21P7P38J459J593J103O69P04R04Q38N23K33J39K01
$$ 87420 87277 86753 86140 85719 85498 85575 86313 87772 89365 90468 91137 91841 92745 93583 94106 94339 94478 94679
55423I4679J75j58o19o61r9N52Q37R93J312J351O21l65o00p7K34j48o22n56r3
$$ 94679 94854 94696 94077 93416 93317 93869 94706 95699 97011 98362 98983 98618 98018 97941 98175 98027 97405 96849 96756
55404I6756L18N45N10J4q64j547j550j031n83n77q02o91K9Q29Q34oo53l07M99
$$ 96756 97074 97619 98129 98143 97279 95732 94182 93151 92568 91991 91189 90498 90527 91356 92190 92184 91531 91224 91723
55385I1723P40K99j93n53j050j464j205m21j3k94o17n70p01j526k566k893k263
$$ 91723 92463 92762 92569 92016 90966 89502 88297 87876 87863 87569 86952 86382 85681 84155 81589 78696 76433
55368G6433j150o5P91J403J800J945J699J048L34RJ59N22R19J279J393J112O81
$$ 76433 75283 75218 76009 77412 79212 81157 82856 83904 84238 84247 84406 84928 85847 87126 88519 89631 90312
55351I0312M71M22K05j56l27k80l09m68n05l14J5M81R94J105N55n6L8N66N12l40
$$ 90312 90783 91205 91410 91254 90927 90647 90338 89870 89365 89051 89066 89547 90541 91646 92201 92145 92183 92749 93261 92921
55331I2921j098j105o96l44O2O76J157J145P65L02j23l21m2N43Q71P06L18j38
$$ 92921 91823 90718 90022 89678 89740 90416 91573 92718 93483 93785 93662 93341 93299 93842 94713 95419 95737 95599
55313I5599p60j289j204p04o64j233j395m97N96P35J36j05L39Q18Q89P32N01Q3
$$ 95599 94839 93550 92346 91642 90978 89745 88350 87853 88449 89184 89320 89215 89554 90372 91261 91993 92494 92577
55295I2577l84m19J19O99P17J62m32n37p2N52Q31N98J16k35k72J0M65Q16Q22N31
$$ 92577 92193 91774 91893 92592 93309 93471 93039 92502 92430 92982 93813 94411 94527 94292 94020 94030 94495 95311 96133 96664
55275I6664K07J7l4j8j24n97j250j330l91R04J472J179P49N10Q9n09o47j56K25
$$ 96664 96871 96888 96854 96836 96712 96115 94865 93535 93144 94048 95520 96699 97448 97958 98047 97538 96891 96735 96960
55256I6960Kl69l81l15n29p02n28m64r11j241o14N84J082L66q28j585j663j300
$$ 96960 96962 96593 96212 95897 95368 94666 94138 93674 92763 91522 90908 91492 92574 92940 92112 90527 88864 87564
55238H7564q01l97p7L88R46J060M77j69j38L14L23k45o17l07K51M33J77j66k56
$$ 87564 86763 86366 86289 86677 87623 88683 89160 88991 88853 89167 89490 89245 88628 88321 88572 89005 89182 89016 88760
55219H8760J04Q08J340J180M21l09o03n35k55K34Q11J191J281J205R10J77q04
$$ 88760 88864 89672 91012 92192 92613 92304 91701 91166 90911 91145 91956 93147 94428 95633 96543 96720 95916
55202I5916j370j071k26M75O45L35j68n17m55q6J63K3k77l41r0J80J89j2r9J75
$$ 95916 94546 93475 93249 93724 94369 94704 94536 94019 93564 93478 93641 93664 93387 93046 92956 93136 93325 93313 93214 93389
55182I3389O61Q84N41j07n21m82j98J41N32Q74Q77N11J94K54L92J45l28l65K56
$$ 93389 94050 94934 95475 95368 94847 94365 94167 94308 94840 95714 96591 97102 97296 97550 97942 98087 97759 97394 97650
55163I7650R62J153Q89N36J03n30j015p63R3O56L82k42m62k71j56k18j90j55n17
$$ 97650 98612 99765 100654 101190 101293 100763 99748 98985 99078 99734 100116 99874 99412 99141 98985 98767 98577 98422 97905
55144I7905j241j723j614j204q71n57j04L86Q31J363J860J741P06n55j013n73
$$ 97905 96664 94941 93327 92123 91252 90695 90591 90977 91808 93171 95031 96772 97478 96923 95910 95337
55128I5337j21k91p07o78k19N4j62m61l24K23P38J029J308J703J905J553P44j11
$$ 95337 95216 94925 94218 93540 93321 93375 93213 92752 92428 92651 93389 94418 95726 97429 99334 100887 101631 101520
55110A01520p67j178j184o30K62R88J355J563J713J581J056L96j54o04q53n71
$$ 101520 100753 99575 98391 97761 98023 99011 100366 101929 103642 105223 106279 106675 106521 105917 105064 104493
55094A04493J83O11K9j047j325l32R20J101Q0j088j454j040m31N0M37O86N93J99
$$ 104493 104676 105287 105316 104269 102944 102612 103532 104633 104713 103625 102171 101131 100700 100750 101187 101873 102466 102665
55076A02665j66l02l21k40J36O86P84P7q38j076n77j6K09K24J13k27n96n62j00
$$ 102665 102499 102197 101876 101636 101772 102458 103242 103319 102481 101405 100828 100812 101021 101245 101358 101131 100535 99973 99873
55057I9873L43M88L56j73j165j916j437N8J062O72k21l15L34O92L67j13k69j16
$$ 99873 100216 100704 101060 100887 99722 97806 96369 96427 97489 98161 97940 97625 97959 98651 99018 98905 98636 98520
55039I8520K22N88N96Np62j020o28N9P96J388J346L88p65r79k05L99J10m11k13
$$ 98520 98742 99330 99926 99931 99169 98149 97521 97580 98376 99764 101110 101498 100733 99754 99549 99948 100058 99647 99434
55020I9434M99P59K59l31m38k97l18l25J38R23J268Q05J13m4L60Q25J171J599
$$ 99434 99933 100692 100951 100620 100182 99885 99567 99242 99380 100303 101571 102376 102489 102445 102805 103630 104801 106400
55002A06400J985J810R66P8k11J53Q15J400J502R04L4k86J19M86J64n70j125j387
$$ 106400 108385 110195 111161 111239 111028 111181 111996 113396 114898 115802 115836 115550 115669 116155 116319 115749 114624 113237
54984A13237j438j110l89K37M96Q43J604K134J699P45L57P39J155J197J112R83
$$ 113237 111799 110689 110300 110537 111033 111876 113480 115614 117313 118058 118415 119154 120309 121506 122618 123601
54968A23601O14K02J77K86j85j089j329m09Q08J331J166P73K49l49n65j58K88
$$ 123601 124215 124417 124594 124880 124695 123606 122277 121868 122676 124007 125173 125946 126195 125846 125281 125123 125411
54951A25411P7o59j198j198q66m56q5J18P8r1k39k88j02L96P95M57m86r16j04
$$ 125411 125488 124829 123631 122433 121567 121111 121026 121144 121222 121131 120892 120604 120502 120898 121693 122150 121664 120748 120644
54932A20644J165J551Q93L24O71J575K213K297K113K022K233K814L668M594N356
$$ 120644 121809 123360 124253 124577 125248 126823 129036 131333 133446 135468 137701 140515 144183 148777 154133
54917A54133N702N443M734M093L750L137J491j031l351m655n119n286n229m736
$$ 154133 159835 165278 170012 174105 177855 180992 182483 181452 178101 173446 168327 163041 157812 153076
54903A53076l942l275k911k700k580k644k800k687k104j285o56m42n12n32k11
$$ 153076 149134 145859 142948 140248 137668 135024 132224 129537 127433 126148 125492 125050 124538 124006 123795
54888A23795M13R38J057J024J378K193K876K855K249J669J633K326L603M931N583
$$ 123795 124208 125146 126203 127227 128605 130798 133674 136529 138778 140447 142080 144406 148009 152940 158523
54873A58523N268M471L810L262K412J173j63j570l269n003n952n666m698l969
$$ 158523 163791 168262 172072 175334 177746 178919 178756 177186 173917 168914 162962 157296 152598 148629
54859A48629l810l828l498k615j409m53k28o57j204j511j707j999k326k499k417
$$ 148629 144819 140991 137493 134878 133469 133016 132788 132131 130927 129416 127709 125710 123384 120885 118468
54844A18468k013j375r40j113j534j308k12Q83J141P32K50j76o13o90o8P91J093
$$ 118468 116455 115080 114140 113027 111493 110185 109973 110856 111997 112729 112979 112803 112190 111500 111432 112223 113316
54827A13316P59L45R7j98n21n96n24o75q53l83P51J580J349N25J51N32J007R05
$$ 113316 114075 114420 114517 114319 113798 113202 112678 112003 111150 110767 111518 113098 114447 114972 115123 115655 116662 117567
54809A17567L56J02N66J252J247L65n26n76O1O46Q99J022J030P76M97N78P46L20
$$ 117567 117923 118025 118591 119843 121090 121455 120929 120353 120414 121060 121959 122981 124011 124787 125284 125862 126608 126928
54791A26928o79j369j206o03j11K78O57P49M59L01P12J346J577J364J108R72Q57
$$ 126928 126249 124880 123674 123071 122960 123238 123895 124644 125103 125404 126116 127462 129039 130403 131511 132483 133340
54774A33340Q52J129J580K006K506L306M260M966N337N661O082O368O197N477
$$ 133340 134192 135321 136901 138907 141413 144719 148979 153945 159282 164943 171025 177393 183590 189067
54760A89067M361L131K047J056k13k009m043n723o713p027o729n860m710l784
$$ 189067 193428 196559 198606 199662 199449 197440 193397 187674 180961 173934 167205 161345 156635 152851
54746A52851l355l219k987k563k200k092k046j598o00M44Q07L30m12p90p24n00
$$ 152851 149496 146277 143290 140727 138527 136435 134389 132791 132191 132635 133442 133772 133360 132570 131846 131346
54730A31346k41J19O30J339K431L923N291N837N516N024M934N032M718L762K383
$$ 131346 131105 131224 131854 133193 135624 139547 144838 150675 156191 161215 166149 171181 175899 179661 182044
54715A82044Q76m81j393j850k371l424m612n023m497l903l854l762k805j288l40
$$ 182044 182920 182439 181046 179196 176825 173401 168789 163766 159269 155366 151512 147750 144945 143657 143317
54700A43317m26j011j525j903k095j847j263q99j026j301j431j548j699j556j050
$$ 143317 142891 141880 140355 138452 136357 134510 133247 132348 131322 130021 128590 127042 125343 123787 122737
54685A22737o31n49m59j54m0l12l33M47J491J831J306M85k43p05n86Q6M52j92
$$ 122737 122106 121557 121098 120944 120904 120592 120259 120706 122197 124028 125334 125819 125576 124871 124285 124371 124823 124631
54667A24631j222j462q78m79o61p63l31K66O74R97J178Q79K54k7K05L68J74J4
$$ 124631 123409 121947 121069 120590 119929 119166 118835 119101 119775 120772 121950 122829 123083 123056 123261 123629 123803 123817
54649A23817O3o4l70j75P10J431J309Q50Q03R77P28R3l91n22l75J11P97R78J66
$$ 123817 123880 123816 123446 123271 123981 125412 126721 127571 128374 129351 130079 130172 129781 129259 128884 128995 129792 130770 130936
54630A30936r29j080j18Q24P20k36j021r28j52N45O39K63j56n16r27j205j004
$$ 130936 130007 128927 128809 129633 130353 130117 129096 128168 128016 128561 129200 129463 129307 128791 127864 126659 125655
54613A25655m55m7J60N36R97R27K46l25m21n73j082j287p30j43l30p84n03L47
$$ 125655 125200 125153 125313 125849 126846 127773 128019 127694 127273 126700 125618 124331 123601 123458 123128 122344 121841 122188
54595A22188P46M74K54L71L54Lk08o4P1L3K31Q51J394J350P67j28j252k261k376
$$ 122188 122934 123408 123662 124033 124387 124390 124182 124118 124189 124222 124453 125304 126698 128048 128815 128687 127435 125174 122798
54576A22798j224M77J564J647J276J015Q27M56Rj66o5q0m08p61q51q21q52o14
$$ 122798 121574 122051 123615 125262 126538 127553 128380 128836 128845 128679 128614 128534 128126 127365 126514 125693 124841 124227
54558A24227K10J134J323Q34O05J081J651J743J593J503J235P01M77Q54J156P99
$$ 124227 124437 125571 126894 127728 128333 129414 131065 132808 134401 135904 137139 137840 138317 139171 140327 141126
54542A41126L51N43Q39K02j054j428k48J501K475K219J097k12r91r81p56r85j415
$$ 141126 141477 142020 142859 143061 142007 140579 140331 141832 144307 146526 147623 147411 146420 145439 144683 143698 142283
54525A42283j240m02K70K50j39m73p19q35o16j36K47M43O57P94N59J44J11M88
$$ 142283 141043 140641 140911 141161 141022 140549 139830 138995 138379 138243 138490 138933 139590 140384 140943 141087 141198 141686
54507A41686P16N65L36J00m11j027j171q61p75j057j053n86l82o84n56O17J918
$$ 141686 142402 142967 143303 143403 142992 141965 140794 139933 139158 138101 137048 136462 136080 135396 134840 135457 137375
54490A37375K090J308O89O86Q80R52Q71M83j87n11m0N89M41k15k38O59J516J596
$$ 137375 139465 140773 141462 142148 143028 143980 144851 145334 145147 144636 144596 145185 145626 145411 145173 145832 147348 148944
54472A48944J227R71Q28P13Q47J197J198O20K24Q34K023K442J423k47j300j370
$$ 148944 150171 151142 151970 152683 153530 154727 155925 156545 156769 157603 159626 162068 163491 163244 161944 160574
54456A60574j142j282j552j198r2R44J122O81L98L95M8q19j413j039j56K07j55
$$ 160574 159432 158150 156598 155400 155308 156252 157374 158055 158453 158848 158896 158077 156664 155625 155469 155676 155521
54439A55521m94k58J83J16o36j583k054j647n49M68O44J9o17o25j44M02R56J592
$$ 155521 155027 154769 154952 155068 154432 152849 150795 149148 148599 149067 149711 149730 149113 148488 148344 148746 149702 151294
54421A51294J968J659Q96L97L90L52j71r98j664j908j635q87r4J32k05l36K42
$$ 151294 153262 154921 155817 156214 156604 156956 156785 155787 154123 152215 150580 149693 149599 149731 149526 149190 149432
54404A49432J050J356J240J348J876K413K621K495K044J253M02l5J54P81J491
$$ 149432 150482 151838 153078 154426 156302 158715 161336 163831 165875 167128 167530 167495 167649 168430 169921
54389A69921J836J415L29p20j244j603k268k802k367j056J41P16R83J047N14l95
$$ 169921 171757 173172 173501 172781 171537 169934 167666 164864 162497 161441 161582 162298 163281 164328 164842 164447
54373A64447n62M91J577J316K1p67l47M96Q20O02L79M27O38Q68J040J072Q23K05
$$ 164447 163885 164376 165953 167269 167290 166523 166176 166672 167492 168094 168473 168900 169538 170406 171446 172518 173341 173546
54355A73546o22j184j043l68J10j22q09j361j558j570j515j375j223j156j096
$$ 173546 172924 171740 170697 170329 170439 170317 169508 168147 166589 165019 163504 162129 160906 159750 158654
54340A58654r21p35o66o14m50l92p16j119r09O0J021J113L27o76j367j684j685
$$ 158654 157733 156998 156332 155718 155268 154876 154160 153041 152132 152192 153213 154326 154653 153977 152610 150926 149241
54323A49241j313n39M07J141J400J201Q26O22P20R22R45P20L54j95j029j822j851
$$ 149241 147928 147389 147796 148937 150337 151538 152364 152986 153706 154628 155573 156293 156647 156452 155423 153601 151750
54306A51750q57L57P60L45L4L05O46N97N20Q31J036L67r11j568q86N65J669J866
$$ 151750 150893 151250 152010 152355 152389 152694 153340 153937 154457 155288 156324 156691 155780 154212 153326 153891 155560 157426
54288A57426J404Q90P23P40M17m12j200j325q27j98L09O38N44o0n75k98M88Q29
$$ 157426 158830 159720 160443 161183 161600 161188 159988 158663 157836 157638 157947 158585 159129 159069 158494 158196 158684 159513
54270A59513N44M45R29J278Q44O1k68q8J38K07J43j53n80o12k9M94K32m93p10
$$ 159513 160057 160502 161431 162709 163553 163614 163346 163258 163396 163603 163746 163593 163013 162401 162372 162866 163098 162605 161895
54251A61895j68M78O66N18L58K94L68N71O25J87o19j265j482j453j322r74m32
$$ 161895 161727 162205 162871 163389 163747 164041 164409 164980 165605 165792 165173 163908 162426 160973 159651 158677 158245
54234A58245l9K1JJ96N33P37O77L79n0l19q5N77J074R79N73L73K97k30j340k370
$$ 158245 158206 158227 158228 158424 158957 159694 160371 160750 160700 160381 160296 160873 161947 162926 163499 163872 164169 163939 162599 160229
54214A60229k681k364j920j483r09l43k08n02o62l01K98O42O67N66L80O4j88j28
$$ 160229 157548 155184 153264 151781 150872 150529 150321 149819 149157 148856 149154 149796 150463 151029 151409 151473 151285 151157
54196A51157J71M84P13P76M24k58n34K30J491J951J150k0n51m31k28j70j12m6
$$ 151157 151328 151812 152525 153301 153725 153467 152933 153163 154654 156605 157755 157735 157184 156753 156525 156355 156243 156197
54178A56197r8j74J1N44J175J481J152K57o95j183j182j035q51m22K47P69Q74
$$ 156197 156099 155925 155936 156480 157655 159136 160288 160545 159850 158667 157485 156450 155599 155177 155424 156193 157067
54161A57067P05M50Q2l85p60r83j133j085n75J49L79o3m16l4O50P65K62j53n4
$$ 157067 157772 158222 158304 157919 157159 156176 155043 153958 153383 153532 153911 153848 153432 153398 154048 154813 155075 154922 154868
54142A54868K91N11N67N44M43K74J28N5M4J20L34O65R88J110Q70L29j86m15m60
$$ 154868 155159 155670 156237 156781 157224 157498 157626 157681 157725 157845 158179 158844 159832 160942 161812 162141 161955 161540 161080
54123A61080m97l33L31J295J969K058J645P81l92j135o50P35J742J740J321J029
$$ 161080 160583 160250 160581 161876 163845 165903 167548 168329 167937 166802 166152 166887 168629 170369 171690 172719
54107A72719N39l51r37n93J95N87N28M10K28n1J7O74J278J238R95J178J411J096
$$ 172719 173258 172907 171970 171377 171572 172159 172687 173097 173325 173274 173291 173965 175243 176481 177476 178654 180065 181161
54089A81161Q06J546L031M081M527N248O275O374M867K621P23p42k034k939l200
$$ 181161 181967 183513 186544 190625 195152 200400 206675 213049 217916 220537 221260 220518 218484 215545 212345
54074B12345l129l091k961k517j935j490j213j051r62p95m75l54o99r58l74O59
$$ 212345 209216 206125 203164 200647 198712 197222 196009 194958 193996 193201 192726 192372 191673 190715 190341 191000
54058A91000Q55j00r84p44J57O75O45O04Q70J467K395L357L769L604L649M347
$$ 191000 191855 191755 190771 190027 190184 190859 191504 192108 192978 194445 196840 200197 203966 207570 211219 215566
54042B15566M999M852M417M752N863O763P031P352Q293R300R235P610N069K762
$$ 215566 220565 225417 229834 234586 240449 247212 254243 261595 269888 279188 288423 296033 301102 303864
54028C03864J304L84n31j251j183n43l91j129j761j345n33o88j918l017l254l182
$$ 303864 305168 305552 305021 303770 302587 302044 301653 300524 298763 297418 296885 296197 294279 291262 288008 284826
54012B84826l489m049m418m570m608m344l708l231l501m277m584l779k247r60
$$ 284826 281337 277288 272870 268300 263692 259348 255640 252409 248908 244631 240047 236268 234021 233061
53998B33061n22p78j184j395j466j594j863k196k475k592k497k255k033j959j989
$$ 233061 232539 231761 230577 229182 227716 226122 224259 222063 219588 216996 214499 212244 210211 208252 206263
53983B06263j930j602j057o27o06q07p04j28M05M09J54K62P40R68O84L50M31Q26
$$ 206263 204333 202731 201674 201047 200441 199634 198930 198802 199207 199616 199770 200032 200772 201740 202424 202774 203205 204031
53965B04031J209J431J389R52L14PK82Q09J224J560J899K072K083K396L325M525
$$ 204031 205240 206671 208060 209012 209326 209333 209615 210424 211648 213208 215107 217179 219262 221658 224983 229508
53949B29508N515O336P231Q068Q725R678J1469J3585J4551J3322J0142O047J965
$$ 229508 235023 241359 248590 256658 265383 275061 286530 300115 314666 327988 338130 344177 346142
53936C46142j612m465o456p389p098n787m157k934k307j979j581q29M13J903L082
$$ 346142 344530 340065 333609 326220 319122 313335 309178 306244 303937 301958 300377 299548 299961 301864 304946
53921C04946L767M470N605O656O811O195N802O209P028P699P994P674O417M495
$$ 304946 308713 313183 318788 325444 332255 338450 344252 350461 357489 365188 373182 380856 387273 391768
53907C91768K848K015J467M13j151k660l756m289m022k987j981j961k944m040
$$ 391768 394616 396631 398098 398511 397360 394700 390944 386655 382633 379646 377665 375704 372760 368720
53893C68720m597m790n097n713o547p320p535o880n885n567o190o849o698n999
$$ 368720 364123 359333 354236 348523 341976 334656 327121 320241 314356 308789 302599 295750 289052 283053
53879B83053n439m884l677j981r14j152k167l111l761m190m202l723l291l459
$$ 283053 277614 272730 269053 267072 266158 265006 262839 259728 255967 251777 247575 243852 240561 237102
53865B37102l915l840l001j934j114o35n95j103j731j733j084o39r33j438j474
$$ 237102 233187 229347 226346 224412 223298 222663 222068 220965 219234 217501 216417 215778 214845 213407 211933
53850B11933j222j234j375j112n36l17o10q36o47l90l44j39N66J342J463Q62J06
$$ 211933 210711 209477 208102 206990 206454 206137 205527 204691 204044 203654 203310 203171 203737 205079 206542 207404 207510
53833B07510l77n78m83K5P50J194J196J161J385J497J006J74j34M74J473K117
$$ 207510 207133 206555 206072 206097 206847 208041 209237 210398 211783 213280 214286 214460 214326 214800 216273 218390
53817B18390K275K266K269K218K159K295K610K712K284J564J240J755K801L619
$$ 218390 220665 222931 225200 227418 229577 231872 234482 237194 239478 241042 242282 244037 246838 250457
53803B50457L839L859M235M846N072M719M383M598N009M785L703K487J995K283
$$ 250457 254296 258155 262390 267236 272308 277027 281410 286008 291017 295802 299505 301992 303987 306270
53789C06270K502J785K43r62q73L6L16o47j944k548k695l209m018m360m171m253
$$ 306270 308772 310557 310800 309838 308965 309001 309317 308670 306726 304178 301483 298274 294256 289896 285725 281472
53773B81472m911n413n121m377l851l600l281k869k605k542k507k399k247k126
$$ 281472 276561 271148 266027 261650 257799 254199 250918 248049 245444 242902 240395 237996 235749 233623
53759B33623k137k235k035j183p8L62j36p47p37n27r62j877k156j268oM95J07
$$ 233623 231486 229251 227216 226033 225955 226317 226181 225434 224697 224170 223208 221331 219175 217907 217901 218396 218503
53742B18503l66k73K10N08M24K23Q8j36n45p96n11J65P60J092J338J574J693J739
$$ 218503 218137 217864 218074 218582 219006 219229 219317 219181 218636 217840 217329 217494 218254 219346 220684 222258 223951 225690
53724B25690J856J893J604J210J250J697J912J606J239J163J077P13N10R58J804
$$ 225690 227546 229439 231043 232253 233503 235200 237112 238718 239957 241120 242197 242910 243420 244378 246182
53709B46182K467K919L500M124M283L811L107K634K577K902L450L966M307M507
$$ 246182 248649 251568 255068 259192 263475 267286 270393 273027 275604 278506 281956 285922 290229 294736
53695B94736M502M050L190K462K272K256J732N98n40j134j206j173j404j880k165
$$ 294736 299238 303288 306478 308940 311212 313468 315200 315798 315258 314124 312918 311745 310341 308461 306296
53680C06296j853j119n90n62o39l92J01N65R18J050O90o8n31k71J87J06l74n73
$$ 306296 304443 303324 302734 302172 301533 301141 301242 301807 302725 303775 304465 304397 303866 303595 303782 303888 303514 302941
53662C02941l79l27p01j208j505j483j058k90L62M12J1k24o6Q5j47o08p73k05
$$ 302941 302562 302235 301534 300326 298821 297338 296280 295990 296352 296764 296775 296551 296485 296570 296423 295815 295042 294837
53644B94837J077K371K726J968J025P87J031R96P11Q52J520J923J578J012J098
$$ 294837 295914 298285 301011 302979 304004 304791 305822 306818 307529 308381 309901 311824 313402 314414 315512
53629C15512K067L334L994L577K630K374L347M681N281N301N683O502O831O265
$$ 315512 317579 320913 324907 328484 331114 333488 336835 341516 346797 352098 357781 364283 371114 377379
53615C77379N508N211N165M959M599M106L272K196J461J333J410J404J580K058
$$ 377379 382887 388098 393263 398222 402821 406927 410199 412395 413856 415189 416599 418003 419583 421641
53601D21641K344K074J644J564J669J485R65L79j49n60p12o74q56j422j948k068
$$ 421641 423985 426059 427703 429267 430936 432421 433386 433765 433616 433056 432344 431670 430814 429392 427444 425376
53585D25376k037k230k459k256j582q34m55p51j742k843l192k644j972j780j728
$$ 425376 423339 421109 418650 416394 414812 413978 413523 412772 411030 408187 404995 402351 400379 398599 396871
53570C96871j367r81r56q83k67L59J16o82p97Q9R57J032P26O05M43Kj25O01J507
$$ 396871 395504 394523 393567 392684 392417 392776 392892 392210 391413 391502 392459 393491 394217 394822 395265 395267 395142 395743 397250
53551C97250J421L64m15j84M46P34J043K119L633M376L908L216L447M571N739
$$ 397250 398671 399035 398620 398436 398882 399616 400659 402778 406411 410787 414695 417911 421358 425929 431668
53536D31668O467O882P050O885O672P070Q291R789J0927J1604J2092J2654J3519
$$ 431668 438135 445017 452067 458952 465624 472694 480985 490774 501701 513305 525397 538051 551570
53523E51570J4787J6071J6651J6354J5941J6287J7406J8646J9614K0498K1663
$$ 551570 566357 582428 599079 615433 631374 647661 665067 683713 703327 723825 745488
53512G45488K3177K4755K5956K6586K6966K7567K8294K8537K8128K7705K7710
$$ 745488 768665 793420 819376 845962 872928 900495 928789 957326 985454 1013159 1040869
53501A040869K7567K6487K4734K3345K2754K2434K1836K0969K0031J9156J8696
$$ 1040869 1068436 1094923 1119657 1143002 1165756 1188190 1210026 1230995 1251026 1270182 1288878
53490A288878J9119K0229K1071K0946K0170J9492J9161J8849J8237J7294J6243
$$ 1288878 1307997 1328226 1349297 1370243 1390413 1409905 1429066 1447915 1466152 1483446 1499689
53479A499689J5477J5245J5138J4229J2132R574P420N470K878l82l354n551p723
$$ 1499689 1515166 1530411 1545549 1559778 1571910 1581484 1588904 1594374 1597252 1596870 1593516 1587965 1580242
53466A580242j0671j3904j6202j7181j7602j8176j8799j9079j9076j9215j9832
$$ 1580242 1569571 1555667 1539465 1522284 1504682 1486506 1467707 1448628 1429552 1410337 1390505
53455A390505k1001k2547k3979k4739k4724k4337k3835k3009k1767k0660k0269
$$ 1390505 1369504 1346957 1322978 1298239 1273515 1249178 1225343 1202334 1180567 1159907 1139638
53444A139638k0272j9662j7872j5271j2530r958p661n886m871m421l927k826j031
$$ 1139638 1119366 1099704 1081832 1066561 1054031 1044073 1036412 1030526 1025655 1021234 1017307 1014481 1013450
53431A013450J059K980M627O188P731R084J0215J1438J2996J4692J6242J7744
$$ 1013450 1014509 1017489 1022116 1028304 1036035 1045119 1055334 1066772 1079768 1094460 1110702 1128446
53419A128446J9406K1004K2102K2775K3638K5088K6927K8783L0566L2402L4396
$$ 1128446 1147852 1168856 1190958 1213733 1237371 1262459 1289386 1318169 1348735 1381137 1415533
53408A415533L6592L8896M1003M2612M3774M4826M6071M7714M9953N2765N5637
$$ 1415533 1452125 1491021 1532024 1574636 1618410 1663236 1709307 1757021 1806974 1859739 1915376
53397A915376N7908N9332O0102O0494O0840O1601O2841O3792O3558O2242O0704
$$ 1915376 1973284 2032616 2092718 2153212 2214052 2275653 2338494 2402286 2465844 2528086 2588790
53386B588790N9231N7184N4156N0675M7448M4482M1360L7843L3848K9325K4477
$$ 2588790 2648021 2705205 2759361 2810036 2857484 2901966 2943326 2981169 3015017 3044342 3068819
53375C068819J9726J5148J0349N142j22n230j0647j7104k4906l3765m2800n0665
$$ 3068819 3088545 3103693 3114042 3119184 3119062 3113832 3103185 3086081 3061175 3027410 2984610 2933945
53363B933945n6316n9958o2624o4676o5462o4752o3505o2624o1817o0513n9077
$$ 2933945 2877629 2817671 2755047 2690371 2624909 2560157 2496652 2434028 2372211 2311698 2252621
53352B252621n8064n6891n4454n0921m7773m6048m5450m5250m5205m5278m5058
$$ 2252621 2194557 2137666 2083212 2032291 1984518 1938470 1893020 1847770 1802565 1757287 1712229
53341A712229m3911m1511l8162l4693l1879k9755k7659k5151k2452j9835j7173
$$ 1712229 1668318 1626807 1588645 1553952 1522073 1492318 1464659 1439508 1417056 1397221 1380048
53330A380048j4571j2721j1948j1565j0921j0581j1322j2526j2819j2100j1511
$$ 1380048 1365477 1352756 1340808 1329243 1318322 1307741 1296419 1283893 1271074 1258974 1247463
53319A247463j1362j0616q798p031o302n881m428j955M33K178L665N089O043O381
$$ 1247463 1236101 1225485 1216687 1209656 1203354 1197473 1193045 1191090 1191523 1193701 1197366 1202455 1208498 1214879
53305A214879O702P687R370J1394J3607J6000J8270J9962K1140K2574K4861K7537
$$ 1214879 1221581 1229268 1238638 1250032 1263639 1279639 1297909 1317871 1339011 1361585 1386446 1413983
53293A413983K9451L0041K9843K9656K9664K9569K9091K8007K6110K3615K1213
$$ 1413983 1443434 1473475 1503318 1532974 1562638 1592207 1621298 1649305 1675415 1699030 1720243
53282A720243J9287J7394J4941J1996Q794N005L61m328p831j0166j2572j5625
$$ 1720243 1739530 1756924 1771865 1783861 1792655 1797660 1798021 1793693 1785862 1775696 1763124 1747499
53270A747499j8425k0064k1050k2627k5239k8235l0740l2310l3012l3293l3636
$$ 1747499 1729074 1709010 1687960 1665333 1640094 1611859 1581119 1548809 1515797 1482504 1448868
53259A448868l4131l4539l4801l5097l5299l4883l3682l2242l1096l0079k8787
$$ 1448868 1414737 1380198 1345397 1310300 1275001 1240118 1206436 1174194 1143098 1113019 1084232
53248A084232k7424k6679k6913k7746k8421k8355k7481k6202k4956k3790k2503
$$ 1084232 1056808 1030129 1003216 975470 947049 918694 891213 865011 840055 816265 793762
53237G93762k1155k0028j9039j7631j5499j3106j1186j0010r295q660p934p261
$$ 793762 772607 752579 733540 715909 700410 687304 676118 666108 656813 648153 640219 632958
53225F32958p028p490q370r112r593j0251j1394j2791j4085j5122j5617j5075
$$ 632958 625930 618440 610070 600958 591365 581114 569720 556929 542844 527722 512105 497030
53213D97030j3415j1382r844q942q304p782p485p351p169o927o728o455o033n845
$$ 497030 483615 472233 462389 453447 445143 437361 429876 422525 415356 408429 401701 395246 389213 383368
53199C83368o368p346p849p427o749o701p184p238o337n121m550m727m875m418
$$ 383368 377000 369654 361805 354378 347629 340928 333744 326506 320169 315048 310498 305771 300896 296478
53185B96478l590k878k330j803j505j751k291k440k006j558j612k004k261k239
$$ 296478 292888 290010 287680 285877 284372 282621 280330 277890 275884 274326 272714 270710 268449 266210
53171B66210k121k015j878j665j363j007p20o16n85m05j55j67n06q43r34q54o00
$$ 266210 264089 262074 260196 258531 257168 256161 255441 254825 254240 253835 253680 253513 253007 252164 251230 250376 249776
53154B49776Q2J079J617J070j23r20r27p09q19j101j056n30K41R87J431J273N21
$$ 249776 249858 250937 252554 253624 253501 252581 251654 250945 250126 249025 247969 247439 247680 248667 250098 251371 251892
53137B51892j67K1R77J545Q41n41j209p59j57k29n20j79P07J412J723J978K209
$$ 251892 251725 251746 252723 254268 255109 254568 253359 252600 252443 252214 251694 251515 252222 253634 255357 257335 259544
53120B59544K105J766J666J746J396N00k10j38M56R09Q60K69o92j529j778j608
$$ 259544 261649 263415 265081 266827 268223 268723 268513 268375 268831 269740 270600 270869 270177 268648 266870 265262
53104B65262j595j784j694j300j189j514j712j589j669k018j793p38k8n44j302
$$ 265262 263667 261883 260189 258889 257700 256186 254474 252885 251216 249198 247405 246667 246639 246095 244793
53089B44793q64L89Q81L85K58J087J684R32n47j330r82k23J85M5m53j008j352
$$ 244793 243929 244318 245199 245584 245842 246929 248613 249545 248998 247668 246686 246463 246648 246693 246240 245232 243880
53072B43880j382j101m88L83J107J190N82k93r88j274j088o77o02j117j627j354
$$ 243880 242498 241397 240909 241292 242399 243589 244171 243878 242890 241616 240528 239851 239249 238132 236505 235151
53056B35151m64O6k20o79m73M58J512K044J688N64o39j155r26n97o21q35r34q92
$$ 235151 234687 234753 234533 233854 233381 233839 235351 237395 239083 239647 239008 237853 236927 236330 235709 234874 233940 233048
53038B33048p59n31l47l84m01K9P35J023P22M63N42M04k38n91P2J091J241N32
$$ 233048 232289 231758 231411 231027 230626 230655 231390 232413 233135 233598 234140 234544 234306 233715 233787 234878 236119 236651
53020B36651J22N14R54P83L86L69O01O19M52L93L22q9o16n48L17J220J212K29
$$ 236651 236773 237287 238241 239024 239410 239779 240380 240999 241451 241844 242166 242077 241461 240913 241230 242450 243662 243891
53002B43891q64j218q32l76k63k08K93J185J842J828J359R31P24N83M49M56O35
$$ 243891 243027 241809 240977 240601 240338 240130 240423 241608 243450 245278 246637 247568 248292 248875 249324 249780 250415
52985B50415Q03Q62R68J193J201O34k28n03L82J970L224L561L241K868K688K506
$$ 250415 251218 252080 253048 254241 255442 256076 255848 255345 255727 257697 260921 264482 267723 270591 273279 275785
52969B75785K024J181K88j71jL82K94m50j283j525j119n65k83l48o99j259j812
$$ 275785 277809 278990 279278 279107 279106 279488 279782 279332 278049 276524 275405 274840 274557 274209 273510 272251 270439
52952B70439j991j660j093p05o89r97j471j857j871j464r21n30k71p0j82r35k040
$$ 270439 268448 266788 265695 264990 264301 263304 261833 259976 258105 256641 255720 255190 254919 254849 254667 253732 251692
52935B51692k623k143j058l06l09o67p25j89O79J276J108K60n82p40j49O34R60
$$ 251692 249069 246926 245868 245562 245253 244586 243861 243672 244351 245627 246735 246995 246413 245673 245524 246158 247118
52918B47118N29m48j322j437p64RK56Q3m5n6j53j34M30J282J449M43j010j861
$$ 247118 247647 247199 245877 244440 243676 243685 243941 244024 243979 243923 243770 243636 244066 245348 246797 247240 246230 244369
52900B44369j846j379p20R5P50P71J87l66l73R1O33J038J290J368J226Q94M37
$$ 244369 242523 241144 240424 240519 241269 242040 242227 241861 241488 241579 242212 243250 244540 245908 247134 248028 248465
52883B48465j44q13j312j221l86P63J471J423J074J082J550K018K123J965J821
$$ 248465 248321 247508 246196 244975 244589 245352 246823 248246 249320 250402 251952 253970 256093 258058 259879
52868B59879J825J943J976J627Q32O3o3M52R64R93O80L15q7n05p28p63j022j713
$$ 259879 261704 263647 265623 267250 268082 268145 268082 268534 269498 270491 271171 271486 271399 270894 270166 269403 268381 266668
52850B66668k387k589k629l214m363n276n169m023k456j259r19j289j656j388
$$ 266668 264281 261692 259063 255849 251486 246210 241041 237018 234562 233303 232384 231095 229439 228051
52836B28051n40L09P09O63M70M15N41N65K16l01m90l06k37m58m56L6L37k61j251
$$ 228051 227511 227820 228529 229192 229662 230077 230618 231183 231399 231098 230608 230302 230065 229607 229151 229187 229524 229263 228012
52817B28012j467o70K27N43O18J030J730K242K280J890J310Q47N80J17q62j892
$$ 228012 226545 225875 226102 226645 227263 228293 230023 232265 234545 236435 237745 238592 239172 239289 238427 236535
52801B36535k099j454r51j283j892j814j015k73l6JJ84L15K2o06j034q31p1Q21
$$ 236535 234436 232982 232031 230748 228856 227042 226027 225754 225718 225719 225903 226218 226240 225634 224600 223769 223698 224519
52783B24519J492J830J832J512J016O24M44K55k03q65j381j440j006l92j74o72
$$ 224519 226011 227841 229673 231185 232201 232825 233269 233524 233321 232456 231075 229635 228629 228237 228063 227391
52767B27391j410j508q05j57k17m82j37O44R94O79K71J60K11L73P52J012O14j76
$$ 227391 225981 224473 223668 223511 223294 222812 222675 223319 224313 224992 225263 225423 225634 226007 226759 227771 228385 228209
52749B28209l79L03J072J347J601K357L147L218K654K079J731J520J597K052K343
$$ 228209 227830 228133 229205 230552 232153 234510 237657 240875 243529 245608 247339 248859 250456 252508 254851
52734B54851J860Q95L17L44L77O1k06l5L03K58l36j247k123k551k203j230l40
$$ 254851 256711 257606 257923 258267 258644 258705 258499 258464 258767 259025 258689 257442 255319 252768 250565 249335 248995
52717B48995j65n99j024j075r28q16o07j18L40J41p96j699j750r98j63L09N33
$$ 248995 248830 248231 247207 246132 245204 244388 243781 243663 244003 244144 243348 241649 239899 238901 238738 239047 239580
52700B39580O51N35J84l2J71N69O96M09k9k47p2K87L19k85j097j304o80Q5K14
$$ 239580 240231 240766 240950 240918 241089 241658 242354 242763 242734 242487 242415 242702 243021 242736 241639 240335 239655 239740 239954
52681B39954k89p72p35k11M02P17O55N49O95Q78N88j75p70p04k06K27M04L48N4
$$ 239954 239665 238893 238158 237947 238349 239066 239721 240270 240965 241843 242431 242256 241486 240782 240576 240803 241207 241555 241609
52662B41609k49n1Q04J734K148K199K394K721K779K501K205J975J591J001L37
$$ 241609 241360 241309 242113 243847 245995 248194 250588 253309 256088 258589 260794 262769 264360 265361 265698
52647B65698m87j629k735l060k441j587j235j316j219o11K28P41O26J51o5L15
$$ 265698 265211 263582 260847 257787 255346 253759 252524 251208 249989 249378 249606 250347 250973 251124 251059 251374
52631B51374R64J419J808K621L713M080K992R09j035k214k771k943k699k085j416
$$ 251374 252338 253757 255565 258186 261899 265979 268971 269880 268845 266631 263860 260917 258218 256133 254717
52616B54717q98l50L69R39R31M58Q2N6P3q0j50O3K35Kk95m0P02J206J048M42l64
$$ 254717 253819 253469 253838 254777 255708 256166 256248 256304 256377 256297 256147 256210 256445 256447 256152 256112 256814 258020 259068 259510 259146
52595B59146j313j996j676l57Q21Q26k9o20m31J67P58J262J584J542J292J249
$$ 259146 257833 255837 254161 253804 254625 255451 255422 254802 254371 254538 255296 256558 258142 259684 260976 262225
52579B62225J460J461R16J00m21m14j30mk10m79m50k12k58p62j239j184q18o87
$$ 262225 263685 265146 266062 266162 265741 265327 265197 265193 264983 264504 264054 263842 263584 262822 261583 260399 259581 258894
52561B58894q42q97p09n16m08k64k07n10j019j147o60NM05N75O71N73K05j33j73
$$ 258894 258052 257155 256446 255930 255522 255258 255051 254541 253522 252375 251715 251720 252125 252700 253371 253944 254149 254016 253843
52542B53843j08k76n32m13J85Q30J103J086J190J586J974J871J186L39k34n15
$$ 253843 253735 253459 252927 252514 252699 253529 254632 255718 256908 258494 260468 262339 263525 263864 263630 263115
52526B63115o31l62O12J926K537J841M80l51j75M99R68R95P52O40J089K220L450
$$ 263115 262484 262122 262734 264660 267197 269038 269518 269167 268992 269491 270459 271454 272206 272846 273935 276155 279605
52509B79605L918L428K691K369K202J483J21j296k334l106l720l896l509k975
$$ 279605 283523 286951 289642 292011 294213 295696 295817 294521 292187 289081 285361 281465 277956 274981
52495B74981k712k510j901r84l74m03p69r85p69q3Q08J317J019K24l09k10L00
$$ 274981 272269 269759 267858 266874 266500 266097 265328 264343 263574 263491 264299 265616 266635 266859 266550 266340 266640
52478B66640R35J519J695J175M13L13J063J859K079J974J881J577R79O75J064
$$ 266640 267575 269094 270789 271964 272377 272690 273753 275612 277691 279665 281546 283123 284102 284777 285841
52463B85841J601J694J766K458L274L077J707P4j192k157k784k763k354k380l061
$$ 285841 287442 289136 290902 293360 296634 299711 301418 301492 300300 298143 295359 292596 290242 287862 284801
52448B84801l647l488k781j996j336r14q63r80r16q27j114j397p48P39J608R89
$$ 284801 281154 277666 274885 272889 271553 270639 269776 268796 267880 267053 265939 264542 263794 264533 266141 267130
52432B67130j10k25N38R03L60l70o20n13m03l40k37m4L91J128J811J950J675J701
$$ 267130 267020 266795 267333 268236 268596 268226 267606 267093 266690 266350 266113 266069 266460 267588 269399 271349 273024 274725
52414B74725K417L399M035M361M983O293Q013R545J0611J1310J1558J0816Q667
$$ 274725 277142 280541 284576 288937 293920 300213 308226 317771 328382 339692 351250 362066 370733
52401C70733N476K043j322m834q292j0718j1266j0059p877n482l535k648k851
$$ 370733 376209 378252 376930 372096 363804 353086 341820 331761 323884 318402 314867 312219 309368
52388C09368l292l007j905o85N8K75K70L92P77J179J252J199J688K848L925M385
$$ 309368 306076 303069 301164 300479 300537 300812 301082 301474 302251 303430 304682 305881 307569 310417 314342 318727
52372C18727M727N502O133N699M516L812L899L778K699J087l02j248j687j426
$$ 318727 323454 328956 335089 340788 345304 349116 353015 356793 359492 360579 360277 359029 357342 355916
52358C55916p10l42o32r03n55kJ43J85Q13J807K234J841J472J965L160M196M437
$$ 355916 355206 354864 354232 353329 352774 352772 352915 353100 353913 355720 357954 359795 361267 363232 366392 370588 375025
52341C75025L964L461L590M335N079N493O039P289R013J0459J1270J1682J1953
$$ 375025 378989 382450 386040 390375 395454 400947 406986 414275 423288 433747 445017 456699 468652
52328D68652J2253J2937J4251J5751J6738J7340J8424K0168K1459K1197J9661
$$ 468652 480905 493842 508093 523844 540582 557922 576346 596514 617973 639170 658831
52317F58831J8029J7004J6516J6448J6909J7820J8719J9083J8608J7348J5847
$$ 658831 676860 693864 710380 726828 743737 761557 780276 799359 817967 835315 851162
52306H51162J4962J5048J5432J5145J4051J2820J1911J1141J0271R306Q071O108
$$ 851162 866124 881172 896604 911749 925800 938620 950531 961672 971943 981249 989320 995428
52294I95428L352M44k051m278o565q644r946j0384j0315r875q960p759o669n642
$$ 995428 998780 999224 997173 992895 986330 977686 967740 957356 947041 937166 928206 920447 913778 908136
52280I08136m247k467q40M42J934L985N938O993P481Q468J0183J1679J2256J2441
$$ 908136 903889 901422 900582 901024 902958 906943 912881 919874 927355 935823 946006 957685 969941 982382
52266I82382J3014J3765J3922J3459J3178J3491J3881J3777J3327J2923J2501
$$ 982382 995396 1009161 1023083 1036542 1049720 1063211 1077092 1090869 1104196 1117119 1129620
52255A129620J1764J0817J0078R682R400Q970Q095O253L064r95m668p026q309
$$ 1129620 1141384 1152201 1162279 1171961 1181361 1190331 1198426 1204679 1207743 1206748 1202080 1195054 1186745
52242A186745r504j1191j3011j4156j4288j3885j3640j3684j3587j3170j2780
$$ 1186745 1177241 1166050 1153039 1138883 1124595 1110710 1097070 1083386 1069799 1056629 1043849
52231A043849j2587j2104j0965r701r047q696p668n871m296l505k873j812q11
$$ 1043849 1031262 1019158 1008193 998492 989445 980749 973081 967210 962914 959409 956536 954724 953913
52218I53913n66p78o35L3Q75J885L263M635N364N542N819O265O216N403M430L915
$$ 953913 953347 952569 951934 951967 952842 954727 957990 962625 967989 973531 979350 985615 991831 997234 1001664 1005579
52202A005579L762L640L585L761M122M547N035N442N452N101M957N355N767N315
$$ 1005579 1009341 1012981 1016566 1020327 1024449 1028996 1034031 1039473 1044925 1050026 1054983 1060338 1066105 1071420
52188A071420L811J962N92j20o49j602l195n159p114q872j0270j0920j0493r234
$$ 1071420 1075231 1077193 1077785 1077665 1077016 1075414 1072219 1067060 1059946 1051074 1040804 1029884 1019391 1010157
52174A010157p859o782n799m602l325k344j784j421r48j79Q59J914K719L288L791
$$ 1010157 1002298 995516 989717 985115 981790 979446 977662 976241 975293 975114 975973 977887 980606 983894 987685
52159I87685M146L991L219K255J572J162O79mo50r43p88l13K62Q01J367K052K712
$$ 987685 991831 995822 999041 1001296 1002868 1004030 1004709 1004705 1004055 1003112 1002324 1002011 1002273 1003074 1004441 1006493 1009205
52142A009205K953K543J738J147J213J860K594L031L338M057N419P105Q812J0773
$$ 1009205 1012158 1014701 1016439 1017586 1018799 1020659 1023253 1026284 1029622 1033679 1039098 1046203 1055015 1065788
52128A065788J3345J6259J8791K0691K2469K4661K7093K9101L0138L0110K9372
$$ 1065788 1079133 1095392 1114183 1134874 1157343 1182004 1209097 1238198 1268336 1298446 1327818
52117A327818K8551K8082K7806K7136K5690K3531K0878J7964J5182J2929J1112
$$ 1327818 1356369 1384451 1412257 1439393 1465083 1488614 1509492 1527456 1542638 1555567 1566679
52106A566679R204O979M893L524K905K605K197J418J29j619l618n736p949j0147
$$ 1566679 1575883 1582862 1587755 1591279 1594184 1596789 1598986 1600404 1600533 1598914 1595296 1589560 1581611 1571464
52092A571464j2190j4235j6568j8963k0629k1076k0709k0187j9482j7960j5255
$$ 1571464 1559274 1545039 1528471 1509508 1488879 1467803 1447094 1426907 1407425 1389465 1374210
52081A374210j1744q217n329l253j660p2J740L740N979Q539J1119J3078J4158
$$ 1374210 1362466 1354249 1348920 1345667 1344007 1343935 1345675 1349415 1355394 1363933 1375052 1388130 1402288
52068A402288J4834J5631J6373J6505J5890J4911J3932J3043J2351J2051J2117
$$ 1402288 1417122 1432753 1449126 1465631 1481521 1496432 1510364 1523407 1535758 1547809 1559926
52057A559926J2028J1064Q969O337M199L033K215O68j992n232q399j1357j4255
$$ 1559926 1571954 1583018 1591987 1598324 1602523 1605556 1607771 1608439 1606447 1601215 1592816 1581459 1567204
52044A567204j7084j9624k1518k2373k2135k1450k1129k1158k0714j9404j7870
$$ 1567204 1550120 1530496 1508978 1486605 1464470 1443020 1421891 1400733 1380019 1360615 1342745
$$ [...]
##END NTUPLES=NMR SPECTRUM
##END=
