##TITLE=AC1463_TOLI313269_8026578_3dazvPaNQQ
##JCAMPDX= 6.0         $$ Bruker NMR JCAMP-DX V2.0
##DATA TYPE= NMR SPECTRUM
##DATA CLASS= NTUPLES
##ORIGIN= BRUKER
##OWNER= Administrator
$$ 1.72 TOPSPIN		Version 2.1
$$ 2013-07-11 18:54:00.721 -0700  Administrator@X
$$ Compression mode = diff/dup
##.OBSERVE FREQUENCY= 400.02188249412
##.OBSERVE NUCLEUS= ^1H
##.ACQUISITION MODE= SIMULTANEOUS (DQD)
##.ACQUISITION SCHEME= undefined
##.AVERAGES= 8
##.DIGITISER RES= 22
##SPECTROMETER/DATA SYSTEM= spect
##.PULSE SEQUENCE= zg30
##.SOLVENT NAME= COFFEE_meoh
##.SHIFT REFERENCE= INTERNAL, COFFEE_meoh, 1, 14.98509
##AUDIT TRAIL= $$ (NUMBER, WHEN, WHO, WHERE, PROCESS, VERSION, WHAT)
$$ ##TITLE= Audit trail, TOPSPIN		Version 2.1
$$ ##JCAMPDX= 5.01
$$ ##ORIGIN= Bruker BioSpin GmbH
$$ ##OWNER= Administrator
$$ $$ E:\/data/COFFEE/nmr/AC1463_TOLI313269_8026578_3dazvPaNQQ/10/pdata/1/auditp.txt
$$ ##AUDIT TRAIL=  $$ (NUMBER, WHEN, WHO, WHERE, PROCESS, VERSION, WHAT)
(   1,<2013-07-11 18:53:53.689 -0700>,<Administrator>,<X>,<go>,<TOPSPIN 2.1>,
      <created by zg
	started at 2013-07-11 18:52:47.971 -0700,
	POWCHK enabled, PULCHK disabled,
       configuration hash MD5:
       C8 4E 4E 5D D3 5C D8 9E 9F 52 82 E0 59 8A DE 15
       data hash MD5: 64K
       92 25 FD C5 F7 AE F3 FD D2 C3 F1 2B 86 EA 21 12>)
(   2,<2013-07-11 18:53:56.596 -0700>,<Administrator>,<X>,<proc1d>,<TOPSPIN 2.1>,
      <Start of raw data processing
       efp LB = 0 FT_mod = 6 PKNL = 1 PHC0 = 0 PHC1 = 0 SI = 32K 
       data hash MD5: 32K
       A7 58 34 DC 7F 2D EB A0 77 D4 BD 67 C7 B4 FB 6E>)
(   3,<2013-07-11 18:53:56.893 -0700>,<Administrator>,<X>,<proc1d>,<TOPSPIN 2.1>,
      <pk PHC0 = 93.40576 PHC1 = 0 
       data hash MD5: 32K
       95 A3 B6 D1 7D 74 28 15 01 7E FB 71 27 FD 5E 62>)
(   4,<2013-07-11 18:53:57.189 -0700>,<Administrator>,<X>,<proc1d>,<TOPSPIN 2.1>,
      <abs ABSG = 1 
       data hash MD5: 32K
       D0 8F 8A 82 2C 77 C2 AB 2D 10 50 AF 47 E8 A4 AC>)
(   5,<2013-07-11 18:53:57.252 -0700>,<Administrator>,<X>,<proc1d>,<TOPSPIN 2.1>,
      <abs ABSG = 2 
       data hash MD5: 32K
       0E B9 D7 9C 15 22 6E 87 22 CF FE E1 BE 1F 81 E1>)
(   6,<2013-07-11 18:53:57.377 -0700>,<Administrator>,<X>,<proc1d>,<TOPSPIN 2.1>,
      <abs ABSG = 3 
       data hash MD5: 32K
       6B 59 94 D5 F4 90 88 47 C9 C8 17 B9 DE CE 59 D5>)
(   7,<2013-07-11 18:53:57.424 -0700>,<Administrator>,<X>,<proc1d>,<TOPSPIN 2.1>,
      <abs ABSG = 4 
       data hash MD5: 32K
       C1 B2 1D 0C F0 08 ED 06 21 13 5B B5 56 6D F1 CB>)
(   8,<2013-07-11 18:53:57.486 -0700>,<Administrator>,<X>,<proc1d>,<TOPSPIN 2.1>,
      <abs ABSG = 5 
       data hash MD5: 32K
       89 C3 9E 0A AA 58 17 45 FF 26 A5 A2 2A AF 81 42>)
$$ ##END=
$$ 
$$ $$ hash MD5
$$ $$ B6 FE 15 4E 04 8B E5 16 A0 E0 F1 31 BC 27 91 2F
##$RELAX= 
##$RELAX= 
##$RELAX= 
##$RELAX= 
##$RELAX= 
##$RELAX= 
##$RELAX= 
$$ Bruker specific parameters
$$ --------------------------
##$DU= <E:\>
##$EXPNO= 10
##$NAME= <AC1463_TOLI313269_8026578_3dazvPaNQQ>
$$ [...]
150 150 150 150 150 150 150 150
##$TP07= 0
##$TPNAME0= <>
##$TPNAME1= <>
##$TPNAME2= <>
##$TPNAME3= <>
##$TPNAME4= <>
##$TPNAME5= <>
##$TPNAME6= <>
##$TPNAME7= <>
##$TPOAL= (0..7)
0.5 0.5 0.5 0.5 0.5 0.5 0.5 0.5
##$TPOFFS= (0..7)
0 0 0 0 0 0 0 0
##$TUNHIN= 0
##$TUNHOUT= 0
##$TUNXOUT= 0
##$USERA1= <user>
##$USERA2= <user>
##$USERA3= <user>
##$USERA4= <user>
##$USERA5= <user>
##$V9= 5
##$VALIST= <valist>
##$VCLIST= <CCCCCCCCCCCCCCC>
##$VD= 0
##$VDLIST= <DDDDDDDDDDDDDDD>
##$VPLIST= <PPPPPPPPPPPPPPP>
##$VTLIST= <TTTTTTTTTTTTTTT>
##$WBST= 1024
##$WBSW= 4
##$XGAIN= (0..3)
0 0 0 0
##$XL= 0
##$YL= 0
##$YMAX_a= 604041
##$YMIN_a= -512391
##$ZGOPTNS= <>
##$ZL1= 120
##$ZL2= 120
##$ZL3= 120
##$ZL4= 120
##$ABSF1= 14.98509
##$ABSF2= -5.573092
##$ABSG= 5
##$ABSL= 3
##$ALPHA= 0
##$AQORDER= 0
##$ASSFAC= 0
##$ASSFACI= 0
##$ASSFACX= 0
##$ASSWID= 0
##$AUNMP= <proc_prof1d_extract_pilot.lims>
##$AXLEFT= 0
##$AXNAME= <>
##$AXNUC= <1H>
##$AXRIGHT= 0
##$AXTYPE= 0
##$AXUNIT= <>
##$AZFE= 0.1
##$AZFW= 0.1
##$BCFW= 0
##$BC_mod= 0
##$BYTORDP= 0
##$COROFFS= 0
##$CY= 15
##$DATMOD= 1
##$DC= 0
##$DFILT= <>
##$DTYPP= 0
##$F1P= 0
##$F2P= 0
##$FCOR= 0.5
##$FTSIZE= 32768
##$FT_mod= 6
##$GAMMA= 0
##$GB= 0
##$INTBC= 1
##$INTSCL= 1
##$ISEN= 128
##$LB= 0
##$LEV0= 0
##$LPBIN= 0
##$MAXI= 10000
##$MC2= 0
##$MEAN= 0
##$ME_mod= 0
##$MI= 0
##$NCOEF= 0
##$NC_proc= -8
##$NLEV= 6
##$NOISF1= 0
##$NOISF2= 0
##$NSP= 0
##$NTH_PI= 0
##$NZP= 0
##$OFFSET= 14.98509
##$PC= 1
##$PHC0= 93.40576
##$PHC1= 0
##$PH_mod= 1
##$PKNL= yes
##$PPARMOD= 0
##$PPDIAG= 0
##$PPIPTYP= 0
##$PPMPNUM= 2147483647
##$PPRESOL= 1
##$PSCAL= 4
##$PSIGN= 0
##$PYNMP= <proc.py>
##$REVERSE= no
##$SF= 400.02
##$SI= 32768
##$SIGF1= 0
##$SIGF2= 0
##$SINO= 400
##$SIOLD= 32768
##$SPECTYP= <>
##$SREGLST= <1H.CDCl3>
##$SSB= 0
##$STSI= 32768
##$STSR= 0
##$SW_p= 8223.68421052631
##$SYMM= 0
##$S_DEV= 0
##$TDeff= 65536
##$TDoff= 0
##$TI= <>
##$TILT= no
##$TM1= 0
##$TM2= 0
##$TOPLEV= 0
##$USERP1= <user>
##$USERP2= <user>
##$USERP3= <user>
##$USERP4= <user>
##$USERP5= <user>
##$WDW= 1
##$XDIM= 32768
##$YMAX_p= 445575193
##$YMIN_p= -686805
##$CURPLOT= <Network HP LaserJet P1505>
##$CURPRIN= <$Network HP LaserJet P1505>
##$DFORMAT= <normdp>
##$LAYOUT= <+/1D_H.xwp>
##$LFORMAT= <normlp>
##$PFORMAT= <normpl>
##$SURQMSG= 1
$$ End of Bruker specific parameters
$$ ---------------------------------
##NTUPLES= NMR SPECTRUM
##VAR_NAME=  FREQUENCY,     SPECTRUM/REAL,   SPECTRUM/IMAG
##SYMBOL=    X,             R,               I
##VAR_TYPE=  INDEPENDENT,   DEPENDENT,       DEPENDENT
##VAR_FORM=  AFFN,          ASDF,            ASDF
##VAR_DIM=   32768,         32768,           32768
##UNITS=     HZ,            ARBITRARY UNITS, ARBITRARY UNITS
##FACTOR=    0.250966925370066, 1,           1
##FIRST=     8223.43324360094, -10245,       -113107
##LAST=      0,             24656,           -45109
##MIN=       0,             -686805,         0
##MAX=       8223.43324360094, 445575193,    0
$$ Real data points
##PAGE= N=1
##DATA TABLE= (X++(R..R)), XYDATA
$$ [...]
19541b68055e2662I1464a50300A5564n333h7126G3872b00315m4855A71692B8702
$$ -268055 -52662 91464 -150300 15564 10231 -87126 73872 -200315 -245170 171692 28702
19529B5271J39349j0069A7333L2854b0194j02108L4916A44468M804I26c24859
$$ 25271 164620 154551 17333 50187 -20194 -122302 -87386 144468 149272 926 -324859
19517g3485j87529A7146a46343k9163I0466J3266a72855O3925a9127B09629h269
$$ -73485 -261014 17146 -146343 -175506 90466 103732 -172855 -108930 -19127 209629 -8269
19505D4191J33197F7828h5061j23131Q7180C0584k776J12752e21992d8192a100
$$ 44191 177388 67828 -85061 -208192 -121012 30584 27808 140560 -521992 -48192 -1100
19493a78428C4729R6677k1102a21338d6854A4805b43318J12508C88347b6770k82999
$$ -178428 34729 131406 110304 -121338 -46854 14805 -243318 -130810 388347 -26770 -309769
19482c09769L1484A65480a86721j04223B35958b13059j99255A0405J42946a77557
$$ -309769 -278285 165480 -186721 -290944 235958 -213059 -412314 10405 153351 -177557
19471F4741l1804K95633C4940a10560C6667b29526F1709K115a2601j90249H4076
$$ 64741 32937 328570 34940 -110560 36667 -229526 61709 63824 -12601 -202850 84076
19459a7210r9605E1230J66772c167A7392j890O8660A2356c7925l36444C5980a56476
$$ -17210 -116815 51230 218002 -3167 17392 15502 84162 12356 -37925 -374369 35980 -156476
19446B05671a07674d4456p5723A55350m2800h0125p4161l04565a84505C5769O7119
$$ 205671 -107674 -44456 -120179 155350 112550 -80125 -154286 -458851 -184505 35769 102888
19435A02888b39747j55700h0058A67467b36776A4843d6391k82918f6703B509O3526
$$ 102888 -239747 -395447 -80058 167467 -236776 14843 -46391 -329309 -66703 2509 66035
19424F6035K54243a72463B01645h0712n6846A14722r450O2059E8451a1235A31926
$$ 66035 320278 -172463 201645 -80712 -137558 114722 105272 167331 58451 -11235 131926
19412B11827J9332a22495j0328k7557J58c3779B44J81405f3048H1837j7390a1037
$$ 211827 231159 -122495 -132823 -160380 -160222 -33779 244 181649 -63048 81837 64447 -11037
19399C418Q524L8939L5759a06402J8349q6073F3533a86003A73130c77788d4127
$$ 3418 11942 50881 86640 -106402 -88053 -174126 63533 -186003 173130 -377788 -44127
19387a97572j57844c0561o9287o5079P9957B37492a83869e7269k69926D334P1599
$$ -197572 -355416 -30561 -99848 -164927 -84970 237492 -183869 -57269 -327195 4334 75933
19376G5933a42851f1206A36099a29931c0682q7377d3246l69092a02245g596m40453
$$ 75933 -142851 -61206 136099 -129931 -30682 -118059 -43246 -412338 -102245 -7596 -448049
19365d48049b22420i4092A11385b35881A5801K00988b60742G1628a35617j4810
$$ -448049 -222420 -94092 111385 -235881 15801 216789 -260742 71628 -135617 -150427
19355a50427F3154L3759c26955f3127F3766J06560G3351a21723j33556P8789P0963
$$ -150427 63154 96913 -326955 -63127 63766 170326 73351 -121723 -255279 -176490 -105527
19344a05527g511A692K9461c42313B95974a08666I8875c8881i100m92964B262
$$ -105527 -7511 1692 31153 -342313 295974 -108666 98875 -38881 -9100 -502064 2262
19332B31958g0043L3925H6871g8776k92003A94652i0782k85984a21623d715m9004
$$ 231958 -70043 -36118 86871 -78776 -370779 194652 -90782 -376766 -121623 -4715 -53719
19321e3719j47733B3082b38816A28260E2972c03294k96832K57488D3232b53513
$$ -53719 -201452 23082 -238816 128260 52972 -303294 -600126 -342638 43232 -253513
19310b98126Q0218H7236b45701J01674d500k29664r1354b6862B90077b25819o699
$$ -298126 -217908 87236 -245701 -144027 -4500 -234164 -325518 -26862 290077 -225819 -232518
19299b32518i3016B23181A7574a43003d44j55761B09660i2608b0051j19037o1725
$$ -232518 -93016 223181 17574 -143003 -444 -156205 209660 -92608 -20051 -139088 -200813
19288b00813e7657A16407d9186j60958C10565a71438O7011j39443k77988A86216
$$ -200813 -57657 116407 -49186 -210144 310565 -171438 -104427 -243870 -521858 186216
19277c2932p2063n5410g6930H693a04383M2082J7279C79030c5580C10380A08479
$$ -32932 -104995 -160405 -76930 8693 -104383 -62301 -45022 379030 -35580 310380 108479
19265B0875b37870a11377B50990G0755f1900j86360C4020R9919c6074k13047A07109
$$ 20875 -237870 -111377 250990 70755 -61900 -248260 34020 133939 -36074 -249121 107109
19253c29472a18761g352j36953m3407B87805j07514C0515a91328A72221a60553
$$ -329472 -118761 -7352 -144305 -187712 287805 180291 30515 -191328 172221 -160553
19242a54137A92852a87586K837n4640A2992J26994a02647B70448a57700B50325
$$ -154137 192852 -187586 -184749 -239389 12992 139986 -102647 270448 -157700 250325
19231a9696l8173H0484f2060A30991e2163j25332C6546J69479g7007A16497b53475
$$ -19696 -57869 80484 -62060 130991 -52163 -177495 36546 206025 -77007 116497 -253475
19219b45489j61097A42422f2477j81462A60238i9441d422j79378A63938b02218
$$ -245489 -406586 142422 -62477 -243939 160238 -99441 -4422 -183800 163938 -202218
19208A98508F5236a62268c6150B10153a50402a8208q3062k9301H6411l2339a59437
$$ 198508 65236 -162268 -36150 210153 -150402 -18208 -101270 -130571 86411 54072 -159437
19196a84720B89778i7560I3448a00208d0589F0688f5646b5151j04116r4237C2332
$$ -184720 289778 -97560 93448 -100208 -40589 60688 -65646 -25151 -129267 -223504 32332
19184b84730I0738k5881a67448k40476G988d32186D3735R3821N9960i1552A0737
$$ -284730 90738 64857 -167448 -407924 7988 -432186 43735 137556 197516 -91552 10737
19172B88280e9278I2629a14043D90i8806j286k16168J38551m72457f4262A03514
$$ 288280 -59278 92629 -114043 490 -98806 -100092 -316260 -177709 -650166 -64262 103514
19160d73375J72363A716a83470C20298g2534A41320a52762j49925J8393M9165
$$ -473375 -301012 1716 -183470 320298 -72534 141320 -152762 -302687 -284294 -235129
19150b35129L4036A14095l3609b33888l1406b5792j6893m7515p599A02738A7020
$$ -235129 -201093 114095 80486 -233888 -265294 -25792 -42685 -90200 -97799 102738 17020
19138a30273R928a1248j56064g5221j57607a1091m8880o240F6031a8924A06399
$$ -130273 -120345 -11248 -167312 -75221 -232828 -11091 -59971 -66211 66031 -18924 106399
19126c2508k06250a10793j08261R7620A22480b10798e8147A51195p2060O4396
$$ -32508 -238758 -110793 -219054 -121434 122480 -210798 -58147 151195 79135 143531
19116A43531F2725J63147a94207D0642A5410b48903l6887J10108J3846B92199
$$ 143531 62725 225872 -194207 40642 15410 -248903 -285790 -175682 -161836 292199
19105c75841K1992h4781A6645d25392b04707h8092B17887k4534c1923A64296I635
$$ -375841 -353849 -84781 16645 -425392 -204707 -88092 217887 193353 -31923 164296 9635
19093B14918c3300B34180h3208A7130K98047E5387b37720M7456m9293J8667B8431
$$ 214918 -33300 234180 -83208 17130 315177 55387 -237720 -190264 -239557 -220890 28431
19081b42275m5315J40670l5598b9803j43992A1133L2245a43524A84167c29243
$$ -242275 -287590 -146920 -182518 -29803 -173795 11133 43378 -143524 184167 -329243
19070a78374P9973a0724l51381b5353E180f3475M128j29636d8069A36114J55321
$$ -178374 -98401 -10724 -362105 -25353 5180 -63475 -59347 -188983 -48069 136114 291435
19059B91435A6145b52169J9259N3500k5578P3828j65074Q836B91300c5626j24332
$$ 291435 16145 -252169 -232910 -179410 -204988 -131160 -296234 -287398 291300 -35626 -159958
19048a59958A73486b4395j98769J8718D4390g7468a7586m16649A48407b22859
$$ -159958 173486 -24395 -223164 -204446 44390 -77468 -17586 -434235 148407 -222859
19037b84945A6759c46250e7434j94602E30196a68260D07742H3126J71039B0636
$$ -284945 16759 -346250 -57434 -252036 530196 -168260 407742 83126 254165 20636
19026i3208K9066C05278a72808A110K55586l9399a64832C6684c10279i4379b4542
$$ -93208 -64142 305278 -172808 1110 256696 217297 -164832 36684 -310279 -94379 -24542
19014h0704p158C2315K81929c6746D3061h705j891m33932A8759c87432D2598d02589
$$ -80704 -87862 32315 314244 -36746 43061 -8705 -10596 -444528 18759 -387432 42598 -402589
19001A59558c72309A61305a53531l3152I7857l9088b6672H7954a51923d1800B06228
$$ 159558 -372309 161305 -153531 -186683 97857 58769 -26672 87954 -151923 -41800 206228
18989a3263j33975d6260j83974N9952f2073j145j80655c62H5431A5739K88541
$$ -13263 -147238 -46260 -230234 -170282 -62073 -63218 -243873 -362 85431 15739 304280
18978C04280F1462f8672G7167h4467A86083b1346M461A37792a18271c061F5042
$$ 304280 61462 -68672 77167 -84467 186083 -21346 -16885 137792 -118271 -3061 65042
18966a87893B75269n3101K0646b18583A27576d9314k47070f9712J0503I0967J16850
$$ -187893 275269 222168 242814 -218583 127576 -49314 -296384 -69712 -59209 90967 207817
18955B07817a93873C05462b19521B27602A07523a46871A5725f0177o968B80317
$$ 207817 -193873 305462 -219521 227602 107523 -146871 15725 -60177 -67145 280317
18944c8050k86283J46755i527A1643a23669j54089i4119A06881d2250j7040o9602
$$ -38050 -324333 -177578 -9527 11643 -123669 -277758 -94119 106881 -42250 -59290 -128892
18933a28892B55070D6581c10535O7888A56479c35873J26378M2233A93544L1380
$$ -128892 255070 46581 -310535 -242647 156479 -335873 -209495 -167262 193544 224924
18923B24924b696j17547A92817i0556k05356c5176p9035B37718a01118a1863C4049
$$ 224924 -2696 -120243 192817 -90556 -295912 -35176 -114211 237718 -101118 -11863 34049
18911A05105a9059k099l54402J10668B5182O2628h0839L8511m7343j89444h1843
$$ 105105 -19059 -21158 -375560 -264892 25182 87810 -80839 -42328 -89671 -279115 -81843
18899A54521J54740c2866k85856a45409I7748b5194C82589a02069l9030o3176
$$ 154521 309261 -32866 -318722 -145409 97748 -25194 382589 -102069 -141099 -204275
18889b04275l3628A14085d02035f5714A3864L4035a49947P3125k9653b7621A17827
$$ -204275 -237903 114085 -402035 -65714 13864 47899 -149947 -76822 -106475 -27621 117827
18877B17308a43994C55037i5748c7405B7248e4585j4071C1711b74720r275H6816
$$ 217308 -143994 355037 -95748 -37405 27248 -54585 -68656 31711 -274720 -283995 86816
18865a98322A37815b22324A2298a18653k4268c0716k38588h2360c127o51m25963
$$ -198322 137815 -222324 12298 -118653 -142921 -30716 -269304 -82360 -3127 -3778 -429741
18854d29741D9875o535P212L4472J8950h9045A11995O6831a76891B3962a48542
$$ -429741 49875 43340 50552 85024 103974 -89045 111995 178826 -176891 23962 -148542
18842a23000F0113J79618a80109K0807N1577A93826H9378b24767j30837A35717
$$ -123000 60113 239731 -180109 -159302 -107725 193826 89378 -224767 -355604 135717
18831b26140Q9210e6987p9155M0935A18618O7150c73010C251J32762d4468k17663
$$ -226140 -136930 -56987 -136142 -95207 118618 185768 -373010 3251 136013 -44468 -262131
18820b62131b1902l28168B99952c880D1799a43577k830A60376i6014A54903C7677
$$ -262131 -21902 -350070 299952 -3880 41799 -143577 -146407 160376 -96014 154903 37677
18808B51338A6376b24316B58041C5153i3735A10214b52035B3421c55746h2516
$$ 251338 16376 -224316 258041 35153 -93735 110214 -252035 23421 -355746 -82516
18797I1855a95903B06348h0598j73822L3258I5067a21344C31758a78818B3110
$$ 91855 -195903 206348 -80598 -254420 -221162 95067 -121344 331758 -178818 23110
18786C9611M5796c20527a47093j48735B584R323a13933r0555b5634A10850a61734
$$ 39611 85407 -320527 -147093 -295828 2584 11907 -113933 -204488 -25634 110850 -161734
18774a6506H2469k1221a79169A57690b22180P5459j3168E2852J27225o9316a27731
$$ -16506 82469 61248 -179169 157690 -222180 -146721 -159889 52852 180077 110761 -127731
18762a99026L6282n8700A03612P9017B8521g6532K2304k91004A51309k9191E4063
$$ -199026 -162744 -221444 103612 182629 28521 -76532 -54228 -345232 151309 122118 54063
18750B94415E1685c2672l14781d1305J5758A70457d66027a14217B12110a6175
$$ 294415 51685 -32672 -347453 -41305 -25547 170457 -466027 -114217 212110 -16175
18739f8950b8053l60464d8702j54581j93153A28589a21018G8526c0097m0627j21282
$$ -68950 -28053 -388517 -48702 -203283 -396436 128589 -121018 78526 -30097 -70724 -192006
18728a92006g4287b1753D8230g8385q2053j48435g4246J8480j90210C14418h3556
$$ -192006 -74287 -21753 48230 -78385 -160438 -308873 -74246 -55766 -245976 314418 -83556
18716A61472Q1341K720b59548C86893a67298A46792b51564k50482a72854I5292
$$ 161472 242813 245533 -259548 386893 -167298 146792 -251564 -502046 -172854 95292
18705A7726Q7205a84921h0368A7199K56779A1022K14795q1944b60252B87192d8837
$$ 17726 104931 -184921 -80368 17199 273978 11022 225817 143873 -260252 287192 -48837
18693e5085p8710c9540j28258j68264A97513e9957a547A46144B5881R8675b34878
$$ -55085 -133795 -39540 -167798 -336062 197513 -59957 -1547 146144 25881 124556 -234878
18681g4435b0187q1538A18334a43353k22839f817j13670j38756M3879N7859j5612
$$ -74435 -20187 -101725 118334 -143353 -366192 -6817 -120487 -259243 -215364 -157505 -173117
18670a73117f0919j3279r9034A08595a23797l4853D7523J30182a2317K424j22891
$$ -173117 -60919 -74198 -173232 108595 -123797 -158650 47523 177705 -12317 -9893 -132784
18659a32784L5317d6718E2525a54644n3878C238K8041d4873J7761d260k59224
$$ -132784 -97467 -46718 52525 -154644 -208522 3238 31279 -44873 -27112 -4260 -263484
18648b63484M6427C0989O0781c3824A63910K6999a68155g1983j3018E5954b2732
$$ -263484 -217057 30989 91770 -33824 163910 190909 -168155 -71983 -85001 55954 -22732
18636b36844a04185b3079a0425l79196C1234E675a15524j79786M9574O2724O5159
$$ -236844 -104185 -23079 -10425 -389621 31234 5675 -115524 -295310 -245736 -183012 -117853
18625a17853A49692c49094i7309J6502f580l13622A36482B0737c27317c2817o9319
$$ -117853 149692 -349094 -97309 -80807 -6580 -320202 136482 20737 -327317 -32817 -102136
18614a02136k58536D3282a61501j86974B19240a34535A95737c49851A9222a04042
$$ -102136 -360672 43282 -161501 -348475 219240 -134535 195737 -349851 19222 -104042
18603c03819a23500n2080A75819c87487I6834a32560b8370E535b60399L0625c2109
$$ -303819 -123500 -175580 175819 -387487 96834 -132560 -28370 5535 -260399 -229774 -32109
18591A30410f1871B3737J12633Q1015b7685k2180B48740a46826p4767D1614J0064
$$ 130410 -61871 23737 136370 217385 -27685 -49865 248740 -146826 -221593 41614 51678
18580E1678A9106c8951j28639k22719a12498r8303G9583c69762a19189J7423A378
$$ 51678 19106 -38951 -167590 -390309 -112498 -210801 79583 -369762 -119189 -101766 1378
18568f3520m4289J3893b4989A10575b5883F5802B6527B895i9903B2324d8182k09587
$$ -63520 -107809 -93916 -24989 110575 -25883 65802 26527 2895 -99903 22324 -48182 -257769
18556b57769B5800M20331b37608B3859P0956j1186c51790K9208i1963A12941L0435
$$ -257769 25800 446131 -237608 23859 94815 83629 -351790 -322582 -91963 112941 143376
18545A43376J6296B6267R6050K4066a09259D7241d5266k47376a38252C6035R344
$$ 143376 159672 26267 122317 146383 -109259 47241 -45266 -292642 -138252 36035 45379
18534D5379m974b40827k85061F4023h7636j5743B92709f2443j65737N1965o5468
$$ 45379 40405 -240827 -525888 64023 -87636 -103379 292709 -62443 -228180 -176215 -241683
18523b41683h4638k47149C15169I3239a42749f2336B0891a6710j96014A89331
$$ -241683 -84638 -331787 315169 93239 -142749 -62336 20891 -16710 -212724 189331
18512A67744c9029I5435L5999d0282C102h4721c0378A2175a32717B24310a65354
$$ 167744 -39029 95435 131434 -40282 3102 -84721 -30378 12175 -132717 224310 -165354
18500E4549b2930k19979b1430A88795o4553c41858R6172K0071A89179a41685A63146
$$ 54549 -22930 -242909 -21430 188795 124242 -341858 -245686 -225615 189179 -141685 163146
18488a69386j22711B80160a62612m8468p0856H6041a28483l4678g8825I2181k5845
$$ -169386 -292097 280160 -162612 -211080 -281936 86041 -128483 -163161 -78825 92181 66336
18477F6336f6069E8093a41172F5776e0792A59533a4380j26945k45474a04084L9906
$$ 66336 -66069 58093 -141172 65776 -50792 159533 -14380 -141325 -386799 -104084 -64178
18466f4178F8016b05111B29644a78969B02519c72403B97264a00964m0486j25334
$$ -64178 68016 -205111 229644 -178969 202519 -372403 297264 -100964 -141450 -266784
18456b66784J11941M4009N3540k12846e3156k07543D9485c06577A98831E0514
$$ -266784 -154843 -110834 -57294 -270140 -53156 -260699 49485 -306577 198831 50514
18445a85461P8153d1311l14619J16284K5763A7076O632J03574a85523b2230j82030
$$ -185461 -107308 -41311 -355930 -239646 -213883 17076 23708 127282 -185523 -22230 -204260
18434b04260j2780A15061i0224A38190j5915g1433a3099B98989a65178b7700B9503
$$ -204260 -217040 115061 -90224 138190 122275 -71433 -13099 298989 -165178 -27700 29503
18422a25981K2372A2066i3023A00585P9824D0539J25224D6432a12147A57290a24293
$$ -125981 -103609 12066 -93023 100585 180409 40539 165763 46432 -112147 157290 -124293
18410E7318R0318k6383B3412J52676b22725D409a29441F0063J89127b19242f9457
$$ 57318 147636 121253 23412 176088 -222725 4409 -129441 60063 249190 -219242 -69457
18398a70448K4700m5885B09019B3112a47245b3929k4433k29645O6035b2973p4518
$$ -170448 -145748 -191633 209019 23112 -147245 -23929 -48362 -278007 -211972 -22973 -97491
18387i7491D9986J9190J86550a97303I4448B9165b9925A83941b35271M4173g3297
$$ -97491 49986 69176 255726 -197303 94448 29165 -29925 183941 -235271 -191098 -73297
18375C73006b30383B203F96g5530F4584P0528b90453J01765N0926D0721n505a94584
$$ 373006 -230383 2203 696 -75530 64584 135112 -290453 -188688 -137762 40721 35216 -194584
18362D5112N438f589A70887a05303b3632j84741h124m020a750k3802B22190a61189
$$ 45112 50550 -6589 170887 -105303 -23632 -208373 -8124 -12144 -1750 -25552 222190 -161189
18349g8983q0889l1740A76525g0200J4482H6944b28657L7806j14635i655k77837
$$ -78983 -159872 -191612 176525 -70200 -55718 86944 -228657 -190851 -305486 -9655 -287492
18338b87492I014a43408q5947D9890c11950g0116A08631p797b40369A1968a54786
$$ -287492 9014 -143408 -229355 49890 -311950 -70116 108631 100834 -240369 11968 -154786
18326D5177e2885A47685b99972G284h5407A48978c24853J14497h6268l2161I3063
$$ 45177 -52885 147685 -299972 7284 -85407 148978 -324853 -210356 -86268 -118429 93063
18314A00076K0066E3938M3344f5092o800A6573J27942c10470A8450i5450A51476
$$ 100076 120142 53938 97282 -65092 -71892 16573 144515 -310470 18450 -95450 151476
18302A48878A5210M2792a19661A7911J55556C7532B723L3431b62974d9758B44993
$$ 148878 15210 58002 -119661 17911 173467 37532 2723 36154 -262974 -49758 244993
18290a30453B31204h6777j68609B67159H3913a68530B5314a1198B2291J30350
$$ -130453 231204 -86777 -255386 267159 83913 -168530 25314 -11198 22291 152641
18280A52641i8160E19c6272B6090d12983A44622F8833a01595q186D8841j7507
$$ 152641 -98160 519 -36272 26090 -412983 144622 68833 -101595 -109781 48841 31334
18269C1334d18649F1211c5588r668n1420A63114c86424a28438q0570A24027a7532
$$ 31334 -418649 61211 -35588 -45256 -96676 163114 -386424 -128438 -209008 124027 -17532
18257c06578B09659H7047C8722b87227B94725a48018j60434J27416B14666I6246
$$ -306578 209659 87047 38722 -287227 294725 -148018 -308452 -181036 214666 96246
18246f9786A43576a28376k54465A04048o135f7159j52652j51434M9995a6650B81174
$$ -69786 143576 -128376 -382841 104048 97913 -67159 -219811 -371245 -321250 -16650 281174
18234a81032b4234C9096J31519b28487e2434A46935a53710K2279B20221a99778
$$ -181032 -24234 39096 170615 -228487 -52434 146935 -153710 -131431 220221 -199778
18223a93278C10675b44962A20380K971h7384A74043B5873i3586A82680K69297
$$ -193278 310675 -244962 120380 123351 -87384 174043 25873 -93586 182680 451977
18213D51977E9639a73501q0984i5352A246b81283B99281a2366j94673C89233C7156
$$ 451977 59639 -173501 -254485 -95352 1246 -281283 299281 -12366 -207039 389233 37156
18201h2575J4418j3676e96A3402a47640A68721o3870b28283c9925E2400A5448
$$ -82575 -68157 -81833 -596 13402 -147640 168721 104851 -228283 -39925 52400 15448
18189a78010A04451a5484o9913L7663B68047E332c2283P903n0219p7813A96908
$$ -178010 104451 -15484 -85397 -47734 268047 5332 -32283 -24380 -74599 -152412 196908
18177F0996Q1493h6901m050E2988b81249b1096B54401E4290L7276j0633a79821
$$ 60996 142489 -86901 -90951 52988 -281249 -21096 254401 54290 91566 80933 -179821
18165a7778H6418m331D0965P2984b01266B74964A20221i1274k3688j6287m145
$$ -17778 86418 82087 40965 113949 -201266 274964 120221 -91274 -114962 -131249 -135394
18154a35394N1008L2318k14121B48624a94672A47023d9588j40997h9544G494b48027
$$ -135394 -84386 -52068 -266189 248624 -194672 147023 -49588 -190585 -89544 7494 -248027
18142F5616k7073c1868C37233A20761c55484a63167A01181A4126i3026A3327P5843
$$ 65616 38543 -31868 337233 120761 -355484 -163167 101181 14126 -93026 13327 89170
18131H9170a00756C25187c22841a11442F9553c08458M6329B36235p778k7284c0739
$$ 89170 -100756 325187 -322841 -111442 69553 -308458 -262129 236235 228457 201173 -30739
18119A03275J17947b47482B1400a42751K9677e477j8948m8617k5430I1074a44681
$$ 103275 221222 -247482 21400 -142751 -113074 -5477 -24425 -73042 -98472 91074 -144681
18107A56090g8317A50725a99211p6721D4442Q8011a69634M0525p6356n9317M9138
$$ 156090 -78317 150725 -199211 -275932 44442 132453 -169634 -129109 -205465 -264782 -215644
18096b15644h3713A8139O779K0453j0124O5163a27058Q960e3593l16A50203h238
$$ -215644 -83713 18139 24918 45371 35247 100410 -127058 -118098 -53593 -53909 150203 -8238
18083C2292j4112J04302a49838j77253c729m2073E2935K356e2488j9158A69527
$$ 32292 18180 122482 -149838 -327091 -3729 -45802 52935 55291 -52488 -71646 169527
18071B22362b15021B8788a21515E0969g3520j57638B7607A2979a81492M2516I2553
$$ 222362 -215021 28788 -121515 50969 -73520 -231158 27607 12979 -181492 -138976 92553
18059e9065n1162C2027a97715R8616k75917N5361D0652A4985i6039B53989J54228
$$ -59065 -110227 32027 -197715 -99099 -375016 -319655 40652 14985 -96039 253989 408217
18048D08217a32626C649P2096a56519B7325a65674k0008F4024a30049j61925f1227
$$ 408217 -132626 3649 75745 -156519 27325 -165674 -185682 64024 -130049 -291974 -61227
18036H7409K3116b3476D0036d0537k0703G1824a6254p0405h84B35532J03725C7311
$$ 87409 110525 -23476 40036 -40537 -61240 71824 -16254 -86659 -884 235532 339257 37311
18023B00943J18688E5752c09935A9869J07748j862n4866O217j7829a71276A21075
$$ 200943 319631 55752 -309935 19869 127617 125755 70889 77106 59277 -171276 121075
18011a81244B26773E2787b88318h9260p27D5391J7499c6821H3290e0048H4618
$$ -181244 226773 52787 -288318 -89260 -89987 45391 62890 -36821 83290 -50048 84618
17999b41212Q1403N3338A41422f9655K7539A71471a61240M8847J3380r7775J3385
$$ -241212 -159809 -106471 141422 -69655 -42116 171471 -161240 -112393 -99013 -196788 -183403
17988a83403G4527J81434i6953A2026K00799i9677l7832o7775D726O1889b50n2992
$$ -183403 74527 255961 -96953 12026 212825 -99677 -137509 -205284 4726 66615 -250 -53242
17976e3242j32877K2864b814j74929M634c1994k60465C3474i0946m2675A04052
$$ -53242 -186119 -163255 -2814 -177743 -173109 -31994 -292459 33474 -90946 -133621 104052
17964i9393B05609J5255a55204n5843c9840B1604i9769F972a04238a8673A48853
$$ -99393 205609 220864 -155204 -211047 -39840 21604 -99769 6972 -104238 -18673 148853
17952A81309b25650e2802A56779J6682a37994A39911f4211p502B61655a26622
$$ 181309 -225650 -52802 156779 173461 -137994 139911 -64211 -71713 261655 -126622
17941A42963G0445J54294D1367j5714a69939j09102A80064c0312A44837J54292
$$ 142963 70445 224739 41367 25653 -169939 -279041 180064 -30312 144837 299129
17931B99129a60152A42797e3167j1256k31931d3941a6903C1774J38617p2911K26638
$$ 299129 -160152 142797 -53167 -64423 -296354 -43941 -16903 31774 170391 97480 324118
17920C24118A26960l2943g6363A43861K7579K46258b86630a9747F1122b24339
$$ 324118 126960 94017 -76363 143861 171440 417698 -286630 -19747 61122 -224339
17909a29165d1781k1296j0200C63813G9822J6495a82175C0623a2341l17611E688
$$ -129165 -41781 -63077 -73277 363813 79822 96317 -182175 30623 -12341 -329952 5688
17897A7544c1134G4775O3014i9778R349j14601G667J0292a55089K7801B12719
$$ 17544 -31134 74775 137789 -99778 -90429 -205030 7667 17959 -155089 -127288 212719
17885C67044A50762b47184m8151A80645c8067B90437F7668c3806A15849l7936
$$ 367044 150762 -247184 -295335 180645 -38067 290437 67668 -33806 115849 77913
17875G7913h7504J7729K2968j460k9376c2037j34773b9129k9607B02885a42890
$$ 77913 -87504 -69775 -46807 -48267 -77643 -32037 -166810 -29129 -58736 202885 -142890
17863f3845r1628m6538h8969k4934p1456j90520G0912O8931f3980E4400a47087
$$ -63845 -155473 -202011 -88969 -113903 -185359 -375879 70912 139843 -63980 54400 -147087
17851a29740E6520d2223l09815A81209m7941J3765a87118A59379p6675B1885Q1839
$$ -129740 56520 -42223 -352038 181209 133268 147033 -187118 159379 82704 21885 103724
17840A03724j6234C6986K87618H1275l942h2734l958J6982j26018j11624C4113
$$ 103724 87490 36986 324604 81275 77333 -82734 -86692 -69710 -195728 -307352 34113
17828A46589g6470C91135c4165B07815A4458b0348l84196a50135I0817K04435
$$ 146589 -76470 391135 -34165 207815 14458 -20348 -404544 -150135 90817 295252
17818B95252E8381b99190b0352E6108b62971d0518A10193c03285a3030l6009k80602
$$ 295252 58381 -299190 -20352 56108 -262971 -40518 110193 -303285 -13030 -49039 -329641
17807c29641A37654L0250l4882B6241e1251B43845m392b67890D9410f7394A22689
$$ -329641 137654 167904 133022 26241 -51251 243845 239453 -267890 49410 -67394 122689
17795a66677B48949a772j31907q0745B11791C0447e9931q4855b5081B42358d90922
$$ -166677 248949 -1772 -133679 -214424 211791 30447 -59931 -144786 -25081 242358 -490922
17783E8023c2939N947m1027j90724i3408j67551B03844f1672A69091F3631R5944
$$ 58023 -32939 -26992 -68019 -258743 -93408 -260959 203844 -61672 169091 63631 159575
17772A59575Q4676F916a2114G0152c79454c6036J7254F479a05278j27007c058
$$ 159575 244251 6916 -12114 70152 -379454 -36036 -18782 6479 -105278 -232285 -3058
17760F3447C0450K74364D0051J58727D3339a26667j83544a28243a0532m2435B89917
$$ 63447 30450 304814 40051 198778 43339 -126667 -310211 -128243 -10532 -52967 289917
17748A7744Q0794O4522b94216A99775D217L28331j07533j01448b69997B54168
$$ 17744 98538 163060 -294216 199775 4217 332548 225015 123567 -269997 254168
17737C17142i7352A32327J43764G0694J33309o9127c25138D8169J05292f0041
$$ 317142 -97352 132327 276091 70694 204003 134876 -325138 48169 153461 -60041
17726a12151G9555c81144A94408b15249A70867J06554b17063B07190c31368c6452
$$ -112151 79555 -381144 194408 -215249 170867 277421 -217063 207190 -331368 -36452
17715A1673Q6706c24846J09267D4119b1789A25149b4164l337o5955A35848j0319
$$ 11673 98379 -324846 -215579 44119 -21789 125149 -24164 -27501 -93456 135848 125529
17704A25529J82848e5442m5817C1805b08058R8206o842F872J93022c3650l9379
$$ 125529 308377 -55442 -101259 31805 -208058 -109852 -116694 6872 199894 -33650 -73029
17693g3029j16396G9402a0607A66853D5201R5164a09968B18672b41041D2721K21796
$$ -73029 -189425 79402 -10607 166853 45201 140365 -109968 218672 -241041 42721 264517
17682B64517j26012k9265L8995m5124e0157k6667D10733G4983g5181b7832A62659
$$ 264517 138505 109240 148235 103111 -50157 -76824 410733 74983 -75181 -27832 162659
17670H0546L839b27745A47567b47582a4448B99846a85406A70444D2739K03961
$$ 80546 84385 -227745 147567 -247582 -14448 299846 -185406 170444 42739 246700
17660B46700C2138a09254M4474b0194C02732e1040J0982B88854j23951a96408
$$ 246700 32138 -109254 -64780 -20194 302732 -51040 -40058 288854 164903 -196408
17649A38169R9414m8271N2924Q5797A32915d0652B2827N6032j5063a77260D3560
$$ 138169 237583 189312 242236 328033 132915 -40652 22827 78859 63796 -177260 43560
17637a0788j56556c6107j94073e6712b1111j0571B9586J19875F2459K27266A38538
$$ -10788 -167344 -36107 -230180 -56712 -21111 -31682 29586 149461 62459 289725 138538
17625A36644Q4461D599a26908C16937A46407a45799M2590c6770C2815Q5068m1686
$$ 136644 221105 4599 -126908 316937 146407 -145799 -103209 -36770 32815 117883 76197
17614G6197Q601P525c83929B24856B2413a73365b2242D24110b94829I9283h2730
$$ 76197 84798 92323 -383929 224856 22413 -173365 -22242 424110 -294829 99283 -82730
17602c3107A17552J3378F4700h7225n0214C30661a59614n7543M296f7357A81025
$$ -33107 117552 130930 64700 -87225 -137439 330661 -159614 -217157 -212861 -67357 181025
17590H9774b51085R6632d1330H481P8919b01360A98451b19003D36603d6803B73231
$$ 89774 -251085 -154453 -41330 8481 87400 -201360 198451 -219003 436603 -46803 273231
17578H593P880d7516k09462a20995B28298J09381i2514B32202A6148K12965g9868
$$ 8593 16473 -47516 -256978 -120995 228298 337679 -92514 232202 16148 229113 -79868
17566b03523A94526a99416A10391a63546a6940M734B03648C9810Q8765a09898
$$ -203523 194526 -199416 110391 -163546 -16940 -12206 203648 39810 128575 -109898
17555C3208b45230A96493K1205L6167b07269A90454K09319b20244I5170L34644
$$ 33208 -245230 196493 217698 253865 -207269 190454 399773 -220244 95170 429814
17545D29814A46934P057C6876b34766A89983i7833A20012c4831B50186a63157
$$ 429814 146934 153991 36876 -234766 189983 -97833 120012 -34831 250186 -163157
17534g6472C57916j40500q8203C1200b82300a13514c1289r2070I5336J53718l2117
$$ -76472 357916 217416 129213 31200 -282300 -113514 -31289 -123359 95336 249054 216937
17523B16937n1534g4629A18202c19324G6065k0492n046N5434L32967A10919K10026
$$ 216937 165403 -74629 118202 -319324 76065 55573 50527 105961 438928 110919 320945
17512C20945A44037B2773K04100B9655B831b80961B46429d9764J9986A2378g9568
$$ 320945 144037 22773 226873 29655 2831 -280961 246429 -49764 -29778 12378 -79568
17500A49255a38845C1034g2563j16604a9366B18190K36934A11911J40249K05160
$$ 149255 -138845 31034 -72563 -189167 -19366 218190 455124 111911 252160 457320
17490D57320J6424a5674B11209c11266A04488L1840O4620O7486C6971E47O3037
$$ 457320 473744 -15674 211209 -311266 104488 136328 200948 268434 36971 547 63584
17479F3584L18466l7905r7038A14786J35413q9664h4810C31266J5982j10221g9866
$$ 63584 382050 344145 247107 114786 250199 160535 -84810 331266 347248 237027 -79866
17467d0156F7494N5817m2906J99171p4566r5874a09242A17829h7749F4352L78873
$$ -40156 67494 123311 80405 279576 205010 109136 -109242 117829 -87749 64352 443225
17456D43225j87999p1803b96313C31946A24366J51886J55903j44321l282c071
$$ 443225 255226 183423 -296313 331946 124366 276252 432155 287834 284552 -3071
17445C85314K5446j70298F7464K56367o9947j10869n2794J27722j0596a3175k8640
$$ 385314 410760 240462 67464 323831 253884 143015 90221 217943 207347 -13175 -41815
17434d1815C87443j85432H4699C5687N05694k22099G5402K23417A14837J21032
$$ -41815 387443 202011 84699 35687 541381 319282 75402 298819 114837 235869
17424B35869J3718L5955P8070r6554q2262J38758j18769I1021J74699k0131P847
$$ 235869 249587 285542 363612 267058 184796 323554 204785 91021 265720 245589 253436
17413B53436o2256I0408A424h4485C65028O5849G9179a37216C14402j07831K2537
$$ 253436 191180 90408 1424 -84485 365028 430877 79179 -137216 314402 206571 229108
17402B29108r4041a42920C39669C8574N1274K44860A65439J24801N1184c03048
$$ 229108 135067 -142920 339669 38574 89848 334708 165439 290240 341424 -303048
17391A03639N6342a62132D96450A38106J7301a1224D19298A78815B4297J15742
$$ 103639 159981 -162132 496450 138106 155407 -11224 419298 178815 24297 140039
17381A40039J3998A6102P8825J16931J35122j49399a96724B34941G2617L95104
$$ 140039 154037 16102 94927 211858 346980 197581 -196724 234941 72617 467721
17371D67721A86100J10803a03289A73859M4513a76685C31772f325A03433C2543
$$ 467721 186100 296903 -103289 173859 218372 -176685 331772 -6325 103433 32543
17360E4002M3629p474a52534C06829m2606k234N5528g7344q4629o3439A42952
$$ 54002 97631 90157 -152534 306829 264223 261989 317517 -77344 -161973 -225412 142952
17348D37459b5937B9170M9141a0756A27842c01355A88801H5319i0838A24312C0989
$$ 437459 -25937 29170 78311 -10756 127842 -301355 188801 85319 -90838 124312 30989
17336B36979j05452k9155J31063m8006n3928R1511a80567B83361J23639j02268
$$ 236979 131527 102372 233435 185429 131501 223012 -180567 283361 407000 304732
17326C04732A7283J42291E0364a1821C73287m5317D7741j7794a13756D39167A23184
$$ 304732 17283 159574 50364 -11821 373287 327970 47741 29947 -113756 439167 123184
17314A62117b4345j14808D79694a09847C59945A39545K40388a07908N1310A89236
$$ 162117 -24345 -139153 479694 -109847 359945 139545 379933 -107908 -56598 189236
17303D17318J85204A28984i5837E03918G7226M14951c8391B97461a28931A34194
$$ 417318 602522 128984 -95837 503918 77226 492177 -38391 297461 -128931 134194
17292B38739J45657h2391c7259C0772P6692J81014j14398M3632E3747c579E2641
$$ 238739 384396 -82391 -37259 30772 107464 288478 174080 217712 53747 -3579 52641
17280C47385A18894b2294B56574A06524P6547b54224F9821j6442R7811h862C96177
$$ 347385 118894 -22294 256574 106524 183071 -254224 69821 53379 151190 -8862 396177
17268A72737k7065a61406D9393M27019a89253K8554B2682K8256N38750k22190
$$ 172737 145672 -161406 49393 476412 -189253 -160699 22682 50938 589688 367498
17258C67498a57896C88493j64461L5509C1057L29167a31151C15902n9887o2334
$$ 367498 -157896 388493 224032 259541 31057 360224 -131151 315902 256015 193681
17248A93681c107D15965j22406A13407J66097o6566M7663j16091l0754J51829
$$ 193681 -3107 415965 293559 113407 279504 212938 260601 144510 113756 265585
17238B65585G9412p164J73367j13379M4824A5724a53040A29504K83721J15455
$$ 265585 79412 72248 245615 132236 177060 15724 -153040 129504 413225 528680
17228E28680A95587J59101D5693J3986O22526A20773k9999N14450g2696A5280
$$ 528680 195587 354688 45693 59679 682205 120773 90774 605224 -72696 15280
17217B51111P5329j10555m6186n4653k2230J79196j479J72173I516J45365K82825
$$ 251111 326440 215885 169699 115046 92816 272012 270533 442706 9516 154881 437706
17206D37706A97608C0784R2811O769n2964M30574E5372J13927p3423K34461j45360
$$ 437706 197608 30784 123595 130364 77400 507974 55372 169299 95876 330337 184977
17195A84977L5442a5650A03667K14178k6697B8044Q5372j7530d2930B11040R2330
$$ 184977 220419 -15650 103667 317845 291148 28044 113416 95886 -42930 211040 303370
17184C03370r8389Q8256P9428p3591J65777j55472A48606D935J06835K93425N2755
$$ 303370 204981 293237 372665 299074 464851 309379 148606 4935 111770 405195 457950
17173D57950j66375c3085B2219K72507A12382e3604B26923r0149A0701L36940
$$ 457950 291575 -33085 22219 294726 112382 -53604 226923 136774 10701 347641
17163C47641d4594E45110b7526B60124M9155L94668B77502o1561n2970L78590
$$ 347641 -44594 545110 -27526 260124 309279 703947 277502 215941 162971 541561
17153E41561j89472O0077A08774L13636A64343d654E19836j29171q6980G8868
$$ 541561 352089 412166 108774 422410 164343 -4654 519836 390665 303685 78868
17142A56249R648O2199K36529J64651A45400M48968j30979Q5888B51746N6707
$$ 156249 165897 228096 464625 629276 145400 594368 463389 549277 251746 308453
17132C08453J14718A91345o22J98614j62757K78833A47693L13625K2736j03059
$$ 308453 423171 191345 190723 389337 226580 505413 147693 461318 484054 380995
17122C80995j79983K61857A80630J65209A60886M05261B76280j10920J88345J39070
$$ 380995 201012 462869 180630 345839 160886 566147 276280 165360 353705 492775
17112D92775j13869j46979K4690j10181d6646A68280J73518o024K40597M6984
$$ 492775 378906 231927 256617 146436 -46646 168280 341798 335774 576371 623355
17102F23355k85553A66860K37547p4985j58104R8209l2565M3481K02475m7707
$$ 623355 337802 166860 404407 329422 171318 269527 236962 280443 482918 435211
17092D35211o1838K51790j84741j10549j625J91289o3291k12358K17894A49521
$$ 435211 373373 625163 440422 329873 328248 519537 456246 243888 461782 149521
17081B45668O0009K55956j39279j0730J42725j13244M0498K72954C51490K25090
$$ 245668 305677 561633 422354 411624 554349 441105 481603 754557 351490 576580
17071E76580j67147K76490A78053G1128L06303k8664O7333K87451l29545j66967
$$ 576580 409433 685923 178053 71128 377431 348767 416100 703551 374006 207039
17061B07039N8245K65909k11045K77442P2569j20480k21911j60646L82400J58764
$$ 207039 265284 531193 320148 597590 670159 549679 327768 167122 549522 708286
17051G08286l9314j34480O2518k03903K89759B08777L87690j36058J67735k12780
$$ 708286 668972 534492 597010 393107 682866 208777 596467 460409 628144 415364
17041D15364J23174r9656j5000K65415o426k918J69913C42983L15959r3568K4447
$$ 415364 538538 438882 423882 689297 682871 679953 849866 342983 658942 565374 589821
17030E89821J18161l14524K36879J78304j39089o3896J1675Q3108J25580j46993
$$ 589821 707982 393458 630337 808641 669552 605656 617331 700439 826019 679026
17020F79026N7093k79864j10752N3606J96868J87919k62789K8434J62180J46067
$$ 679026 736119 456255 345503 399109 595977 783896 521107 549541 711721 857788
17010H57788k40345q4937J01870B63187J91742q0417K12365K36810k38056p8623
$$ 857788 617443 532506 634376 263187 454929 374512 586877 823687 585631 507008
17000E07008M03672q3365J9302n5410l04703J52768K26307m14071M88233R8971
$$ 507008 910680 827315 846617 791207 486504 639272 865579 451508 939741 1038712
16990A038712l33250m7325J39871j2644J64357k88826q0494L01469j02576m3540
$$ 1038712 705462 658137 798008 785364 949721 660895 580401 881870 779294 735754
16980G35754j39874L07215p7008j63576K38726p2261j26762J2018K30167j60762
$$ 735754 595880 903095 826087 662511 901237 828976 702214 714232 944399 783637
16970G83637M5440k7830J2062j7332K54304l31792K47474L5050l28486P4372o473
$$ 783637 829077 801247 813309 795977 1050281 718489 965963 1001013 672527 746899 740426
16959G40426L39451k17405K81221k9346m01293O65011l81258L2384J60854o6723
$$ 740426 1079877 862472 1143693 1114347 713054 1378065 996807 1029191 1190045 1123322
16949A123322P4045j60918M18632n48031J03927m4399J79768J12600r8232J08456
$$ 1123322 1197367 1036449 1455081 907050 1010977 966578 1146346 1258946 1160714 1269170
16939A269170j47236L7062L4008k05010n0449L93727m1552j68438j05319J95378
$$ 1269170 1121934 1158996 1193004 987994 937545 1331272 1289720 1121282 1015963 1211341
16929A211341m6735P2624R2183J9438l89483N95390m7161j9711J52818k36684
$$ 1211341 1164606 1237230 1329413 1348851 959368 1554758 1507597 1487886 1640704 1404020
16919A404020k35556P0670P6197K16300j94999r3140M46928j31135l13493L06006
$$ 1404020 1168464 1239134 1315331 1531631 1336632 1243492 1690420 1559285 1245792 1551798
16909A551798N8103j98064q3884M57564R9215j99644J39009n85767L67018J61377
$$ 1551798 1609901 1411837 1327953 1785517 1884732 1685088 1824097 1238330 1605348 1766725
16899A766725J42122n0102j93905K30742J4211j16576k4954J88853J54142k57167
$$ 1766725 1908847 1858745 1664840 1895582 1909793 1793217 1768263 1957116 2111258 1854091
16889A854091J13032k82454J74345K6630J98572k15649R575M42770k63297R3937
$$ 1854091 1967123 1684669 1859014 1885644 2084216 1868567 1878142 2320912 2057615 2151552
16879B151552K61714m88449J24800L02628j43773k40518K15718J4578P636K69607
$$ 2151552 2413266 1924817 2049617 2352245 2208472 1967954 2183672 2198250 2205886 2475493
16869B475493N1829k03137M35028l1421J2771j41893k19220M86138l39778o0976
$$ 2475493 2527322 2324185 2759213 2727792 2740563 2598670 2379450 2865588 2525810 2464834
16859B464834J61204J5031K06420M14791m76545J16685j95072M47356j72283L87727
$$ 2464834 2626038 2641069 2847489 3262280 2785735 2902420 2707348 3154704 2982421 3370148
16849C370148l12112L45301j20186j41231K47211J19153l05077M36531m129L48329
$$ 3370148 3058036 3403337 3283151 3141920 3389131 3508284 3203207 3639738 3635609 3983938
16839C983938R928k14318J78214N9238j00625J25134k0124J85477o6872J02910
$$ 3983938 3993866 3779548 3957762 4017000 3916375 4041509 4021385 4206862 4139990 4242900
16829D242900M4751Q4295K4M98047j01908J38433K1682p3533K74856r2342K48964
$$ 4242900 4287651 4371946 4371970 4870017 4768109 4906542 4928224 4854691 5129547 5037205 5286169
16818E286169N01893l13406J07630k75K01985J48689m8426K22469N41905q1302
$$ 5286169 5788062 5474656 5582286 5582011 5783996 5932685 5884259 6106728 6648633 6567331
16808F567331j42658M32084L25545M3248K00266J58345K5171R4810O31665L17829
$$ 6567331 6424673 6856757 7182302 7225550 7425816 7584161 7609332 7704142 8335807 8653636
16798H653636m31390L29390J72242L86679M6749L05704K16313K1427R43449L5887
$$ 8653636 8222246 8551636 8723878 9110557 9157306 9463010 9679323 9700750 10644199 10680086
16788A0680086n0749N22240P1520M68095O2391O28102L51373N48849K35746K63564
$$ 10680086 10629337 11151577 11223097 11691192 11753583 12381685 12733058 13281907 13517653 13781217
16778A3781217N70429M47771L33215P93689K63017N56324O50558L10327P38125
$$ 13781217 14351646 14799417 15132632 15926321 16189338 16745662 17396220 17706547 18444672
16769A8444672P76308R65363L48383R46347Q65275O58319J049109Q91169R03628
$$ 18444672 19220980 20186343 20534726 21481073 22346348 23004667 24053776 24944945 25848573
16760B5848573J494577J064229O91361J463202J397002J515347J710189J290458
$$ 25848573 27343150 28407379 29098740 30561942 31958944 33474291 35184480 36474938
16752C6474938J724873J796271J995583J787625K297472K052323L211885K714751
$$ 36474938 38199811 39996082 41991665 43779290 46076762 48129085 51340970 54055721
16744E4055721K643539K856872L583123L353978L957152L886212M436942M271126
$$ 54055721 56699260 59556132 63139255 66493233 70450385 74336597 78773539 83044665
16736H3044665M791768M988688N381599N301366O408379N817539O170971O516618
$$ 83044665 87836433 92825121 98206720 103508086 109916465 115734004 121904975 128421593
16728A28421593O384527O312949O197110N642724N890357M733514M352890L093745
$$ 128421593 134806120 141119069 147316179 152958903 158849260 163582774 167935664 171029409
16720A71029409K574171J422854M50616p39102j493244k963559l496691m293494
$$ 171029409 173603580 175026434 175477050 174737948 173244704 170281145 166784454 162490960
16712A62490960n557252n610114o040606o325210o388043o471358o569912o597801
$$ 162490960 156933708 151323594 145282988 138957778 132569735 126098377 119528465 112930664
16704A12930664n783623n660425n936515n097738n182025m406235m629501m474271
$$ 112930664 107147041 101486616 95550101 90452363 85270338 80864103 76234602 71760331
16696G1760331l677156m006185l258141l582759k952886k746311k413306k292151
$$ 71760331 68083175 64076990 60818849 57236090 54283204 51536893 49123587 46831436
16688D6831436k906707j704083k028571j950775j952809j806789j244968j292494
$$ 46831436 43924729 42220646 40192075 38241300 36288491 34481702 33236734 31944240
16680C1944240j650231j055197j379052j350808j019255m97663j413036r77722
$$ 31944240 30294009 29238812 27859760 26508952 25489697 24992034 23578998 22601276
16672B2601276n16414r15118r18978n43043q82481m85553n80420o62245n59224
$$ 22601276 22084862 21169744 20250766 19707723 18825242 18339689 17759269 17097024 16537800
16663A6537800r11552k54877p86884p3170q47899j71874l09844p30251j47719
$$ 16537800 15626248 15371371 14584487 14511317 13663418 13491544 13181700 12451449 12303730
16654A2303730l40548o25084l46123P411o98125j6651m05463k178J12760r87015
$$ 12303730 11963182 11338098 10991975 10999386 10301261 10284610 9879147 9876969 9989729 9002714
16644I002714J72616l80753k71244m9107n86505j33426j76305L307k97662j00717
$$ 9002714 9175330 8794577 8523333 8474226 7887721 7754295 7577990 7581297 7283635 7182918
16634G182918l1675n43179j39p945l06991m12749j87607K74070n1029J00543m74740
$$ 7182918 7151243 6608064 6607925 6599980 6292989 5880240 5692633 5966703 5915674 6016217 5541477
16623E541477j05776l14231L1008K6046k58509J62091m9794l12771j49680m8519
$$ 5541477 5435701 5121470 5152478 5178524 4920015 5082106 5032312 4719541 4569861 4521342
16613D521342K9737k59511l16791J00868m9048K24146k40034m60198O36595m51250
$$ 4521342 4551079 4291568 3974777 4075645 4026597 4250743 4010709 3550511 4187106 3735856
16603C735856k6911K56362k41758l08797m7001J05648k72040O7828K38146j20591
$$ 3735856 3708945 3965307 3723549 3414752 3367751 3473399 3201359 3269187 3507333 3386742
16593C386742q5527j26613N9454m73163k27483M10160Q0260m00706L79240n53952
$$ 3386742 3301215 3174602 3234056 2760893 2533410 2943570 3023830 2623124 3002364 2448412
16583B448412L32805j40135j06806J21815m8333l67080J89898k82753L25434k43031
$$ 2448412 2781217 2641082 2534276 2656091 2607758 2240678 2430576 2147823 2473257 2230226
16573B230226K05076r6323k03634k69268N63255m50061Q1245J56366N2067l60901
$$ 2230226 2435302 2338979 2135345 1866077 2429332 1979271 2060516 2216882 2268949 1908048
16563A908048K7313K53563l40205j85547L96464l87242j7950n5087L31924k58703
$$ 1908048 1935361 2188924 1848719 1663172 2059636 1672394 1654444 1599357 1931281 1672578
16553A672578J2829J61892O0046j58327m2874k32403K00321j08111K18063j39478
$$ 1672578 1685407 1847299 1907345 1749018 1706144 1473741 1674062 1565951 1784014 1644536
16543A644536J28884l03149L29633o4043k96270j49144K12735L38906k82958L4171
$$ 1644536 1773420 1470271 1799904 1735861 1439591 1290447 1503182 1842088 1559130 1593301
16533A593301l1662r7209k3546n25754M73667k04905J16337J0519q2455q3902
$$ 1593301 1561639 1464430 1440884 915130 1388797 1183892 1300229 1310748 1228293 1144391
16523A144391k62613L37123M165R40k16301K06878j03807j52381M5630P9223N1012
$$ 1144391 881778 1218901 1223066 1224006 1007705 1214583 1110776 958395 1004025 1083248 1134260
16512A134260j65450m3073J50282K24842k20194M228j68868K09367J06862k44968
$$ 1134260 968810 925737 1076019 1300861 1080667 1084895 916027 1125394 1232256 987288
16502I87288p4951q7198M7349O8797J57948l83954J16852J1972p1262M6889P9467
$$ 987288 912337 825139 872488 941285 1099233 715279 832131 844103 772841 819730 899197
16491H99197J16825q6211R2240l81292K39314m155q6251Q2797j96852J08651j17767
$$ 899197 1016022 929811 1022051 640759 880073 875918 789667 872464 675612 784263 666496
16480F66496k69469K52641K58932k20731J86613l21126K89650j10675R412j76891
$$ 666496 397027 649668 908600 687869 874482 553356 843006 732331 741743 564852
16470E64852M06176k71479J75350k41089k04250K58481k2869L7442o7008o5469
$$ 564852 971028 699549 874899 633810 429560 688041 665172 702614 635606 570137
16460E70137K82262D09675J63463j577L06581k21130J25239J22787j56724p7944
$$ 570137 852399 409675 573138 571561 878142 657012 782251 905038 748314 670370
16450F70370j42044K80455B64757K53734M1470M2993p4943J54806j60912B28527
$$ 670370 528326 808781 264757 518491 559961 602954 528011 682817 521905 228527
16439E65405j5654K86245k51312N5433A64486N32382j44266j42817A66949J36820
$$ 565405 549751 835996 584684 640117 164486 696868 552602 409785 166949 303769
16429C03769M25075p6071k03253J36484L9991k76040O5243Q0858j19719P3730
$$ 303769 728844 652773 449520 586004 625995 349955 415198 496056 376337 450067
16419D50067N7383O7996k54855r7244K03377l1409L15248j66199A87736L10400
$$ 450067 507450 575446 320591 223347 426724 395315 710563 544364 187736 498136
16409D98136k7179j30148A53815K9094E1021M97475k1928n5407j53546J50641
$$ 498136 470957 340809 153815 182909 51021 548496 526568 471161 317615 468256
16399D68256B25874O280K7130J43446E9547M30573o2071J00607k28997l9696k0743
$$ 468256 225874 232154 259284 402730 59547 490120 428049 528656 299659 259963 239220
16388B39220J41259K88032A63734M08992k82929f0925B31686l709Q1748R0481
$$ 239220 380479 668511 163734 572726 289797 -60925 231686 227977 309725 400206
16378D00206r3194j31393K29891j08529Q8951A70919Q2541J28604l5255J27468
$$ 400206 307012 175619 405510 296981 385932 170919 253460 382064 346809 474277
16368D74277q1298A47719L09308A40433P5150K39488A38941M4629K14601j55854
$$ 474277 392979 147719 457027 140433 215583 455071 138941 183570 398171 242317
16358B42317B8811e5457D2345M4437N29004B90785K36386H4459C4150Q1329J16862
$$ 242317 28811 -55457 42345 86782 615786 290785 527171 84459 34150 115479 232341
16347B32341L3608C8508K02001N49j08857E4533R6216P0433J17890A64133J12341
$$ 232341 265949 38508 240509 241058 132201 54533 150749 221182 339072 164133 276474
16336B76474k701D357K39281L8859K5620j7667P4164I1713J28140m6881p2887
$$ 276474 273773 4357 243638 282497 308117 290450 364614 91713 219853 172972 100085
16325A00085J57620l8697o9083J93396L4270o0551L06991A34487a66762B26199
$$ 100085 257705 219008 149925 343321 377591 317040 624031 134487 -166762 226199
16314A6436a72388A33620M0317D1474j897K36719H6772N08883B65318J84950c4221
$$ 16436 -172388 133620 173937 41474 39577 276296 86772 595655 265318 450268 -34221
16302c5017A97241K64740J3114j32740M156c17911A91736a01565B56614J39619
$$ -35017 197241 461981 475095 342355 346511 -317911 191736 -101565 256614 396233
16292C96233a5756B80428F778K43669j0331L6244m865H7280O7436d9440B98765
$$ 396233 -15756 280428 6778 250447 240116 276360 271495 87280 154716 -49440 298765
16280C73799m0376j49363m5538E7310J31530A6561K73372l2658C1558M0803J04895
$$ 373799 333423 184060 138522 57310 188840 16561 289933 257275 31558 72361 177256
16269A77256q0944g7467K7295B21051r9807Q8099G615K17495Q0684n1563E7109
$$ 177256 96312 -77467 -50172 221051 121244 209343 7615 225110 305794 254231 57109
16257A30358J15782n18K275R3504q4963H7182i0870K0621A32543g8493A9277K20909
$$ 130358 246140 245622 247897 341401 256438 87182 -90870 -70249 132543 -78493 19277 240186
16245B40186b2700B10895A2515L28452k1579A7282K35342b12429A72034O3682
$$ 240186 -22700 210895 12515 340967 319388 17282 252624 -212429 172034 235716
16235B35716K83349a44246A18417J86127j30784q0343a94651K5151A95720J09229
$$ 235716 519065 -144246 118417 304544 173760 93417 -194651 -169500 195720 304949
16225C04949J08119d4017D3632J24716M0881a250C47165A29817c0286A87328J99501
$$ 304949 413068 -44017 43632 168348 209229 -1250 347165 129817 -30286 187328 386829
16214C86829A14675a6541I2709C7842R5738M25917B35559D5567K7078b61268B21495
$$ 386829 114675 -16541 92709 37842 133580 559497 235559 45567 72645 -261268 221495
16202f6440j60125L5909R3155I1240L9861c3049q5294l5724A27593n428J05941
$$ -66440 -226565 -190656 -97501 91240 131101 -33049 -118343 -154067 127593 122165 228106
16191B28106a12267B7126K84165a91416F4250k1388b1697I125a64971A31808d4941
$$ 228106 -112267 27126 311291 -191416 64250 42862 -21697 9125 -164971 131808 -44941
16179b90869B15219k3659B4416J85349c04509h7335B26825b9274m3247Q123j75988
$$ -290869 215219 191560 24416 209765 -304509 -87335 226825 -29274 -72521 -64398 -240386
16168b40386E9830a63241E1429O0834c1705o4798A17236a09931A77218L8763I3551
$$ -240386 59830 -163241 51429 112263 -31705 -96503 117236 -109931 177218 215981 93551
16156e7540F6350a00081A59265j993a25679d4845C3996a00890o6437g5828A99013
$$ -57540 66350 -100081 159265 157272 -125679 -44845 33996 -100890 -167327 -75828 199013
16144A79606f9461c608A28413l2369i6131C12987B1329P386O5229e7444B31943
$$ 179606 -69461 -3608 128413 96044 -96131 312987 21329 28715 93944 -57444 231943
16132A31859D9258P5351f8981D4024L24949B8823J61807O8073b42140A23127b18862
$$ 131859 49258 124609 -68981 44024 368973 28823 190630 258703 -242140 123127 -218862
16120b3395j05711o3100p2265E090h9003l11065G9715a6143l1133A72604f4850
$$ -23395 -129106 -192206 -264471 5090 -89003 -400068 79715 -16143 -47276 172604 -64850
16108a49605j86040O5169D08554g2120b3275C16613e7153P128f17G0280f2691
$$ -149605 -335645 -270476 408554 -72120 -23275 316613 -57153 -50025 -617 70280 -62691
16096B50798A07995d8040A36654P6775D0017n81K95519b57647A46780h1847k45308
$$ 250798 107995 -48040 136654 213429 40017 39436 334955 -257647 146780 -81847 -327155
16085c27155j4131e5977B33268J48546a3608L313c184D9451j0248a47885B9996
$$ -327155 -341286 -55977 233268 381814 -13608 -10295 -3184 49451 39203 -147885 29996
16073c58140D73851A20837k1094D6496a07962A50620J32005J1729a63678o1324
$$ -358140 473851 120837 99743 46496 -107962 150620 282625 294354 -163678 -225002
16063b25002j0082B35272N5971b42657B6303J70366b57188b5888A59880P0622
$$ -225002 -235084 235272 291243 -242657 26303 196669 -257188 -25888 159880 230502
16053B30502E8338h9855B25868a68045b0547B29133d4493B3455m006b47899c7372
$$ 230502 58338 -89855 225868 -168045 -20547 229133 -44493 23455 19449 -247899 -37372
16041A66386b998B55849b0699B3552a81480L587P9774I7515a41033B37311a06371
$$ 166386 -2998 255849 -20699 23552 -181480 -177893 -98119 97515 -141033 237311 -106371
16029A05939a90610A30945N9190H5733i0392B1214J27345a65472j12421f3392
$$ 105939 -190610 130945 190135 85733 -90392 21214 148559 -165472 -277893 -63392
16018a210l92164f3422C14273o4740b45591G0101B4176J18192f4241A90605B0163
$$ -1210 -393374 -63422 314273 249533 -245591 70101 24176 142368 -64241 190605 20163
16006f2333n5196A40121c8218j44852a12E7664a32276A62809a6892o1142G6307
$$ -62333 -117529 140121 -38218 -183070 -112 57664 -132276 162809 -16892 -78034 76307
15994I2290a0496j787F3558H819P2042J50543j12015c00739B49947A23226K3246
$$ 92290 -10496 -12283 63558 8819 80861 231404 119389 -300739 249947 123226 146472
15983A46472K89929E6056L74869k0258A44148K998g6263d794j55534O4980B5933
$$ 146472 436401 56056 430925 410667 144148 147146 -76263 -4794 -160328 -95348 25933
15971d3116j10979N1419j50351G3517b16487f2902j39317d2705I5374J85145I8829
$$ -43116 -154095 -102676 -253027 73517 -216487 -62902 -202219 -42705 95374 280519 98829
15959b1306k40059d856o356H484a53832A74875J64388C2754J68376p435a23425
$$ -21306 -261365 -4856 -11212 8484 -153832 174875 339263 32754 201130 193695 -123425
15947g8417F708J0460f0779A73693L1356k0992B5252J3539J897b76531N9913G2856
$$ -78417 6708 17168 -60779 173693 205049 184057 25252 38791 40688 -276531 -216618 72856
15934a29916F7547b52873N5464p7438G1483N6448K6739G0099c34128R3127B91328
$$ -129916 67547 -252873 -197409 -274847 71483 127931 154670 70099 -334128 -241001 291328
15922b60585e8606H079d9407n7071j98663A75037h4486A6540i320l06500M2893
$$ -260585 -58606 8079 -49407 -106478 -305141 175037 -84486 16540 -9320 -315820 -272927
15911b72927q9865h2320j5520E2818b16859h3558c0416n0647B8366a47216B45898
$$ -272927 -362792 -82320 -97840 52818 -216859 -83558 -30416 -81063 28366 -147216 245898
15899a33223A75545a48202I6869c74840C7492d5283r7915j15035h1999k4232J5175
$$ -133223 175545 -148202 96869 -374840 37492 -45283 -143198 -258233 -81999 -106231 -91056
15888i1056r533d9710l315C7830i4628b1640j06104H1803b72126L961i4735g851
$$ -91056 -100589 -49710 -53025 37830 -94628 -21640 -127744 81803 -272126 -268165 -94735 -7851
15875a0183j35463A87780d2773A66043F6380d8005Q488k8011m2973B3634K41765
$$ -10183 -145646 187780 -42773 166043 66380 -48005 -39517 -67528 -110501 23634 265399
15864B65399a65011B9397a30752N4218L0673A81501H8182c82080A38657a62014
$$ 265399 -165011 29397 -130752 -76534 -45861 181501 88182 -382080 138657 -162014
15853B44427p3008c41749m111C9722J66575e3055D3079L52674a90890h0680k21191
$$ 244427 171419 -341749 -345860 39722 206297 -53055 43079 395753 -190890 -80680 -301871
15842c01871J38397E8178c7170p8268N1594B27126a62277A29885J4434l1274h0659
$$ -301871 -163474 58178 -37170 -115438 -63844 227126 -162277 129885 144319 113045 -80659
15830B56393I3654b89934A07117b00383b9753k2968B64968H3464C6931i1025C23342
$$ 256393 93654 -289934 107117 -200383 -29753 -52721 264968 83464 36931 -91025 323342
15818a32316A84541a55632K6063j37343L5989d6851p2225a2248H8715B0748L67366
$$ -132316 184541 -155632 -129569 -266912 -230923 -46851 -119076 -12248 88715 20748 388114
15807C88114e2367C8625b20126K7521Q2480A11382a32296B28874C7350a96479
$$ 388114 -52367 38625 -220126 -192605 -110125 111382 -132296 228874 37350 -196479
15796C7678b64186D7063d18596A19013D1328J36274K61045G0623b17458G213a08466
$$ 37678 -264186 47063 -418596 119013 41328 177602 438647 70623 -217458 7213 -108466
15784d02972J78936m9473L0960b3461A26915b62221a0871B48655a98841C74030
$$ -402972 -224036 -273509 -242549 -23461 126915 -262221 -10871 248655 -198841 374030
15773a54807j09607h5837A43948a06078a9217R540j61605p2323A37032b00576
$$ -154807 -264414 -85837 143948 -106078 -19217 -9677 -171282 -243605 137032 -200576
15762B8524B382M23691a75729P7330j44397I5844g0048A18845J86053p3823a98690
$$ 28524 2382 426073 -175729 -98399 -242796 95844 -70048 118845 304898 231075 -198690
15750b7080C9419a77433C9868c22777A37603h7571C4245g6277L7801l7879j51357
$$ -27080 39419 -177433 39868 -322777 137603 -87571 34245 -76277 -38476 -76355 -227712
15739b27712A21960J81832a30506j23323F4870J19731b42083a13003m16608a5013
$$ -227712 121960 303792 -130506 -253829 64870 184601 -242083 -113003 -529611 -15013
15728c71165f3802l1129q9318g4736b3805A6056J19576J16270r2646d8303A0475
$$ -371165 -63802 -94931 -184249 -74736 -23805 16056 135632 251902 159256 -48303 10475
15716C28152c13444A87172e2439A76926c0394j93671A6537b20192B54854A14056
$$ 328152 -313444 187172 -52439 176926 -30394 -224065 16537 -220192 254854 114056
15705a2982p5103F7547B9240h2743j48311B66504b44581i4023a4051E6532b56406
$$ -12982 -88085 67547 29240 -82743 -231054 266504 -244581 -94023 -14051 56532 -256406
15693C31898j33859o4232O0681K9477j05067N8234a50524J5735O4814A05559b04817
$$ 331898 198039 133807 194488 223965 118898 177132 -150524 -134789 -69975 105559 -204817
15681b12926A25636m1247a7958j56764I206a9453C38443B1799a16240d266o3589
$$ -212926 125636 84389 -17958 -174722 9206 -19453 338443 21799 -116240 -4266 -67855
15670f7855p6449F40936B21158j09697L0198C7655P8684c48498o2735J92194j50420
$$ -67855 -144304 640936 221158 111461 141659 37655 116339 -348498 -411233 -219039 -369459
15659c69459D38286g6302A14953K28848i2515j07634j9372h68C4974J7570c20153
$$ -369459 438286 -76302 114953 343801 -92515 -200149 -219521 -868 34974 52544 -320153
15647F0347a84754A18910P9494b71513J12145O5221B1762f0094j80706m7540M8285
$$ 60347 -184754 118910 198404 -271513 -159368 -94147 21762 -60094 -240800 -288340 -240055
15636b40055J9616A28478b97111I5754K82163a9070E3268L61482j79380A7432
$$ -240055 -220439 128478 -297111 95754 377917 -19070 53268 414750 235370 17432
15625I147N3543a36151A80583q7886J08269C6915b00138k3009e3447j11831l40119
$$ 9147 62690 -136151 180583 92697 200966 36915 -200138 -223147 -53447 -165278 -505397
15614e05397B10210c1224k75974R0038J04973k39801F3866M2390b40776A5992
$$ -505397 210210 -31224 -307198 -217160 -112187 -351988 63866 106256 -240776 15992
15603a37700A06759i8465p9719A11641a75719K4084F1706K77259j44782c78399
$$ -137700 106759 -98465 -178184 111641 -175719 -151635 61706 338965 194183 -378399
15592B60617b7018q966G8529b09963C273g2825A09267b55789C68353m5735r8835
$$ 260617 -27018 -35984 78529 -209963 3273 -72825 109267 -255789 368353 322618 223783
15581B23783b1913G7532b66895e0577B23267a73786K4172G9300K465Q3535a95385
$$ 223783 -21913 77532 -266895 -50577 223267 -173786 -149614 79300 81765 165300 -195385
15569A34665l4422b27949a1783l1634l61028a64870A5550J58660b01656j43926
$$ 134665 100243 -227949 -11783 -43417 -404445 -164870 15550 174210 -201656 -345582
15559c45582d2976K1222I6841L7434a64659j26255D2846b6916A03948l6376Q9011
$$ -345582 -42976 -21754 96841 134275 -164659 -290914 42846 -26916 103948 67572 156583
15548A56583a7902j45223b9887A95570l6964a75227K6377c5707j42693A96732
$$ 156583 -17902 -163125 -29887 195570 158606 -175227 -148850 -35707 -178400 196732
15537c9154o2183A77859a8421A98815J60525a18571A21883a68046I0902J25161
$$ -39154 -101337 177859 -18421 198815 359340 -118571 121883 -168046 90902 216063
15527B16063e5800J5016E9600c18043A29523e6655k7899A05252f5360G1286D94
$$ 216063 -55800 -40784 59600 -318043 129523 -56655 -84554 105252 -65360 71286 494
15515b53284B59453m3084b8572a1184k57255g8530C34807b22347E9388J01117
$$ -253284 259453 216369 -28572 -11184 -268439 -78530 334807 -222347 59388 160505
15505A60505a82274F3715a41228A2707J2977a36581j24262b2791A90084j0937
$$ 160505 -182274 63715 -141228 12707 25684 -136581 -260843 -22791 190084 179147
15495A79147c62717f6432a0607B2084M3915Q3654E8884E734a0873B9939K5032
$$ 179147 -362717 -66432 -10607 22084 65999 149653 58884 5734 -10873 29939 54971
15484E4971a54297B16654g7124P216L4145k07102B8913R8808h823d241m8148j34342
$$ 54971 -154297 216654 -77124 -69908 -35763 -242865 28913 127721 -8823 -4241 -52389 -186731
15472a86731D96845j89459A09350b06346A83560P0493b50421B8933a10734E3683
$$ -186731 496845 307386 109350 -206346 183560 254053 -250421 28933 -110734 53683
15461a19226C9910J19446f7582J6776B21894j05743E356L6650K83656a01734A54851
$$ -119226 39910 159356 -67582 -50806 221894 116151 5356 42006 325662 -101734 154851
15449C38357A913f9455o2838P701E8899J71188f6186B11219h0734A57453e4950
$$ 338357 1913 -69455 -132293 -124592 58899 230087 -66186 211219 -80734 157453 -54950
15437c822j35085e2933A57656P8188I9669a63714k8356D05709a43241N7870k60801
$$ -3822 -138907 -52933 157656 235844 99669 -163714 -192070 405709 -143241 -85371 -346172
15426c46172C89376b83252a4156A14202D7905J18344O7455a52273o398c3917B02033
$$ -346172 389376 -283252 -14156 114202 47905 166249 233704 -152273 -158671 -33917 202033
15414a56834E0285b7000H3969K5713b83722B61692c53242A3521J9828a19629j0541
$$ -156834 50285 -27000 83969 109682 -283722 261692 -353242 13521 33349 -119629 -130170
15403a30170A86234b59745O9431A04048b98890J41142b134j05122b3868B36178
$$ -130170 186234 -259745 -190314 104048 -298890 -157748 -2134 -107256 -23868 236178
15392B39290d835l3107n1692I4099a55196a8775j3812A85502a00711C15358h1203
$$ 239290 -4835 -37942 -89634 94099 -155196 -18775 -32587 185502 -100711 315358 -81203
15380c25064c652B637c63557B39244b63427c2268J67Q252k18819H2770a34741
$$ -325064 -3652 2637 -363557 239244 -263427 -32268 -32101 -23849 -242668 82770 -134741
15368H8803F158O1432J15319q8859l3634O2556j5977i1298D70274A45443E2841
$$ 88803 6158 67590 182909 94050 60416 122972 106995 -91298 470274 145443 52841
15356A80068a23268e4100o5265A0265N2130P0226N3237A7145a60306O0149j7902
$$ 180068 -123268 -54100 -119365 10265 62395 132621 185858 17145 -160306 -100157 -118059
15345a18059j52103G941M2939A2129a04253a4494j12923F404d8059n7950j40277
$$ -118059 -270162 7941 50880 12129 -104253 -14494 -127417 6404 -48059 -106009 -246286
15334b46286H0498J38709f8503D3745a35276r9811L1478Q6155B78588A21535b93963
$$ -246286 80498 219207 -68503 43745 -135276 -235087 -203609 -117454 278588 121535 -293963
15322C02528I9873K09823g7844G9958a14742A13741J65515J42135i5125j92820
$$ 302528 99873 309696 -77844 79958 -114742 113741 279256 421391 -95125 -287945
15312b87945B10267b01788Q7301A03881b77687J02277A87943F1158f930I152J03230
$$ -287945 210267 -201788 -114487 103881 -277687 -175410 187943 61158 -6930 9152 112382
15301A12382a00857B83444A07266a93451A26044o304a63009B52874F9031e2334
$$ 112382 -100857 283444 107266 -193451 126044 119740 -163009 252874 69031 -52334
15290a86558B9761J1977I170O6912a98422E8730J63194g1682A41123K4473K3351
$$ -186558 29761 41738 9170 76082 -198422 58730 221924 -71682 141123 165596 188947
15279A88947I845L57965i7068B76860p1649I2437f8094j74039f6344A94655a9952
$$ 188947 9845 367810 -97068 276860 205211 92437 -68094 -242133 -66344 194655 -19952
15267A14861a25224A67512J22430A08869J97469F0276e23658C13630b48252k4423
$$ 114861 -125224 167512 289942 108869 306338 60276 -523658 313630 -248252 -272675
15257b72675A17842l7737K23862d5701B91462K37958B2455L41997K51949L93357
$$ -272675 117842 80105 303967 -45701 291462 529420 22455 364452 616401 1009758
15247A009758K30737k02563K56440k88425D01393j74894h4095c5860r5952K4920
$$ 1009758 1240495 1037932 1294372 1005947 401393 226499 -84095 -35860 -131812 -106892
15237a06892j65957a4572A28025J3453M3436a23277C03804a5600j33005N0723
$$ -106892 -272849 -14572 128025 141478 184914 -123277 303804 -15600 -148605 -97882
15227i7882A59224D9031K39540c05608d6444c627A63528Q2040E1461a16327j0384
$$ -97882 159224 49031 288571 -305608 -46444 -3627 163528 245568 51461 -116327 -126711
15216a26711C18856D8300C244b23396B22977B1537b83231A02663C0086a14404
$$ -126711 318856 48300 3244 -223396 222977 21537 -283231 102663 30086 -114404
15205a42419B9387R9066e4837i46H4628L27200q2573K9559C5504Q4793J90014
$$ -142419 29387 128453 -54837 -946 84628 411828 329255 358814 35504 120297 310311
15194C10311d0009I3620J00429n003l1698R9350a2880C69811E7997J49691b9504
$$ 310311 -40009 93620 194049 189046 157348 256698 -12880 369811 57997 207688 -29504
15182C1324J67042n2881o5730k0708q850K74642a4283j17801A63496a68311j9482
$$ 31324 198366 145485 79755 59047 50197 324839 -14283 -132084 163496 -168311 -187793
15171a87793H766Q7327c1057B00716e34j20812D1072i0405j58929A0190J16219
$$ -187793 8766 96093 -31057 200716 -534 -121346 41072 -90405 -249334 10190 126409
15160A26409j0622C9283Q4466K8113J41324j16522f3239A56470d296C3344J92736
$$ 126409 115787 39283 123749 151862 293186 176664 -63239 156470 -4296 33344 226080
15149B26080d2250C29115a86070B35865K36691B11769o6576J4249a82529q1187
$$ 226080 -42250 329115 -186070 235865 472556 211769 145193 159442 -182529 -263716
15139b63716g3804a9824j63639A37970n4186J67295L259K6106G4486b1661r7078
$$ -263716 -73804 -19824 -183463 137970 83784 251079 254338 280444 74486 -21661 -118739
15128a18739C67220H8639K45449g7392F076P3883J22256E9368i1725p0560A12546
$$ -118739 367220 88639 334088 -77392 6076 79959 202215 59368 -91725 -162285 112546
15116A06823M5426n4357R5528k385j0572a49820A85551J37840J16015g5560A79694
$$ 106823 152249 97892 193420 191035 180463 -149820 185551 323391 439406 -75560 179694
15104G1986C5233P9981R0690D1505b75994O3326G2182J17555Q2587g3936B9574
$$ 71986 35233 115214 205904 41505 -275994 -212668 72182 189737 272324 -73936 29574
15092A35341k9478O0821F0831J93965E9755A366e0162A54938J42138j34065b92124
$$ 135341 105863 166684 60831 254796 59755 1366 -50162 154938 297076 163011 -292124
15080A69022d1906I24M70775j26404c5311j5687B00915J3222m1748K5221D3851
$$ 169022 -41906 924 471699 345295 -35311 -50998 200915 214137 172389 197610 43851
15068E1052N9925l2962J32121q9634I075K12017i6964A7260f6999B03011J73017
$$ 51052 110977 78015 210136 120502 9075 221092 -96964 17260 -66999 203011 376028
15057C76028r5774J30654N0761N1079a36935g581A87610L9486D9695J21493a78226
$$ 376028 280254 410908 461669 512748 -136935 -7581 187610 227096 49695 171188 -178226
15045B33254N5072l0152E1355L55024D6562l751b0808m5309K0995B75435h870
$$ 233254 288326 258174 51355 406379 46562 42811 -20808 -66117 -45122 275435 -8870
15033C46742i3053D1838J55674H1356r235J95658K36082A98909O4558F1683K35432
$$ 346742 -93053 41838 197512 81356 72121 267779 503861 198909 263467 61683 297115
15022B97115E8299J69578M5147r2607F0930R9700K11962a3828B45049D5338L5091
$$ 297115 58299 227877 273024 180417 60930 160630 372592 -13828 245049 45338 80429
15011H0429b57929B05276m7648R3880I8123a06319A62654L8517m1201K72340A5988
$$ 80429 -257929 205276 157628 251508 98123 -106319 162654 201171 159970 432310 15988
14999B77013k6153J93058A27112J24683j0737C7452K10047I0730J73680M479J64753
$$ 277013 250860 443918 127112 251795 241058 37452 247499 90730 264410 268889 433642
14988D33642A18109e5226B48840g559C7890K91643j06935P432b3652D84836k17372
$$ 433642 118109 -55226 248840 -7559 37890 329533 222598 230030 -23652 484836 267464
14977B67464R2390r949A49239b36421D2591K86128j21076e8791B34490F9355f4285
$$ 267464 359854 349905 149239 -236421 42591 328719 207643 -58791 234490 69355 -64285
14965A20320L37811A04007Q0768c2976A65105M14742B12841F3757L740i1830E64723
$$ 120320 458131 104007 184775 -32976 165105 579847 212841 63757 67497 -91830 564723
14953B87806K7957j55501k0918F9580i6729A52124J34793N142A17351M0825G6622
$$ 287806 315763 160262 139344 69580 -96729 152124 286917 292059 117351 158176 76622
14941D76893c1275C62536J36991B15094p0242J61740A19841J14232O0762m1423
$$ 476893 -31275 362536 499527 215094 144852 306592 119841 234073 294835 253412
14931B53412J68234j37371M1399p0971H5975i163C46459m6733k6987r648I7733
$$ 253412 421646 284275 325674 254703 85975 -9163 346459 299726 272739 263091 97733
14919C06429A51703N1664N5163E4635K66018j29667M1090M8182o3228J72191Q3282
$$ 306429 151703 203367 258530 54635 320653 190986 232076 280258 217030 389221 472503
14908D72503j22408L5116j7068A83458o0228j4086K79250j61397l8114M1549K41566
$$ 472503 350095 385211 368143 183458 123230 109144 388394 226997 188883 230432 471998
14897D71998N0426k50419q7515J32910C9681K45439J58205o0120k1048N0287k01621
$$ 471998 522424 272005 184490 317400 39681 285120 443325 383205 362157 412444 210823
14886B10823J68233A67305R4797Q0202q9793J20643P1551o5197K7276j51500L8409
$$ 210823 379056 167305 262102 342304 252511 373154 444705 379508 406784 255284 293693
14875B93693g7971D59999A56671O784K94016J39533k63851K34062B43794m3414
$$ 293693 -77971 459999 156671 163455 457471 597004 333153 567215 243794 200380
14865B00380p7672J88872j23449O04024C42087J34212j29363J19136L11556A69724
$$ 200380 122708 311580 188131 792155 342087 476299 346936 466072 777628 169724
14854B15538L46343p1127j17045p4737K04226k2100N6755k06119j48143L12604
$$ 215538 561881 490754 373709 298972 503198 481098 537853 331734 183591 496195
14844D96195K3901r0302p9396A62740L93975B09133J19483K91860j28004j73249
$$ 496195 520096 429794 350398 162740 556715 209133 328616 620476 492472 319223
14834C19223K14711k13571N2801J58618G2143J70120N7636J48944B1361L61925
$$ 319223 533934 320363 373164 531782 72143 242263 299899 448843 21361 383286
14824C83286P996j57308M98510C27545K01707j39450j3125A69479L02801J92246
$$ 383286 391282 233974 732484 327545 529252 389802 376677 169479 472280 664526
14814F64526C05810K43157k497k20498K56291j1666J16388j26933j85909K61486
$$ 664526 305810 548967 546470 325972 582263 570597 686985 560052 374143 635629
14804F35629j49915j78838M76622l64224L62316l62718q0931J93568n346J10611
$$ 635629 485714 306876 783498 419274 781590 418872 337941 531509 526163 636774
14794F36774j30298L9112B67243L72148k63176L83596B98735N56661l59120o8856
$$ 636774 506476 545588 267243 639391 376215 759811 298735 855396 496276 427420
14784D27420k9874R5228J06379Q7497j6300j93434M6140J44034k53219P1342m5484
$$ 427420 397546 492774 599153 686650 670350 476916 523056 667090 413871 485213 439729
14773D39729J8442J38427L2894j80137l4147K32352B33282M12832O1433K69981
$$ 439729 458171 596598 629492 449355 415208 647560 233282 646114 707547 977528
14763I77528j09471B05029K84140P0978j19009M09443k19415k92163K44303k46542
$$ 977528 868057 205029 489169 560147 441138 850581 631166 339003 583306 336764
14753C36764L49590l1282n3216J62231P7847k85754J10459k16699n0286L45023
$$ 336764 686354 655072 601856 764087 841934 556180 666639 449940 399654 744677
14743G44677j01947j12967K08087o0920j40351K2538l7466J60328m6594j71166
$$ 744677 642730 529763 737850 676930 536579 559117 521651 681979 635385 464219
14733D64219M21036n267J08704j8557l53879k03976J65944J00998j18323L61129
$$ 464219 885255 879988 988692 970135 616256 412280 578224 679222 560899 922028
14723I22028l57347L32878k89780K55173M3002m02136P43997n86172m6860n061
$$ 922028 564681 897559 607779 862952 905954 503818 1247815 661643 614783 609722
14713F09722J97226k37410J54362l9915Q5029k06973M08082j22797K40717l8695
$$ 609722 806948 569538 723900 683985 769014 562041 970123 847326 1088043 1049348
14703A049348K76698m33296K913k99791K27098J44188j12495m1346l6972J01905
$$ 1049348 1326046 892750 895663 595872 822970 967158 854663 813317 776345 878250
14693H78250J10941j95221K6905J37118j76924J52887k09850K85516l19694N1008
$$ 878250 989191 793970 820875 957993 781069 933956 724106 1009622 689928 740936
14683G40936M25170k25640j94262M09949p8133k97541J05267l4p8813j78612N22778
$$ 740936 1166106 940466 746204 1156153 1078020 780479 885746 885712 806899 628287 1151065
14672A151065q0207k46212J48984p5208K39127k68407J00724J23052j28522M436
$$ 1151065 1070858 824646 973630 898422 1137549 869142 969866 1092918 964396 968832
14662I68832J21204m10863L28929R2670k89438j60433M36519J09884k37722J01203
$$ 968832 1090036 679173 1008102 1100772 811334 650901 1087420 1197304 959582 1060785
14652A060785j27008L3404j15222K53588Q6817k30613K21940J34633j34079J93348
$$ 1060785 933777 967181 851959 1105547 1192364 961751 1183691 1318324 1184245 1377593
14642A377593m12949R7131P885j07676Q753M8283k7872N5908J38048k26847L51841
$$ 1377593 964644 1061775 1069660 961984 970737 1019020 991148 1047056 1185104 958257 1310098
14631A310098J02126l94008L01320k18510j02266L49881j52752l26899L88724
$$ 1310098 1412224 1018216 1319536 1101026 998760 1348641 1195889 868990 1257714
14622A257714j07413J39132J50856P2202J93966m69218k07859K57260J58334J69341
$$ 1257714 1150301 1289433 1440289 1512491 1706457 1237239 1029380 1286640 1444974 1614315
14612A614315k43614j97830K38282K35987J7831n64038K58365J29359k88074N98995
$$ 1614315 1370701 1172871 1411153 1647140 1664971 1100933 1359298 1488657 1200583 1799578
14602A799578k76820Q361j39214J82753K55295l74216K10852q4196k5218K7824
$$ 1799578 1522758 1531119 1391905 1574658 1829953 1455737 1666589 1582393 1557175 1584999
14592A584999L7089N333j12401K8458M85196m72922K71962j07353j02931j40684
$$ 1584999 1622088 1627421 1515020 1543478 2028674 1555752 1827714 1720361 1617430 1476746
14582A476746K47003O9333P6092J51780k08605J72518K59549k9014p5590J00486
$$ 1476746 1723749 1793082 1869174 2020954 1812349 1984867 2244416 2215402 2139812 2240298
14572B240298l20320J28839j7177j51696M01579j60989J46414k13966l2688L70709
$$ 2240298 1919978 2048817 2031640 1879944 2281523 2120534 2266948 2052982 2020294 2391003
14562B391003n3457K43379o3098L46077l99702L3233J69262L68444O42192k90608
$$ 2391003 2337546 2580925 2517827 2863904 2464202 2497435 2666697 3035141 3677333 3386725
14552C386725M97766N91792R53550J979441M052466P927339J5473712Q014546
$$ 3386725 3884491 4476283 5429833 7409274 11461740 19389079 34862791 42877337
14544D2877337k0248456H605770D183330j428238m99624l12243p5520l06328K43264
$$ 42877337 22628881 8605770 4183330 2755092 2255468 1943225 1867705 1561377 1804641
14535A804641K7696p5696J72420J2290J01652k09332P1321J67362N11673l61202
$$ 1804641 1832337 1756641 1929061 1941351 2043003 1833671 1904992 2072354 2584027 2222825
14525B222825k68675L73697j42892J2394N1795P5761J50475K0003j847q3J18232
$$ 2222825 1954150 2327847 2184955 2197349 2249144 2324905 2475380 2495383 2493536 2493453 2611685
14514B611685k94839j1197J46607L05l09073M87579n3972k4711M47512k30028
$$ 2611685 2316846 2305649 2452256 2452561 2143488 2631067 2577095 2552384 2999896 2769868
14504B769868J8607k57543L36380J62462j83698p6820K77643j50583k98058O06169
$$ 2769868 2788475 2530932 2867312 3029774 2846076 2769256 3046899 2896316 2598258 3204427
14494C204427o3787k11127J53167J97166J36312Q4006m41410J10059R8794J01443
$$ 3204427 3140640 2929513 3082680 3279846 3416158 3500164 3058754 3168813 3267607 3369050
14484C369050K35001j83952L50369j03196j55916J32390k72856L42389m2072p1780
$$ 3369050 3604051 3420099 3770468 3667272 3511356 3643746 3370890 3713279 3671207 3599427
14474C599427L02271O6026n77266R39919m88118J66155p9581J93624R5831m07537
$$ 3599427 3901698 3967724 3390458 4330377 3842259 4008414 3928833 4122457 4218288 3810751
14464C810751O83594j98126n7738q9442K04052Q289L40588J10561l41099K81719
$$ 3810751 4494345 4296219 4238481 4149039 4353091 4361380 4701968 4812529 4471430 4753149
14454D753149p523m6478J59514j52297J37634L0548m2594L07063L7272N0532K01825
$$ 4753149 4745626 4699148 4858662 4706365 4843999 4874547 4831953 5139016 5176288 5226820 5428645
14443E428645k18205J03268Q6230p1665Q3307K44354l3510J57270M6779J92581
$$ 5428645 5210440 5313708 5399938 5328273 5411580 5655934 5622424 5779694 5826473 6019054
14433F019054J806L44380j23760J08539J6248k4827L41592N7584J07199J7903
$$ 6019054 6020860 6365240 6241480 6350019 6366267 6341440 6683032 6740616 6847815 6865718
14423F865718K30487k227k03785L96871J73097N20453k17935j45463J46379j449
$$ 6865718 7096205 7093978 6890193 7287064 7460161 7980614 7762679 7617216 7763595 7762146
14413G762146L28780k61455N63471m39359M08799N99080m91192L87970M92765
$$ 7762146 8090926 7829471 8392942 7953583 8362382 8961462 8470270 8858240 9351005
14404I351005J813M4237k43753K91087M15883n5036J88046L37285J92276k19858
$$ 9351005 9352818 9397055 9153302 9444389 9860272 9805236 9993282 10330567 10522843 10302985
14394A0302985L50618J80347j3900M77028j1632N5610M4127N60538N38172j34424
$$ 10302985 10653603 10833950 10820050 11297078 11285446 11341056 11385183 11945721 12483893 12349469
14384A2349469L65237k0211K91733L81041M42011j4078J57745L43681P23861j70247
$$ 12349469 12714706 12694495 12986228 13367269 13809280 13795202 13952947 14296628 15020489 14850242
14374A4850242K52985J09267M15422J79010L63061N15130M42702N60984L2278
$$ 14850242 15103227 15212494 15627916 15806926 16169987 16685117 17127819 17688803 17721081
14365A7721081L95562L91545L60429M75850O23271J13858N30984K52812Q23245
$$ 17721081 18116643 18508188 18868617 19344467 19967738 20081596 20612580 20865392 21688637
14356B1688637N53763K13068K25743J086140N24911M15828O79769P46665M89361
$$ 21688637 22242400 22455468 22681211 23767351 24292262 24708090 25387859 26134524 26623885
14347B6623885Q04108N44461N46074R42877R17694Q96496M77768J082868J123916
$$ 26623885 27427993 27972454 28518528 29461405 30379099 31275595 31753363 32836231 33960147
14338C3960147Q08204N79704J348320J096430Q92337J488702O55874J314633J323199
$$ 33960147 34768351 35348055 36696375 37792805 38685142 40173844 40829718 42144351 43467550
14329D3467550J822044J239374J259521K081041J796158J168843K160236J787681
$$ 43467550 45289594 46528968 47788489 49869530 51665688 52834531 54994767 56782448
14321E6782448J835319K279839K363817K075046K824614K325951L208088K825267
$$ 56782448 58617767 60897606 63261423 65336469 68161083 70487034 73695122 76520389
14313G6520389K863279L143107L402243L801543L862585L694491M372377M430521
$$ 76520389 79383668 82526775 85929018 89730561 93593146 97287637 101660014 106090535
14305A06090535M988788N203181N517890N760402O156695O294179P200433P312938
$$ 106090535 111079323 116282504 121800394 127560796 133717491 140011670 147212103 154525041
14297A54525041P911801Q290810Q936401R324813R993165J0549466J1220187J1298028
$$ 154525041 162436842 170727652 179664053 188988866 198982031 209531497 220751684 232049712
14289B32049712J2512233J3115035J3563232J3952642J4249985J5415116J5009068
$$ 232049712 244561945 257676980 271240212 285192854 299442839 314857955 329867023
14282C29867023J5389794J5257572J4891299J4863418J3585530J2870517J1247312
$$ 329867023 345256817 360514389 375405688 390269106 403854636 416725153 427972465
14275D27972465R450597O245032J907099l7985m77761q79747j351679j091675
$$ 427972465 437423062 443668094 445575193 445537208 445059447 444179700 442828021 441736346
14267D41736346m274827p583612j0577511j2050681j3582236j4248701j4744684
$$ 441736346 437461519 429877907 419300396 407249715 393667479 379418778 364674094
14260C64674094j5369034j5580247j5617763j5415757j4822207j3858103j3436208
$$ 364674094 349305060 333724813 318107050 302691293 287869086 274010983 260574775
14253B60574775j3207960j2740093j2220638j1310474j0489190j0092007r827276
$$ 260574775 247366815 234626722 222406084 211095610 200606420 190514413 180687137
14246A80687137q909490q217533p384634q142230o990732o529292o299770n657645
$$ 180687137 171777647 163560114 156175480 148033250 141042518 134513226 128213456 122555811
14238A22555811n260914n212594m954119m281060m435109m447734l473321l502302
$$ 122555811 117294897 112082303 107128184 102847124 98412015 93964281 90490960 86988658
14230H6988658l298668l733225l044777k825978k977502k468354k882184k015905
$$ 86988658 83689990 79956765 76911988 74086010 71108508 68640154 65757970 63742065
14222F3742065k429125k087707j807118k054660j603340j986055j504240j543930
$$ 63742065 61312940 59225233 57418115 55363455 53760115 51774060 50269820 48725890
14214D8725890j711392r95174j314677j668335j114818j540963r50923r35407
$$ 48725890 47014498 46019324 44704647 43036312 41921494 40380531 39429608 38494201
14206C8494201o39861j539563p95212j296415q69901p87868o29716j173743m62374
$$ 38494201 37854340 36314777 35519565 34223150 33353249 32565381 31935665 30761922 30299548
14197C0299548p91781j144270L3663r90092o03786r52159p26482p14485j78466
$$ 30299548 29507767 28363497 28397160 27407068 26803282 25851123 25124641 24410156 24231690
14188B4231690p62796p85267m59458m52109n54769n27481o2152n48279l47969
$$ 24231690 23468894 22683627 22224169 21772060 21217291 20689810 20627658 20079379 19731410
14179A9731410o93359k67931l88689n45769j34326q786n01434l56748n25948m88919
$$ 19731410 19038051 18770120 18381431 17835662 17701336 17692550 17191116 16834368 16308420 15819501
14169A5819501l01734l31748l60614q3028k15851k26912o16319J1020n5591m05398
$$ 15819501 15517767 15186019 14825405 14742377 14526526 14299614 13683295 13694315 13638724 13233326
14159A3233326j69819k36277k56512n9591l41253j33807j01946m92449r5272l71977
$$ 13233326 13063507 12827230 12570718 12511127 12169874 12036067 11934121 11441672 11346400 10974423
14149A0974423R7067J331l59786n09801J43769R9214l62027j54011k53935q5053
$$ 10974423 11071490 11072821 10713035 10203234 10347003 10446217 10084190 9930179 9676244 9591191
14139I591191J3613k90256q9631j53277p6425q4037j26420n22092K62168j86046
$$ 9591191 9604804 9314548 9224917 9071640 8995215 8911178 8784758 8262666 8524834 8338788
14129H338788m91458L57169l57289K46117m72968J41032j33116k54732j43641
$$ 8338788 7847330 8204499 7847210 8093327 7620359 7761391 7628275 7373543 7229902
14120G229902Q5701n12466L29216l60581k06104L49872o02066K73656l03867K96335
$$ 7229902 7315603 6803137 7132353 6771772 6565668 6915540 6313474 6587130 6283263 6579598
14110F579598k85274j44153K94146j14226j45259K3944m17513J36827l92591j52244
$$ 6579598 6294324 6150171 6444317 6330091 6184832 6208776 5791263 5928090 5535499 5383255
14100E383255M75450m69843K65248l10081J20977k02421p4150q6978q9651k16741
$$ 5383255 5858705 5388862 5654110 5344029 5465006 5262585 5188435 5101457 5011806 4795065
14090D795065K84549o3519n3300M0494l58413L1602M1466l02709N3855J47430
$$ 4795065 5079614 5016095 4962795 5003289 4644876 4676478 4717944 4415235 4469090 4616520
14080D616520O2611k33367m0172k36363P1948Q7823j71272j5434m36035N28647
$$ 4616520 4679131 4445764 4405592 4169229 4241177 4329000 4157728 4142294 3706259 4234906
14070D234906k67367R1884M4220l93590J24724M44524o45144K0978k24072L65955
$$ 4234906 3967539 4059423 4103643 3710053 3834777 4279301 3634157 3655135 3431063 3797018
14060C797018k33575J88814k58733r8429K73809P3869j44939M496j77695J74410
$$ 3797018 3563443 3752257 3493524 3395095 3668904 3742773 3597834 3602330 3424635 3599045
14050C599045l57504K80025o48435K61134J500L48024n25330J82070P6890m03181
$$ 3599045 3241541 3521566 2873131 3134265 3135765 3483789 2958459 3140529 3217419 2814238
14040B814238J90517P5853j66916q5907R8136l27385K91548J49090k98277m3701
$$ 2814238 3004755 3080608 2913692 2827785 2925921 2598536 2890084 3039174 2740897 2697196
14030B697196O6327K48373k50464R3524k12602l00274J63940M7793j97270K82204
$$ 2697196 2763523 3011896 2761432 2854956 2642354 2342080 2506020 2553813 2356543 2638747
14020B638747j48287j08866K09310m57735L22608L2595p4441o4683L4208k41623
$$ 2638747 2490460 2381594 2590904 2133169 2455777 2488372 2413931 2349248 2383456 2141833
14010B141833M59282m12558K59678n05836L42569k51516r3205l86538M90856j77576
$$ 2141833 2601115 2188557 2448235 1942399 2284968 2033452 1940247 1553709 2044565 1866989
14000A866989L04719j61575k77837K74401k51520J07695L58551n3355m60632N55912
$$ 1866989 2171708 2010133 1732296 2006697 1755177 1862872 2221423 2168068 1707436 2263348
13990B263348N40115J108161K873952O181607J4898144J4785944j5813814A2947521
$$ 2263348 2803463 3911624 6785576 12967183 27865327 42651271 26837457 12947521
13981G539407k145791j027964k91800o45175l55958n0217m98486j44797J4981
$$ 7539407 5393616 4365652 4073852 3428677 3072719 3022502 2524016 2379219 2394200
13972B394200k52153J33167q300l1613j39832K38044k58604K28842k54514q4876
$$ 2394200 2142047 2275214 2266914 2235301 2095469 2333513 2074909 2303751 2049237 1964361
13962A964361J44343k27895r8639l7760J03258p8845P7220l8272J4504M78652
$$ 1964361 2108704 1880809 1782170 1744410 1847668 1768823 1846043 1807771 1822275 2300927
13952B300927n55206K56337p34964O98737l26054K69316k87661k27371r6876L31958
$$ 2300927 1745721 2002058 1267094 1965831 1639777 1909093 1621432 1394061 1297185 1629143
13942A629143k49640J65640P6234j81213M8043j3869J59917k23757J32890j82833
$$ 1629143 1379503 1545143 1621377 1440164 1488207 1474338 1634255 1410498 1543388 1360555
13932A360555K25124k10023J36997j11846J49958l06942L19466m52702M88390
$$ 1360555 1585679 1375656 1512653 1400807 1550765 1243823 1563289 1110587 1598977
13923A598977j65452k02945N1723M92932o29255M14628k77828K48912j73571n9091
$$ 1598977 1433525 1230580 1282303 1775235 1145980 1560608 1282780 1531692 1358121 1299030
13913A299030r1603j3016J05906k7480J28517R2815m15327M3265k9582K89738
$$ 1299030 1207427 1194411 1300317 1272837 1401354 1494169 1078842 1122107 1092525 1382263
13903A382263k83580K17302j29113J32948m3715J71325m63110J32724K3410P496
$$ 1382263 1098683 1315985 1186872 1319820 1276105 1447430 984320 1117044 1140454 1147950
13893A147950J08565j97324n1346J50694q3896l9435L53376j17626j41134j55156
$$ 1147950 1256515 1059191 1007845 1158539 1074643 1035208 1388584 1270958 1129824 974668
13883I74668J97115k24761J83644J38090l36725K20317K2930o4043L6992l15394
$$ 974668 1171783 947022 1130666 1268756 932031 1152348 1175278 1111235 1148227 832833
13873H32833L64434j2511q1378p5730l2823J99212N8302k31651j42547J24149
$$ 832833 1197267 1184756 1103378 1027648 994825 1194037 1252339 1020688 878141 1002290
13863A002290k49052K69430m6486o3968L22608n17610K9551R1583o2073L01677
$$ 1002290 753238 1022668 976182 912214 1234822 717212 746763 838346 776273 1077950
13853A077950j43675K14240n55819Q6230N66535j510k70732j08415N4275N2268
$$ 1077950 934275 1148515 592696 678926 1245461 1243951 973219 864804 919079 971347
13843I71347j51476j43507M80591k09716K5042M2421N7514j84691M41344E98610
$$ 971347 819871 676364 1156955 947239 972281 1014702 1072216 887525 1328869 598610
13832H76959m00194O05674l44749L39239k82421L876O0315j57727P7143j36963
$$ 876959 476765 1082439 737690 1076929 794508 798384 858699 700972 778115 641152
13822F41152M62K68687l05924K14294k26836K62003l76367J76211m0170J78797
$$ 641152 641614 910301 604377 818671 591835 853838 477471 653682 613512 792309
13812G92309L7036Q391n0202n0752K21235k75100R0961k9738k9408M4811M2765
$$ 792309 829345 837736 787534 736782 958017 682917 773878 744140 714732 759543 802308
13801H02308J27367j59646j71841L03722l34513K44509J227P3396j61270Q9685
$$ 802308 929675 770029 598188 901910 567397 811906 813133 886529 725259 814944
13791H14944j26265K44684C77901L23181j32849L1246r1111M04670j63970k99863
$$ 814944 688679 933363 377901 701082 568233 599479 508368 913038 749068 449205
13781D49205K79989J02100C32268L81421J41065j74580k61244M88231l34319R3372
$$ 449205 729194 831294 332268 713689 854754 680174 418930 907161 572842 666214
13771F66214M1961o6944M27403r4178l72106N0359o7056P9536J94323l38241K34116
$$ 666214 708175 641231 1068634 974456 602350 652709 585653 665189 859512 521271 755387
13760G55387l63606J62048p8543L68264l68971L20636l70981M74580K3555l85389
$$ 755387 391781 553829 475286 843550 474579 795215 424234 898814 922369 536980
13750E36980j32049K2356K25538l16972M1913A64644K98470J64478j45674J55907
$$ 536980 404931 427287 652825 335853 377766 164644 463114 627592 481918 637825
13740F37825J67715C71172K52233B75755N28783r1825j99871J2507M9258K06040
$$ 637825 805540 371172 623405 275755 804538 712713 512842 525349 574607 780647
13730G80647A32104L21081N5944q5377J46840n7264q4527Q6903j58183K18137
$$ 780647 132104 453185 509129 423752 570592 513328 428801 515704 357521 575658
13720E75658k49475L68094B08620K4528M92910R5127k60251k25367L25237q9410
$$ 575658 326183 694277 208620 233148 726058 821185 560934 335567 660804 571394
13710E71394A55890M54615K14465C73437J07599j57892J81427l7564P2029B57509
$$ 571394 155890 610505 824970 373437 481036 323144 504571 467007 539036 257509
13699G24460l51222J69359A40274J08908M59387A93987L08796A71516N82627j88942
$$ 724460 373238 542597 140274 249182 708569 193987 502783 171516 754143 565201
13689E65201k43588L42356l213q8623R522q4484L638o3908j08888L6502R4014
$$ 565201 321613 663969 660756 572133 581655 497171 500809 436901 328013 364515 458529
13678D58529j68592J90908j35296J18626A46667J94686J5038R6385L23374j97295
$$ 458529 289937 480845 345549 464175 146667 341353 356391 452776 776150 578855
13668E78855A31472L90989B22579M74918k68280j24768R8957j12025K5514J08114
$$ 578855 131472 522461 222579 697497 429217 304449 403406 291381 316895 425009
13658D25009J3954p9081q4251M12612B18309n5503J35265q7662K33253J38691
$$ 425009 438963 359882 275631 688243 218309 162806 298071 210409 443662 582353
13648E82353n785m3076l4117B32027Q3716N9927P0111n026J22193B42191K17228
$$ 582353 576568 533492 499375 232027 315743 375670 445781 440755 562948 242191 459419
13637D59419j49019q3802N5659O405a1781C17027K74275r4172k07943K53969n4480
$$ 459419 310400 226598 282257 288662 -11781 317027 591302 497130 289187 543156 488676
13626D88676j30247j29036J13001A50620l3516J17368J54051j37645J07187j54102
$$ 488676 358429 229393 342394 150620 117104 234472 388523 250878 358065 203963
13616B03963L58369a9244D51748E7326M60667j85823I0656K35792M784J11P4795
$$ 203963 562332 -19244 451748 57326 517993 332170 90656 326448 331232 331343 406138
13605D06138J05773a23033r2990D85536j04520o7952j13023L37071j55847p5528
$$ 406138 511911 -123033 -216023 485536 381016 313064 200041 537112 381265 305737
13595C05737J54130J10820A46490C1182K7279J32788J45983j56566m9020A5332
$$ 305737 459867 570687 146490 31182 58461 191249 337232 180666 131646 15332
13584C70126n5486J30862H7269b6733A77077K15459J19586q4968A58341L11737
$$ 370126 314640 445502 87269 -26733 177077 392536 512122 427154 158341 470078
13574D70078B25890L70094j95256A57931K7798J00316a54476C73619N9744N2232
$$ 470078 225890 595984 400728 157931 185729 286045 -154476 373619 433363 485595
13564D85595B16056m6905K21368N6830A98569Q2358J1419B4104K99288J28715
$$ 485595 216056 169151 390519 447349 198569 280927 292346 24104 323392 452107
13554D52107j85162L37150B52726K65477j91990j28261a69744E75051k73102m0947
$$ 452107 266945 604095 252726 518203 326213 197952 -169744 575051 301949 261002
13544B61002i8732A94329l8002M20789A63451J9255K881K78484A37610J54863
$$ 261002 -98732 194329 156327 577116 163451 182706 185587 464071 137610 292473
13534B92473I5706N8175E5761O5564J39831a39668D61092j93302J55817A66157
$$ 292473 95706 153881 55761 121325 261156 -139668 461092 267790 423607 166157
13523C07753a62216D42335k18505E5299N7624M6824F2375j9877L06047Q3858k05328
$$ 307753 -162216 442335 223830 55299 112923 159747 62375 42498 348545 432403 227075
13512B27075A2211J94770J48672j57966O8381J71301n510M8833B18512n9274L81366
$$ 227075 12211 206981 355653 197687 266068 437369 431859 480692 218512 159238 540604
13501E40604n3307D5060g8789B76922F7460d8179C3712N355L62346h7802E92825
$$ 540604 487297 45060 -78789 276922 67460 -48179 33712 39067 401413 -87802 592825
13489a48414B34365j01452j4317J73503a72106B74248M34405H356K29616M82026
$$ -148414 234365 132913 118596 292099 -172106 274248 708653 8356 237972 719998
13479G19998k46016j9091a21009E424K30501j14148J78613K57679j65139j76992
$$ 719998 473982 454891 -121009 5424 235925 121777 300390 558069 392930 215938
13469B15938r5895B6780M028K61282H4933j8914Q205K66050J25729d969B61360
$$ 215938 120043 26780 30808 292090 84933 66019 74224 340274 466003 -4969 261360
13457H0014K0062J36711D1509a76182h1134A91900J29552A9396N7525J96544J13767
$$ 80014 100076 236787 41509 -176182 -81134 191900 321452 19396 76921 273465 387232
13446C87232N0386a91910I7332L0373J96899K18835A46602M7683b83737B50046
$$ 387232 437618 -191910 97332 127705 324604 543439 146602 194285 -283737 250046
13435B26456b8246D5126L35413j64391Q4234K0982l3720j21847k0468e7847E7771
$$ 226456 -28246 45126 380539 216148 300382 321364 287644 165797 145329 -57847 57771
13423a35936c9279q6259B33447K33402q1432p1383J9337A35169R8734a58568A20521
$$ -135936 -39279 -125538 233447 466849 385417 314034 333371 135169 233903 -158568 120521
13411A48574d6095G218K64369L08385a3215B48621M2901j39071L4072N2821C2558
$$ 148574 -46095 7218 271587 579972 -13215 248621 291522 152451 186523 239344 32558
13399E14750a48637A13087K25279o6756N1727J65248c2396B90923p229A32691
$$ 514750 -148637 113087 338366 271610 323337 488585 -32396 290923 283694 132691
13388c8933B38694H2824Q3224R8906J29281A34236m477O3708o6377K7395K65316
$$ -38933 238694 82824 166048 264954 394235 134236 129759 193467 127090 154485 419801
13377D19801i6024m1841A44669L74121i8441B78805j31795K43880j90507G4532
$$ 419801 -96024 -137865 144669 518790 -98441 278805 147010 390890 200383 74532
13366f3330B15393O7159p1980a71851A97758J8674m0894a04484C21902j53077
$$ -63330 215393 282552 210572 -171851 197758 216432 175538 -104484 321902 168825
13356A68825D2373L34379A36496a14564E09690A90968J61790b7703B80149j7583
$$ 168825 42373 376752 136496 -114564 509690 190968 352758 -27703 280149 262566
13346B62566j04492K02425H7974J23786K38255j2886B07480j3699k6871J58592
$$ 262566 158074 360499 87974 211760 450015 437129 207480 193781 166910 325502
13336C25502D487f3874B56134k0971P5387B1855j0619B30J78344O2658I4602f8409
$$ 325502 4487 -63874 256134 235163 310550 21855 11236 230 178574 241232 94602 -68409
13323A93917K25184A88991F2380L0497L2684M4361K4376o5950c1921A73753k1575
$$ 193917 419101 188991 62380 92877 125561 169922 194298 128348 -31921 173753 152178
13312A52178G4563K25584g0105A41464O1950I3901J71780a32650C07423E758J66367
$$ 152178 74563 300147 -70105 141464 203414 93901 265681 -132650 307423 5758 172125
13301A72125m6311C9767J58112J92121l5194O4582e8580b9067D4708J63596m8131
$$ 172125 125814 39767 197879 390000 354806 419388 -58580 -29067 44708 208304 160173
13290A60173b52114A59682J64979A14192J23386j7165l0032m886j666N5859b37483
$$ 160173 -252114 159682 324661 114192 237578 220413 190381 185495 183829 239688 -237483
13278b5228B9569K55107j5773a6372j40199b1945A63758o9221m5113c5736C3829
$$ -25228 29569 284676 268903 -16372 -156571 -21945 163758 94537 49424 -35736 33829
13266B42991j3234A11796k6077b19622c5770D73451F5604L65796j05387a25990
$$ 242991 229757 111796 85719 -219622 -35770 473451 65604 431400 326013 -125990
13255b0838j83287k4337B53325Q5487C8883b2543E6291j6151J41163a20709C09291
$$ -20838 -204125 -228462 253325 338812 38883 -22543 56291 40140 181303 -120709 309291
13243b55062c2529J5228A11785J77933F1424A1284J18537E8006e6271A74745k5930
$$ -255062 -32529 -17301 111785 289718 61424 11284 129821 58006 -56271 174745 148815
13232A48815L81926C1615a87950A01356b12945q9349B03768o7903M6033K44991
$$ 148815 530741 31615 -187950 101356 -212945 -302294 203768 135865 181898 426889
13222D26889A10449G055N11748l486b057G0455j4542i6160A10514K21819b8588
$$ 426889 110449 7055 518803 515317 -2057 70455 55913 -96160 110514 332333 -28588
13210F2488L2414P9330J74324n0300m7103M8427A41868a21472B84340a70638g3655
$$ 62488 94902 174232 348556 298256 251153 299580 141868 -121472 284340 -170638 -73655
13198C8009j7379K2139J56518A9353J32464P3193J65966A14394b03679B59501
$$ 38009 20630 42769 199287 19353 151817 225010 390976 114394 -203679 259501
13187e7583A05938R9149P657b9107A91713J14879f1339q2806A94251c35685D39584
$$ -57583 105938 205087 212744 -29107 191713 306592 -61339 -144145 194251 -335685 439584
13175d4276m48A21865Q3510a16417a8225G3862J41854c1924C42141I5469a00920
$$ -44276 -44724 121865 205375 -116417 -18225 73862 215716 -31924 342141 95469 -100920
13163b36932d6094A39446b2028A15661b70253a00543A59087c11839B80623K05149
$$ -236932 -46094 139446 -22028 115661 -270253 -100543 159087 -311839 280623 485772
13153D85772A45934a24322D66470j60627H2413g6439A71923K05515A07311a9235
$$ 485772 145934 -124322 466470 305843 82413 -76439 171923 377438 107311 -19235
13142B4722O6645m508d4063r4836A09929d3091A78161J50611a64004j1480a262
$$ 24722 91367 86859 -44063 -138899 109929 -43091 178161 328772 -164004 -175484 -1262
13130b7716q909B30453A03887J69096p9906r0648K5405J32013O606A20887b09287
$$ -27716 -36625 230453 103887 272983 193077 102429 127834 259847 266453 120887 -209287
13118A41525o9320Q9447d1047A83214M10129F2852b13658A42841O8873b64035
$$ 141525 72205 161652 -41047 183214 593343 62852 -213658 142841 211714 -264035
13107A61522F7317L09272A28752D2409E889a1457k5236B26232K2958A17039n2908
$$ 161522 67317 376589 128752 42409 5889 -11457 -36693 226232 249190 117039 64131
13096F4131N0122k297a09219A69459J5868l6072N4139B1956J82340i8864g905
$$ 64131 114253 111956 -109219 169459 185327 149255 203394 21956 204296 -98864 -7905
13084A5103d0859A62418G4178K35829F9967N2156M16275E1725i083A44812P9484
$$ 15103 -40859 162418 74178 310007 69967 122123 538398 51725 -9083 144812 224296
13073B24296p9644e7770B3455J09040J03416J5109a32063A98743m3413D9112f0051
$$ 224296 144652 -57770 23455 132495 235911 251020 -132063 198743 155330 49112 -60051
13061B92465O4341A7071a28581A75596H500K6871J36118b35188a344B09299D3415
$$ 292465 356806 17071 -128581 175596 8500 35371 171489 -235188 -1344 209299 43415
13049D2323J2491A8068M2213l260L09619H3526k827a03840M6497l06407B91238
$$ 42323 54814 18068 60281 57021 366640 83526 80699 -103840 -57343 -363750 291238
13037B916c40818J14595P4587C82917I501Q5000b19038C17255A10444J26192a71479
$$ 2916 -340818 -226223 -151636 382917 9501 94501 -219038 317255 110444 236636 -171479
13025a06274j11991a1839r5860A68151d7814B08718b3924A5090M05622I9039h2177
$$ -106274 -218265 -11839 -107699 168151 -47814 208718 -23924 15090 420712 99039 -82177
13013c1564D56999j63881a86758C0512P1577a06396E6752c2756A36933a0063l658
$$ -31564 456999 293118 -186758 30512 102089 -106396 56752 -32756 136933 -10063 -13721
13002a3721l1735A83737Q723c06209A38629b8438C23335R372r9071P6906b12428
$$ -13721 -45456 183737 192460 -306209 138629 -28438 323335 332707 233636 310542 -212428
12990a26150A17688J08431E429a65984A76711F0734L9965B6310K3734a45791D39570
$$ -126150 117688 226119 5429 -165984 176711 60734 100699 26310 50044 -145791 439570
12978c34314d8593C31879A56629K1292E6293J45640F3685K40316A22945J36010
$$ -334314 -48593 331879 156629 177921 56293 201933 63685 304001 122945 258955
12968B58955d21565a41042j11455J12677B14805l1242c70705R8223a10678q3900
$$ 258955 -421565 -141042 -252497 -139820 214805 183563 -370705 -272482 -110678 -194578
12958a94578C4604J09046K69040a69850O8268A53812a20589H4106g1990j42187
$$ -194578 34604 143650 412690 -169850 -101582 153812 -120589 84106 -71990 -214177
12948b14177B04273a76513d2685C53126d57513C7774m771K34158O894l0942R7977
$$ -214177 204273 -176513 -42685 353126 -457513 37774 33003 267161 274055 243113 341090
12937C41090D7611a14614B52152j22539i4221G716b40634C05673l8742a11716
$$ 341090 47611 -114614 252152 129613 -94221 7716 -240634 305673 266931 -111716
12926i5194b6998j19945A06987J10307q4741b19328m4559J25565F45823k72270
$$ -95194 -26998 -146943 106987 217294 132553 -219328 -263887 -138322 645823 373553
12916C73553d834A19461g8067A22036n9383d1663A15664h216q8475a0482D09457
$$ 373553 -4834 119461 -78067 122036 62653 -41663 115664 -8216 -96691 -10482 409457
12904a321k47433j05902B53096K0496D113K71164J422A00781J00927b45510F77
$$ -1321 -248754 -354656 253096 273592 4113 275277 276699 100781 201708 -245510 677
12892B9515J63089h879j51854C36633n1653H8971d9276a3273k9503n8067j01722
$$ 29515 192604 -8879 -160733 336633 284980 88971 -49276 -13273 -42776 -100843 -202565
12881b02565R8807D06238A30927g8535C7727c00153A1425c45908A8829N2843R642
$$ -202565 -103758 406238 130927 -78535 37727 -300153 11425 -345908 18829 71672 81314
12870H1314d9964G7906a0029A49929a93589E98457B35004l2968A4310J88655B9977
$$ 81314 -49964 77906 -10029 149929 -193589 598457 235004 202036 14310 202965 29977
12858g8070A49288b17155B1803c8126k53907J45487M8478A64859a25882B8152
$$ -78070 149288 -217155 21803 -38126 -292033 -146546 -98068 164859 -125882 28152
12847H7866B3227J17891e8155p1684A50109Q8363a8561G3499c7864o510E31L05113
$$ 87866 23227 141118 -58155 -129839 150109 238472 -18561 73499 -37864 -44374 531 305644
12835C05644E147J30547C4830a89163Q0439B4778M95195a34472A99680a58465
$$ 305644 5147 135694 34830 -189163 -108724 24778 519973 -134472 199680 -158465
12824C33715j52052d08712H6914E626K05859H5987a68299B65572a49585A72492
$$ 333715 181663 -408712 86914 5626 211485 85987 -168299 265572 -149585 172492
12813C50212a0977m6166g923p3978p3115B6732P9232e6660B09033o6061h9155
$$ 350212 -10977 -57143 -7923 -81901 -155016 26732 105964 -56660 209033 142972 -89155
12801B24777F2541f8272B54337f1160G2211k6268J99908H9878Q4378G6926d06626
$$ 224777 62541 -68272 254337 -61160 72211 45943 245851 89878 174256 76926 -406626
12789b9472k76544c707A47105n3956J847f277D3141b7196F1381c6163k43563I5952
$$ -29472 -306016 -3707 147105 93149 94996 -6277 43141 -27196 61381 -36163 -279726 95952
12776C0363M5461K8251a7596D8102b9200k15123j97974a26292A4547b74107A39262
$$ 30363 75824 104075 -17596 48102 -29200 -244323 -442297 -126292 14547 -274107 139262
12764B3178J3507L00059F3963a0961C40103E1089K0532J97791i0595b4239A14071
$$ 23178 36685 336744 63963 -10961 340103 51089 71621 269412 -90595 -24239 114071
12752a50438A71390l3332L16667a18645B39836q6083a3900k3203k4499j53270
$$ -150438 171390 138058 454725 -118645 239836 153753 -13900 -37103 -61602 -214872
12742b14872A43751e2787A5605K72061I2457a62392e8332e399A62237R722J2141
$$ -214872 143751 -52787 15605 287666 92457 -162392 -58332 -5399 162237 171959 184100
12731A84100a83659A11597a24926K2250F2556a7281n9938A81352H398f6817r3564
$$ 184100 -183659 111597 -124926 -102676 62556 -17281 -77219 181352 8398 -66817 -160381
12720a60381A19268c06942f5776A29024A0306L3786c1554n8351o3913B39359a74273
$$ -160381 119268 -306942 -65776 129024 10306 44092 -31554 -89905 -153818 239359 -174273
12708B67751j6052p6591J58899j47024k9599J71523j33773a56975A91298o3222
$$ 267751 251699 175108 334007 186983 157384 328907 195134 -156975 191298 128076
12698A28076a30115l5609C15444c43583A63484h6462J6129J7353A47035j7442
$$ 128076 -130115 -165724 315444 -343583 163484 -86462 -70333 -52980 147035 129593
12688A29593p703K07749A56460g3352C79724a1252j7364j8873j08868C7198K51860
$$ 129593 121890 329639 156460 -73352 379724 -11252 -28616 -47489 -156357 37198 289058
12677B89058e7157A91573F3874c6575k05427g2631C11624G4896h3349p7608e8489
$$ 289058 -57157 191573 63874 -36575 -242002 -72631 311624 74896 -83349 -160957 -58489
12665a22395A46019p1525K72875j72718a3469k8550A74259M222l6835e7666A8010
$$ -122395 146019 74494 347369 174651 -13469 -42019 174259 178481 141646 -57666 18010
12653b15035D3920J3569M30546G0180j331J1364j2694a27975G4025a10932J6607
$$ -215035 43920 57489 488035 70180 68849 80213 67519 -127975 74025 -110932 -94325
12642i4325j24890M8234D5094K97448A61507g3417J4679b1808B74777a7870B3040
$$ -94325 -219215 -170981 45094 342542 161507 -73417 -58738 -21808 274777 -17870 23040
12630A14585c81983A01849K4687m5474J94374d850j22650f0158C14891M1666d9823
$$ 114585 -381983 101849 126536 81062 275436 -4850 -127500 -60158 314891 356557 -49823
12618E20176B06911C5210Q1870a16865d920k74779D06158A76044C7294J56534
$$ 520176 206911 35210 117080 -116865 -4920 -279699 406158 176044 37294 193828
12608A93828H7676a88123C99459A07559J76636J43075b64447f9696D6199a82964
$$ 193828 87676 -188123 399459 107559 284195 427270 -264447 -69696 46199 -182964
12597B28073K26331E5004A3309a0212A03248a52559A95609f1939a2157j42137
$$ 228073 454404 55004 13309 -10212 103248 -152559 195609 -61939 -12157 -154294
12587a54294P6453B718c20696A63198A9438J45087K0379b91133H9190a5039G8375
$$ -154294 -77841 2718 -320696 163198 19438 164525 184904 -291133 89190 -15039 78375
12575B92310a63381O7875B97606a16681D56408C8355M2960J9137g6329C1496b82115
$$ 292310 -163381 -95506 297606 -116681 456408 38355 81315 100452 -76329 31496 -282115
12563e5828E54273A7523b5936C41331o1155c76335C16109i6564A85444o0722l3659
$$ -55828 554273 17523 -25936 341331 280176 -376335 316109 -96564 185444 124722 91063
12552I1063L88070b27884g1796k2278A42101a07473n6044B36262n2297i2098C15447
$$ 91063 479133 -227884 -71796 -94074 142101 -107473 -163517 236262 183965 -92098 315447
12540c6029k4465r9349A39868b85186B4914J4570J79864i9571j64869A82158M7388
$$ -36029 -60494 -159843 139868 -285186 24914 39484 219348 -99571 -264440 182158 229546
12529B29546c6963j69801A67116a69314B835c21844B64480K7843a70339A13046
$$ 229546 -36963 -206764 167116 -169314 2835 -321844 264480 292323 -170339 113046
12518F9541J08048o5126c00418B45211g1534j1238K4976l9053A17879a36733M2356
$$ 69541 177589 112463 -300418 245211 -71534 -82772 -57796 -96849 117879 -136733 -94377
12507i4377j50452P4499C24766G633L9926c8663A47837p2331a74971M0675B86075
$$ -94377 -244829 -170330 324766 7633 47559 -38663 147837 75506 -174971 -134296 286075
12495A1664J83122B5391e2905k0185A9508e4519k16308C02910C647i927A52133
$$ 11664 194786 25391 -52905 -73090 19508 -54519 -270827 302910 3647 -9927 152133
12483a53311j01900H685J21149J4958P5052b8254A67588E2852F717O3807c3858
$$ -153311 -255211 8685 129834 144792 219844 -28254 167588 52852 6717 70524 -33858
12471G1818d9537A70087c00901a5947k16846K6778C842K32354d8231j62498B4898
$$ 71818 -49537 170087 -300901 -15947 -232793 -206015 3842 236196 -48231 -210729 24898
12459A34765d2894l68487J33487c7360A17213b96650C90932j71982m4697N4538
$$ 134765 -42894 -411381 -277894 -37360 117213 -296650 390932 218950 174253 228791
12449B28791a72737f5123B21461J78723a30969o78A25458P6749G0842K38368b17546
$$ 228791 -172737 -65123 221461 400184 -130969 -131647 125458 202207 70842 309210 -217546
12437b25474F7333J15491O9946C4262b1755k18585M2855D86493A14469a85608
$$ -225474 67333 182824 252770 34262 -21755 -240340 -197485 486493 114469 -185608
12426d69676C43290b5328k31924c0185o6728I4743a78308D91614b1981m25948
$$ -469676 343290 -25328 -257252 -30185 -96913 94743 -178308 491614 -21981 -447929
12416d47929J84133J21223F5493a46594A31151b22831f3804J1986k574B52266
$$ -447929 -263796 -142573 65493 -146594 131151 -222831 -63804 -51818 -54392 252266
12405B32769j16140a7294j08649A18127a30743A10465D9715a62963P8943c2679
$$ 232769 116629 -17294 -125943 118127 -130743 110465 49715 -162963 -84020 -32679
12394g5213j72920I1840b23565d412A99921C158M1309b3833E0236b06054p6903
$$ -75213 -248133 91840 -223565 -4412 199921 3158 44467 -23833 50236 -206054 -282957
12383b82957a25124E4099b25484A55966g329F3298a01992B57278a30610K6214
$$ -282957 -125124 54099 -225484 155966 -7329 63298 -101992 257278 -130610 -104396
12373a04396C6449a70938A6791b1299C35709A40683b20192B2598K82738j32646
$$ -104396 36449 -170938 16791 -21299 335709 140683 -220192 22598 305336 172690
12363A72690L7899B0079e3749h873m7316k85400a43411B15619r0150N927J42887
$$ 172690 210589 20079 -53749 -8873 -56189 -341589 -143411 215619 125469 131396 274283
12352B74283a86388A05642B1442J75331b4907D066L66233b06000B19775A08814
$$ 274283 -186388 105642 21442 196773 -24907 4066 370299 -206000 219775 108814
12341b62793D8470n4O7359j6666K5922K8339B5448d1877l9750L8163j09829o2488
$$ -262793 48470 48416 115775 99109 125031 153370 25448 -41877 -81627 -43464 -153293 -215781
12329b15781A23171b44867F8111c7552A73142q75R6148A26189k7740J52635c5685
$$ -215781 123171 -244867 68111 -37552 173142 172267 268415 126189 98449 251084 -35685
12317a22310A29367e0157j38939l547i2080C66501R0199b4676k16279B15856A187
$$ -122310 129367 -50157 -189096 -192643 -92080 366501 456700 -24676 -240955 215856 1187
12305b64119B8139j3876h0373k62451A23014c0767a595j31408C0858J59055c93146
$$ -264119 28139 14263 -80373 -342824 123014 -30767 -1595 -133003 30858 189913 -393146
12293B7569J50991r140B8367R7527a9914A82783F7407J97669c2791l3955c0443
$$ 27569 178560 169420 28367 125894 -19914 182783 67407 265076 -32791 -66746 -30443
12281A07728J69994c74316f5816D2516N6620P6218M9676F1868j3308J5585a07005
$$ 107728 277722 -374316 -65816 42516 99136 175354 225030 61868 48560 64145 -107005
12269a05897E0967J05556p6514d136E851a50420H7862a6399p0056C18054b12080
$$ -105897 50967 156523 80009 -4136 5851 -150420 87862 -16399 -86455 318054 -212080
12257C86581I0140J06439A7653a06341A63771p8228J99396d3908j0525H5062b74231
$$ 386581 90140 196579 17653 -106341 163771 85543 284939 -43908 -54433 85062 -274231
12245c37836H3070J27605g853p9993A36415K2094L33112a55923G2111a7961j70234
$$ -337836 83070 210675 -7853 -87846 136415 158509 491621 -155923 72111 -17961 -188195
12234a88195A92994L2459F9794P0211e7649n6097A13086j8285J81808a16464C9354
$$ -188195 192994 225453 69794 140005 -57649 -113746 113086 94801 276609 -116464 39354
12222B81673N2706b84159C54110m4537k1478L2341B9076J78843i1846A90983K3069
$$ 281673 334379 -284159 354110 309573 288095 320436 29076 207919 -91846 190983 214052
12211B14052a2413F1111J15572i3546A21609N0351O4734a5345A87976O7528j24939
$$ 214052 -12413 61111 176683 -93546 121609 171960 236694 -15345 187976 255504 130565
12200A30565Q1469D7980J72710K25343j97880L8430i2479H3271A5571l856g7314
$$ 130565 212034 47980 220690 446033 248153 286583 -92479 83271 15571 11715 -77314
12188A15848B9929J92590F8791a63282C44674a28469H7030K44362j9654c59043
$$ 115848 29929 222519 68791 -163282 344674 -128469 87030 331392 311738 -359043
12177A12305P3188N9314c78672d1308c843A11019A0964M5481K53089a11309B24137
$$ 112305 185493 244807 -378672 -41308 -3843 111019 10964 56445 309534 -111309 224137
12165A42666J93787e4470E7497J0805d295B8398J50101m4683b19167I031b635
$$ 142666 336453 -54470 57497 68302 -4295 28398 178499 133816 -219167 9031 -2635
12153B54854B2938L58249A10984P8888Q4093a05355K737A4683K90215D9481N5557
$$ 254854 22938 381187 110984 189872 273965 -105355 -102618 14683 304898 49481 105038
12142A05038d8816p051B04556l9124J63548l4191b01664A19590n5427b69962a31379
$$ 105038 -48816 -55867 204556 165432 328980 294789 -201664 119590 64163 -269962 -131379
12130A02120m0729d3115A14107d60237B30779b2050C569a6857j27589e3055A81841
$$ 102120 61391 -43115 114107 -460237 230779 -22050 3569 -16857 -144446 -53055 181841
12118b26034A52922B5675a70605O1810A42261A1P2115a75888c1343o9699P68n5193
$$ -226034 152922 25675 -170605 -108795 142261 11 72126 -175888 -31343 -101042 -100274 -155467
12106a55467F5928g0419A86460d964A96694c46719D747e1074j43761R256B96149
$$ -155467 65928 -70419 186460 -4964 196694 -346719 4747 -51074 -194835 -185579 296149
12094a91402D27582A08115l4379K26967b55944C13624A19111d6870B0390f4084
$$ -191402 427582 108115 73736 300703 -255944 313624 119111 -46870 20390 -64084
12083A01482a95375F4575J01006a66451I3573J62191b9949D06863N82485J239961
$$ 101482 -195375 64575 165581 -166451 93573 255764 -29949 406863 989348 2229309
12073B229309I39243A70698e788m3784B72963g110c290G2116J29988b11279B19500
$$ 2229309 939243 170698 -5788 -49572 272963 -7110 -3290 72116 202104 -211279 219500
12061a44416d8715j03294H56f304B8198b71887B38058b88430I5272a38183a8397
$$ -144416 -48715 -152009 856 -6304 28198 -271887 238058 -288430 95272 -138183 -18397
12049a26145J6056D9532g092n670B519L2967a6749k06088I6258a3898A22418a9178
$$ -126145 -110089 49532 -7092 -12762 2519 35486 -16749 -222837 96258 -13898 122418 -19178
12036H1163L6502a22338k19321J46604F3840L6467B8850J11525g7131B7182J1107
$$ 81163 117665 -122338 -341659 -195055 63840 100307 28850 140375 -77131 27182 38289
12025C8289R6132b63325c0598B11907J8078c32439l9210B70481j16592a24340
$$ 38289 134421 -263325 -30598 211907 229985 -332439 -371649 270481 153889 -124340
12014B37713a79736Q7352A13017f3959n6217C1768L47104D5235J7854h3658C24856
$$ 237713 -179736 -92384 113017 -63959 -120176 31768 378872 45235 63089 -83658 324856
12002F0514b5713j08205C68219m9763j04076j02965M174b14600R9595G4617c14070
$$ 60514 -25713 -133918 368219 318456 214380 111415 115589 -214600 -115005 74617 -314070
11990i9544a4985L500m8340l5659j19612E4577d80273B10599j01301b45324b1852
$$ -99544 -14985 -11485 -59825 -95484 -215096 54577 -480273 210599 109298 -245324 -21852
11978a56935A43601F4659b06j82040j38759C17067F3935c02609e0453o9519A394
$$ -156935 143601 64659 -206 -182246 -321005 317067 63935 -302609 -50453 -119972 1394
11966A11705L82149A54939J03165b17619h6377k15666a21314O441o0446L4970
$$ 111705 493854 154939 258104 -217619 -86377 -302043 -121314 -114873 -175319 -140349
11956a40349I0240h3569j384C45813H3398K5477D2280a14324A75722A4373a33588
$$ -140349 90240 -83569 -84953 345813 83398 108875 42280 -114324 175722 14373 -133588
11944a25174r5247A92334A4968b45810P5161m2624h8118c0686H2686b87146j56646
$$ -125174 -220421 192334 14968 -245810 -170649 -213273 -88118 -30686 82686 -287146 -443792
11933d43792A47336c05004A0357J86564b68076J08090B0094b36685B1982a32036
$$ -443792 147336 -305004 10357 196921 -268076 -159986 20094 -236685 21982 -132036
11922c593k3255C9224a13179B33138h5994L8953j73920A33617g9456C54037b03168
$$ -3593 -26848 39224 -113179 233138 -85994 -47041 -220961 133617 -79456 354037 -203168
11910b49734B92089a77544A18190k1816b62816M7103A95223B9745A3701N0315
$$ -249734 292089 -177544 118190 96374 -262816 -215713 195223 29745 13701 64016
11900F4016K15070n8379d1031l86611f8236j95296A92490b0453C55044a66333
$$ 64016 279086 220707 -41031 -427642 -68236 -263532 192490 -20453 355044 -166333
11889a73977g3218A0201O8983g0534A22786b10794h761l505m58715D37192b40366
$$ -173977 -73218 10201 79184 -70534 122786 -210794 -8761 -12266 -470981 437192 -240366
11877A20718j3399a37158f6121H9538i0590j86663a18319A78751H5493a27495
$$ 120718 107319 -137158 -66121 89538 -90590 -277253 -118319 178751 85493 -127495
11866B0754a03367G9520a08054N0143n2231k07914P4446j9690M1765A22316O3367
$$ 20754 -103367 79520 -108054 -57911 -110142 -318056 -243610 -263300 -221535 122316 185683
11855A85683C0636a48381q1194G1083b8838n0363A29207N3789b14730B63947j27876
$$ 185683 30636 -148381 -229575 71083 -28838 -79201 129207 182996 -214730 263947 136071
11844A36071b46044B67118D7052K49529d5252l1304p103G4707h6413A30917h7704
$$ 136071 -246044 267118 47052 296581 -45252 -76556 -83659 74707 -86413 130917 -87704
11832H0134B571J63568J1580a01745A36626a2013j07503r335K7050b4602E2396
$$ 80134 2571 166139 177719 -101745 136626 -12013 -119516 -128851 -101801 -24602 52396
11820b7682B98051A16071b01828A13572D0842N5071a84020M8720P736A17391c27987
$$ -27682 298051 116071 -201828 113572 40842 95913 -184020 -135300 -127564 117391 -327987
11808A4526a55149P1726B33961b92799Q0930f5392q519j4406C70508J51823B37315
$$ 14526 -155149 -83423 233961 -292799 -211869 -65392 -73911 -88317 370508 522331 237315
11796a48978A22625D5954a31699c8866B88709C836a60916j42767e5432h368A15319
$$ -148978 122625 45954 -131699 -38866 288709 3836 -160916 -303683 -55432 -8368 115319
11784D897b4923B02247b37063C3646a93940B697M6718c40064J23923D7746K2497
$$ 4897 -24923 202247 -237063 33646 -193940 2697 49415 -340064 -216141 47746 70243
11773G0243J03480k8310d69986a10959C14681a96864F5139a10877n1213A74927
$$ 70243 173723 145413 -469986 -110959 314681 -196864 65139 -110877 -162090 174927
11762b44380J00936D071J23475a47748A27823c13337I618g8297J1800n2559N6079
$$ -244380 -143444 4071 127546 -147748 127823 -313337 9618 -78297 -66497 -119056 -62977
11751f2977G0514e5888A34943a61135B0294a76212g1786A84420q9652b36069N6493
$$ -62977 70514 -55888 134943 -161135 20294 -176212 -71786 184420 94768 -236069 -179576
11740a79576c1296N230C46510a89008h7189o6343A7617a30112A99511a37679D1929
$$ -179576 -31296 -26066 346510 -189008 -87189 -153532 17617 -130112 199511 -137679 41929
11728a16739D1186O2196a33147o2647B76310N3403k5705f2741k13782A50526d6338
$$ -116739 41186 103382 -133147 -195794 276310 329713 304008 -62741 -276523 150526 -46338
11716A7075K85291b10863c5980m2357J7507A35538o0986J8884a9055A95665a7212
$$ 17075 302366 -210863 -35980 -78337 -60830 135538 74552 93436 -19055 195665 -17212
11704D6527a80221A34798c50104C4866J7651R4961K89715e2957l44080A4912b46208
$$ 46527 -180221 134798 -350104 34866 52517 147478 437193 -52957 -397037 14912 -246208
11692A36174i8742c3821C73043F430c75212A12899I64L31944B2297J38172a28919
$$ 136174 -98742 -33821 373043 6430 -375212 112899 964 332908 22297 160469 -128919
11680b07495d9149q275k73164a14321B03311C0594J01322M3655D9244K87313b56142
$$ -207495 -49149 -57424 -330588 -114321 203311 30594 131916 175571 49244 336557 -256142
11668d44375D3010f6981A34077l4225g6006K5859C4924K41714b786A47061J69443
$$ -444375 43010 -66981 134077 99852 -76006 -50147 34924 276638 -2786 147061 316504
11657C16504C5176b05892K3218O1240e4873j4002l760C9835R2908c47834A95060
$$ 316504 35176 -205892 -182674 -121434 -54873 -68875 -72635 39835 132743 -347834 195060
11645A09108b5739A42019a17705C8378P5999c8528A23885b432n467k08679a3574
$$ 109108 -25739 142019 -117705 38378 114377 -38528 123885 -2432 -7899 -216578 -13574
11633B07701a9366n0415I1472h2402q566B9102J4012A7572b7625B10773n2953
$$ 207701 -19366 -69781 91472 -82402 -90968 29102 43114 17572 -27625 210773 157820
11622A57820a01220j54305F0104K04894C1705L1137e9187A78009a14256B44051
$$ 157820 -101220 -255525 60104 264998 31705 62842 -59187 178009 -114256 244051
11611A87463b87476A71042G5130B4515b03744i4059C33642a38681A24893O3118
$$ 187463 -287476 171042 75130 24515 -203744 -94059 333642 -138681 124893 188011
11601A88011a46309B50331F3708c36186A09983D4858j5202a82049B63096c0350
$$ 188011 -146309 250331 63708 -336186 109983 44858 29656 -182049 263096 -30350
11590F0400j6434b3868m1802K3653B22231h7769k947c6939k63963b4988k16855
$$ 60400 43966 -23868 -65670 -42017 222231 -87769 -90716 -36939 -300902 -24988 -241843
11579b41843a3475A90528a11462n1621D06a54749e370C49232L4185g7618A74992
$$ -241843 -13475 190528 -111462 -163083 406 -154749 -5370 349232 383417 -77618 174992
11567c1788j6104E22719a6545A91282a65722C01896j24351k2778B0688P9430K53586
$$ -31788 -47892 522719 -16545 191282 -165722 301896 177545 154767 20688 100118 353704
11556C53704A24893f6248A49718j3726b64753A54556f6551q2226I021d7881F1550
$$ 353704 124893 -66248 149718 135992 -264753 154556 -66551 -148777 9021 -47881 61550
11544b37481I0983L6527b05669A13338m0817K91685a55904a2662I0627P8823G248
$$ -237481 90983 127510 -205669 113338 72521 364206 -155904 -12662 90627 169450 7248
11532B94727A28785R3481a9137I5446J26097J35699m5007F02R4964e9950A14089
$$ 294727 128785 222266 -19137 95446 221543 357242 312235 602 95566 -59950 114089
11520g7450q4482C2229L37893r4182j14344p2681K17175A7997M3062M83454j92706
$$ -77450 -161932 32229 370122 275940 161596 88915 306090 17997 61059 544513 351807
11509C51807j67167C6972a96733f8990B2994n090P5410i6512l8261d794D08633
$$ 351807 184640 36972 -196733 -68990 22994 17904 93314 -96512 -134773 -4794 408633
11497C36305A04745K78429b48874B41689G708a94293C72765b3965H1203d9198
$$ 336305 104745 383174 -248874 241689 7708 -194293 372765 -23965 81203 -49198
11486i0157E9969a05024H3200P4016G7187J23899l6788b74260A88173i1353A04557
$$ -90157 59969 -105024 83200 157216 77187 201086 164298 -274260 188173 -91353 104557
11474A12855J46241r8493h4840k1520B03125q7433L55829m3561H442L62096G4912
$$ 112855 259096 160603 -84840 -106360 203125 115692 471521 427960 8442 370538 74912
11462f1110C2526K30840i1921B57492l2055J37778F7668c44499a15924K8256F4765
$$ -61110 32526 263366 -91921 257492 225437 363215 67668 -344499 -115924 -87668 64765
11450A23749c06856P6749G0497O6629N796b06942A86820E8773B4694R1944J16704
$$ 123749 -306856 -230107 70497 137126 142922 -206942 186820 58773 24694 116638 233342
11439B33342J08579j07161K5149b72827H7828J28899a01513k57913a07474A45918
$$ 233342 341921 234760 259909 -272827 87828 216727 -101513 -359426 -107474 145918
11428a94223j7272h3681a2558k78635C46038b49670G0725L8317R8660C1229b03819
$$ -194223 -211495 -83681 -12558 -291193 346038 -249670 70725 109042 207702 31229 -203819
11416a1979j02108j5086N1718K5329C11428A7139a8129b198I4142C1470K9220
$$ -11979 -114087 -129173 -77455 -52126 311428 17139 -18129 -2198 94142 31470 60690
11405F0690P8866K65991E4839P9608h307q3406b6909k63218B29629N1044c39343
$$ 60690 139556 405547 54839 134447 -8307 -91713 -26909 -290127 229629 280673 -339343
11393B64579H8411j7057b73739B16964a19135j63094I634e0378k90303a02519
$$ 264579 88411 71354 -273739 216964 -119135 -282229 9634 -50378 -340681 -102519
11382a19316B58109d4629C1319a22114l19317C63918p2169A43422m7368J43833
$$ -119316 258109 -44629 31319 -122114 -441431 363918 291749 143422 96054 239887
11372B39887J18181g4466m9491B13868B3321a1092A08660a23742c1499k93252
$$ 239887 358068 -74466 -123957 213868 23321 -11092 108660 -123742 -31499 -324751
11362c24751A5596J18509b4039j34733k39363A37094f615j00417o6268h6408j08245
$$ -324751 15596 134105 -24039 -158772 -398135 137094 -6615 -107032 -173300 -86408 -194653
11351a94653A16922J09000a09646r0818C9844a9140A12315c8055n3053A40105
$$ -194653 116922 225922 -109646 -200464 39844 -19140 112315 -38055 -91108 140105
11340I8149Q7753a17993I0252Q3120p2830c58472e6457J9134B30669a05775H9112
$$ 98149 185902 -117993 90252 173372 100542 -358472 -56457 -37323 230669 -105775 89112
11328b99398A3332b25712C48133C3891c8640A27550E1259J72855b73507D5662
$$ -299398 13332 -225712 348133 33891 -38640 127550 51259 224114 -273507 45662
11317A3787e3742B22694G5711Q074f2380j78732a46k7816k10252N9862n5209B5487
$$ 13787 -53742 222694 75711 83785 -62380 -241112 -146 -27962 -238214 -178352 -233561 25487
11304a67575N5093b7397A23946F0657i6124j64846E0152O7491m5456b4904k93520
$$ -167575 -112482 -27397 123946 60657 -96124 -260970 50152 117643 72187 -24904 -318424
11293c18424A82745p564a15941a8282l2101r6349d4640B85792H8567R6796b15796
$$ -318424 182745 175181 -115941 -18282 -50383 -146732 -44640 285792 88567 185363 -215796
11281B98048c29570i5532r0865A62777a95116K5812h2164k70489D9357O350h6910
$$ 298048 -329570 -95532 -186397 162777 -195116 -169304 -82164 -352653 49357 55707 -86910
11269a60492k05728J60317i4675c585j37972f4918H1287c41635a42637d2334D131
$$ -160492 -366220 -205903 -94675 -3585 -141557 -64918 81287 -341635 -142637 -42334 4131
11257b53822k448a08595C66705D3518f793j11420A5048P0185a08725p3002N7875
$$ -253822 -256270 -108595 366705 43518 -6793 -118213 15048 85233 -108725 -181727 -123852
11246a23852k70930A8978a73472r1839N085B68877C4158g0148a9652o5080j38531
$$ -123852 -394782 18978 -173472 -265311 -260226 268877 34158 -70148 -19652 -84732 -223263
11235b23263J03729M4591c1565m94167a21324b890j09102B31056n9508G4340J33747
$$ -223263 -119534 -74943 -31565 -525732 -121324 -2890 -111992 231056 171548 74340 208087
11224B08087c5997A73215c316A56257b6829A10875R486a19738j24898A05990f0194
$$ 208087 -35997 173215 -3316 156257 -26829 110875 120361 -119738 -244636 105990 -60194
11212c00773P4073a3076A37474J68595c8400r9570C652a21336k6566A52329J05750
$$ -300773 -226700 -13076 137474 306069 -38400 -137970 3652 -121336 -147902 152329 258079
11201B58079G3394k5460N3199c6084F514J0461i6450a3714o8439A43589a23209
$$ 258079 73394 47934 101133 -36084 6514 16975 -96450 -13714 -82153 143589 -123209
11189c9562j40473A81108b32292C05394B2534K48067k4636j18979j033i4418A77543
$$ -39562 -180035 181108 -232292 305394 22534 270601 245965 126986 125953 -94418 177543
11177H5739h1637L1467b0840G57J19866c25904H4934B396b83786B02700J79385
$$ 85739 -81637 -50170 -20840 757 120623 -325904 84934 2396 -283786 202700 382085
11166C82085a938k20268P8666p5154c8263A02849N5235b55379l480j6584J16840
$$ 382085 -1938 -222206 -143540 -218694 -38263 102849 158084 -255379 -258859 -275443 -158603
11155a58603B45143d03482a45219j40A43101e4645A80393p8058J4705b4067q0620
$$ -158603 245143 -403482 -145219 -145359 143101 -54645 180393 102335 117040 -24067 -104687
11144a04687l5148B20718d6055b0202r8869B69963b00277A22088c5404K927D4111
$$ -104687 -139835 220718 -46055 -20202 -119071 269963 -200277 122088 -35404 -32477 44111
11132a21168A24932j2891K33568c22767E6384a76799A85168K67388n1113H1790
$$ -121168 124932 112041 345609 -322767 56384 -176799 185168 452556 401443 81790
11121c92496J50858E4449i5393C5256e7933A93063i7795A915R169d9845B3281
$$ -392496 -241638 54449 -95393 35256 -57933 193063 -97795 1915 11084 -49845 23281
11109h5172A31889i7291B5015L88237G6382a0968B32522F8706J90977O1364n5253
$$ -85172 131889 -97291 25015 413252 76382 -10968 232522 68706 259683 321047 265794
11098B65794R2588A37818M4921d080B34586J20710A74899a41288A06428L8781
$$ 265794 358382 137818 182739 -4080 234586 355296 174899 -141288 106428 145209
11088A45209J89142I5070L09154J05847C2521K62802E1604J3242h0834A71737
$$ 145209 334351 95070 404224 510071 32521 295323 51604 64846 -80834 171737
11077B11559P5813l5231J110K65141B4447O01653k64938Q0410B14633K63455k9225
$$ 211559 287372 252141 253251 518392 24447 626100 361162 441572 214633 478088 448863
11066D48863A40439L83369J46658l07334K5997m865K00050J69502j34310o51k48350
$$ 448863 140439 523808 670466 363132 389129 384264 584314 753816 619506 618855 370505
11055C70505N23108m02976M1813M45514k60544J29327k92436K47757C18729J08505
$$ 370505 893613 490637 532450 977964 717420 846747 554311 802068 318729 427234
11045D27234R1721A37915L82001M2771j4440J35197n2007J05335l11072L79875
$$ 427234 518955 137915 519916 562687 548247 683444 631437 736772 425700 805575
11035H05575l87462J35383k27001K98284K13310j27832j56604J7199J57203J30561
$$ 805575 418113 553496 326495 624779 838089 710257 553653 570852 728055 858616
11025H58616K43704k45434l92449J00644j32311J72209k61365M253m8950j20246
$$ 858616 1102320 856886 464437 565081 432770 604979 343614 347867 298917 178671
11015A78671O40016k70852m8762J89483j2985k55153m1205K85069j43445J58234
$$ 178671 818687 547835 499073 688556 675571 420418 379213 664282 520837 679071
11005F79071L5012L524m0516p4756L55313D22862O06467k11593P4662o808k63916
$$ 679071 714083 717607 677091 602335 957648 422862 1029329 817736 892398 885590 621674
10994F21674o9604j35015K94867K03437l43717L28916l12914K04705j77593N11488
$$ 621674 552070 417055 711922 915359 571642 900558 587644 792349 614756 1126244
10984A126244j41777o3984K50299j23768K41726L1330K59583k1304J96533J04943
$$ 1126244 984467 920483 1170782 1047014 1288740 1320070 1579653 1558349 1754882 1859825
10974A859825M99272L40507m4246K98927K00236m56394l5386m43394l08421j45065
$$ 1859825 2359097 2699604 2655358 2954285 3154521 2698127 2662741 2219347 1910926 1765861
10964A765861q1854j68678N9945m31126J88501N3823k66746K09948o4158K44740
$$ 1765861 1684007 1515329 1575274 1144148 1332649 1386472 1119726 1329674 1265516 1510256
10954A510256k5663m75899k04608N02056l35319l22817Q9619l12747n1458J66200
$$ 1510256 1484593 1008694 804086 1306142 970823 648006 737625 424878 373420 539620
10944E39620k66623F8932P20452C38851g3920B0369b4890A39012n2282g2178A76681
$$ 539620 272997 68932 789384 338851 -73920 20369 -24890 139012 86730 -72178 176681
10932H4335a13854G1955b25173d7673A73771o8880J52178A8439a71778r079A9386
$$ 84335 -113854 71955 -225173 -47673 173771 104891 257069 18439 -171778 -180857 19386
10920B9080R145f4086A88555a77453N0982g869A52250b93920G5258K43364a37090
$$ 29080 38225 -64086 188555 -177453 -126471 -7869 152250 -293920 75258 318622 -137090
10908F1909b9545j15898b4512A18836b6283I6041a29919F679b23909j17406C44107
$$ 61909 -29545 -145443 -24512 118836 -26283 96041 -129919 6679 -223909 -341315 344107
10896A26152K5427G3544C6212a87685A9348J0562a32211l5145H6491P5298a01963
$$ 126152 151579 73544 36212 -187685 19348 29910 -132211 -167356 86491 161789 -101963
10884A7902M733J79717a7320B57967k541e5418C2105J22e3692o784j1456l24220
$$ 17902 22635 202352 -17320 257967 255426 -55418 32105 32227 -53692 -60476 -71932 -396152
10872c96152J36316D6425B0663b02306k03184J45515C03693a72613G9836J3208
$$ -396152 -259836 46425 20663 -202306 -405490 -259975 303693 -172613 79836 93044
10862I3044I134K79061a29054A62661p9341K3228m6953e533j3035m7914q2477
$$ 93044 9134 288195 -129054 162661 83320 106548 59595 -5533 -18568 -66482 -148959
10851a48959M8054K7513K9634j21260A96946h9218j11848d3685I6823B7722e5944
$$ -148959 -100905 -73392 -43758 -165018 196946 -89218 -201066 -43685 96823 27722 -55944
10839a71782d7036j7616J9922j3738k61492a36727C23978b38303l0896D07611
$$ -171782 -47036 -64652 -44730 -58468 -319960 -136727 323978 -238303 -269199 407611
10828a33526r9717R4201k2567A23862c08705h1616K3310A35311a37699D1674j8374
$$ -133526 -233243 -139042 -161609 123862 -308705 -81616 -58306 135311 -137699 41674 23300
10817B3300f6033m7300A24249A0253c06450a19925k70898C76404f1353l22941
$$ 23300 -66033 -113333 124249 10253 -306450 -119925 -390823 376404 -61353 -384294
10807c84294B5359c28279h3152A45428f0912j03762A41674h0496q4838K361D2799
$$ -384294 25359 -328279 -83152 145428 -60912 -164674 141674 -80496 -165334 -162973 42799
10795a54514f0825D0758g3786k18820c1524o8036k3942B60200a45466B9465Q9166
$$ -154514 -60825 40758 -73786 -292606 -31524 -99560 -123502 260200 -145466 29465 118631
10784A18631d01102J24201L2811h5867l83081b16753R3230A86894K95893c63308
$$ 118631 -401102 -276901 -244090 -85867 -468948 -216753 -123523 186894 482787 -363308
10773h1391A1209J1301f8878j62161c5163E9897L8037O7780j4983R1913d7842
$$ -81391 11209 22510 -68878 -231039 -35163 59897 97934 165714 150731 242644 -47842
10761B52245B173b45218J20080C9232R7117N6859C4354J45891a74607f7650m2949
$$ 252245 2173 -245218 -125138 39232 136349 193208 34354 180245 -174607 -67650 -110599
10750a10599j09687J7319P7022j49657c13C16572b13515G1039e0136F1476B2283
$$ -110599 -220286 -202967 -125945 -275602 -313 316572 -213515 71039 -50136 61476 22283
10738f4101A57627a27214I1243K73079H7449b48066i6875a5686j74854B76843
$$ -64101 157627 -127214 91243 364322 87449 -248066 -96875 -15686 -190540 276843
10727A6856K21028c5397I9435a68539A96985b47518J6228A35576a55505d7348
$$ 16856 237884 -35397 99435 -168539 196985 -247518 -231290 135576 -155505 -47348
10716e7079B19938R5086j47283o4476J50385E9572P1713b28950a2288B11244a58590
$$ -57079 219938 315024 167741 103265 253650 59572 131285 -228950 -12288 211244 -158590
10704C5544L8846a83035A6552c01608F0959a40235j22926A06748b16865M3751
$$ 35544 74390 -183035 16552 -301608 60959 -140235 -263161 106748 -216865 -173114
10694a73114a9077j12585B20475q4444g753C061L5339c93687o1510d4520A07020
$$ -173114 -19077 -131662 220475 136031 -7753 3061 38400 -393687 -455197 -44520 107020
10682a22315k11860h3637o8992q7206A51696a0809j92727K097B22363h8353D1622
$$ -122315 -334175 -83637 -152629 -239835 151696 -10809 -203536 -201439 222363 -88353 41622
10670B64858b97581B8812L4450h3928O53K3382j88057J05085k79852B0473e02433
$$ 264858 -297581 28812 63262 -83928 -83275 -59893 -247950 -142865 -422717 20473 -502433
10658a85857A6148f8615b8334m1759B2431c79679a80611P2992B13128a3013k54245
$$ -185857 16148 -68615 -28334 -70093 22431 -379679 -180611 -107619 213128 -13013 -267258
10647b67258B52753a1587j93093e2042F2238J82503J55449a51662e165k51086
$$ -267258 252753 -11587 -204680 -52042 62238 244741 400190 -151662 -5165 -256251
10637b56251C247K38908b1728r6642d6526j61114L3981q4214b6804k93286k6560
$$ -256251 3247 242155 -21728 -118370 -46526 -207640 -173659 -257873 -26804 -320090 -346650
10626c46650d5936j81621q2481F2673q734a71435D0485J49228c07510A46690G045
$$ -346650 -45936 -227557 -310038 62673 53939 -171435 40485 189713 -307510 146690 7045
10614H59b21080n294E9560J08122f6779j1425F7248a22824o7695a6002j82598
$$ 859 -221080 -226374 59560 167682 -66779 -78204 67248 -122824 -190519 -16002 -198600
10603a98600A43425F1233c3091j63721j843D3703d6849J1222a6132k0146a3375
$$ -198600 143425 61233 -33091 -196812 -198655 43703 -46849 -35627 -16132 -36278 -13375
10591A06558h2765r5286F2387J77862c22926a61249c5876A8371b22357C0181b22919
$$ 106558 -82765 -178051 62387 240249 -322926 -161249 -35876 18371 -222357 30181 -222919
10579B9511i7690l2475E218e84572a68716f5018j25694k31115a79679L5053O8882
$$ 29511 -97690 -130165 5218 -584572 -168716 -65018 -190712 -421827 -179679 -144626 -75744
10568g5744a455k28598j26160J34179p0447a17460J9382j70839J08799B85189
$$ -75744 -1455 -230053 -356213 -222034 -292481 -117460 -98078 -268917 -160118 285189
10557B00719N7978b0769l0415m5269I102a29810A97460B715a22949A51070f9387
$$ 200719 258697 -20769 -51184 -96453 9102 -129810 197460 2715 -122949 151070 -69387
10545b22774A8135g5633A5397c7834F5568N3059a59550O8800A9567a29724j98627
$$ -222774 18135 -75633 15397 -37834 65568 118627 -159550 -90750 19567 -129724 -328351
10534c28351a8890k75799b6027m802k80331i2815j88647B76221c44638B2122a35693
$$ -328351 -18890 -294689 -26027 -30829 -311160 -92815 -281462 276221 -344638 22122 -135693
10522A60257J18658a10028I8806b47715I6260J90144c3683B8334K08756M4368
$$ 160257 278915 -110028 98806 -247715 96260 286404 -33683 28334 237090 281458
10512B81458Q061m4047b6384B38521A7871J17385k9851N13933a7997C0376J05799
$$ 281458 289519 245472 -26384 238521 17871 135256 105405 619338 -17997 30376 136175
10501A36175A2524d9426j8180B26855G9626a9925A73136d7789G2149a05145K6193
$$ 136175 12524 -49426 -67606 226855 79626 -19925 173136 -47789 72149 -105145 -78952
10490g8952D3417d07730a02517H7361M7558L4944a40002A72839a61251D78694
$$ -78952 43417 -407730 -102517 87361 134919 169863 -140002 172839 -161251 478694
10479B57168N2320j11158I1583g5564A40925R2434q7734f5175B37466A06729J01372
$$ 257168 309488 198330 91583 -75564 140925 233359 145625 -65175 237466 106729 208101
10468B08101C1559J12013a17911k72364a01714j00253H4303a47010j17688A20103
$$ 208101 31559 143572 -117911 -390275 -101714 -201967 84303 -147010 -264698 120103
10457E8045a49075f570q4245A09391i2519A00785m0346g4985k5595D2635K26352
$$ 58045 -149075 -6570 -90815 109391 -92519 100785 60439 -74985 -100580 42635 268987
10446B68987E4210A4186a73646L6642B8139b45205A57117n0094O97h2786c4744
$$ 268987 54210 14186 -173646 -137004 28139 -245205 157117 107023 107720 -82786 -34744
10434B22757g7871H4295A3946J79076D1573d9407r9707j0581K8784A89923b65470
$$ 222757 -77871 84295 13946 193022 41573 -49407 -149114 -159695 -130911 189923 -265470
10422e4837A52097c56608a17987H0844j8257a07678j29612G6856J8847b37354
$$ -54837 152097 -356608 -117987 80844 62587 -107678 -237290 76856 95703 -237354
10411D8985A7867Q3258L43854k17811c05747e2232j54545a8353l33832b4920B18565
$$ 48985 17867 101125 444979 227168 -305747 -52232 -206777 -18353 -352185 -24920 218565
10399c53221a1479A22290K66966C1257K29747h8313C89672C4543J60792O7387
$$ -353221 -11479 122290 389256 31257 261004 -88313 389672 34543 195335 262722
10389B62722C0841d20526E4288a08179A02351i1589D9843A349O428K35639b06697
$$ 262722 30841 -420526 54288 -108179 102351 -91589 49843 1349 7777 243416 -206697
10377B43990b17337B46245J066K34897D2734L12895j76640O8516O8186M3057A04627
$$ 243990 -217337 246245 247311 482208 42734 355629 178989 247505 315691 358748 104627
10365C96495A82940L98785F8711B9265D451L04869r6362l2314N9349f0368B51009
$$ 396495 182940 581725 68711 29265 4451 309320 212958 180644 239993 -60368 251009
10353B73367J12671M40966l88273O0206K60928C29209J49411R9526B70344G9527
$$ 273367 386038 827004 438731 498937 759865 329209 478620 578146 270344 79527
10342B95561Q7470j51557Q5345H5320M6813f8401A65063n2687e5088C5686O6337
$$ 295561 383031 231474 316819 85320 132133 -68401 165063 112376 -55088 35686 102023
10331A02023K9875J91767j03677e9725B06273j1225F2816M1964a09595C1691f4182
$$ 102023 131898 323665 219988 -59725 206273 195048 62816 104780 -109595 31691 -64182
10319b4296A25086K45340f6757G5544K31766A17388D2793J21906e8923j55010
$$ -24296 125086 370426 -66757 75544 307310 117388 42793 164699 -58923 -213933
10309b13933A17775a81770d1223F2430b95376A0377a14236A04294D1875C8J18319
$$ -213933 117775 -181770 -41223 62430 -295376 10377 -114236 104294 41875 38 118357
10298A18357j1007b06516P141k97439A66185c11994F6833j0439b9547G260h2688
$$ 118357 107350 -206516 -199375 -496814 166185 -311994 66833 56394 -29547 7260 -82688
10286G692J62103q0259b23855a03923B56364g6421c4339k4731l30686a8098p0512
$$ 7692 169795 89536 -223855 -103923 256364 -76421 -34339 -59070 -389756 -18098 -88610
10275h8610d1865C22518q0301b8467l07678A70674B5866K9976e1190j1902C45883
$$ -88610 -41865 322518 242217 -28467 -336145 170674 25866 55842 -51190 -63092 345883
10263d4703A61200o1639e2532A80432M0830J76662j83064F6299L4142m1881K8996
$$ -44703 161200 99561 -52532 180432 221262 397924 214860 66299 100441 58560 87556
10252H7556C6836K2777M3098J45006e5855K700B25683a56181H7270k5525j5432
$$ 87556 36836 59613 102711 247717 -55855 -53155 225683 -156181 87270 61745 46313
10241D6313a10091M7099j66425l2208r7740Q2800e4711A65411J32629G2555B5325
$$ 46313 -110091 -62992 -229417 -261625 -359365 -276565 -54711 165411 298040 72555 25325
10229A54557F8113P4527l0064J80682n4204d0229l7276B85265j08838b4209B45468
$$ 154557 68113 142640 112576 293258 239054 -40229 -77505 285265 176427 -24209 245468
10217a92933A30152h7902p8391f9886m0121A04641l2364A2655a91811A71462b0262
$$ -192933 130152 -87902 -166293 -69886 -110007 104641 72277 12655 -191811 171462 -20262
10205B75021b62902A4439a05280N312E5060i0358p0870M5339E2440a3196l31216
$$ 275021 -262902 14439 -105280 -99968 55060 -90358 -161228 -115889 52440 -13196 -344412
10194c44412e1394k22989b267k94156i4817B63832J6992a57487b9558B27477b25545
$$ -344412 -51394 -274383 -2267 -296423 -94817 263832 280824 -157487 -29558 227477 -225545
10182e7190C9450L1340b8333a1759B25074m9444e1793B44250a4281k02483L4154
$$ -57190 39450 70790 -28333 -11759 225074 175630 -51793 244250 -14281 -216764 -182610
10171a82610a3597j72483c2611A00125J858D3528K34894q8225g0792j88744a09195
$$ -182610 -13597 -186080 -32611 100125 101983 43528 278422 190197 -70792 -259536 -109195
10159A15102J5873J41747b01972A28695f3772G960a08848M6864k58796J24010
$$ 115102 130975 272722 -201972 128695 -63772 7960 -108848 -61984 -320780 -196770
10149a96770A3642a09571e536B36357D6292J31483d4379p6507F7371R8356b63660
$$ -196770 13642 -109571 -5536 236357 46292 177775 -44379 -120886 67371 165727 -263660
10137a86172K5382D1017K02024E5531c27053c9089A09752a27289k4359h185A40476
$$ -186172 -160790 41017 243041 55531 -327053 -39089 109752 -127289 -151648 -8185 140476
10125c32131R6759i6117j30867A17567b50555I0215a78177O5473j78513B0843
$$ -332131 -235372 -96117 -226984 117567 -250555 90215 -178177 -112704 -291217 20843
10114a30331k10140H3125J04042D0922J83746d0076j4447G6574b91650h299j19757
$$ -130331 -340471 83125 187167 40922 224668 -40076 -54523 76574 -291650 -8299 -128056
10103a28056E1837a16451l7311j22181J08914k01870a64115I8493K49041j50927
$$ -128056 51837 -116451 -153762 -275943 -167029 -368899 -164115 98493 347534 196607
10093A96607a53701j01157d8065l4432k34667F1266d3255k72601B48589E7949
$$ 196607 -153701 -254858 -48065 -82497 -317164 61266 -43255 -315856 248589 57949
10082A6202d7536j95562E2374b73002H7540a08719m3671c321k25614R1096C25550
$$ 16202 -47536 -243098 52374 -273002 87540 -108719 -152390 -3321 -228935 -137839 325550
10070F5570g485j72712J2439I8043Q0169b61283C93337B5995d40734A38836b57229
$$ 65570 -7485 -180197 -167758 98043 178212 -261283 393337 25995 -440734 138836 -257229
10058c905D5107N6166g2903k66713H9235M6452l2980c4265A7259b65376c6196
$$ -3905 45107 101273 -72903 -339616 89235 135687 102707 -34265 17259 -265376 -36196
10046b781A44824b71239J02521F5638b33997K4269j25907A30893O4375Q186b10843
$$ -2781 144824 -271239 -168718 65638 -233997 -209728 -335635 130893 195268 203454 -210843
10034c4481k09388a9974m0058A44357d69186G3794a84389b1950k5468A57308D5764
$$ -34481 -243869 -19974 -60032 144357 -469186 73794 -184389 -21950 -47418 157308 45764
10022h8000K4614c0898e283A8184b72263B12758a34875c6972j84944O680L2935
$$ -88000 -63386 -30898 -5283 18184 -272263 212758 -134875 -36972 -221916 -215236 -182301
10011a82301k19950A4553J45346l575b55377F3162K4302k9489B4366f3913o5370
$$ -182301 -402251 14553 159899 156324 -255377 63162 87464 57975 24366 -63913 -129283
10000a29283E2162A1672a5295A27174N0349f4388l06454b1235B04572b11822j9487
$$ -129283 52162 11672 -15295 127174 177523 -64388 -370842 -21235 204572 -211822 -231309
9989b31309A1204L955Q1224c8019I0230c50777A58224h4512C0007a54532C03217
$$ -231309 11204 15159 96383 -38019 90230 -350777 158224 -84512 30007 -154532 303217
9977b1236o3011j0989a0230l0423j33032k0660B1507a74547B59387p4695a00164
$$ -21236 -84247 -95236 -10230 -40653 -173685 -194345 21507 -174547 259387 184692 -100164
9965b75136D5702Q0669P0416a31758H912b14735K7148g5097p8442J2I3315a54112
$$ -275136 45702 126371 196787 -131758 8912 -214735 -187587 -75097 -153539 -153527 93315 -154112
9952e2811J6635k240j44860F8286b11397B32030b57000h9226j61125g3204A09164
$$ -52811 -36176 -38416 -183276 68286 -211397 232030 -257000 -89226 -250351 -73204 109164
9940c15141A02733b6640j23346F1087j0768b87337b6506p4286j66090G7945e7018
$$ -315141 102733 -26640 -149986 61087 50319 -287337 -26506 -100792 -266882 77945 -57018
9928B23735k0225c04781g7090A29335K13448e0709m2421F0144a48283l0476P1500
$$ 223735 203510 -304781 -77090 129335 342783 -50709 -93130 60144 -148283 -178759 -107259
9917a07259j6131p8371j10014A825d2307C05623c65201g9437A27131c56771A51128
$$ -107259 -123390 -201761 -311775 1825 -42307 305623 -365201 -79437 127131 -356771 151128
9905b9421F63J39791L2922E8815A8813K8317J26971a17588D4274a23679B09552
$$ -29421 663 140454 173376 58815 18813 47130 174101 -117588 44274 -123679 209552
9893A07495K7098a45468L3138c5108j89504c2240E5675c4639J6576m7115c180
$$ 107495 134593 -145468 -112330 -35108 -224612 -32240 55675 -34639 -18063 -65178 -3180
9881e693r9802p868j02550g7339A5620c00341h3970j42099h9731j62865J02359
$$ -5693 -105495 -113363 -215913 -77339 15620 -300341 -83970 -226069 -89731 -252596 -150237
9870a50237A82334n4593g5904k1113H613f2086k2121m68464A45297e8365A03660
$$ -150237 182334 127741 -75904 -97017 8613 -62086 -84207 -552671 145297 -58365 103660
9858I0518b44618J05778D6721a28484e1705f111q7773B1438c2027D3114a24395
$$ 90518 -244618 -138840 46721 -128484 -51705 -6111 -93884 21438 -32027 43114 -124395
9846i9438I768c7331k00946i548j57607A73770a06291i104k25668A53555C8362
$$ -99438 9768 -37331 -238277 -9548 -167155 173770 -106291 -9104 -234772 153555 38362
9834b06379A3424h4786o2147o5878B56530E2633c66024C08097i905k4553B3033
$$ -206379 13424 -84786 -146933 -212811 256530 52633 -366024 308097 -9905 -34458 23033
9822B38379d2992j13463F954J8077b92182P4080L1137B38288C4274a61513B21990
$$ 238379 -42992 -156455 6954 25031 -292182 -218102 -186965 238288 34274 -161513 221990
9810I9124L7027a39287A53790n0924e68j86373P6591j27200m4086B18378c18133
$$ 99124 136151 -139287 153790 102866 -568 -186941 -110350 -237550 -281636 218378 -318133
9798b7016l78890a10320B27596f2583j35448J8286L2731G0938a97489Q8535a5311
$$ -27016 -405906 -110320 227596 -62583 -198031 -179745 -147014 70938 -197489 -108954 -15311
9786d52496A26162c8594A66689a64737j29018A47616C7402b37570P1037I8118
$$ -452496 126162 -38594 166689 -164737 -293755 147616 37402 -237570 -166533 98118
9775B56520E6079P995g0837j85495J09558N3686k29014A85761i7298F8906g9545
$$ 256520 56079 64074 -70837 -256332 -146774 -93088 -322102 185761 -97298 68906 -79545
9763A5766c43785a12313b008o101D77260C1390a70977C5453b16157D7494a2676
$$ 15766 -343785 -112313 -2008 -8109 477260 31390 -170977 35453 -216157 47494 -12676
9751i8209B97533f0467j38553P2209A20628a26676b285k28890A29354m8483J46894
$$ -98209 297533 -60467 -199020 -126811 120628 -126676 -2285 -231175 129354 80871 227765
9740B27765G2955a15351l3215J8345B89429a67576E141d34077a00462D5304d1528
$$ 227765 72955 -115351 -148566 -130221 289429 -167576 5141 -434077 -100462 45304 -41528
9728A6965a42628b8170A80945i3479j2935k03733A19311n5156b61125K9341c1766
$$ 16965 -142628 -28170 180945 -93479 -106414 -310147 119311 64155 -261125 -231784 -31766
9716b44960a08361j644E18066H6891J22637c00652B107a93643Q9071k82178a77938
$$ -244960 -108361 -110005 518066 86891 209528 -300652 2107 -193643 -104572 -386750 -177938
9704B9740c39325L4865J265G9426J6592f4694j8282A48062j9801a59774B26261
$$ 29740 -339325 -304460 -303195 79426 96018 -64694 -82976 148062 128261 -159774 226261
9692I1364e2831p1048n7821m3661O1573j76436J26471B938M4933O0026i1513j35061
$$ 91364 -52831 -123879 -181700 -225361 -163788 -340224 -213753 2938 47871 107897 -91513 -226574
9680b26574B9280K40482d02079a78857A14442a85967e1680m67969G2076d7742
$$ -226574 29280 269762 -402079 -178857 114442 -185967 -51680 -519649 72076 -47742
9669A7671c1101j77240h4733I6600c56681F6871P0552b99733J43891A98001b75279
$$ 17671 -31101 -208341 -84733 96600 -356681 66871 137423 -299733 -155842 198001 -275279
9657B6053i9873b0537n5110q206l1251O685B38688a31001A46659o2973e3423o2646
$$ 26053 -99873 -20537 -75647 -83853 -115104 -108419 238688 -131001 146659 83686 -53423 -116069
9645a16069j99336R1879m9859a08185K3810b961k19182o5940B0692J52858a09662
$$ -116069 -315405 -223526 -273385 -108185 -84375 -2961 -222143 -288083 20692 173550 -109662
9633H6308a02673J4454A39678b70198A19769d40672a61367l8767p5988A31625
$$ 86308 -102673 -88219 139678 -270198 119769 -440672 -161367 -200134 -276122 131625
9622c2000j19187j44421B4855e2854l6437J1633I774i3218j15288c2128r5071
$$ -32000 -151187 -295608 24855 -52854 -89291 -77658 9774 -93218 -208506 -32128 -127199
9611a27199k89377e2918o585l83703J36368a47007D2206c07822D58785C0472j3197
$$ -127199 -416576 -52918 -59503 -443206 -306838 -147007 42206 -307822 458785 30472 17275
9600A7275J90055a15953j21570j13289a33869H5402k6784k2121Q0054J63483B9234
$$ 17275 207330 -115953 -237523 -350812 -133869 85402 58618 36497 116551 280034 29234
9588b65273O3863f605B8581b47273G4310a21521J4554L7097C0896O7754L69212
$$ -265273 -201410 -6605 28581 -247273 74310 -121521 -106967 -69870 30896 98650 467862
9577D67862B27639b56855g0835o6709e4007A61621J00095C7117a38028I7804c6123
$$ 467862 227639 -256855 -70835 -137544 -54007 161621 261716 37117 -138028 97804 -36123
9565h8073m2857d9800K0591j29543A05746i3871P82G6515i2102K8350G6597l3458
$$ -88073 -130930 -49800 -29209 -158752 105746 -93871 -93089 76515 -92102 -63752 76597 43139
9553D3139b81483C326J6769a4901H9809D3136b03885r651j15029A0252L37982
$$ 43139 -281483 3326 20095 -14901 89809 43136 -203885 -213536 -328565 10252 348234
9542C48234a42559J8868A46957E4719a91224q3120a4787A25056L3479L4518f8977
$$ 348234 -142559 -123691 146957 54719 -191224 -274344 -14787 125056 158535 193053 -68977
9530d8057l5512l07557J63416j38162R622A24344A6263f1676q994b9554l8206
$$ -48057 -83569 -391126 -227710 -365872 -356250 124344 16263 -61676 -70670 -29554 -67760
9519f7760l33819J43260r5961G3997D597a10358b6547j63752B30683i0561C29268
$$ -67760 -401579 -258319 -354280 73997 4597 -110358 -26547 -190299 230683 -90561 329268
9507a51642O7916m9520j17088a06877C9476e2283r9740m6447a3005A65586h7856
$$ -151642 -83726 -133246 -250334 -106877 39476 -52283 -152023 -198470 -13005 165586 -87856
9495B62752a90025H1273J53974J08707c15550A48519a3599e312E478c4181l11945
$$ 262752 -190025 81273 235247 343954 -315550 148519 -13599 -5312 5478 -34181 -346126
9484c46126h1958l1340L4427a6578A68521a29696a4081A03667a20908j64515A0607
$$ -346126 -81958 -113298 -78871 -16578 168521 -129696 -14081 103667 -120908 -285423 10607
9472c10434A35323B5254N4568j8958b75443g8204m506k2254B21847F6699e37418
$$ -310434 135323 25254 79822 60864 -275443 -78204 -82710 -104964 221847 66699 -537418
9460B37751B5106a50436b9533r4624j82810J16289B6486K04000E8039b85847l896
$$ 237751 25106 -150436 -29533 -124157 -306967 -190678 26486 230486 58039 -285847 -289743
9449b89743B92884b53505R6684B18765c07414K5917E2584b02869n7128i2545c5053
$$ -289743 292884 -253505 -156821 218765 -307414 -281497 52584 -202869 -259997 -92545 -35053
9437A31475F4382J47246b97625C54895a59745k37374o0422e2505A01593h1345
$$ 131475 64382 211628 -297625 354895 -159745 -397119 -457541 -52505 101593 -81345
9426h9244j36885B7678M4673b47514J0813a08189a4463j97059B85643b21858N1384
$$ -89244 -226129 27678 72351 -247514 -236701 -108189 -14463 -211522 285643 -221858 -170474
9415a70474A36338a2093j73586A79710b9745A7325b99243b3995j58694C4203R8817
$$ -170474 136338 -12093 -185679 179710 -29745 17325 -299243 -23995 -182689 34203 133020
9404A33020h5160q5485e1116A7062d0557G9540J90449b02685A86339a54816j6754
$$ 133020 -85160 -170645 -51116 17062 -40557 79540 269989 -202685 186339 -154816 -171570
9393a71570M5461d7560C01563A42210j8517F944L2017c95071Q4732A26954a32349
$$ -171570 -126109 -47560 301563 142210 123693 6944 38961 -395071 -310339 126954 -132349
9381g5692G2054K6508h7690A15179a90011Q1845A0542K5943J11049a22610a4736
$$ -75692 72054 98562 -87690 115179 -190011 -108166 10542 36485 147534 -122610 -14736
9369A5887c59186a39476K2267B9655a10920o3993J7528L464C8337b14898k5792
$$ 15887 -359186 -139476 -117209 29655 -110920 -174913 -157385 -153921 38337 -214898 -240690
9358b40690C07556H5646J199h2594C9936R6231E5526a14765J6710j88590F8500
$$ -240690 307556 85646 86845 -82594 39936 136167 55526 -114765 -98055 -286645 68500
9346C24246j53237A055a00289q3894a3447o7244l08637D57932a54686L9496C3020
$$ 324246 171009 1055 -100289 -184183 -13447 -80691 -389328 457932 -154686 -115190 33020
9334b08450B30441h1867q4832k86229A63655a44807I7170k6389J2525a07904E499
$$ -208450 230441 -81867 -166699 -452928 163655 -144807 97170 70781 83306 -107904 5499
9322D947f0372B0235L5207b95746a34328E0568K77430e16005I2519a86785j44191
$$ 4947 -60372 20235 55442 -295746 -134328 50568 327998 -516005 92519 -186785 -330976
9311c30976f2997D0850c1895B0184a022k5140B2963J8401b48814B78850a10228
$$ -330976 -62997 40850 -31895 20184 -1022 -26162 22963 41364 -248814 278850 -110228
9299h3286j7698j721J416C662c15500Q0811l6118A99402b94401B11717b75355
$$ -83286 -100984 -102705 -101289 3662 -315500 -234689 -270807 199402 -294401 211717 -275355
9287h2834K131j88076J08726m3570C0790a02076j588M9672A99155f2483j09850
$$ -82834 -80703 -268779 -160053 -203623 30790 -102076 -103664 -53992 199155 -62483 -172333
9276a72333J2717F9651R2074D4176M7508J87171F2183a65658A06902c9790j92429
$$ -172333 -159616 69651 161725 44176 91684 278855 62183 -165658 106902 -39790 -232219
9265b32219I6737a7463n7866k5906C84023h9205F3610A5190e9432k66966Q2115
$$ -232219 96737 -17463 -75329 -101235 384023 -89205 63610 15190 -59432 -326398 -244283
9254b44283a6962m70961B00613h549j54626a649j55057D3988e1230A39192R5473
$$ -244283 -16962 -487923 200613 -8549 -163175 -1649 -156706 43988 -51230 139192 234665
9243B34665p3243b27577A32865c30694D0380a84360K8234k8746O6655j55253f9051
$$ 234665 161422 -227577 132865 -330694 40380 -184360 -156126 -184872 -118217 -273470 -69051
9231B4069J2930a34051b9979j91721j62349J76206A34966B5429a78252E3812A809
$$ 24069 36999 -134051 -29979 -221700 -384049 -207843 134966 25429 -178252 53812 1809
9219b20891i0390j6353j12797I5701b25916A2122d71553I7655M43045I5402d45990
$$ -220891 -90390 -106743 -219540 95701 -225916 12122 -471553 97655 540700 95402 -445990
9207a53164O9623j95018d8861b2625k45607O9880e364A86221h8866G960K67226
$$ -153164 -83541 -278559 -48861 -22625 -268232 -198352 -5364 186221 -88866 7960 275186
9196B75186a28977B72299b75424B854h0002c6557F683a73959p6669d2094D49858
$$ 275186 -128977 272299 -275424 2854 -80002 -36557 6683 -173959 -250628 -42094 449858
9184a90278k40690J81330d8820j11931A00301a52770q6191C49499A37004g8523
$$ -190278 -430968 -249638 -48820 -160751 100301 -152770 -238961 349499 137004 -78523
9173d87428a25994G3951C2941c35366h0656A31245E3535a03541m7619D6844a04887
$$ -487428 -125994 73951 32941 -335366 -80656 131245 53535 -103541 -151160 46844 -104887
9161b14919q979j84835J22290e543A19699F912a27304B10248i5453D1927L31a75201
$$ -214919 -223898 -408733 -286443 -5543 119699 6912 -127304 210248 -95453 41927 42258 -175201
9148B57152q1964a53793A18633a80375G6331b57334A82286b00021O4107M9635
$$ 257152 175188 -153793 118633 -180375 76331 -257334 182286 -200021 -135914 -86279
9138h6279E9426a05081r1627M6497n7688A62083m4923n5658n715Q0211n4242P6478
$$ -86279 59426 -105081 -196708 -150211 -207899 162083 117160 61502 55787 135998 81756 158234
9126A58234a51593j04167a13828E796J38311c38887J62852M4242R064A72450b83346
$$ 158234 -151593 -255760 -113828 5796 144107 -338887 -176035 -131793 -122729 172450 -283346
9114a22051A37746a57538A4116J64185q55D5532J48839J89605A03021b7998F119
$$ -122051 137746 -157538 14116 178301 177446 45532 194371 383976 103021 -27998 6119
9102a04244B2022g6786A7908B706d8896m2724B62524a76844A83163p009G7287
$$ -104244 22022 -76786 17908 2706 -48896 -91620 262524 -176844 183163 176154 77287
9090D4824g7217j37225f5559A3941C706K65421B7502c1045j50886O3714O702j57100
$$ 44824 -77217 -214442 -65559 13941 3706 269127 27502 -31045 -181931 -118217 -111515 -268615
9078b68615r0543f7323A9944a86152Q2607A74772O9761i4125C09036H7761R6546
$$ -268615 -359158 -67323 19944 -186152 -103545 174772 244533 -94125 309036 87761 184307
9067A84307d5630n8890k51661g3646j4406k04767c3946n2002o8261M3215C2905
$$ 184307 -45630 -104520 -356181 -73646 -88052 -292819 -33946 -85948 -154209 -110994 32905
9055A7800e0809o315p5058d6097n2231q7143A8895f215H6629J99830f0377n4909
$$ 17800 -50809 -57124 -132182 -46097 -98328 -185471 18895 -6215 86629 286459 -60377 -115286
9043a15286F1618B7079d61357a80274f1414N357j25878N5733B21786O4329a48642
$$ -115286 61618 27079 -461357 -180274 -61414 -56057 -181935 -126202 221786 286115 -148642
9031a20935A1248d35707a82567A0384J6127L36661c48374C7346a9705q4059I1391
$$ -120935 11248 -435707 -182567 10384 26511 363172 -348374 37346 -19705 -103764 91391
9019B89397b714k1127l42683B000a92382J3710L9246A31702l0841i8380k43352
$$ 289397 -2714 -23841 -366524 2000 -192382 -178672 -139426 131702 100861 -98380 -341732
9008c41732A86448d3901m7453I3482J36025d4985k56188A63302p8978f7477k56087
$$ -341732 186448 -43901 -91354 93482 229507 -44985 -301173 163302 84324 -67477 -323564
8997c23564A51979d79084b8142k15927j2029d7872G4023J91926d76382g8609i868
$$ -323564 151979 -479084 -28142 -244069 -256098 -47872 74023 265949 -476382 -78609 -9868
8985A75811d4122B79594c7514a5839k75843D3447J60153I5883a47597K2103J6566
$$ 175811 -44122 279594 -37514 -15839 -291682 43447 203600 95883 -147597 -125494 -108928
8974a08928j6671j69120C8360J38542b17906e1456A31766m6058a6755j44547K4395
$$ -108928 -125599 -294719 38360 176902 -217906 -51456 131766 85708 -16755 -161302 -136907
8963a36907j6037f0736r7402m8667J5283l41605d3446j38899C62356h6623a3143
$$ -136907 -152944 -60736 -158138 -206805 -191522 -533127 -43446 -182345 362356 -86623 -13143
8951b06491g6047A22293D4132M7824N7998C627a7061A47220f2516r1839L8775
$$ -206491 -76047 122293 44132 91956 149954 3627 -17061 147220 -62516 -154355 -115580
8940a15580M4581A15658N7784i1679l1650A34184J58812b17143G574J36017D6280
$$ -115580 -70999 115658 173442 -91679 -123329 134184 292996 -217143 7574 143591 46280
8928b01042B828a25897K4066D8175K07209o3046K38162O27896B58991a64787A04403
$$ -201042 2828 -125897 -101831 48175 255384 192338 430500 1058396 258991 -164787 104403
8916A04980l5213O7033j978b52061b7123C2209J7610r686h6620C2598a65223q6151
$$ 104980 69767 136800 134822 -252061 -27123 32209 49819 40133 -86620 32598 -165223 -251374
8904b51374A77686c72092C9683b22772N6876N9654A73631o4165a12046K4547a317
$$ -251374 177686 -372092 39683 -222772 -165896 -106242 173631 109466 -112046 -87499 -1317
8892B23902d0459j27622A13143a06275l8558c1268o6349c2813q233n4126B2986
$$ 223902 -40459 -168081 113143 -106275 -144833 -31268 -97617 -32813 -41046 -95172 22986
8880A62124C2037P0035A9567a17647A5377J04536J96493d78265a40286k6034H4810
$$ 162124 32037 102072 19567 -117647 15377 119913 316406 -478265 -140286 -166320 84810
8868d25012B32131B1200f5193A26444R5450a33784j01617j91659E792e6258b4656
$$ -425012 232131 21200 -65193 126444 221894 -133784 -235401 -427060 5792 -56258 -24656
8856g378o0882L3456k47734j565e28A78930b64575E6604f8418J563l9467B9763
$$ -7378 -68260 -34804 -282538 -284103 -528 178930 -264575 56604 -68418 -66855 -106322 29763
8843A17902E8415b38673j55314a61717j20614D9705b51404B23355k9461a41940
$$ 117902 58415 -238673 -393987 -161717 -282331 49705 -251404 223355 193894 -141940
$$ [...]
##END NTUPLES=NMR SPECTRUM
##END=
