##TITLE=AC1463_TOLI313269_7819355_85D92tqTSG
##JCAMPDX= 6.0         $$ Bruker NMR JCAMP-DX V2.0
##DATA TYPE= NMR SPECTRUM
##DATA CLASS= NTUPLES
##ORIGIN= BRUKER
##OWNER= Administrator
$$ 1.72 TOPSPIN		Version 2.1
$$ 2013-04-30 23:31:26.149 -0700  Administrator@X
$$ Compression mode = diff/dup
##.OBSERVE FREQUENCY= 400.02188249412
##.OBSERVE NUCLEUS= ^1H
##.ACQUISITION MODE= SIMULTANEOUS (DQD)
##.ACQUISITION SCHEME= undefined
##.AVERAGES= 8
##.DIGITISER RES= 22
##SPECTROMETER/DATA SYSTEM= spect
##.PULSE SEQUENCE= zg30
##.SOLVENT NAME= COFFEE_meoh
##.SHIFT REFERENCE= INTERNAL, COFFEE_meoh, 1, 14.98509
##AUDIT TRAIL= $$ (NUMBER, WHEN, WHO, WHERE, PROCESS, VERSION, WHAT)
$$ ##TITLE= Audit trail, TOPSPIN		Version 2.1
$$ ##JCAMPDX= 5.01
$$ ##ORIGIN= Bruker BioSpin GmbH
$$ ##OWNER= Administrator
$$ $$ E:\/data/COFFEE/nmr/AC1463_TOLI313269_7819355_85D92tqTSG/10/pdata/1/auditp.txt
$$ ##AUDIT TRAIL=  $$ (NUMBER, WHEN, WHO, WHERE, PROCESS, VERSION, WHAT)
(   1,<2013-04-30 23:31:19.368 -0700>,<Administrator>,<X>,<go>,<TOPSPIN 2.1>,
      <created by zg
	started at 2013-04-30 23:30:13.743 -0700,
	POWCHK enabled, PULCHK disabled,
       configuration hash MD5:
       F7 49 AB AC A2 8D 51 76 73 8D C1 9A A6 38 9F DE
       data hash MD5: 64K
       AB DA 85 70 F9 18 D7 F2 45 98 7E 7F E0 7E 26 81>)
(   2,<2013-04-30 23:31:22.383 -0700>,<Administrator>,<X>,<proc1d>,<TOPSPIN 2.1>,
      <Start of raw data processing
       efp LB = 0 FT_mod = 6 PKNL = 1 PHC0 = 0 PHC1 = 0 SI = 32K 
       data hash MD5: 32K
       9E 70 53 A8 C9 00 1D FC B5 11 FA 22 87 8D 13 BE>)
(   3,<2013-04-30 23:31:22.743 -0700>,<Administrator>,<X>,<proc1d>,<TOPSPIN 2.1>,
      <pk PHC0 = 98.93188 PHC1 = 0 
       data hash MD5: 32K
       84 4C AE 30 3A B9 B7 60 EB 04 6F 7B F1 25 6E 48>)
(   4,<2013-04-30 23:31:22.883 -0700>,<Administrator>,<X>,<proc1d>,<TOPSPIN 2.1>,
      <abs ABSG = 1 
       data hash MD5: 32K
       86 A0 DF F8 32 85 89 B3 22 71 C1 8F E9 8B AA 95>)
(   5,<2013-04-30 23:31:22.946 -0700>,<Administrator>,<X>,<proc1d>,<TOPSPIN 2.1>,
      <abs ABSG = 2 
       data hash MD5: 32K
       C1 D9 83 28 F2 47 8A E7 0F F5 F6 DA F9 48 6A 1E>)
(   6,<2013-04-30 23:31:22.993 -0700>,<Administrator>,<X>,<proc1d>,<TOPSPIN 2.1>,
      <abs ABSG = 3 
       data hash MD5: 32K
       66 D0 D6 ED C3 FF 8A A6 FE EA 78 C5 4D 50 D8 4B>)
(   7,<2013-04-30 23:31:23.055 -0700>,<Administrator>,<X>,<proc1d>,<TOPSPIN 2.1>,
      <abs ABSG = 4 
       data hash MD5: 32K
       25 4E 6F 90 88 4F 29 98 84 5E C5 5D 72 99 7F 6B>)
(   8,<2013-04-30 23:31:23.102 -0700>,<Administrator>,<X>,<proc1d>,<TOPSPIN 2.1>,
      <abs ABSG = 5 
       data hash MD5: 32K
       43 61 CE 55 FB BA B3 02 D2 D8 CE 7B 31 53 18 E9>)
$$ ##END=
$$ 
$$ $$ hash MD5
$$ $$ C4 68 DD E6 E5 E5 09 24 9B 59 14 0E F4 D9 63 E7
##$RELAX= 
##$RELAX= 
##$RELAX= 
##$RELAX= 
##$RELAX= 
##$RELAX= 
##$RELAX= 
$$ Bruker specific parameters
$$ --------------------------
##$DU= <E:\>
##$EXPNO= 10
##$NAME= <AC1463_TOLI313269_7819355_85D92tqTSG>
$$ [...]
150 150 150 150 150 150 150 150
##$TP07= 0
##$TPNAME0= <>
##$TPNAME1= <>
##$TPNAME2= <>
##$TPNAME3= <>
##$TPNAME4= <>
##$TPNAME5= <>
##$TPNAME6= <>
##$TPNAME7= <>
##$TPOAL= (0..7)
0.5 0.5 0.5 0.5 0.5 0.5 0.5 0.5
##$TPOFFS= (0..7)
0 0 0 0 0 0 0 0
##$TUNHIN= 0
##$TUNHOUT= 0
##$TUNXOUT= 0
##$USERA1= <user>
##$USERA2= <user>
##$USERA3= <user>
##$USERA4= <user>
##$USERA5= <user>
##$V9= 5
##$VALIST= <valist>
##$VCLIST= <CCCCCCCCCCCCCCC>
##$VD= 0
##$VDLIST= <DDDDDDDDDDDDDDD>
##$VPLIST= <PPPPPPPPPPPPPPP>
##$VTLIST= <TTTTTTTTTTTTTTT>
##$WBST= 1024
##$WBSW= 4
##$XGAIN= (0..3)
0 0 0 0
##$XL= 0
##$YL= 0
##$YMAX_a= 554519
##$YMIN_a= -473210
##$ZGOPTNS= <>
##$ZL1= 120
##$ZL2= 120
##$ZL3= 120
##$ZL4= 120
##$ABSF1= 14.98509
##$ABSF2= -5.573092
##$ABSG= 5
##$ABSL= 3
##$ALPHA= 0
##$AQORDER= 0
##$ASSFAC= 0
##$ASSFACI= 0
##$ASSFACX= 0
##$ASSWID= 0
##$AUNMP= <proc_prof1d_extract_pilot.lims>
##$AXLEFT= 0
##$AXNAME= <>
##$AXNUC= <1H>
##$AXRIGHT= 0
##$AXTYPE= 0
##$AXUNIT= <>
##$AZFE= 0.1
##$AZFW= 0.1
##$BCFW= 0
##$BC_mod= 0
##$BYTORDP= 0
##$COROFFS= 0
##$CY= 15
##$DATMOD= 1
##$DC= 0
##$DFILT= <>
##$DTYPP= 0
##$F1P= 0
##$F2P= 0
##$FCOR= 0.5
##$FTSIZE= 32768
##$FT_mod= 6
##$GAMMA= 0
##$GB= 0
##$INTBC= 1
##$INTSCL= 1
##$ISEN= 128
##$LB= 0
##$LEV0= 0
##$LPBIN= 0
##$MAXI= 10000
##$MC2= 0
##$MEAN= 0
##$ME_mod= 0
##$MI= 0
##$NCOEF= 0
##$NC_proc= -8
##$NLEV= 6
##$NOISF1= 0
##$NOISF2= 0
##$NSP= 0
##$NTH_PI= 0
##$NZP= 0
##$OFFSET= 14.98509
##$PC= 1
##$PHC0= 98.93188
##$PHC1= 0
##$PH_mod= 1
##$PKNL= yes
##$PPARMOD= 0
##$PPDIAG= 0
##$PPIPTYP= 0
##$PPMPNUM= 2147483647
##$PPRESOL= 1
##$PSCAL= 4
##$PSIGN= 0
##$PYNMP= <proc.py>
##$REVERSE= no
##$SF= 400.02
##$SI= 32768
##$SIGF1= 0
##$SIGF2= 0
##$SINO= 400
##$SIOLD= 32768
##$SPECTYP= <>
##$SREGLST= <1H.CDCl3>
##$SSB= 0
##$STSI= 32768
##$STSR= 0
##$SW_p= 8223.68421052631
##$SYMM= 0
##$S_DEV= 0
##$TDeff= 65536
##$TDoff= 0
##$TI= <>
##$TILT= no
##$TM1= 0
##$TM2= 0
##$TOPLEV= 0
##$USERP1= <user>
##$USERP2= <user>
##$USERP3= <user>
##$USERP4= <user>
##$USERP5= <user>
##$WDW= 1
##$XDIM= 32768
##$YMAX_p= 422068172
##$YMIN_p= -864395
##$CURPLOT= <Network HP LaserJet P1505>
##$CURPRIN= <$Network HP LaserJet P1505>
##$DFORMAT= <normdp>
##$LAYOUT= <+/1D_H.xwp>
##$LFORMAT= <normlp>
##$PFORMAT= <normpl>
##$SURQMSG= 1
$$ End of Bruker specific parameters
$$ ---------------------------------
##NTUPLES= NMR SPECTRUM
##VAR_NAME=  FREQUENCY,     SPECTRUM/REAL,   SPECTRUM/IMAG
##SYMBOL=    X,             R,               I
##VAR_TYPE=  INDEPENDENT,   DEPENDENT,       DEPENDENT
##VAR_FORM=  AFFN,          ASDF,            ASDF
##VAR_DIM=   32768,         32768,           32768
##UNITS=     HZ,            ARBITRARY UNITS, ARBITRARY UNITS
##FACTOR=    0.250966925370066, 1,           1
##FIRST=     8223.43324360094, 182797,       -220786
##LAST=      0,             100116,          -159387
##MIN=       0,             -864395,         0
##MAX=       8223.43324360094, 422068172,    0
$$ Real data points
##PAGE= N=1
##DATA TABLE= (X++(R..R)), XYDATA
$$ [...]
19595A03550d3048A14454n7003a25342K3291o9618g4654j55661M0291J8664d9487
19583a87676d6575O492p0983Q835C75631j39835G8845l3145b25657E9072a38371
19571g9804j83546M7417P5061M7236B52094i631l34109d5294j94301g5090H1323
19559F5438A1188K82202a12158B28980B411J5552J06424b94326C41739i681A72336
19547a03119k0864j21983J14162I5138J32764j4806f1625n7642d6940B34735E3993
19535b11385r5227A91119D4777b70864A7469a05160n1935b7063j641k73172h7927
19523a27715B34373c1192j13166e6103p8903A24342c68135a09474A9319c81543
19512a32887A16030k0740J4418n853a09803j2183D327K37604c3562k5598C2685
$$ plain form
19595 103550 -43048 114454 57451 -125342 -102051 -171669 -74654 -230315 -190024 -171360 -49487
19583 -187676 -46575 -40083 -111066 -102231 375631 235796 78845 45700 -225657 59072 -138371
19571 -79804 -263350 -215933 -140872 -93636 252094 -9631 -343740 -45294 -239595 -75090 81323
19559 65438 11188 293390 -112158 228980 2411 17963 124387 -294326 341739 -9681 172336
19547 -103119 -123983 -245966 -131804 95138 227902 213096 -61625 -119267 -46940 234735 53993
19535 -211385 -306612 191119 44777 -270864 17469 -105160 -157095 -27063 -28704 -301876 -87927
19523 -127715 234373 -31192 -144358 -56103 -135006 124342 -368135 -109474 19319 -381543
19512 -132887 116030 95290 109708 103855 -109803 -121986 4327 241931 -33562 -59160 32685
19500a18668r7141D9446L4171h9872B32718f4946F9398b41573A12181a77995C8078
19488a70620j2431C14557E339R8144O5825c09249A76627F0698M11158c28011h3629
19476a93052J7552h0905L4768E0224i9684j27343p7152J35274H7405a89017j8799
19465b07816J01639J1853M0130b1839j77181e7294A64278a12250B39235a18758
19454a65427K9701A46747c92107J37695R6893r7463e1961l89668a74937j50358
19444c25295A33468O491c03604F5883d89692a00827p9A58265a4855A22863b42312
19432A00005D8757c57582B7517K11683c86843a4031q9664Q406A21796J66140h6810
19420B97601b06754i9989A15241L5654c97118B33028a84294q8805d2348m5629
$$ plain form
19500 -118668 -215809 49446 83617 -89872 232718 -64946 69398 -241573 112181 -177995 38078
19488 -170620 -183051 314557 5339 103483 169308 -309249 176627 60698 471856 -328011 -83629
19476 -193052 -175500 -80905 -46137 50224 -99684 -227027 -304179 -168905 87405 -189017 -207816
19465 -207816 -106177 -94324 -54194 -21839 -199020 -57294 164278 -112250 239235 -118758
19454 -165427 -135726 146747 -392107 -254412 -157519 -254982 -51961 -441629 -174937 -325295
19444 -325295 133468 139959 -303604 65883 -489692 -100827 -100906 158265 -14855 122863 -242312
19432 100005 48757 -357582 27517 239200 -386843 -14031 -103695 -95289 121796 287936 -86810
19420 297601 -206754 -99989 115241 150895 -397118 233028 -184294 -273099 -42348 -87977
19410h7977l1300j54020F6400c5249p3856A48362g2299q5733C15984k6948a0659
19398A05600c22541f1106C38159E7392b95565B7786N1292d419k6792B31891O8259
19387C00150b33775a01890c732j23272A52291b71984d6380J1061H9512J4069f1836
19375E0559M631K6406a29916A46135a40613l7340D4364b87854B10609C8496d5516
19363b36893N4601k6514A89864h6731l20648I3191N7353G0199J10969c52850a22063
19351b58586K9680k0181r8076a38515B15679I0442f1620J834q9261f86j60605
19340a61291q9127a20099B08984e07414a14073A36217b348k14044B7341J30743
19330A58084a30851k70271J77913j7151N1217M8162r3639B31546d403k99664A15953
$$ plain form
19410 -87977 -119277 -273297 66400 -35249 -109105 148362 -72299 -158032 315984 289036 -10659
19398 105600 -322541 -61106 338159 57392 -295565 27786 79078 -4419 -31211 231891 300150
19387 300150 -233775 -101890 -3732 -127004 152291 -271984 -46380 -35319 89512 103581 -61836
19375 50559 55190 81596 -129916 146135 -140613 -177953 44364 -287854 210609 38496 -45516
19363 -236893 -182292 -208806 189864 -86731 -407379 93191 150544 70199 181168 -352850 -122063
19351 -258586 -228906 -249087 -347163 -138515 215679 90442 -61620 -59786 -149047 -686 -161291
19340 -161291 -250418 -120099 208984 -507414 -114073 136217 -2348 -216392 27341 158084
19330 158084 -130851 -401122 -223209 -240360 -189143 -140981 -234620 231546 -4403 -304067 115953
19318a74052P6853a8330A508M4338J21628f4381D8057a73588h2763p6048b9415
19306e3987C5563a69891b7631A26025C2748a31564l9598A81888c75255h4945l3523
19295a18468B14064r5403J81156j17233k1156a36049A31984a58945A52809a75912
19284H2842A3538c18260d1985j43289A39777d8841E6366g2985n4044B91451q0700
19273B10751f0939B32380Q6713a02416j9496k43765d5497r4740D4813a21636M8004
19262g3632B9538c4365j1157C6079i0148c1080D0723A2698i9713A48165b70631
19250c3243k13734R5818C1091a19868A04837b37073P422A67123a78012A4676a88395
19238b1669E7169B708K90861a51597L7602d7684j568j91570h1138q4392N1288
$$ plain form
19318 -174052 -97199 -18330 1508 45846 167474 -64381 48057 -173588 -82763 -158811 -29415
19306 -53987 35563 -169891 -27631 126025 32748 -131564 -171162 181888 -375255 -84945 -118468
19295 -118468 214064 118661 299817 182584 161428 -136049 131984 -158945 152809 -175912
19284 82842 13538 -318260 -41985 -185274 139777 -48841 56366 -72985 -127029 291451 210751
19273 210751 -60939 232380 319093 -102416 -121912 -365677 -45497 -140237 44813 -121636 -73632
19262 -73632 29538 -34365 -45522 36079 -90148 -31080 40723 12698 -99713 148165 -270631
19250 -33243 -246977 -151159 31091 -119868 104837 -237073 -229651 167123 -178012 14676 -188395
19238 -21669 57169 2708 293569 -151597 -113995 -47684 -49252 -240822 -81138 -165530 -114242
19227a14242A58437h8274M2441j7020j29060A8572J41203K8515m5516b79889B06687
19215c82592a8944D6375f8576C938i2715A0142P0482b21144N5728j68246J61154
19204a72508j54675C7129d8028o6739n070a044q135l18200J48042D3699J24405
19193A68104c1268j73887O714A19570c66187c9416l05918p3399A03331a51832
19182d8168B25436J98251g9524G9088f49m46976B70380a23725j12653A10927K7924
19171A38851B0496a224j19284b7437E035K29628b5677B08152a84528K0409k6564
19160a90683c6374j57420A68088A9790b21483r3694a56908f5888j11940j61044
19150c38872i3709D5871L2820a07660j0769b3660A92784E838i4294j82890j16298
$$ plain form
19227 -114242 158437 -88274 -45833 -62853 -191913 18572 159775 188290 142774 -279889 206687
19215 -382592 -18944 46375 -68576 3938 -92715 10142 80624 -221144 -165416 -333662 -172508
19204 -172508 -327183 37129 -48028 -114767 -119837 -1044 -9179 -327379 -179337 43699 168104
19193 168104 -31268 -205155 -198441 119570 -366187 -39416 -345334 -418733 103331 -151832
19182 -48168 225436 423687 -79524 79088 -649 -447625 270380 -123725 -236378 110927 138851
19171 138851 20496 -1224 -120508 -27437 5035 234663 -25677 208152 -184528 -164119 -190683
19160 -190683 -36374 -193794 168088 19790 -221483 -315177 -156908 -65888 -177828 -338872
19150 -338872 -93709 45871 78691 -107660 -118429 -23660 192784 5838 -94294 -277184 -393482
19139c93482A36171b48172G4075k2735J1218D85K04292O8920j32267i935j93108
19128b03043G1084E064P7982b68040A9628g7609A54978F5751a13450j13097a00795
19116D1020J35296e3188j95411d3468k65941O3355J07599k56464a6850H1721c50610
19104c6290j83851E9277a62718p9413C00061d2621G0542a14043J9931C22419b4995
19092b62071a27724j98938B7675a10978j3608j77714A41179b48458h5482A09307
19081b28984K140l01389a10412K0572J4878B5984b4813q3334p9681O709G1939
19069d6639I607N4816d7796p7820K5853d2192Q08A57389E4174d13616A09929a79507
19056F0412J14840J83717a95817G1337j6400g8553l3527K7694j89649J3375f8256
$$ plain form
19139 -393482 136171 -248172 74075 51340 62558 485 204777 273697 141430 -9935 -203043
19128 -203043 71084 5064 83046 -268040 19628 -77609 154978 65751 -113450 -226547 -100795
19116 41020 176316 -53188 -248599 -43468 -309409 -246054 -138455 -394919 -16850 81721 -350610
19104 -36290 -220141 59277 -162718 -242131 300061 -42621 70542 -114043 -94112 322419 -24995
19092 -262071 -127724 -326662 27675 -110978 -124586 -302300 141179 -248458 -85482 109307
19081 -228984 -226844 -528233 -110412 -89840 -74962 25984 -24813 -108147 -187828 -181119 71939
19069 -46639 9607 64423 -47796 -125616 -99763 -42192 -41384 157389 54174 -413616 109929 -179507
19056 60412 175252 358969 -195817 71337 54937 -78553 -112080 -84386 -274035 -260660 -68256
19044A92932C4916O8573b51647F1377J00886a29587A32577d9688q921m96322B1032
19032a71272H0816O4445A3643a40382N5608A12851J83044R9374b23101C2214J66227
19021A98441b38093a7505j9242m3976k1610k62657e361r3161j04737l9855n861
19010b48975A01706g8432n8434j6053k13040a12631N4949p5605e4175B44378a6743
18998f4182I4006a59058B98271A12726a43029L2047M0817b7048k9838o8519A29053
18986a00340F5228a33141b0267j63285c1566l7455j67617b9083l70111H8116B9433
18974C6355i3048k11199F3142b89654b8481F3965d91053a14287J9824l1885f1577
18962e5601A73899M4675i2546d0728A27114b28501b2642j72853R0165A66027H642
$$ plain form
19044 192932 34916 103489 -251647 61377 162263 -129587 132577 -49688 -58609 -554931 21032
19032 -171272 80816 145261 13643 -140382 -84774 112851 295895 395269 -223101 32214 198441
19021 198441 -238093 -17505 -36747 -80723 -102333 -364990 -5361 -98522 -203259 -243114 -248975
19010 -248975 101706 -78432 -136866 -152919 -365959 -112631 -57682 -133287 -54175 244378 -16743
18998 -64182 94006 -159058 298271 112726 -143029 -110982 -70165 -27048 -56886 -125405 129053
18986 -100340 65228 -133141 -20267 -183552 -31566 -69021 -236638 -29083 -399194 88116 29433
18974 36355 -93048 -304247 63142 -289654 -28481 63965 -491053 -114287 -94463 -126348 -61577
18962 -55601 173899 218574 -92546 -40728 127114 -228501 -22642 -195495 -105330 166027 8642
18950b55921g5108m7716B27975l7747R824n5875c68928A04286J96347L4633b20357
18938i2091J1438j91701f8430A00912B4341e9870k1908H6939O7437b0061C04283
18926F0445O7253j0093K4071A5336h4127j1370K1703n2310A2188j599g9002a3240
18913a94402j1036I7043i6060A82761k349a9822A2181J60819A3388K87347a23468
18901f7791A8072L5562K7875N2193b02404e5599j88060D2580N3556i1767b0882
18889a61772A55294a60592q7030e1040j70958E3055a51930F6041a22118K9440
18879i2678j72124k8057B11082m4061a13908J1859L1515j25922h4816j9165B9448
18867A41775J03464c82875a51001j18516J18660j68984A05009b11337P2017k47626
$$ plain form
18950 -255921 -75108 -122824 227975 190228 200052 144177 -368928 104286 300633 335266 -220357
18938 -92091 -80653 -272354 -68430 100912 24341 -59870 -81778 86939 154376 -20061 304283
18926 60445 127698 117605 141676 15336 -84127 -95497 -73794 -126104 12188 10589 -79002 -13240
18913 -194402 -205438 97043 -96060 182761 180412 -19822 12181 173000 13388 300735 -123468
18901 -67791 18072 53634 81509 133702 -202404 -55599 -243659 42580 96136 -91767 -20882
18889 -161772 155294 -160592 -247622 -51040 -221998 53055 -151930 66041 -122118 -92678
18879 -92678 -264802 -292859 211082 167021 -113908 -102049 -70534 -196456 -84816 -103981 29448
18867 141775 245239 -382875 -151001 -269517 -150857 -319841 105009 -211337 -139320 -386946
18857c86946a59903L439J792B5753j2650f4957A47579E1484J24188f0444a8669
18845d07235K03010E4449a02148p1484B02548C6669a40954e7278a1736m4907a9353
18833A2382a25380Q388K6868k49222G8786b26142g4805A26941j3542a82159A94993
18821A05213a2976E7354b31514Q8213F9439K41894a53147c046C5830L14067A46217
18809E4504J64040d2990k21411A61732f3104K4162A66723g3711A1891J98780a47859
18797a8711B16631a90475G1156N6755a93054J483R0832F822M05268a28275M1760
18786h6515F1859a56260O1609G0755a88957B28337b64350d9065A58634e8362j82488
18775b40850k778I6837c4426B2346a34751A49754a37446e4825E3196a46866O7750
$$ plain form
18857 -386946 -159903 -156464 -154672 25753 13103 -64957 147579 51484 175672 -60444 -18669
18845 -407235 -204225 54449 -102148 -173632 202548 36669 -140954 -57278 -11736 -56643 -19353
18833 12382 -125380 -116992 -90124 -339346 78786 -226142 -74805 126941 113399 -182159 194993
18821 105213 -12976 57354 -231514 -143301 69439 311333 -153147 -3046 35830 349897 146217
18809 54504 218544 -42990 -264401 161732 -63104 -38942 166723 -73711 11891 210671 -147859
18797 -18711 216631 -190475 71156 127911 -193054 -191571 -100739 6822 412090 -128275 -86515
18786 -86515 61859 -156260 -94651 70755 -188957 228337 -264350 -49065 158634 -58362 -240850
18775 -240850 -243628 96837 -34426 22346 -134751 149754 -137446 -54825 53196 -146866 -79116
18764g9116K5001F382c05789j00121C48184A9569J2493f5954j53734A36456J6704
18753A53160h9692B47222b05127N1196C4083b09443F2701a60039F4199g5232A68884
18741g4582B01119q4253c8879m6708D2635K3871O8630b55891C71813a02711M6763
18730e5948b2832i736k83978b893A56944j4274J83401E8971J1979f0829r0006
18719a50835j17929F6991K644a29852j07033E669J95626K24539a66425B15379
18708h6856j47308J12295L0555l6835j2581b9837F5047a0182C6496b16677A7914
18696C04900G54e4433j6375k3989A13290D8210c47854J48494h9317p329A9327
18684a46670c623k90370b4696A75431K50279C0229a36495L2057c7949r2788m3055
$$ plain form
18764 -79116 -54115 6382 -305789 -405910 348184 19569 32062 -65954 -219688 136456 153160
18753 153160 -89692 247222 -205127 -153931 34083 -209443 62701 -160039 64199 -75232 168884
18741 -74582 201119 116866 -38879 -85587 42635 66506 135136 -255891 371813 -102711 -55948
18730 -55948 -22832 -9736 -293714 -2893 156944 142670 326071 58971 70950 -60829 -150835
18719 -150835 -268764 66991 69635 -129852 -236885 5669 201295 425834 -166425 215379
18708 -86856 -234164 -121869 -91314 -128149 -140730 -29837 65047 -10182 36496 -216677 17914
18696 304900 754 -54433 -70808 -94797 113290 48210 -347854 -199360 -89317 -96646 19327
18684 -146670 -3623 -293993 -24696 175431 425710 30229 -136495 -104438 -37949 -130737 -173792
18673a73792D4264o421a23201E4492b86100A00444a91707A44632G1346c8508B25142
18661b29705q2236A57106b18589I7179m5394c37655J00142h4462j03802B30510
18650i4947I1583g5604j30695I2989c04896D9818g745j0998k94318H1964P0331
18639A52295g1248k32057J36663K9416C31259b81591L1069A37087K6702g5900
18628c0542j56533A61219J3448R0671G4170k3172c3763A68213m9393a04312L5182
18617f9130j37035M2982r6251j04467g9660g376k25693j8708C3994b7823j25968
18606a53791c1947j55628e6613G3110a08987j08127A27254b27367I8438l9807
18596E8631j0991H147K48782c34772A0755b46647P6431A07076b89927A59098a7887
$$ plain form
18673 -173792 44264 37843 -123201 54492 -286100 100444 -191707 144632 71346 -38508 225142
18661 -229705 -311941 157106 -218589 97179 51785 -337655 -237513 -84462 -188264 230510
18650 -94947 91583 -75604 -206299 92989 -304896 49818 -7745 -18743 -313061 81964 152295
18639 152295 -71248 -303305 -166642 -137226 331259 -281591 -250522 137087 163789 -75900
18628 -30542 -187075 161219 174667 265338 74170 50998 -33763 168213 118820 -104312 -69130
18617 -69130 -206165 -163183 -259434 -363901 -79660 -7376 -233069 -251777 33994 -27823 -153791
18606 -153791 -31947 -187575 -56613 73110 -108987 -217114 127254 -227367 98438 58631
18596 58631 47640 8147 256929 -334772 10755 -246647 -170216 107076 -289927 159098 -17887
18584e1213o0741M1849l5114M8225j50003J9417A0983K44158A13525b05973K7593
18573a78380P1109A13344K1533e7472a3221A43955J69846j35511c4038A32701
18562b53963A70632a44879M0516A95406c85065k3947J79655P0753B5558G482a39866
18550H1459a67781M7745A4717J08821a43600o0216e4165q8600j0109b7190j61965
18539a89155D3599O0276d8007G6676a89179A33464m6010b75206R3701g2780B6069
18527a72872l8087H766J14901E1401d9858H4466C5864J7567a82973E4162a33361
18515g2149j05286P1489F4658a4541j4988j28103K9847I8596D7607c59873B2488
18503a8800C9600j7196J73487b88347a0057k88737B4578h3043B05481k0135d8919
$$ plain form
18584 -51213 -111954 -70105 -105219 -56994 -206997 -187580 10983 255141 113525 -205973 -178380
18573 -178380 -107271 113344 134877 -57472 -13221 143955 313801 178290 -34038 132701
18562 -253963 170632 -144879 -104363 195406 -385065 -409012 -229357 -158604 25558 7482 -139866
18550 81459 -167781 -120036 14717 123538 -143600 -203816 -54165 -142765 -152874 -27190 -189155
18539 -189155 43599 103875 -48007 76676 -189179 133464 87454 -275206 -181505 -72780 26069
18527 -172872 -210959 8766 123667 51401 -49858 84466 35864 53431 -182973 54162 -133361
18515 -72149 -177435 -105946 64658 -14541 -29529 -157632 -127785 98596 47607 -359873 22488
18503 -18800 39600 22404 195891 -288347 -10057 -298794 24578 -83043 205481 185346 -48919
18491B85524a44439N9102B37030J08017c1890q5023A99748a55011c2633C7487
18480H1686c03147M6431R9881l98466C0263J59166e0675A09228j4316g8300n29589
18469f07889a21619o7603H4843e1582o5624d9447J316C21952b42928B82914B1377
18457b9501A49016f6607r8743j5574g2058B20014b00263B6915J88890d0245E1142
18445b06574A67032a76570f6238k42419A61722Q8719I6380a04944n1527D58475
18434A61669c86201B06687f9857J4176B296b99697C5N6771b59394E471a12306
18422D2632f6982p6305j19667i2846j01258C6984d5649A82725H0784J17096j2305
18411A85575C9721b3239p1732G3458D592K22344b3280r2215C04171h9948B57045
$$ plain form
18491 285524 -144439 -85337 237030 345047 -31890 -116913 199748 -155011 -32633 37487
18480 81686 -303147 -256716 -156835 -555301 30263 189429 -50675 109228 94912 -78300 -607889
18469 -607889 -121619 -189222 84843 -51582 -117206 -49447 -48131 321952 -242928 282914 21377
18457 -29501 149016 -66607 -165350 -180924 -72058 220014 -200263 26915 215805 -40245 51142
18445 -206574 167032 -176570 -66238 -308657 161722 250441 96380 -104944 -156471 458475
18434 161669 -386201 206687 -69857 -55681 2296 -299697 35 56806 -259394 5471 -112306
18422 42632 -66982 -143287 -262954 -92846 -194104 36984 -45649 182725 80784 197880 185575
18411 185575 39721 -23239 -94971 73458 4592 226936 -23280 -115495 304171 -89948 257045
18399b3187F0930b67381d3033l925B27105K4062C8580b83429f9964H645J2072
18388B0717h8118m2165B34393a89105j01395a30339a8283C096a61360P716L3263
18377a20381G0767a27894B80871a42757F5876B3979f4324A30011a6338q2747B54571
18365B18897f1535k00086E3869B0351J24770d8609B55567e53732K36444G750c27070
18353a42814C70946b46072a5864B15534c5615r8622q2208E2606g6996j96458D8236
18341b63622C29890F0668g0397A0940J07440B0489a17921d3687j32425F6895R1738
18330A58633c01886b8234m3596b8124o2972A10900h8834o5660j53409j42891A67797
18318a69314p8692B30273L1183O4715m1102D7255L9468c3304k53509C3226l995
$$ plain form
18399 -23187 60930 -267381 -43033 -46958 227105 251167 38580 -283429 -69964 8645 20717
18388 20717 -88118 -130283 234393 -189105 -290500 -130339 -18283 3096 -161360 -153644 -120381
18377 -120381 70767 -127894 280871 -142757 65876 23979 -64324 130011 -16338 -99085 254571
18365 218897 -61535 -261621 53869 20351 145121 -48609 255567 -553732 -317288 7750 -327070
18353 -142814 370946 -246072 -15864 215534 -35615 -134237 -216445 52606 -76996 -273454 48236
18341 -263622 329890 60668 -70397 10940 118380 20489 -117921 -43687 -176112 66895 158633
18330 158633 -301886 -28234 -71830 -28124 -91096 110900 -88834 -154494 -307903 -450794 167797
18318 -169314 -248006 230273 261456 326171 285069 47255 86723 -33304 -286813 33226 29231
18307B9231A1511M4123b5911C92950j94924a69260f2069A43706a97410A30016
18296f5330b0357D24872H0356a64875m1358b719k00359O8772q6775A30047K9716
18285A59763d68290J01735a15626k14004A25626B3956O9759h0033O248L1618h711
18273C5948a32926q3491j14488E0064b59718B09907a69536K9013k5834G2114L23879
18262C95993F3642A2495c60859a31788L9209j00694r9784i45C2724b48824O6742
18251a82082B26565G1343c34111f7253q4940B11712a96528d6982j00963A531J08878
18240A10409b00864D3159A7731R3093L5423a88207O4487K4487K4346r6687B6982
18228c46512A43896h9912l26686K07053A23540D1566e636B77951h0239A04034
$$ plain form
18307 29231 11511 55634 -25911 392950 198026 -169260 -62069 143706 -197410 130016
18296 -65330 -20357 424872 80356 -164875 -206233 -2719 -203078 -134306 -221081 130047 159763
18285 159763 -468290 -366555 -115626 -329630 125626 23956 93715 -80033 -73785 -42167 -8711
18273 35948 -132926 -216417 -330905 50064 -259718 209907 -169536 -140523 -166357 72114 395993
18262 395993 63642 12495 -360859 -131788 -92579 -193273 -293057 -945 32724 -248824 -182082
18251 -182082 226565 71343 -334111 -67253 -152193 211712 -196528 -46982 -147945 1531 110409
18240 110409 -200864 43159 17731 110824 146247 -188207 -123720 -99233 -74887 -171574 26982
18228 -346512 143896 -89912 -416598 -209545 123540 41566 -5636 277951 -80239 104034
18217i2766k72592a8095m1355j1699J6303C15593A09423l8408a15870j01482e9624
18205E8319L00904a84708A03213a3682k7035k23921f7618p0105B76553D3176g5253
18193g101A6589J16819J52862a21194l25007a19238D21562h3847H829d7028j72886
18182b19914I3370b88033O998A20109j5658b1696j52222B55361i5718j04674g826
18170b05196K7395A68794f7949K3907j0821o4636k2169H9414J78307b45863D15820
18158a33814j39193j9724J18072D0542I394e3823j62503B63989a53086E0391K46010
18147B96401D951K4213a22615B12122C8707b88201F7985k3484b73365a6042l9041
18136e5083H2763J84543a18993p5982b6376l1578n0097l27964A00009J4853B8630
$$ plain form
18217 -92766 -365358 -18095 -59450 -71149 -54846 315593 109423 71015 -115870 -217352 -59624
18205 58319 359223 -184708 103213 -13682 -40717 -264638 -67618 -137723 276553 43176 -75253
18193 -7101 16589 133408 286270 -121194 -446201 -119238 421562 -83847 8829 -47028 -219914
18182 -219914 93370 -288033 -281035 120109 104451 -21696 -173918 255361 -95718 -200392 -7826
18170 -205196 -177801 168794 -67949 -44042 -54863 -119499 -141668 89414 267721 -245863 415820
18158 -133814 -273007 -292731 -174659 40542 9394 -53823 -216326 263989 -153086 50391 296401
18147 296401 4951 29164 -122615 212122 38707 -288201 67985 44501 -273365 -16042 -55083
18136 -55083 82763 267306 -118993 -194975 -26376 -57954 -108051 -436015 100009 114862 28630
18124A20720a59632g5166F8341G818b01072a00118D3800d21889A3504g8028A86237
18112h9041a496D8829d3961j43747i1713B5412J94053R6713G8016b36435C4957
18100A70440b15037M4264j98431d4025A13269a80599O7063G0903c7088H3710a85621
18088B0852M760i7360d1912D263O7223a23408j75290e112j79084k6737a01603
18076c72279A69984O4884i6214j27254g4352B35685b16224A34437n648P8253n1524
18065A55518k3212M0576k1486e4280k6357C5710c4960j93969A40031b13947g3183
18053A736M8460a25227j03854B74497M4872A9467d7299J0396F3316c35535A17600
18041A18275b04599B91817a08286A70503J7192c5496B57983D7461L58173a9399
$$ plain form
18124 120720 -159632 -75166 68341 7818 -201072 -100118 43800 -421889 13504 -78028 186237
18112 -89041 -1496 48829 -43961 -187708 -91713 25412 219465 316178 78016 -236435 34957
18100 170440 -215037 -170773 -369204 -44025 113269 -180599 -113536 70903 -37088 83710 -185621
18088 20852 25612 -97360 -41912 4263 71486 -123408 -298698 -5112 -184196 -210933 -101603
18076 -372279 169984 234868 -96214 -223468 -74352 235685 -216224 134437 128789 207042 155518
18065 155518 132306 172882 151396 -54280 -80637 35710 -34960 -228929 140031 -213947 -73183
18053 1736 50196 -125227 -229081 274497 319369 19467 -47299 -36903 63316 -335535 117600
18041 118275 -204599 291817 -108286 170503 187695 -35496 257983 47461 405634 -19399
18030d4233B1290c39426b0870j61833P3268C3703c9090j26482m5451F7847g7602
18018C68928A30805b30200H297c20627a47820D8463J08280a19447M5871m5807
18008a19383B72061b47043G0521J0578A0879a79242P3743A9985L27600a10147
17997B21545a23100B21272b71662A37915b91039B34967b24886B99592K5881A44973
17986G8533L5131c95574E39M5168b86404C1715a85634K0218j28193j90929C72598
17974h1381c6711j75355B45525a70705f9511d883A69803a37218D2857i5160j48564
17963b43724A87428A0524c04954A83240I1505i0694j2170B69306A32087a62881
17952b07741M6925j275l3423f7474j96544C98417F3081K54666o0066a32713N8353
$$ plain form
18030 -44233 21290 -339426 -20870 -182703 -109435 33703 -39090 -165572 -211023 67847 -77602
18018 368928 130805 -230200 8297 -320627 -147820 48463 156743 -119447 -73576 -119383
18008 -119383 272061 -247043 70521 81099 10879 -179242 -105499 19985 347585 -110147
17997 221545 -123100 221272 -271662 137915 -291039 234967 -224886 299592 325473 144973
17986 78533 113664 -395574 539 45707 -286404 31715 -185634 -165416 -293609 -484538 372598
17974 -81381 -36711 -212066 245525 -170705 -69511 -4883 169803 -137218 42857 -95160 -243724
17963 -243724 187428 10524 -304954 183240 91505 -90694 -102864 269306 132087 -162881
17952 -207741 -160816 -162091 -195514 -67474 -264018 398417 63081 317747 257681 -132713 -74360
17941g4360r0554r3245k50813A65367n0311c2202a4550p1559b5890p8487A15117
17929b6281H879c0633j15736A00466C6787a2973l0403A17174f9103B7169a667
17917a37212j08167A8933J46340c34483b5622k20192A27464K21440A46592c87942
17906h5231c5259k65706D23177a39863A68154a0883k27981c6867A13714a93805
17895G1750M2557g2973j7672j51734q741a7041A58069a54520c776B75831c2064
17883c48147A83567f2133A70912b72504L0160N0048q6457a1685d909I1016k3986
17872F7030J02668J10134o6821A02952c02117F0385J52695k5424a3899q4954M3922
17861e4931B4501b86462a09404L1697k49276J41410A04677l6468N4046k2377A3444
$$ plain form
17941 -74360 -164914 -258159 -508972 165367 115056 -32202 -14550 -86109 -25890 -104377 115117
17929 -26281 8879 -30633 -146369 100466 36787 -12973 -43376 117174 -69103 27169 -1667
17917 -137212 -245379 18933 165273 -334483 -25622 -245814 127464 348904 146592 -387942
17906 -85231 -35259 -300965 423177 -139863 168154 -10883 -238864 -36867 113714 -193805
17895 71750 114307 -72973 -90645 -242379 -251120 -17041 158069 -154520 -3776 275831 -32064
17883 -348147 183567 -62133 170912 -272504 -242344 -192296 -278753 -11685 -4909 91016 67030
17872 67030 169698 279832 213011 102952 -302117 60385 213080 187656 -13899 -98853 -54931
17861 -54931 24501 -286462 -109404 -77707 -326983 -185573 104677 68209 122255 99878 13444
17849B1421O8344h3903j14781A41599e2032j69772B4420c59966A4751O326b4892
17837B73166c05580A78268c9313G0420F211a55745A35149a55402E3857a83496
17826B2047f5469n8014c9641A05953c6986B96039g1640N065A68930N350J6915
17815A91195a95070h2588B3810a99218j59148b3349r0347Q037j39110a09324k68679
17804c78003A46319i5583a6742A51669i5149I5538K0091a6923q6488A24400f6797
17792b21867E082J4218J78783b43216C93967h0289A67940p1740L82466b86168
17781a61210A68517c35543h7154j19006j88208a6977B7215P276a82099b3964D40798
17769a38507a3079A0158a01498A12509A4960g3376j32609O878A01885a77825A14897
$$ plain form
17849 21421 89765 -83903 -198684 141599 -52032 -221804 24420 -359966 14751 21077 -24892
17837 273166 -305580 178268 -39313 70420 6211 -155745 135149 -155402 53857 -183496
17826 22047 -65469 -123483 -39641 105953 -36986 296039 -71640 -66575 168930 174280 191195
17815 191195 -195070 -82588 23810 -199218 -358366 -23349 -113696 -105659 -244769 -109324 -378003
17804 -378003 146319 -95583 -16742 151669 -95149 95538 115629 -16923 -103411 124400 -66797
17792 -221867 5082 19300 198083 -243216 393967 -80289 167940 96200 478666 -286168
17781 -161210 168517 -335543 -87154 -206160 -394368 -16977 27215 34491 -182099 -23964 440798
17769 -138507 -13079 10158 -101498 112509 14960 -73376 -205985 -199107 101885 -177825 114897
17757A37231b74336a08999G763c4735A34142J42949n1500g7119A63076A773J4702
17746A6475i3698b4439k06491A26361a34722E6051M077a6628k23083J06767A06086
17734D9427N4526B8926L0985b92876P2220D09199A3119N4946a40428G5274J0622
17723H5896b51162G9526c29077H8773O4062J4294C1501L69624b05139A54704D9440
17711a03946b6953k8337D6807d519A15169J81905g7351J2052A83989D4956k1910
17700B3046a10961l0458e335A57094a86721A34413a77163P4500A07370a6378E829
17688g5567q488B47345j10207O6809N7355a58267k78252J99834N0374i1537k0879
17677a12416A12783n5348b51354f094D3320a44571B1627c7704A78891q921G612
$$ plain form
17757 137231 -274336 -108999 7763 -34735 134142 277091 225591 -77119 163076 1773 16475
17746 16475 -93698 -24439 -230930 126361 -134722 56051 60128 -16628 -239711 -132944 106086
17734 49427 103953 28926 59911 -292876 -220656 409199 13119 68065 -140428 75274 85896
17723 85896 -251162 79526 -329077 88773 152835 167129 31501 401125 -205139 154704 49440
17711 -103946 -26953 -55290 46807 -4519 115169 297074 -77351 -65299 183989 44956 23046
17700 23046 -110961 -141419 -5335 157094 -186721 134413 -177163 -102663 107370 -16378 5829
17688 -75567 -84055 247345 137138 203947 261302 -158267 -436519 -236685 -186311 -91537 -112416
17677 -112416 112783 57435 -251354 -6094 43320 -144571 21627 -37704 178891 169970 7612
17665C26594a13745j25831D1567o414b48024A42225c13395J25223G7099a08332
17654f7289C480J93526e8891j78681I8922C1957J13277n2594l0909J270J35697
17643A98698a7814C58346H4887J01081F1120K20571c95954C00803R288G7322c1165
17631A92711b9325A65784E0009i8981k0704A78784c2966A44454b93997M7749b4275
17619A56870i3253A25838E745J60863O5551q6624a93541P929B76875H6993J79013
17608B66006a06828d9934j12231L3390b6696F1376M6211J82852b25013k32550
17598d57563B5898J63208O2807o93e8214D8784a5388m7158B24257a17754D1962
17586G1614C1117A0101K07115b01950A24146E8035J69450A2987d0753B36499a22326
$$ plain form
17665 326594 -113745 -239576 41567 35153 -248024 142225 -313395 -188172 77099 -108332
17654 -67289 3480 197006 -58891 -237572 98922 31957 145234 92640 61731 63001 198698
17643 198698 -17814 358346 84887 185968 61120 281691 -395954 300803 310091 77322 -31165
17631 192711 -29325 165784 50009 -98981 -119685 178784 -32966 144454 -293997 -246248 -24275
17619 156870 -93253 125838 5745 166608 232159 145535 -193541 -185612 276875 86993 266006
17608 266006 -106828 -49934 -162165 -128775 -26696 61376 107587 290439 -225013 -457563
17598 -457563 25898 189106 251913 251220 -58214 48784 -15388 -62546 224257 -117754 41962
17586 71614 31117 10101 217216 -201950 124146 58035 227485 12987 -40753 236499 -122326
17574g1147p8594N5730b1014j79662C33589i9912c9867j249F0082N7592D0462
17562G5784K2659h654j05075B1110c59514A77656b9041C485d4128f509A21339
17550A84103G794J89537H9304P0114b4515C2943J23522j1508d9344A66150O9500
17539B35650J65511b36114I6858a19867A32133b05694E03371A76520a3844m1425
17529e5269b4156B60123D0923K14310F5138b80687O5573B27264q627j9723l6542
17518A62372e67971c2892K157B27040F0826M0174G821O2645a60413A10394O8757
17507A79151e0865h309B52061m1280j8145A8478L60504G5732B8434b5930C09503
17495a53108B35597A11144f9176J646a5850I742a00870j27589e5017A84932H5123
$$ plain form
17574 -71147 -149741 -94011 -21014 -200676 333589 -99912 -39867 -41116 60082 117674 40462
17562 75784 98443 -8654 -113729 21110 -359514 177656 -29041 3485 -44128 -6509 121339
17550 184103 7794 197331 89304 159418 -24515 32943 156465 144957 -49344 166150 235650
17539 235650 401161 -236114 96858 -119867 132133 -205694 503371 176520 -13844 -55269
17529 -55269 -24156 260123 40923 255233 65138 -280687 -215114 227264 218637 198914 162372
17518 162372 -567971 -32892 -30735 227040 60826 101000 7821 70466 -160413 110394 179151
17507 179151 -50865 -8309 252061 210781 192636 18478 378982 75732 28434 -25930 309503
17495 -153108 235597 111144 -69176 -67530 -15850 9742 -100870 -228459 -55017 184932 85123
17483E3325J66444e645A74829F9793B0568J92459a45019C15218D2035J80250A9475
17471B94751b8797A89829G1864K92821F0089J46920G2765N5249K4919b61965I3867
17459g608p7163J4542B22064e3152B64208j15386e7759B02705E5022L5315K16950
17448C07287m327r582m574k3880j30960J41832a31459F377K76206f7165B08988
17436D6497O25999A41621E5841L158R3014C3743P0272K49312O1284j71779l5174
17425B07658D6042e8241B33597K18894o6954A6599h803j87515D44472j75480n9193
17414B09799M9358l9992J29821g318A43467K78902j03712F4002M5805L5616J03768
17403B49191a34420a188q9707A891a42499D12683A23736E3579J5725d8803D12996
$$ plain form
17483 53325 219769 -5645 174829 69793 20568 213027 -145019 315218 42035 222285 19475
17471 294751 -28797 189829 71864 364685 60089 207009 72765 128014 152933 -261965 93867
17459 -7608 -84771 -70229 222064 -53152 264208 148822 -57759 202705 55022 90337 307287
17448 307287 302960 293378 288804 264924 133964 275796 -131459 6377 282583 -67165 208988
17436 46497 672496 141621 55841 58999 152013 33743 104015 353327 414611 242832 207658
17425 207658 46042 -58241 233597 452491 385537 16599 -8803 -196318 444472 268992 209799
17414 209799 259157 219165 348986 -7318 143467 422369 318657 64002 109807 145423 249191
17403 249191 -134420 -1188 -90895 1891 -142499 412683 123736 53579 69304 -48803 412996
17391A44503K23655j10376J00360A63029i0411A23199b4527B20011L27097a26850
17380e2663A27035J13456g157B2312N9590J9267m1237b53010I4007L4067a24357
17368C58186i9416k92430G7589c4365E3688K25490J07188p2849B1111a1077A07181
17356B65962A16038J27240n0305J06103A43869J30431n3648C1635M14337H3760
17345A65785K15746D7487Q1605b4157A10613D5470J57924R8802A28293B9451N6861
17334H6312b12865A29345K26522F8612e9521D5775b4081j54949I8470c8718k23723
17323b62441J07770e2131A52203M05692B74835n2348H6974j5146J63573E5195
17312D5480K39575c700F4479N2270d4200A95020B4360N7556f928A00639C0911
$$ plain form
17391 144503 368158 257782 358142 163029 -90411 123199 -24527 220011 547108 -126850
17380 -52663 127035 240491 -7157 22312 81902 101169 59932 -253010 94007 128074 -124357
17368 358186 -99416 -391846 77589 -34365 53688 279178 386366 313517 21111 -11077 107181
17356 265962 116038 243278 192973 299076 143869 274300 220652 31635 445972 83760
17345 165785 381531 47487 129092 -24157 110613 45470 203394 302196 128293 29451 86312
17334 86312 -212865 129345 355867 68612 -59521 45775 -24081 -179030 98470 -38718 -262441
17323 -262441 -154671 -52131 152203 557895 274835 222487 86974 71828 235401 55195
17312 45480 285055 -3700 64479 116749 -44200 195020 24360 81916 -6928 100639 30911
17300A58872J00805h2082B48612j16246L7524c9118E004N22978a41140A55339
17289a53233A72195K46385H8967J34642A604J02198K058P0945L2567A0296L81877
17278C92173j05193h0470B62160i7303E8007A5553K59816E6987J01366R479a20509
17266A08002c9512A87946F9940L0305C4878M4011M89466b14802B2803K00165g4249
17254E3369c5056k03737a06312C24146A31604L03413H9765L21113D5529J25753
17244A71282J20731c494H7395K2808P0803J29759F1680L19561F4043O04486b3924
17232A31320J09540b14641C36877j12592K15408j47084A34022D1439h1894B52060
17221D54507j32867j42144J09065B5187a34811G7720b7879A78270M3023a08048
$$ plain form
17300 158872 259677 -82082 248612 132366 169890 -39118 5004 527982 -141140 155339
17289 -153233 172195 418580 88967 223609 1604 103802 105860 176805 209372 10296 392173
17278 392173 286980 -80470 262160 -97303 58007 15553 275369 56987 158353 167832 -120509
17266 108002 -39512 187946 69940 100245 34878 78889 568355 -214802 22803 222968 -74249
17254 53369 -35056 -238793 -106312 324146 131604 435017 89765 410878 45529 171282
17244 171282 292013 -3494 87395 110203 181006 310765 61680 381241 64043 668529 -23924
17232 131320 240860 -214641 336877 224285 439693 292609 134022 41439 -81894 252060
17221 454507 321640 179496 288561 25187 -134811 77720 -27879 178270 221293 -108048
17210A75975n4259j1700J25864r7993N8788I7742J38711b89368B52746J1830l3517
17199B31059J62774G8693K57369A63866E4a1293o0201A03994K27971j14005R5665
17188C13625J91620A18699L54635a54433A10703r418R8609J89252A37126R9539
17178B36665K80306P174k60176P6780n4682G3998K45482K17973k26977A42053
17167C44630H1798K05605A19474h5684B45701L65065A60809C4897J38198L79300
17157E52395A40897M8415g245A22376M8106a19337I9003M56778H6862A1779J08181
17146A19960L53879N0747A49292M9207I7634N0432J67096L14627B42699j6016
17136B26683K68495j6753A41544K14453j03616L2485A29584J30330J2252I0515
$$ plain form
17210 175975 121716 110016 235880 137887 196675 97742 236453 -289368 252746 264576 231059
17199 231059 393833 78693 336062 163866 54 -11293 -71494 103994 331965 217960 313625
17188 313625 505245 118699 473334 -154433 110703 101285 199894 389146 137126 236665
17178 236665 516971 524145 263969 340749 286067 73998 319480 537453 310476 142053
17167 344630 81798 287403 119474 -85684 245701 610766 160809 34897 173095 552395
17157 552395 140897 189312 -7245 122376 170482 -119337 99003 555781 86862 11779 119960
17146 119960 473839 524586 149292 198499 97634 148066 315162 629789 242699 226683
17136 226683 495178 478425 141544 355997 252381 284866 129584 259914 272166 90515
17125f8598D33882j93603J47564A92179L8373C3547K53874P4004j72576J81058
17115C69907A19550J87353k9701k984K40571k03035j37218G7202M43177A37454
17104H8523J75142J39222l5717j08975K31089j3492J70373B81657J98730J8803
17094D99190j97252m8235j15871N2801K51625K5939n9689J4267A42040K80309
17084D22349g9240A22287M17228k50951A00133K92496A59142O63481k70450l5529
17074E16644k23326d6749C83536M0384m4918j43221K09659m0043l4644K16648
17064E87401j89421O849L3505M1554J88795L3937I4995K77027L576N1214A95336
17052F38298k51301j71775R8098C0477P64774B47834L50476j49681J6104K44268
$$ plain form
17125 -68598 433882 240279 387843 192179 230552 33547 287421 361425 188849 369907
17115 369907 119550 306903 277202 274218 514789 311754 174536 77202 520379 137454
17104 88523 263665 402887 367170 258195 489284 475792 646165 281657 480387 499190
17094 499190 301938 253703 137832 190633 442258 468197 408508 422775 142040 422349
17084 422349 -79240 122287 539515 288564 100133 392629 159142 822623 552173 516644
17074 516644 293318 -46749 383536 423920 379002 235781 445440 405397 370753 587401
17064 587401 397980 404829 438334 479888 668683 702620 94995 372022 375598 426812 195336
17052 638298 386997 215222 313320 30477 795251 247834 598310 448629 464733 709001
17042G09001j72507B32270O00964j46174k01282j93370L20995B72980Q9586j74865
17032A87701J27696K79937A39782N5588L11937j47020J47641j32765j60596L43361
17022E57928O6884q5340L34879l59943k22946L01664j34987J70618J08720k41355
17012D96122J0087p5535J08535K29582B67889J99123B13752J17307J62160M8246
17002E41465O2543I3968M60467K58308j81719B77324K57145j82638k7352K28912
16992E53391M6221j92138l3454N324J42415j39563N04578l09259J00651j35842
16982E42324L95414k72974k47033N1435M49054C27384K54013L928J17521n3347
16972F49499L23059l42602K92461l31934L32378k63094K14014j33160K32341l15133
$$ plain form
17042 709001 536494 232270 833234 687060 485778 292408 613403 272980 362566 187701
17032 187701 315397 595334 139782 195370 507307 360287 507928 375163 214567 557928
17022 557928 624812 539472 874351 514408 291462 593126 458139 628757 737477 496122
17012 496122 506209 430674 539209 768791 267889 467012 213752 331059 493219 541465
17002 541465 604008 93968 554435 812743 631024 277324 534469 351831 324479 553391
16992 553391 599612 407474 374020 379344 521759 382196 886774 577515 678166 542324
16982 542324 937738 664764 417731 469166 918220 327384 581397 585325 702846 649499
16972 649499 972558 629956 922417 590483 922861 659767 873781 740621 972962 657829
16962F57829P1375K41411l99785K33642K08942m76656J31476l7656L38769j41686
16952H27661K8330O2017j37514l18751N18422m19622Q2151K54228P7694l58858
16942F15758K49815j80439J60502j33277K74002o7169k6022K13272k98053J71153
16932I79542Q3102j95775J44049K4434l9451L9755q1350L08263k95186J70656
16922A138039K17236j98854j01090j9884J23697O0665l74440J87820K09293J276
16912A243758j28352k45294J7177R6733J87049K29949k48194L66986l58110K03724
16902A365426j88245q2144p813L38701M00206n88345l3519K20287L23505k10838
16892A537221R9404l76541M07418j28377p5258L93954p6329k39931p5660J97231
$$ plain form
16962 657829 729204 970615 570830 804472 1013414 536758 668234 630578 969347 827661
16952 827661 855991 918008 780494 461743 980165 560543 642694 896922 974616 615758
16942 615758 865573 685134 845636 712359 986361 919192 893170 1106442 808389 979542
16932 979542 1062644 866869 1010918 1035352 995901 1035656 954306 1262569 967383 1138039
16922 1138039 1355275 1156421 1055331 1035447 1159144 1219809 845369 1033189 1242482 1243758
16912 1243758 1115406 870112 887289 984022 1171071 1401020 1152826 1519812 1161702 1365426
16902 1365426 1177181 1095037 1087224 1425925 1826131 1237786 1204267 1424554 1748059 1537221
16892 1537221 1636625 1260084 1667502 1539125 1463867 1857821 1781492 1541561 1465901 1663132
16882A663132k46918l9349M57933o0015o1199K4573m07143K77167J27546K55550
16872A991277k5401m42404K88431J99018j79388K66185l73312K17245J82181K4643
16862B148475r9583J18041J4479m45950O40707r9480K16447m63836O25253q0750
16852B573803j03094K5226K58475r8117N1571k22803K24007J87540n03933L53571
16842B746246O5759l3036r2798R8878J48841K56104l55493N23885j72010j94748
16832B991628L58905m3018J3065K52027O8123k22132L70916n8704k2289L90079
16822D098600k84884L53376p4514o4900K97469K30448m00706J40983R5959K66860
16812D658691n8804K78775J52190J81596l47245M41312J37532L8511K37750k23469
$$ plain form
16882 1663132 1416214 1376865 1834798 1774783 1713584 1738157 1331014 1608181 1735727 1991277
16872 1991277 1965876 1523472 1811903 2010921 1831533 2097718 1724406 1941651 2123832 2148475
16862 2148475 2048892 2166933 2181412 1735462 2376169 2276689 2493136 2029300 2654553 2573803
16852 2573803 2470709 2495935 2754410 2656293 2707864 2485061 2709068 2896608 2392675 2746246
16842 2746246 2812005 2778969 2686171 2785049 2933890 3189994 2834501 3358386 3186376 2991628
16832 2991628 3350533 3307515 3320580 3572607 3640730 3418598 3789514 3730810 3708521 4098600
16822 4098600 3813716 4167092 4092578 4027678 4325147 4555595 4154889 4295872 4391831 4658691
16812 4658691 4599887 4878662 5030852 5212448 4865203 5306515 5444047 5482558 5720308 5496839
16802E496839N01758p9057K61495O8551K55539j62580L83315o252M13530k79247
16792F853891L67546P4251M51156L18984j81409M36589M3143L36079J78302K07800
16782I086332J91838N40159q4280N65975P21594o6699J96157O16874M50830J68350
16772A2387130L47486J46006Q17390N44595K74161P22954N47504M81498Q22042
16763A7090766M14214O58449J038128N76106R01868O25976J331942O15354J074469
16754B4327272J149867J204490J024782J430429J526191J467589J618061J661040
16746C5409721J807178J923929J960261K331048K575668K395608L095921K878275
16738E4377609L449666L635227L883174M225614M552983M929925N072827N536583
$$ plain form
16802 5496839 5998597 5919540 6181035 6249586 6505125 6342545 6725860 6719608 7133138 6853891
16792 6853891 7221437 7295688 7746844 8065828 7884419 8321008 8364151 8700230 8878532 9086332
16782 9086332 9278170 9818329 9734049 10300024 11021618 10954919 11151076 11767950 12218780 12387130
16772 12387130 12734616 12880622 13698012 14242607 14516768 15239722 15787226 16268724 17090766
16763 17090766 17504980 18163429 19201557 19777663 20679531 21305507 22637449 23252803 24327272
16754 24327272 25477139 26681629 27706411 29136840 30663031 32130620 33748681 35409721
16746 35409721 37216899 39140828 41101089 43432137 46007805 48403413 51499334 54377609
16738 54377609 57827275 61462502 65345676 69571290 74124273 79054198 84127025 89663608
16730H9663608N941362O526594O625905P017921P158240P770479P135062P702779
16722A45541950P207610O561641O157495N375851M385031K935631J469218L92720
16714A80027147j623322k402562l734359n205691n680389o909857p050076p480191
16706A39940700p513483p886614p276673o992165o946491o391345o424115n641457
16698H4868357n182111n183339m697788m128855m401809l430042l570454l309753
16690E0964206l014859k877069k317096k245019k338643j952976j697116j660790
16682C2860638j851525j563759j610432j257242j302709j344139r32402j247249
16674B1751181o19516p86067j124079p34356n52371p98551o47904p02915n62918
$$ plain form
16730 89663608 95604970 102131564 108757469 115775390 122933630 130704109 137839171 145541950
16722 145541950 152749560 159311201 165468696 170844547 175229578 178165209 179634427 180027147
16714 180027147 178403825 176001263 172266904 167061213 161380824 154470967 147420891 139940700
16706 139940700 132427217 124540603 117263930 110271765 103325274 96933929 90509814 84868357
16698 84868357 79686246 74502907 69805119 65676264 61274455 57844413 54273959 50964206
16690 50964206 47949347 45072278 42755182 40510163 38171520 36218544 34521428 32860638
16682 32860638 31009113 29445354 27834922 26577680 25274971 23930832 22998430 21751181
16674 21751181 21131665 20345598 19221519 18487163 17934792 17136241 16488337 15785422 15222504
16665A5222504k45732j018980l66076m46114m86664l10234p21186J11123r92240
16656A0746401k95112k18240k20030q0123l68912n14434j00835m11697l27557
16647H209461R312n01705q8140j80007k27515l17687r1651r6083m41724j17050
16637F157211j34205m0676p5032m24873K17017n04917K93523n32836P6996j63403
16627D868805j43885l5059m05245L16609l90859J03764l13985R5366m24095K02755
16617C874171n0477r9452j60958J03613j73003m9172j13514K92088J15751n10134
16607C228913m15573L13422J26016l90533j75202J34432j84606l0710j6364L15113
16597B904908k72550p473p5733q8764j80055L48543m73992J86794r5797J38250
$$ plain form
16665 15222504 14976772 13957792 13591716 13145602 12658938 12348704 11627518 11738641 10746401
16656 10746401 10451289 10233049 10013019 9932896 9563984 9049550 8948715 8537018 8209461
16647 8209461 8218773 7717068 7628928 7448921 7221406 6903719 6812068 6715985 6274261 6157211
16637 6157211 6023006 5982330 5907298 5482425 5699442 5194525 5488048 4955212 5032208 4868805
16627 4868805 4724920 4689861 4284616 4601225 4210366 4314130 4000145 4095511 3671416 3874171
16617 3874171 3823694 3724242 3563284 3666897 3493894 3444722 3331208 3623296 3739047 3228913
16607 3228913 2813340 3126762 3252778 2862245 2687043 2821475 2636869 2606159 2589795 2904908
16597 2904908 2632358 2624885 2549152 2460388 2280333 2628876 2154884 2341678 2245881 2384131
16587B384131j05908j56316j28620L12405j14851m36036L74890j58357o072n4200
16577A911066j6959J5615N2951k00242K48456k84180m8559K69734m61091J47614
16567A634405J65655n52148J84446L10828j90178l43912L24512J40561o90337
16558I83832L31180K09998j78562p811j25260j12684J13945J94015Q7773k71889
16548A224537R3096O489k6169l16642K56262J30813m70510J56508k48529m425
16538H01430K23612K25445k94600j03001J83063k25683O0026M49527l36049j53096
16528H30674l03588J35081L13302r2702N94836o07701N2401n0711q6732k16850
16518E68010K25572J38575m37513K79258J6319J8959j80162O0384k04942M61171
$$ plain form
16587 2384131 2278223 2121907 1993287 2305692 2190841 1754805 2129695 1971338 1965266 1911066
16577 1911066 1894107 1909722 1962673 1762431 2010887 1726707 1678148 1947882 1486791 1634405
16567 1634405 1800060 1247912 1432358 1743186 1553008 1209096 1533608 1674169 983832
16558 983832 1315012 1525010 1346448 1338637 1213377 1100693 1214638 1408653 1496426 1224537
16548 1224537 1317633 1324122 1297953 981311 1237573 1368386 897876 1054384 805855 801430
16538 801430 1025042 1250487 955887 852886 1035949 810266 870292 1319819 983770 830674
16528 830674 527086 662167 975469 882767 1477603 869902 922303 871592 784860 568010
16518 568010 793582 932157 494644 773902 790221 809180 629018 689402 484460 945631
16508I45631j11108L4647L2968J92919m33263P6627J28096k82713R9706J52209
16498H35719l04494R0422K30283J9496k05506J67170k71380Q5925p5572J45577
16488G17640n0950j24620J70725j79241J50953r2019J45690j79252J33881K8943
16478G21750J49828k66149A90141N42440l20558K63926k36911p4795J88196m5140
16468E07299j09461k4645K63975q1379k15177M06953A69925J89937J75271n50
16458E34583m5229L88046B98323K63699o7430D569N24805l3653A97925M1113M7572
16447B86610J1130K51477j02670J55795A91783K44447j17271L08305j51981q8865
16437C86418A35493L18551J15460j93275J03097j30558J57283A53178L00306r7845
$$ plain form
16508 945631 834523 869170 902138 1095057 661794 738421 866517 583804 683510 835719
16498 835719 531225 621647 851930 871426 665920 833090 561710 647635 572063 717640
16488 717640 666690 542070 712795 533554 684507 592488 738178 558926 692807 721750
16478 721750 871578 605429 190141 732581 412023 675949 439038 364243 552439 507299
16468 507299 397838 373193 637168 555789 340612 747565 169925 359862 535133 534583
16458 534583 489354 877400 298323 562022 494592 4569 529374 495721 197925 239038 286610
16447 286610 297740 549217 446547 602342 191783 436230 318959 627264 475283 386418
16437 386418 135493 454044 569504 376229 479326 348768 506051 153178 453484 355639
16427C55639A23557L16018i7042B87220p4848L9442R9313R8070A50460J34176
16417B84636A09916N6143M02602j58170F2207J37073J41134q7661p9535j2779
16407A60439l8368J63606K36293A76810L68344a7058D61174L6487j16278A84318
16396A10940l4118K59038B2967L36959j29018Q1777C7602L07610J7112A31931
16385A61460K04392j24911l9479K44029j2965I09L03110a94124D18133O5610Q469
16374D92212A75047K00954A69640m6341a1891B57104K35285E438a40763A58335
16363B25679M81a70923F1844J98131J15116b52669B53089G6714J36739F3233M5718
16352A08951k7635B8132r717L52828g0368j53437A30742A6716h4030l2336A49287
$$ plain form
16427 355639 123557 439575 -97042 287220 212372 251814 351127 449197 150460 284636
16417 284636 109916 166059 568661 410491 62207 199280 340414 252753 173218 160439
16407 160439 122071 285677 521970 176810 545154 -17058 461174 497661 381383 184318
16396 110940 76822 335860 22967 359926 230908 312685 37602 345212 362324 131931
16385 161460 365852 240941 201462 445491 432526 909 304019 -194124 418133 483743 492212
16374 492212 175047 376001 169640 123299 -11891 257104 492389 5438 -140763 158335
16363 225679 226160 -170923 61844 259975 375091 -252669 253089 76714 213453 63233 108951
16352 108951 81316 28132 18415 371243 -70368 -223805 130742 16716 -84030 -116366 149287
16340a14461B24470m588K24288f2326F3447J57778K0990K62982A25649B4622c65831
16328C48856r5180R3552b42436A73209F6822Q9079K07180r9503K12091k22885
16318B52784A25441K0215c6587j10279B92045b26336A25292J07981E1602R9692
16308A51294a776I1995l8099a07007H5060i9929D1991R6848C9342b19386A33217
16296B28437D1594J49306C8366L0642L34411j03864e0209a2790d088G3517a970
16284E67238f9504C4948O7889J14626d2930A92974a73511B88639a15006B2667
16273B07257e8574B00499p2798A2254J18151C1191J70695K8538I7014R6288L15132
16262E08434B7202P035e3816r8326A61195B898K8651K32072p6121c0554F9500
$$ plain form
16340 -114461 224470 219882 444170 -62326 63447 221225 242215 505197 125649 24622 -365831
16328 348856 253676 347228 -242436 173209 66822 155901 363081 263578 475669 252784
16318 252784 125441 145656 -36587 -146866 292045 -226336 125292 233273 51602 151294
16308 151294 -1776 91995 53896 -107007 85060 -99929 41991 138839 39342 -219386 133217
16296 228437 41594 190900 38366 69008 403419 299555 -50209 -12790 -4088 73517 -1970
16284 567238 -69504 34948 102837 217463 -42930 192974 -173511 288639 -115006 22667
16273 207257 -58574 200499 127701 12254 130405 31191 201886 230424 97014 193302 508434
16262 508434 27202 34237 -53816 -152142 161195 2898 31549 263621 187500 -30554 69500
16250A23834a12533J732G8204K21752E5495J17652c53527m4541Q9787B72011d9304
16238d9243o6562A58151i1770d1808n7137d8502A25697a23976c2018j17283M9011
16227a00290d5307B25058m5239K13302d927C599K30984J24459A00280e2866b1230
16215B77830L4711d87025A02649J6790K59051g2197A18582P8889B8128K58477
16205B86605A1833b50397D3802J79905i6589c4475j79731A5140J79005n0195n6561
16194H7389a52880E79020a38179A2666i4935m9414M0642l01869f7137r319B74814
16182b82814A0055m183b06368Q966B67321c7622p3143j36015a17049C4109L70392
16171D04501A54067C8439P0841g0959k04847A59408c52552A35750A580R8713l5019
$$ plain form
16250 123834 -112533 -110801 78204 299956 55495 173147 -353527 -398068 -308281 272011 -49304
16238 -49243 -115805 158151 -91770 -41808 -98945 -48502 125697 -123976 -32018 -149301 -100290
16227 -100290 -45307 225058 179819 393121 -4927 3599 234583 359042 100280 -52866 -21230
16215 277830 312541 -487025 102649 119439 378490 -72197 118582 197471 28128 286605
16205 286605 11833 -250397 43802 223707 -96589 -34475 -214206 15140 194145 143950 87389
16194 87389 -152880 579020 -138179 12666 -94935 -144349 -103707 -405576 -67137 -76456 274814
16182 -282814 10055 5872 -206368 -197402 267321 -37622 -110765 -246780 -117049 34109 404501
16171 404501 154067 38439 109280 -70959 -275806 159408 -352552 135750 1580 100293 65274
16160F5274d5379E4306j6857b22641f0348n9615N2262A67115O7703k6932D4671
16148d88128A01178N2953n8232k3879i1770k28452J09858h5351r8217B24289e7067
16136a45335C2448b44498B02185B849g6652J934k6308M5411B23414C1993b15790
16124A39369d1787A19248h6896n97C5169p264a15886j60092P4565q4465C7540
16112A0859N29621A29668e7117A69134d9444j66102p047J2472A57007c9760J5740
16101b4020A6371M75959j13625I3482R6085P2868r3836k4973M2004L8614i2597
16089b19836G9799d5191j66809A20236J5924a14260q6565n6648l2210F0986a9315
16077c69721d6943j16042p1996E0534A2512J49378A2446Q8614J80312A5909m166
$$ plain form
16160 65274 -45379 54306 37449 -222641 -60348 -119963 -67701 167115 234818 207886 44671
16148 -488128 101178 154131 95899 72020 -91770 -320222 -210364 -85351 -183568 224289 -57067
16136 -145335 32448 -244498 202185 2849 -76652 -74718 -101026 -55615 223414 31993 -215790
16124 139369 -41787 119248 -86896 -87493 35169 27905 -115886 -275978 -201413 -285878 37540
16112 10859 540480 129668 -57117 169134 -49444 -215546 -222593 -210121 157007 -39760 -24020
16101 -24020 16371 492330 378705 93482 189567 262435 168599 143626 185630 224244 -92597
16089 -219836 79799 -45191 -212000 120236 136160 -114260 -200825 -257473 -289683 60986 -19315
16077 -369721 -46943 -162985 -234981 50534 12512 161890 12446 101060 281372 15909 11743
16066A1743L6799b50408g1465A69769a27088F6365a51307A87619o7164a35165
16055B11315r3563a25044B19819c7852B01310a1720H6213k5247b31818f4182o3134
16044a27316k08375I8160i8665d4345A80116a74830e4063B4762b24870E3012B2011
16032H0407R1955a45435m1576h6247l15258a61729D19595G912e9147b3129k86344
16021c09473g4443m6531j62835a1547o5867A55c97252f8334j0902H7698a1448
16009g9817a8164H5623b60690j40254B80475f6223l8301E3492J22346R1906c57106
15997B03666b85573A72215a81790C37159i3520j17768A94367e8625k3250A2171
15986E1594L8131L5703k794J4286J8493D3319O8186J9525C7203M5850M0215L5952
$$ plain form
16066 11743 48542 -250408 -71465 169769 -127088 66365 -151307 187619 120455 -135165
16055 211315 117752 -125044 219819 -37852 201310 -11720 86213 60966 -231818 -64182 -127316
16044 -127316 -335691 98160 -98665 -44345 180116 -174830 -54063 24762 -224870 53012 22011
16032 80407 172362 -145435 -187011 -86247 -401505 -161729 419595 7912 -59147 -23129 -309473
16021 -309473 -74443 -120974 -283809 -11547 -77414 155 -397252 -68334 -79236 87698 -11448
16009 -79817 -18164 85623 -260690 -400944 280475 -66223 -104524 53492 175838 267744 -357106
15997 203666 -285573 172215 -181790 337159 -93520 -211288 194367 -58625 -81875 12171
15986 51594 89725 125428 122634 136920 155413 43319 111505 131030 37203 83053 123268 159220
15974A59220B0580N3284f7172D494J75570b35749c4109F2982a77414B86143b43303
15962A83796a27214n3801f6267B23709c9321A93446L7117O709i4843g88A90106
15950D7469b4390o0695a38k78450G3294c03642k290J27328j60902A13347d9595
15938g104l180k17092R9916a036k70k55383A94131j8198b864G0483R6294a43572
15925b201n68681h6156G6581a9285j7162q4866e4372e654B1541l452b25358D6641
15912c09765b3597l31858B91503b92222L6195b8139G0809d366D7780J31748J21331
15901C00859c32423i0187A77145f494j78507L6627A36774b07167q8523K9203B78779
15889I3590b49196i0218k82148A48600a24149C45214A0232D721L8593a30645O898
$$ plain form
15974 159220 20580 73864 -67172 4494 180064 -235749 -34109 62982 -177414 286143 -243303
15962 183796 -127214 -181015 -66267 223709 -39321 193446 230563 237272 -94843 -788 190106
15950 47469 -24390 -85085 -138 -278588 73294 -303642 -305932 -178604 -339506 113347 -49595
15938 -7104 -10284 -227376 -127460 -1036 -1306 -256689 194131 175933 -2864 70483 166777 -143572
15925 -2201 -570882 -86156 76581 -19285 -36447 -121313 -54372 -5654 21541 18089 -225358 46641
15912 -309765 -23597 -355455 291503 -292222 -256027 -28139 70809 -4366 47780 179528 300859
15901 300859 -332423 -90187 177145 -6494 -185001 -148374 136774 -207167 -295690 -266487 278779
15889 93590 -249196 -90218 -372366 148600 -124149 345214 10232 4721 43314 -130645 -123747
15878a23747k32590J52864a00868p7429A60115i9034k86613A11543J4883q446
15868A17980n4412K2597Q2827a27712K194n539H2522a12127e4368m495k47328
15857c06191c1064k47377P3562G7917a00600A63800B3064O2196e8843C6214a51794
15845a02517a8283I3499a12115q1385I0270b84940L3787I4492K890a10821A05982
15833B82092g7639D3351d0483A35535I107K22905a47568I9588b01389f6948G2279
15821I2192a15103n7625e6827m4471k12845i403l00336A64715b18522B19646d860
15809b62180J27198D6150a01805A17399O202m8161a67038q8938G1491a24333G8714
15797B5556c7757B2543c90096a02072A24151a80676L8919N5433m1968c830k71333
$$ plain form
15878 -123747 -356337 -203473 -100868 -178297 160115 -99034 -385647 111543 126426 117980
15868 117980 63568 86165 168992 -127712 -125518 -131057 82522 -112127 -54368 -58863 -306191
15857 -306191 -31064 -278441 -204879 77917 -100600 163800 23064 85260 -58843 36214 -151794
15845 -102517 -18283 93499 -112115 -193500 90270 -284940 -251153 94492 97382 -110821 105982
15833 282092 -77639 43351 -40483 135535 9107 232012 -147568 99588 -201389 -66948 72279
15821 92192 -115103 -172728 -56827 -101298 -314143 -9403 -309739 164715 -218522 219646 -4860
15809 -262180 -134982 46150 -101805 117399 123601 75440 -167038 -255976 71491 -124333 78714
15797 25556 -37757 22543 -390096 -102072 124151 -180676 -141757 -86324 -128292 -3830 -275163
15786b75163B77964a69825C2302M1693C1615a5813I4672a0870A44044f0521D3874
15774a98323b4041j89499a8550D7992a70662j09802A86912l9456J0264h6552q0875
15763a67427A29406C7574O8540L56444a06703L4822j37106A48756C4842J25307
15753A60149o5972C4251J01290k5946g8814r6880F636J73442N24K8424H5551b04615
15740B1181c3113C6509f9013j23936B9204J19368d06904a57761b7659q9849D02320
15728A02961a11483H846b7811j20321O7336j18495b5609j47526b5082l07038J31770
15717b00350l0236a12784b4131o5630A10601a35252L0075j66548a24464A29375
15706a75756b1866D4712R5772J14942j03865b35916F7228P0561C2100b59483e0759
$$ plain form
15786 -275163 277964 -169825 32302 73995 31615 -15813 94672 -10870 144044 -60521 43874
15774 -198323 -24041 -213540 -18550 47992 -170662 -280464 186912 147456 157720 -86552 -167427
15763 -167427 129406 37574 106114 462558 -106703 -71881 -208987 148756 34842 160149
15753 160149 94177 34251 135541 109595 -78814 -175694 6636 180078 180602 209026 85551 -204615
15740 21181 -33113 36509 -69013 -192949 29204 148572 -406904 -157761 -27659 -117508 402320
15728 102961 -111483 8846 -27811 -148132 -80796 -199291 -25609 -173135 -25082 -332120 -200350
15717 -200350 -230586 -112784 -24131 -89761 110601 -135252 -105177 -271725 -124464 129375
15706 -175756 -21866 44712 140484 255426 151561 -235916 67228 137789 32100 -259483 -50759
15694b6406k33592Q1559a5537j69662E8292K55189i389B1464b596H0041a92896
15682g0809k8732I2265a24870H8117e1549A31933O6137K21452e5402H5875f3655
15670B27179i9206j31924B22263e2953A00314c47180O1626j08816G7827A8918
15659e2346G3355J92910h2247k21263J23979j1729N6257j31203J05768J7382A22527
15647A21327k6867b54689J6437e6922j71504h3786H829i1964l5897e0272j47967
15636a98239A09549i9421j67343C877J12151c12876f0861K7605B39430b73243
15625h8500A9314P7443f241k46147J4771g6697C8921a26326K454M3870D5094O472
15613E1566a47602G4795J30072J39711n2003a2193j83556n4330a113k8719j9058
$$ plain form
15694 -26406 -259998 -178439 -15537 -185199 58292 313481 -9389 21464 -2596 80041 -192896
15682 -70809 -99541 92265 -124870 88117 -51549 131933 198070 419522 -55402 85875 -63655
15670 227179 -99206 -231130 222263 -52953 100314 -347180 -285554 -394370 77827 18918
15659 -52346 73355 266265 -82247 -303510 -179531 -191260 -135003 -266206 -160438 -143056 122527
15647 121327 94460 -254689 -238252 -56922 -228426 -83786 8829 -91964 -127861 -50272 -198239
15636 -198239 109549 -99421 -266764 3877 116028 -312876 -60861 -33256 239430 -273243
15625 -88500 19314 96757 -6241 -252388 -237617 -76697 38921 -126326 -123872 -80002 45094 51566
15613 51566 -147602 74795 204867 344578 292575 -12193 -195749 -250079 -1113 -29832 -48890
15602d8890E3732L5739a8148K726C05469p7788b6708q4439g939q355B37769a53897
15589b98672B12880a00082K385l978k9736A53809b79870a17033D30359a99897
15578E8340i7002l93642A92637b4629F8533J66606b1755A87269a19405B81622
15567D11409a17568L2231Q211A88983b11861b1789B83524a00376D3315M05622
15557D48937a36606B63994b62264A3575b88743j870f4645F3879J80156g239j61774
15546a69013A27807e4756e837l8594D04263b00448b9779A88931E0510j4565e9593
15534b42704B58294a46168D2212L5967B0951a36222O5673k8831j48068B60258
15523B30817b40535R5334j9012P4391A20278Q8214a69283C20365E6140P3110b3645
$$ plain form
15602 -48890 53732 89471 -18148 -15422 305469 227681 -26708 -111147 -7939 -16294 237769 -153897
15589 -298672 212880 -100082 -97697 -101675 -131411 153809 -279870 -117033 430359 -199897
15578 58340 -97002 -490644 192637 -24629 68533 235139 -21755 187269 -119405 281622
15567 411409 -117568 -85337 -77126 188983 -211861 -21789 283524 -100376 43315 448937
15557 448937 -136606 263994 -262264 13575 -288743 -290613 -64645 63879 244035 -7239 -169013
15546 -169013 127807 -54756 -5837 -44431 404263 -200448 -29779 188931 50510 35945 -59593
15534 -242704 258294 -146168 42212 78179 20951 -136222 -70549 -99380 -247448 260258
15523 230817 -240535 -145201 -164213 -89822 120278 208492 -169283 320365 56140 129250 -23645
15511a74652f6780B17064l7469k2125c4466A96811B7883P3809M2766E5808M3290
15500I9098M16R2606p1659b04972B67247i597m9992B17244c1099A4985i1394b7024
15487f0744j8142c4518k06235A59893c4868k3303j37734D2010c26760F5245h4574
15475E4830B0571L122a41834O990b6670G4390a57570O0399B6626b7382q7065m1520
15463a55967B4212M1383M29982a7294l36564J43252h2003j04402j41987J33262
15453a95130C29335m5406q1462a17490B2934L693J32500n8921Q3723e0080q3935
15442a34015M9597A67737g560j41444l0918A7051a28356B2238b8335j00178G100
15430a49283b371n1011j12511D2240g895j5757A31487a23176B37723g352F1705
$$ plain form
15511 -174652 -66780 217064 179595 157470 -34466 196811 27883 101692 144458 55808 99098
15500 99098 99514 192120 120461 -204972 267247 -9597 -59589 217244 -31099 14985 -91394 -27024
15487 -60744 -78886 -34518 -240753 159893 -34868 -58171 -195905 42010 -326760 65245 -84574
15475 54830 20571 23693 -141834 -134844 -26670 74390 -157570 -97171 26626 -27382 -114447 -155967
15463 -155967 24212 65595 495577 -17294 -353858 -210606 -82003 -186405 -328392 -195130
15453 -195130 329335 283929 202467 -117490 22934 26627 159127 100206 183929 -50080 -134015
15442 -134015 -84418 167737 -7560 -149004 -179922 17051 -128356 22238 -28335 -128513 7100
15430 -149283 -2371 -53382 -165893 42240 -7895 -23652 131487 -123176 237723 -7352 61705
15418H8054c6806m6097B46089a11851a4350k0192j9606A24881a0127A07260P2665
15407A79925b14704F1584a78889B46078a65766e6582A76255b07266C3267b19838
15396C8435i9018j4267M0082A80466l7297a28753q9341C0363d5175A64150c9141
15384I0487b15915e8648q7310j49932C3218a11713F5544c72478D1194b61447R04
15373b60543A34106N2918j4950p1824B1000e8984D7884e535l7061B95342a83168
15361A9998R0599a29501A63551b24661A19430L511a31254E6308c3093B2088a81517
15349C8179b25663j24770A02158c55206A03618c85760a01882A02513C6865b36411
15338C84763a591G7922a42139f8522B64099H9564N1176f6855K7880j32020A43299
$$ plain form
15418 88054 -36806 -82903 246089 -111851 -14350 -34542 -54148 124881 -10127 107260 179925
15407 179925 -214704 61584 -178889 246078 -165766 -56582 176255 -207266 33267 -219838
15396 38435 -99018 -113285 -73203 180466 143169 -128753 -218094 30363 -45175 164150 -39141
15384 90487 -215915 -58648 -145958 -295890 33218 -111713 65544 -372478 41194 -261447 -260543
15373 -260543 134106 187024 172074 100250 21000 -58984 47884 -5535 -42596 295342 -183168
15361 19998 110597 -129501 163551 -224661 119430 122941 -131254 56308 -33093 22088 -181517
15349 38179 -225663 -350433 102158 -355206 103618 -385760 -101882 102513 36865 -236411
15338 384763 -1591 77922 -142139 -68522 264099 89564 140740 -66855 -38975 -170995 143299
15326H3146M2258d163A01520l8105J35322B3567M858J89957a87627Q3925B33555
15314H8361B154a82343c7574B82403G3254a64713F7722g7633B00822C5673M010
15303C9683f5389B124J00076m9544a49072j84063B80167F2489K39745d2624A47665
15291c08165a25354B15609G8107b14213E3838f3901G3106b49898A16939L9844
15281A56783K73545l7694i6233N986C75587L4377A62869A2375J16145I811K78886
15270B88697a79797f3783j71757f5270A9319e0887A06179C0902b25707C14882
15259A24719C0221g4290j11882g8807b2046j08283J218A61598G3422J24444K9557
15248B27423P07574M49223l37311j87903J3093B86488m4794A2085b21939B75896
$$ plain form
15326 83146 125404 -4163 101520 63415 198737 23567 28425 218382 -187627 -103702 233555
15314 88361 2154 -182343 -37574 282403 73254 -164713 67722 -77633 200822 35673 39683
15303 39683 -65389 2124 102200 52656 -149072 -333135 280167 62489 302234 -42624 147665
15291 -308165 -125354 215609 78107 -214213 53838 -63901 73106 -249898 116939 156783
15281 156783 430328 392634 -96233 -90247 375587 409964 162869 12375 128520 9811 288697
15270 288697 -179797 -63783 -235540 -65270 19319 -50887 106179 30902 -225707 314882
15259 124719 30221 -74290 -186172 -78807 -22046 -130329 -129111 161598 73422 197866 227423
15248 227423 934997 1384220 1046909 859006 872099 286488 241694 12085 -221939 275896
15237B23858N5383B3681N2760B9767a3676j64800B01048i4226K0553J0642D04
15225a40927D5812J09659m4825R0071m5373a3596k51325A30426k3961a08312l8279
15214a46591B51285E9978h8853L1036A26508e2723j01568I0634o59c25465H9056
15202a48846C01728o2403j5523I8410i5605L3259D2184c41121A22718J96990j29886
15191A89822r0135g4121q030j24340P2501f6169l4253C80850A45375C2172b04545
15179H2916A3471L02542D0689h2071K7851F8765K17318b1720C8098A5834K7598
15168D3432K5914e1967C3944a16424H713a02775b7208h66B55954J10458A00239
15156A19072b38316h9589B51241a3093C70716a26864e0871A20439d9343C77367
$$ plain form
15237 223858 279241 23681 76441 29767 -13676 -178476 201048 -94226 -73673 -63031 404
15225 -140927 45812 155471 110646 200717 155344 -13596 -264921 130426 106465 -108312 -146591
15214 -146591 251285 59978 -88853 -57817 126508 -52723 -154291 90634 89975 -325465 89056
15202 -148846 301728 239325 223802 98410 -95605 -62346 42184 -341121 122718 319708 189822
15191 189822 99687 -74121 -82151 -206491 -133990 -66169 -100422 380850 145375 32172 -204545
15179 82916 13471 316013 40689 -82071 -54220 68765 286083 -21720 38098 15834 43432
15168 43432 69346 -51967 33944 -116424 8713 -102775 -27208 -866 255954 366412 100239
15156 119072 -238316 -89589 251241 -13093 370716 -126864 -50871 120439 -49343 377367
15145B86313l6945f3898D200J19012a16760A12068L12973d1588n4515a9999n2691
15134g2690B63442G6042K19787E9317f8938A08061h6963j93583B32431j14460
15124A17971b1093G2827L27453H5035f5529k0954A74660G5418J60401n1679P4676
15113B58816A12052m1934J72713F3691J59926i3483A30334k5388k7578R1834l1780
15102A37422C5225J18153J49981a6809A40851P1581b1752E4133a16460L5954c4086
15090B69976J17610a68516A36369b05391B11444J73603c1980j11662c2930I8610
15079D14c23930d0606H6512L1604n2202B1530L30670E3907K5654d9413n8321A89747
15066D3883K24497a11446B54224j15936K14555E9565J89981q4921L350a1901D3389
$$ plain form
15145 286313 249368 -63898 4200 123212 -116760 112068 425041 -41588 -96103 -19999 -72690
15134 -72690 263442 76042 295829 59317 -68938 108061 -86963 -280546 232431 117971
15124 117971 -21093 72827 400280 85035 -65529 -86483 174660 75418 235819 184140 258816
15113 258816 112052 70118 242831 63691 223617 -93483 130334 104946 77368 169202 137422
15102 137422 35225 153378 303359 -16809 140851 212432 -21752 54133 -116460 -80506 -34086
15090 269976 387586 -168516 136369 -205391 211444 385047 -31980 -143642 -32930 98610
15079 414 -323930 -40606 86512 118116 65914 21530 352200 53907 79561 -49413 -107734 189747
15066 43883 268380 -111446 254224 138288 352843 59565 249546 164625 167975 -11901 43389
15054B15651f24k0268P99q2799G884l651L12457b80988B41051L6094j31705K85305
15042D30745f4735j18492C88224j46274f7980B42490A07198a45263B11149r6831
15032A14318n0694Q5268k5929e1845B22639M8509r4965M9249J2666j3458b48255
15020c6362I5830K22458h3457C92275r3885H1410O4073J55465g0714B58657g5467
15008C50493A23014d0611H3703l7213N4635a78911e879C17264A3809N0189c7161
14996B70627o4599g725B17260I9692L87375r7626A55729J92391G9302C3029R436
14985D2465g8597A04909k6745F019L94794C4750J58970J4444L5331K0193B5851
14973E4097N8519l3226L64122A97404N0699E7449J93525L01010k07395j44898
$$ plain form
15054 215651 -624 -20892 -20093 -102892 7884 4233 316690 -280988 241051 277145 145440 430745
15042 430745 -64735 -183227 388224 241950 -67980 242490 107198 -145263 211149 114318
15032 114318 63624 148892 122963 -51845 222639 271148 176183 225432 238098 224640 -248255
15020 -36362 95830 318288 -83457 392275 298390 81410 145483 300948 -70714 258657 -75467
15008 350493 123014 -40611 83703 46490 101125 -178911 -5879 317264 13809 63998 -37161
14996 270627 206028 -7725 217260 99692 487067 389441 155729 348120 79302 33029 42465
14985 42465 -78597 104909 78164 6019 400813 34750 193720 208164 243495 263688 25851
14973 54097 112616 79390 443512 197404 248103 57449 250974 551984 344589 199691
14963A99691a6847F7650a5577A56582J7102J2993A1299M3133R8333J94453j32465
14952B14753a64986F6890l1001K67830C1867L44316q5114d8228A03839e9163D6460
14940I5162J31250r9447J75686I4255E903b9326A66961L06308j92654J57638B00836
14928A23209J04224j01929Q1694q2132J25106m8024J99323B6094a3654G1453J73220
14917B44673i7543D18417A46607J60473C0411K28903J41115M2281k06282J30467
14907C66895j52223M84J44902K1561R4595r2611j58041r5498J76896J1290a13830
14895A42405K73605A21364f1750A24141K59999o7735M1809j4991L3634P4635A28187
14883D14988L4172H6182J46645O7640p0656J43763n2333m7374P6757A68290L00849
$$ plain form
14963 199691 -16847 67650 -15577 156582 173684 186677 11299 54432 152765 347218 214753
14952 214753 -164986 66890 35889 303719 31867 376183 291069 -48228 103839 -59163 46460
14940 95162 226412 126965 302651 94255 5903 -29326 166961 473269 280615 438253 200836
14928 123209 227433 125504 207198 125066 250172 202148 401471 26094 -13654 71453 244673
14917 244673 -97543 418417 146607 307080 30411 259314 400429 442710 236428 366895
14907 366895 214672 215156 360058 381619 476214 383603 225562 130064 306960 318250 -113830
14895 142405 416010 121364 -61750 124141 384140 316405 358214 343223 376857 451492 128187
14883 414988 449160 86182 232827 300467 229811 373574 321241 273867 350624 168290 469139
14872D69139A81056q7445K36233j20166J12110K35161B67106K08099j56823j03657
14862B14725R7387J50400k15486K21549A98519E4397j900M39462B36762m353O5110
14851B97519A05640J61763R1327J76580K91031l60279k27114J32171R7711k6237
14841D42593B08383J40868J48736j63919q562l5212L7341M59258l73258J22479
14831E36114B35875L3087A09056L73812L94677k89254B82523m3808J58303j70046
14821B26972R9803K51808J06039B57120H3326O08250A97911J79080j4933m627
14811C57431L89792C19131A45483L25475r1865A64055L54763p983j8069k11122
14801B81644h375D65133o356M1977J88295k56042j67393J62529K00901A85424
$$ plain form
14872 469139 181056 93611 329844 209678 321788 556949 267106 475205 318382 214725
14862 214725 312112 462512 247026 468575 198519 54397 52497 491959 236762 232409 297519
14851 297519 105640 267403 358730 535310 826341 466062 238948 371119 468830 442593
14841 442593 208383 349251 497987 334068 325506 290294 327635 786893 413635 536114
14831 536114 235875 268962 109056 482868 877545 588291 282523 238715 397018 226972
14821 226972 326775 578583 684622 257120 83326 691576 197911 376991 362058 357431
14811 357431 747223 319131 145483 470958 379093 164055 518818 510835 492766 281644
14801 281644 -8375 465133 458777 500754 689049 433007 265614 428143 629044 185424
14790B21084K6256N83849l30837Q4409B44963P1559q9800m0900J75677M64814
14780H26313C70097K11380O3155B91070J80188q8218O8574F8271K14174N21340
14770H03785B31301J7142K69921B52685M40672C44543j68855N41442Q0624k37503
14760E60251J86573k44611j00997P1599N4806K4283j60977M31367j13871j51590
14750E56833k72278J52690O3778q624Q1788j07375j8424A75961N38523l54542
14740C59942M79803j50408k75730L6286J53564K55773D20023j61144Q6287J10487
14730D55653k04574L0841M64385l02822Q1295j2038J82246L2499P8166B97244
14719F39210K1148k20144K10659K04245j25261j65830J89274l9492R4701l44316
$$ plain form
14790 221084 247340 831189 500352 584761 244963 316522 226722 185822 361499 826313
14780 826313 370097 581477 644632 291070 471258 383040 451614 68271 282445 803785
14770 803785 231301 248443 518364 252685 693357 344543 175688 717130 797754 560251
14760 560251 746824 502213 401216 472815 527621 551904 390927 822294 708423 556833
14750 556833 284555 437245 501023 492399 574187 466812 448388 175961 714484 359942
14740 359942 839745 689337 413607 449893 603457 859230 420023 258879 345166 455653
14730 455653 251079 281920 746305 443483 524778 512740 694986 727485 805651 297244
14719 639210 660358 440214 650873 855118 729857 564027 753301 713809 808510 464194
14709D64194J21478L25373D16424P1820j9605Q615k5398O56652m52793K97001
14699I52716l92465K825j3994J14889K54278j92241J65815k0935k53079L33748
14689I51557L4304m42250o3847m3686k1215L56672k0772Q4237L27785m48490J41841
14678H56136k13017L32070l94877K87349j18105j15481k0243P4651L14694k48404
14668G54773k69178J90533o7537O88764m14335k86263J42250M02472C91956M41631
14658H33587R910r2197K60072p8384M934l6382o391J21134k14447j52429L83625
14647A033032J27580k58562J63655m8832j40429N7940J60110j20176N2065k6054
14637A000329j07742N8647J41622j0951m03432L71011J64820k210k89056K03290
$$ plain form
14709 464194 585672 911045 416424 488244 468639 477254 451856 1108508 655715 952716
14699 952716 560251 563076 549082 663971 918249 726008 891823 870888 617809 951557
14689 951557 985861 543611 479764 436078 414863 771535 750763 835000 1162785 714295 856136
14678 856136 643119 975189 580312 867661 749556 634075 613832 688483 1003177 754773
14668 754773 485595 676128 608591 1297355 883020 596757 739007 1141479 391956 833587
14658 833587 843497 751300 1011372 932988 937922 901540 895149 1016283 801836 649407 1033032
14647 1033032 1160612 902050 1065705 1016873 876444 934384 1094494 974318 1026383 1000329
14637 1000329 892587 951234 1092856 1081905 678473 1049484 1214304 1212094 923038 1126328
14627A126328L33142n08065J45392R5599N4612L0546l51097j10478L23449j11630
14617A027798M1501L24932n8614k26472n5676J58529k29601K6399j19911L35258
14607A224143j2164k8558k7761L28230k52642N4984K06744k54326o7879l0516
14597A140255J00617J98889p0513N0626L1404R3820k19680K3722K390K75685k31381
14586A395834J34823k51766J41403Q9931p9191K90233j16967K29153l34178K1187
14576A520462p6777J47819J9302L3093p9324P8099K0610Q0706m44311Q59855L1479
14565B191013m92804r03K61400L5786M9969J23761m83554N53825o3061J13943
14555B289375M6011K10224L79651L27927L36971P77658J721561L033167O282217
$$ plain form
14627 1126328 1459470 951405 1096797 1192396 1247008 1277554 926457 815979 1139428 1027798
14617 1027798 1069299 1394231 1335617 1109145 1053469 1211998 982397 1008796 888885 1224143
14607 1224143 1211979 1183421 1155660 1483890 1231248 1286232 1492976 1238650 1170771 1140255
14597 1140255 1240872 1439761 1369248 1419874 1451278 1545098 1325418 1349140 1351530 1627215 1395834
14586 1395834 1530657 1278891 1420294 1510225 1431034 1721267 1604300 1833453 1499275 1520462
14576 1520462 1443685 1591504 1610806 1643899 1564575 1642674 1663284 1743990 1299679 2159534 2191013
14565 2191013 1698209 1697306 1958706 1994492 2044461 2168222 1684668 2238493 2175432 2289375
14555 2289375 2335386 2545610 2925261 3253188 3590159 4367817 6089378 9122545 15404762
14546A5404762J3036672J3503853j9052013I758872D249397j967888k72194k15559
14538A793756N8227k29037j40483L37358k3308m80567O55489n04283K96745J81760
14528A945657o6057j72600K5190K64549K3561l87106J82002K53395j16124p1322
14518A881145K03831q6874K04503l55266M47770l40477k5201M02317q856J8043
14508B340935J163J55914k61931J56855j3512j94100L88328l48930n0793K79480
14498B453409J12530J56684k07488L14282M1056l15674J42325j95171J94424K12721
14488B909098p4108J58239k71885K16058j73776O2018L6330J28279K46462m0712
14478C196003k14011L04126l35350M8543l33276P54876k93933P8614N86397l33620
$$ plain form
14546 15404762 28441434 41945287 22893274 9758872 4249397 2281509 2009315 1793756
14538 1793756 1851983 1622946 1482463 1819821 1796513 1315946 1971435 1467152 1763897 1945657
14528 1945657 1879600 1707000 1732190 1996739 2020300 1633194 1815196 2068591 1952467 1881145
14518 1881145 2084976 1998102 2202605 1847339 2295109 1954632 1929431 2331748 2322892 2340935
14508 2340935 2342098 2498012 2236081 2392936 2379424 2185324 2573652 2224722 2173929 2453409
14498 2453409 2565939 2722623 2515135 2829417 2870473 2554799 2697124 2501953 2696377 2909098
14488 2909098 2834990 2993229 2721344 2937402 2763626 2825644 2861974 2990253 3236715 3196003
14478 3196003 2981992 3286118 2950768 2999311 2666035 3420911 3126978 3205592 3791989 3458369
14468C458369q5573Q8432K8079m5323L02054K03672k45723Q6579J16777N3984
14458C961327k32630K57224j43114q9664N54188r4254j2758J32633k83446J74666
14448D224172r2070M78592k7143J08541j86757L64644l02456L21133P9912K626
14438D971194J4567J06627r5450O1752L98357m16811K01886M35553m07061K58808
14428E529422J39791j95462L39573j19403R7321L46878l86025L13370L6834Q0479
14418F182778L20019k67081L69707q3961J86600K38843k24674L23643J64499R8374
14408G308747L7915j22252O39169J05158j39034M25050l01297k11211L37575N36253
14398H616073j66227L04467K76901l34531K78009M75300j62033j6436L45596K57701
$$ plain form
14468 3458369 3372796 3461228 3489307 3443984 3746038 3949710 3703987 3790566 3907343 3961327
14458 3961327 3728697 3985921 3842807 3753143 4307331 4213077 4200319 4332952 4049506 4224172
14448 4224172 4132102 4610694 4583551 4692092 4505335 4869979 4567523 4888656 4968568 4971194
14438 4971194 4985761 5092388 4996938 5058690 5457047 5040236 5242122 5677675 5270614 5529422
14428 5529422 5669213 5473751 5813324 5693921 5791242 6138120 5752095 6065465 6102299 6182778
14418 6182778 6502797 6235716 6605423 6521462 6708062 6946905 6722231 7045874 7210373 7308747
14408 7308747 7346662 7224410 7863579 7968737 7829703 8254753 7953456 7742245 8079820 8616073
14398 8616073 8449846 8754313 9031214 8696683 8974692 9449992 9287959 9271523 9617119 9874820
14388I874820R7603J62192p198N46601j04942N18518m04140R35204j36694N45475
14378A2027439J1583R1334K98978J37073L97145K95994L5564M46247M08339J11174
14368A4260870K144N44820M75506L12761n0689P70406J76732M88881l2581N79382
14358A7528232L27708M14472L67566N79048O57367L14771M35458M29856K33414
14349B1287892P45161N10205N18893N97890P08656P82005M58428O68858P43368
14340B7021356Q36867M63763J118232O17865O80316J054287J032540R60346Q46198
14331C4631770J126378Q69273J382949J081973Q93053J529875J598745J368567
14323D4482583J906277J313827J224016K242459J841025J877569J844164K249393
$$ plain form
14388 9874820 9972423 10134615 10127417 10674018 10569076 11087594 10683454 11618658 11481964 12027439
14378 12027439 12039022 12130356 12429334 12566407 12963552 13259546 13295110 13741357 14149696 14260870
14368 14260870 14263014 14807834 15283340 15596101 15545412 16315818 16492550 16981431 16948850 17528232
14358 17528232 17855940 18270412 18637978 19217026 19874393 20189164 20624622 21054478 21287892
14349 21287892 22033053 22543258 23062151 23660041 24368697 25150702 25609130 26277988 27021356
14340 27021356 27858223 28321986 29440218 30058083 30738399 31792686 32825226 33785572 34631770
14331 34631770 35758148 36627421 38010370 39092343 39985396 41515271 43114016 44482583
14323 44482583 46388860 47702687 48926703 51169162 53010187 54887756 56731920 58981313
14315E8981313K230333K462265K419648K918111K819037K756258L070307L484084
14307H1141356L836918L731135L733376M198543M534058M711655N572396M742397
14299A16201834O020436O247511O619801O904795P459582P743936Q533953Q859512
14291A74591360R927595J0040645J0294254J1629568J1775789J2729529J3402388
14284B54391128J3572728J4351269J4938996J4805036J5015044J5244240J4812710
14277C57131151J4728905J3316548J2422769J0163908O213148K920561J783923
14270D18680913J435296J951963k195109j930654m342631p669850r656306j1380358
14262C84893264j2931502j4093548j4334044j4926630j5104134j5119339j4608379
$$ plain form
14315 58981313 61211646 63673911 66093559 69011670 71830707 74586965 77657272 81141356
14307 81141356 84978274 88709409 92442785 96641328 101175386 105887041 111459437 116201834
14299 116201834 122222270 128469781 135089582 141994377 149453959 157197895 165731848 174591360
14291 174591360 184518955 194559600 204853854 216483422 228259211 240988740 254391128
14284 254391128 267963856 282315125 297254121 312059157 327074201 342318441 357131151
14277 357131151 371860056 385176604 397599373 407763281 413976429 416896990 418680913
14270 418680913 420116209 422068172 419873063 417942409 413599778 405929928 396273622 384893264
14262 384893264 371961762 357868214 343534170 328607540 313503406 298384067 283775688
14255B83775688j4256185j3164382j3270944j2822271j2084987j1250326j0902728
14248A96023865j0627972r679931r132463q291144p903687p137835p433661o668412
14240A29148760o396226n981480n296751m627261n268397m466538m626262l796634
14232H8689211l842731l446261l109562l115383l499831k857337k393997k654657
14224F3769452k628767k431022j720355k018196k279795j643040j762068j686706
14216D7599503j583329j737299j082541r91473j655759j141227j508883r81334
14208C6917658j168577m50800q91738j609441j272479n95200m43858r33023n75669
14199B8976873q80490o26277o71883j410690j69985p79681k99965j323888M7678
$$ plain form
14255 283775688 269519503 256355121 243084177 230261906 218176919 206926593 196023865
14248 196023865 185395893 175715962 166583499 158292355 150388668 143250833 135817172 129148760
14240 129148760 122752534 116771054 111474303 106847042 101578645 97112107 92485845 88689211
14232 88689211 84846480 81400219 78290657 75175274 71675443 68818106 66424109 63769452
14224 63769452 61140685 58709663 56989308 54971112 52691317 51048277 49286209 47599503
14216 47599503 46016174 44278875 43196334 42204861 40549102 39407875 37898992 36917658
14208 36917658 35749081 35298281 34406543 32797102 31524623 30929423 30485565 29552542 28976873
14199 28976873 28096383 27470106 26798223 25387533 25217548 24437867 24137902 22814014 22861692
14190B2861692q60305o43168l28006o82747m20840k50783o08714q03460K28642
14181A8492311o52391l94396l45054l79694k50879m28198m20153l24624m41615
14172A4855307k03660m23830K00731l77671n66830k58167j89999K16557l76640
14163A2875798m64574k05345j31832l55435l75341J93339l00180l16932k80109
14154A0639389p1262J24069k04966j38818n78984K18077k54586k97622n74735
14145H860562K62021j20376l9753N302k83591m70726l1953J90127m29866J22520
14135H064267q8388m72892j9029j54109o555j16159Q1606l49649J27879k20111
14125F846860R1657O6605n32276J7598m42576L84207J65018m82839k93990K18757
$$ plain form
14190 22861692 22001387 21358219 21030213 20347466 19926626 19675843 19067129 18263669 18492311
14181 18492311 17839920 17445524 17100470 16720776 16469897 16041699 15621546 15296922 14855307
14172 14855307 14651647 14227817 14428548 14050877 13484047 13225880 13035881 13252438 12875798
14163 12875798 12411224 12205879 12074047 11718612 11343271 11536610 11236430 10919498 10639389
14154 10639389 10568127 10692196 10487230 10348412 9769428 9987505 9732919 9435297 8860562
14145 8860562 9122583 9002207 8962454 8967756 8684165 8213439 8181486 8371613 7941747 8064267
14135 8064267 7975879 7502987 7483958 7329849 7323294 7207135 7288741 6939092 7066971 6846860
14125 6846860 6938517 7005122 6472846 6490444 6047868 6432075 6597093 6114254 5820264 6039021
14115F039021o3800M6671j15558k14699K75714n01979j04798K00189l76417K20433
14105E404777k94944J22152k33392L7323r2595J14619j58769l08370K55507l02791
14095D543517n4620j562K25615k83178N2559J1458l66353J0721N0648j88778L03540
14084D303567k44897j40136r9467K80641o3252l20560R9943M51449o10700Q0314
14074C736902k4402M4877k52573M17193n63957j8251j11197J81160k8587o0009
14064C321156J37892r3755K3925j71108k3855K26798m79196K33312j27174J37026
14054C185021Q9252n59093M20258n10707K83089o5129N7721k04374k56024N26364
14044B966378k00477m70380M58706k50980M319K78275m76300n0741K89726k04743
$$ plain form
14115 6039021 5975221 6021892 5906334 5691635 5967349 5465370 5360572 5560761 5184344 5404777
14105 5404777 5109833 5231985 4998593 5035916 4943321 5057940 4899171 4590801 4846308 4543517
14095 4543517 4488897 4487335 4712950 4429772 4482331 4493789 4127436 4138157 4188805 4000027 4303567
14084 4303567 4058670 3918534 3819067 4099708 4036456 3715896 3815839 4267288 3656588 3736902
14074 3736902 3712500 3757377 3504804 3921997 3358040 3339789 3228592 3409752 3381165 3321156
14064 3321156 3459048 3365293 3389218 3218110 3194255 3421053 2941857 3175169 3047995 3185021
14054 3185021 3274273 2715180 3135438 2624731 2907820 2842691 2900412 2696038 2440014 2966378
14044 2966378 2765901 2295521 2754227 2503247 2507566 2785841 2309541 2258800 2548526 2343783
14034B343783J03861J64465j33186J46489n7768K25745l18569L71416l01980m12162
14024B132094M68932k17225k07074J95854k31918J48900O9493k65298q1435Q6683
14014B099006k08146J29543J18933l94864K81330j79829Q2301J18504m20679L11110
14004A937209j81627K57139Q160k48172o2710m05531P5607K57253O7555p2166
13994A632717M16882j77205p106K6889J4709J163392K266509N470421J1469368
13985B2276576J9431817j5708895A2632827n413180k019398j242676l59511n10412
13977C087650l08410j64511P7444k20873r877j82152K6344J30486l92877j58285
13967A884939l36652O24011k68685j9590k5299j70969P5885r9624R6824J97850
$$ plain form
14034 2343783 2447644 2612109 2478923 2625412 2567644 2793389 2474820 2846236 2544256 2132094
14024 2132094 2601026 2383801 2176727 2372581 2140663 2289563 2359056 2093758 2012323 2099006
14014 2099006 1890860 2020403 2139336 1744472 2025802 1845973 1928274 2046778 1626099 1937209
14004 1937209 1755582 2012721 2020881 1772709 1709999 1304468 1380075 1637328 1704883 1632717
13994 1632717 2049599 1872394 1865288 1892177 1906886 3070278 5336787 10807208 22276576
13985 22276576 41708393 25999498 12632827 7219647 5200249 3957573 3598062 3087650
13977 3087650 2779240 2614729 2692173 2471300 2461423 2279271 2305615 2436101 2043224 1884939
13967 1884939 1548287 2172298 1903613 1884023 1858724 1687755 1763640 1664016 1760840 1958690
13957A958690m22963m5690j12139L00469j43266K8671K86311R039k21593j42053
13947A495476L8403N5542k83743K90540j554o0350j94064O6548j96188o3592L66171
13936A513189j80585K40523j44090j98390K14228r2772j22739L75881k41105j17030
13926A247110K45681R929q6140j35275K0762k50963L03312k68304K03161j015
13916A288258l39997K92847K06409q5778l17735J54576k07732J18873j14782N9383
13906A054322N7776J54204K35091m67103J7287M24103n10647J68955r0391J33994
13896A177591l64642J85340m49626N80013K21416m47379P3386J65447L6087k6966
13886A150667r7062j23121k3057j52881J94012l380k98418N74586j51043j49361
$$ plain form
13957 1958690 1535727 1490037 1377898 1678367 1535101 1563772 1850083 1859122 1637529 1495476
13947 1495476 1533879 1589421 1305678 1596218 1594664 1534314 1340250 1406798 1210610 1147018 1513189
13936 1513189 1332604 1573127 1429037 1230647 1444875 1352103 1229364 1605245 1364140 1247110
13926 1247110 1492791 1502720 1416580 1281305 1302067 1051104 1354416 1086112 1289273 1288258
13916 1288258 948261 1241108 1447517 1361739 1044004 1198580 990848 1109721 994939 1054322
13906 1054322 1112098 1266302 1501393 1034290 1051577 1475680 965033 1133988 1043597 1177591
13896 1177591 812949 998289 548663 1128676 1350092 902713 976099 1141546 1177633 1150667
13886 1150667 1053605 930484 907427 754546 948558 945178 646760 1221346 1070303 920942
13876I20942j57884P197N9225M3822Q4684L7968C67024P22632j89951J43090j33305
13865I09490j87616O05099n26879J88252p9814J56493m52750O5095M32694l57371
13855G52693J03792J25466k11316r0745L1792N32753n23797K05159R943m09526
13845E26214L38031m0170o8105j40898K99436l3062l11457R0955J66765o0117
13835G67592K82624n7724m94053M7350m9641J89875J97266k46697J93334j17025
13825G12901n3019J48753j85364j48305K11546k22720J10105L8376m9865K61835
13815H24243p7539k4370K4610l34233J69272N5920K69521k95893J60469j97976
13805E74024k01879N48532C57405L16593j32682K89833j37133j67886Q8419L8872
$$ plain form
13876 920942 763058 770255 829480 873302 957986 995954 367024 1089656 899705 1042795 909490
13865 909490 721874 1326973 800094 988346 908532 1065025 612275 677370 1110064 752693
13855 752693 856485 981951 770635 679890 711682 1244435 720638 925797 935740 526214
13845 526214 864245 824075 755970 615072 914508 881446 569989 660944 827709 767592
13835 767592 1050216 992492 498439 545789 496148 686023 883289 636592 829926 712901
13825 712901 659882 808635 623271 474966 686512 463792 573897 612273 562408 824243
13815 824243 746704 722334 746944 412711 581983 637903 907424 611531 772000 574024
13805 574024 372145 920677 357405 673998 541316 831149 694016 526130 614549 653421
13795F53421j19277J54871K27371j98066n0468k05081J77391R233L749k14305
13785D38839R6271J6515J97002r0855m0823J18872L3314k38731O9339k5543j87002
13774C87198K17485Q0366J31080j88358k37587L04021j25391q4345B11535M70891
13764F82426k66311K35275j82153A7231L79121m5625k2157j6730K88004K8353
13754F28197B40765L79757k70515J02661n7147M66180j78472o6026B25842P24103
13744I49945A44793L60204m4241L53019j69031l14051j43814L36074J53402B67380
13733F55565B45202Q9501L95240A92415k801L57512k07797j01158M97275l58943
13723C76503j06183J23396O5227j97839N1028L0844L10799k57121K17465B11156
$$ plain form
13795 653421 534144 689015 916386 718320 667852 462771 640162 649395 653144 438839
13785 438839 535110 551625 748627 657772 616949 735821 769135 530404 599743 574200 387198
13774 387198 604683 685049 816129 627771 390184 694205 568814 484469 211535 682426
13764 682426 416115 651390 469237 17231 396352 350727 328570 311840 599844 628197
13754 628197 240765 620522 350007 452668 395521 861701 683229 617203 225842 949945
13744 949945 144793 504997 460756 813775 644744 330693 186879 522953 676355 267380
13733 655565 245202 334703 729943 192415 189614 547126 339329 238171 735446 376503
13723 376503 270320 393716 458943 261104 312132 342976 653775 396654 614119 211156
13712B94920o5310M19709k36410p5241M16576B94837H4087L10567L92106B86099
13701G9859M81698B06858K48216j2147j52564K46563B31970Q0784J36566j46989
13691C02331l9285Q5312K44278B46666L00167B50771J46994K69375B72651J65523
13681D38174a7038C04771p1030J69101K36167B35950K5604p7689L78922j12690
13671D50097j46177N7685J13220r1746C8580L72822J08409Q558J1494k25807J83393
13660D97449B04157K29437o5135A80724K53121A78350J88401p9547A43466R5464
13650B38930A12351J05576K2532L50918A71510J45288o5112L07633k01955L7384
13640C94748j07211H7164J10376L8580q6004M809M83198A81594M70568a6551F72044
$$ plain form
13712 294920 229610 649319 412909 337668 754244 294837 84087 394654 786760 286099
13701 79859 561557 206858 455074 442927 290363 536926 231970 312754 449320 302331
13691 302331 263046 348358 592636 246666 546833 250771 397765 667140 272651 438174
13681 438174 -17038 304771 233741 402842 639009 235950 261554 183865 562787 450097
13671 450097 303920 361605 474825 383079 38580 411402 519811 528369 539863 314056 497449
13660 497449 204157 433594 368459 180724 433845 178350 366751 287204 143466 238930
13650 238930 112351 217927 240459 591377 171510 316798 251686 559319 357364 394748
13640 394748 287537 87164 197540 236120 150116 154925 638123 181594 652162 -16551 672044
13628A70012J32115K74134J67994j78554j62506j09909J02869Q0788m429p7230
13618C95284R4473j75600K31912B05087J42445l1730j2227j7225M2448J18669
13608D47467J23273j70729j2322j49621L79049H5101K29154m6657J51650J6043
13598D35291K00888B18956h3989E61384B34179g5435H8331P0756K99307j89702
13588B68692L31202g3275D44217A44322L1811l573n6077B2925J88356k6228P5740
13577B60793J16159J25942j07191O2613E2348J64425P4015K56401o9915j89695
13567B87579o4160a76957E5465K84835r1104j02802L8517J75622m9223F3349P6451
13556A39800J67671r954K877K6599k6445R2577k5077j31975p9425R2927H6869
$$ plain form
13628 170012 302127 576261 744255 565701 403195 293286 396155 476943 472514 395284
13618 395284 489757 314157 546069 205087 347532 315802 303575 286350 328798 447467
13608 447467 570740 400011 387689 238068 617117 85101 314255 267598 419248 435291
13598 435291 636179 218956 -83989 561384 234179 -75435 88331 159087 458394 268692
13588 268692 599894 -73275 444217 144322 176133 172560 116483 22925 211281 185053 260793
13577 260793 376952 502894 395703 458316 52348 216773 290788 547189 477274 287579
13567 287579 223419 -176957 55465 340300 249196 146394 184911 360533 311310 63349 139800
13556 139800 307471 297517 300394 326993 300548 393125 368048 236073 156648 249575 86869
13544A61687J96209c140C73869A02362N40207l10212j10339J68957j29438F5015
13533A94053n6650l1508a05392C31832B1864K45478o3896J67578l7940C2848N05073
13522E37921k42073A04477J30018Q1988A54315I997O09509B23000Q9153j29080
13512A83073J05058b24454D67294B02181B7891J97418a77326B38459b8438C16510
13501A01998J82614i8885A32877J39751J98012D5113J6363L05147j70159K17561
13491D14025f8237B36881J48161h7663H1362K5698J78078b0535B38809A08472
13480A63280Q0972J39461j28603R436G4273h113k2778B85800l7557J5935j12807
13469A51371Q0453b49323I3294J92879A13866J43926l0121j05705R9335j3069
$$ plain form
13544 161687 357896 -3140 373869 102362 642569 332357 222018 390975 261537 65015
13533 194053 137403 105895 -105392 331832 21864 267342 203446 371024 333084 32848 537921
13522 537921 295848 104477 234495 316483 154315 9997 619506 223000 312153 183073
13512 183073 288131 -224454 467294 202181 27891 225309 -177326 238459 -28438 316510
13501 101998 284612 -98885 132877 272628 470640 45113 61476 366623 196464 414025
13491 414025 -68237 236881 385042 -87663 81362 107060 285138 -20535 238809 108472
13480 163280 244252 383713 255110 264546 74273 -8113 -30891 285800 248243 264178 151371
13469 151371 231824 -249323 93294 286173 113866 257792 227671 121966 221301 208232
13459B08232K02765n0656d6833D26297j59133E2606j2534K0982o406L90785J91493
13448F36926j94177F9640K59082j63451J49208I8747K30065j61470K9165q3161
13438A13346d0034C61576a35202G8651Q0269J93842o4372D4206J41199N079K81083
13427D71567g2478B93273e2590B81581b10273D38370e6496C73820j58434k1557
13417A93829g9990n5927c6002m6286H5821J90168j22689J06787N7199C4229a86388
13405A03608J40873b8427P72C16465E8100O0307b26558C7184h4906I81J01118
13394A02099P461l0704R1885C587K63423o3302F5044k6900a39689a9950B79317
13382B56787f4529K6857H9129g4573C43577A17806L4762J95138e3709j43318C30818
$$ plain form
13459 208232 410997 360341 -46833 426297 267164 52606 40072 61054 54648 445433 636926
13448 636926 442749 69640 328722 165271 314479 98747 328812 167342 196507 113346
13438 113346 -40034 361576 -135202 78651 158920 352762 288390 44206 185405 190484 471567
13427 471567 -72478 293273 -52590 281581 -210273 438370 -56496 373820 215386 193829
13417 193829 -79990 -135917 -36002 -82288 85821 275989 153300 260087 317286 34229 -186388
13405 103608 244481 -28427 -27655 316465 58100 118407 -226558 37184 -84906 981 102099
13394 102099 109560 78856 170741 3587 267010 203708 65044 38144 -139689 -19950 279317
13382 256787 -64529 -37672 89129 -74573 343577 117806 152568 347706 -53709 -197027 330818
13370A11002J23825M0476A14585J89153k2277E0706d883A13701J24255L8337l4042
13359B42251b81785A11638J50274c233A66992B1147J61352J38424F8831J85163
13349B53994I3570K9124L94066A2096b1666D67609B18531M59553k63709A2284
13338B50498J07749G940J2673J8153M8380J78822F2244f8173B72951N0142j48711
13327A74382F3211J37997J37481G6752J54047G8838l0913K45853d4497A22878
13316C15561J02644F4354e2298F0279Q750Q941R9498N1512A8337K88660b30569
13304a0191A63895Q6936N3556F4898K59061A18718l8015L29670a40946B49179
13293A18175a03391D67161A47855J49774l3299r1827G9320K13349H8897N1302
$$ plain form
13370 111002 234827 275303 114585 303738 281461 50706 -4883 113701 237956 276293 242251
13359 242251 -281785 111638 261912 -3233 166992 21147 182499 320923 68831 253994
13349 253994 93570 122694 516760 12096 -21666 467609 218531 678084 414375 12284
13338 250498 358247 7940 20613 38766 87146 265968 62244 -68173 272951 323093 174382
13327 174382 63211 201208 338689 76752 230799 78838 47925 293778 -44497 122878
13316 315561 418205 64354 -52298 60279 69029 77970 177468 228980 18337 306997 -230569
13304 -10191 163895 250831 304387 64898 323959 118718 80703 410373 -140946 249179
13293 118175 -103391 467161 147855 297629 264330 172503 79320 292669 88897 140199
13283A40199J23957I9664C0113R0403D7763a26717B1956L50246c07505B37545
13272A72151q4716r933l3637R6602d7971B12397D2964J79894b1933j4181k2589
13261e8703A35061o2744L61333H9971c9007H4645K16061k3058D178J96728J13079
13250C13985m8560D4071d0592E4726L80632a13854G5072N28079F6420a87412A4595
13238A50917l1260a73933A2872A03K88197A25997l5711K43168A3259J70709k0785
13227A63183g236C4117J5786Q3560M4789b9533B3430P0133m5170j3954a32407
13215A56872M2443a07540d3618A74622l0649k7815b3626A55923a06636a242C76604
13203a38216k1120B02264I0234M9809a90698c9062B3885a4577j46772j47240b8077
$$ plain form
13283 140199 264156 99664 30113 120516 47763 -126717 21956 372202 -307505 237545
13272 172151 87435 77502 43865 140467 -47971 212397 42964 222858 -21933 -36114 -58703
13261 -58703 135061 72317 433650 89971 -39007 84645 300706 277648 4178 200906 313985
13250 313985 265425 44071 -40592 54726 435358 -113854 75072 603151 66420 -187412 14595
13238 150917 119657 -173933 12872 103 288300 125997 90286 333454 13259 183968 163183
13227 163183 -7236 34117 49903 133463 178252 -29533 23430 93563 48393 34439 -132407
13215 156872 199315 -107540 -43618 174622 143973 116158 -23626 155923 -106636 -1242 376604
13203 -138216 -159336 202264 90234 140043 -190698 -39062 23885 -14577 -161349 -308589 -28077
13191E022b6968A37874d0051B32586J95861e3489A49681B7168K15072m8922I1420
13179c06836k9915A79939c00400D8409L3826d2738j05833k022A12965q600l8003
13168F6362c091A72133m2368J22402F1183a50722P4379j9898B27388r4382K98614
13157D31620A65298i4404E3795a38191e6590B1147b83219f7288G1391l925b34129
13145A9538K63037p2400G988L91989F7242P8327L75244d982j05069B46265B4170
13133I6286b6313A54711d6297H4035a83407B84562A40172E5458A0831a7605j57253
13122a74858I2433K57779B6950a01932B05796J4985b0171A29137E1892M8610a76306
13110g2829A08627a63879A68096q1569a43241A67552F7563J22995L6841A6891
$$ plain form
13191 5022 -26968 137874 -40051 232586 428447 -53489 149681 27168 242240 193318 91420
13179 -306836 -336751 179939 -300400 48409 82235 -42738 -148571 -150593 112965 104365 66362
13168 66362 -3091 172133 129765 252167 61183 -150722 -76343 -96241 227388 133006 431620
13157 431620 165298 -94404 53795 -138191 -56590 21147 -283219 -67288 71391 67466 -234129
13145 19538 282575 210175 7988 399977 67242 145569 520813 -4982 -110051 246265 24170
13133 96286 -26313 154711 -46297 84035 -183407 284562 140172 55458 10831 -17605 -174858
13122 -174858 92433 350212 26950 -101932 205796 220781 -20171 129137 51892 100502 -176306
13110 -72829 108627 -163879 168096 86527 -143241 167552 67563 190558 227399 16891
13099a81762c3418k1550j47973B6831K52895f1328B03247J28423d34501A83145
13088B03239m3581n4253J569k9513a369k54413a4813A43726F5413K86880K36705
13077E88998E598a22496K2659b489k67805d1204D5935b48191c4490B6114a88261
13065A73066D4296J65359Q6280b02883a3118A36866n8865J32964p4006E3884K67687
13054C21571K01823k53810b5567B74412j1769d3040A01248a20492A70039K56693
13044D26732a35803B16643J65932A59105C3150c1491J4422B59717f5377q81L1203
13033c5055M471j56360g7173k90327A47368K83727a71146b0555C66351a68521
13022i0845I6077D7033L1850D320K27781I4198h4328B72941c5610A02626K3375
$$ plain form
13099 -181762 -33418 -54968 -202941 26831 279726 -61328 203247 331670 -434501 183145
13088 203239 159658 105405 106974 77461 -1369 -255782 -14813 143726 65413 352293 588998
13077 588998 5598 -122496 -99837 -2489 -270294 -41204 45935 -248191 -34490 26114 -188261
13065 173066 44296 209655 295935 -202883 -13118 136866 78001 210965 136959 53884 321571
13054 321571 523394 269584 -25567 274412 262643 -43040 101248 -120492 170039 426732
13044 426732 -135803 216643 382575 159105 33150 -31491 -17069 259717 -65377 -66258 -35055
13033 -35055 -30584 -186944 -77173 -367500 147368 431095 -171146 -20555 366351 -168521
13022 -90845 96077 47033 78883 4320 232101 94198 -84328 272941 -35610 102626 126001
13011A26001J52416m4189J0263M0591r8748m9494A6521J33298n0354D2469J61700
13000B04169n614a62041J7475q1267d1742B23726J1582q6267d85242E6131b3918
12988e7597J4647A57053k6779E0425a35064d0812C87485a27418h972H0530d9823
12976d094H0423P5046F1134K4060A0160a41240e3318C57728D836a29832B82754
12964B25669m9196a57777r6916B61686b59552g7236A43599b38517E4287B2097
12953F7085b92121I1775g7108A02853M4531C2327O1955Q1174K83335G407K82221
12942B89628a09027q0910C00410M877d2990j9872B15915b949n6892n947j0427
12931g6215b0705D70358G8448B0968J17578k7665g5786A85756b9707A29734K80165
$$ plain form
13011 126001 278417 234228 244491 285082 186334 136840 16521 149819 99465 42469 204169
13000 204169 198555 -162041 -144566 -225833 -41742 223726 235308 149041 -485242 56131 -23918
12988 -57597 -42950 157053 130274 50425 -135064 -40812 387485 -127418 -8972 80530 -49823
12976 -4094 80423 155469 61134 85194 10160 -141240 -53318 357728 4836 -129832 282754
12964 225669 176473 -157777 -254693 261686 -259552 -77236 143599 -238517 54287 22097
12953 67085 -292121 91775 -77108 102853 147384 32327 94282 175456 458791 7407 289628
12942 289628 -109027 -189937 300410 305287 -42990 -62862 215915 -2949 -59841 -65788 -76215
12931 -76215 -20705 470358 78448 20968 138546 110881 -75786 185756 -29707 129734 409899
12920D09899A62372b4275B80588l9902b2189l7839E6129J55855h1597A83193n1748
12909A31445D09J34697k3271d7723D0585R4789j7302d7647H3919e255j1123F3507
12896b250j72401C22863f3239A46784a07656A84710E1221K88645i4134A06645
12885a72754b7876d264A26941M2109a12158j15781D9040i1739j21815R5960A5207
12873a66482A32289J56576m38I9393J86884a6859q4746k9206D30694a18011k3677
12862a41688G2640b09193g1243H9037a18655C27587j28513J60452I8198c32183
12851c3638k87715C9543K7390a65656G1294a26533B78209a26538B57307a02918
12840E24290B1614c10662D446e9008K1527p5034A30747c917C03811B1118h1160
$$ plain form
12920 409899 162372 -24275 280588 240686 -22189 -60028 56129 211984 -81597 183193 131445
12909 131445 409 135106 111835 -47723 40585 135374 118072 -47647 83919 -5255 -16378 63507
12896 -2250 -174651 322863 -63239 146784 -107656 184710 51221 339866 -94134 106645
12885 -172754 -27876 -4264 126941 169050 -112158 -227939 49040 -91739 -213554 -117594 15207
12873 -166482 132289 288865 288427 99393 286277 -16859 -101605 -130811 430694 -118011 -141688
12862 -141688 72640 -209193 -71243 89037 -118655 327587 199074 359526 98198 -332183
12851 -33638 -321353 39543 66933 -165656 71294 -126533 278209 -126538 257307 -102918
12840 524290 21614 -310662 4446 -59008 -37481 -112515 130747 -3917 303811 21118 -81160
12828a40286d7351k9978A01432c80481A0699a16350A11435L7490a76709K0819
12818a55890A09595a89638H1301a39564C5516b07701M7471A35890b5557H7577
12807a23040j013A99686a55737C35325I1763f0572a936A11424g5423E8556J5199
12796G3755K83114F9125k451i9143A8084g0982A14566a87514e4061B22188a70654
12784a42057A14826n3539O8320h8624r0120A84665B8467a99352Q7493A08200e4908
12772E0041a60272f0775C9162c31876A02523b28169L611A15218c22647H5844p701
12761G8143f2172F986e9855j10162A09900O5254k8980a09276b5588j8965l5454
12750h0007M456C0410a58151j43954Q6552R9865j04765A69941J32625A24914a6642
$$ plain form
12828 -140286 -47351 -77329 101432 -380481 10699 -116350 111435 148925 -176709 -155890
12818 -155890 109595 -189638 81301 -139564 35516 -207701 -160230 135890 -25557 87577
12807 -123040 -124053 199686 -155737 335325 91763 -60572 -1936 111424 -75423 58556 73755
12796 73755 356869 69125 66674 -99143 18084 -70982 114566 -187514 -54061 222188 -170654
12784 -142057 114826 61287 129607 -88624 -178744 184665 28467 -199352 -111859 108200 -54908
12772 50041 -160272 -60775 39162 -331876 102523 -228169 -224558 115218 -322647 85844 78143
12761 78143 -62172 6986 -59855 -170017 109900 175154 146174 -109276 -25588 -44553 -80007
12750 -80007 -75551 30410 -158151 -302105 -215553 -115688 -220453 169941 302566 124914 -16642
12738C2317e6514F496d4289B30011l5599a41296l2580B09326B5217O6729a56504
12726A17803J25882H661a03359a1754C51131E0121d9168D211a3938n4847k25066
12715b93851A00040g5880A87515a34083A85613A5776D357P8471a2908A64040K4684
12704A88724A5790J40036b20743j9936A55774J21229c69505B53742A7074a6974
12693C23287a00131L355a966j47656D2370a36703A48068a43499C40566D0610l026
12682C7584a38087C97851H6794J54238j14920b41180c1404j4891C61165f5097
12671B97788a2142j46603A07159b37511B8028L9381i8659c5828D24574j43399
12661B81175a22945D22842a15147H8983j2374A7823L52435A09183l8170b36590
$$ plain form
12738 32317 -56514 6496 -44289 230011 194412 -141296 -173876 209326 25217 91946 -156504
12726 117803 243685 8661 -103359 -11754 351131 50121 -49168 4211 -13938 -68785 -293851
12715 -293851 100040 -75880 187515 -134083 185613 15776 4357 82828 -12908 164040 188724
12704 188724 15790 155826 -220743 -240679 155774 277003 -369505 253742 17074 -16974
12693 323287 -100131 -96776 -1966 -149622 42370 -136703 148068 -143499 340566 40610 37584
12682 37584 -138087 397851 86794 241032 126112 -241180 -31404 -46295 361165 -65097
12671 297788 -12142 -158745 107159 -237511 28028 67409 -98659 -35828 424574 281175
12661 281175 -122945 422842 -115147 88983 76609 17823 370258 109183 71013 -236590
12650a2546A2541a94397e2543A47311J7827l2523a48768B65263g3956p2617B41102
12638f2440A61576b31139I7383D7417a12586A64608J87194A20458m2879L10719
12628C88298j11719J40719A41627o4025L36835a38297D06432p272A2358K8573
12618D0931J67992L5457h5639r3066O3495l6990O5751G4833g1903C09369A18105
12606b76144f1864A73824J37806K91837d08046a59768G6058J95721E2851e239
12595b32811A40365J16283c809p0976G0788J59575h7669A42989a32473c9935G5880
12583A50464j6221b5009B21502n1362L4487a79667j41157f5337j1516j90808A7621
12571D5497H642c01323L8880B21155a29068A98421A5210b94271b5197A55867P9309
$$ plain form
12650 -12546 12541 -194397 -52543 147311 165138 132615 -148768 265263 -73956 -146573 241102
12638 -62440 161576 -231139 97383 47417 -112586 164608 351802 120458 77579 388298
12628 388298 276579 417298 141627 77602 414437 -138297 406432 399160 12358 40931
12618 40931 208923 244380 -85639 -178705 -115210 -152200 -86449 74833 -71903 309369 118105
12606 -276144 -61864 173824 311630 603467 -408046 -159768 76058 271779 52851 -5239
12595 -232811 140365 256648 -3809 -74785 70788 230363 -87669 142989 -132473 -39935 75880
12583 150464 134243 -25009 221502 170140 204627 -179667 -320824 -65337 -76853 -267661 17621
12571 45497 8642 -301323 -262443 221155 -129068 198421 15210 -294271 -25197 155867 235176
12560B35176A15644D0978J25574J63417A19888J69818b1080I3780a66385N1134
12550a15251A23969a58572A16293D4057L05305j41559L4242f2054J666A43338
12539A36007a53300B40540g308H6548B7072J46837j5129a85143i484j49352G4089
12527E8877K34672e3978F5585k7957b00922P4526G6603K82416F7452R3969L11162
12516D72583o5999a80424e7545p3351A83039i2124B71634H5316J20275p430H4721
12504A71020C4661a79679N0886e8636l54022B75306G5236J19280N9667C685K9002
12493C2687P4522J13384b715j40233e6320D5424a30530j36530A04040a31638l4628
12482a66266g466D01296H2494J78150a61928A73863b86710a21902k051e8505G6073
$$ plain form
12560 235176 115644 40978 166552 329969 119888 289706 -21080 93780 -166385 -115251
12550 -115251 123969 -158572 116293 44057 349362 207803 242045 -62054 -60388 143338
12539 136007 -153300 240540 -7308 86548 27072 173909 158780 -185143 -9484 -158836 74089
12527 58877 293549 -53978 65585 37628 -200922 -126396 76603 359019 67452 161421 472583
12516 472583 406584 -180424 -57545 -130896 183039 -92124 271634 85316 205591 198161 84721
12504 171020 34661 -179679 -128793 -58636 -412658 275306 75236 194516 254183 3685 32687
12493 32687 107209 220593 -2715 -142948 -56320 45424 -130530 -267060 104040 -131638 -166266
12482 -166266 -7466 401296 82494 260644 -161928 173863 -286710 -121902 -123953 -58505 76073
12470a77195G8978c53524A00607m0816a12841a7509k63805e0334j10630C64165
12459a96639j4334M5541m702A6211a13322q4196e7236E914K08334a07068e932
12447E954b51100J02943H0725L7261R0223R6078b38550J03689A73169j6342c12614
12435b79413A80946J05676h1894j26293f7154C72949e7807K7072n5255R228j85264
12424b62026A89279J14814b91396J14968J8477E6188b64295A09353F123c54214
12413B7553Q1944n1782J2738a8100G6218J18263D7292a93950B68309a59281k03708
12402c62989a10877C17017a37124j45291F6381f542H3089g4476j84195b8634q0462
12391a09096k08722F8251B6536J42108a56542O0863A34066F7J78942c5591j25974
$$ plain form
12470 -177195 78978 -353524 100607 59791 -112841 -17509 -281314 -50334 -160964 364165
12459 -196639 -210973 -165432 -170134 16211 -113322 -197518 -57236 5914 214248 -107068 -5932
12447 5954 -251100 -148157 80725 117986 208209 304287 -238550 -134861 173169 156827 -312614
12435 -279413 180946 286622 -81894 -208187 -67154 372949 -57807 -30735 -85990 -76762 -262026
12424 -262026 189279 304093 -291396 -176428 -157951 56188 -264295 109353 6123 -354214
12413 27553 109497 57715 70453 -18100 76218 194481 47292 -193950 268309 -159281 -362989
12402 -362989 -110877 317017 -137124 -282415 66381 -6542 83089 -74476 -258671 -28634 -109096
12391 -109096 -317818 68251 26536 168644 -156542 -95679 134066 67 179009 -35591 -161565
12380a61565A14645n7130a45073k4992b5704A11595J2607C7320I260c8886j34265
12369a73151C46435j68585J40096A5242c3227A36542d24086a50206C5058b66888
12358H6275a60901a5033I1171a60852i533l4475k5806k00733f1175A03037c99420
12346A13917c4241B13287D4467c23497c7985B02478p3742a87101C56036a8369
12335b51215A33636B3075a0095A66782d7240H4066R4726b00482j39807A14598
12324I5645e5246C84959L10411a6800C8037c3548d254B54390b2615A8380k594
12313A5786h6239C100h1210l7152B55092A2120a655A33506A0725J1298f8095A40785
12300a57754d1242A0726R4452J04164d6566C11052B1250J92657A038g479C9834
$$ plain form
12380 -161565 114645 57515 -145073 -170065 -25704 111595 124202 37320 9260 -38886 -173151
12369 -173151 346435 177850 317946 15242 -33227 136542 -424086 -150206 35058 -266888
12358 86275 -160901 -15033 91171 -160852 -9533 -44008 -69814 -270547 -61175 103037 -399420
12346 113917 -34241 213287 44467 -323497 -37985 202478 128736 -187101 356036 -18369
12335 -251215 133636 23075 -10095 166782 -47240 84066 178792 -200482 -340289 114598
12324 95645 -55246 384959 695370 -16800 38037 -33548 -4254 254390 -22615 18380 15786
12313 15786 -86239 3100 -81210 -118362 255092 12120 -1655 133506 10725 22023 -68095 140785
12300 -157754 -41242 10726 105178 209342 -46566 311052 21250 213907 1038 -7479 39834
12288c45607a42920B80398A21625e4467B66486M9426C6337R9320A0251a42813
12277B42303A07509b8561D18380l2363R9304B24479j04549n7617J21668m8404
12267A35577J08707q9425E9416a1279A46737K7737n5097a03860l7025j30028i5424
12255F9556f4731B55533f7550G1089e2916J0779B0340a26853e9110j56707C34282
12243A94303B7913D733Q6583A1410K22917E6342b24017f7036A19370f6775C21116
12231D9015R3296K66924j76448L22461A58887J49226j0567A32409P6754b8142
12220F1101J16631N8092e8203o6654D27381I9986K1032P185R0909c10705I9613
12208A42150b4987E42895I9839J24923m345h5448B53259K14501E4483K27243H722
$$ plain form
12288 -345607 -142920 280398 121625 -54467 266486 315912 36337 135657 10251 -142813
12277 242303 107509 -28561 418380 386017 485321 224479 119930 62313 183981 135577
12267 135577 244284 154859 59416 -11279 146737 174474 119377 -103860 -140885 -270913 -95424
12255 69556 -64731 255533 -67550 71089 -52916 -42137 20340 -126853 -59110 -215817 334282
12243 194303 27913 4733 91316 11410 234327 56342 -224017 -67036 119370 -66775 321116
12231 49015 142311 409235 232787 555248 158887 308113 297546 132409 209163 -28142
12220 61101 177732 235824 -58203 -124857 427381 99986 121018 128203 219112 -310705 99613
12208 142150 -24987 542895 99839 224762 220417 -85448 253259 467760 54483 281726 8722
12196a91787A31665K90745A58295M0090J77785A43785c8138B28555j08623k2942
12186I6990J52321b500H4791k1210k0363d6567j4541j815j85283i2210B3196M10624
12174D33820r8258A05674K46907p5118A6691K71846E2612K60182N8856a9062j85727
12163b04789B62313G6994N7758R9664A15720a8429k82148D3712P8731d4025A71980
12151D8587k3224A1227b25778A92102a33262J4684E7235M3862K22201k0582h5962
12139G8112b9739A77964i8637B5717J47918m5129a80065H5843b01986j11067A04248
12127A60269E1597f1418A39702B3082K1739P4313d1839J0282q3770j42965I404
12115A00855J48j1913A1978a738D31115A11150L57572A52712r734J19623d6968
$$ plain form
12196 -191787 131665 422410 158295 198385 376170 143785 -38138 228555 119932 96990
12186 96990 249311 -2500 84791 63581 43218 -46567 -61108 -62923 -248206 -92210 23196 433820
12174 433820 335562 105674 352581 277463 16691 288537 52612 312794 371650 -19062 -204789
12163 -204789 262313 76994 134752 234416 115720 -18429 -300577 43712 122443 -44025 171980
12151 48587 25363 11227 -225778 192102 -133262 -118578 57235 101097 323298 302716 -85962
12139 78112 -29739 177964 -98637 25717 173635 128506 -180065 85843 -201986 -313053 104248
12127 160269 51597 -61418 139702 23082 44821 119134 -41839 -31557 -115327 -258292 9404
12115 100855 101003 89090 11978 -1738 431115 111150 468722 152712 142978 262601 -46968
12103e8669k1470O817A87427I232J5492c6287C5461h0498L4296B53246H0733e7558
12090a79845c2531j05727K7173d9545A90224a8592j68298K6627j95970a26388
12079b73636J24769A75209G6629M4019f1069C34809Q03711O24077C99279m0166
12069C59113A43042M7754a90433r3507A01056j0247i2267A01472n0298e9534F1759
12057c33688C4741c5104l9485j85397E9217a96735g5046B90623b43343J19723
12047a23620j01660c1599G0414c7358A7923a14408j8386E378e0787j2879r5997
12036a59663r980B21971a54296A83374D3901P4247a76789A32763K02982n1176
12026B84569b89483A93451k8396J2532q3149a24494j97777E6687a8991D4309L55094
$$ plain form
12103 -58669 -80139 -73322 187427 9232 24724 -36287 35461 -80498 -46202 253246 80733 -57558
12090 -179845 -32531 -138258 -111085 -49545 190224 -18592 -186890 -160263 -356233 -126388
12079 -273636 -148867 175209 76629 120648 -61069 334809 1138520 1762597 399279 359113
12069 359113 143042 190796 -190433 -283940 101056 90809 -92267 101472 51174 -59534 61759
12057 -333688 34741 -35104 -74589 -259986 59217 -196735 -75046 290623 -243343 -123620
12047 -123620 -225280 -31599 70414 -37358 17923 -114408 -132794 5378 -50787 -63666 -159663
12036 -159663 -169643 221971 -154296 183374 43901 118148 -176789 132763 335745 284569
12026 284569 -289483 193451 165055 177587 94438 -124494 -322271 56687 -18991 44309 399403
12015C99403A34537B2786b82183B5621b53930B62873g1342A3044P6107b44033
12004C6570a5624B61822a95772l2163B68858B2326N6517e4265A01853a6857l99048
11993d15905a66716D21777A10267l6685a74485o5460B613a85595J8208f247A37629
11981C9832P595b7847A81984o6993g910C7858J34409i5521B09735m7182b9212
11969a72764D2967b5573k700A09570B3559a40535A4863J60432C2210b89407R4158
11958a95249K2265b6876I2441b9451o1970A99790m6176d75427d893k8228j84756
11947b17877A93445b48829A5015a1008j45696M2991C8215f2101k06740L4158C28535
11935a51274a1387k41112j2562B28166m3256q1959a28858N1613k407j20750e5414
$$ plain form
12015 399403 134537 22786 -282183 25621 -253930 262873 -71342 13044 89151 -244033
12004 36570 -15624 261822 -195772 -227935 268858 22326 78843 -54265 101853 -16857 -415905
11993 -415905 -166716 421777 110267 73582 -174485 -239945 2613 -185595 -167387 -6247 137629
11981 39832 47427 -27847 181984 114991 -7910 37858 172267 -95521 209735 162553 -29212
11969 -172764 42967 -25573 -28273 109570 23559 -140535 14863 175295 32210 -289407 -195249
11958 -195249 -172984 -26876 92441 -29451 -91421 199790 153614 -475427 -4893 -33121 -217877
11947 -217877 193445 -248829 15015 -11008 -156704 -113713 38215 -62101 -268841 -234683 328535
11935 -151274 -11387 -252499 -265061 228166 184910 102951 -128858 -77245 -79652 -200402 -55414
11923b39175C25333C7144J12373D2304a95768B47378b57986f2588b9137k56108
11913b85245E9419b29657R158A42045J82116E4745b77222h1359j02364F104K24475
11902B30579D876J3469K01207a21367l52183A16450j5869J18212a04479a0785
11891B92444b16213D45504j60847a7130k5592A02870a32032B2155d0214C1174
11880c30724J03630F0147c1529j24659b484r1033C68984G5816a03236c7395j46612
11869a84007j48769a33055B51127E2229P5558J85413c75398F2615i3205A02070
11858D775r76c01157D592a44490A65946k7653h5429j75654m5419A05738a41191
11846b52086A97502c02590a3386C6861K6167b07035b0833k69219R0125Q7013A26033
$$ plain form
11923 -239175 325333 37144 149517 42304 -195768 247378 -257986 -62588 -29137 -285245
11913 -285245 59419 -229657 -220499 142045 324161 54745 -277222 -81359 -183723 6104 230579
11902 230579 4876 18345 219552 -121367 -473550 116450 100581 218793 -104479 -10785
11891 292444 -216213 445504 284657 -17130 -42722 102870 -132032 22155 -40214 31174
11880 -330724 -227094 60147 -31529 -156188 -2484 -93517 368984 75816 -103236 -37395 -184007
11869 -184007 -332776 -133055 251127 52229 127787 313200 -375398 62615 -93205 102070
11858 4775 3799 -301157 4592 -144490 165946 138293 -85429 -261083 -306502 105738 -141191
11846 -252086 197502 -302590 -13386 36861 63028 -207035 -20833 -290052 -199927 -112914 126033
11834f3690A23176a34119a169A67331c08731E2371L25245c2819C90084k050c8267
11822A00284Q3692c23101J33896r4316c5629B7832K3872j933a3161A90741a00697
11810f1335k98150f643p7244F6359A0777b06492i6630B18122a4654k15691B1910
11798B07872c94131Q2323k8655a17212A22420l8632c6094j33465M7595A56801
11787b05848b1067k61461E6023B1889N357M1019J9928a3672A23742a14577l4183
11776a48760B28951d7384j87902E9792a25480r7715e7413I2882b35960C1942J55637
11765A87579p6922a570n8243C208J12510a61363r2057C33349j44848B2546O7561
11754I0107A0085K90171a82652A34598g5691A11338a2236j48597b8079E317a33911
$$ plain form
11834 -63690 123176 -134119 -1169 167331 -308731 52371 377616 -32819 390084 388034 -38267
11822 100284 183976 -323101 -189205 -283521 -35629 27832 51704 49771 -13161 190741 -100697
11810 -61335 -359485 -6643 -83887 66359 10777 -206492 -96630 218122 -14654 -230345 21910
11798 207872 -394131 -311808 -340463 -117212 122420 83788 -36094 -169559 -121964 156801
11787 -205848 -21067 -282528 56023 21889 27246 68265 88193 -13672 123742 -114577 -148760
11776 -148760 228951 -47384 -235286 59792 -125480 -223195 -57413 92882 -235960 31942 187579
11765 187579 110657 -1570 -59813 3208 115718 -161363 -253420 333349 188501 22546 90107
11754 90107 10085 300256 -182652 134598 -75691 111338 -12236 -160833 -28079 5317 -133911
11742H5964i3037A31578J6681B9024o407a83552A61765a31564A70369Q9470c16869
11730C87588b20402f0234j49479p1332G6712C7767c2497A19069a3443j3149k49664
11719b76256h9549A22337E9865e1924j2430B18688g0133j30470L3087A98315m6570
11708A51745J5144a54553j6716C02835j47328N047i7102a9404A49762C0941L50151
11697C81092E4388J23677n509q2232G590K52994a63912E6777O0328k2755J0765
11686A05115M9717a99812D52477b62553A3829e2398B00810K53345b22083B11668
11675c5486j07815f5367q4914A44703b48695A20693a95052A33116i06A4768e7899
11663b58984E09061E1039O747a9320A0143J03025a70343a8877m2302A02242c13162
$$ plain form
11742 85964 -93037 131578 148259 29024 22617 -183552 161765 -131564 170369 259839 -316869
11730 387588 -220402 -60234 -209713 -281045 76712 37767 -32497 119069 -13443 -26592 -276256
11719 -276256 -89549 122337 59865 -51924 -64354 218688 -70133 -200603 -167516 198315 151745
11708 151745 166889 -154553 -171269 302835 155507 160554 -97102 -19404 149762 30941 381092
11697 381092 54388 178065 172556 90324 7590 260584 -163912 56777 117105 94350 105115
11686 105115 154832 -199812 452477 -262553 13829 -52398 200810 454155 -222083 211668
11675 -35486 -143301 -65367 -150281 144703 -248695 120693 -195052 133116 -906 14768 -57899
11663 -258984 509061 51039 57786 -19320 10143 113168 -170343 -18877 -61179 102242 -313162
11651a20225b3408j83567C71514E9747B69L397c51704d6948C51062o3965E5807
11639H7071a76545B44468b9402j80918c0300I7716h532B45950F0488J8510P9132
11628A58130K69194g575A31326F4901k9834L26779E5479b8j35180A93366J4931
11617B08297g4802J6129C12944g9207a7261j87814A90784b08633e7247A80342
11606F0569f4191j32135C16972F1194J01454a7009E8228J5600a71757l0573B21005
11594B19508b0513k86221g0183K7148C5569c52648d6346F2102P0660J8749E3726
11582D47553a703C30298c4591m065j44323F6771J48835f3571J2733H2796M8927
11571A31723b39592B5613g3013A70326G3707b20961d4148n0367G4150O5915L7032
$$ plain form
11651 -120225 -23408 -206975 371514 59747 269 3666 -351704 -46948 351062 287097 55807
11639 87071 -176545 244468 -29402 -210320 -30300 97716 -8532 245950 60488 78998 158130
11628 158130 427324 -7575 131326 64901 35067 361846 55479 -28 -135208 193366 208297
11617 208297 -74802 -58673 312944 -79207 -17261 -205075 190784 -208633 -57247 180342
11606 60569 -64191 -196326 316972 61194 162648 -17009 58228 73828 -171757 -202330 221005
11594 219508 -20513 -306734 -70183 -43035 35569 -352648 -46346 62102 132762 151511 53726
11582 447553 -1703 330298 -34591 -38656 -182979 66771 215606 -63571 -50838 82796 131723
11571 131723 -239592 25613 -73013 170326 73707 -220961 -44148 -94515 74150 140065 177097
11560A77097c4285p5725C25302j33830G8697A3976J49320A8702J16893b41371
11549A14353J29607a46431f4507e264m3413B57895C1716J73623b23302A31287
11538b29288A55554b07554B74788a28431A3651K24995B8422J22892d5055m94773
11528e39828b47294A65991i296A81293D2203g0150C66708j04106R4967A57222
11517G255f20450A75320d6659k9849A95412M3337p8420Q5026K6941b45280f1153
11505f8423B22957i6359B61022d346A05738K34669j31779a13597B58049E5969
11494b1259E4689J42077R037D6777L03431I1486R4099a645l1962I1123j4614k2690
11482E3819b4365p9079a7948B74804B9422J09682Q3293f6783A54404J9466h0369
$$ plain form
11560 177097 -34285 -110010 325302 191472 78697 13976 163296 18702 135595 -241371
11549 114353 243960 -146431 -64507 -5264 -48677 257895 31716 205339 -223302 131287
11538 -229288 155554 -207554 274788 -128431 13651 238646 28422 151314 -45055 -539828
11528 -539828 -247294 165991 -9296 181293 42203 -70150 366708 262602 357569 157222
11517 7255 -620450 175320 -46659 -76508 195412 238749 160329 245355 272296 -245280 -61153
11505 -68423 222957 -96359 261022 -4346 105738 340407 208628 -113597 258049 55969
11494 -21259 54689 196766 205803 46777 350208 91486 185585 -1645 -33607 91123 76509 53819
11482 53819 -24365 -103444 -17948 274804 29422 139104 222397 -66783 154404 173870 -80369
11470B92639D2276K84499j53136K56634j06812a21613N3380A70412n4231J6080
11460A32261m6136e8475I0869K8927N074d8195A89521A5816a58928O5829b1857
11448A53804e4232E46121B17228J9320K01168m5466k6499b38869B8282J11007
11438A39289a25655K2255j2137A01135l3887E988K0243c25650h3049m4207K2511
11427a04745A45219g6039I7250D3023h548C17353g6683C3264g2970k27478f7685
11415B9593a12740F9188L09948h3024l21o8387A04053a37613n6670A82455h1183
11403A06110a30337j11466H6639b18450A43432F8440b10680a03453A71771G2535
11392A06483d7306B93243k3079A14814A9738R9835c55832A05014a65938k8262
$$ plain form
11470 292639 42276 326775 173639 430273 323461 -121613 -68233 170412 116181 132261
11460 132261 86125 -58475 90869 119796 124870 -48195 189521 15816 -158928 -93099 -21857
11448 153804 -54232 546121 217228 236548 437716 392250 365751 -238869 28282 139289
11438 139289 -125655 -103400 -115537 101135 67248 5988 26231 -325650 -83049 -127256 -104745
11427 -104745 145219 -76039 97250 43023 -8548 317353 -76683 33264 -72970 -300448 -67685
11415 29593 -112740 69188 379136 -83024 -83345 -151732 104053 -137613 -194283 182455 -81183
11403 106110 -130337 -241803 86639 -218450 143432 68440 -210680 -103453 171771 72535
11392 106483 -47306 293243 270164 114814 19738 119573 -355832 105014 -165938 -194200
11382a94200A32650c18767A74284b07613g8606a0095p657r1267l6564B31082C0583
11370B88862a28047A4549a05421q4652A08189J01523a20613k5319A12259O7560
11360A79819f5314A94830i6125F0654J69929a6313j32090C794a56643A47642h595
11348A87003r1878k3848c4949M055F6788g9450l12780J95077R1428l18267B19219
11336e3391A20317a37083B49903H2547N4612D7977F547c61826H2689b1752j49883
11325a71635B55226a57269N9095A49893J13344a5149B58682d4323A41490g3683
11314d56409a23270L3263k73076e9862C2040a34315M6770A95251b0337k5179n6886
11303a02402B17464b0502D0274J4011b4952o4702M2487A88524b34835H6933a59033
$$ plain form
11382 -194200 132650 -318767 174284 -207613 -78606 -10095 -17752 -109019 -145583 231082 30583
11370 288862 -128047 14549 -105421 -190073 108189 209712 -120613 -145932 112259 179819
11360 179819 -65314 194830 -96125 60654 230583 -16313 -148403 3794 -156643 147642 -8595
11348 187003 95125 71277 -34949 -30894 66788 -79450 -392230 -197153 -105725 -423992 219219
11336 -53391 120317 -137083 249903 82547 137159 47977 6547 -361826 82689 -21752 -171635
11325 -171635 255226 -157269 -98174 149893 263237 -15149 258682 -44323 141490 -73683
11314 -456409 -123270 -90007 -363083 -59862 32040 -134315 -87545 195251 -20337 -45516 -102402
11303 -102402 217464 -20502 40274 54285 -24952 -89654 -47167 188524 -234835 86933 -159033
11291a21200A99574D0888M1614k8282e2853m4056b4657A51597r211e2451A0565
11279F6086e9614B22939a12866I1532J20096b7221C59844a59196k7305A27695
11268C42661a40175H8722a10191j55705B9287b06670D4992a7686n3791k19203
11258b90680Q6492A4590a93060P4892A72065a77463d4554k7616m7989f75m9710
11247e0385m068C70187a3848F4537b07530A25451a60218b0031l80678a10902q9560
11236b00462N3290O0605l19723h2305A86955n7597i180B683J43380P2724b43217
11224C8301K8115a8226j95498B4534a13163C9601i7056H1417f3447c1027l2221
11213f3248q8708B4768K74347H1813g4983l2290r5493B77419a57499f9695B18306
$$ plain form
11291 -121200 199574 40888 82502 54220 -52853 -96909 -24657 151597 142386 -52451 10565
11279 66086 -59614 222939 -112866 91532 211628 -27221 359844 -159196 -186501 127695
11268 342661 -140175 88722 -110191 -265896 29287 -206670 44992 -17686 -71477 -290680
11258 -290680 -204188 14590 -193060 -118168 172065 -177463 -44554 -72170 -120159 -675 -50385
11247 -50385 -54453 370187 -13848 64537 -207530 125451 -160218 -20031 -400709 -110902 -200462
11236 -200462 -147172 -86567 -406290 -82305 186955 129358 -9180 2683 146063 218787 -243217
11224 38301 66416 -18226 -213724 24534 -113163 39601 -97056 81417 -63447 -31027 -63248
11213 -63248 -151956 24768 299115 81813 -74983 -107273 -202766 277419 -157499 -69695 218306
11201g7799J6779D7634f1284E7795c44230A63496b25102p5160O1949c9799g976
11189H2057a47982M1254A83282c39162A51316a89885G6825R6513J519D4829b13929
11177a69669c5897J2541A0608a13724l5153P3510a910j832k328C8289J0506b9424
11164A64602a78926E0626L5900J79280c3653o763q8366p5297B6419a71474j07393
11153b78867f8741A87865c471A90296J03395a21743B52895b94911a21966A87307
11142B7019i3443q3775B453L8354K17462B1044a59647E5323J76100b29381e8045
11130F8181b26045a02338A83781P6694c07476B25107N2751b33023B71111n1918
11120B19193A04513l0442Q4772E9280J11035o1665N23568a36635C16404a25797
$$ plain form
11201 -77799 -61020 47634 -61284 57795 -344230 163496 -225102 -300262 -238313 -39799 -7976
11189 82057 -147982 -106728 183282 -339162 151316 -189885 76825 173338 174857 44829 -213929
11177 -169669 -35897 -23356 10608 -113724 -148877 -75367 -1910 -3742 -6070 38289 48795 -29424
11164 164602 -178926 50626 86526 265806 -33653 -40416 -128782 -204079 26419 -171474 -278867
11153 -278867 -68741 187865 -3471 190296 293691 -121743 252895 -294911 -121966 187307
11142 27019 -93443 -177218 2453 40807 258269 21044 -159647 55323 231423 -229381 -58045
11130 68181 -226045 -102338 183781 260475 -307476 225107 277858 -233023 271111 219193
11120 219193 104513 74071 158843 59280 170315 108650 632218 -136635 316404 -125797
11109A20640j8175a90347B25505M2056d9491C70670a42250A4516L50287F0027
11098D30827M9516A52048E4885O2854M09459l2707c8649A65405b0396C0842L7280
11087F8122J71119R8768q8581j752J72440O4714j0719L9529A09384K43583P2353
11076D25320C3475h8544A80038J07971L1567C6754L02819K62083A82869M51721
11066F34590j62380O5333k00526N5373J53229q5542O3654j86245J57346J03764
11056E98596j7949j21473R8368k30566M12831J5484o5742k39201L03519k80556
11046D73311J47327B63251J63712M88364k47308k78154L38336J42835p2309j81873
11036F16854K90761l33369B45455K25010N98526n24178J57981C39812L50322J92279
$$ plain form
11109 120640 102465 -190347 225505 267561 -49491 370670 -142250 14516 364803 60027
11098 430827 480343 152048 54885 117739 527198 494491 -38649 165405 -20396 30842 68122
11087 68122 239241 338009 249428 247676 420116 484830 474111 513640 109384 352967 425320
11076 425320 33475 -88544 180038 288009 319576 36754 339573 601656 182869 634590
11066 634590 472210 537543 337017 392390 545619 460077 523731 337486 494832 598596
11056 598596 580647 459174 557542 326976 739807 755291 689549 450348 753867 473311
11046 473311 620638 263251 426963 915327 668019 389865 728201 871036 798727 616854
11036 616854 907615 574246 245455 470465 1068991 544813 702794 339812 690134 882413
11026H82413o5723C40319K56119k61600P28570l82734K8379n2047l21412K99809
11016F35403j87330Q8251M5240J20637k10956K28334K67819k95251Q550o615j46045
11005E48037M34143C26722O5335N1442J7592L07276r5169j19259j95037N65150
10995I24052C94190N29219k7196k44765J60014J97360l18315J1822r1218L54292
10985I65403r9530J75469J32448l85657L53118p1559N2766K66903K91128J14140
10975A794629j85454R04883j27960N08881l73423J46519j08699k01388j0918n08254
10965A838816j31030o30322L64954j65480J72801j22310J34802J70510k57341
10956A375400K20738J54733o54945k2127l5571l10843p9264k71329K31626k88993
$$ plain form
11026 882413 816690 340319 596438 334838 1063408 680674 709053 657006 335594 635403
11016 635403 448073 536324 581564 702201 491245 719579 987398 692147 700697 694082 548037
11005 548037 982180 326722 392057 443499 461091 768367 673198 553939 358902 924052
10995 924052 394190 923409 896213 651448 811462 1008822 690507 702329 611111 965403
10985 965403 865873 1041342 1173790 788133 1141251 1069692 1122458 1389361 1680489 1794629
10975 1794629 1609175 2514058 2386098 2894979 2521556 2668075 2559376 2357988 2347070 1838816
10965 1838816 1707786 1077464 1442418 1276938 1449739 1327429 1462231 1632741 1375400
10956 1375400 1596138 1750871 1095926 1073799 1038228 727385 648121 376792 608418 319425
10946C19425p7956A12510L53020B08141J79806J04874k20447I6979P6416a55934
10935g5826A17488K94668j69710f8573B96265a40703B82068J01913o1418F9872
10924i1608b3609C61107b4073A71963j7841K5177n513a28667j63415e9217A8672
10912b53345a07986j00119r0427C042K6298a02147F8061a56909M2466C73102g4927
10900A48184a01702E4203a0551k13235A40955m018a29258L5645q348J9209m26990
10889e09742a94004f409j11172E2027a17093F5751O2951a87576E1990j7835J18297
10878A52452p5103P3892a50593m3445n1201d9408n0976C01159a18069k76126a06461
10866b40955L0004q5453N6485J04235E9793i7038d7804H632g4927j54190A37414
$$ plain form
10946 319425 241469 112510 465530 208141 387947 492821 272374 96979 173395 -155934
10935 -75826 117488 412156 242446 -68573 296265 -140703 282068 383981 322563 69872
10924 -91608 -23609 361107 -24073 171963 154122 179299 173786 -128667 -292082 -59217 18672
10912 -253345 -107986 -208105 -298532 3042 29340 -102147 68061 -156909 -114443 373102 -74927
10900 148184 -101702 54203 -10551 -223786 140955 136937 -129258 -93613 -101961 -82752 -509742
10889 -509742 -194004 -6409 -117581 52027 -117093 65751 128702 -187576 51990 34155 152452
10878 152452 77349 151241 -150593 -194038 -245239 -49408 -100384 301159 -118069 -394195 -106461
10866 -240955 -210951 -296404 -239919 -135684 59793 -97038 -47804 8632 -74927 -229117 137414
10854A97005a66369C6810b01814h5723D2297J72783O0628f3623B39902r3665c2595
10842A53148O6550a65188C3264f0256A36137b02996A20026e7555m50B1334a6037
10830C2339a96512n8436A78542q0817a30421a9773j58680p9534a1557j95904j6180
10819b23641J11001o0560A17906A3239a03985H9379c04053r8590B14837a27581
10808A44265l4624a16966F1451d2535G6213c24937J15824b6549A58632a59228
10797d06409A60196c6401j63228D09014a54002O8780A86668a60546o1681A43356
10786A3299a04231k06053A18050H664b87712C10119m3980g7543C16874d6475k09446
10775b55921E0628R28J58488f9081A6205K1792O584g3661r5676M6828l8108B1859
$$ plain form
10854 197005 -166369 36810 -201814 -85723 42297 215080 275708 -63623 239902 146237 -32595
10842 153148 219698 -165188 33264 -60256 136137 -202996 120026 -57555 -58005 21334 -16037
10830 32339 -196512 -254948 178542 97725 -130421 -19773 -178453 -257987 -11557 -207461 -223641
10819 -223641 -112640 -173200 117906 13239 -103985 89379 -304053 -402643 214837 -127581
10808 144265 109641 -116966 61451 -42535 76213 -324937 -209113 -26549 158632 -159228
10797 -406409 160196 -36401 -199629 409014 -154002 -85222 186668 -160546 -222227 143356
10786 13299 -104231 -310284 118050 8664 -287712 310119 266139 -77543 316874 -46475 -255921
10775 -255921 50628 51556 210044 -69081 16205 37997 44581 -73661 -169337 -122509 -160617 21859
10762A28493a8352j040k41187n9147N3558J2885A2459a37552A4353J85125H08
10750b36902A21651i266j71006K9985N3446C58166m6673I0521Q292C6135b73037
10738a61662C22119H9401b51732A42059l7464b23400b2597r1813b9654H8073J14241
10727B02314a17827K2803A8161f2318C19604a57776p3184K9107b7173j48929C3122
10715B13441F0906b28387f9505j6324A39910a01824B81269a45350A62453a0576
10704c4659d709k13661B24849a22140B85309i1754A47082b53044J25443A39562
10693a48070A6966K6868d24605J02144C955a85864Q9355A94787g6243A80305M9774
10682B30079i7678J0906j32253A49545d997H8967J18438b41266k65547g4388j03008
$$ plain form
10762 128493 -18352 -19392 -260579 -319726 -266168 -253283 12459 -137552 14353 199478 808
10750 -236902 121651 -9266 -180272 -150287 -96841 358166 311493 90521 98813 36135 -273037
10738 -161662 322119 89401 -251732 142059 104595 -223400 -22597 -114410 -29654 88073 202314
10727 202314 -117827 -95024 18161 -62318 319604 -157776 -230960 -201853 -27173 -176102 33122
10715 213441 60906 -228387 -69505 -85829 139910 -101824 281269 -145350 162453 -10576
10704 -34659 -4709 -218370 224849 -122140 285309 -91754 147082 -253044 -127601 139562
10693 -148070 16966 43834 -424605 -322461 3955 -185864 -96509 194787 -76243 180305 230079
10682 230079 -97678 -86772 -219025 149545 -4997 88967 207405 -241266 -506813 -74388 -177396
10671a77396I2357a85597B187c13B27856a02435l08382C4935b14011C76732a60847
10659A17820a09034a8411k90387L4146D3129c74619C27572D5136a8660A34460
10648a01150L9762j33684N8254C6751g4946b8041l95074g3077j55217E8001J42304
10637B00305i6176c9461r4207A0813J92292b70009b1855n7435A24667E1634P4567
10626A26201d6768A04561L3252c81436b0181A18467a21881l72995a03333j44027
10616b47360a983j35801I9329e7028k26008A26737b3016k34967e2958j1437A03762
10604b8181l24927D5817b6083i91A33209a922o3348J4665j01341A88518f7104
10592B49302a058k40669E4734a38347l7382a589k10619K0497B25287d62919a793
$$ plain form
10671 -177396 92357 -185597 2187 -313 227856 -102435 -410817 34935 -214011 376732 -160847
10659 117820 -109034 -18411 -308798 -274652 43129 -374619 327572 45136 -18660 134460
10648 -101150 -61388 -195072 -136818 36751 -74946 -28041 -423115 -73077 -228294 58001 200305
10637 200305 -96176 -39461 -133668 10813 203105 -270009 -21855 -79290 124667 51634 126201
10626 126201 -46768 104561 137813 -381436 -20181 118467 -121881 -494876 -103333 -247360
10616 -247360 -1983 -137784 99329 -57028 -283036 126737 -23016 -257983 -52958 -64395 103762
10604 -28181 -353108 45817 -26083 -991 133209 -1922 -65270 -50605 -151946 188518 -67104
10592 249302 -1058 -241727 54734 -138347 -175729 -1589 -212208 -191711 225287 -462919 -1793
10580a04700n0119A13373b43653G6804N4650j3213f5407j367C4769a79728g5940
10568B3658a72758j698c8897j82396Q554O097b2418B91078a610l21577B596a31165
10555a34308A04449c30628I0569J35993b41000J3457J07629F6882K7333R837b33081
10543D1391b61494k6116j84809I573K38471a63024j30338a2520j07742A2832K11431
10532B24263G1807a44636f4222J1415j22844A9275d0018A90643B6399O6538q607
10521H4330J13064q3603i251A79796E3638a33696j42239C0843a9256k42402A30765
10509A36987c37596d3431j50066H8327M2023a05639A72004a28641K9280A63785
10498A74116d5325A15878C6670a16610A92467a03438B4439a1600D92N4638F697
$$ plain form
10580 -104700 -154819 113373 -243653 76804 131454 118241 -65407 -66774 34769 -179728 -75940
10568 23658 -172758 -174456 -38897 -221293 -212739 -206642 -22418 291078 -1610 -323187 2596 -131165
10555 -134308 104449 -330628 90569 226562 -241000 -227543 -119914 66882 94215 104052 -233081
10543 41391 -261494 -287610 -472419 9573 248044 -163024 -293362 -12520 -120262 12832 224263
10532 224263 71807 -144636 -64222 -52807 -175651 19275 -40018 190643 26399 92937 84330
10521 84330 197394 113791 -9251 179796 53638 -133696 -275935 30843 -19256 -261658 130765
10509 136987 -337596 -43431 -193497 88327 130350 -105639 172004 -128641 -99361 163785
10498 174116 -45325 115878 36670 -116610 192467 -103438 24439 -11600 492 55130 6697
10486h9221G0507J08707m6190o2755K65019N8811J19590j19649C9561J83525B9524
10474B38573B3515d95B81969c54708B06742o6386l4135C9357N083Q2012D8812
10462C65571G9507K4116N5809g8444a9783l06710G6923b53272J0765A03859d6462
10450A71991a11831L1455E1272c08384c5048C47176B4011g5467j70059P4730a0725
10438a49338A97823q364a88274B1880i5956A70983m7189a24210d3473A02651a17120
10426B0032g9228B78444h180n65530B88977g4852A40247J38709a75051j54170
10416c29221J01009I6531h6397G6775L1295K3946m1025a89898e3442j07090j44422
10405c04954B40972h3033A69145K4676N5226m5842b75349E5237d3684B82217O5503
$$ plain form
10486 -89221 70507 179214 133024 70269 335288 394099 513689 394040 39561 223086 29524
10474 238573 23515 -495 281969 -354708 206742 140356 106221 39357 44440 126452 48812
10462 365571 79507 103623 159432 -78444 -19783 -326493 76923 -253272 -242507 103859 -46462
10450 171991 -111831 -80376 51272 -308384 -35048 347176 24011 -75467 -245526 -170796 -10725
10438 -149338 197823 189459 -188274 21880 -95956 170983 123794 -124210 -43473 102651 -117120
10426 20032 -79228 278444 -8180 -573710 288977 -74852 140247 278956 -175051 -329221
10416 -329221 -228212 96531 -86397 76775 108070 132016 90991 -189898 -53442 -160532 -304954
10405 -304954 240972 -83033 169145 193821 249047 203205 -275349 55237 -43684 282217 347720
10394C47720B4025O9292N2629J16740j4723B5707K52597A13507C3122K56614e1209
10382f8964l5152C83530F8794q190j8741J16214J41575p5150M9674K08924B32256
10370B28542r5097K46841k0947j27971L13416q0424j29829L3868O2904k05298
10360B26005o8361o6929R708L8015l0127C1377a023D16482p3655Q1966L26791
10349G51584B93129q9884J83537A41017B0279L04555M1592P2272m1046j09856
10339B87796A28984n3160J98609A02802J45948D0965J09434b00430C22723I212
10328A52022e8045J1316j92983A98004J68856j33988A4465K35139E8944c9474
10317B5241J61529J47021l7245f8551B14989H7391J20513c0829A7267k123b7481
$$ plain form
10394 347720 24025 93317 145946 262686 247963 25707 278304 113507 33122 289736 -51209
10382 -68964 -104116 383530 68794 60604 41863 158077 299652 224502 274176 483100 232256
10370 228542 133445 380286 359339 231368 544784 464360 334531 368399 431303 226005
10360 226005 157644 90715 100423 138438 108311 31377 -1023 416482 342827 424793 751584
10349 751584 293129 203245 386782 141017 20279 324834 366426 438698 397652 287796
10339 287796 128984 75824 274433 102802 248750 40965 150399 -200430 322723 9212
10328 152022 -58045 -46729 -239712 198004 366860 232872 14465 249604 58944 -39474
10317 25241 186770 333791 296546 -68551 214989 87391 207904 -30829 17267 15144 -27481
10305A52741N8449g3314j86264a25656J0490A16082g5352a8189m4672D0223a84260
10293h9355C65636h454j05394e6205A70937m512b68093A82284a56840H1319a57409
10281A04707N27248H2026h2265l13582J37375B56233f4245l21767F8901a07116
10270a06755c8811m1494E4912J96574k5290c3909k23025B522J67799J41323r0910
10259B20734n6013E1488J42346O5520r7592N4631e3611B74615G2400b42706Q3062
10248a59644E1431a21429A01718l7248b17294F9147c7310j11197r054A965R4946
10237I6911a53861C69667F1631f2953j58597q7574d5408K1097n5319i214A9328
10225a04796r065A11683j8224R1034j1976a96968A49744b238n8673j1117p0300
$$ plain form
10305 152741 211190 -73314 -259578 -125656 -115166 116082 -75352 -18189 -62861 40223 -184260
10293 -89355 365636 -8454 -113848 -56205 170937 166425 -268093 182284 -156840 81319 -157409
10281 104707 631955 82026 -82265 -395847 -258472 256233 -64245 -386012 68901 -107116
10270 -106755 -38811 -80305 54912 251486 226196 -33909 -256934 2522 170321 311644 220734
10259 220734 164721 51488 193834 259354 161762 216393 -53611 274615 72400 -242706 -159644
10248 -159644 51431 -121429 101718 64470 -217294 69147 -37310 -148507 -157561 1965 96911
10237 96911 -153861 369667 61631 -62953 -221550 -309124 -45408 -24311 -79630 -9214 19328
10225 -104796 -113861 111683 93459 184493 172517 -196968 149744 -2238 -60911 -72028 -142328
10214a42328L156B05500a65357M9662k00489B29268b38361d3713k34411e7894
10203a354A74559d1431k00634A68148b4365A03023b76006A09939a55548j51784
10193c07332a11829A68496g6602r0880j7938e5142p7949A00259a71918j11655
10183b83573B14573c2547A59174b19904N8646O8060L3098o6885A83213E3694L6561
10172I0255K12500f076I0080b77353B0795a21234c4856o4275j73836D11660C6031
10160C83541I5926K72619j535D6303b50841G0394c32852B90979b32742b7681j0454
10149c8135A40080B326L0141a63645A37581a58070f1877K7148J3759l87252a39226
10137h9187k36818f9190j97002i5909r039j92966O3542r8243H699a30020c2924
$$ plain form
10214 -142328 -139172 205500 -165357 -115695 -316184 229268 -238361 -43713 -278124 -57894
10203 -1354 174559 -41431 -242065 168148 -24365 103023 -276006 109939 -155548 -307332
10193 -307332 -111829 168496 -76602 -167482 -185420 -55142 -133091 100259 -171918 -283573
10183 -283573 214573 -32547 159174 -219904 -161258 -93198 -60100 -126985 183213 53694 90255
10172 90255 302755 -6076 90080 -277353 20795 -121234 -34856 -99131 -272967 411660 36031
10160 383541 95926 368545 367010 46303 -250841 70394 -332852 290979 -232742 -27681 -38135
10149 -38135 140080 2326 32467 -163645 137581 -158070 -61877 -34729 -20970 -408222 -139226
10137 -89187 -326005 -69190 -266192 -95909 -104948 -297914 -234372 -332615 8699 -130020 -32924
10125c02392A88896d0086j30516I1940h5813l13339a7482j17410k1089d1940j01037
10114a42977p8108j74386D7494c18861c5570j91734B5957c23371A28584b17680
10103b25731E2400b06069B00341H9179a66839j38826f4819j39738a3691C0979
10092E2597B4580J10846d74118a69835B57401a06363B46412D5697e7377j07671
10082a65048A29623B5978J14860c00919H8653K70281A9948a75714g7142A21564
10071b30459A69155k9315a97983B99660d20858b06269q3319i0120E1588L46672
10061C98260A20969b98752a49224A62650M1513r4517a79934e4059k7891B60799
10050d1458A77750B3396f3568H7993K9283D1769b31380A77386b40961i9461D587
$$ plain form
10125 -302392 188896 -40086 -170602 91940 -85813 -399152 -17482 -134892 -155981 -41940 -142977
10114 -142977 -221085 -395471 47494 -318861 -35570 -227304 25957 -323371 128584 -217680
10103 -225731 52400 -206069 200341 89179 -166839 -305665 -64819 -204557 -13691 30979
10092 52597 24580 135426 -474118 -169835 257401 -106363 246412 45697 -57377 -165048
10082 -165048 129623 25978 140838 -300919 88653 358934 19948 -175714 -77142 121564
10071 -230459 169155 139840 -197983 299660 -420858 -206269 -289588 -90120 51588 398260
10061 398260 120969 -298752 -149224 162650 204163 109646 -179934 -54059 -81950 260799
10050 -41458 177750 23396 -63568 87993 117276 41769 -231380 177386 -240961 -99461 4587
10038A65221a35317l9348L2586D9298e42249a56050K4444n657B08167h5147j2352
10027i7499A442e6545l77051B43404A2278g9486j37534E3042b39154M8676B00771
10015b15043R5188j10180A44913d75652E9431a58041I1379a33321m1682m7370
10005b22373P1565o2929H2561a11853l51450A46349e845B00419b35906F7289c78975
9993h1538A43162a57100o0780A43593R1629p2403i9626d6045A5505N9301i1123
9981A10307M7437K9312b40129k7016a320j69256a6562k57509i1623q3571A54429
9969b93118B99348F337a78031p2753n0615Q5453E2945b23775J2923r9824h7548
9957a16219a2422k92279g8751J229B6291h9138p0323g3674C60042b7959G973a59974
$$ plain form
10038 165221 -135317 -174665 -142079 49298 -542249 -156050 -131606 -137263 208167 -85147 -97499
10027 -97499 1442 -56545 -433596 243404 12278 -79486 -217020 53042 -239154 -190478 200771
10015 -215043 -119855 -230035 144913 -475652 59431 -158041 91379 -133321 -175003 -222373
10005 -222373 -150808 -213737 82561 -111853 -463303 146349 -5845 200419 -235906 67289 -378975
9993 -81538 143162 -157100 -217880 143593 235222 162819 -99626 -46045 15505 74806 -91123
9981 110307 157744 187056 -240129 -267145 -1320 -170576 -16562 -274071 -91623 -175194 154429
9969 -293118 299348 6337 -178031 -250784 -301399 -215946 52945 -223775 -210852 -310676 -87548
9957 -116219 -12422 -304701 -78751 -77522 26291 -89138 -159461 -73674 360042 -27959 7973 -159974
9944A75669g8316j76678J07256j74616a04395q294G7944a15817q6452K6648O1686
9933a13935H311b8136k69222A24454i13k7369a3420B61982N5592b29823A10032
9921c1183d379I3676Q6485B7126a0977l0638B41277A12646a16797l8044a8382
9909B03738b04576I3990N7284J7916h5454c1934k9327I0938C839a33388b2649
9897b1538j48092k13546J16424H7595a44090l7942N2305C6585a16161e59k19205
9886b19764A1130f711p4971B32249b33528J00868o5717k8139b2543j38597g7546
9874a97677c4861H2755J32809b636l38712J24899C6739b07738B13601I4558C6003
9862A31958J33946a03961L0445K5008j97598E5087a09262l46939E7697a08366
$$ plain form
9944 175669 -78316 -254994 -147738 -322354 -104395 -112689 77944 -115817 -202269 -175621 -113935
9933 -113935 8311 -28136 -297358 124454 -913 -28282 -13420 261982 317574 -229823 110032
9921 -31183 -4379 93676 180161 27126 -10977 -41615 241277 112646 -116797 -154841 -18382
9909 203738 -204576 93990 151274 169190 -85454 -31934 -61261 90938 3839 -133388 -22649
9897 -21538 -169630 -383176 -266752 87595 -144090 -182032 -129727 36585 -116161 -559 -219764
9886 -219764 11130 -6711 -81682 232249 -233528 -132660 -198377 -226516 -22543 -161140 -77546
9874 -197677 -34861 82755 215564 -2636 -341348 -216449 36739 -207738 213601 94558 36003
9862 131958 265904 -103961 -73516 -48508 -246106 55087 -109262 -456201 57697 -108366
9851A80254J4095h8023I4200a21091J9838m68357b4886B16297c9177k9578Q198
9840f0557k5778j59633L9957B6654b87455O551B05024I4434b5175B6434F856M4056
9828E0912e4620m64417F1145a48108A65868m5611E1614a00381j39973J18974A08467
9816b93212I7816k659e2391B85281D958b0725n7610A59071E2887Q7794C5496c4774
9803a10723j09456P8001A33469a98918K4914g0446q7320d056n84914f3600D491
9791h5667m2875o9752i7345H3730a3119p2155C51756q3288b80649f1564k1211
9780h2775C203K4923K3189b44639h149l04721i83r8546H0693K71c29098A10215
9767A0785a41321o1426K0986i0768A03029a69721L721j20835F9175A70c4578k40887
$$ plain form
9851 180254 194349 -88023 94200 -121091 -101253 -569610 -24886 216297 -39177 -68755 -60557
9840 -60557 -86335 -245968 -206011 26654 -287455 -280904 205024 94434 -25175 26434 6856 50912
9828 50912 -54620 -519037 61145 -148108 165868 120257 51614 -100381 -240354 -121380 108467
9816 -293212 97816 95157 -52391 285281 4958 -20725 -78335 159071 52887 140681 35496 -34774
9803 -110723 -220179 -142178 133469 -198918 -174004 -70446 -157766 -4056 -588970 -63600 4491
9791 -85667 -128542 -198294 -97345 83730 -13119 -85274 351756 268468 -280649 -61564 -82775
9780 -82775 3203 28126 51315 -244639 -8149 -312870 -983 -99529 80693 80964 -329098 110215
9767 10785 -141321 -202747 -181761 -90768 103029 -169721 -166000 -286835 69175 170 -34578 -275465
9755b75465g0204k6011K7524E5235a06624C62967B7019b8825C5880K1470a27307
9743A99428A6675e957A99383o681A3078b33932H4470c39106a40118I5610a43723
9731A61082d2999A13003A6142c6528c468k1822A8158e2083C5560f4961q2526d0092
9718B10649A04372i1030A78250a30955j64661g8078o8029e5510q4949n6686h5019
9706D339J27190c9624C02393b16711B81107e0393j80244d4457A6798e2827k89087
9695c41914l6249F3622K81083g8599C7068J39405b11738g5720G7938B5493K1230
9684D6723c57451B65089j1548b56251O6361B58749a14034r1259i6342B15859b25033
9672a16016j16893B0407M7431k1663d18915O7008J01542O8942A09240a33062G0747
$$ plain form
9755 -275465 -70204 -96215 -68691 55235 -106624 362967 27019 -28825 35880 57350 -127307
9743 199428 16675 -5957 199383 192702 13078 -233932 84470 -339106 -140118 95610 -143723
9731 161082 -42999 113003 16142 -36528 -3468 -25290 18158 -52083 35560 -64961 -147487 -40092
9718 210649 104372 -91030 178250 -130955 -295616 -78078 -146107 -55510 -140459 -197145 -85019
9706 4339 131529 -39624 302393 -216711 281107 -50393 -230637 -44457 16798 -52827 -341914
9695 -341914 -378163 63622 344705 -78599 37068 176473 -211738 -75720 77938 25493 46723
9684 46723 -357451 265089 253541 -256251 -189890 258749 -114034 -205293 -96342 215859 -225033
9672 -116016 -232909 20407 67838 46175 -418915 -351907 -250365 -181423 109240 -133062 70747
9660A53419a03090k42630h2826I2188b6357B26616b55213F6563B5739K23576b26298
9648a23626E8538K42713j44384i0453l53091A06951c71288a4074G5626K1807a82481
9636A10674L5671A1547b95340a00727F3529b1197j55367h6838p2775M6167l50449
9625d63895a67462b9200A22660c72006N3065j19970I4433b17486I4398a95025
9614h7343D3278d3968k69240a24679E6785d9597p1312n7687B6847b04598A47011
9602I3289g4456r2128D511K04011l0685c1133m1028k20021Q478J06754C29336
9590D3697a36908B03921a41412b9085j41584A5144f9692o2964j19701h1425c9688
9578c57669M7850G0002i9125j26563A80831a14536H9188J40765A615i7994J5395
$$ plain form
9660 153419 -103090 -345720 -82826 92188 -26357 226616 -255213 66563 25739 249315 -226298
9648 -123626 58538 301251 156867 -90453 -443544 106951 -371288 -14074 75626 97433 -182481
9636 110674 146345 11547 -295340 -100727 63529 -21197 -176564 -86838 -159613 -113446 -463895
9625 -463895 -167462 -29200 122660 -372006 -318941 -438911 94433 -217486 94398 -195025
9614 -87343 43278 -43968 -313208 -124679 56785 -49597 -120909 -178596 26847 -204598 147011
9602 93289 -74456 -166584 4511 208522 177837 -31133 -72161 -292182 -283704 -176950 329336
9590 43697 -136908 203921 -141412 -29085 -170669 15144 -69692 -132656 -252357 -81425 -39688
9578 -357669 -309819 70002 -99125 -225688 180831 -114536 89188 229953 1615 -97994 -82599
9567h2599j05835c3812F6229L71590i502A6526a6869l14978a17362C4718K21680
9556B56398a23670A32114b11648A18750k1273g3040r310q0902A78811a93959e5015
9544C8748f4899B4232h244E5096b00260R6743A93113G3832a53431A80682b46967
9532c12476Q2587A00045a97563K360B3457I982N9638c39069O3568a06895b5195
9520b4877A87673b5406H7746a80772a2308j78849A70059l6683b7486m461h321
9508A60683F0763a48145A09853g2331E1089k4407Q2829m0556K3125k5823q170
9497E8087b00427e8840C4184J50396a31503C57408j37117k5932a02973n4142d4840
9485a23460n3962h3040e36C7248O7764J43482d6995F1870b18492j0646A89181
$$ plain form
9567 -82599 -188434 -33812 66229 437819 -9502 16526 -16869 -331847 -117362 34718 256398
9556 256398 -123670 132114 -211648 118750 97477 -73040 -82350 -163252 178811 -193959 -55015
9544 38748 -64899 24232 -8244 55096 -200260 -103517 193113 73832 -153431 180682 -246967
9532 -312476 -229889 100045 -197563 -195203 23457 9982 69620 -339069 -275501 -106895 -25195
9520 -24877 187673 -25406 87746 -180772 -12308 -191157 170059 133376 -27486 -31947 -8321
9508 160683 60763 -148145 109853 -72331 51089 26682 109511 68955 92080 66257 58087
9497 58087 -200427 -58840 34184 184580 -131503 357408 220291 194359 -102973 -157115 -44840
9485 -123460 -177422 -83040 -536 37248 105012 248494 -46995 61870 -218492 -229138 189181
9473H9112a16040j11818A6706K28703k005a64684e8705I3650d4117J7350j0660
9462c7427q6373M0100a7753A05296a47324j93445j1985c8766k47105E4207a87936
9450e6928I1262a20482A21644g3557A51567a76264C68785A74736p8951R4872D9374
9438B13784b3448A26002e6006J2134D42836a1880k2186I5079h4401A82962a44036
9426A00311b29846F2083c05365J30812N7994p0084A65312K309C1853g4961m7870
9415a22831A2334b6773A40022F2634a0728A50175a5590a735j37761A21486h7691
9403A1119c81663A71568a07199j12712C86377b2615l61200J05452l2000A87572
9392a22486H2317e62575b1686r4626K8724k83890i4548N560M3816A25511a71849
$$ plain form
9473 89112 -116040 -227858 16706 245409 243404 -164684 -58705 93650 -44117 -26767 -37427
9462 -37427 -123800 -83700 -17753 105296 -147324 -340769 -352754 -38766 -285871 54207 -187936
9450 -56928 91262 -120482 121644 -73557 151567 -176264 368785 174736 95785 190657 49374
9438 213784 -23448 126002 -56006 -43872 442836 -11880 -34066 95079 -84401 182962 -144036
9426 100311 -229846 62083 -305365 -174553 -116559 -186643 165312 167621 31853 -74961 -122831
9415 -122831 12334 -26773 140022 62634 -10728 150175 -15590 -1735 -139496 121486 -87691
9403 11119 -381663 171568 -107199 -219911 386377 -22615 -383815 -278363 -310363 187572
9392 -122486 82317 -562575 -21686 -116312 -87588 -371478 -94548 -88988 -45172 125511 -171849
9380C04034E5072g9247q9262g0140j9587L4942b5756B2244e5480f900k37952A05711
9367a66813a1592k17437K652N6908A2209M6902c42665O2275g5541k75528j49463
9356e00532a28772m225b7510j3397I8313b17096A59730a37936o3043B9692P0958
9345A00650E0315a21206o5285j8970k98652i4429o685B2758k446J81185c51200
9333b14184A14067J9674C5531a54454B60080h0021E4474a7928l13581J19535H8336
9321f4136p892g301A81989a20827o7847b8332q4761e4118B73006d51424K25019
9310b26405B51941e0278q1977I5233C1614P7010a2272j43401A53258a23145G3150
9298C11797b50909a00964i755j2250A02948J35673A2096a74691R42n6455K1826
$$ plain form
9380 304034 55072 -79247 -168509 -70140 -89727 -54785 -25756 22244 -55480 -6900 -244852 105711
9367 -166813 -11592 -229029 -226377 -169469 12209 59111 -342665 -280390 -75541 -351069 -500532
9356 -500532 -128772 -132997 -27510 -40907 98313 -217096 159730 -137936 -200979 29692 100650
9345 100650 50315 -121206 -186491 -205461 -504113 -94429 -101114 22758 20312 201497 -351200
9333 -214184 114067 133741 35531 -154454 260080 -80021 54474 -17928 -331509 -211974 88336
9321 -64136 -72028 -7301 181989 -120827 -188674 -28332 -113093 -54118 273006 -451424 -226405
9310 -226405 251941 -50278 -132255 95233 31614 108624 -12272 -155673 153258 -123145 73150
9298 311797 -250909 -100964 -9755 -22005 102948 238621 12096 -174691 -173749 -230204 -208378
9287b08378B4113b1113C5479A2973b32948p1410A78586b683j63950J7749M2511
9276a06373K8479k93514a04240H218b18038d9664A17808a78918e4645k04470A2610
9264A06949g7972I9636b92509R4460K8680n2417F1436A7244b4927O256k16803
9253b35474g2726F9924L4784Q5823j931a31084k5273d6194j71122O2564A20361
9241h9162J5521A22875b59928h1640D4166a43074d4126k5392r0413F5966K112
9230F8078J55510c17767g6459j61141J03711B5057J44544C6038i7117n9351p2344
9219b28812A56703b10939B6598c3624k39124e8776m5207j06136Q0025l5148k16881
9208c82123a63100P3476c2315A59309c4756r9727C1403J89163b6832r7043C37536
$$ plain form
9287 -208378 24113 -21113 35479 12973 -232948 -304358 178586 -2683 -166633 -148884 -106373
9276 -106373 -77894 -371408 -104240 8218 -218038 -49664 117808 -178918 -54645 -259115 12610
9264 106949 -77972 99636 -292509 -198049 -169369 -221786 61436 17244 -24927 -18671 -235474
9253 -235474 -72726 69924 104708 190531 188600 -131084 -156357 -46194 -217316 -154752 120361
9241 -89162 -73641 122875 -259928 -81640 44166 -143074 -44126 -69518 -159931 65966 68078
9230 68078 223588 -317767 -76459 -237600 -133889 25057 169601 36038 -97117 -156468 -228812
9219 -228812 156703 -210939 26598 -33624 -272748 -58776 -103983 -210119 -130094 -165242 -382123
9208 -382123 -163100 -89624 -32315 159309 -34756 -134483 31403 220566 -26832 -123875 337536
9196c00757N4547A5414P1363J63194j20385g3602B391a88901B87142b8399B3532
9184E8320K29592j6072r7882G9766b60872A5205J03903j2321J95507g9093J3962
9173f5131D5546J9586a28398q7268A29991J27275b92934C10176L6903a59335k09067
9162c68402a46431p5489K1189G0276M2130f8684E7665J9640J66739H5629e2526
9150d25507G5171e3603A94676Q1496j34105b82399e0071A73020i7815K4205j12225
9139a85835e6385r5037A23562C781a43406j37463k11736g4771A27892e5146B69275
9127b02649d3842m05507A08318a57163N5476B38158m383h9588c7418k0395j12833
9116a70646p3347j30469h8528c5101r6440M7179b7994A52085a87117Q3494A26123
$$ plain form
9196 -300757 -246210 15414 86777 249971 129586 -73602 2391 -188901 287142 -28399 23532
9184 58320 287912 271840 173958 79766 -260872 15205 119108 106787 302294 -79093 -65131
9173 -65131 45546 65132 -128398 -215666 129991 257266 -292934 310176 347079 -159335 -368402
9162 -368402 -146431 -221920 -200731 70276 112406 -68684 57665 77305 244044 85629 -52526
9150 -425507 75171 -53603 194676 276172 142067 -282399 -50071 173020 -97815 -73610 -185835
9139 -185835 -56385 -151422 123562 3781 -143406 -280869 -492605 -74771 127892 -55146 269275
9127 -202649 -43842 -449349 108318 -157163 -101687 238158 233775 -89588 -37418 -57813 -170646
9116 -170646 -243993 -374462 -88528 -35101 -131541 -84362 -27994 152085 -187117 -103623 126123
9104e8238D3078h8104A24841b14006Q3209B13192C2444L5437a92577l9893A05367
9092d2066A60313h0781j70540c4772D9144J81716h4036l65010a69486B32648a58220
9080D3790c4047B89311q7603H519a33267L3123A41652o3132d0006A75914l5523
9069A40391c99149g3176k32515J23208J607j10014B09358a14414N1965l83752
9059d46201a06843B55492A26887g807B3834a40925H067d0965C792M4047K5443
9048G3282a02091l481j28063e5000j14207g4199k84289R2920C630K66380b32112
9036b14003d4116F0033N3942a68867D00415b17393a07089c9359q1954j86455h1801
9024c2995B85786g8982n7677a4261E8195c66915D3108a18745N4146k00765N5929
$$ plain form
9104 -58238 43078 -88104 124841 -214006 -130797 213192 32444 67881 -192577 -232470 105367
9092 -42066 160313 -80781 -251321 -34772 49144 230860 -84036 -449046 -169486 232648 -158220
9080 43790 -34047 289311 201708 8519 -133267 -100144 141652 78520 -40006 175914 140391
9069 140391 -399149 -73176 -305691 -182483 -180876 -290890 209358 -114414 -62449 -446201
9059 -446201 -106843 255492 126887 -7807 23834 -140925 8067 -40965 3792 47839 73282
9048 73282 -102091 -105572 -233635 -55000 -169207 -74199 -358488 -265568 3630 270010 -232112
9036 -214003 -44116 60033 113975 -168867 400415 -217393 -107089 -39359 -121313 -307768 -81801
9024 -32995 285786 -78982 -136659 -14261 58195 -366915 43108 -118745 -64599 -265364 -209435
9013b09435j009H7321J98598o5487A01950B2545C750K89567a99631g9310G6853
9001H555R7294d05347a97221A55094e66l9700B80890a60883p1085N7475c3208
8989F2775a88396D1883g3533k15310M7756B2201b8301p1284D6063b24384c7549
8977i4630D7494L5674i1623C9872K83286e0185A53273a45328a7193C74822I2781
8965a76011j96611a73021f8409L2261J7123C4248J01394b51963R5772o5689D6779
8953a7455A07084a78435o9296A39135f9861J5871q8231A90051a47617g1199A46481
8941b78299E8657g6384c4314J1876A98938a50164F7398a46136B83944c26124C9769
8929c23798J28705K808I2120a14668K405D42859j48425J171986k99572D16950
$$ plain form
9013 -209435 -210444 87321 285919 220432 101950 22545 3750 293317 -199631 -79310 76853
9001 8555 105849 -405347 -197221 155094 -566 -40266 280890 -160883 -231968 -174493 -33208
8989 62775 -188396 41883 -73533 -288843 -241087 22201 -28301 -99585 46063 -224384 -37549
8977 -94630 47494 83168 -91623 39872 323158 -50185 153273 -145328 -17193 374822 92781
8965 -176011 -372622 -173021 -68409 -36148 -19025 34248 135642 -251963 -156191 -221880 46779
8953 -17455 107084 -178435 -247731 139135 -69861 -53990 -142221 190051 -147617 -71199 146481
8941 -278299 58657 -76384 -34314 -22438 198938 -150164 67398 -146136 283944 -326124 39769
8929 -323798 -195093 -192285 92120 -114668 -112263 442859 294434 1466420 1166848 416950
8918C46438a22745J5794B09829j03817g9467F7332b2562B10065c4704E0496c12150
8906a77240B8846b4625D0504a9002q9740b5683l883H8423a55538E2542J01188
8895A53730e8375j53865M1356B37397G5907a38299A55669g8986K2282j17528N2191
8884a22041j49690H5683b0910C6414K26026E0407h4721K6344C13150a45538l9507
8873a85045B4440a04503k80387J15714a03907d5586q243j91766j04123G9857a08280
$$ plain form
8918 346438 -122745 -106951 209829 106012 -79467 67332 -22562 210065 -34704 50496 -312150
8906 -177240 28846 -24625 40504 -19002 -108742 -25683 -29566 88423 -155538 52542 153730
8895 153730 -58375 -212240 -170884 237397 75907 -138299 155669 -78986 -56704 -174232 -122041
8884 -122041 -271731 85683 -20910 36414 262440 50407 -84721 -58377 313150 -145538 -185045
8873 -185045 24440 -104503 -384890 -269176 -103907 -45586 -53829 -245595 -349718 79857 -108280
$$ [...]
##END NTUPLES=NMR SPECTRUM
##END=
