##TITLE=AC1463_TOLI313269_7819355_85D92tqTSG
##JCAMPDX= 6.0         $$ Bruker NMR JCAMP-DX V2.0
##DATA TYPE= NMR SPECTRUM
##DATA CLASS= NTUPLES
##ORIGIN= BRUKER
##OWNER= Administrator
$$ 1.72 TOPSPIN		Version 2.1
$$ 2013-04-30 23:44:25.227 -0700  Administrator@X
$$ Compression mode = diff/dup
##.OBSERVE FREQUENCY= 400.02188249412
##.OBSERVE NUCLEUS= ^1H
##.ACQUISITION MODE= SIMULTANEOUS (DQD)
##.ACQUISITION SCHEME= undefined
##.AVERAGES= 64
##.DIGITISER RES= 22
##SPECTROMETER/DATA SYSTEM= spect
##.PULSE SEQUENCE= noesygpps1d.comp
##.SOLVENT NAME= COFFEE_meoh
##.SHIFT REFERENCE= INTERNAL, COFFEE_meoh, 1, 14.96088
##AUDIT TRAIL= $$ (NUMBER, WHEN, WHO, WHERE, PROCESS, VERSION, WHAT)
$$ ##TITLE= Audit trail, TOPSPIN		Version 2.1
$$ ##JCAMPDX= 5.01
$$ ##ORIGIN= Bruker BioSpin GmbH
$$ ##OWNER= Administrator
$$ $$ E:\/data/COFFEE/nmr/AC1463_TOLI313269_7819355_85D92tqTSG/12/pdata/1/auditp.txt
$$ ##AUDIT TRAIL=  $$ (NUMBER, WHEN, WHO, WHERE, PROCESS, VERSION, WHAT)
(   1,<2013-04-30 23:44:20.258 -0700>,<Administrator>,<X>,<go>,<TOPSPIN 2.1>,
      <created by zg
	started at 2013-04-30 23:32:50.493 -0700,
	POWCHK enabled, PULCHK disabled,
       configuration hash MD5:
       F7 49 AB AC A2 8D 51 76 73 8D C1 9A A6 38 9F DE
       data hash MD5: 64K
       99 FF CD E8 FD B1 EF 15 9C BB 28 72 A6 53 D0 A0>)
(   2,<2013-04-30 23:44:23.196 -0700>,<Administrator>,<X>,<proc1d>,<TOPSPIN 2.1>,
      <Start of raw data processing
       efp LB = 0.3 FT_mod = 6 PKNL = 1 PHC0 = 0 PHC1 = 0 SI = 128K 
       data hash MD5: 128K
       8F 8B 15 A8 B2 01 BC 76 EC 54 96 1A A4 B1 D1 26>)
(   3,<2013-04-30 23:44:24.196 -0700>,<Administrator>,<X>,<proc1d>,<TOPSPIN 2.1>,
      <pk PHC0 = -78.27209 PHC1 = 0 
       data hash MD5: 128K
       F8 9B A7 8A 32 B9 7A 4E CD 83 91 03 C1 1D 88 21>)
(   4,<2013-04-30 23:44:24.649 -0700>,<Administrator>,<X>,<proc1d>,<TOPSPIN 2.1>,
      <abs ABSG = 1 
       data hash MD5: 128K
       66 D5 87 B9 7E 7E 61 94 BE 63 3C C5 31 68 6E B8>)
(   5,<2013-04-30 23:44:24.774 -0700>,<Administrator>,<X>,<proc1d>,<TOPSPIN 2.1>,
      <abs ABSG = 2 
       data hash MD5: 128K
       B2 3F 8F 5B 65 27 07 64 1D 10 B3 45 45 4D 50 2C>)
(   6,<2013-04-30 23:44:24.868 -0700>,<Administrator>,<X>,<proc1d>,<TOPSPIN 2.1>,
      <abs ABSG = 3 
       data hash MD5: 128K
       50 41 88 DB A2 60 01 59 7D BA 46 F7 09 BD D5 7E>)
(   7,<2013-04-30 23:44:24.946 -0700>,<Administrator>,<X>,<proc1d>,<TOPSPIN 2.1>,
      <abs ABSG = 4 
       data hash MD5: 128K
       7E F8 B7 54 86 AB 45 29 DC D4 66 3E 71 10 DD 09>)
(   8,<2013-04-30 23:44:25.055 -0700>,<Administrator>,<X>,<proc1d>,<TOPSPIN 2.1>,
      <abs ABSG = 5 
       data hash MD5: 128K
       96 83 0C D7 E0 53 E0 AC 1B 67 D4 C7 81 03 8A 59>)
$$ ##END=
$$ 
$$ $$ hash MD5
$$ $$ A2 1F 24 2A 43 97 C8 BF EE 22 C5 18 78 AF 23 E3
##$RELAX= 
##$RELAX= 
##$RELAX= 
##$RELAX= 
##$RELAX= 
##$RELAX= 
##$RELAX= 
##$RELAX= 
$$ Bruker specific parameters
$$ --------------------------
##$DU= <E:\>
##$EXPNO= 12
$$ [...]
150 150 150 150 150 150 150 150
##$TP07= 0
##$TPNAME0= <>
##$TPNAME1= <>
##$TPNAME2= <>
##$TPNAME3= <>
##$TPNAME4= <>
##$TPNAME5= <>
##$TPNAME6= <>
##$TPNAME7= <>
##$TPOAL= (0..7)
0.5 0.5 0.5 0.5 0.5 0.5 0.5 0.5
##$TPOFFS= (0..7)
0 0 0 0 0 0 0 0
##$TUNHIN= 0
##$TUNHOUT= 0
##$TUNXOUT= 0
##$USERA1= <user>
##$USERA2= <user>
##$USERA3= <user>
##$USERA4= <user>
##$USERA5= <user>
##$V9= 5
##$VALIST= <valist>
##$VCLIST= <CCCCCCCCCCCCCCC>
##$VD= 0
##$VDLIST= <DDDDDDDDDDDDDDD>
##$VPLIST= <PPPPPPPPPPPPPPP>
##$VTLIST= <TTTTTTTTTTTTTTT>
##$WBST= 1024
##$WBSW= 4
##$XGAIN= (0..3)
0 0 0 0
##$XL= 0
##$YL= 0
##$YMAX_a= 5783764
##$YMIN_a= -12242836
##$ZGOPTNS= <>
##$ZL1= 120
##$ZL2= 120
##$ZL3= 120
##$ZL4= 120
##$ABSF1= 14.96088
##$ABSF2= -5.597301
##$ABSG= 5
##$ABSL= 3
##$ALPHA= 0
##$AQORDER= 0
##$ASSFAC= 0
##$ASSFACI= 0
##$ASSFACX= 0
##$ASSWID= 0
##$AUNMP= <proc_prof1d_extract.lims>
##$AXLEFT= 0
##$AXNAME= <>
##$AXNUC= <1H>
##$AXRIGHT= 0
##$AXTYPE= 0
##$AXUNIT= <>
##$AZFE= 0.1
##$AZFW= 0.1
##$BCFW= 0
##$BC_mod= 0
##$BYTORDP= 0
##$COROFFS= 0
##$CY= 15
##$DATMOD= 1
##$DC= 0
##$DFILT= <>
##$DTYPP= 0
##$F1P= 0
##$F2P= 0
##$FCOR= 0.5
##$FTSIZE= 131072
##$FT_mod= 6
##$GAMMA= 0
##$GB= 0
##$INTBC= 1
##$INTSCL= 1
##$ISEN= 128
##$LB= 0.3
##$LEV0= 0
##$LPBIN= 0
##$MAXI= 10000
##$MC2= 0
##$MEAN= 0
##$ME_mod= 0
##$MI= 0
##$NCOEF= 0
##$NC_proc= -2
##$NLEV= 6
##$NOISF1= 0
##$NOISF2= 0
##$NSP= 0
##$NTH_PI= 0
##$NZP= 0
##$OFFSET= 14.96088
##$PC= 1
##$PHC0= -78.27209
##$PHC1= 0
##$PH_mod= 1
##$PKNL= yes
##$PPARMOD= 0
##$PPDIAG= 0
##$PPIPTYP= 0
##$PPMPNUM= 2147483647
##$PPRESOL= 1
##$PSCAL= 4
##$PSIGN= 0
##$PYNMP= <proc.py>
##$REVERSE= no
##$SF= 400.0200096833
##$SI= 131072
##$SIGF1= 0
##$SIGF2= 0
##$SINO= 400
##$SIOLD= 131072
##$SPECTYP= <>
##$SREGLST= <1H.CDCl3>
##$SSB= 0
##$STSI= 131072
##$STSR= 0
##$SW_p= 8223.68421052631
##$SYMM= 0
##$S_DEV= 0
##$TDeff= 65536
##$TDoff= 0
##$TI= <>
##$TILT= no
##$TM1= 0
##$TM2= 0
##$TOPLEV= 0
##$USERP1= <user>
##$USERP2= <user>
##$USERP3= <user>
##$USERP4= <user>
##$USERP5= <user>
##$WDW= 1
##$XDIM= 131072
##$YMAX_p= 404305285
##$YMIN_p= -11753
##$CURPLOT= <Network HP LaserJet P1505>
##$CURPRIN= <$Network HP LaserJet P1505>
##$DFORMAT= <normdp>
##$LAYOUT= <+/1D_H.xwp>
##$LFORMAT= <normlp>
##$PFORMAT= <normpl>
##$SURQMSG= 1
$$ End of Bruker specific parameters
$$ ---------------------------------
##NTUPLES= NMR SPECTRUM
##VAR_NAME=  FREQUENCY,     SPECTRUM/REAL,   SPECTRUM/IMAG
##SYMBOL=    X,             R,               I
##VAR_TYPE=  INDEPENDENT,   DEPENDENT,       DEPENDENT
##VAR_FORM=  AFFN,          ASDF,            ASDF
##VAR_DIM=   131072,        131072,          131072
##UNITS=     HZ,            ARBITRARY UNITS, ARBITRARY UNITS
##FACTOR=    0.0627417313425164, 1,          1
##FIRST=     8223.62146879497, -587,         -51251
##LAST=      0,             1386,            -51768
##MIN=       0,             -11753,          0
##MAX=       8223.62146879497, 404305285,    0
$$ Real data points
##PAGE= N=1
##DATA TABLE= (X++(R..R)), XYDATA
$$ [...]
63901A237393q8491p7958o8664o0359n3052m6707m0959l5566l0834k7146k4329
$$ 1237393 1148902 1070944 1002280 941921 888869 842162 801203 765637 734803 707657 683328
63890F83328k1982k0071j8642j7237j5360j3315j1814j0865r718p960n909l933
$$ 683328 661346 641275 622633 605396 590036 576721 564907 554042 544324 536364 530455 526522
63878E26522k108o26K92J062K547M847O999Q299R282J0896J3226J5602J7577J9122
$$ 526522 524414 523788 524080 525142 527689 532536 539535 547834 557116 568012 581238 596840 614417 633539
63864F33539K0176K0590K0499K0237J9856J9079J7782J6189J4551J2830J0802
$$ 633539 653715 674305 694804 715041 734897 753976 771758 787947 802498 815328 826130
63853H26130Q335N520K585k88l045n754q600j1854j5562j9121k1565k2593k3031
$$ 826130 834465 839985 842570 842282 839237 833483 824883 813029 797467 778346 756781 734188 711157
63840G11157k3784k4632k4679k3828k2957k2611k2379k1836k1189k0582j9498
$$ 711157 687373 662741 638062 614234 591277 568666 546287 524451 503262 482680 463182
63829D63182j7628j5722j4771j4666j4374j3279j1715j0360r637r530r496q720
$$ 463182 445554 429832 415061 400395 386021 372742 361027 350667 341030 331500 322004 313284
63817C13284p080n578n196n479n083l619k121j520j590j720j900k373k820k652
$$ 313284 306204 300626 295430 289951 284868 281249 279128 277608 276018 274298 272398 270025 267205 264553
63803B64553j862j026n83n18o59r21j248j607k024k505k909l040k818k296j717
$$ 264553 262691 261665 261082 260564 259905 258984 257736 256129 254105 251600 248691 245651 242833 240537 238820
63788B38820j517k019k910l330k719j458m34j48m34q79j198j314j340j421j463
$$ 238820 237303 235284 232374 229044 226325 224867 224433 224285 223851 222972 221774 220460 219120 217699 216236
63773B16236j122l32L85M76J03l0L83Q68Q58M32J64L69P11O25M6m08j72M23M03
$$ 216236 215114 214782 215167 215643 215746 215716 216099 216967 217825 218257 218421 218790 219501 220126 220172 219764 219592 220015 220418
63754B20418m85j170n52Q77J500P07l31l51L78Q08Q74J362K325K734K069J293
$$ 220418 219933 218763 218211 219088 220588 221295 220964 220613 220991 221799 222673 224035 226360 229094 231163 232456
63738B32456J608K855L876M097L932L799L594L243K977K755K103J008L53Q49J971
$$ 232456 234064 236919 240795 244892 248824 252623 256217 259460 262437 265192 267295 268303 268656 269505 271476
63723B71476K736L173M081N428O126N654M949N066N722N916N365M480L365J743
$$ 271476 274212 277385 281466 286894 293020 298674 303623 308689 314411 320327 325692 330172 333537 335280
63709C35280k44j999l258m207m781m608l795l056k904l180l559l879l858l119
$$ 335280 335036 333037 329779 325572 320791 316183 312388 309332 306428 303248 299689 295810 291952 288833
63695B88833j773m06P50J989L233L729L143K257J922J962J749J369J322J441J105
$$ 288833 287060 286654 287404 289393 292626 296355 299498 301755 303677 305639 307388 308757 310079 311520 312625
63680C12625L63l0K34N94N41L38N37J225J972K289K024J566J624K538L857M851
$$ 312625 312988 312958 313192 313786 314327 314665 315202 316427 318399 320688 322712 324278 325902 328440 332297 337148
63664C37148N263N242M737L554J891L13q40j626k130k477l060m212n599o521o803
$$ 337148 342411 347653 352390 355944 357835 358148 357308 355682 353552 351075 348015 343803 338204 331683 324880
63649C24880o837o693n963m578l158k188j475o82Q9O21J012J435J835K163K571
$$ 324880 318043 311350 305387 300809 297651 295463 293988 293306 293395 294016 295028 296463 298298 300461 303032
63634C03032L143L697M099M376M491M378M366M959O076P019P441P713Q059Q091
$$ 303032 306175 309872 313971 318347 322838 327216 331582 336541 342617 349636 357077 364790 372849 380940
63620C80940P664P515Q408J0129J1939J3537J5050J6483J7887J9661K2012K4467
$$ 380940 388604 396119 404527 414656 426595 440132 455182 471665 489552 509213 531225 555692
63608E55692K6573K8705L1428L4360L6570L7830L8595L8732L7253L3495K7796
$$ 555692 582265 610970 642398 676758 713328 751158 789753 828485 865738 899233 927029
63597I27029K0810J2901M644k781q227j1426j2862j3033j2173j0626r250r258
$$ 927029 947839 960740 965384 962603 954376 942950 930088 917055 904882 894256 885006 875748
63585H75748j1407j5268j9490k3075k5976k8293k9441k8861k7172k5667k4654
$$ 875748 864341 849073 829583 806508 780532 752239 722798 693937 666765 641098 616444
63574F16444k3189k0551j7167j3814j0708p806n289l195j144J047K837L682L959
$$ 616444 593255 572704 555537 541723 531015 523209 517920 514725 513581 514628 517465 521147 525106
63561E25106M577N842P243Q271Q939R507J0145J0973J2131J3630J5371J7376J9837
$$ 525106 529683 535525 542768 551039 559978 569485 579630 590603 602734 616364 631735 649111 668948
63548F68948K2910K6521L0458L4591L9079M4274N0163N5643N8388N5874M6953
$$ 668948 691858 718379 748837 783428 822507 866781 916944 972587 1030975 1086849 1133802
63537A133802L2772J6351J186j0268j7270k0398k0638j8849j5886j2754j0349
$$ 1133802 1166574 1182925 1184111 1173843 1156573 1136175 1115537 1096688 1080802 1068048 1057699
63526A057699r196r597j1864j6040k1400k6681l1014l4484l7539m0064m1341m0907
$$ 1057699 1048503 1038906 1027042 1011002 989602 962921 931907 897423 859884 819820 778479 737572
63514G37572l9070l6488l3575l0472k7355k4435k1747j9228j6947j4991j3250
$$ 737572 698502 662014 628439 597967 570612 546177 524430 505202 488255 473264 460014
63503D60014j1580j0065q856p842o817n947n586n731n983o005n602m456k493n19
$$ 460014 448434 438369 429513 421671 414854 408907 403321 397590 391607 385602 380000 375544 373051 372532
63489C72532L41N9k25J22L79j01n55J26J667K807L148L462M225M963N191N101
$$ 372532 372873 372932 372707 372829 373208 373107 372552 372678 374345 377152 380300 383762 387987 392950 398141 403242
63473D03242N044M970M709M178L138J302j008k919l967m529n050n335n040m451
$$ 403242 408286 413256 417965 422143 425281 426583 425575 422656 418689 414160 409110 403775 398735 394284
63459C94284m216m441m484l686k159p58k73o50j094r42k17P64J876K984L746M204
$$ 394284 390068 385627 381143 377457 375298 374540 374267 373617 372523 371581 371364 372128 374004 376988 380734 384938
63443C84938N171P317J0002J1825J2313J2405J3194J4951J7428K0383K3554K6852
$$ 384938 390109 397426 407428 419253 431566 443971 457165 472116 489544 509927 533481 560333
63431E60333L0817L6085M1791M5175M3521L6542K6588J6740Q938L537J75j166
$$ 560333 591150 627235 669026 714201 757722 794264 820852 837592 846530 850067 850242 849076
63419H49076j2L750R294J5556K2173K9093L5536M0273M2939M4089M3749M0865
$$ 849076 849064 852814 862108 877664 899837 928930 964466 1004739 1047678 1091767 1135516 1176381
63407A176381L4655K5742J5482M999m600j1957j6270j8001j8106j7088j5422j4331
$$ 1176381 1211036 1236778 1252260 1257259 1252659 1240702 1224432 1206431 1188325 1171237 1155815 1141484
63395A141484j5171j8214k2662k7705l2887l7639m1151m2923m3018m1795l9593
$$ 1141484 1126313 1108099 1085437 1057732 1024845 987206 946055 903132 860114 818319 778726
63384G78726l6689l3316k9788k6585k3966k1506j8493j4967j1713r056o430l546
$$ 778726 742037 708721 678933 652348 628382 606876 588383 573416 561703 552647 546217 542671
63372E42671j068N25J972M209O936R165J0729J2206J3746J5060J6419J8534K1416
$$ 542671 541603 542128 544100 548309 555245 564410 575139 587345 601091 616151 632570 651104 672520
63359F72520K4356K7105L0089L3322L6075L8035L9875M2178M4372M5338M4550
$$ 672520 696876 723981 754070 787392 823467 861502 901377 943555 987927 1033265 1077815
63348A077815M2117L7978L1699K3097J2888K610o101j2305j5957j7426j7158j5908
$$ 1077815 1119932 1157910 1189609 1212706 1225594 1228204 1222103 1209798 1193841 1176415 1159257 1143349
63336A143349j4780j4608j5505j7390k0520k4977l0051l4737l8530m1067m1472
$$ 1143349 1128569 1113961 1098456 1081066 1060546 1035569 1005518 970781 932251 891184 849712
63325H49712l9181l5216l1466k8536k5339k0991j5985j1033n940n80L733M773
$$ 849712 810531 775315 743849 715313 689974 668983 652998 641965 636025 635445 639178 643951
63313F43951J248o199j5329k3225k7588k8061k6214k3823k1372j8541j5564j3204
$$ 643951 645199 639000 623671 600446 572858 544797 518583 494760 473388 454847 439283 426079
63301D26079j1628j0137q197o172m811m346m321m144l705l450l816m552m860m352
$$ 426079 414451 404314 396117 389945 385134 380788 376467 372323 368618 365168 361352 356800 351940 347588
63287C47588l606l465l994m455m227l370k344j586j379j761k371k618k216j491
$$ 347588 343982 340517 336523 332068 327841 324471 322127 320541 319162 317401 315030 312412 310196 308705
63273C08705r42o30j71N84J145R11N0m73N6J283K216K334J926J498J304J439J948
$$ 308705 307763 307133 306962 307546 308691 309602 309652 309179 309235 310518 312734 315068 316994 318492 319796 321235 323183
63256C23183K611L021L154L510M443N499N859N322M505M107M189M326M245M223
$$ 323183 325794 328815 331969 335479 339922 345421 351280 356602 361107 365214 369403 373729 377974 382197
63242C82197M846O410Q511J0375J1603J2491J3574J5029J6680J8433K0330K2203
$$ 382197 387043 393453 401964 412339 423942 436433 450007 465036 481716 500149 520479 542682
63230E42682K3567K4057K3836K3391K3036K2742K2449K2232K2104K1846K1267
$$ 542682 566249 590306 614142 637533 660569 683311 705760 727992 750096 771942 793209
63219G93209K0558K0244K0676K1692K2708K3072K2412K0778J8490J5715J2182
$$ 793209 813767 834011 854687 876379 899087 922159 944571 965349 983839 999554 1011736
63208A011736P479J663m622j0600j5800k0151k3837k7061k9706l1285l1472l0549
$$ 1011736 1019215 1020878 1016256 1005656 989856 969705 945868 918807 889101 857816 826344 795795
63196G95795k8991k6692k3276j9126j5405j2754j0584q065n214k559k08K135M660
$$ 795795 766804 740112 716836 697710 682305 669551 658967 650902 645688 643129 642921 645056 649716
63183F49716P422J0393J3056J4489J4580J4671J6034J8118J9203J8661J7487J6654
$$ 649716 657138 667531 680587 695076 709656 724327 740361 758479 777682 796343 813830 830484
63171H30484J6052J5294J4436J3493J2031R855P494N467L549J158j983n874j0463
$$ 830484 846536 861830 876266 889759 901790 911645 919139 924606 928155 929313 927330 921456 910993
63158I10993j5373j9828k3298k5989k8295l0082l0842l0386k9065k7470k6042
$$ 910993 895620 875792 852494 826505 798210 768128 737286 706900 677835 650365 624323
63147F24323k4752k3066k0495j7349j4483j2299j0419q562p073o277n796n129
$$ 624323 599571 576505 556010 538661 524178 511879 501460 492898 485825 479548 473752 468623
63135D68623m429m165m215l913k924j648p12l52l07r5N46J360J833J883K016K646
$$ 468623 464194 460029 455814 451901 448977 447329 446617 446265 445958 445863 446409 447769 449602 451485 453501 456147
63119D56147L496L959L839L507L439L801M329M457L860K953K552K819K951K248
$$ 456147 459643 463602 467441 470948 474387 478188 482517 486974 490834 493787 496339 499158 502109 504357
63105E04357J134O08R41J470J560J262R60Q73J058J502J956J928J162J64p8Q79
$$ 504357 505491 506099 507040 508510 510070 511332 512292 513165 514223 515725 517681 519609 520771 520935 520857 521736
63089E21736K226K563J459P1k11N25Q73l5j487k223j839q03L89J496K257K506
$$ 521736 523962 526525 527984 528055 527844 528369 529242 529207 527720 525497 523658 522855 523244 524740 526997 529503
63073E29503K555K991M020N339O595P732Q819R832J0702J1463J2241J3147J4187
$$ 529503 532058 535049 539069 544408 551003 558735 567554 577386 588088 599551 611792 624939 639126
63060F39126J5353J6819J8906K1730K4960K8135L1179L4285L7465M0515M3389
$$ 639126 654479 671298 690204 711934 736894 765029 796208 830493 867958 908473 951862
63049I51862M6236M9046N1654N4005N6003N7183N7131N6262N5536N5237N4721
$$ 951862 998098 1047144 1098798 1152803 1208806 1265989 1323120 1379382 1434918 1490155 1544876
63038A544876N3564N2261N1421N0930N0418M9932M9629M9175M7948M5460M1203
$$ 1544876 1598440 1650701 1702122 1753052 1803470 1853402 1903031 1952206 2000154 2045614 2086817
63027B086817L4575K5448J4494K567r820k2103l3484m3684n3236o2306o9758p4174
$$ 2086817 2121392 2146840 2161334 2163901 2154081 2131978 2098494 2054810 2001574 1939268 1869510 1795336
63015A795336p5440p4522p2068o8082o2749n6595m9875m2570l4933k7415k0142
$$ 1795336 1719896 1645374 1573306 1505224 1442475 1385880 1336005 1293435 1258502 1231087 1210945
63004A210945j3048o384m84M868J0121J5154J9438K2803K5418K7201K8016K8253
$$ 1210945 1197897 1191513 1191029 1195897 1206018 1221172 1240610 1263413 1288831 1316032 1344048 1372301
62992A372301K8440K8498K8135K7739K7871K8071K7303K5484K3403K1083J7549
$$ 1372301 1400741 1429239 1457374 1485113 1512984 1541055 1568358 1593842 1617245 1638328 1655877
62981A655877J2499O797Q91n990j4352k3320l1777l9574m6674n2189n5436n7122
$$ 1655877 1668376 1675173 1676064 1670074 1655722 1632402 1600625 1561051 1514377 1462188 1406752 1349630
62969A349630n8272n8539n6877n3552n0125m7442m4855m1545l7687l4010l0965
$$ 1349630 1291358 1232819 1175942 1122390 1072265 1024823 979968 938423 900736 866726 835761
62958H35761k8630k6817k5067k3006k0886j9273j8222j7270j6318j5799j5745
$$ 835761 807131 780314 755247 732241 711355 692082 673860 656590 640272 624473 608728
62947F08728j5411j4261j2818j2023j2057j2253j1942j1039r914r108r020r522
$$ 608728 593317 579056 566238 554215 542158 529905 517963 506924 497010 487902 478882 469360
62935D69360r824r104p362n485m431m405m859n055m644l887l390l433l609l271
$$ 469360 459536 450432 443070 437585 433154 428749 423890 418835 414191 410304 406914 403481 399872 396601
62921C96601k411j729j706j958j914j770k107k735k731j860j161j491k181j966
$$ 396601 394190 392461 390755 388797 386883 385113 383006 380271 377540 375680 374519 373028 370847 368881
62907C68881q72j89n95j321j467j264j425j944k210j964j448p69J53J065J457
$$ 368881 368009 367820 367225 365904 364437 363173 361748 359804 357594 355630 354182 353413 353566 354631 356088
62892C56088J284J086J200J328J138Q29P18O05J29m50l96M30J227J227N95L8j39
$$ 356088 357372 358458 359658 360986 362124 362953 363671 364276 364405 363955 363559 363989 365216 366443 367038 367076 366937
62875C66937j37j40j54l08o41p23p5R00J138L28n31m71J09Q8q10j744j870j085
$$ 366937 366800 366660 366506 366198 365557 364834 364759 365659 366797 367125 366594 366123 366232 366320 365510 363766 361896 360811
62857C60811J71J257J585J148P03R53J580J715J246R71J366J979K213K043J681
$$ 360811 360982 362239 363824 364972 365675 366628 368208 369923 371169 372140 373506 375485 377698 379741 381422
62842C81422J178P53Q44J412J680J098J43l57l48m02p41r37o17L4N70P93R19J335
$$ 381422 382600 383353 384197 385609 387289 388387 388530 388173 387825 387423 386682 385745 385128 385162 385732 386525 387444 388779
62824C88779K108K740K634J906J371J566K108K341K236K286K745L400L946M192
$$ 388779 390887 393627 396261 398167 399538 401104 403212 405553 407789 410075 412820 416220 420166 424358
62810D24358M044L620L281L292L574M023M786N892O876P269P241P325P669Q116
$$ 424358 428402 432022 435303 438595 442169 446192 450978 456870 463746 471015 478256 485581 493250 501366
62796E01366Q839J0212J2014J3469J4293J5120J6641J8813K1236K3850K6775K9893
$$ 501366 510205 520417 532431 545900 560193 575313 591954 610767 632003 655853 682628 712521
62784G12521L3036L6405M0419M5250N0807N6957O3338O9222P4137P8538Q3233
$$ 712521 745557 781962 822381 867631 918438 975395 1038733 1107955 1182092 1260630 1343863
62773A343863Q8051R1618R2739R1390Q8045Q2571P4461O3850N1502L7830K2640
$$ 1343863 1431914 1523532 1616271 1707661 1795706 1878277 1952738 2016588 2068090 2105920 2128560
62762B128560O118j0601k6233m0324n2984o4040p2933p9378q3584q5848q6330
$$ 2128560 2134678 2124077 2097844 2057520 2004536 1940496 1867563 1788185 1704601 1618753 1532423
62751A532423q5210q2811p9433p5395p1134o6997o2906n8530n3836m9120m4520
$$ 1532423 1447213 1364402 1284969 1209574 1138440 1071443 1008537 950007 896171 847051 802531
62740H02531l9895l5275l1088k7658k4770k1974j9092j6287j3802j1835j0432
$$ 802531 762636 727361 696273 668615 643845 621871 602779 586492 572690 560855 550423
62729E50423r327q066o570n337m793m641m124k896j358j32N28Q08J105J763K927
$$ 550423 541096 533030 526460 521123 516330 511689 507565 504669 503311 503179 503707 504515 505620 507383 510310
62714E10310M443O001P392Q648R971J1578J3603J6048J8815K1729K4588K7226
$$ 510310 514753 520754 528146 536794 546765 558343 571946 587994 606809 628538 653126 680352
62702F80352K9690L2344L5616L9586M3870M8020N1884N5526N8858O1573O3420
$$ 680352 710042 742386 778002 817588 861458 909478 961362 1016888 1075746 1137319 1200739
62691A200739O4467O4928O4727O3258N9702N3654M5447L5794K5165J3598J039
$$ 1200739 1265206 1330134 1394861 1458119 1517821 1571475 1616922 1652716 1677881 1691479 1692518
62680A692518j2155k5118l6851m6776n4904o1423o6213o8950o9672o8888o7011
$$ 1692518 1680363 1655245 1618394 1571618 1516714 1455291 1389078 1320128 1250456 1181568 1114557
62669A114557o4077o0266n6261n2660m9258m5423m1075l6831l3189l0053k7117
$$ 1114557 1050480 990214 933953 881293 832035 786612 745537 708706 675517 645464 618347
62658F18347k4287k1643j9311j7415j5921j4452j2608j0445q405o872o022n939
$$ 618347 594060 572417 553106 535691 519770 505318 492710 482265 473860 466988 460966 455027
62646D55027o418o811o590n958n429m875l783k293j192p33k97M65J044J111J253
$$ 455027 448609 441798 435208 429250 423821 418946 415163 412870 411678 410945 410648 411113 412157 413268 414521
62631D14521K028K869K721J395l53j738k390k206j448q19q16j077q60j7Q73J266
$$ 414521 416549 419418 422139 423534 423181 421443 419053 416847 415399 414580 413764 412687 411827 411810 412683 413949
62615D13949J176J042J429K634M232N289N387N200N658O814Q019Q899R654J0548
$$ 413949 415125 416167 417596 420230 424462 429751 435138 440338 445996 452810 460829 469728 479382 489930
62601D89930J1682J3150J4932J6771J8618K0960K4196K7905L1329L4395L7547
$$ 489930 501612 514762 529694 546465 565083 586043 610239 638144 669473 703868 741415
62590G41415M0682M3069M4332M4772M4493M2924L9524L4410K8012K0594J2410
$$ 741415 782097 825166 869498 914270 958763 1001687 1041211 1075621 1103633 1124227 1136637
62579A136637L936m409j2436j9862k6178l1122l5011l8221m0588m1597m1108l9658
$$ 1136637 1140573 1136164 1123728 1103866 1077688 1046566 1011555 973334 932746 891149 850041 810383
62567H10383l8104l7002l6201l4959l2598k9131k5232k1635j8735j6647j5293
$$ 810383 772279 735277 699076 664117 631519 602388 577156 555521 536786 520139 504846
62556E04846j4301j3079j1249q988o963n834n736o107o159n545m475l265k087
$$ 504846 490545 477466 466217 457229 450266 444432 438696 432589 426430 420885 416410 413145 411058
62543D11058j228j003j142q58R6R54J127J231K054L031K918J796J136J710K699
$$ 411058 409830 408827 407685 406827 406923 407877 409004 410235 412289 415320 418238 420034 421170 422880 425579
62528D25579L192L435L995M704N261O046P478R161J0570J2055J4278J7013J9463
$$ 425579 428771 432206 436201 440905 446166 452212 459690 468851 479421 491476 505754 522767 542230
62515E42230K1569K3978K6786K9347L1470L3824L6727L9316M0507M0319L9605
$$ 542230 563799 587777 614563 643910 675380 709204 745931 785247 825754 866073 905678
62504I05678L8800L7442L4790L0493K4671J7848J0859M558o24m822q434j1720
$$ 905678 944478 981920 1016710 1047203 1071874 1089722 1100581 1105139 1104515 1099693 1091259 1079539
62492A079539j4559j6441j6709j4979j1391o406m88N879J2015J7392K2230K7387
$$ 1079539 1064980 1048539 1031830 1016851 1005460 999054 998566 1004445 1016460 1033852 1056082 1083469
62480A083469L3333L9470M4804M9042N2629N5840N8096N8143N4474M6066L3545
$$ 1083469 1116802 1156272 1201076 1250118 1302747 1358587 1416683 1474826 1529300 1575366 1608911
62469A608911J9688P800j072q969j8698l1102m4768n7545o7628p3798p5903p5259
$$ 1608911 1628599 1636399 1635327 1626358 1607660 1576558 1531790 1474245 1406617 1332819 1256916 1181657
62457A181657p3797p2478p0824o7906o3314n7276n0468m3800l7896l2676k7777
$$ 1181657 1107860 1035382 964558 896652 833338 776062 725594 681794 643898 611222 583445
62446E83445k3315j9741j7019j4598j2185r995q161o573n440n242n782n961m982
$$ 583445 560130 540389 523370 508772 496587 486592 478431 471858 466418 461176 455394 449433 444451
62433D44451l322k027j420j048o59n91j159k009k363j873j191j422k827m270m414
$$ 444451 441129 439102 437682 436634 435975 435384 434225 432216 429853 427980 426789 425367 422540 418270 413856
62418D13856l251j963j402j421j707k331l148l458k928k240k201k624k736k388
$$ 413856 410605 408642 407240 405819 404112 401781 398633 395175 392247 390007 387806 385182 382446 380058
62404C80058k127k280k582k692k579k334j960j448q01j2Q47J645K352L030L514
$$ 380058 377931 375651 373069 370377 367798 365464 363504 362056 361255 361243 362090 363735 366087 369117 372631
62389C72631L476K985K643K820L170L227L126L296L716M024M146M345M817N662
$$ 372631 376107 379092 381735 384555 387725 390952 394078 397374 401090 405114 409260 413605 418422 424084
62375D24084O988Q626R878J0178R888R959J0797J2046J3346J4750J6268J7655
$$ 424084 431072 439698 449576 459754 469642 479601 490398 502444 515790 530540 546808 564463
62363E64463J8914K0576K3112K6431L0117L4013L8316M3226M8659N4170N9089
$$ 564463 583377 603953 627065 653496 683613 717626 755942 799168 847827 901997 961086
62352I61086O2860O5368O6844O7351O6324O2627N5280M4443L1788J9507Q774o52
$$ 961086 1023946 1089314 1156158 1223509 1289833 1352460 1407740 1452183 1483971 1503478 1512252 1511600
62340A511600r300j7033k3628k9664l5997m2525m8182n2196n4648n5716n5125
$$ 1511600 1502300 1485267 1461639 1431975 1395978 1353453 1305271 1253075 1198427 1142711 1087586
62329A087586n2663m8834m4628m0839l7733l4980l1866k8039k4238k1838k1343
$$ 1087586 1034923 986089 941461 900622 862889 827909 796043 768004 743766 721928 700585
62318G00585k1657k1305k0001j8624j7782j7028j5622j3673j2119j1636j1768
$$ 700585 678928 657623 637622 618998 601216 584188 568566 554893 542774 531138 519370
62307E19370j1371r891p928o437n550m597l189j812j207j434j854j812j208m55
$$ 519370 507999 498108 490180 483743 478193 473596 470407 468595 467388 465954 464100 462288 461080 460625
62293D60625o0j73m75n45k89J39P13J534K434K910K729K274K138K464K975L435
$$ 460625 460565 460392 459917 459372 459083 459222 459935 461469 463903 466813 469542 471816 473954 476418 479393 482828
62277D82828L831M188M465M685N000N498O050O416O542O787P728R592J1925J4013
$$ 482828 486659 490847 495312 499997 504997 510495 516545 522961 529503 536290 544018 553610 565535 579548
62263E79548J5712J7619K0279K3579K7104L0895L5361M0536M5874N0976N6092
$$ 579548 595260 612879 633158 656737 683841 714736 750097 790633 836507 887483 943575
62252I43575O1565O6974P1195P3237P2691O9383O3107N3984M2864L0973J9252
$$ 943575 1005140 1072114 1143309 1216546 1289237 1358620 1421727 1475711 1518575 1549548 1568800
62241A568800Q244j644j0205j7805k5171l2621l9806m6256n1835n6361n9273o0089
$$ 1568800 1577044 1575400 1565195 1547390 1522219 1489598 1449792 1403536 1351701 1295340 1236067 1175978
62229A175978n8961n6440n2970m9018m5408m2772m0714l8160l4723l1130k8156
$$ 1175978 1117017 1060577 1007607 958589 913181 870409 829695 791535 756812 725682 697526
62218F97526k5697k3303k1043j9263j7794j6084j4048j2282j1237j0636r857q569
$$ 697526 671829 648526 627483 608220 590426 574342 560294 548012 536775 526139 516282 507713
62206E07713o867n085l698l110l186l151k367j100j88J38O17J946L775N164N807
$$ 507713 500846 495761 492063 488953 485767 482616 480249 479149 478961 479099 479716 481662 485437 490601 496408
62191D96408O262O967P612P767P653P900Q707R710J0509J1047J1447J1821J2245
$$ 496408 502670 509637 517249 525016 532669 540569 549276 558986 569495 580542 591989 603810 616055
62178F16055J2598J2410J1252R401P825P219P312P412P560Q687J1536J5685K0004
$$ 616055 628653 641063 652315 661716 669541 676760 684072 691484 699044 707731 719267 734952 754956
62165G54956K3954K8082L3100L8761M4025M8106N0926N2456N2133M9257M3701
$$ 754956 778910 806992 840092 878853 922878 970984 1021910 1074366 1126499 1175756 1219457
62154A219457L5943K6678J6771P330p50p429j3359j9018k4367k9332l4180l9030
$$ 1219457 1255400 1282078 1298849 1306179 1305429 1298000 1284641 1265623 1241256 1211924 1177744 1138714
62142A138714m3324m6126m6942m5978m3739m0664l7186l3678l0136k6144k1527
$$ 1138714 1095390 1049264 1002322 956344 912605 871941 834755 801077 770941 744797 723270
62131G23270j6986j3581j1485r648p053l973j369O18K757N287P321Q211Q737J0111
$$ 723270 706284 692703 681218 671570 664517 660544 659175 659793 662550 667837 675158 683369 692106 702217
62117G02217J2300J4220J5341J6046J6378J5456J2642Q620M778J870k04j607k175
$$ 702217 714517 728737 744078 760124 776502 791958 804600 813220 817998 819868 819664 818057 815882
62104H15882j774p40P5l17k352n368p915q862q128o325m001j482Q20K502L553
$$ 815882 814108 813368 813443 813126 810774 805406 797491 788629 780501 774176 770175 768693 769513 772015 775568
62089G75568M373N313O358P295P996Q488Q838R053R107R094R306J0059J1405J3082
$$ 775568 779941 785254 791612 798907 806903 815391 824229 833282 842389 851483 860789 870848 882253 895335
62075H95335J4825J6577J8391K0205K1790K2847K3162K2798K2112K1521K1284
$$ 895335 910160 926737 945128 965333 987123 1009970 1033132 1055930 1078042 1099563 1120847
62064A120847K1613K2853K5192K8182L0960L2988L4303L4867L4074L1182K6059
$$ 1120847 1142460 1165313 1190505 1218687 1249647 1282635 1316938 1351805 1385879 1417061 1443120
62053A443120J9253J1598L956k957q874j4046j8830k3373k7873l2741l8041m3042
$$ 1443120 1462373 1473971 1477927 1474970 1466096 1452050 1433220 1409847 1381974 1349233 1311192 1268150
62041A268150m6821m9258n0875n1823n1541m9622m6474m2876l9235l5531l1770
$$ 1268150 1221329 1172071 1121196 1069373 1017832 968210 921736 878860 839625 804094 772324
62030G72324k8164k4986k2347k0076j7792j5262j2738j0675r134p753o397n439
$$ 772324 744160 719174 696827 676751 658959 643697 630959 620284 611150 603397 597000 591561
62018E91561n215n539o070o757p581q084p747o737n751n109m370l081j430M6J120
$$ 591561 586346 580807 574737 567980 560399 552315 544568 537831 532080 526971 522601 519520 518090 518136 519256
62003E19256J969K745L393L884M322M773N122N154M756M006L109K253J496P50
$$ 519256 521225 523970 527363 531247 535569 540342 545464 550618 555374 559380 562489 564742 566238 566988
61989E66988j85j512l302n351p217q505r174r537r989j0685j1392j1600j0945
$$ 566988 566803 565291 561989 556638 549421 540916 531742 522205 512216 501531 490139 478539 467594
61976D67594r646q394p622p000n898m274k752j864j536j447j490j665j826j764
$$ 467594 457948 449554 441932 434932 429034 424760 422008 420144 418608 417161 415671 414006 412180 410416
61962D10416j392o82L16J308J851J840J586J256O90nk13L96J247J638J793K446
$$ 410416 409024 408342 408658 409966 411817 413657 415243 416499 417189 417184 416971 417367 418614 420252 422045 424491
61946D24491L708N106O577Q490J0711J2572J3894J5233J6891J8512J9959K1586
$$ 424491 428199 433305 439882 448372 459083 471655 485549 500782 517673 536185 556144 577730
61934E77730K3210K3730K2580K0857K0102K0432K0666J9907J8166J5678J2567
$$ 577730 600940 624670 647250 668107 688209 708641 729307 749214 767380 783058 795625
61923G95625R160N893K860p4k801n179p460r849j1698j1925j0310p698m924k129
$$ 795625 804785 810678 813538 813464 810663 805484 798024 788175 776477 764552 754242 746544 741620 739491
61909G39491P08L424O108R209J2807J6223J8729K0191K0685J9920J7552J3791
$$ 739491 740199 743623 749731 758940 771747 787970 806699 826890 847575 867495 885047 898838
61897H98838R334M755L40l713p285j0491j3555j6433j8692j9850j9819j9011j7952
$$ 898838 908172 912927 913267 909554 902269 891778 878223 861790 843098 823248 803429 784418 766466
61884G66466j6760j5191j3276j1647j0926j1015j1406j1919j2661j3334j3291
$$ 766466 749706 734515 721239 709592 698666 687651 676245 664326 651665 638331 625040
61873F25040j2482j1705j1641j1957j1707j0339q060n464l083j210J14R22J281
$$ 625040 612558 600853 589212 577255 565548 555209 547149 541685 538602 537392 537506 538428 539709
61860E39709J550K481M620P608J0452J2567J4216J5997J8349K1491K5304K9114
$$ 539709 541259 543740 548360 555968 566420 578987 593203 609200 627549 649040 674344 703458
61848G03458L2157L4356L6183L7683L8325L7937L6960L5419L2433K7431K1180
$$ 703458 735615 769971 806154 843837 882162 920099 957059 992478 1024911 1052342 1073522
61837A073522J4914Q938K877l128q325j2333j5350j7342j7780j6340j3396r612
$$ 1073522 1088436 1097374 1100251 1097123 1088798 1076465 1061115 1043773 1025993 1009653 996257 986645
61825I86645n360o91M387R591J4273J7662J9340J9246J7176J2735O157j302q390
$$ 986645 981285 980594 984981 994572 1008845 1026507 1045847 1065093 1082269 1095004 1101161 1099859 1091469
61812A091469j4948k1414k7541l2452l5800l8010l9232l9005l7246l4849l2705
$$ 1091469 1076521 1055107 1027566 995114 959314 921304 882072 843067 805821 770972 738267
61801G38267l0709k8223k5285k2671k0883j9515j7801j5535j3280j1751j1005
$$ 738267 707558 679335 654050 631379 610496 590981 573180 557645 544365 532614 521609
61790E21609j0342r102p433o069n374n019m643m390m414m258l228j465o4M8q87
$$ 521609 511267 502165 494732 488663 483289 478270 473627 469237 464823 460565 457337 455872 455808 455856 454969
61775D54969j825k101j798j175k30Q98J641J561J009O90O66L38n14j228j060p
$$ 454969 453144 451043 449245 448070 447840 448738 450379 451940 452949 453639 454305 454643 454129 452901 451841 451834
61759D51834J383K632L368L199K123R54P06J468K222J914N59q26j289r36p51j339
$$ 451834 453217 455849 459217 462416 464539 465493 466199 467667 469889 471803 472362 471536 470247 469311 468560 467221
61743D67221k070j903r72o28j651l137l718l206k348j475m40M30M54j68l32M02
$$ 467221 465151 463248 462276 461648 459997 456860 453142 449936 447588 446113 445673 446103 446557 446389 446057 446459
61727D46459J127J045P62J354K640L360K937K136J836J930J839J599J796K537
$$ 446459 447586 448631 449393 450747 453387 456747 459684 461820 463656 465586 467425 469024 470820 473357
61713D73357L171L134K589J937J128j8j125j536j339j478k559m079n075n158m571
$$ 473357 476528 479662 482251 484188 485316 485298 484173 482637 481298 479820 477261 473182 468107 462949 458378
61698D58378l756l177l157l425l210k241j231r19j080j104j086j473k030k093
$$ 458378 454622 451445 448288 444863 441653 439412 438181 437262 436182 435078 433992 432519 430489 428396
61684D28396j712j570j816j908j686j613j811j796j433j219j269r74j67L38qn38
$$ 428396 426684 425114 423298 421390 419704 418091 416280 414484 413051 411832 410563 409589 409422 409760 409752 409214
61668D09214m31N6K41K01L48L66l03j240j444q50m07n66p43m60n4J95P60J994
$$ 409214 408783 408839 409080 409281 409629 409995 409692 408452 407008 406158 405751 405185 404442 403982 403928 404123 404883 406877
61650D06877L160L135J871N17J13O36J363J790J980K190K487K720K761K616K348
$$ 406877 410037 413172 415043 415560 415673 416309 417672 419462 421442 423632 426119 428839 431600 434216 436564
61635D36564K005J649J263O13n46j982k967l066k778l017l932m660m397l377k541
$$ 436564 438569 440218 441481 442094 441548 439566 436599 433533 430755 427738 423806 419146 414749 411372 408831
61620D08831k432k719k796k518k167j869j346m21M79O32k05j586k936m004m722
$$ 408831 406399 403680 400884 398366 396199 394330 392984 392563 393042 393674 393469 391883 388947 384943 380221
61605C80221n037n114n347n790n875n148m103l691m039m278l793l065k937l510
$$ 380221 375184 370070 364723 358933 353058 347910 343807 340116 336077 331799 328006 324941 322004 318494
61591C18494m204m628m800m614l769k357j121p18r87j237j122r21r61j161j226
$$ 318494 314290 309662 304862 300248 296479 294122 293001 292283 291296 290059 288937 288016 287055 285894 284668
61576B84668j076q44o61o28r12j523k054j878q81K28N65pp60r69p00n57p98r90
$$ 284668 283592 282748 282087 281459 280547 279024 276970 275092 274211 274439 275004 274997 274237 273268 272568 272011 271213 270223
61558B70223o68j1M42N71P22J037J159R18P76J228K030K479K249J566P25k9k85
$$ 270223 269555 269544 269986 270557 271279 272316 273475 274393 275169 276397 278427 280906 283155 284721 285446 285417 285132
61541B85132J76Q32Q53K93J49R46J936K173J880K001K801L584L692L084J988O59
$$ 285132 285308 286140 286993 287286 287435 288381 290317 292490 294370 296371 299172 302756 306448 309532 311520 312179
61525C12179l94o27k67l48j493k988l555k878j854j309j022l32O51J013K59r27
$$ 312179 311785 311158 310891 310543 309050 306062 302507 299629 297775 296466 295444 295112 295763 296776 297035 296108
61509B96108j470j188q36r62j266j240r17o26l85j2L72M37J54j80m07n39l59M16
$$ 296108 294638 293450 292614 291652 290386 289146 288229 287603 287218 287206 287578 288015 288169 287989 287582 287043 286684 287100
61491B87100J499K055J664Q23K52J10K11M98Q21O79j06p18j67J266K174J810R40
$$ 287100 288599 290654 292318 293141 293393 293503 293714 294212 295033 295712 295606 294888 294721 295987 298161 299971 300911
61474C00911O68J120J767K326K603K063M75j245j806j168m87l62j42O89J437J181
$$ 300911 301579 302699 304466 306792 309395 311458 311933 310688 308882 307714 307227 306865 306723 307412 308849 310030
61458C10030J49o98j000j070r45k35R82J929K045J646J429J633J893J680Q38j82
$$ 310030 310179 309481 308481 307411 306466 306231 307213 309142 311187 312833 314262 315895 317788 319468 320306 320124
61442C20124o72m15J01M73J047K316L896M782M573L781K937K110J477J545K340
$$ 320124 319452 319037 319138 319611 320658 322974 326870 331652 336225 340006 342943 345053 346530 348075 350415
61427C50415L042K926K211J513R54M34L02R74K091K743K581K086J738J551J530
$$ 350415 353457 356383 358594 360107 361061 361495 361797 362771 364862 367605 370186 372272 374010 375561 377091
61412C77091J905K539K652J634r2j526k314l000m003m829m708l729k789k474k493
$$ 377091 378996 381535 384187 385821 385729 384203 381889 378889 374886 370057 365349 361620 358831 356357 353864
61397C53864k410k389k764l260l254k691k075j622j045l03P5j51l61J82J271J936
$$ 353864 351454 349065 346301 343041 339787 337096 335021 333399 332354 332051 332126 331975 331614 331796 333067 335003
61381C35003J542M25m87m83L90J392J832J774J815K166K417K327K301K631K873
$$ 335003 336545 336970 336483 336000 336390 337782 339614 341388 343203 345369 347786 350113 352414 355045 357918
61366C57918K491J769J420J547J644J538J615K047K411K313J954J852K331L408
$$ 357918 360409 362178 363598 365145 366789 368327 369942 371989 374400 376713 378667 380519 382850 386258
61352C86258M895O406P521Q172Q702R430J0262J0826J0818J0119Q756O940N116
$$ 386258 391153 397559 405080 413252 421954 431384 441646 452472 463290 473409 482165 489105 494221
61339D94221L869L596M172N000N467N394M928M174L213K345J894J587O65j164
$$ 494221 498090 501686 505858 510858 516325 521719 526647 530821 534034 536379 538273 539860 540525 539361
61325E39361l243m767n680o371o884o938o533o000n509m882l945k711j386l60
$$ 539361 536118 531351 525671 519300 512416 505478 498945 492945 487436 482554 478609 475898 474512 474152
61311D74152Pj26j36K55O13O83J082K474M430N969O925P804Q405P730N466K516
$$ 474152 474159 474033 473897 474152 474765 475448 476530 479004 483434 489403 496328 504132 512537 520267 525733 528249
61295E28249l27l246o347q665r091p883o419n674n576n669n666n334m423l018
$$ 528249 527922 524676 518329 509664 500573 492690 486271 480597 475021 469352 463686 458352 453929 450911
61281D50911j667r28q34q84n29L48J441K490L591M896O206P177P780Q209Q403
$$ 450911 449244 448316 447482 446598 446069 446417 447858 450348 453939 458835 465041 472218 479998 488207 496610
61266D96610Q170P739P592P673P357O509N962O600Q370J0562J2567J3943J4195
$$ 496610 504780 512519 520111 527784 535141 541650 547612 554212 562582 573144 585711 599654 613849
61253F13849J3182J1502R834Q089N812L263J407P19N47kj111k427l767n218o689
$$ 613849 627031 638533 648367 656456 662268 665531 666938 667657 668204 668202 667091 664664 660897 655679 648990
61238F48990p837q425q515q261p735p043o413o036n892n841n790n621n063l891
$$ 648990 641153 632728 624213 615952 608217 601174 594761 588725 582833 576992 571202 565581 560518 556627
61224E56627k279p23L88R42Q85J69r23j777j976j646j154p96q66j495k128j732
$$ 556627 554348 553625 554013 554955 555840 556009 555086 553309 551333 549687 548533 547737 546871 545376 543248 541516
61208E41516j38J319J178l81j888k408k217j812j218m02M67J481L082N405Q067
$$ 541516 541378 542697 543875 543494 541606 539198 536981 535169 533951 533549 534016 535497 538579 543984 552051
61193E52051J0723J3268J5475J7085J8338J9542K0049J8613J5180J1357Q603O861
$$ 552051 562774 576042 591517 608602 626940 646482 666531 685144 700324 711681 720284 727145
61181G27145N528M787N025N694N816N315M862M684M306L344J878J44j516k582
$$ 727145 732673 737460 742485 748179 753995 759310 764172 768856 773162 776506 778384 778528 777012 774430
61167G74430k865k880l296m169n198o366p756r064r978j0770j1827j2843j3123
$$ 774430 771565 768685 765389 761220 756022 749656 741900 732836 722858 712088 700261 687418 674295
61154F74295j2561j1625j0573r338q010o729n230l106n24J906L736M590L769Q57
$$ 674295 661734 650109 639536 630198 622188 615459 610229 607123 606599 608505 612241 616831 620600 621457
61140F21457l371p374j0236j1966j2653j2192j0855r278p778o332n168m566m052
$$ 621457 618086 610712 600476 588510 575857 563665 552810 543532 535754 529422 524254 519688 515636
61127E15636k772p23J221K688M251O257Q193R615J0884J2447J4089J5390J6380
$$ 515636 512864 512141 513362 516050 520301 526558 534751 544366 555250 567697 581786 597176 613556
61114F13556J7279J8071J8769J9599K0636K1676K2659K3649K4255K3816K2479
$$ 613556 630835 648906 667675 687274 707910 729586 752245 775894 800149 823965 846444
61103H46444K1298K0827K0319J8806J6334J3462J0264O529K502j339m987q701
$$ 846444 867742 888569 908888 927694 944028 957490 967754 974283 976785 975446 970459 961758
61091I61758j2349j5482j7913j9751k0983k1492k1317k0650j9673j8683j8101
$$ 961758 949409 933927 916014 896263 875280 853788 832471 811821 792148 773465 755364
61080G55364j8094j8326j8253j7526j6157j4616j3645j3428j3008j1356q950p352
$$ 755364 737270 718944 700691 683165 667008 652392 638747 625319 612311 600955 592005 584653
61068E84653o985o487m811k838j912j772j098M31J878K640L141L871M610M944
$$ 584653 577668 571181 566370 563532 561620 559848 558750 559181 561059 563699 566840 570711 575321 580265
61054E80265M996N359O510Q336J0149J1296J1796J2139J2574J3114J4101J5973
$$ 580265 585261 590620 597130 605466 615615 626911 638707 650846 663420 676534 690635 706608
61042G06608J8334K0234K1532K3004K4841K6270K7120K8407L0571L2475L3195
$$ 706608 724942 745176 766708 789712 814553 840823 867943 896350 926921 959396 992591
61031I92591L3503L4459L5775L6958L8779M1949M5255M6875M6758M6059M5061
$$ 992591 1026094 1060553 1096328 1133286 1172065 1214014 1259269 1306144 1352902 1398961 1444022
61020A444022M3645M3044M4949M9299N4978O2201P1946Q3433R4753J05946J19163
$$ 1444022 1487667 1530711 1575660 1624959 1679937 1742138 1814084 1897517 1992270 2098216 2217379
61009B217379J36020J57316J85123K22047K68247L22255L84855M58869N45627
$$ 2217379 2353399 2510715 2695838 2917885 3186132 3508387 3893242 4352111 4897738
61000D897738O46401P67319R16633J096394J304629J544358J808545K035606K093708
$$ 4897738 5544139 6311458 7228091 8324485 9629114 11173472 12982017 15017623 17111331
60991A7111331J852938J305715O11980M697l58239m54002l38162p7150K42103
$$ 17111331 18964269 20269984 20881964 20886661 20528422 20074420 19736258 19659108 19901211
60982A9901211M72360M42054P2254n43371j190817j674694j915774j943073j828088
$$ 19901211 20373571 20815625 20887879 20344508 19153691 17478997 15563223 13620150 11792062
60973A1792062j636439j416476j200498j004336q31466o82189n57562m56029l72299
$$ 11792062 10155623 8739147 7538649 6534313 5702847 5020658 4463096 4007067 3634768
60964C634768l01971k44247j98903j63504j35181j12726r5419q1627o9890n9913
$$ 3634768 3332797 3088550 2889647 2726143 2590962 2478236 2382817 2301190 2231300 2171387
60954B171387n1359m3217l5253k8597k3866k0117j6766j5148j6794k1224k6554
$$ 2171387 2120028 2076811 2041558 2012961 1989095 1968978 1952212 1937064 1920270 1899046 1872492
60943A872492l1565l6035l9788m2574m4530m5940m6882m7668m8933n0748n2174
$$ 1872492 1840927 1804892 1765104 1722530 1678000 1632060 1585178 1537510 1488577 1437829 1385655
60932A385655n2377n1622n0592m9359m7593m5254m2546l9723l7298l5744l4558
$$ 1385655 1333278 1281656 1231064 1181705 1134112 1088858 1046312 1006589 969291 933547 898989
60921H98989l2446k8949k5186k2373k0461j8802j7295j6037j4683j3019j1529
$$ 898989 866543 837594 812408 790035 769574 750772 733477 717440 702757 689738 678209
60910F78209j0476r154p011m799l528k834j695k46N07O09J221K661L699L374K356
$$ 678209 667733 658579 651568 646769 643241 640407 638712 638466 638973 639582 640803 643464 647163 650537 652893
60895F52893J848J943J813J052M1q68j849l179m668n824o503p110p951q665q687
$$ 652893 654741 656684 658497 659549 659590 658722 656873 653694 649026 643202 636699 629589 621638 612973 604286
60880F04286q206q089q709r433r528r036q439p929p523p375p474p392o876o333
$$ 604286 596080 587991 579282 569849 560321 551285 542846 534917 527394 520019 512545 505153 498277 491944
60866D91944o179o068n441m507l978l939l642k543r29M23Q76K91q07j461j162
$$ 491944 485765 479697 474256 469749 465771 461832 458190 455647 454718 455141 456017 456308 455501 454040 452878
60851D52878m35k10o45j061q65j59N24O84J50p39j301j264j169j651k576l318
$$ 452878 452443 452233 451588 450527 449662 449503 450027 450711 450861 450122 448821 447557 446388 444737 442161 438843
60835D38843l695m010m201l748k525j257p03q07q44l15N67J206J373J518K145
$$ 438843 435148 431138 426937 423189 420664 419407 418704 417897 417053 416738 417305 418511 419884 421402 423547
60820D23547K948K993J986Q36N36Q65P77j38j231j760j677j389j229j300j510
$$ 423547 426495 429488 431474 432310 432846 433711 434488 434350 433119 431359 429682 428293 427064 425764 424254
60805D24254j636j520j274j115j109j242j553k013k405k557k521k369k122k049
$$ 424254 422618 421098 419824 418709 417600 416358 414805 412792 410387 407830 405309 402940 400818 398769
60791C98769k600l692m532m581m300m386m678m487l707k941k578k413k194j971
$$ 398769 396169 392477 387945 383364 379064 374678 370000 365513 361806 358865 356287 353874 351680 349709
60777C49709j840j717j430q54m9N71N35L4j10M40J036J128J195J881K777L018
$$ 349709 347869 346152 344722 343868 343819 344390 344925 344959 344849 345289 346325 347453 348648 350529 353306 356324
60761C56324K750K895L660M276M269M071M202M531M521L730K131M10l75%M44m
$$ 356324 359074 361969 365629 369905 374174 378245 382447 386978 391499 395229 397360 397770 397395 397395 397839 397835
60745C97835p36n38M72J089Q60L78k13j511l498n174n946o255o517o550o356o329
$$ 397835 397099 396561 397033 398122 398982 399360 399147 397636 394138 388964 383018 376763 370246 363696 357340 351011
60729C51011o344n741m569l717l413k823j661q31q68j018p33p75j766k797k747
$$ 351011 344667 338926 334357 330640 327227 324404 322743 321912 321044 320026 319293 318518 316752 313955 311208
60714C11208k044j790j899j459m78Q2j47n62o13l33P9M42N09L22L98R36J284R15
$$ 311208 309164 307374 305475 304016 303538 303620 303473 302911 302298 301965 302044 302486 302995 303317 303715 304651 305935 306850
60696C06850N11J087K344K892K079P58J67O88J738K428K308J811J827K584L435
$$ 306850 307361 308448 310792 313684 315763 316521 316688 317376 319114 321542 323850 325661 327488 330072 333507
60681C33507M006M790N957O451N368L577K726K977L044K352J696J560J185n8j401
$$ 333507 337513 342303 348260 354711 360079 363656 366382 369359 372403 374755 376451 378011 379196 379138 377737
60666C77737j678r63n27j273k796l891l867l250l154l852m378l851k714k062k032
$$ 377737 376059 375096 374569 373296 370500 366609 362742 359492 356338 352486 348108 344257 341543 339481 337449
60651C37449j753p71L28Q52Q88Q95J029J149J102Q09L41j00n40j411k938m465
$$ 337449 335696 334925 335253 336105 336993 337888 338917 340066 341168 341977 342318 342218 341678 340267 337329 332864
60635C32864n021m462l433k372j276n03p89k076l126k877j691o78k75k2M92J109
$$ 332864 327843 323381 319948 317576 316300 315797 315008 312932 309806 306929 305238 304560 304285 304263 304755 305864
60619C05864J464J443J139O79J94j19p4K96O57O62L90L03N62P32L89k33n67m71
$$ 305864 307328 308771 309910 310589 310783 310664 310590 310886 311543 312205 312595 312898 313460 314192 314581 314348 313781 313310
60601C13310k29L4M39R40J301J495J616J506R49K50J00O93J499J991K182K262
$$ 313310 313081 313115 313554 314494 315795 317290 318906 320412 321361 321611 321711 322404 323903 325894 328076 330338
60585C30338K186J845J319O96Jn87p05k40M13P75P97Q93J490K618L804M474M616
$$ 330338 332524 334369 335688 336384 336385 335798 335093 334853 335266 336041 336838 337731 339221 341839 345643 350117 354733
60568C54733M930O047P745R261J0229J0874J1402J1606J1146R788P415M213R10
$$ 354733 359663 365710 373455 382716 392945 403819 415221 426827 437973 447761 455176 459389 460299
60555D60299j604l059l932m762n524n713m833k926p57P27J457K385M136O020P032
$$ 460299 458695 455636 451704 446942 441418 435705 430872 427946 427189 427916 429373 431758 435894 441914 448946
60540D48946P453Q404J0059J1493J2360J3461J5095J6104J5288J2961J0169P138
$$ 448946 456399 464803 474862 486355 498715 512176 527271 543375 558663 571624 581793 588931
60528E88931L481m87l784n997p479q328q090o759n330m812n124n400n105m414
$$ 588931 592412 591925 588141 582144 574665 566337 558247 551488 546158 541346 536222 530822 525717 521303
60514E21303l612k604j198L65J503J902J907K150K928M001N001N960P396R888
$$ 521303 517691 515087 513889 514254 515757 517659 519566 521716 524644 528645 533646 539606 547002 556890
60500E56890J3499J7623K1565K5162K8729L2433L6124L9684M3003M5476M6211
$$ 556890 570389 588012 609577 634739 663468 695901 732025 771709 814712 860188 906399
60489I06399M5106M3020M0184L5133K6113J3392o92j3807k4949l3987m1031m6468
$$ 906399 951505 994525 1034709 1069842 1095955 1109347 1108655 1094848 1069899 1035912 994881 948413
60477I48413n0560n2710n1900m8255m3383l8802l4752l0899k7311k4088k0863
$$ 948413 897853 845143 793243 744988 701605 662803 628051 597152 569841 545753 524890
60466E24890j7491j4760j3463j3116j2423j0912r296q236p510o644n725n121m802
$$ 524890 507399 492639 479176 466060 453637 442725 433429 425193 417683 411039 405314 400193 395391
60453C95391m325l462k561k156k405k965l379l399k966k179j401j102j290j396
$$ 395391 391066 387604 385043 382887 380482 377517 374138 370739 367773 365594 364193 363091 361801 360405
60439C60405j020m92l04l09j05J09j79q29j177j143j259j482j022K61J250R70
$$ 360405 359385 358893 358589 358280 358175 358284 358105 357276 356099 354956 353697 352215 351193 351454 352704 353674
60423C53674r5q27r44r49j009p64p9O49R68Q09N13N93J237J906J807R63K87L42
$$ 353674 353579 352752 351808 350859 349850 349086 349007 349656 350624 351433 351946 352539 353776 355682 357489 358452 358739 359081
60405C59081O24N29L15N38J069J410J578J875K117J896J428J368J819K274K467
$$ 359081 359705 360234 360549 361087 362156 363566 365144 367019 369136 371032 372460 373828 375647 377921 380388
60390C80388K585K665K418J837J405J497K058K883L776M363M202L300K219J569
$$ 380388 382973 385638 388056 389893 391298 392795 394853 397736 401512 405875 410077 413377 415596 417165
60376D17165J598K189K887L049K440J666J595K286K972L112K951K911K924K737
$$ 417165 418763 420952 423839 426888 429328 430994 432589 434875 437847 440959 443910 446821 449745 452482
60362D52482K418K168J861J248N16K88R84K372L832M931N647O224P015Q387J0439
$$ 452482 454900 457068 458929 460177 460693 460981 461965 464337 468169 473100 478747 484971 491986 500373 510812
60347E10812J2566J3635J3001J1219R313P410M730R74k931n873p734r024r796
$$ 510812 523378 537013 550014 561233 570546 577956 582686 583660 580729 574856 567122 558098 548302
60334E48302r660q694p580o792o162n439m831m731n103n378m947l816k675k191
$$ 548302 538642 529948 522368 515576 509414 503975 499144 494413 489310 483932 478985 475169 472494 470303
60320D70303k221k028j285m43L9L15O87J099J592K752M939P396Q947R573J0494
$$ 470303 468082 466054 464769 464326 464365 464680 465367 466466 468058 470810 475749 483145 492092 501665 512159
60305E12159J2584J5373J7866J9789K1574K3361K4347K3187J9125J2876O106k01
$$ 512159 524743 540116 557982 577771 599345 622706 647053 670240 689365 702241 708347 708146
60293G08146o562j3642k0485k4937k5947k4575k2507k0315j7618j4337j1027q227
$$ 708146 701584 687942 667457 642520 616573 591998 569491 549176 531558 517221 506194 497967
60281D97967o066m449l266k422j947j937k261k471k317k087k167k449k583k645
$$ 497967 491901 487452 484186 481764 479817 477880 475619 473148 470831 468744 466577 464128 461545 458900
60267D58900l046l733m077l717l107k843k788k358j501q95j058j728k344k744
$$ 458900 455854 452121 448044 444327 441220 438377 435589 433231 431730 430835 429777 428049 425705 422961
60253D22961l027l026k365j058L38J158J086K91o06p85M7J244J876J847J846K146
$$ 422961 419934 416908 414543 413485 413823 414981 416067 416358 415752 414967 415014 416258 418134 419981 421827 423973
60237D23973K089J093l55j241j223p60k71K67R07J414J549J450J511J984K669
$$ 423973 426062 427155 426800 425559 424336 423576 423305 423572 424479 425893 427442 428892 430403 432387 435056
60222D35056L055K845K357K171K393K557K454K591L480M739N401N100M534M616
$$ 435056 438111 440956 443313 445484 447877 450434 452888 455479 458959 463698 469099 474199 478733 483349
60208D83349N449O302O521O268O233O638O890O392N499N103N412N681N320M688
$$ 483349 488798 495100 501621 507889 514122 520760 527650 534042 539541 544644 550056 555737 561057 565745
60194E65745M499M828N034M457K984J268L57P02J415J104m10j901k489k713l396
$$ 565745 570244 575072 580106 584563 587547 588815 589172 589874 591289 592393 591983 590082 587593 584880 581484
60179E81484m291m660m525m485m683m790m718m505l915k900k187k449l183l340
$$ 581484 577193 572533 568008 563523 558840 554050 549332 544827 540912 538012 535825 533376 530193 526853
60165E26853k886k683k919k769j827p81l17k06K5K68K36J25L17Q17J340J724J969
$$ 526853 523967 521284 518365 515596 513769 512988 512671 512465 512490 512758 512994 513119 513436 514253 515593 517317 519286
60148E19286K073K060J961J741J495J602K268L024L214K945K953L536M378N429
$$ 519286 521359 523419 525380 527121 528616 530218 532486 535510 538724 541669 544622 548158 552536 557965
60134E57965P085R171J0556J0370R082P845P218O901O285M902K747O11m19k54
$$ 557965 565050 574221 584777 595147 604229 612074 619292 626193 632478 637380 640127 640738 640319 640065
60120F40065j02q91j936j889o98L09K67k45k76J83M63K79o4l42p10j198j430j155
$$ 640065 639963 639072 637136 635247 634549 634858 635125 634880 634604 634787 635250 635529 635465 635123 634413 633215 631785 630630
60102F30630q27j197k332l402l613l055k391k030j914j870j701j120NJ337K470
$$ 630630 629803 628606 626274 622872 619259 616204 613813 611783 609869 607999 606298 605178 605183 606520 608990
60087F08990L490M697N796N983N021L648K661K087J578J180J168J404J294L89
$$ 608990 612480 617177 622973 628956 633977 637625 640286 642373 643951 645131 646299 647703 648997 649386
60073F49386j218l032m521n492o314p528r070j0115j0029r298r024r588j0216
$$ 649386 648168 645136 640615 635123 628809 621281 612211 602096 592067 582769 573745 564157 553941
60060E53941r972q819p528o794o699o832o680n955m816l723k902k079r65J36O62
$$ 553941 543969 535150 527622 520828 514129 507297 500617 494662 489846 486123 483221 481142 480177 480313 480975
60045D80975P81J359K684L868M059L687L800M519N085N227N440N810N681M840
$$ 480975 481756 483115 485799 489667 493726 497413 501213 505732 510817 516044 521484 527294 532975 537815
60031E37815M017L727L534L006K497K154J049j638n090p555q332q131p707p108
$$ 537815 541832 545559 549093 552099 554596 556750 557799 556161 551071 543516 535184 527053 519346 512238
60017E12238o265n426m890m812n263o044o582o562o318o185n845n008m241m230
$$ 512238 505973 500547 495657 490845 485582 479538 472956 466394 460076 453891 448046 443038 438797 434567
60003D34567m539m142l016k143j956j800j072K0R75J513J478J000Q24J656L096
$$ 434567 430028 425886 422870 420727 418771 416971 415899 415919 416894 418407 419885 420885 421709 423365 426461
59988D26461M030M094L897L831L629L297L372L877M023L374K495J922J333K42
$$ 426461 430491 434585 438482 442313 445942 449239 452611 456488 460511 463885 466380 468302 469635 469877
59974D69877j137k272k972l194k801j963j355j431j837j875j252k19O70R07N95
$$ 469877 468740 466468 463496 460302 457501 455538 454183 452752 450915 449040 447788 447569 448239 449146 449741
59959D49741O19J652L113L833L692L599L811L401J815j27j336j753j955k201k429
$$ 449741 450360 452012 455125 458958 462650 466249 470060 473461 475276 475149 473813 472060 470105 467904 465475
59944D65475k566k394j747j096j269k161k605j926q93o08j229k276l329l881l285
$$ 465475 462909 460515 458768 457672 456403 454242 451637 449711 448818 448210 446981 444705 441376 437495 434210
59929D34210j596J42J104J539K007K550L091L857M765N231N262N814P300Q678
$$ 434210 432614 432756 433860 435399 437406 439956 443047 446904 451669 456900 462162 467976 475276 483954
59915D83954Q930Q547Q424Q079O374L596J458J114K122L322L894L571K594J555
$$ 483954 492884 501431 509855 517934 524308 527904 529362 530476 532598 535920 539814 543385 545979 547534
59901E47534Q58M42K51M59Q60P05k25j098j207j019j231j509j123k54L94Q26J564
$$ 547534 548392 548834 549085 549544 550404 551109 550884 549786 548579 547560 546329 544820 543697 543443 543837 544663 546227
59884E46227K588L425L982M405M455L997L681M130M816M853M470M561M997M766
$$ 546227 548815 552240 556222 560627 565082 569079 572760 576890 581706 586559 591029 595590 600587 605353
59870F05353L668K580J923J100k86j729k628k968k922k604k371k562k825k448
$$ 605353 609021 611601 613524 614624 614338 612609 609981 607013 604091 601487 599116 596554 593729 591281
59856E91281j485p46n56m17l8K33L07P22J742K830L553M319N630P050P476O262
$$ 591281 589796 589050 588494 588077 588039 588272 588579 589301 591043 593873 597426 601745 607375 614425 621901 628163
59840F28163L773R52j407l055m080m382l678k178q17m68j150k416l981n497o307
$$ 628163 631936 632888 631481 628426 624346 619964 616286 614108 613291 612823 611673 609257 605276 599779 593472
59825E93472o141n669n533n336m468l431l171l414l004j855j117j249j351q26
$$ 593472 587331 581662 576129 570793 566325 562894 559723 556309 553305 551450 550333 549084 547733 546907
59811E46907m31r21j817k337k661l335m087m170l557k877k379j690o29L51O52
$$ 546907 546476 545555 543738 541401 538740 535405 531318 527148 523591 520714 518335 516645 516016 516367 517019
59796E17019J63p11j455j843j997k152k392k656k835k747k243j502r68q04p03
$$ 517019 517182 516471 515016 513173 511176 509024 506632 503976 501141 498394 496151 494649 493681 492877 492174
59781D92174m99n78j262k169k655k633k403k038j488j006q18o03J05J177K131
$$ 492174 491675 491097 489835 487666 485011 482378 479975 477937 476449 475443 474625 474022 474127 475304 477435
59766D77435K824L316L407L056K883L426M189M368M190M536N410N933N823N781
$$ 477435 480259 483575 486982 490038 492921 496347 500536 504904 509094 513630 519040 524973 530796 536577
59752E36577O293P055P684Q106Q135P670P391Q157R560J0049Q853O831N185M255
$$ 536577 542870 549925 557609 565715 573850 581520 588911 597068 606628 616677 625530 632361 637546 641801
59738F41801L852L770L523K477O94j069k448l734m870n194m566l762l307k833
$$ 641801 645653 649423 652946 655423 656117 655048 652600 648866 643996 638802 634236 630474 627167 624334
59724F24334k118j787k306l132l497l406l218k950k566k327k320k267k206k632
$$ 624334 622216 620429 618123 614991 611494 608088 604870 601920 599354 597027 594707 592440 590234 587602
59710E87602l413l434k061k06Q32R68J014J315J602J832K241K706K804K471K086
$$ 587602 584189 580755 578694 578488 579320 580288 581302 582617 584219 586051 588292 590998 593802 596273 598359
59695E98359K008K305K866L509M115M771N380N174L277L1k887m050l530k345j332
$$ 598359 600367 602672 605538 609047 613162 617933 623313 628487 631764 631795 628908 624858 621328 618983 617651
59680F17651q83j055j419j358r62j079k123l498m606n603o621p040o334n052m130
$$ 617651 616768 615713 614294 612936 611974 610895 608772 605274 600668 595065 588444 581404 575070 570018 565888
59665E65888l751l526l371l407l410l089k616k199j565n01M89P90N77M10L34J24
$$ 565888 562137 558611 555240 551833 548423 545334 542718 540519 538954 538453 538942 539732 540309 540719 541053 541177
59649E41177J42R88K453L606L913L574K842J696K62j036j935k578l229l994m786
$$ 541177 541319 542307 544760 548366 552279 555853 558695 560391 560653 559617 557682 555104 551875 547881 543095
59634E43095n283n097m240l182k220j180o2N61K59n19j138j750k837m015m285
$$ 543095 537812 532715 528475 525293 523073 521893 521831 522392 522651 522132 520994 519244 516407 512392 508107
59619E08107l439k462k278k826l534m132m549m544l917k935k073j415o14M87J514
$$ 508107 504668 502206 499928 497102 493568 489436 484887 480343 476426 473491 471418 470003 469389 469876 471390
59604D71390K025K116K239K494K537K275K128K264K153J353L71rJ40J64QK10P79
$$ 471390 473415 475531 477770 480264 482801 485076 487204 489468 491621 492974 493345 493336 493476 493640 493648 493858 494637
59587D94637J104J030J017J094O53l64j136j234j278j816k486k881l297l914m102
$$ 494637 495741 496771 497788 498882 499535 499171 498035 496801 495523 493707 491221 488340 485043 481129 477027
59572D77027l433k619k595l172l537l508l375l019k144j066l64M5N98J102R40
$$ 477027 473594 470975 468380 465208 461671 458163 454788 451769 449625 448559 448195 448240 448838 449940 450880
59557D50880K04k32J37Q70J283J224J014R56J109J350J638K152K972L766M221
$$ 450880 451084 450852 450989 451859 453142 454366 455380 456336 457445 458795 460433 462585 465557 469323 473544
59542D73544M710N902P629Q898R263R407J0157J1855J4817J8973K2291K1151J3989
$$ 473544 478254 484156 491785 500683 509946 519353 529510 541365 556182 575155 597446 618597 632586
59529F32586L887m008p329p605p060o137m328j856L76J851K767L615M605N308
$$ 632586 636473 632465 625136 617531 610471 604334 600006 598150 598526 600377 603144 606759 611364 616672
59515F16672M849K770l50l447n909p689q828r421r771j0115j0247r930r375q889
$$ 616672 621521 624291 623941 620494 614585 606896 598068 588647 578876 568761 558514 548584 539209 530320
59501E30320q327p371o125m934l840k735j808j353j294j349j372j208o05L50J077
$$ 530320 521993 514622 508497 503563 499723 496988 495180 493827 492533 491184 489812 488604 487999 488349 489426
59486D89426J297J514K204L039L392L229K898K522K217K376L115L881M262M693
$$ 489426 490723 492237 494441 497480 500872 504101 506999 509521 511738 514114 517229 521110 525372 530065
59472E30065N615O485O412N403M166L068K036J115L19o84j946k690k176q18L99
$$ 530065 535680 542165 548577 553980 558146 561214 563250 564365 564684 564000 562054 559364 557188 556370 556769
59457E56769J209K001K916L860N106O968R102J0918J2331J3419J3760J3031J1801
$$ 556769 557978 559979 562895 566755 571861 578829 587931 598849 611180 624599 638359 651390 663191
59444F63191J0809R840Q216N859K927r89n992j0652j3097j3195j2464j1904j1241
$$ 663191 674000 683840 692056 697915 700842 699853 693861 683209 670112 656917 644453 632549 621308
59431F21308j0151q981q029p206o529o077n425m005j948J90K299M449O249P480
$$ 621308 611157 602176 594147 586941 580412 574335 568910 564905 562957 563147 565446 569895 576144 583624
59417E83624Q924J1333J4085J6160J7908K0293K2966K5006K7052L0084L1997K8118
$$ 583624 592548 603881 617966 634126 652034 672327 695293 720299 747351 777435 809432 837550
59405H37550J6535J040j2400k0553k3510k2411j8462j3000o631J107R713J5890
$$ 837550 854085 855125 842725 822172 798662 776251 757789 744789 738158 739265 748978 764868
59393G64868J5398P046n878j8247k6535k9985k9598k6766k2729j8627j5267j2542
$$ 764868 780266 787312 781434 763187 736652 706667 677069 650303 627574 608947 593680 581138
59381E81138r671o498m009k961k598j716m15L45O01J311K628L688M199M685N051
$$ 581138 571467 564969 560960 557999 555401 553685 553270 553615 554216 555527 558155 561843 566042 570727 575778
59366E75778M471L114K392K926L751M148M789O166P342P342O680O412O593O783
$$ 575778 580249 583363 585755 588681 592432 596580 601369 607535 614877 622219 628899 635311 641904 648687
59352F48687P182Q222R596J0719J1538J2204J2550J2672J3303J4726J5959J5892
$$ 648687 655869 664091 673687 684406 695944 708148 720698 733370 746673 761399 777358 793250
59340G93250J4742J3569J2809J2091J1055R525P215M001L13l288o612r524j1650
$$ 793250 807992 821561 834370 846461 857516 867041 874256 878257 878570 875282 868670 859146 847496
59327H47496j2912j3909j5259j6797j7845j7837j6515j4066j1365r492q601p846
$$ 847496 834584 820675 805416 788619 770774 752937 736422 722356 710991 701499 692898 685052
59315F85052o713n638n049m563l669k427j086K61J265J409J052J377K813M380
$$ 685052 678339 672701 667652 663089 659420 656993 655907 656168 657433 658842 659894 661271 664084 668464
59301F68464N261N955P170Q616R813J1041J2301J2128Q786K281n642j3026j8334
$$ 668464 673725 679680 686850 695466 705279 716320 728621 740749 749535 751816 746174 733148 714814
59288G14814k0446j9457j7132j5367j4256j2645j0150p609n650m033k518j319
$$ 714814 694368 674911 657779 642412 628156 615511 605361 597752 592102 588069 585551 584232
59276E84232n24K50J382K958M963P244R348J0850J1813J2525J2984J3039J2742
$$ 584232 583708 583958 585340 588298 593261 600505 609853 620703 632516 645041 658025 671064 683806
59263F83806J2057J0575Q087N243K942J250n83l050n839q305j0023j0919j1187
$$ 683806 695863 706438 714525 719768 722710 723960 723377 720327 714488 706183 696160 685241 674054
59250F74054j1051j0490r367p861o418n082l462j558j14L19J51K20Q58J849K853
$$ 674054 663003 652513 643146 635285 628867 623785 620323 618765 618651 618970 619121 619341 620199 622048 624901
59235F24901L523L723L874M539N458N710N132M687M922M977L818J676n29k406
$$ 624901 628424 632147 636021 640560 646018 651728 656860 661547 666469 671446 675264 676940 676411 674005
59221F74005l911m722m843n181o439p884q304p770p309p097o235m372k419j366
$$ 674005 670094 665372 660529 655348 648909 641025 632721 624951 617642 610545 604310 599938 597519 596153
59207E96153j199j285j173p71j90K91L78K5n95j253j662j546r44k72M8r7o47j331
$$ 596153 594954 593669 592496 591725 591535 591826 592204 592229 591634 590381 588719 587173 586229 585957 586005 585908 585261 583930
59189E83930j539q12L38Q53N72M75J127J768J614J164J396K271K933K965K677
$$ 583930 582391 581579 581917 582770 583342 583817 584944 586712 588326 589490 590886 593157 596090 599055 601732
59174F01732K429K377K573K883L103L491M631O342P489P467P195P887R432J0722
$$ 601732 604161 606538 609111 611994 615097 618588 623219 629561 637050 644517 651712 659599 669031 679753
59160F79753J1039J0414R093P445N911M480K659M38j426k664m099o270q302r160
$$ 679753 690792 701206 710299 717744 723655 728135 730794 731232 729806 727142 723043 716773 708471 699311
59146F99311r201r401r741r531q800q175p795p410p177p338p478p116o625o573
$$ 699311 690110 680709 670968 661437 652637 644462 636667 629257 622080 614742 607264 600148 593523 586950
59132E86950o642o219n529n066m398k887j188n87r73q33O71K792M525N693O525
$$ 586950 580308 574089 568560 563494 559096 556209 555021 554434 553461 552628 553299 556091 560616 566309 572834
59117E72834P114P608Q289R209J0173J1008J1523J1533J1293J1396J1732J1310
$$ 572834 579948 587556 595845 605054 615227 626235 637758 649291 660584 671980 683712 695022
59105F95022R789Q337Q087Q547Q678Q582Q791Q661P186M895L255K469J469n8j280
$$ 695022 704811 713148 721235 729782 738460 747042 755833 764494 771680 776575 779830 782299 783768 783710 782430
59090G82430j846k334k937l132k825k482k110j384q46j608l692n978p866r615
$$ 782430 780584 778250 775313 772181 769356 766874 764764 763380 762534 760926 757234 751256 743390 733775
59076G33775j1001j1241j0565j0285j0868j1283j0749r803r040q130o776n502
$$ 733775 722774 711533 700968 690683 679815 668532 657783 647980 638940 630810 624034 618532
59064F18532m803m492m404m807n531n721n056m294m058l952l464k845k515k325
$$ 618532 613729 609237 604833 600026 594495 588774 583718 579424 575366 571414 567950 565105 562590 560265
59050E60265k027j844k004k391k895l527l874l287j925q08m38k37K81P45Q51J107
$$ 560265 558238 556394 554390 551999 549104 545577 541703 538416 536491 535683 535245 535008 535289 536034 536885 537992
59034E37992J976L060L812M456N425O420O811O618O541P132Q429J0214J2257J4444
$$ 537992 539968 543028 546840 551296 556721 563141 569952 576570 583111 590243 598672 608886 621143 635587
59020F35587J6721J8879K0428K1084K1156K1037K0425J8577J5239J0771N568J31
$$ 635587 652308 671187 691615 712699 733855 754892 775317 793894 809133 819904 825472 825603
59008H25603m512p389q739r669j0556j0631r332p202n078l102r41J585M303O671
$$ 825603 821091 813702 804963 795294 784738 774107 764775 757573 752495 749393 748452 750037 754340 761011
58994G61011P814P121N011K635P36p36k024l149m133n089o002o841p802r045j0362
$$ 761011 768825 775946 780957 783592 784328 783592 781568 778419 774286 769197 763195 756354 748552 739507 729145
58979G29145j1418j1942j1383r186n950l448k572k154r09N04Q50Q08K105M604
$$ 729145 717727 705785 694402 685216 679266 675818 673246 671092 670183 670687 671537 672345 674450 679054
58965F79054O447O967P386Q387R047Q740Q264Q304Q307P606O368M744K334q90
$$ 679054 685501 692468 699854 708241 717288 726028 734292 742596 750903 758509 764877 769621 771955 771065
58951G71065m244p410j0703j3832j5667j5781j5047j4212j3087j1623j0465r858
$$ 771065 766821 759411 748708 734876 719209 703428 688381 674169 661082 649459 638994 629136
58939F29136r122p857o597n677m638l262k118j511r11j6P27J113J544J955J534
$$ 629136 620014 612157 605560 599883 595245 591983 589865 588354 587443 587427 588154 589267 590811 592766 594300
58924E94300J17j337k154k676l153l220k988l289m181m486l528k070r51r4N06
$$ 594300 594417 593080 590926 588250 585097 581877 578889 575600 571419 566933 563405 561335 560384 560290 560796
58909E60796L40l34k31J083K504L427M825P216R244R725R617J0345J1437J1558
$$ 560796 561136 560802 560571 561654 564158 567585 572410 579626 588870 598595 608212 618557 629994 641552
58895F41552J0920J0787J1275J1344J0630R825R436R545J0534J2808J5841J8418
$$ 641552 652472 663259 674534 685878 696508 706333 715769 725314 735848 748656 764497 782915
58883G82915J9916K0686K1212K1395K0499J7710J3116Q223M714K570K91k912o244
$$ 782915 802831 823517 844729 866124 886623 904333 917449 925672 930386 932956 933247 930335 924091
58870I24091q909j1131j3026j3861j3254j1971j0779r593q408p785p653p054n952
$$ 924091 915182 904051 891025 877164 863910 851939 841160 831567 823159 815374 807721 800667 794715
58857G94715n799p340r296j0392j1193j2560j3760j3730j2968j2482j1877j0223
$$ 794715 788916 781576 772280 761888 750695 738135 724375 710645 697677 685195 673318 663095
58845F63095p950o220n149m262l905m627n778o402o930q362j0281j1294j1050
$$ 663095 655145 648925 643776 639514 635609 630982 625204 618802 611872 603510 593229 581935 570885
58832E70885j0319r378p928o333n421n147m730m014l447k945j993q23k57m47p13
$$ 570885 560566 551188 543260 536927 531506 526359 521629 517615 514168 511223 509230 508407 508150 507703 506990
58817E06990o11k21L88J140J584J358P96L94J38nM56J672K698K596J755J148Q22
$$ 506990 506379 506158 506546 507686 509270 510628 511424 511818 511956 511951 512407 514079 516777 519373 521128 522276 523098
58800E23098K67l30l16K67Q14J204J694K048J701O28o11j434j429m90P09J166
$$ 523098 523365 523035 522719 522986 523800 525004 526698 528746 530447 531075 530464 529030 527601 527111 527820 528986
58784E28986R50J315K833M469N233N527N969O162N772N612O317P019O691N701
$$ 528986 529936 531251 534084 538553 543786 549313 555282 561444 567216 572828 579145 586164 592855 598556
58770E98556M676K892m05m130o474p259p496p418o627n576n054m663l502j923
$$ 598556 603232 606124 605719 601589 595115 587856 580360 572942 566315 560739 555685 551022 547520 545597
58756E45597j008o71P6J332K357L139M310N693O429O351O014N540M719L881L553
$$ 545597 544589 543918 543994 545326 547683 550822 555132 560825 567254 573605 579619 585159 589878 593759 597312
58741E97312L620L871M705O172P199P078O784P390Q291Q594R129J0955J2921J3074
$$ 597312 600932 604803 609508 615680 622879 629957 636741 644131 652422 661016 670145 681100 694021 707095
58727G07095J1832J1312J1945J2179J1363J0451R788Q594O918N978O127O455O654
$$ 707095 718927 730239 742184 754363 765726 776177 785965 794559 801477 807455 813582 820037 826691
58714H26691P455Q874R919J0318J0731J0984R885P211M173J488j359m531p281
$$ 826691 834146 843020 852939 863257 873988 884972 894857 902068 906241 907729 906370 901839 894558
58701H94558r518j2316j6180k0136k3143k5236k6757k7607k7674k7046k5550k3015
$$ 894558 885040 872724 856544 836408 813265 788029 761272 733665 705991 678945 653395 630380
58689F30380k0055j7573j5513j3192j0724q948q000p257o496n963n441m519l583
$$ 630380 610325 592752 577239 564047 553323 544375 536375 529118 522622 516659 511218 506699 503116
58676E03116l270l219k637j733j221r16k38M16M77P99K569N127O812P620Q937
$$ 503116 499846 496627 493990 492257 491036 490120 489882 490298 490775 491574 494143 499270 506082 513702 522639
58661E22639J0898J2224J2491J2349J1539R061N395K301J59k219m864o180n708
$$ 522639 533537 545761 558252 570601 582140 591201 596596 598897 599056 596837 591973 585793 580085
58648E80085n145n716o498o264n204m100l266k979l519m282m222l399k686k037
$$ 580085 574940 569224 562726 556462 551258 547158 543892 540913 537394 533112 528890 525491 522805 520768
58634E20768p26P98J310J070J537K746L183K545K237K622K206L24j559k126j836
$$ 520768 520042 520840 522150 523220 524757 527503 530686 533231 535468 538090 540296 540620 539061 536935 535099
58619E35099j454r01k47k4J80J545L852N430N787O255P317P588O256M458L231
$$ 535099 533645 532744 532497 532473 532653 534198 538050 543480 549267 555522 562839 570427 576683 581141 584372
58604E84372K168J012N50R10R03Q8m13j18k02j306k296k329k211k545k527j682
$$ 584372 586540 587552 588102 589012 589915 590003 589590 589472 589270 587964 585668 583339 581128 578583 576056 574374
58588E74374j002j009n19J395L858N807P517R369J0715J1188J1532J2121J2179
$$ 574374 573372 572363 571844 573239 577097 582904 590421 599790 610505 621693 633225 645346 657525
58575F57525J1480J1048J1217J0850R551Q761R457J0673J1611J3278J6528K0186
$$ 657525 669005 680053 691270 702120 711671 720432 729889 740562 752173 765451 781979 802165
58563H02165K2787K4641K6757K9047L1037L2933L4695L5345L4409L2646L0295
$$ 802165 824952 849593 876350 905397 936434 969367 1004062 1039407 1073816 1106462 1136757
58552A136757K6156J9623J2145N407m11n582r637j2499j5121j7801j9339j9172
$$ 1136757 1162913 1182536 1194681 1200088 1199677 1194095 1184458 1171959 1156838 1139037 1119698 1100526
58540A100526j8771j9643k1460k3298k5159k7040k8154k8279k8304k8319k6958
$$ 1100526 1081755 1062112 1040652 1017354 992195 965155 937001 908722 880418 852099 825141
58529H25141k3789k0586j8683j7000j4165j0860q388o524m499k684j709j190o80
$$ 825141 801352 780766 762083 745083 730918 720058 711670 705146 700647 697963 696254 695064 694384
58516F94384o66j333j809j754k131l266l810k897j644j215j182j000j258k117
$$ 694384 693718 692385 690576 688822 686691 683425 679615 676718 675074 673859 672677 671677 670419 668302
58502F68302k375j531q73j128j103r3M81m36j494j179j76L58R06K033K693K068
$$ 668302 665927 664396 663523 662395 661292 661199 661680 661244 659750 658571 658395 658753 659659 661692 664385 666453
58486F66453J481K433M330N903P235Q721R861J0804J3101J7099K0561K1864K2386
$$ 666453 667934 670367 674697 680600 687835 696556 706417 717221 730322 747421 767982 789846 812232
58473H12232K3657K4345K2425J8356J3637Q123J416m909r093j1845j4703j7187
$$ 812232 835889 860234 882659 901015 914652 922775 924191 919282 910189 898344 883641 866454
58461H66454j7895j7058j5669j3498j0216o999m757k339J387N217P644R395J1542
$$ 866454 848559 831501 815832 802334 792118 785119 780362 778023 779410 784627 792271 801666 813208
58448H13208J2898J1832R110O272K857k100p238j0389j1596j2162j1971j0348
$$ 813208 826106 837938 847048 853320 856177 854077 846839 836450 824854 812692 800721 790373
58436G90373q218o796n406k961k43J621L451O195Q538R048R140J1172J4902J8656
$$ 790373 782155 775359 769953 766992 766749 768370 771821 778016 786554 795602 804742 815914 830816 849472
58422H49472K2412K6794L0199K9981K5588J8227Q670k024j1197j6815j9885k2224
$$ 849472 871884 898678 928877 958858 984446 1002673 1011343 1009319 998122 981307 961422 939198
58410I39198k3424k2470k0537j9253j7887j5248j2629j1801j1717j0429q626p975
$$ 939198 915774 893304 872767 853514 835627 820379 807750 795949 784232 773803 765177 757202
58398G57202p541n451k639j369j243j80J671K511K378K705L287K870J787J020
$$ 757202 749661 744210 741571 740202 738959 738779 740450 742961 745339 748044 751331 754201 755988 757008
58384G57008j64k599m585m084k257j561j663n41J705L592N417Q188J0609J0682
$$ 757008 756844 754245 749660 745576 743319 741758 740095 739554 741259 744851 750268 758456 769065 779747
58370G79747R206Q424Q460Q238Q393R845J1087J0394R172R617J0827J0878J0751
$$ 779747 788953 797377 805837 814075 822468 832313 843400 853794 862966 872583 883410 894288 905039
58357I05039J2227J3878J3371J1879J1852J2186J0165O565M160K772N16j631j336
$$ 905039 917266 931144 944515 956394 968246 980432 990597 997162 1001322 1004094 1004610 1002979 1001643
58344A001643M08R80J043K891N392N746M951O180Q882R856R208R822J1822J2840
$$ 1001643 1002051 1003031 1004074 1006965 1012357 1018103 1023054 1029234 1038116 1047972 1057180 1067002 1078824 1091664
58330A091664J3056J4583J6645J6647J5285J5254J5792J3935J0359Q370P873N997
$$ 1091664 1104720 1119303 1135948 1152595 1167880 1183134 1198926 1212861 1223220 1231590 1239463 1245460
58318A245460L012J908K644K491J533K173L837L881L115M606P711R167R330J1201
$$ 1245460 1248472 1250380 1253024 1255515 1257048 1259221 1263058 1266939 1270054 1274660 1282371 1291538 1300868 1312069
58304A312069J4081J4440J2573J2073J3309J3611J3209J4591J6726J6442J4768
$$ 1312069 1326150 1340590 1353163 1365236 1378545 1392156 1405365 1419956 1436682 1453124 1467892
58293A467892J5283J7102J6375J3790J3471J5337J5894J5602J7915K1853K3293
$$ 1467892 1483175 1500277 1516652 1530442 1543913 1559250 1575144 1590746 1608661 1630514 1653807
58282A653807K2699K3764K5583K4533K2674K5288L0972L3398L2257L2922L5940
$$ 1653807 1676506 1700270 1725853 1750386 1773060 1798348 1829320 1862718 1894975 1927897 1963837
58271A963837L6786L5724L7637M2049M3692M3127M6141N2360N5359N4732N6716
$$ 1963837 2000623 2036347 2073984 2116033 2159725 2202852 2248993 2301353 2356712 2411444 2468160
58260B468160O2117O5108O5049O7714P3262P4942P1506O9085O9049O6046N9979
$$ 2468160 2530277 2595385 2660434 2728148 2801410 2876352 2947858 3016943 3085992 3152038 3212017
58249C212017N7474N9467N9907N8640O2604P2033P8973Q1845Q7732R7873J05142
$$ 3212017 3269491 3328958 3388865 3447505 3510109 3582142 3661115 3742960 3830692 3928565 4033707
58238D033707J08541J15457J26679J34490J38509J47536J62445J73769J79863
$$ 4033707 4142248 4257705 4384384 4518874 4657383 4804919 4967364 5141133 5320996
58229E320996J90338K07559K22456K32998K48389K70478K90015L06081L29375
$$ 5320996 5511334 5718893 5941349 6174347 6422736 6693214 6983229 7289310 7618685
58220G618685L61361L91075M17615M53624N01151N47739N92269O49494P22643
$$ 7618685 7980046 8371121 8788736 9242360 9743511 10291250 10883519 11533013 12255656
58211A2255656P98590Q77307R77370J104440J245279J401892J598928J848464
$$ 12255656 13054246 13931553 14908923 16013363 17258642 18660534 20259462 22107926
58203B2107926K143175K493511K931522L468084M091707M821018N706680O767605
$$ 22107926 24251101 26744612 29676134 33144218 37235925 42056943 47763623 54531228
58195E4531228P984963R377778J1020520J2971542J5264225J7980485K1221168
$$ 54531228 62516191 71893969 82914489 95886031 111150256 129130741 150351909
58188A50351909K4979492K9170763L3725176L8209509M1029546L9407509L1050356
$$ 150351909 175331401 204502164 238227340 276436849 317466395 356873904 387924260
58181C87924260J6381025j038637j6645165k7591206l3630206l5980066l5880520
$$ 387924260 404305285 403266648 386621483 359030277 325400071 289420005 253539485
58174B53539485l4110970l1216566k7694676k3966864k0348015j7059746j4212964
$$ 253539485 219428515 188211949 160517273 136550409 116202394 99142648 84929684
58167H4929684j1804377r785294q122700o780761n693746m798484m066297l476832
$$ 84929684 73125307 63340013 55217313 48436552 42742806 37944322 33878025 30401193
58159C0401193k990899k574834k224355j940475j705384j501616j330963j195073
$$ 30401193 27410294 24835460 22611105 20670630 18965246 17463630 16132667 14937594
58151A4937594j078939r70910q78144q05910p41485o73997o11119n61055n15970
$$ 14937594 13858655 12887745 12009601 11203691 10462206 9788209 9177090 8616035 8100065
58142H100065m67803m23401l89616l59150l24932k93871k73474k58477k42613
$$ 8100065 7632262 7208861 6819245 6460095 6135163 5841292 5567818 5309341 5066728
58133E066728k30121k24126k16757k02241j87432j78535j69617j54870j40358
$$ 5066728 4836607 4612481 4395724 4193483 4006051 3827516 3657899 3503029 3362671
58124C362671j32690j27166j17755j08370j03894r9961r1812q3980q1486q0199
$$ 3362671 3229981 3102815 2985060 2876690 2772796 2672835 2581023 2497043 2415557 2335358
58114B335358p5128o9716o7981o5987n9894n4279n3734n4025n0111m5480m5025
$$ 2335358 2260230 2190514 2122533 2056546 1996652 1942373 1888639 1834614 1784503 1739023 1693998
58103A693998m5866m3478m0265l9973m0014l6989l3741l3624l3740l0840k7910
$$ 1693998 1648132 1604654 1564389 1524416 1484402 1447413 1413672 1380048 1346308 1315468 1287558
58092A287558k8155k8428k5323k1874k1592k1720j8914j5882j5761j5666j2495
$$ 1287558 1259403 1230975 1205652 1183778 1162186 1140466 1121552 1105670 1089909 1074243 1061748
58081A061748r638j1152j4370j4870j4054j5361j7565j7997j8058j9736k0936
$$ 1061748 1052110 1040958 1026588 1011718 997664 982303 964738 946741 928683 908947 888011
58070H88011j9775j9015k0868k2095j9608j6183j5250j4772j1960r159r300j0013
$$ 888011 868236 849221 828353 806258 786650 770467 755217 740445 728485 719326 710026 700013
58058G00013q186o019o817q917r453r940j2374j4030j2048r301r735j1516j0717
$$ 700013 691827 685808 678991 670074 660621 650681 638307 624277 612229 602928 593193 581677 570960
58045E70960q279p397p253n299k849k743m014m179m110n644p152o444n234n834
$$ 570960 562681 555284 548031 542732 539883 537140 533126 528947 524837 519193 512041 505597 500363 494529
58031D94529o514m991l459m935p623q122p400q314r882r377p650p190p190n631
$$ 494529 488015 483024 479565 474630 467007 458885 451485 443171 433289 423912 416262 409072 401882 396251
58017C96251l993m722o202n286k839j945k536k545k359l428m387l229j442j478
$$ 396251 392258 387536 381334 376048 373209 371264 368728 366183 363824 360396 356009 352780 351338 349860
58003C49860k118q72J134J358P99J977L932M122L491M752P210Q137P807Q349R004
$$ 349860 347742 346870 348004 349362 350161 352138 356070 360192 363683 368435 375645 383782 391589 399938 408942
57988D08942P341M064K001J333K18j032q20j84j460m013n441n902p128q402p808
$$ 408942 416283 420347 422348 423681 423899 422867 422047 421863 420403 416390 410949 405047 397919 389517 381709
57973C81709o356o526p670p239n542n005n527m909l213k488k681j860o1R32R91
$$ 381709 375353 368827 361157 353918 348376 343371 337844 332935 329722 327234 324553 322693 322632 323564 324555
57958C24555J288J297j52j758j489m42j119k852l027j914k047l401l497j931p30
$$ 324555 325843 327140 326988 325230 323741 323299 322180 319328 316301 314387 312340 308939 305442 303511 302781
57943C02781l43P55K625L730M119N210O675O975O594P262Q545Q742Q541R998J2286
$$ 302781 302438 303193 305818 309548 313667 318877 325552 332527 339121 346383 354928 363670 372211 382209 394495
57928C94495J2349R664O676M658K687N98o30j438l307n893p606q581r946j0847
$$ 394495 406844 416508 423184 427842 430529 431127 430497 429059 425752 419859 412253 403672 393726 382879
57914C82879r638p377o499o657n610l605k810k894j442J414K980K656K457K729
$$ 382879 373241 365864 359365 352708 347098 343493 340683 337789 336347 337761 340741 343397 345854 348583
57900C48583J652o57j648p88m92j831k970k731k173j813o76R92J427N21J91Q32
$$ 348583 350235 349578 347930 347142 346650 344819 341849 339118 336945 335132 334456 335448 336875 337396 337587 338419
57884C38419O79p09j539j104q49j398j583j157j382k289k391j763k262m061n047
$$ 338419 339098 338389 336850 335746 334897 333499 331916 330759 329377 327088 324697 322934 320672 316611 311564
57869C11564m420l751l783l294j963j200j324q49N57J424J476K267M136N598O396
$$ 311564 307144 303393 299610 296316 294353 293153 291829 290980 291537 292961 294437 296704 300840 306438 312834
57854C12834P932R965J0334Q898Q222R228R607P939N910M902L683J285r35k040
$$ 312834 320766 330731 341065 349963 358185 367413 377020 384959 390869 395771 399454 400739 399804 397764
57840C97764l431o039q268q678q281q317q136p112o418o913p357o539n293m712
$$ 397764 394333 388294 380026 371348 363067 354750 346614 339502 333084 326171 318814 312275 306982 302270
57826C02270m195k855j232r5Q11J598J530O21J92Q22J469J573K007L011L242J943
$$ 302270 298075 295220 293988 293893 294704 296302 297832 298453 298645 299467 300936 302509 304516 307527 310769 312712
57810C12712L3j868m358p236q883q850q805r646r956q603o699n510m528l054j666
$$ 312712 312745 310877 306519 299283 290400 281550 272745 263099 253143 244540 237841 232331 227803 224749 223083
57795B23083o78P84K770L595K434R17O52J094J305J821L137M246M409M638N757
$$ 223083 222405 223189 225959 229554 231988 232905 233557 234651 235956 237777 240914 245160 249569 254207 259964
57780B59964O675O310N663O181P474Q262Q427Q538Q428P691O617N527M175K591
$$ 259964 266639 272949 278612 284793 292267 300529 308956 317494 325922 333613 340230 345757 349932 352523
57766C52523J337K89j473l886n704o665p918r598j0129q905p520p171o939n978
$$ 352523 353860 354149 352676 348790 343086 336421 328503 318905 308776 299871 292351 285180 278241 272263
57752B72263n228n407n324l880k031j090p14j09L58K85L69R91J198M66r4L33Q63
$$ 272263 267035 261628 256304 252424 250393 249303 248589 248480 248838 249123 249492 250483 251681 252147 252053 252386 253249
57735B53249P88J028K198L073K705K245K917L776L415K396K049K198J947J510
$$ 253249 254037 255065 257263 260336 263041 265286 268203 271979 275394 277790 279839 282037 283984 285494
57721B85494J542J769J749J834J969J005j297l160l260k794l325m172l935l193
$$ 285494 287036 288805 290554 292388 294357 295362 294065 290905 287645 284851 281526 277354 273419 270226
57707B70226l423m444m937m737m607m553m102l523l190k562j276l01m84r22l90
$$ 270226 266803 262359 257422 252685 248078 243525 239423 235900 232710 230148 228872 228571 228087 227165 226775
57692B26775O24Q34K06n03j292k479l558l914l850l682k883j368l11k01N04L091
$$ 226775 227399 228233 228439 227936 226644 224165 220607 216693 212843 209161 206278 204910 204599 204398 204902 207993
57676B07993O287Q146R076J0981J4276J7894K1546K6016L1519L7581M4175N1252
$$ 207993 214280 222426 231502 242483 256759 274653 296199 322215 353734 391315 435490 486742
57664D86742N7133N8476N1988L6078J2200j4429l6811n0581n6148n6129n2311
$$ 486742 543875 602351 654339 690417 702617 688188 651377 600796 544648 488519 436208
57653D36208m5978l9106l3122k7622k1974j7060j3863j1710r601p986p408o712
$$ 436208 390230 351124 318002 290380 268406 251346 237483 225773 216172 208186 200778 194066
57641A94066m652k132q53o57k31M67N28K6k06j46j87l5M97N02n43j446j188q77
$$ 194066 189414 187282 186429 185772 185541 186008 186536 186562 186356 186210 186023 185988 186485 186987 186444 184998 183810 182933
57623A82933j921l473l869l424l470l638k616r00k23p10r83p07p61j192j184q37
$$ 182933 181012 177539 173670 170246 166776 163138 160522 159622 159399 158689 157706 156999 156238 155046 153862 153025
57607A53025r13j096m78N17O51J6k67j23k92n68j77M10J44n98o62m28j256k932
$$ 153025 152112 151016 150538 151055 151706 151722 151455 151332 151040 150472 150295 150705 150849 150251 149589 149161 147905 144973
57589A44973l798l324k479j749q02m3k99j108j231p39o60q29k23P76O99m37j087
$$ 144973 141175 137851 135372 133623 132821 132778 132479 131371 130140 129401 128741 127912 127689 128465 129164 128727 127640
57572A27640p95o98j290j798k000k534l218l007j917j060o26K01J220J195J00
$$ 127640 126845 126147 124857 123059 121059 118525 115307 112300 110383 109323 108697 108898 110118 111313 111413
57557A11413o87p49j113j951j953n58J059J947K470K889K634J644Q52O34L13l49
$$ 111413 110726 109977 108864 106913 104960 104402 105461 107408 109878 112767 115401 117045 117897 118531 118844 118495
57541A18495o15k30J05J52N55J452K181K608L228L635K690O37p46o63l18p28j296
$$ 118495 117880 117650 117755 117907 118462 119914 122095 124703 127931 131566 134256 134893 134147 133484 133166 132438 131142
57524A31142j283j183j662k415k946l353l643l316k318j397r99o97j36M13P46
$$ 131142 129859 128676 127014 124599 121653 118300 114657 111341 109023 107626 106627 105930 105794 106207 106953
57509A06953J003J071O84K38M32J008R79J59o10q06o25j24P10J183N07q06j471
$$ 106953 107956 109027 109711 109949 110381 111389 112368 112527 111917 111111 110486 110362 111072 112255 112762 111956 110485
57492A10485j266r69p40j75K77k61j293j428o78m81j266j922j864j762j855j436
$$ 110485 109219 108250 107510 107335 107612 107351 106058 104630 103952 103471 102205 100283 98419 96657 94802 93366
57476I3366m49J53N2o1j06q62k203k890k506j947j612r28PK10l32m71n5l23j598
$$ 93366 92917 93070 93122 93061 92955 92093 89890 87000 84494 82547 80935 80007 80014 80224 79892 79421 79366 79043 77445
57457G7445k507k175j350p30p7L85k32j621k079j070k4J23J91P21Q75L64L98J423
$$ 77445 74938 72763 71413 70683 70606 70991 70759 69138 67059 65989 65965 66088 66279 67000 67875 68239 68637 70060
57439G0060J933Q89n20q89o37o24m87J60N02Rk75N61J634J739J212R15O13j79
$$ 70060 71993 72882 72362 71473 70836 70212 69725 69885 70387 70396 70121 70682 72316 74055 75267 76182 76795 76616
57421G6616q72p07p1K64K15j89j242k452k398p98O79P24J63K81Q64J179J435J856
$$ 76616 75744 75037 74966 75230 75445 75256 74014 71562 69164 68366 69045 69769 69932 70213 71077 72256 73691 75547
57403G5547J703N86n11q53j226k209k694j733m39k69o80l56M42O35M27P11J154
$$ 75547 77250 77836 77325 76472 75246 73037 70343 68610 68171 67902 67222 66866 67308 67943 68370 69081 70235
57386G0235Q95M53J034K327K860K252J540J441J702J959J984J360N7j000r84m13
$$ 70235 71130 71583 72617 74944 77804 80056 81596 83037 84739 86698 88682 90042 90099 89099 88115 87702
57370H7702l86j078j897k525k837k519j723j354j702j714o84L69K56m04k80M62
$$ 87702 87316 86238 84341 81816 78979 76460 74737 73383 71681 69967 69283 69652 69908 69504 69224 69686
57354F9686O76L13L63J012J413J114M94p3m42l16L42R00Q94P70R50Q26k80j744
$$ 69686 70362 70675 71038 72050 73463 74577 75071 74998 74556 74240 74582 75482 76376 77146 78096 78922 78642 76898
57336G6898k374k017j408r05l88J0Q7O1J08j08o79r69o19k25k18RQ97J617J348
$$ 76898 74524 72507 71099 70194 69806 69816 69903 69964 70072 69964 69285 68316 67697 67472 67254 67263 68160 69777 71125
57317G1125P25Q57J625K104J971J439N70k80j99R73J943J627O17r9p23j717k390
$$ 71125 71850 72707 74332 76436 78407 79846 80416 80136 79937 80910 82853 84480 85097 84998 84275 82558 80168
57300H0168j978j122p80o06k7J79q50k040j598K05J370R32k06r88j160p92j87
$$ 80168 78190 77068 76288 75682 75655 75834 74984 72944 71346 71551 72921 73853 73647 72659 71499 70707 70520
57283G0520l2m82o17J52R70J000R71J808K732K582K051K709M429N802O442O920
$$ 70520 70488 70006 69389 69541 70511 71511 72482 74290 77022 79604 81655 84364 88793 94595 101037 107957
57267A07957O987N997M679M399M889M753L961L709M022L656K407J395R34J76r09
$$ 107957 114944 120941 125620 130019 134908 139661 143622 147331 151353 155009 157416 158811 159745 159921 159012
57252A59012j242p21o03j298j648r95l04n18j149j261p47j32P5m32j384j807j119
$$ 159012 157770 157049 156446 155148 153500 152505 152201 151683 150534 149273 148526 148394 148469 148037 146653 144846 143727
57235A43727OP75J571K817L390K050j64j008j78O99R04J211J718J593J224K154
$$ 143727 143733 144508 146079 148896 152286 154336 154172 153164 152986 153685 154589 155800 157518 159111 160335 162489
57219A62489M279N455M667L473L446M188M903N867P223P984P628P217P737Q557
$$ 162489 166768 172223 176890 180363 183809 187997 192900 198767 205990 213974 221602 228819 236556 245113
57205B45113Q666Q311Q336Q879R635J0468J1010J0598R436Q847R668J1282J2745
$$ 245113 253779 262090 270426 279305 288940 299408 310418 321016 330452 339299 348967 360249 372994
57192C72994J3935J4978J5599J5750J5977J6572J7153J7518J7998J8547J8514
$$ 372994 386929 401907 417506 433256 449233 465805 482958 500476 518474 537021 555535
57181E55535J7774J7131J7159J7571J8072J8777J9479J9577J9106J8790J8720
$$ 555535 573309 590440 607599 625170 643242 662019 681498 701075 720181 738971 757691
57170G57691J8144J6948J6104J6200J6686J6925J6853J6233J4615J2499J1249
$$ 757691 775835 792783 808887 825087 841773 858698 875551 891784 906399 918898 930147
57159I30147J1392J2170J3105J4479J5951J6342J5559J5107J5853J6822J7099
$$ 930147 941539 953709 966814 981293 997244 1013586 1029145 1044252 1060105 1076927 1094026
57148A094026J7308J8074J8524J7717J6321J5531J5281J4883J4506J4720J5234
$$ 1094026 1111334 1129408 1147932 1165649 1181970 1197501 1212782 1227665 1242171 1256891 1272125
57137A272125J5325J4997J4789J4895J5304J6141J7168J7633J7315J7036J7467
$$ 1272125 1287450 1302447 1317236 1332131 1347435 1363576 1380744 1398377 1415692 1432728 1450195
57126A450195J8292J9114K0242K1859K3430K4705K6408K9066L2187L5367L9215
$$ 1450195 1468487 1487601 1507843 1529702 1553132 1577837 1604245 1633311 1665498 1700865 1740080
57115A740080M4205M9717N5240O1532O9483P8901Q9438J01778J16690J34074J54300
$$ 1740080 1784285 1834002 1889242 1950774 2020257 2099158 2188596 2290374 2407064 2541138 2695438
57104B695438J79531K12258K53561L04534L68268M47736N41494O43552P48431
$$ 2695438 2874969 3087227 3340788 3645322 4013590 4461326 5002820 5646372 6394803
57095F394803Q55642R69455J095452J237361J396003J570742J761651J968553
$$ 6394803 7250445 8219900 9315352 10552713 11948716 13519458 15281109 17249662
57087A7249662K186339K402241K599308K760743K867900K896812K825378K648918
$$ 17249662 19436001 21838242 24437550 27198293 30066193 32963005 35788383 38437301
57079C8437301K383905K048897J641847J142740N42291j34218q32461j494004
$$ 38437301 40821206 42870103 44511950 45654690 46196981 46062763 45230302 43736298
57071D3736298k073656k539951k871626l060443l114413l053358k900692k679970
$$ 43736298 41662642 39122691 36251065 33190622 30076209 27022851 24122159 21442189
57063B1442189k415746k132262j849429j581196j337406j124768r45562p97595
$$ 21442189 19026443 16894181 15044752 13463556 12126150 11001382 10055820 9258225
57055I258225o77041n80910n06879m52254m13777l87625l69365l54911l42012
$$ 9258225 8581184 8000274 7493395 7041141 6627364 6239739 5870374 5515463 5173451
57046E173451l30026l18368l06153k93209k79989k66218k50982k34406k17758
$$ 5173451 4843425 4525057 4218904 3925695 3645706 3379488 3128506 2894100 2676342
57037B676342k01591j85061j67650j50059j32897j15848r8823q2483o6841n0784
$$ 2676342 2474751 2289690 2122040 1971981 1839084 1723236 1624413 1541930 1475089 1424305
57027A424305l3807j6827k75J6941L4666M8514N1594L9838J5486j3952l9663n5741
$$ 1424305 1390498 1373671 1373396 1390337 1425003 1473517 1525111 1564949 1580435 1566483 1526820 1471079
57015A471079o1382n9658n4119m6823l9115l2550k7968k4642k1379j8070j5426
$$ 1471079 1409697 1350039 1295920 1249097 1209982 1177432 1149464 1124822 1103443 1085373 1069947
57004A069947j3814j2968j2382j1451r816q009p134p519q364r014r642j0281j0350
$$ 1069947 1056133 1043165 1030783 1019332 1009516 1001507 994373 986854 978490 969476 959834 949553 939203
56991I39203r744r351r716j0083r531q201o656m866k651l99J245J679r8n075j2526
$$ 939203 929459 920108 910392 900309 890778 882577 875921 871055 868404 868005 869250 870929 870831 865756 853230
56976H53230j9747k4428k6588k7492k7619k6620k4405k1260j7448j3548j0447
$$ 853230 833483 809055 782467 754975 727356 700736 676331 655071 637623 624075 613628
56965F13628q256n961k846M64L094N109P034R058J1485J4825J8474K0188J7947
$$ 613628 605372 599411 596565 597029 600123 605232 612266 621324 632809 647634 666108 686296 704243
56952G04243J1732K929o932j6079k2479k5340k5765k4927k2605j8605j4427j1767
$$ 704243 715975 718904 711972 695893 673414 648074 622309 597382 574777 556172 541745 529978
56940E29978j0125p554l452Q68M169O569Q886J1791J5600K0168K4914K9182L1955
$$ 529978 519853 512299 508847 509715 513884 520453 529339 541130 556730 576898 601812 630994 662949
56927F62949L1098K4221J1347m105j7848k7583l2931l4123l2149k9081k6487k4024
$$ 662949 694047 718268 729615 725510 707662 680079 647148 613025 580876 551795 525308 501284
56915E01284k0808j7341j4795j3109j1312r284p750o895o254n637n050m130k715
$$ 501284 480476 463135 448340 435231 423919 414635 406885 399990 393736 388099 383049 378919 376204
56902C76204j517j109q17K79J782K688L041L657M691N796P213R388J1861J3824
$$ 376204 374687 373578 372761 373040 374822 377510 380551 384208 388899 394695 401908 411296 423157 436981
56888D36981J5490J7668K0372K2970K5234K6859K6276K1545J2641J839q128j5506
$$ 436981 452471 470139 490511 513481 538715 565574 591850 613395 626036 627875 619747 604241
56876F04241j9559k0505j9393j7261j4355j0742p072l917r08K549O268R890J3891
$$ 604241 584682 564177 544784 527523 513168 502426 495354 491437 490529 493078 499346 509236 523127
56863E23127J8998K5096L1677L8725M6215N3145N7735N7753N0398L3704R723j4920
$$ 523127 542125 567221 598898 637623 683838 736983 794718 852471 902869 936573 946296 931376
56851I31376l3560m4096m8179m7545m3086l6285k8852k1150j2812m497K790R587
$$ 931376 897816 853720 805541 757996 714910 678625 649773 628623 615811 611314 614104 623691
56839F23691J7196K5462L3387M1473N1318O3059P5279Q6897R6398R9078Q8213
$$ 623691 640887 666349 699736 741209 792527 855586 930865 1017762 1114160 1213238 1301451
56828A301451O0900K1709k0010n5409p9279r0619r1833q6575p7525o6199n4143
$$ 1301451 1362351 1384060 1364050 1308641 1229362 1138743 1046910 960335 882810 816611 762468
56817G62468m2760l2117k1536j1355k671M637J2053K0425K9375L8782M9195O0124
$$ 762468 719708 687591 666055 654700 652029 656666 668719 689144 718519 757301 806496 866620
56805H66620O8987P2044O5729M7918J9964j2264m1076o1484p2674p5945p3080
$$ 866620 935607 1007651 1073380 1121298 1141262 1128998 1087922 1026438 953764 877819 804739
56794H04739o6444n8408m9897m0762l1611k3739j7276j1158n091J95M796R921
$$ 804739 738295 679887 629990 589228 557617 533878 516602 505444 500353 500548 505344 515265
56782E15265J6010K2303K8495L4684L9096L7931K8769J3026n515k3180l7101m5412
$$ 515265 531275 553578 582073 616757 655853 693784 722553 735579 730064 706884 669783 624371
56770F24371m8164m7148m4080l9634l4469k9664k5616k1726j7790j4572j2574
$$ 624371 576207 529059 484979 445345 410876 381212 355596 333870 316080 301508 288934
56759B88934j1350j0445r829r086p504n337l783l285l088k732k614k792k652k226
$$ 288934 277584 267139 257310 248224 240720 235383 231600 228315 225227 222495 219881 217089 214437 212211
56745B12211k348l063l229k285j107n86n73p55j239j846j966j608j451j569j310
$$ 212211 209863 206800 203571 201286 200179 199593 199020 198265 197026 195180 193214 191606 190155 188586 187276
56730A87276o72l88n42m46j32l54r77j003m36l24o29k5J648K733K310J520J464
$$ 187276 186604 186216 185674 185228 185096 184742 183765 182762 182326 182002 181373 181348 182996 185729 188039 189559 191023
56713A91023J588J127M99J91j84p77q19r7M01J18j52J80M55J64j05L9M4k27M3
$$ 191023 192611 193738 194237 194428 194244 193467 192648 192551 192952 193070 192918 193098 193553 193717 193612 193651 193695 193468 193511
56694A93511R30J166K10o90n55j76m31q00p51j036k092k726j839k35P27J056J305
$$ 193511 194441 195607 195817 195127 194572 194396 193965 193165 192414 191378 189286 186560 184721 184486 185213 186269 187574
56677A87574J098M3r88j005m66k82k29L27R74R16L55m6l06o53o74o9M79L22o9
$$ 187574 188672 188715 187727 186722 186256 185974 185745 186072 187046 187962 188317 188271 187965 187312 186638 186569 187048 187370 187301
56658A87301l1R5k84q30q37k62O51J920L196L506K498J080R9n92j074o89O09J547
$$ 187301 187270 187365 187081 186251 185414 185152 185803 187723 190919 194425 196923 198003 198102 197510 196436 195747 196356 197903
56640A97903J300P64R23J157M80o70j211j139j101j135r88r37j180j154n24j4
$$ 197903 199203 199967 200890 202047 202527 201857 200646 199507 198406 197271 196283 195346 194166 193012 192488 192474
56624A92474l20j038j540j950k369k224j372p03o90n15K77O28k90j437j464p14
$$ 192474 192154 191116 189576 187626 185257 183033 181661 180958 180268 179753 180030 180658 180368 178931 177467 176753
56608A76753k71j02K38J73r37k204k214j112k02j5p6p5n5J10L53J42n59q05m6
$$ 176753 176482 176380 176618 176791 175854 173650 171436 170324 170122 170107 170031 169956 169901 170011 170364 170506 169947 169142 169096
56589A69096R19J319J657K448K888K099Q12L39O04O24K29O2L69Q57J348J671J583
$$ 169096 170015 171334 172991 175439 178327 180426 181238 181577 182181 182805 183034 183096 183465 184322 185670 187341 188924
56572A88924J436K014L054L158J918Q92J463L075M627O123P748Q862R351J0561
$$ 188924 190360 192374 195428 198586 200504 201396 202859 205934 210561 216684 224432 233294 242645 253206
56558B53206J3364J6477J8159J8245J7135J4312R591M569J053q64j733j273L58
$$ 253206 266570 283047 301206 319451 336586 350898 360489 365058 366111 365247 363514 362241 362599
56545C62599J337L35j371j890j650k258l627m492m856n663o747p139o824o358
$$ 362599 363936 364271 362900 361010 359360 357102 353475 348983 344127 338464 331717 324578 317754 311396
56531C11396n593m465m108n240o530o477n838o073o552n690l881k814k617k212
$$ 311396 305803 301338 297230 291990 285460 278983 273145 267072 260520 254830 250949 248135 245518 243306
56517B43306j779k377l595m073l923m219m537l527j651q04j336j788j553j450
$$ 243306 241527 239150 235555 231482 227559 223340 218803 215276 213625 212821 211485 209697 208144 206694
56503B06694j686j500r66j021j614j713j209r41r20l97M41O92M96O90R85M42n03
$$ 206694 205008 203508 202542 201521 199907 198194 196985 196044 195124 194727 195168 195860 196356 197046 198031 198473 197970
56486A97970n79O6J55l36k25N87R81O71L98K07m56j102p14K33L71j15J64J182
$$ 197970 197391 197457 197612 197276 197051 197638 198619 199290 199688 199895 199439 198337 197623 197856 198227 198112 198276 199458
56468A99458J518Q93M63M98J08o16m76N14R61N02K50N18K91n79p92J63J073R90
$$ 199458 200976 201869 202332 202830 202938 202322 201846 202360 203321 203823 204073 204591 204882 204303 203511 203674 204747 205737
56450B05737M56K26K50L99Q26J328J541J685J984J744M83o79n08J56k56j165p31
$$ 205737 206193 206419 206669 207068 207894 209222 210763 212448 214432 216176 216659 215980 215472 215628 215372 214207 213476
56433B13476Q40J486O36j53l0J65m3q1K9l95r31l96Q89J333P25M45R29J209J102
$$ 213476 214316 215802 216438 216285 216255 216420 216377 216296 216325 215930 214999 214603 215492 216825 217550 217995 218924 220133 221235
56414B21235J469K119J856P94K63K26p06k388k875j569j53J66j6j63o24j033l21
$$ 221235 222704 224823 226679 227473 227736 227962 227256 224868 221993 220424 220271 220437 220421 220258 219634 218601 218280
56397B18280J169J827J443J456K176K315J684J687K515K507J108q1r0O4l29m37
$$ 218280 219449 221276 222719 224175 226351 228666 230350 232037 234552 237059 238167 238086 237996 238060 237731 237294
56381B37294K02P45Q89J389K056J602J91l25N40J092M74j2M73Q97N83M44R07R48
$$ 237294 237496 238241 239130 240519 242575 244177 244368 244043 244583 245675 246149 246137 246610 247507 248090 248534 249441 250389
56363B50389J91k54Q0K93K59R82K130J874J31q52j55M17k40o18L40J155N30l63
$$ 250389 250580 250326 250406 250699 250958 251940 254070 255944 256075 255223 255068 255485 255245 254627 254967 256122 256652 256289
56345B56289k28J78l1L2J130K070J679P89O47J040J476K375L710M267L638L139
$$ 256289 256061 256239 256208 256240 257370 259440 261119 261908 262555 263595 265071 267446 271156 275423 279061 282200
56329B82200L554L810L100K357K405K545K258K302K876K693J156m44j071j353
$$ 282200 285754 289564 292664 295021 297426 299971 302229 304531 307407 310100 311256 310812 309741 308388
56315C08388j776j602p32m88j357j991j585j170j447j546r88o30o15K40J980K928
$$ 308388 306612 305010 304278 303790 302433 300442 298857 297687 296240 294694 293706 293076 292461 292701 294681 297609
56299B97609K680L046M838O254N880M692L713K379N63l66r8l26j647k189q53P60
$$ 297609 300289 303335 308173 314427 320307 324999 328712 331091 331654 331288 331190 330864 329217 327028 326175 326935
56283C26935J192J274J839K075J653J706K310J864M42M20K264L187J917J133K807
$$ 326935 328127 329401 331240 333315 334968 336674 338984 340848 341290 341710 343974 347161 349078 350211 353018
56268C53018M821M855M231M914N884N606N147N794O314N648N548P479R601R947
$$ 353018 357839 362694 366925 371839 377723 383329 388476 394270 400584 406232 411780 419259 428860 438807
56254D38807R949J1546J3498J3939J4145J6170J8987K0571K1722K4264K7300K8734
$$ 438807 448756 460302 473800 487739 501884 518054 537041 557612 579334 603598 630898 659632
56242F59632K8927K9556L0410L0347K9851K9730K8885K6145K2616J9536J5811
$$ 659632 688559 718115 748525 778872 808723 838453 867338 893483 916099 935635 951446
56231I51446J0317M562J79l927q969j3209j4778j5325j7445k0443k2095k2580
$$ 951446 961763 966325 966504 962577 953608 940399 925621 910296 892851 872408 850313 827733
56219H27733k3245k3387k1848k0022j9796k0068j8794j6751j5896j5663j4396
$$ 827733 804488 781101 759253 739231 719435 699367 680573 663822 647926 632263 617867
56208F17867j2823j2594j2883j1871j0181r504r256p958o375o044o114m933l259
$$ 617867 605044 592450 579567 567696 557515 548011 538755 530797 524422 518378 512264 507331 504072
56195E04072k737k783k090j504k203k857j854m67m51n75R55K700K389J135J363
$$ 504072 501335 498552 496462 494958 492755 489898 488044 487577 487126 486551 487506 490206 492595 493730 495093
56180D95093K423K167J167J462K647L060L220M373N386M771L942M671N377L980
$$ 495093 497516 499683 500850 502312 504959 508019 511239 515612 520998 525769 529711 534382 539759 543739
56166E43739K294L235N670O544O210P066Q603Q625P902Q856J0934J1814J1988
$$ 543739 546033 549268 554938 561482 567692 574758 583361 591986 599888 608744 619678 631492 643480
56153F43480J3556J5872J6916J7672K0522K4654K7635L0154L4583M0310M5325
$$ 643480 657036 672908 689824 707496 728018 752672 780307 810461 845044 885354 930679
56142I30679N0964O0022P1499Q2207R2437J04782J18442J29783J37420J41542
$$ 930679 981643 1041665 1113164 1195371 1287808 1392590 1511032 1640815 1778235 1919777
56132A919777J39429J27511J07793Q7123P0301N8245N1588N0499N1218M8118L9470
$$ 1919777 2059206 2186717 2294510 2381633 2451934 2510179 2561767 2612266 2663484 2711602 2751072
56121B751072K7260J2529m293j9707k9395l3964l8055m4498n3734o7306q6309
$$ 2751072 2778332 2790861 2786568 2766861 2737466 2703502 2665447 2620949 2567215 2499909 2413600
56110B413600j07202j24204j35200j40854j39795j30350j15591j00899q7477p3519
$$ 2413600 2306398 2182194 2046994 1906140 1766345 1635995 1520404 1419505 1332028 1258509
56100A258509o0128n0139m2520l4136k5863k0890j8227j4232r374o972o453m447
$$ 1258509 1198381 1148242 1105722 1071586 1045723 1024833 1006606 992374 983000 976028 969575 965128
56088I65128j438o12j149M63L415L841K184K240L850L761K783M563Q028Q663O759
$$ 965128 963690 963078 961929 962392 965807 969648 971832 974072 977922 981683 984466 989029 997057 1005720 1012479
56073A012479O667Q544Q660P385Q643J1731J1946R393Q936J1287J2344J1519J2451
$$ 1012479 1019146 1027690 1036350 1043735 1052378 1064109 1076055 1085448 1094384 1105671 1118015 1129534 1141985
56060A141985J5217J6006J4854J5579J7990J8338J7199J8417K0571J8634J3778
$$ 1141985 1157202 1173208 1188062 1203641 1221631 1239969 1257168 1275585 1296156 1314790 1328568
56049A328568J2197J4208J4327J2045J2502J5995J7233J5758J6782K0718K2231
$$ 1328568 1340765 1354973 1369300 1381345 1393847 1409842 1427075 1442833 1459615 1480333 1502564
56038A502564K0756K1510K5053K6310K5023K6383L0345L1352K9651L1429L6649
$$ 1502564 1523320 1544830 1569883 1596193 1621216 1647599 1677944 1709296 1738947 1770376 1807025
56027A807025L8642L6944L8246M3107M4553M1743M1896M6384M8182M5764M6095
$$ 1807025 1845667 1882611 1920857 1963964 2008517 2050260 2092156 2138540 2186722 2232486 2278581
56016B278581N0940N3782N3329N6237O3137O6178O4042O5071P1765P6593P7026
$$ 2278581 2329521 2383303 2436632 2492869 2556006 2622184 2686226 2751297 2823062 2899655 2976681
56005B976681P9830Q6622R0340R0181R4386J04014J10029J10734J15357J26004
$$ 2976681 3056511 3143133 3233473 3323654 3418040 3522054 3632083 3742817 3858174 3984178
55995C984178J33483J35793J42537J55900J66045J70832J80657J97932K12022
$$ 3984178 4117661 4253454 4395991 4551891 4717936 4888768 5069425 5267357 5479379
55986E479379K20565K34757K57136K76253K90101L11535L43224L71876L95068
$$ 5479379 5699944 5934701 6191837 6468090 6758191 7069726 7412950 7784826 8179894
55977H179894M27668M73243N16809N55386O06502O75937P48156Q20165R12130
$$ 8179894 8607562 9080805 9597614 10153000 10759502 11435439 12183595 13003760 13915890
55968A3915890J031884J163950J307597J488823J720583J991812K311269K717362
$$ 13915890 14947774 16111724 17419321 18908144 20628727 22620539 24931808 27649170
55960B7649170L227465L827229M528291N379193O396974P553922Q861196J0395830
$$ 27649170 30876635 34703864 39232155 44611348 51008322 58562244 67423440 77819270
55952G7819270J2219679J4361026J6904696J9977773K3596015K7663729L2117373
$$ 77819270 90038949 104399975 121304671 141282444 164878459 192542188 224659561
55945B24659561L6647804L9883862L9145151L1864885J7864817J83572j6604607
$$ 224659561 261307365 301191227 340336378 372201263 390066080 390249652 373645045
55938C73645045k9024225l5987590l8227659l7124918l4018387k9993948k5788795
$$ 373645045 344620820 308633230 270405571 233280653 199262266 169268318 143479523
55931A43479523k1788782j8175053j5055282j2458825j0320400q555038p119278
$$ 143479523 121690741 103515688 88460406 76001581 65681181 57126143 50006865
55924E0006865n974256n048337m278255l645249l138025k718846k355049k047473
$$ 50006865 44032609 38984272 34706017 31060768 27922743 25203897 22848848 20801375
55916B0801375j799688j590526j401029j238152j108520r96242q87714p92485
$$ 20801375 19001687 17411161 16010132 14771980 13663460 12667218 11779504 10987019
55908A0987019p19351o55941n90810n32951m91455m56950m20013l87755l66105
$$ 10987019 10267668 9611727 9020917 8487966 7996511 7539561 7119548 6731793 6365688
55899F365688l45018l16632k89905k72626k56519k34246k13927k02736j92491
$$ 6365688 6020670 5704038 5414133 5141507 4884988 4650742 4436815 4234079 4041588
55890D041588j75443j58923j50738j44539j32841j20833j14526j08289r6407q4853
$$ 4041588 3866145 3707222 3556484 3411945 3279104 3158271 3043745 2935456 2839049 2754196
55880B754196p9949p7256p2452p1096p6758q1418p8498p4031p4339p4069o7410
$$ 2754196 2674247 2596991 2524539 2453443 2376685 2295267 2216769 2142738 2068399 1994330 1926920
55869A926920o0102n9057o0008n6571n1986n1237n0482m4958l8916l7549l7098
$$ 1926920 1866818 1807761 1747753 1691182 1639196 1587959 1537477 1492519 1453603 1416054 1378956
55858A378956l2758k8511k9412l1684k9911k6871k7096k7678k4545k1089k1777
$$ 1378956 1346198 1317687 1288275 1256591 1226680 1199809 1172713 1145035 1120490 1099401 1077624
55847A077624k3698k2844k2233k5374k8225k6133k2640k2881k4245k1944j8209
$$ 1077624 1053926 1031082 1008849 983475 955250 929117 906477 883596 859351 837407 819198
55836H19198j7587j8325j6562j4101j4253j4688j2031q895r094j0399r116p218
$$ 819198 801611 783286 766724 752623 738370 723682 711651 702756 693662 683263 674147 666929
55824F66929p972r149p537n713p368j0213j0425r777j1557j3545j1982q740p825
$$ 666929 658957 649808 642271 636558 629190 618977 608552 598775 587218 573673 561691 552951 545126
55811E45126q324p205n509n637n945l996j650j255n77K862O371O794O524Q901
$$ 545126 536802 529597 524088 518451 512506 508510 506860 505605 505028 507890 514261 521055 527579 536480
55797E36480J1724J1435R795J0126J0766Q586N462M726M588J491l081n481o504
$$ 536480 548204 559639 569434 579560 590326 598912 604374 609100 613688 615179 612098 606617 600113
55784F00113q897j1222j0576q806r777j2820j4647j5338j6656j7062j4276j0286
$$ 600113 591216 579994 569418 560612 550835 538015 523368 508030 491374 474312 460036 449750
55772D49750q151o278j578M430Q387J1076J4372J5046Q501l060j2714j7608j9816
$$ 449750 441599 435321 433743 438173 446560 457636 472008 487054 495555 492495 479781 462173 442357
55759D42357k0175j7762j4285j2711j2104r405n380l381l239k032j8k21k616m200
$$ 442357 422182 404420 390135 377424 365320 355915 350535 347154 343915 341883 341865 341644 339028 334828
55745C34828m399n215o455n873l905l293m120l825k037j001j321j449j209j911
$$ 334828 330429 325214 318759 312886 308981 305688 301568 297743 295706 294705 293384 291935 290726 288815
55731B88815l200l527l321m096n177m888m059m606n750n404m146l927m076k677
$$ 288815 285615 282088 278767 274671 269494 264606 260547 255941 250191 244787 240641 236714 232638 229961
55717B29961o57l32r89k34J421J760J499L113N884O823N872N556O010M916K216
$$ 229961 229304 228972 227983 227749 229170 230930 232429 235542 241426 248249 254121 259677 265687 270603 272819
55702B72819K24p63k656n368o773o836p601r012q870p083n901n734m730k731j720
$$ 272819 273043 272280 269624 264256 257483 250647 243046 234034 225164 218081 212180 206446 201716 198985 197265
55687A97265k026j779m81M06O36J440K518K326J443K061M013M891M182L692L695
$$ 197265 195239 193460 192979 193385 194021 195461 197979 200305 201748 203809 207822 212713 216895 220587 224282
55672B24282K461jj496j464j716k842l278k595k310k723k164k07J384J676J733
$$ 224282 226743 226742 225246 223782 222066 219224 215946 213351 211041 208318 206154 205947 207331 209007 210740
55657B10740K115J963J249J230K158K927L344M312N540N588M430L487L091K311
$$ 210740 212855 214818 216067 217297 219455 222382 225726 230038 235578 241166 245596 249083 252174 254485
55643B54485J242Q91R08K7j460k307k981m949p626q985q945r145r667r136p823
$$ 254485 255727 256618 257526 257553 256093 253786 250805 245856 238230 229245 220300 211155 201488 192352 184529
55628A84529p330p291n822l237j909k228k132j011n96j455j991j572j478k035
$$ 184529 177199 169908 164086 160849 158940 156712 154580 153569 152973 151518 149527 147955 146477 144442
55614A44442j952j184j346k525k722j353l66r39j838j921j728j643j072k04k26
$$ 144442 142490 141306 139960 137435 134713 133360 132994 132055 130217 128296 126568 124925 123853 123649 123423
55599A23423j129j526j100q97j005m37N08M97j64J28J085P67p97j399n56k84j362
$$ 123423 122294 120768 119668 118771 117766 117329 117837 118334 118170 118298 119383 120150 119353 117954 117398 117114 115752
55582A15752k001j203k49O6P35K054K726K448K638L606L865L168L335M983O362
$$ 115752 113751 112548 112299 112365 113100 115154 117880 120328 122966 126572 130437 133605 136940 141923 148285
55567A48285O468O405O552N420K690M45j82p86k598m301m651m720n717o825o922
$$ 148285 154753 161158 167710 173130 175820 176265 176083 175297 172699 168398 163747 159027 153310 146485 139563
55552A39563o456n999m913k948j294p31m67P5K10l09m84L5K67p1N4P95R26K86
$$ 139563 133107 127108 122195 119247 117953 117222 116755 116830 117040 116731 116247 116282 116549 116478 116532 117327 118253 118539
55534A18539L36J390J814J010M82R03Q40l25r83l00J48o96j404q55l70j197k279
$$ 118539 118875 120265 122079 123089 123571 124474 125314 124989 124006 123706 123854 123158 121754 120899 120529 119332 117053
55517A17053k405k310k669k375q73L9j015k483k372j321r84j110o43j00n45j430
$$ 117053 114648 112338 109669 107294 106421 106460 105445 102962 100590 99269 98285 97175 96532 96432 95887 94457
55501I4457j574j193j090j048o74o04j198j412n36L63L32K66J066J675Q73m50
$$ 94457 92883 91690 90600 89552 88878 88274 87076 85664 85128 85491 85823 86089 87155 88830 89703 89253
55485H9253p74l19o4K94J377K330K037J116Q04Q46L42l21k47J03k93j123j353
$$ 89253 88479 88160 88096 88390 89767 92097 94134 95250 96054 96900 97242 96921 96674 96777 96484 95361 94008
55468I4008j054j000j121q37l26r4L7L01K46k95m70J69O01J7o88m58N8k09p26
$$ 94008 92954 91954 90833 89996 89670 89576 89613 89914 90160 89865 89395 89564 90165 90182 89494 89036 89094 88885 88159
55449H8159l80M72O45J52p8J86N71J139J912K055R00p51j626j655j532j322o76
$$ 88159 87779 88251 88896 89048 88970 89156 89727 90866 92778 94833 95733 94982 93356 91701 90169 88847 88171
55432H8171J94Q70J394J717J336L30k61k4j1r28j784j511p53o32q76o17k8K33
$$ 88171 88365 89235 90629 92346 93682 94012 93751 93727 93716 92788 91004 89493 88740 88108 87232 86615 86587 86820
55414H6820L41O66P36J17m77j98N94J083J216J168O74p9j28O67R50m7j187j391
$$ 86820 87161 87827 88563 88680 88203 88005 88599 89682 90898 92066 92740 92661 92533 93200 94150 94103 92916 91525
55396I1525j342j787j857q03J91j19p49k10Q14P64L3J40R90J269R69J159J649
$$ 91525 90183 88396 86539 85736 85927 85808 85059 84849 85663 86427 86460 86600 87590 88859 89828 90987 92636
55379I2636J183k61j333j371q69j78N83O89m22j817k114j465r39o00J22P46L97
$$ 92636 93819 93558 92225 90854 89985 89807 90390 91079 90657 88840 86726 85261 84322 83722 83844 84590 84987
55362H4987k93J8J025J182L02k51N0L06K0k50k83m56n22J81J178J206K78k27K10
$$ 84987 84694 84712 85737 86919 87221 86970 87020 87326 87346 87096 86813 86357 85835 86016 87194 88400 88678 88451 88661
55343H8661O16M08K81O56Q24K91l10l29p9p4k02j65kK22O37J138J367J280J160
$$ 88661 89277 89685 89966 90622 91446 91737 91427 91098 91019 90945 90743 90578 90576 90798 91435 92573 93940 95220 96380
55324I6380J080Q58N25K46m5m30o66o09n79p17n36J52N52O7n62l82J57J0n96n79
$$ 96380 97460 98318 98843 99089 99044 98614 97948 97339 96760 96043 95507 95659 96211 96278 95716 95334 95491 95501 94905 94326
55304I4326NLq41j434j078l89q9k2K44O42Q64Q08N59L06K73L60J32n08r48p11
$$ 94326 94331 94334 93493 92059 90981 90592 90503 90481 90725 91367 92231 93039 93598 93904 94177 94537 94669 94161 93213 92502
55284I2502j55J60K69L02n8q69j386j082o28q43j320j127k98M25Q58J256J468
$$ 92502 92347 92507 92776 93078 93020 92151 90765 89683 89055 88212 86892 85765 85467 85892 86750 88006 89474
55267H9474J223Q82Q86R49P06N66R17J142O36P9L74R64O37m51j035p30l62m42
$$ 89474 90697 91579 92465 93414 94120 94686 95603 96745 97381 97460 97834 98798 99435 98984 97949 97219 96857 96415
55249I6415o19n62l07J39N99M78l69j023p48k27m09q81o52M2K27r9k52k99o83
$$ 96415 95796 95234 94927 95066 95665 96143 95774 94751 94003 93776 93367 92486 91834 91876 92103 92004 91752 91453 90770
55230I0770q99j99P87Q45J98L8L35K2q02q79r6J45p28j499j083K2Q27J075R33
$$ 90770 89871 89672 90459 91304 91502 91540 91875 91897 91095 90216 90120 90265 89537 88038 86955 86977 87804 88879 89812
55211H9812N02R2N3J92R5nL72R08R51P58J027J452J129K73N8P01J168Q66K62k48
$$ 89812 90314 90406 90459 90651 90746 90741 91113 92021 92972 93730 94757 96209 97338 97611 97669 98370 99538 100404 100666 100418
55191A00418p98j210j053o10n82q13n68J5Q7l37m53k18l92r51j047o01m16n83
$$ 100418 99620 98410 97357 96747 96165 95352 94784 94799 94886 94549 94096 93878 93486 92535 91488 90887 90471 89888
55173H9888l54K41L34p1LO33P70K51K61J199J878J553J111J305J401O20l55m80
$$ 89888 89534 89775 90109 90038 90041 90674 91444 91695 91956 93155 95033 96586 97697 99002 100403 101023 100668 100188
55155A00188R0N13N33L63M8l41n01l75k73j73K38P01M27o66j641j770j178j72
$$ 100188 100278 100791 101324 101687 101735 101394 100893 100518 100245 100072 100310 101011 101438 100772 99131 97361 96183 96011
55137I6011J004J707J326M13J87O80O73k81j161j180q37o62l35L21O38K11l44
$$ 96011 97015 98722 100048 100461 100648 101328 102001 101720 100559 99379 98542 97880 97545 97866 98504 98715 98371
55120I8371m26l01l16k17J63L98K09n4j23j72j93J37O55P10J99l14o24r15p75
$$ 98371 97945 97644 97328 97111 97274 97672 97881 97827 97704 97532 97339 97476 98131 98841 99040 98726 98102 97187 96412
55101I6412M38K067K559J708R41R26O46m19j027k25Q54O77m01r13m98l1q4m17
$$ 96412 96850 98917 101476 103184 104125 105051 105697 105278 104251 104026 104880 105557 105156 104243 103745 103714 103630 103213
55083A03213n97l43L92J072R04o3q24p35k51Q1K76K53m76j721k323j608l23N55
$$ 103213 102616 102273 102665 103737 104641 104578 103754 103019 102768 102849 103125 103378 102902 101181 98858 97250 96927 97482
55065I7482R71J201J142R07J042J483J241pj097j062n72p20j230j132m60p2k10
$$ 97482 98453 99654 100796 101703 102745 104228 105469 105462 104365 103303 102731 102011 100781 99649 99189 99117 98907
55048I8907l70l07k18j11K18O81R54R34P30N01M56P35J104J168R40O66K42m23
$$ 98907 98537 98230 98012 97901 98119 98800 99754 100688 101418 101919 102375 103110 104214 105382 106322 106988 107230 106807
55030A06807o65K15J491J587K96r06j089q98r28o36K23O12j82j150r65J33J013
$$ 106807 106142 106357 107848 109435 109731 108825 107736 106838 105910 105274 105497 106109 105927 104777 103812 103945 104958
55013A04958J400J768K108J928J124M2r30j397j098m50k22l38Q0J140J743J288
$$ 104958 106358 108126 110234 112162 113286 113328 112398 111001 109903 109453 109231 108893 108973 110113 111856 113144
54997A13144N59K83P4l72l74L92R31M53k49k35n4n40r98k45J241J877J293N55
$$ 113144 113703 113986 114060 113688 113314 113706 114637 115090 114841 114606 114552 114012 113014 112769 114010 115887 117180 117735
54979A17735K92Q7l21n47l30Q6M92Q42R80Q39P02O93L87m55j198j065k19N52Q57
$$ 117735 118027 118114 117793 117246 116916 117002 117494 118336 119316 120155 120857 121550 121937 121482 120284 119219 119000 119552 120409
54960A20409Q27O16L57K47K22ok61O4Q72J151M58l88o52p51j128j178l79M17J26
$$ 120409 121236 121852 122209 122456 122678 122672 122411 122475 123347 124498 124956 124568 123916 123165 122037 120859 120480 120897 121023
54941A21023q79j388j147q03n83j97K28J58m48j124j487j280k76J194K157K161
$$ 121023 120144 118756 117609 116806 116223 116026 116254 116412 115964 114840 113353 112073 111797 112991 115148 117309
54925A17309J912K071K206J794J457K111L505M720N536O183O309N445M133L384
$$ 117309 119221 121292 123498 125292 126749 128860 132365 137085 142621 148804 155113 160558 164691 168075
54911A68075L223K841J949R50q5j567l447n029n735n552m846m168l959m051l778
$$ 168075 171298 174139 176088 177038 176953 175386 171939 166910 161175 155623 150777 146609 142650 138599 134821
54896A34821k952k133j648j137n22l99q60r78l39Q1m23p79L34K323L490L363K825
$$ 134821 131869 129736 128088 126951 126429 126030 125170 124192 123853 123934 123511 122732 123066 125389 128879 132242 135067
54879A35067K411J907J373J293J776K530L432M353M921N134N573O161N680L505
$$ 135067 137478 139385 140758 142051 143827 146357 149789 154142 159063 164197 169770 175931 181611 185116
54865A85116R11o34j531k933m483m915m345m122m658n083m945m625m176l253k172
$$ 185116 186027 185393 183862 180929 176446 171531 167186 163064 158406 153323 148378 143753 139577 136324 134152
54850A34152j680j659j329p29o23j047j276j170j314j754j869j575j429j525j335
$$ 134152 132472 130813 129484 128755 128132 127085 125809 124639 123325 121571 119702 118127 116698 115173 113838
54835A13838p60k30J12M15M44k5m24j29L63J95k22J71J071J081o6j048r84m18
$$ 113838 113078 112848 112960 113375 113819 113794 113370 113241 113604 113799 113577 113748 114819 115900 115834 114786 113802 113384
54817A13384m4K40O38R88J304J733J859J155J42p9M08L64n74j203n34Q63J780
$$ 113384 113340 113580 114218 115206 116510 118243 120102 121257 121399 121320 121728 122092 121518 120315 119781 120644 122424
54800A22424J728R63j4n93m10K22O80Q25P85L00q31j929k086j397n99J80J098
$$ 122424 124152 125115 125101 124508 124098 124320 125000 125825 126610 126910 126079 124150 122064 120667 120068 120248 121346
54783A21346J542P94m24o36K65J025J165J417J951J862R24K77P23J664K233K367
$$ 121346 122888 123682 123258 122622 122887 123912 125077 126494 128445 130307 131231 131508 132231 133895 136128 138495
54767A38495K270J914J563J779K565L451M531O204P802P878O286M541L613K680
$$ 138495 140765 142679 144242 146021 148586 152037 156568 162772 170574 178452 184738 189279 192892 195572
54753A95572P97j513l176m126n008o046o850o973o253m993l925l433k990k068
$$ 195572 196369 194856 191680 187554 182546 176500 169650 162677 156424 151431 147506 144073 141083 139015
54739A39015j182j044j112l86O46N34o97j405q48r5L7J58P69J270J289J519K304
$$ 139015 137833 136789 135677 135291 135937 136471 135774 134369 133521 133426 133463 133621 134390 135660 136949 138468 140772
54722A40772K801K484K222K853L842M331M461M710M825M346L374K105L86j586
$$ 140772 143573 146057 148279 151132 154974 159305 163766 168476 173301 177647 181021 183126 183512 181926
54708A81926l026l615l919m296m413m235m362m777m552l473k629k552k232r62
$$ 181926 178900 175285 171366 167070 162657 158422 154060 149283 144731 141258 138629 136077 133845 132883
54694A32883J78k6r24j135p12o48r33n96N09J343J130K00o14p95l64K42N46M44
$$ 132883 133061 133035 132111 130976 130264 129616 128683 128087 128596 129939 131069 131269 130655 129860 129496 129738 130284 130728
54676A30728O4o63j676k180j347L17J309J015J54o85j584k095j273N00J309L26
$$ 130728 130792 130129 128453 126273 124926 125243 126552 127567 127721 127036 125452 123357 122084 122584 123893 124219
54660A24219q87p38J20K01m50p55m95k09K5L76M44r7o04l92J01J17r3J12M88M17
$$ 124219 123332 122594 122714 122915 122465 121710 121215 121006 121031 121407 121851 121754 121150 120758 120859 120976 120883 120995 121483 121900
54640A21900J36K99P71J001J050J221J142M43k02J17J056J466J072O02M48K67
$$ 121900 122036 122335 123106 124107 125157 126378 127520 127963 127761 127878 128934 130400 131472 132074 132522 132789
54624A32789j94p45j140j216q47k70n6k19n0O17Q48Q1p38n48J89L33j65n68p60
$$ 132789 132595 131850 130710 129494 128647 128377 128321 128102 128052 128669 129517 129598 128860 128312 128501 128834 128669 128101 127341
54605A27341j008r30p8R14J096P51Q34J254J127N04K87N19K85n76j104q15l83
$$ 127341 126333 125403 125325 126239 127335 128086 128920 130174 131301 131805 132092 132611 132896 132320 131216 130401 130018
54588A30018l05j31M52Q29M04l87p01m16j53m16j046j369q39L18J191J135M55
$$ 130018 129713 129582 130034 130863 131267 130880 130179 129763 129610 129194 128148 126779 125940 126258 127449 128584 129039
54571A29039q7j13L08R92J622J750J289O95K72j96p36q15k43K69J79L6N27J178
$$ 129039 128952 128839 129147 130139 131761 133511 134800 135495 135767 135571 134835 134020 133777 134046 134225 134261 134788 135966
54553A35966J049J91m84n00q9M61R31J001P51Q39J412J511M96n63j61J484K778
$$ 135966 137015 137206 136722 136222 136133 136594 137525 138526 139277 140116 141528 143039 143535 142972 142811 144295 147073
54536A47073K873K189J198R9m98j8R07R93J33n53n24m07o58q87q34q21q70m92
$$ 147073 149946 152135 153333 153432 152934 152916 153823 154816 154949 154396 153872 153465 152807 151920 151086 150265 149395 148903
54518A48903K07K61p28j786j814r69j77R2J3j96m76p25q12p41o13m61j63M58J296
$$ 148903 149110 149371 148643 146857 145043 144074 143897 143989 144002 143806 143330 142605 141793 141052 140439 139978 139815 140273 141569
54499A41569J709J048l77j409j428r64o18j47O69J120N60l06k97N27J126J157
$$ 141569 143278 144326 143949 142540 141112 140148 139530 139383 140052 141172 141732 141426 141129 141656 142782 143939
54483A43939J178J390J340R05M86K25m7j47K29O87O03L50Q36J874K195J291R7
$$ 143939 145117 146507 147847 148752 149238 149463 149416 149269 149498 150185 150788 151138 151974 153848 156043 157334 157431
54466A57431m31l55o3M17R84J227J115J136J378J244M68l72p25q29j104j347j049
$$ 157431 157000 156645 156582 156999 157983 159210 160325 161461 162839 164083 164551 164179 163454 162625 161521 160174 159125
54449A59125k22N20N63r9q21r58o68o79j096j082k79L21j96j077r02K87J199J255
$$ 159125 158903 159423 159986 159887 159066 158108 157440 156761 155665 154583 154304 154625 154429 153352 152450 152737 153936 155191
54431A55191J029Q80N54J55J24J36n79j687j872q37J71K43j07k17k08r4P20K175
$$ 155191 156220 157100 157654 157809 157933 158069 157490 155803 153931 153094 153265 153508 153401 153184 152976 152882 153602 155777
54413A55777K958K133N17m62n03k68j52j10j10j18O8M03M84K13N5K89O01P42R26
$$ 155777 158735 160868 161385 160923 160420 160152 160000 159890 159780 159662 159730 160133 160617 160830 160885 161174 161775 162517 163443
54394A63443J233J346J241J363J684J484N39l17m21k67n14q67o81j24J70Q2p1
$$ 163443 164676 166022 167263 168626 170310 171794 172333 172016 171595 171328 170814 169947 169266 169142 169312 169394 169323
54377A69323j97l05j62K87N40K20k41k33J50M41O28R37J162R33L66j42n57r56
$$ 169323 169126 168821 168659 168946 169486 169706 169465 169232 169382 169823 170451 171388 172550 173483 173849 173707 173150 172194
54359A72194r97l06P07J176R21O08P05Q36M26m37j117j256j205j524k177k433
$$ 172194 171197 170891 171598 172774 173695 174303 175008 175844 176270 175833 174716 173460 172255 170731 168554 166121
54343A66121j734m81L44K42m40j095j390j229o88j04J72J87K13J86j69o27n45
$$ 166121 164387 163906 164250 164492 164052 162957 161567 160338 159650 159546 159718 159905 160118 160304 160135 159508 158963
54326A58963K15R67J135J001J125J457J419O53n37j472j725j589j732k246k336
$$ 158963 159178 160145 161280 162281 163406 164863 166282 166935 166398 164926 163201 161612 159880 157634 155298
54311A55298j418j02N10K75j8P6K95M69P53R37N16l86r61q82o35n17j95L70N21
$$ 155298 153880 153778 154288 154563 154545 154621 154916 155385 156138 157075 157591 157205 156244 155362 154727 154210 154015 154385 154906
54292A54906o0o77n47K10R75J418J466J073M91K09K65J60k79n74m71l64n29o00
$$ 154906 154846 154169 153622 153832 154807 156225 157691 158764 159255 159464 159729 159889 159610 159036 158565 158201 157672 157072
54274A57072k97L0l6l91p69j073j056l82O39J153R10N48M07J1p63j086m85K30
$$ 157072 156775 156805 156769 156378 155609 154536 153480 153098 153737 154890 155800 156348 156755 156766 156003 154917 154432 154662
54256A54662K33K7N33J498J939J669J315J150Q44K67k77o17q06q26o48m32k74
$$ 154662 154895 154922 155455 156953 158892 160561 161876 163026 163870 164137 163860 163243 162437 161611 160963 160531 160257
54239A60257j3L39L97Ll91m42m04n20m48P9O38P76P72R98J078M96l52o08j53L42
$$ 160257 160244 160583 160980 160983 160592 160150 159746 159226 158778 158857 159495 160271 161043 162041 163119 163615 163263 162655 162502 162844
54219A62844M06J39j74k75J5M80N28m7p23j065j321j673j643r22j89j40m09l35
$$ 162844 163250 163389 163215 162940 162955 163435 163963 163916 163193 162128 160807 159134 157491 156569 156380 156240 155831 155496
54201A55496k50q09j478j035M82J617J385L35m76n96r6P25J238Q44j83q47o30
$$ 155496 155246 154437 152959 151924 152406 154023 155408 155743 155267 154671 154575 155300 156538 157382 157199 156352 155722
54184A55722q9L8k77n92o37m10P4P55J403J712J484Q21K26K49Q52J270P99m23
$$ 155722 155633 155671 155394 154802 154165 153755 153829 154584 155987 157699 159183 160004 160230 160479 161331 162601 163400 162977
54166A62977j590k064j762j030l92k18l31k20K28N24L86J82K68L77J91p4j22j75
$$ 162977 161387 159323 157561 156531 156139 155921 155590 155370 155598 156122 156508 156690 156958 157335 157526 157452 157330 157155
54148A57155m41n15pN76M24l56q71o76j42K78M91M89K45p5k14j44P8M98R83J103
$$ 157155 156714 156199 156192 156768 157192 156836 155965 155289 155147 155425 155916 156405 156650 156575 156361 156217 156295 156793 157776 158879
54128A58879P80O25J006J269O03n75j004k24R20J427J153O57N95J235K113K315
$$ 158879 159659 160284 161290 162559 163162 162587 161583 161359 162279 163706 164859 165516 166111 167346 169459 171774
54112A71774J584Q00Q68J443J442O00l49q13q88p63m49j12j1o4KJ14Rk25l32m25
$$ 171774 173358 174158 175026 176469 177911 178511 178162 177349 176461 175698 175249 175137 175126 175062 175064 175178 175187 174962 174630 174205
54092A74205o60o41O1R91J318J150J351K056K389J925J460J922L200M507N328
$$ 174205 173545 172904 172965 173956 175274 176424 177775 179831 182220 184145 185605 187527 190727 195234 200562
54077B00562N643N636N486N150M192K200m99k904m237m464m032l425k985k718
$$ 200562 206205 211841 217327 222477 226669 228869 228370 225466 221229 216765 212733 209308 206323 203605
54063B03605k388k021k038k428k353j293j71l21j550k295j745o53J01O58J394
$$ 203605 201217 199196 197158 194730 192377 191084 190913 190592 189042 186747 185002 184349 184450 185108 186502
54048A86502K003K015J697J776K556L652M379M282L624L314L984N155N823N818
$$ 186502 188505 190520 192217 193993 196549 200201 204580 208862 212486 215800 219784 224939 230762 236580
54034B36580N860O318O684O466N872N382N205N348N621N515M729L851L779M352
$$ 236580 242440 248758 255442 261908 267780 273162 278367 283715 289336 294851 299580 303431 307210 311562
54020C11562M450L677K911K773K535J218r45k929m234n103n838o571p396q156
$$ 311562 316012 319689 322600 325373 327908 329126 328181 325252 321018 315915 310077 303506 296110 287954
54006B87954q335p700o750o101n623m791l618k733k505k600k437j904j430j482
$$ 287954 279619 271919 265169 259068 253445 248654 245036 242303 239798 237198 234761 232857 231427 229945
53992B29945k021k541k707k740k925l058k776k263k024k021j681q37n8J53j47
$$ 229945 227924 225383 222676 219936 217011 213953 211177 208914 206890 204869 203188 202351 202293 202446 202299
53977B02299o61j116j104l73N51P85L39K27R04J515J171K62k69k85l06m61m04
$$ 202299 201638 200522 199418 199045 199596 200381 200720 200947 201851 203366 204537 204799 204530 204245 203939 203478 203074
53960B03074k4N19J304K446L465L561K619J436Q29R04J258J561J744J892K084
$$ 203074 203050 203569 204873 207319 210784 214345 216964 218400 219229 220133 221391 222952 224696 226588 228672
53945B28672K252K279K274K629L620N012O276P116P716Q471R570J0837J1874J2444
$$ 228672 230924 233203 235477 238106 241726 246738 253014 260130 267846 276317 285887 296724 308598 321042
53931C21042J2620J2425J1425R010N125M99l807o912q295p948o452m588k786j178
$$ 321042 333662 346087 357512 366522 371647 372146 368339 361427 353132 345184 338732 334144 331358 330180
53917C30180K5P39J488K969M922O139N984N283N247N944O449O114N065L593J761
$$ 330180 330205 330944 332432 335401 340323 346462 352446 357729 362976 368920 375369 381483 386548 390141 391902
53902C91902k49j938k854k994k684k207j662j159r98j526k791m338n581o273o588
$$ 391902 391653 389715 386861 383867 381183 378976 377314 376155 375157 373631 370840 366502 360921 354648 348060
53887C48060o814p106p428p525p099o243n550n498n890o115n854n163m135k948
$$ 348060 341246 334140 326712 319187 312088 305845 300295 294797 288907 282792 276938 271775 267640 264692
53873B64692k070j868k073k147k097k311k675k676k362k368k775k784k001j197
$$ 264692 262622 260754 258681 256534 254437 252126 249451 246775 244413 242045 239270 236486 234485 233288
53859B33288j220j770j955j663j543j855k081j771j200r70j254j673j741j380
$$ 233288 232068 230298 228343 226680 225137 223282 221201 219430 218230 217260 216006 214333 212592 211212
53845B11212r48q30j002j139j024p48m51q1N26J384K165K317J540K47p59j149
$$ 211212 210264 209434 208432 207293 206269 205521 205070 204989 205515 206899 209064 211381 212921 213168 212409 211260
53829B11260j300j460j270n69l8l29r39p72L50J568K221K323J988J313Q07R42
$$ 211260 209960 208500 207230 206661 206623 206294 205355 204583 204933 206501 208722 211045 213033 214346 215153 216095
53813B16095J256Q77Q1J53J470K888L495L759M297M641M152L367L282L899M435
$$ 216095 217351 218228 218309 218462 219932 222820 226315 230074 234371 239012 243164 246531 249813 253712 258147
53798B58147M632M898N363N598N252M452L573K947K695K534K019J212P01O92O24
$$ 258147 262779 267677 273040 278638 283890 288342 291915 294862 297557 300091 302110 303322 304023 304715 305339
53783C05339P7n27o38n01p13j340k072k916m052n200n739n439m586l632l061l240
$$ 305339 305416 304889 304251 303750 303037 301697 299625 296709 292657 287457 281718 276279 271693 268061 265000 261760
53767B61760l900m066l110j726j190j822k707k983k796k805l185l350k695j444
$$ 261760 257860 253794 250684 248958 247768 245946 243239 240256 237460 234655 231470 228120 225425 223981
53753B23981o00q19j494j493p04j71m72q72n48J19K56n8L3P30J274J079N10L52
$$ 223981 223381 222562 221068 219575 218871 218700 218228 217356 216808 216927 217183 217125 217158 217888 219162 220241 220751 221103
53735B21103R36J860K354J905P91j48l63r4J67L42N69P77P88P20Q91J431K195
$$ 221103 222039 223899 226253 228158 228949 228801 228438 228344 228511 228853 229422 230199 230987 231707 232598 234029 236224
53718B36224K913L258L118K891L087L440L013J586K95L55J533K554K704K359K140
$$ 236224 239137 242395 245513 248404 251491 254931 257944 259530 259825 260180 261713 264267 266971 269330 271470
53703B71470K149K133J905J559J378J549J884K093K269K762L503M005M050L776
$$ 271470 273619 275752 277657 279216 280594 282143 284027 286120 288389 291151 294654 298659 302709 306485
53689C06485K981J281p23j519n81O73O95k23p16m44j99l92o01o09p60j166j377
$$ 306485 309466 310747 310024 308505 307924 308597 309292 309069 308353 307909 307710 307318 306717 306108 305348 304182 302805
53672C02805j080n13j10j08m98r45r17l53N6l05j128j699j848j830j638j161p32
$$ 302805 301725 301212 301102 300994 300496 299551 298634 298281 298337 298032 296904 295205 293357 291527 289889 288728 287996
53655B87996p18p76l05N42J081J126J013Q11L56j5K60R63J230Q63O18J011J639
$$ 287996 287278 286502 286197 286739 287820 288946 289959 290770 291126 291111 291371 292334 293564 294427 295045 296056 297695
53638B97695J960K011J974J678R96L71M26J207K123K543K326J851J585J640J837
$$ 297695 299655 301666 303640 305318 306314 306685 307111 308318 310441 312984 315310 317161 318746 320386 322223
53623C22223K141K703L446L996M271M580M986N122M936N007N601O133O150O173
$$ 322223 324364 327067 330513 334509 338780 343360 348346 353468 358404 363411 369012 375145 381295 387468
53609C87468O765P447P379O613N773N012M235L821L998L890K445J16j571j947
$$ 387468 394233 401680 409059 415672 421445 426457 430692 434513 438511 442401 444846 444962 443391 441444
53595D41444j669j377j141j088j423j749j523j197j667k613k669j545n90q62j865
$$ 441444 439775 438398 437257 436169 434746 432997 431474 430277 428610 425997 423328 421783 421193 420331 418466
53580D18466k675l129l379l223k654k160k005j886j716j848k146j778n94K89p5
$$ 418466 415791 412662 409283 406060 403406 401246 399241 397355 395639 393791 391645 389867 389273 389562 389487
53565C89487j160j815j688j178n86j7L16L54L94N61N90M46N87J199J705J586J140
$$ 389487 388327 386512 384824 383646 383060 383043 383359 383713 384107 384668 385258 385704 386291 387490 389195 390781 391921
53548C91921R32R67R01P29P92J347K390L581M346M455M535N314O418O765O240
$$ 391921 392853 393820 394721 395450 396242 397589 399979 403560 407906 412361 416896 422210 428628 435393 441633
53533D41633N911O339O833O914P300Q703J0628J2197J3315J4131J4255J3522J2835
$$ 441633 447544 453883 460716 467630 474930 483633 494261 506458 519773 533904 548159 561681 574516
53520E74516J3192J4387J5592J6684J8015J9354K0200K0789K1789K3159K4293
$$ 574516 587708 602095 617687 634371 652386 671740 691940 712729 734518 757677 781970
53509G81970K5086K5913K6725K7123K7239K7592K8105K8094K7351K6452K5843
$$ 781970 807056 832969 859694 886817 914056 941648 969753 997847 1025198 1051650 1077493
53498A077493K5320K4609K3817K3146K2552K1899K1131K0296J9648J9546J9898
$$ 1077493 1102813 1127422 1151239 1174385 1196937 1218836 1239967 1260263 1279911 1299457 1319355
53487A319355K0011J9439J8661J8370J8383J7975J7076J6362J6188J6169J5862
$$ 1319355 1339366 1358805 1377466 1395836 1414219 1432194 1449270 1465632 1481820 1497989 1513851
53476A513851J5122J3785J1611Q815O085L841J899j14k434n253q607j2047j4881
$$ 1513851 1528973 1542758 1554369 1563184 1569269 1573110 1575009 1574895 1572461 1567208 1558601 1546554 1531673
53463A531673j6828j8024j8474j8058j7181j6756j7323j8680k0501k2657k4719
$$ 1531673 1514845 1496821 1478347 1460289 1443108 1426352 1409029 1390349 1369848 1347191 1322472
53452A322472k5782k5404k4267k3416k3081k2758k2139k1429k0771j9966j8852
$$ 1322472 1296690 1271286 1247019 1223603 1200522 1177764 1155625 1134196 1113425 1093459 1074607
53441A074607j7527j5973j3828j0888p682n127l669k968k508k066j430j34K009
$$ 1074607 1057080 1041107 1027279 1016391 1008709 1003582 999913 996945 994437 992371 990941 990807 992816
53428I92816M384O095P054Q003R440J1098J2605J4075J5669J7211J8626K0263
$$ 992816 997200 1003295 1010349 1018352 1027792 1038890 1051495 1065570 1081239 1098450 1117076 1137339
53416A137339K2261K4041K5083K5913K7487K9733L1555L2329L2753L3919L6080
$$ 1137339 1159600 1183641 1208724 1234637 1262124 1291857 1323412 1355741 1388494 1422413 1458493
53405A458493L8683M1225M3637M6075M8673N1427N4121N6375N7978N9094O0036
$$ 1458493 1497176 1538401 1582038 1628113 1676786 1728213 1782334 1838709 1896687 1955781 2015817
53394B015817O0876O1420O1549O1467O1520O1736O1711O1011N9680N8081N6343
$$ 2015817 2076693 2138113 2199662 2261129 2322649 2384385 2446096 2507107 2566787 2624868 2681211
53383B681211N4113N1056M7330M3418L9686L6183L2734K8999K4639J9626J4424
$$ 2681211 2735324 2786380 2833710 2877128 2916814 2952997 2985731 3014730 3039369 3058995 3073419
53372C073419R536M975K85m989j1024j7917k5834l4785m4132n2523n8557o1839
$$ 3073419 3082955 3087930 3088215 3083226 3072202 3054285 3028451 2993666 2949534 2897011 2838454 2776615
53360B776615o3299o4256o5177o5561o5003o3888o2837o1818o0240n7800n4927
$$ 2776615 2713316 2649060 2583883 2518322 2453319 2389431 2326594 2264776 2204536 2146736 2091809
53349B091809n2290n0153m8336m6795m5966m6280m7267m7574m6206m3515m0527
$$ 2091809 2039519 1989366 1941030 1894235 1848269 1801989 1754722 1707148 1660942 1617427 1576900
53338A576900l7609l4381l0906k8029k6202k4670k2393j9365j6448j4176j2374
$$ 1576900 1539291 1504910 1474004 1445975 1419773 1395103 1372710 1353345 1336897 1322721 1310347
53327A310347j0870r952r981j0855j2032j2934j3162j2506j0967q941p227o475
$$ 1310347 1299477 1289525 1279544 1268689 1256657 1243723 1230561 1218055 1207088 1198147 1190920 1184445
53315A184445o477o231n003l116j345J58J826L783N623P035Q000Q468Q519Q946
$$ 1184445 1177968 1171737 1166734 1163618 1162273 1162431 1164257 1168040 1173663 1180698 1188698 1197166 1205685 1214631
53301A214631J0703J3567J6141J7707J9169K1653K4850K7484K8865K9316K9444
$$ 1214631 1225334 1238901 1255042 1272749 1291918 1313571 1338421 1365905 1394770 1424086 1453530
53290A453530K9761L0567L1506L1484K9795K7116K4778K3248K1936K0256J8153
$$ 1453530 1483291 1513858 1545364 1576848 1606643 1633759 1658537 1681785 1703721 1723977 1742130
53279A742130J5629J2579R116N492J630k708p182j0902j3470j5523j7965k0906
$$ 1742130 1757759 1770338 1779454 1784946 1786576 1783868 1776686 1765784 1752314 1736791 1718826 1697920
53267A697920k3660k5639k7013k8424l0142l1756l2745l3181l3574l4127l4615
$$ 1697920 1674260 1648621 1621608 1593184 1563042 1531286 1498541 1465360 1431786 1397659 1363044
53256A363044l4918l5153l5198l4739l3914l3267l2768l1667k9742k8003k7464
$$ 1363044 1328126 1292973 1257775 1223036 1189122 1155855 1123087 1091420 1061678 1033675 1006211
53245A006211k7837k8112k7925k7557k7038k6170k5151k4344k3552k2263k0458
$$ 1006211 978374 950262 922337 894780 867742 841572 816421 792077 768525 746262 725804
53234G25804j8512j6483j4201j1946j0274r178q161p121o536o704p410q321r183
$$ 725804 707292 690809 676608 664662 654388 645210 637049 629928 623392 616688 609278 600957 591774
53221E91774r656r585r444r953j1173j2460j3256j3476j3236j2699j2108j1531
$$ 591774 582118 572533 563089 553136 541963 529503 516247 502771 489535 476836 464728 453197
53209D53197j0658r342q034p205o685o225o186o821p367o986o332o794q215q818
$$ 453197 442539 433197 425163 417958 411273 405048 398862 392041 384674 377688 371356 364562 356347 347529
53195C47529p689n963n030m830m659m448m394m219l725l399l508l313k158p94
$$ 347529 339840 333877 328847 324017 319358 314910 310516 306297 302572 299173 295665 292352 290194 289400
53181B89400n12j299j946j867j767k347l254l642l162k052p29L78Q31M87k78q38
$$ 289400 288888 287589 285643 283776 282009 279662 276408 272766 269604 267552 266823 267201 268032 268519 268241 267403
53165B67403q95p48r15j491j928j648p84o7J2l77q58j331j761j896j543r82o94
$$ 267403 266508 265760 264845 263354 261426 259778 258994 258927 258939 258562 257704 256373 254612 252716 251173 250191 249497
53148B49497p75q98q73q88j138j411j278o17K52R70J535K102K545K501J903J162
$$ 249497 248722 247824 246951 246063 244925 243514 242236 241619 241871 242841 244376 246478 249023 251524 253427 254589
53132B54589O39K76j30m83n41k58J99O48Q46O32K66K85P03Q63M78K47Q02J602
$$ 254589 255228 255504 255374 254891 254350 254092 254291 254939 255785 256417 256683 256968 257671 258534 259012 259259 260061 261663
53114B61663J735J378J412J819J656P25K9K14N67J10j089k276k987l215l111l000
$$ 261663 263398 264776 266188 268007 269663 270388 270417 270631 271198 271308 270219 267943 264956 261741 258630 255630
53098B55630l146l186k360o95P08J038P50O20N50Q4m66l96J34K17m43j049q07
$$ 255630 252484 249298 246938 246243 246951 247989 248739 249359 249909 249993 249527 249131 249265 249482 249039 247990 247183
53081B47183N5O83N90N1m12o54r88j547j803j071M50J632J662R00K35Ko6k07m43
$$ 247183 247238 247921 248511 248562 248150 247496 246508 244961 243158 242087 242537 244169 245831 246731 246966 246968 246902 246695 246252
53062B46252q42j401j808j714j272r66r96j109r89n44K21J191K000K141J456M99
$$ 246252 245410 244009 242201 240487 239215 238249 237253 236144 235155 234611 234832 236023 238023 240164 241620 242119
53046B42119J83Q93J872J826M15j119j296k12O54L88m53j046j454j964k099j277
$$ 242119 242302 243195 245067 246893 247308 246189 244893 244681 245335 245723 245270 244224 242770 240806 238707 237430
53030B37430j3M90j43j086j536j504j334j029l97N26J447K012J962J376P40N35
$$ 237430 237417 237907 237764 236678 235142 233638 232304 231275 230878 231404 232851 234863 236825 238201 238941 239476
53014B39476O87P46N83N49Q66J183J043N64K89M50O12K84l22n05q5K01k84j008
$$ 239476 240163 240909 241492 242041 242907 244090 245133 245697 245986 246436 247048 247332 247010 246505 246420 246621 246337 245329
52996B45329q50K42R87M42p37j221o81J21O00Q76J166J355J373J416J580J664
$$ 245329 244479 244721 245708 246150 245413 244192 243511 243632 244232 245108 246274 247629 249002 250418 251998 253662
52980B53662J560J469J513J391P63j96q69p84k3R51J706K110K266K289K185J973
$$ 253662 255222 256691 258204 259595 260358 260162 259293 258509 258486 259437 261143 263253 265519 267808 269993 271966
52964B71966J718J432J017M90J74M59J288K016J945R77l11j301j892k396k927
$$ 271966 273684 275116 276133 276623 276797 277256 278544 280560 282505 283482 283171 281870 279978 277582 274655
52949B74655l175k890k344k021j985j800j190m96l58j006j865j960q69O38J233
$$ 274655 271480 268590 266246 264225 262240 260440 259250 258754 258396 257390 255525 253565 252696 253334 254567
52934B54567M94n87q82n02l46o25p08l20Kj43m18n01o86j236j674j347l47N99
$$ 254567 255061 254474 253592 253090 252744 252119 251411 251091 251093 250950 250532 250031 249345 248109 246435 245088 244741 245340
52916B45340R14N36k66r87j133p32l38l06l84l33m14q43j174q29L5P18P92L05
$$ 245340 246254 246790 246524 245537 244404 243672 243334 243028 242644 242311 241897 241054 239880 239051 239086 239804 240596 240901
52898B40901n28j333j534r41j61J85L45R13J654J658P00l92p92n15n3K16J46j31
$$ 240901 240373 239040 237506 236565 236404 236589 236934 237847 239501 241159 241859 241467 240675 240160 240107 240323 240469 240338
52880B40338j25M53J047Q43Q9j5Q90J615J113R8J1R18J588J457J288J619J721
$$ 240338 240213 240666 241713 242556 242645 242630 243520 245135 246248 246346 246357 247275 248863 250320 251608 253227 254948
52863B54948Q62k37k51Q22J644J484J109J356J746J369N13L08Q81R17n59k810
$$ 254948 255810 255573 255322 256144 257788 259272 260381 261737 263483 264852 265365 265673 266554 267471 266912 264102
52847B64102m307m516m157m004m039l768k901j637n10J4j35o40j186j570j464
$$ 264102 259795 255279 251122 247118 243079 239311 236410 234773 234263 234277 234142 233502 232316 230746 229282
52832B29282n36R22J884J600M86l64m12J3M70P96Q30K88p75j750k031j560p08
$$ 229282 228746 229668 231552 233152 233638 233274 232862 232875 233345 234141 234971 235259 234484 232734 230703 229143 228435
52815B28435J60P50P54R8p27r62l65N15J032J235J631K246K410J618K20j085j985
$$ 228435 228595 229345 230099 230197 229470 228508 228143 228658 229690 230925 232556 234802 237212 238830 239050 237965 235980
52798B35980k417k089r54J49J44q61j629j433q11m35j34L33L96m91j625j668l69
$$ 235980 233563 231474 230520 230669 230813 229952 228323 226890 226079 225644 225510 225843 226239 225748 224123 222455 222086
52781B22086J107J595J058K94K2L78R24J090P93M62L46J87j39j47M66J041P52
$$ 222086 223193 224788 225846 226140 226162 226540 227464 228554 229347 229809 230155 230342 230203 230056 230522 231563 232315
52764B32315j56q16j177j945l036l280k098m87L16M01O35J167J372J050P14O21
$$ 232315 232159 231343 230166 228221 225185 221905 219807 219320 219636 220037 220672 221839 223211 224261 224975 225596
52748B25596L67k45n24K44J625K379K023J474J768K702L230L004K736K942L117
$$ 225596 225963 225718 225194 225438 227063 229442 231465 232939 234707 237409 240639 243643 246379 249321 252438
52733B52438K543J390M78K38M21O09N60J93l41o79o90p62j233j820k024j885j790
$$ 252438 254981 256371 256849 257087 257508 258117 258677 258870 258529 257850 257160 256398 255165 253345 251321 249436 247646
52716B47646j717j309o74l58m94o09m48l77o47q82p52o04r29j444j380n61K73
$$ 247646 245929 244620 243946 243588 243094 242485 242037 241660 241013 240131 239379 238775 237846 236402 235022 234461 234734
52699B34734L95n3l25j5N33P43M90J74K00O23J212J701J873J675J339J166J119
$$ 234734 235129 235076 234751 234736 235269 236012 236502 236676 236876 237499 238711 240412 242285 243960 245299 246465 247584
52682B47584Q10Q7o14p49l10J42J5q52k038k746k448j423m24K95J112K089K502
$$ 247584 248394 248481 247867 247118 246808 246950 246965 246113 244075 241329 238881 237458 237034 237329 238441 240530 243032
52665B43032J786M70l59k33M62J156J483J344J031J023J306J227N04j21J93J236
$$ 243032 244818 245288 244929 244696 245158 246314 247797 249141 250172 251195 252501 253728 254232 254111 254304 255540
52649B55540K169K655K766K223P27j088k084j985j536j309j244j244j335j164
$$ 255540 257709 260364 263130 265353 266080 264992 262908 260923 259387 258078 256834 255590 254255 253091
52635B53091l37O82R09K76k22j8M06O13Q50J237J284Q93P90J295J530N96j045
$$ 253091 252754 253436 254345 254621 254399 254381 254787 255400 256250 257487 258771 259664 260454 261749 263279 263875 262830
52618B62830k231k537k270j592n52L43M62j09p11r53q71m61K82R89J153Q03M12
$$ 262830 260599 258062 255792 254200 253648 253991 254453 254344 253633 252680 251809 251348 251630 252619 253772 254575 254987
52601B54987J98n0m30p25p70o55m64j21M01Q57Q82L29n28j142j179q17m44j15
$$ 254987 255185 255135 254705 253980 253210 252555 252091 251970 252371 253228 254110 254439 253911 252769 251590 250773 250329 250214
52583B50214L44Q23R33O56M51O07Q91J108J437J955K255J958J239N03j23n58m44
$$ 250214 250558 251381 252314 252970 253421 254028 254919 256027 257464 259419 261674 263632 264871 265374 265251 264693 264249
52566B64249M07J442J768J000m91k028k986l007k272j433r47o12o6N06N78O8n25
$$ 264249 264656 266098 267866 268866 268375 266347 263361 260354 258082 256649 255702 255090 255024 255530 256108 256176 255651
52549B55651p22m94j05K08L84N12O06M55j48r31j253q32o6N05O97N34Q7k54R6
$$ 255651 254929 254435 254330 254538 254922 255434 256040 256495 256347 255416 254163 253331 253265 253770 254467 255001 255088 254834 254930
52530B54930J058J646J154K14j2N90J051P77K74K94Q84J503J720J509J153R72
$$ 254930 255988 257634 258788 259002 258990 259580 260631 261408 261682 261976 262860 264363 266083 267592 268745 269717
52514B69717J075J322J599J969K405K538K140J684J952K980L784L331J638k62
$$ 269717 270792 272114 273713 275682 278087 280625 282765 284449 286401 289381 293165 296496 298134 297872
52500B97872j318j360j101j329k164l160l952m491m650m062k736j411q81j073
$$ 297872 296554 295194 294093 292764 290600 287440 283488 278997 274347 270285 267549 266138 265257 264184
52486B64184j182o58K47Q72Q31L29o0J13P44J312J474J328J096Q29O21P06J054
$$ 264184 263002 262344 262591 263463 264294 264623 264563 264676 265420 266732 268206 269534 270630 271459 272080 272786 273840
52469B73840J246J073R77J467K285K672K303J600J162J267J833K555L000K873
$$ 273840 275086 276159 277136 278603 280888 283560 285863 287463 288625 289892 291725 294280 297280 300153
52455C00153K150Q54j013l082m405m239k984j947k040k980l775l775l138k445
$$ 300153 302303 303157 302144 299062 294657 290418 287434 285487 283447 280467 276692 272917 269779 267334
52441B67334j961j417n92J15J17l92n35J9N67N15K36K59K96p7l22L67J548J890
$$ 267334 265373 263956 263364 263479 263596 263204 262669 262688 263255 263770 264006 264265 264561 264484 264162 264529 266077 267967
52423B67967J040N4k61l18o50q53l65M65R18J066J614K754L833M174L729K939
$$ 267967 269007 269061 268800 268482 267832 266979 266614 267079 267997 269063 270677 273431 277264 281438 285167 288106
52407B88106K382K637M060O447R087J1231J2483J2661J1483Q620M182q82n111
$$ 288106 290488 293125 297185 303632 312719 323950 336433 349094 360577 369197 373379 372497 367386
52394C67386p494q166q104q101q147p738o639n155l759k578j446m09Q5k13p35
$$ 367386 359892 351726 343622 335521 327374 319636 312997 307842 304083 301505 300059 299650 299735 299522 298787
52379B98787n65M50J494J883J904K206K830L316L522L727M107M611N208N790N897
$$ 298787 298222 298672 300166 302049 303953 306159 308989 312305 315827 319554 323661 328272 333480 339270 345167
52364C45167N079L537J887L71j123k268k342j299k13j41r32j612j597j025j68
$$ 345167 350246 353783 355670 356041 354918 352650 350308 349009 348796 348655 347723 346111 344514 343489 343321
52349C43321R05J996K660K695K519K714L273L557L123K333J870J905K124K488
$$ 343321 344226 346222 348882 351577 354096 356810 360083 363640 366763 369096 370966 372871 374995 377483
52335C77483L347M667N811O509P450R292J1482J2843J3088J2999J3272J3932J4876
$$ 377483 380830 385497 391308 397817 405267 414559 426041 438884 451972 464971 478243 492175 507051
52322E07051J6163J7563J8556J9007J9247J9319J8856J7955J7391J7553J7856
$$ 507051 523214 540777 559333 578340 597587 616906 635762 653717 671108 688661 706517
52311G06517J7656J7149J6812J6555J6108J5707J5630J5430J4485J3094J2197
$$ 706517 724173 741322 758134 774689 790797 806504 822134 837564 852049 865143 877340
52300H77340J2035J1874J1123R977Q871P888O934N882M338J806j597m958p384
$$ 877340 889375 901249 912372 922349 931220 939108 946042 951924 956262 958068 956471 951513 944129
52287I44129q690r189r258r248r382r360q603p153n824n040m070k087M88K498
$$ 944129 935439 926250 916992 907744 898362 889002 880399 873246 867422 862382 858312 856225 856713 859211
52273H59211L668M759O232P654Q635R519J0696J1961J2918J3455J3427J2597J1381
$$ 859211 862879 867638 873870 881524 890159 899678 910374 922335 935253 948708 962135 974732 986113
52260I86113J0995J2034J3431J3679J2707J1683J1216J0840J0248R879R937R808
$$ 986113 997108 1009142 1022573 1036252 1048959 1060642 1071858 1082698 1092946 1102825 1112762 1122570
52248A122570Q904P425N742L668Q90k345n467q125j0126j1258j1712j2222j3256
$$ 1122570 1131474 1138899 1144641 1148309 1149199 1146854 1141387 1133262 1123136 1111878 1100166 1087944 1074688
52235A074688j4308j4521j3799j2840j2188j1822j1504j1114j0560r724q575p269
$$ 1074688 1060380 1045859 1032060 1019220 1007032 995210 983706 972592 962032 952308 943733 936464
52223I36464o160n665n781n743m654k662r38k08Q7P25J520J931K266L254M703
$$ 936464 930304 924639 918858 913115 908461 905799 904861 904653 904740 905465 906985 908916 911182 914436 919139
52208I19139N582N492N201N474O103O317N669M323K877K067K250L020L649L847
$$ 919139 924721 930213 935414 940888 946991 953308 958977 963300 966177 968244 970494 973514 977163 981010
52194I81010L786L533L022K587K828L783M693M844M284L544K942K346J437P9j431
$$ 981010 984796 988329 991351 993938 996766 1000549 1005242 1010086 1014370 1017914 1020856 1023202 1024639 1024718 1023287
52179A023287k648l629m999o989q794r521r410r396r536q847o866m512k958k310
$$ 1023287 1020639 1017010 1012011 1005022 996228 986707 977297 967901 958365 949518 942652 938140 935182 932872
52165I32872j870j205m62J55P54J637K949M363N222N232M803M418L877K741J324
$$ 932872 931002 929797 929335 929490 930244 931881 934830 939193 944415 949647 954450 958868 962745 965486 966810
52150I66810M70M15O11P00Q73J104R84N55N24J237K129K588K675K573K134J430
$$ 966810 967280 967695 968306 969006 969879 970983 971967 972522 973046 974283 976412 979000 981675 984248 986382 987812
52134I87812J082J463K175K924M082N850P610R028J0984J4355J8336K1226K2638
$$ 987812 988894 990357 992532 995456 999538 1005388 1012998 1022026 1033010 1047365 1065701 1086927 1109565
52121A109565K3801K5669K7868K9615L0677L1062L0621K9444K8033K6684K5041
$$ 1109565 1133366 1159035 1186903 1216518 1247195 1278257 1308878 1338322 1366355 1393039 1418080
52110A418080K2624J9487J6199J3337J1118R170O792L819J189O0L14N80m5j050
$$ 1418080 1440704 1460191 1476390 1489727 1500845 1510015 1516807 1520626 1521815 1521875 1522189 1522769 1522724 1521674
52096A521674j585j832k629m165n798p021p939q834r874j1432j4036j7567k0758
$$ 1521674 1520089 1518257 1515628 1511463 1505665 1498644 1490705 1481871 1471997 1460565 1446529 1428962 1408204
52083A408204k2034k0918j8299j5391j2713j0168p661n214k653K41L203N567P106
$$ 1408204 1386170 1365252 1346953 1331562 1318849 1308681 1301020 1295806 1293153 1293394 1296597 1302164 1309270
52070A309270Q412J0051J1670J2420J2250J2189J3124J4685J5714J5611J4895
$$ 1309270 1317682 1327733 1339403 1351823 1364073 1376262 1389386 1404071 1419785 1435396 1450291
52059A450291J4378J4150J3578J2179J0187Q223O621N321M232L376K525J076j413
$$ 1450291 1464669 1478819 1492397 1504576 1514763 1522986 1529607 1534928 1539160 1542536 1545061 1546137 1544724
52046A544724m609p658j0007j1834j3631j5652j7862k0108k2013k2982k2718k1728
$$ 1544724 1540115 1532457 1522450 1510616 1496985 1481333 1463471 1443363 1421350 1398368 1375650 1353922
52034A353922k0833k0137j8952j6971j4933j3609j2634j1121r175p798p306o856
$$ 1353922 1333089 1312952 1294000 1277029 1262096 1248487 1235853 1224732 1215557 1207759 1200453 1193597
52022A193597n963n438o132p508q357q372q083p700o989o104n458m901m014l271
$$ 1193597 1187634 1182196 1176064 1168556 1160199 1151827 1143744 1136044 1129055 1122951 1117493 1112592 1108578 1105307
$$ [...]
##END NTUPLES=NMR SPECTRUM
##END=
