##TITLE=AC1464_TOLI813270_8026490_rph5gjRkHF
##JCAMPDX= 6.0         $$ Bruker NMR JCAMP-DX V2.0
##DATA TYPE= NMR SPECTRUM
##DATA CLASS= NTUPLES
##ORIGIN= BRUKER
##OWNER= Administrator
$$ 1.72 TOPSPIN		Version 2.1
$$ 2013-07-11 19:27:55.502 -0700  Administrator@X
$$ Compression mode = diff/dup
##.OBSERVE FREQUENCY= 400.02188249412
##.OBSERVE NUCLEUS= ^1H
##.ACQUISITION MODE= SIMULTANEOUS (DQD)
##.ACQUISITION SCHEME= undefined
##.AVERAGES= 8
##.DIGITISER RES= 22
##SPECTROMETER/DATA SYSTEM= spect
##.PULSE SEQUENCE= zg30
##.SOLVENT NAME= COFFEE_meoh
##.SHIFT REFERENCE= INTERNAL, COFFEE_meoh, 1, 14.98509
##AUDIT TRAIL= $$ (NUMBER, WHEN, WHO, WHERE, PROCESS, VERSION, WHAT)
$$ ##TITLE= Audit trail, TOPSPIN		Version 2.1
$$ ##JCAMPDX= 5.01
$$ ##ORIGIN= Bruker BioSpin GmbH
$$ ##OWNER= Administrator
$$ $$ E:\/data/COFFEE/nmr/AC1464_TOLI813270_8026490_rph5gjRkHF/10/pdata/1/auditp.txt
$$ ##AUDIT TRAIL=  $$ (NUMBER, WHEN, WHO, WHERE, PROCESS, VERSION, WHAT)
(   1,<2013-07-11 19:27:48.627 -0700>,<Administrator>,<X>,<go>,<TOPSPIN 2.1>,
      <created by zg
	started at 2013-07-11 19:26:42.408 -0700,
	POWCHK enabled, PULCHK disabled,
       configuration hash MD5:
       C8 4E 4E 5D D3 5C D8 9E 9F 52 82 E0 59 8A DE 15
       data hash MD5: 64K
       0C EE BC B3 9E 35 E3 C2 B2 3F 47 A1 04 2C FC 02>)
(   2,<2013-07-11 19:27:51.502 -0700>,<Administrator>,<X>,<proc1d>,<TOPSPIN 2.1>,
      <Start of raw data processing
       efp LB = 0 FT_mod = 6 PKNL = 1 PHC0 = 0 PHC1 = 0 SI = 32K 
       data hash MD5: 32K
       3A 40 F3 48 44 06 0F 00 24 CF 99 7D 56 D3 A9 CD>)
(   3,<2013-07-11 19:27:51.799 -0700>,<Administrator>,<X>,<proc1d>,<TOPSPIN 2.1>,
      <pk PHC0 = 97.7124 PHC1 = 0 
       data hash MD5: 32K
       F2 A7 5B DE B2 40 9E 0C 9B 7A F5 09 88 4B 20 46>)
(   4,<2013-07-11 19:27:51.986 -0700>,<Administrator>,<X>,<proc1d>,<TOPSPIN 2.1>,
      <abs ABSG = 1 
       data hash MD5: 32K
       08 B4 74 6C 7B 6D 0A C8 67 39 0C 36 D3 2F EC 2C>)
(   5,<2013-07-11 19:27:52.096 -0700>,<Administrator>,<X>,<proc1d>,<TOPSPIN 2.1>,
      <abs ABSG = 2 
       data hash MD5: 32K
       02 CC C4 EC D5 47 A0 FF DA 9F 4A BD 66 57 1B 58>)
(   6,<2013-07-11 19:27:52.189 -0700>,<Administrator>,<X>,<proc1d>,<TOPSPIN 2.1>,
      <abs ABSG = 3 
       data hash MD5: 32K
       39 2A 8C AC B8 0A D6 DB FB 91 47 90 68 AF 51 91>)
(   7,<2013-07-11 19:27:52.236 -0700>,<Administrator>,<X>,<proc1d>,<TOPSPIN 2.1>,
      <abs ABSG = 4 
       data hash MD5: 32K
       50 7F C7 3A 37 27 27 EF F8 82 54 4F E0 67 6C 3A>)
(   8,<2013-07-11 19:27:52.283 -0700>,<Administrator>,<X>,<proc1d>,<TOPSPIN 2.1>,
      <abs ABSG = 5 
       data hash MD5: 32K
       76 35 3E 78 9D B6 FA F8 8B 73 3A D5 3F 15 75 9C>)
$$ ##END=
$$ 
$$ $$ hash MD5
$$ $$ 6C 72 E2 BB C7 25 C1 B7 0B E7 3C E7 C1 13 1B 2C
##$RELAX= 
##$RELAX= 
##$RELAX= 
##$RELAX= 
##$RELAX= 
##$RELAX= 
##$RELAX= 
$$ Bruker specific parameters
$$ --------------------------
##$DU= <E:\>
##$EXPNO= 10
##$NAME= <AC1464_TOLI813270_8026490_rph5gjRkHF>
$$ [...]
##$TP= (0..7)
150 150 150 150 150 150 150 150
##$TP07= 0
##$TPNAME0= <>
##$TPNAME1= <>
##$TPNAME2= <>
##$TPNAME3= <>
##$TPNAME4= <>
##$TPNAME5= <>
##$TPNAME6= <>
##$TPNAME7= <>
##$TPOAL= (0..7)
0.5 0.5 0.5 0.5 0.5 0.5 0.5 0.5
##$TPOFFS= (0..7)
0 0 0 0 0 0 0 0
##$TUNHIN= 0
##$TUNHOUT= 0
##$TUNXOUT= 0
##$USERA1= <user>
##$USERA2= <user>
##$USERA3= <user>
##$USERA4= <user>
##$USERA5= <user>
##$V9= 5
##$VALIST= <valist>
##$VCLIST= <CCCCCCCCCCCCCCC>
##$VD= 0
##$VDLIST= <DDDDDDDDDDDDDDD>
##$VPLIST= <PPPPPPPPPPPPPPP>
##$VTLIST= <TTTTTTTTTTTTTTT>
##$WBST= 1024
##$WBSW= 4
##$XGAIN= (0..3)
0 0 0 0
##$XL= 0
##$YL= 0
##$YMAX_a= 661343
##$YMIN_a= -562378
##$ZGOPTNS= <>
##$ZL1= 120
##$ZL2= 120
##$ZL3= 120
##$ZL4= 120
##$ABSF1= 14.98509
##$ABSF2= -5.573092
##$ABSG= 5
##$ABSL= 3
##$ALPHA= 0
##$AQORDER= 0
##$ASSFAC= 0
##$ASSFACI= 0
##$ASSFACX= 0
##$ASSWID= 0
##$AUNMP= <proc_prof1d_extract_pilot.lims>
##$AXLEFT= 0
##$AXNAME= <>
##$AXNUC= <1H>
##$AXRIGHT= 0
##$AXTYPE= 0
##$AXUNIT= <>
##$AZFE= 0.1
##$AZFW= 0.1
##$BCFW= 0
##$BC_mod= 0
##$BYTORDP= 0
##$COROFFS= 0
##$CY= 15
##$DATMOD= 1
##$DC= 0
##$DFILT= <>
##$DTYPP= 0
##$F1P= 0
##$F2P= 0
##$FCOR= 0.5
##$FTSIZE= 32768
##$FT_mod= 6
##$GAMMA= 0
##$GB= 0
##$INTBC= 1
##$INTSCL= 1
##$ISEN= 128
##$LB= 0
##$LEV0= 0
##$LPBIN= 0
##$MAXI= 10000
##$MC2= 0
##$MEAN= 0
##$ME_mod= 0
##$MI= 0
##$NCOEF= 0
##$NC_proc= -8
##$NLEV= 6
##$NOISF1= 0
##$NOISF2= 0
##$NSP= 0
##$NTH_PI= 0
##$NZP= 0
##$OFFSET= 14.98509
##$PC= 1
##$PHC0= 97.7124
##$PHC1= 0
##$PH_mod= 1
##$PKNL= yes
##$PPARMOD= 0
##$PPDIAG= 0
##$PPIPTYP= 0
##$PPMPNUM= 2147483647
##$PPRESOL= 1
##$PSCAL= 4
##$PSIGN= 0
##$PYNMP= <proc.py>
##$REVERSE= no
##$SF= 400.02
##$SI= 32768
##$SIGF1= 0
##$SIGF2= 0
##$SINO= 400
##$SIOLD= 32768
##$SPECTYP= <>
##$SREGLST= <1H.CDCl3>
##$SSB= 0
##$STSI= 32768
##$STSR= 0
##$SW_p= 8223.68421052631
##$SYMM= 0
##$S_DEV= 0
##$TDeff= 65536
##$TDoff= 0
##$TI= <>
##$TILT= no
##$TM1= 0
##$TM2= 0
##$TOPLEV= 0
##$USERP1= <user>
##$USERP2= <user>
##$USERP3= <user>
##$USERP4= <user>
##$USERP5= <user>
##$WDW= 1
##$XDIM= 32768
##$YMAX_p= 448190730
##$YMIN_p= -656601
##$CURPLOT= <Network HP LaserJet P1505>
##$CURPRIN= <$Network HP LaserJet P1505>
##$DFORMAT= <normdp>
##$LAYOUT= <+/1D_H.xwp>
##$LFORMAT= <normlp>
##$PFORMAT= <normpl>
##$SURQMSG= 1
$$ End of Bruker specific parameters
$$ ---------------------------------
##NTUPLES= NMR SPECTRUM
##VAR_NAME=  FREQUENCY,     SPECTRUM/REAL,   SPECTRUM/IMAG
##SYMBOL=    X,             R,               I
##VAR_TYPE=  INDEPENDENT,   DEPENDENT,       DEPENDENT
##VAR_FORM=  AFFN,          ASDF,            ASDF
##VAR_DIM=   32768,         32768,           32768
##UNITS=     HZ,            ARBITRARY UNITS, ARBITRARY UNITS
##FACTOR=    0.250966925370066, 1,           1
##FIRST=     8223.43324360094, 29968,        -270737
##LAST=      0,             -190561,         -62758
##MIN=       0,             -656601,         0
##MAX=       8223.43324360094, 448190730,    0
$$ Real data points
##PAGE= N=1
##DATA TABLE= (X++(R..R)), XYDATA
$$ [...]
$$ plain form
19535 44176 -108077 -302352 21947 -49907 -434795 121838 -40897 -74401 -2840 8430 143887
19524 143887 -18367 13539 215728 72837 -86593 -4790 -59537 304341 -124585 -41136 -37160
19513 -37160 11901 26937 36851 -28531 180194 173689 147572 245857 21997 -105336 -104442 -125827
19501 -125827 -56766 167336 -20857 -131298 29215 -85355 -213526 27918 2338 212355 -228038
19489 -186409 214443 -161320 303369 -81580 -68218 165466 172782 -283583 -355732 271676
19478 -26449 -174474 -74397 -8933 39153 60402 -137055 130292 196791 90909 166925 -72638
19466 -204697 160722 80842 -48675 196541 680 -163236 -511097 -105002 -124326 22607 184432
19455 184432 -169540 -287223 204400 141055 -58031 130706 -8714 -133771 142927 439230
$$ packed form
19535D4176a08077j94275B1947d9907l84888A21838d0897l3504b840H430J35457
19524A43887a8367A3539K02189G2837h6593d790n4747C04341a24585d1136L976
19513c7160A1901J5036R914b8531A80194o505k6117R8285B1997a05336Q94k1385
19501a25827e6766A67336b0857j10441B9215h5355j28171B7918B338K10017b28038
19489a86409B14443a61320C03369h1580J3362A65466P316b83583p2149B71676
19478b6449j48025g4397h933C9153K1249a37055A30292O6499I0909P6016g2638
19466b04697A60722p9880d8675A96541F80a63236l47861a05002j9324B2607J61825
19455A84432a69540j17683B04400o3345e8031A30706h714j25057A42927K96303
$$ plain form
19445 439230 -75778 -276529 -90465 5049 110526 -330713 -100939 -154994 -252277 -36814 -82160
19434 -82160 102239 -55861 229810 -149704 -70539 -217240 65991 -25711 -136520 -134604 -115357
19423 -115357 57106 -152031 36426 -222238 -135213 118049 -250921 157544 -2963 -230422
19413 -230422 -84119 230883 137064 272587 103325 -4592 106424 -327085 157267 -250560
19402 -35125 -216215 -226885 -325996 -252832 -80226 -296311 -148927 -216888 -99702 -295760 -203073
19391 -203073 103987 31924 -197411 -266643 -81985 23621 59418 -224911 -15475 -227412 -390866
19380 -390866 -216683 -110852 -70092 82039 -182784 -225865 62395 -88138 -34217 41702 -23177
19368 510856 274006 -253385 -58214 -118273 -240741 -107973 8899 409795 341113 -224048
$$ packed form
19445D39230g5778k00751i0465E049J05477c30713a00939n4055r7283c6814m5346
19434h2160A02239e5861B29810a49704g0539j46701F5991b5711j10809J916J9247
19423a15357E7106a52031C6426b22238Q7025A18049b50921A57544b963k27459
19413b30422h4119B30883r3819J35523A03325d592A06424c27085A57267b50560
19402c5125j81090j0670r9111P3164h0226k16085J47384o7961i9702j96058R2687
19391b03073A03987C1924a97411o9232h1985B3621L5797b24911a5475k11937j63454
19380c90866J74183J05831M0760H2039a82784m3081F2395h8138c4217D1702b3177
19368E10856k36850b53385e8214o0059j22468a07973H899M00896o8682b24048
$$ plain form
19357 -197972 -124808 -69170 42477 -184342 61041 -445868 -137761 -233791 -313728 83235 -165662
19345 -133917 -84489 -35955 120247 -144855 -44939 67992 -271697 -114746 -290871 48405
19334 14986 -37577 -514693 269146 95837 -48338 192159 -131265 66848 -191405 145519
19323 -89164 -376147 -37591 -43657 60868 228311 54687 -181891 -40049 -216051 -195273 -126092
19312 -126092 458109 31823 5593 66390 -1724 -102758 422261 -457761 92612 -212410 -132883
19301 -132883 103800 -284223 -95616 -62591 -187555 -69676 -152165 90805 -406845 -105863
19290 56293 -6947 -79441 -281681 267845 241136 -14416 26680 -157872 44779 168353 141194
19279 141194 -350648 -86290 9692 -11774 -358453 -215131 -47997 85555 -105353 -65972 -19501
$$ packed form
19357a97972P3164N5638D2477a84342F1041d45868a37761r6030p9937H3235a65662
19345a33917M9428c5955A20247a44855d4939F7992b71697a14746j76125D8405
19334A4986c7577m77116B69146I5837d8338A92159a31265F6848a91405A45519
19323h9164k86983c7591o066F0868J67443E4687a81891d0049j76002K0778O9181
19312a26092D58109C1823E593O0797a724j01034D22261d57761I2612b12410P9527
19301a32883A03800b84223i5616L3025j24964f9676q2489I0805d06845a05863
19290E6293f947p2494k02240B67845k6709a4416B6680a57872D4779J23574k7159
19279A41194c50648h6290I692a1774l46679J43322d7997H5555a05353L9381a9501
$$ plain form
19267 -25242 94166 -74403 -98043 62341 -447968 65401 -137733 172 -115964 134164 -37267
19255 165255 254338 2766 -194716 -124234 -62578 138687 284569 -106265 92341 183012 -119021
19243 14903 172970 47952 95095 -92105 -259521 -70215 -133627 -162337 31179 -85171 178085
19231 96897 -102907 190755 -21845 2150 -14656 67330 -94950 -142595 64177 139786 -228277
19219 64533 -44407 -150188 -213327 -282122 -130783 -16068 -93381 301338 -344916 45478 -23623
19207 -96970 174271 -149972 11066 237054 -39557 -78424 -368248 -104399 -368020 157733
19196 -102371 -27709 -305256 226600 -197358 -353322 152753 -121824 -181117 -52607 62930
19185 -14406 -83830 245848 111008 -139307 28742 84697 -204451 -52557 -34125 -65789 41685
$$ packed form
19267b5242I4166g4403k3640F2341d47968F5401a37733A72a15964A34164c7267
19255A65255Q9083B766a94716P0482O1656A38687J45882a06265I2341R0671a19021
19243A4903J58067D7952M7143i2105j67416g0215o3412k8710C1179h5171A78085
19231I6897a02907A90755b1845B150a4656F7330i4950m7645F4177P5609b28277
19219F4533d4407j05781o3139o8795a30783a6068p7313C01338c44916D5478b3623
19207i6970A74271a49972A1066K25988c9557l8867k89824a04399k63621A57733
19196a02371b7709k77547B26600a97358j55964A52753a21824n9293e2607F2930
19185a4406o9424B45848A11008a39307B8742N5955b04451e2557J8432l1664D1685
$$ plain form
19173 225775 -170191 -245694 178374 -69429 -205080 -180536 -150096 -84750 149723 107796 -124822
19161 209252 -225863 155078 -288491 -149806 -47117 34004 -65422 10090 95393 -45832 105282
19149 -228739 -136577 41374 -73213 172842 311 -67276 -156329 -25876 -374657 122787 -114557
19137 815 -273942 -200589 167668 -218035 -220683 -302897 -94031 -8173 180562 69899 211988
19126 211988 -207931 -20830 128372 -352006 212396 2832 158288 -243667 -118202 -122481
19116 -122481 -88626 -86282 160206 -4873 349640 -82953 145064 -437292 104867 -47673 -9192
19104 -171151 -372059 -28013 95307 -264478 -258191 353175 -182210 -136085 -183401 -162926 -246194
19093 -246194 -359766 47597 -48698 -195669 -171192 26406 -57106 -127589 204524 -136096 -290328
$$ packed form
19173B25775a70191p5503A78374f9429j35651K4544L0440O5346A49723m1927a24822
19161B09252b25863A55078b88491J38685d7117C4004f5422A0090Q5303d5832A05282
19149b28739R2162D1374g3213A72842C11f7276q9053b5876l48781A22787a14557
19137H15b73942P3353A67668b18035k648q2214i4031h173A80562F9899J42089
19126B11988b07931b0830A28372c52006B12396B832J55456b43667a18202m279
19116a22481L3855K344A60206d873C49640h2953A45064d37292A04867d7673i192
19104a71151k00908b8013I5307b64478O287C53175a82210M6125m7316K0475q3268
19093b46194j13572D7597d8698j46971K4477B6406e7106p0483B04524a36096j54232
$$ plain form
19082 -290328 -223231 22164 -217963 171406 -49540 -257793 -30467 -105636 36803 -19449 228932
19070 30858 -140344 -15830 31596 -84557 49531 -482536 429881 121594 -162680 -238621 124743
19058 -104435 75628 -277277 -35944 74632 -10883 135109 148494 -22526 -204187 125883 -109429
19046 108645 24033 25389 20610 212204 75708 148743 -127719 -47084 -196877 94094 -9000
19034 101028 -108072 479823 75194 -86893 29418 187977 -15335 -7284 157116 -98444 -211448
19023 -211448 -16498 -249864 -98069 -23906 -3129 21249 41378 -41193 79278 124187 -41754
19011 -190046 111552 -364514 149755 37633 -162414 -1295 -131022 30147 78295 -131164
19000 -189879 102671 114531 199262 -272115 62590 -101762 -21977 -324801 50387 -110269
$$ packed form
19082b90328O7097B2164b17963A71406d9540k08253c0467p5169C6803a9449B28932
19070C0858a40344a5830C1596h4557D9531d82536D29881A21594a62680p5941A24743
19058a04435G5628b77277c5944G4632a0883A35109J3385b2526j81661A25883a09429
19046A08645B4033J356m779J91594G5708P3035a27719d7084j49793I4094i000
19034A01028a08072D79823G5194h6893B9418J58559a5335g284A57116i8444j13004
19023b11448a6498k33366i8069b3906c129B1249K0129d1193G9278M4909d1754
19011a90046A11552c64514A49755C7633a62414a295j29727C0147M8148a31164
19000a89879A02671J1860Q4731b72115F2590a01762b1977l02824E0387a10269
$$ plain form
18989 -109120 -148091 -239063 -438535 148006 -382743 94535 -57012 16129 -143019 363948
18978 -252032 -206775 -182662 199239 -74319 94459 5848 63445 -332038 45148 139420 -400781
18966 -62199 -56814 -79079 -249675 -160565 -58749 -108599 -93716 -6312 118154 -64165 -84686 -179169
18954 -179169 162379 81954 -125744 -296839 35795 -149296 173287 -262001 69349 96905
18944 96905 -106487 342738 125407 380167 -387654 115440 117486 -178108 50873 -361612
18933 -92701 -198706 58247 246400 -88461 -50472 -114634 83660 265319 267405 -1145 183867
18921 8508 -194688 402932 34714 42629 -147459 131676 -6793 207332 -158189 41073 292411
18910 292411 -157774 9495 -79511 106494 -118118 144561 -245378 -206786 18913 -113805
$$ packed form
18989a09120l8971r0972j99472A48006c82743I4535e7012A6129a43019C63948
18978b52032M5257K4113A99239g4319I4459E848N7597c32038D5148R4272d00781
18966f2199N385k2265j70596Q9110e8749m9850J4883f312A18154f4165k0521r4483
18954a79169A62379q0425a25744j71095C5795a49296A73287b62001F9349K7556
18944I6905a06487C42738A25407K54760c87654A15440K046a78108E0873c61612
18933i2701j06005E8247J88153h8461L7989o4162H3660J81659K086a145A83867
18921H508a94688D02932C4714P915a47459A31676f793B07332a58189D1073K51338
18910B92411a57774I495g9511A06494a18118A44561b45378L8592A8913a13805
$$ plain form
18899 -256035 -111509 200263 -177431 -123655 -337489 30145 60818 -93983 -169480 -133525 -308113
18888 -308113 -30074 -150881 49157 -344193 259580 -144379 196027 290124 -180841 -17045
18877 224115 -160967 -175918 151834 -73903 133642 -271307 -92217 277504 8447 -308722
18866 -51627 -122314 -232701 176643 -183366 118827 231981 -333591 -364536 363848 -118147
18855 -256905 91924 210210 3201 -254095 61614 250211 23303 187155 -109205 -35362 179339
18843 71244 -289958 -207706 -39860 -261735 -352629 37117 50309 -250254 18345 -37498 -275552
18832 -275552 140216 -472695 -64287 -232925 92473 -158708 -70693 100183 177910 -365941
18821 -99162 -57240 -125085 12168 -32102 175524 207022 33914 64975 -6657 -39806 344552
$$ packed form
18899b56035a11509B00263a77431N3776k13834C0145L0673i3983p5497L5955j74588
18888c08113c0074j20807D9157c44193B59580a44379A96027R4097a80841a7045
18877B24115a60967j4951A51834g3903A33642b71307i2217B77504H447c08722
18866e1627p0687j10387A76643a83366A18827J13154c33591l0945C63848a18147
18855b56905I1924J18286C201b54095F1614J88597B3303J63852a09205c5362A79339
18843G1244b89958Q2252c9860k21875r0894C7117J3192b50254A8345c7498k38054
18832b75552A40216d72695f4287j68638I2473a58708g0693A00183P7727c65941
18821i9162M1922o7845A2168c2102A75524L1498C3914L1061f657l3149C44552
$$ plain form
18809 227484 99057 -125598 -127717 33529 162389 -254129 -513180 128696 -206696 -75458
18798 -115663 -147381 45057 -100389 326474 355608 267273 54894 -59527 159684 29337 59410
18787 59410 -554137 -114080 128232 -134507 -93772 242983 99543 -237359 43247 16971
18776 -199888 61796 59445 -197034 -198761 -295264 114656 -80291 261716 -359942 -137932 167605
18764 499511 -40050 -48258 -176592 75728 89434 -153306 -617359 259572 107843 93054 95158
18753 95158 151136 287138 -107902 -210144 -331218 114689 163989 8295 -117539 -234999
18743 -234999 172939 -119402 -271847 -342912 -156711 420012 -114814 -37525 -202239 -81891
18732 72372 -95803 -212973 -78692 -172530 -138059 -276489 -76332 -285214 227979 -188169 138640
$$ packed form
18809B27484I9057a25598k119C3529J28860b54129k59051A28696b06696g5458
18798a15663l1718D5057a00389C26474K9134q8335E4894e9527A59684B9337L0073
18787E9410e54137a14080A28232a34507M0735B42983I9543b37359D3247A6971
18776a99888F1796k351a97034j727r6503A14656h0291B61716c59942a37932A67605
18764D99511d0050q208j28334G5728J3706a53306m64053B59572A07843j4789K104
18753I5158N5978J36002a07902j02242j21074A14689M9300H295a17539j17460
18743b34999A72939a19402j52445p1065a56711D20012a14814c7525j64714h1891
18732G2372i5803j17170g8692r3838L4471j38430g6332k08882B27979a88169A38640
$$ plain form
18720 -279201 -45393 82837 -59065 31197 54443 -98496 -231398 18033 26442 -199273 -45891
18708 -42020 122534 230348 190764 -100561 -17406 212220 -168101 -112446 115376 22791
18697 -119633 -71093 -21005 -356376 -519531 105235 57103 -191662 18759 210696 -281975
18686 64753 45354 215400 -410193 227759 -169969 51957 300245 -424990 14428 -201731
18675 234770 95381 -247491 189523 90039 -319313 107071 -60669 317762 140037 -39700
18664 318854 137864 -177721 -220263 -164814 48543 71369 -230361 60074 -209951 -29394 -45690
18653 -45690 145907 -126465 42754 -312548 -237784 94824 326954 -283935 -149171 123954
18642 -184887 104262 226601 -155991 200783 -75958 12971 72416 131283 -125882 27253
$$ packed form
18720b79201d5393H2837e9065C1197K3246i8496j32902A8033Q409a99273d5891
18708d2020A22534J07814l9584a00561a7406B12220a68101N5655A15376B2791
18697a19633M8540b1005l35371j63155A05235m8132a91662A8759J91937b81975
18686F4753j9399J70046d10193B27759a69969E1957K48288d24990A4428b01731
18675B34770I5381b47491A89523I0039c19313A07071f0669C17762A40037c9700
18664C18854A37864a77721m2542N5449D8543K2826b30361F0074b09951b9394j6296
18653d5690A45907a26465D2754c12548P4764I4824K32130b83935J34764A23954
18642a84887A04262J22339a55991B00783g5958A2971N9445N8867a25882B7253
$$ plain form
18631 -163981 117502 35944 253864 127783 -95489 -155718 54898 47280 -109348 -38913 -418707
18620 -418707 26566 34417 -132370 -331359 -211997 17752 -546453 74951 -69673 -332869 73922
18608 312349 -51498 -48083 -130499 -267300 -136176 169319 218428 283958 -239809 -240124 33883
18596 -142903 69469 190742 -437089 136250 -121899 -324942 -66645 212602 264084 223150
18586 223150 -6895 69413 -181666 -73248 -490606 -63137 -99138 -137198 -3475 33966 -74953
18574 123631 -38268 -90318 -36258 165249 281223 -144541 -276992 -403432 -209977 -216334
18564 -216334 -352518 -158117 -126230 -234158 23550 -100045 126148 -294683 -130483 295194
18553 328994 39947 -62993 8622 -342387 -120980 17235 160511 -71350 -231736 -361483 -259814
$$ packed form
18631a63981A17502C5944K17920j26081i5489o0229E4898p618a09348c8913l79794
18620d18707B6566P851a32370j98989J19362A7752e46453G4951f9673k63196G3922
18608C12349e1498L415q2416j36801J31124A69319M9109O5530b39809l15C3883
18596a42903F9469J21273d37089A36250a21899k03043f6645B12602N1482m0934
18586B23150f895F9413a81666g3248m17358f3137l6001l8060c475C3966g4953
18574A23631c8268n2050c6258A65249J15974a44541j32451j26440J93455o357
18564b16334j36184a58117L1887j07928B3550a00045A26148b94683a30483B95194
18553C28994C9947f2993H622c42387a20980A7235J43276g1350j60386j29747J01669
$$ plain form
18542 -259814 -73627 -388516 -248350 -89225 -80025 207960 -440785 -44059 36367 -119951 238449
18530 -276946 -135316 26812 -344726 8221 93912 288027 10007 -108436 -40440 -78794 -108154
18519 -108154 258886 -133014 -98495 49241 357196 102698 -103258 -103442 149164 -208201
18508 -144725 -254019 121057 68675 78623 -512955 45510 89022 90059 -8575 110218 63350
18497 63350 -310354 30213 -329306 51505 -240718 163582 132214 -87739 -67168 90046 72811
18486 72811 -130016 116459 252081 -361187 -256481 -184069 3880 -79027 11581 -12651 58524
18474 1677 5446 110545 -93796 115092 -73519 -99746 37174 110754 -69415 210725 -10312
18462 72796 23255 -322792 84768 -200863 33613 -328260 -159440 -228642 -99122 -223498 8842
$$ packed form
18542b59814g3627l14889J40166h9225R200B07960d40785d4059C6367a19951B38449
18530b76946a35316B6812c44726H221Q5691J94115A0007a08436d0440l8354k9360
18519a08154B58886a33014L4519D9241L07955A02698a03258j84A49164b08201
18508a44725j09294A21057n2382R948e12955D5510M3512J037h575A10218m6868
18497F3350c10354C0213c29306E1505b40718A63582l1368h7739K0571I0046j7235
18486G2811a30016A16459J35622c61187J04706P2412C880g9027A1581a2651E8524
18474A677L769J05099i3796A15092g3519k6227C7174P3580f9415B10725a0312
18462G2796B3255c22792H4768b00863C3613c28260a59440o9202i9122j24376H842
$$ plain form
18450 -155277 -59304 71985 -53376 26545 -267709 -159167 269524 -89895 92074 98037 21386
18438 -105207 102921 204803 353013 -87431 -234088 160732 320580 -164137 -59788 -259888
18428 -259888 944 -27850 -176350 247970 -272487 -60567 -25922 -262662 88430 -8622 163863
18416 83202 85750 -104349 -42822 45513 266560 -87620 -183700 -437659 -23442 -7218 193144
18404 90156 -134038 119373 -348762 100607 117350 -72861 -82476 -155983 226750 96235 -305727
18392 -298154 -95248 -229930 -86252 47920 -125590 -182165 28972 154146 18855 172625 56655
18380 -185559 -152484 -111971 -269577 -267278 357626 335827 -162609 -46874 -86263 -41071 92403
18368 -153200 -14508 -52441 -54873 -91397 411216 -247871 266143 207886 -31386 40651 219605
$$ packed form
18450a55277e9304G1985e3376B6545b67709J08542B69524h9895I2074N963B1386
18438a05207A02921J01882J48210h7431j46657A60732J59848a64137e9788k00100
18428b59888I44b7850j48500B47970b72487f0567b5922k36740H8430h622A63863
18416H3202K548a04349d2822D5513K21047h7620r6080k53959b3442g218A93144
18404I0156a34038A19373c48762A00607J6743g2861r615p3507B26750I6235c05727
18392b98154i5248j34682h6252D7920a25590n6575B8972J25174A8855J53770E6655
18380a85559L3075M0513j57606K299C57626k1799a62609d6874l9389d1071I2403
18368a53200a4508l7933k432l6524D11216b47871B66143n8257c1386D0651J78954
$$ plain form
18357 219605 -224786 189371 -119168 25947 -77181 -47779 207124 -68104 -131197 -47403 34674
18345 193125 -175482 280342 -388365 -11030 -246470 -178212 -211032 -129457 13491 -222439
18334 119643 -232347 -183937 -857 -64748 -351123 -93494 -166948 86247 -70727 125994 -83296
18322 -114979 -25181 -89919 -320358 -495769 19633 -322557 -66020 247579 128810 -270471
18311 356496 9666 -144874 115471 8325 63825 54606 -2060 178940 59952 -230344 -503157
18300 -503157 211973 176202 -24552 -301145 42338 36399 -63405 -18016 -33925 16477 -263711
18288 -37340 5608 52545 -194700 -122430 368451 65923 -253113 75922 -112802 230664 69333
18276 -303731 -53169 -244674 -164634 -381513 193430 212070 204115 -2323 -133746 -169304 -26241
$$ packed form
18357B19605b24786A89371a19168B5947g7181K9402B07124f8104o3093d7403C4674
18345A93125a75482B80342c88365a1030k35440O8258l2820Q1575A3491b22439
18334A19643b32347M8410h57o3891k86375i3494p3454H6247g0727A25994h3296
18322a14979b5181o4738k30439j75411A9633c22557f6020B47579j18769b70471
18311C56496I666a44874A15471H325N5500r219b060A78940E9952b30344k72813
18300e03157B11973l5771b4552k76593D2338n939f3405a8016j5909A6477b63711
18288c7340E608M6937a94700P2270C68451F5923b53113G5922a12802B30664F9333
18276c03731e3169j91505Q0040k16879A93430J8640p955b323j31423l5558b6241
$$ plain form
18264 250503 114932 -5190 48575 104729 128379 126960 254535 -383772 -260651 -35587 -16447
18252 292892 -26526 40884 -82474 24119 81336 231334 24880 -25148 -66111 -269052 -74155
18240 64432 42787 39752 -66554 126979 96849 -362011 -152558 -162122 -103163 16601 -188008
18228 -66490 -116393 41700 3530 192436 3824 -63644 -38213 185298 -154390 -84242 -237094
18217 -237094 306801 36558 -295313 -104355 42563 218474 35916 -57095 -138249 -40691 -64239
18206 -64239 -278021 241659 -101989 -228278 -152345 35935 -42563 281693 -91465 171317
18195 129424 241320 -82443 -36606 -274944 38266 199345 -186220 -252194 197065 -45523
18184 378795 329404 53106 -149881 127688 341031 -186643 -58927 -119230 -14588 -296881
$$ packed form
18264B50503A14932e190D8575N6154K3650j419J27575c83772J23121c5587a6447
18252B92892b6526D0884h2474B4119N7217J49998B4880b5148m0963k02941g4155
18240F4432k1645l035f6554A26979l0130c62011a52558r564N8959A6601a88008
18228f6490m9903D1700C530J88906C824f3644K5431A85298a54390P0148j52852
18217b37094C06801C6558b95313a04355D2563J75911C5916e7095q1154d0691k3548
18206f4239k13782B41659a01989j26289P5933C5935d2563B81693i1465A71317
18195A29424J11896h2443c6606k38338C8266J61079a86220o5974A97065d5523
18184C78795m9391E3106a49881A27688K13343a86643e8927o0303a4588k82293
$$ plain form
18174 -296881 -107350 123836 223971 -111819 -350900 -134373 -10893 -65361 -304359 -76210
18163 -13692 97666 -464600 614256 -88170 -102046 84158 -182722 133593 -336117 206034
18152 -173480 -124308 -139194 -303582 -291623 -71396 -171200 -186750 94602 -136784 247944 -4883
18140 -33602 -330298 -55925 -143437 401968 -40694 -38074 -237792 -106135 168813 70868 47974
18129 47974 -39209 354468 -96031 -298587 -146150 -158658 11724 -3282 201133 -256273 25960
18117 -39458 -92763 -136533 -9135 196980 -47201 -286198 -178623 -112085 2309 -55025 -7668 -301026
18105 -301026 -238916 -174026 -98419 -113644 378559 -103695 61905 89316 378856 -60533 -286502
18094 -286502 45601 -218822 2715 165081 60034 9783 316305 71531 251 -163205 57411
$$ packed form
18174b96881a07350A23836J00135a11819k39081a34373a0893n4468k38998g6210
18163a3692I7666d64600F14256h8170j3876H4158a82722A33593c36117B06034
18152a73480M9172j4886j64388J1959g1396r9804j5550I4602a36784B47944d883
18140c3602k96696e5925q7512D01968d0694K620j99718a06135A68813G0868k2894
18129D7974c9209C54468i6031k02556a46150j2508A1724c282B01133b56273B5960
18117c9458n3305m3770i135A96980d7201k38997J07575O6538B309e5025g668k93358
18105c01026O2110O4890P5607j5225C78559a03695F1905K7411K89540f0533k25969
18094b86502D5601b18822B715J62366F0034I783L06522G1531B51a63205E7411
$$ plain form
18082 145752 -56278 102714 -268847 -43247 -229017 -483444 125130 38250 -239843 92644
18071 -172731 23955 198346 -20133 -8328 -60789 -162893 52255 -125389 -342376 -280319 345019
18059 -67736 247744 158274 -99516 -4780 -66034 359851 376271 113075 -124168 -360979 109069
18047 355968 -153139 -71739 -50029 -73492 -97917 59519 14947 -93723 -144629 122822 -9159
18035 -260481 -348186 -237770 -137366 -66295 -252403 336453 94574 48867 123557 -90853 -173518
18024 -173518 70712 148292 45347 -115593 -158271 -207271 38716 108787 -279517 -207520 121874
18012 286418 -170965 -107943 -187109 250450 -213844 166372 58704 385010 102385 23149
18001 -52841 348877 -14107 -179662 31663 259536 -153693 -111006 172336 -124234 30607
$$ packed form
18082A45752e6278A02714b68847d3247j85770k54427A25130C8250b39843I2644
18071a72731B3955J74391b0133h328n2461j02104E2255a25389k16987O2057C45019
18059f7736B47744q9470i9516d780o1254C59851J6420A13075a24168k36811A09069
18047C55968a53139g1739K1710k3463k4425E9519A4947i3723n0906A22822i159
18035b60481q7705J10416J00404f6295j86108C36453I4574m5707P4690i0853q2665
18024a73518G0712P7580D5347a15593m2678m9000C8716P0071b79517P1997A21874
18012B86418a70965O3022p9166B50450b13844A66372E8704L26306A02385B3149
18001e2841C48877a4107j65555C1663K27873a53693M2687A72336a24234C0607
$$ plain form
17990 -97207 21213 23483 -155028 356582 66073 -279467 68498 -118714 -171795 102481 356557
17979 356557 261964 -10616 -74792 -27736 55321 -25661 67410 257594 -15850 -324262 -158471
17967 -158159 -65147 -178190 -252680 -339981 220102 -42380 93057 -127847 -105725 -185509 148029
17955 -289176 252561 185848 199343 -50149 86968 102940 64795 -120869 118192 315987 -165926
17943 -165293 -34316 60051 -70179 -38687 -141765 -149663 189477 20897 20551 410376 -8456 155814
17930 12201 -167203 -70843 252633 -200109 -169480 117534 -17362 22212 12468 123282 -302294
17918 -143940 149645 74959 -165193 46527 -262069 -94757 -191468 122274 -235212 -62162
17907 -118964 -13058 -30315 203427 359995 -55673 -82047 127521 -318490 -135680 -221429
$$ packed form
17990i7207B1213K270a55028C56582F6073b79467F8498a18714n3081A02481K54076
17979C56557r4593a0616o4176b7736E5321b5661F7410J90184a5850l08412a58471
17967a58159f5147j13043p4490q7301B20102d2380I3057a27847K2122p9784A48029
17955b89176B52561o6713J3495e0149H6968J5972l8145a20869A18192J97795a65926
17943a65293c4316F0051g0179L1492j03078p898A89477B0897l46L89825h456A55814
17930A2201a67203g0843B52633b00109L0629A17534a7362B2212r744J10814c02294
17918a43940A49645p4686a65193D6527b62069i4757r6711A22274b35212f2162
17907a18964a3058j7257B03427J56568e5673k6374A27521c18490a35680q5749
$$ plain form
17897 -221429 -21030 -168183 -105581 -157938 -66208 78612 -67462 -36556 49840 9129 503226
17886 503226 -31266 -61552 -76309 140827 50970 -172960 -139368 -107150 205534 -212746 19103
17874 139402 -313885 327622 95680 -304187 -30009 43471 30855 -123381 227345 -95256
17863 41060 5365 60255 28554 23447 -60458 256511 -59617 -14381 -300762 -142382 144314
17851 203579 -132304 116141 243359 43616 -43869 -54980 -70170 225921 170859 -374934
17840 77901 -9434 -306234 -305191 -134381 -84654 88401 29507 185537 81451 265961 -200936
17828 106154 9759 -83050 -19350 93978 -125556 117727 -190171 13595 -192764 41704 214515
17817 214515 -158725 62776 -107478 -125698 100278 21862 150571 39784 -86421 -200613
$$ packed form
17897b21429b1030j47153O2602n2357f6208G8612f7462L0906D9840I129M94097
17886E03226c1266l0286j4757A40827E0970a72960L3592L2218B05534b12746A9103
17874A39402c13885C27622I5680c04187c0009D3471j2616a23381B27345i5256
17863D1060E365N4890B8554n107f0458B56511e9617a4381k86381a42382A44314
17851B03579a32304A16141J27218D3616d3869j1111j5190B25921n5062c74934
17840G7901i434k96800J043a34381M9727H8401B9507J56030H1451J84510b00936
17828A06154I759h3050a9350I3978a25556A17727a90171A3595a92764D1704J72811
17817B14515a58725F2776a07478j8220A00278B1862J28709C9784h6421j14192
$$ plain form
17807 -200613 125292 89732 67868 126194 -122290 -382133 -57017 396926 -180611 44800
17796 -218671 254391 -173726 -53615 147327 -141305 232766 -205664 -89312 3611 -318227
17785 233760 113782 -113899 -205204 452843 151031 -182123 -20321 -222545 26795 93015
17775 93015 119760 -28067 281792 -150973 227538 -35050 4763 -60541 102766 68012 -92244
17763 -231777 258711 68656 100182 -140691 322756 71198 -97624 30746 -259355 -204539 -137470
17752 -137470 279726 -5501 17321 100357 373881 348854 -380981 63948 -160529 -422370 50434
17740 102702 32788 -76610 -99750 -19640 43949 10356 -17080 -78492 19766 -15399 -22586 -103305
17728 -103305 34091 284030 135046 17756 -190714 -159366 239110 180174 -460759 388839
$$ packed form
17807b00613A25292l5560k1864N8326a22290k59843e7017C96926a80611D4800
17796b18671B54391a73726e3615A47327a41305B32766b05664h9312C611c18227
17785B33760A13782a13899r1305D52843A51031a82123b0321k02224B6795O6220
17775I3015K6745b8067B81792a50973B27538c5050D763f0541A02766l4754i2244
17763b31777B58711F8656L1526a40691C22756G1198i7624C0746b59355N4816O7069
17752a37470B79726e501A7321Q3036K73524k5027c80981F3948a60529k61841E0434
17740A02702C2788g6610k3140a9640D3949A0356a7080o1412A9766a5399p187q0719
17728a03305C4091K49939A35046A7756a90714L1348B39110n8936d60759C88839
$$ plain form
17717 -54994 -739 160493 163706 -28240 -168481 75503 -251870 101513 281870 189776 -51232
17705 -21076 -293654 -112310 -90855 113284 209169 322871 67578 -45417 44233 78026 -218536
17693 -102018 -186464 108339 56423 104713 31561 -53927 -31754 -174597 41061 -397699 -27699
17681 332508 155420 -299247 78 130556 -128616 -171305 24140 -92575 225960 -108973 316456
17669 -37790 -169339 19301 281423 28526 127530 346819 375053 -70792 -67043 30976 151329
17658 151329 -15778 302723 -74372 77129 47163 -39611 225158 97465 -9095 184282 42732
17646 -164713 -97063 -181283 98568 7097 -226811 -53832 -118118 -119810 119234 181529 19502
17634 -19434 -57550 -13112 -16626 -305386 83504 5237 39266 43389 108864 1003 -41475 75564
$$ packed form
17717e4994g39A60493L213b8240j40241G5503b51870A01513J80357r2094e1232
17705b1076k72578a12310K1455A13284R5885J13702F7578d5417D4233L3793b18536
17693a02018q4446A08339n1916M8290C1561e3927K2173j42843D1061c97699b7699
17681C32508A55420b99247G8J30478a28616m2689B4140i2575B25960a08973C16456
17669c7790j31549A9301K62122B8526R9004K19289K8234g0792L749C0976J20353
17658A51329a5778C02723g4372G7129k9966c9611B25158I7465i095A84282D2732
17646a64713O7650q4220I8568G097b26811e3832o4286j692A19234O2295A9502
17634a9434l8116a3112l514k88760H3504E237L4029M123O5475A003d1475G5564
$$ plain form
17621 290948 267908 173352 -135238 9482 265243 -89473 -115832 -146601 -91429 -10517 -40938
17610 -40938 232801 492980 -169883 -230524 296624 -31631 115282 227855 165858 -254314
17599 -183910 183289 40986 246920 126836 174743 178810 -376668 -68433 -86577 -104371 5095
17587 307586 101385 -78151 -204926 81079 -310480 334868 -69885 237502 -44156 193531
17576 -98018 260414 -77961 -34109 -256934 -148293 379217 -5868 -613862 -301379 -134746
17565 272349 133893 -25143 87617 146936 240979 369290 266123 -72672 -36426 181433 136507
17554 136507 24417 -19162 346691 146896 -81723 339735 -121235 -75281 192915 47323
17543 99907 -127103 20575 261070 -142861 38985 153539 223247 193753 -48352 -109299 237227
$$ packed form
17621B90948k3040r4556a35238I482K55761h9473k6359l0769N5172a0517l0421
17610d0938B32801K60179a69883o0641B96624c1631A15282J12573o1997b54314
17599a83910A83289D0986K05934j20084M7907M067c76668f8433j8144j7794E095
17587C07586A01385g8151j26775H1079c10480C34868f9885B37502d4156A93531
17576i8018B60414g7961c4109k22825J08641C79217e868o07994c01379a34746
17565B72349A33893b5143H7617N9319R4043J28311j03167g2672L6246A81433m4926
17554A36507B4417a9162C46691A46896h1723C39735a21235M5954A92915D7323
17543I9907a27103B0575K40495a42861C8985J14554O9708k9494d8352o0947B37227
$$ plain form
17531 -32991 84289 91420 447209 -17189 -99679 34040 244645 75984 98212 -123943 96050
17519 -123201 -14760 21553 294430 370760 366215 174884 307910 306930 -133167 -130941 85017
17507 341053 255470 -220177 179153 -86156 -284080 517863 285615 295989 215248 61460
17496 425043 -67945 -122823 132350 231055 156822 -50590 80286 181973 -249576 403118 -103195
17484 89336 -147721 13906 132444 136221 35155 247353 279174 -88169 -56424 315188 -20664
17472 114610 322414 60892 148108 269708 126473 32688 85611 -32552 172444 112367 59725
17461 59725 14222 -24826 189727 44193 -13791 -63687 177015 93404 337818 584626 534246
17450 534246 154519 390170 404257 391031 223682 358130 154596 243781 3633 -138432
$$ packed form
17531c2991H4289P131L55789a7189q2490C4040K10605G5984K2228a23943I6050
17519a23201a4760B1553K72877P6330m545A74884J33026r80a33167K226H5017
17507C41053q5583b20177A79153h6156j97924E17863k32248J0374q0741F1460
17496D25043f7945n4878A32350R8705p4233e0590H0286J01687b49576D03118a03195
17484H9336a47721A3906J18538L777C5155K12198L1821h8169L1745C15188b0664
17472A14610K07804F0892Q7216J21600A26473C2688N2923c2552A72444o0077n2642
17461E9725A4222b4826A89727D4193a3791m9896A77015q3611K44414K46808n0380
17450E34246A54519K35651J4087j3226j67349J34448A54596Q9185C633a38432
$$ plain form
17439 -262279 528448 146333 115093 601252 -45632 632292 446505 227922 198035 224537
17429 224537 141829 383528 630052 160420 -94787 412255 65773 182262 363587 -147467
17418 -18468 105751 404640 637296 530429 294346 550918 351747 459145 117605 91027
17408 91027 458210 119643 189661 249024 96037 107425 328019 -85323 63674 161308 -22047
17396 448697 -81319 197879 402815 186555 216000 225492 260549 136827 353749 140149
17385 159792 116702 381326 93201 175730 -53684 274261 219976 -98929 183730 300619 121393
17373 -31903 132620 72901 198078 -206190 57084 -4443 93507 -173530 220229 -81205 -50961
17362 -50961 -174925 233668 -16402 95254 -51431 -119359 -71035 267654 306356 301443 423089
$$ packed form
17439b62279E28448A46333l1240M86159d5632F32292j85787k18583k9887K6502
17429B24537q2708K41699K46524A60420i4787D12255F5773J16489J81325a47467
17418a8468A05751K98889K32656j06867k36083K56572j99171J07398A17605k6578
17408I1027L67183A19643P0018N9363I6037J1388K20594h5323F3674R7634b2047
17396D48697h1319A97879K04936A86555K9445R492L5057j23722K16922A40149
17385A59792m3090K64624I3201Q2529e3684B74261n4285i8929A83730J16889A21393
17373c1903A32620n9719J25177b06190E7084d443I3507a73530B20229h1205L0244
17362e0961j23964B33668a6402I5254e1431o7928M8324B67654L8702m913J21646
$$ plain form
17351 423089 25694 -86462 655702 -51866 183237 258036 172964 155724 394456 109035 14649
17339 214859 219729 107330 7086 380544 -52273 179929 -16772 -28089 366402 377246 449608
17328 449608 324280 189547 617593 20259 137163 156478 275288 -28166 37192 -39261
17317 -48707 127751 353488 298196 299995 170784 20840 99272 518630 282299 -162371 113406
17305 377595 -25202 -29563 55655 324344 8354 -103583 335492 69943 104147 23634 85013
17294 85013 99537 412947 37233 63315 558457 180549 305065 61048 13621 -133377 -102586
17283 -102586 100537 191948 255268 511253 406492 129628 428376 -106578 86975 110954
17273 110954 389520 36642 264748 120754 231178 109244 189827 21117 155379 82596
$$ packed form
17351D23089B5694h6462F55702e1866A83237P4799q5072j7240K38732A09035A4649
17339B14859M870A07330G086L73458e2273A79929a6772j1317C66402J0844P2362
17328D49608j25328j34733M28046B0259J16904J9315J18810b8166C7192c9261
17317d8707A27751K25737n5292J799j29211B0840P8432M19358k36331a62371A13406
17305C77595b5202m361E5655K68689H354a03583C35492F9943L4204B3634O1379
17294H5013J4524L13410C7233K6082M95142A80549J24516F1048A3621a33377L0791
17283a02586A00537R1411O3320K55985j04761A29628K98748a06578H6975K3979
17273A10954K78566C6642K28106A20754J10424A09244Q0583B1117J34262p2783
$$ plain form
17263 82596 214151 298108 383846 -59948 279057 159854 -127042 72788 416596 -41561 325310
17251 347731 418957 299571 -196074 -27100 -23118 231568 -134833 428015 198018 197726 483004
17240 483004 101128 -7052 320515 452328 24283 393840 93137 167703 395074 90281 346750
17229 346750 147714 -27926 45785 260279 257673 176030 188285 108466 58176 57733 244789
17218 244789 399975 491069 396679 406316 420083 259365 -124354 189180 412331 303428
17208 303428 573935 293996 180170 230685 367478 129774 274914 234239 221265 436690
17198 436690 240800 511820 422817 429409 205693 210963 287168 -135636 464957 378924 280021
17187 280021 243107 132935 363345 116622 186966 217061 165048 130176 13801 383967 130045
$$ packed form
17263H2596J31555Q3957Q5738e9948B79057j19203a27042G2788L43808d1561C25310
17251C47731P1226j19386a96074b7100L982B31568a34833D28015A98018k92K85278
17240D83004A01128g052C20515J31813B4283L69557I3137P4566K27371I0281K56469
17229C46750A47714b7926D5785K14494k606q1643J2255p9819n0290m43J87056
17218B44789J55186R1094r4390R637J3767j60718a24354A89180K23151j08903
17208C03428K70507k79939j13826N0515J36793A29774J45140m0675j2974K15425
17198D36690j95890K71020q9003O592B05693N270P6205a35636D64957q6033r8903
17187B80021l6914j10172K30410A16622P0344L0095n2013l4872A3801L70166A30045
$$ plain form
17175 196209 384573 -15985 299993 396837 89713 192704 465277 484786 485625 450452 256497
17164 256497 358527 86815 439292 847192 199050 227234 490211 583906 158436 123652
17154 123652 83022 154678 259290 259309 597208 277504 568417 184053 -26269 273310 384904
17143 384904 408580 449587 260426 224261 -83951 -53076 177140 121982 419035 24829 329109
17132 329109 288208 199457 459333 382182 420840 340176 364656 729669 326064 483146 249611
17121 249611 442640 674799 612334 213671 452206 565995 94685 158162 286398 535668
17111 535668 435291 325801 429973 108155 585299 372222 503556 -41161 563494 342697
17101 342697 662046 223817 500569 518056 304286 453417 431933 323231 512125 253131
$$ packed form
17175A96209J88364a5985B99993R6844H9713J02991K72573J9509Q39l5173j93955
17164B56497J02030H6815L52477M07900A99050K8184K62977R3695A58436l4784
17154A23652m0630P1656J04612J9L37899B77504K90913A84053b6269B73310J11594
17143C84904K3676M1007j89161l6165h3951L0875A77140n5158K97053B4829L04280
17132C29109m0901q8751K59876p7151L8658q0664K4480L65013C26064J57082k33535
17121B49611J93029K32159o2465B13671K38535J13789I4685O3477J28236K49270
17111E35668j00377j09490J04172A08155M77144k13077J31334d1161E63494k20797
17101C42697L19349B23817K76752J7487k13770J49131k1484j08702J88894B53131
$$ plain form
17090 367487 552290 394885 722509 527633 538421 445671 418538 454696 542928 370553
17080 370553 421649 610775 297204 407682 538306 335692 486970 258574 302492 763837
17070 763837 577448 462894 439323 500030 525374 370989 681626 539120 558806 644115
17060 644115 325998 523250 521350 384464 593048 361159 501388 479084 589823 480999
17050 480999 528850 515660 778691 441695 625095 673564 630327 568747 778084 274621
17039 798103 512493 730213 325345 865160 645959 442972 629267 928369 804637 738999
17029 738999 801714 438164 347346 252044 608407 568517 660680 518817 784798 382233
17018 761529 900012 682998 484832 656962 790204 735108 850408 794921 375488 903084
$$ packed form
17090C67487J84803j57405L27624j94876J0788r2750k7133L6158Q8232j72375
17080C70553N1096J89126B97204J10478J30624k02614J51278k28396M3918M61345
17070G63837j86389j14554k3571O0707K5344j54385L10637j42506J9686Q5309
17060F44115l18117J97252j900j36886K08584k31889J40229k2304J10739j08824
17050D80999M7851j3190K63031l36996J83400M8469m3237o1580K09337B74621
17039G98103k85610K17720C25345N39815k19201k02987J86295K99102j23732o5638
17029G38999O2715l63550r0818r5302L56363l9890R2163j41863K65981C82233
17018G61529J38483k17014j98166J72130J33242n5096J15300n5487C75488N27596
$$ plain form
17008 903084 760854 980339 630080 564652 787604 766430 971529 484362 486266 649602
16998 649602 596425 1004328 363104 787380 892999 620170 869426 950643 719884 820411
16988 820411 914804 565257 883566 808566 760152 1078779 1067680 620694 1348008 1038657
16978 1038657 718346 1111765 576252 658730 971271 942294 872190 1003697 905524 1045947
16968 1045947 988243 1052677 1160470 1265910 898096 1146628 1122996 923656 791638 1107840
16958 1107840 876154 962450 1052995 899625 729245 875186 1134290 897225 1576582 1038987
16948 1038987 1017425 1309193 1016340 1294253 1037182 1217403 1298772 1046546 1125814 1149597
16938 1149597 1016589 967108 1361437 1218899 1586944 1386326 1437149 1468600 1475331 1375469
$$ packed form
17008I03084j42230K19485l50259o5428K22952k1174K05099D84362J904J63336
16998F49602n3177M07903C63104M24276J05619k72829K49256Q1217k30759J00527
16988H20411R4393l49547L18309p5000m8414L18627j1099m46986P27314l09351
16978A038657l20311L93419n35513Q2478L12541k8977p0104J31507r8173J40423
16968A045947n7704O4434J07793J05440l67814K48532k3632j99340j32018L16202
16958A107840k31686Q6296R0545j53370j70380J45941K59104k37065O79357n37595
16948A038987k1562K91768k92853K77913k57071J80221Q1369k52226P9268K3783
16938A149597j33008m9481L94329j42538L68045k00618N0823L1451O731r9862
$$ plain form
16928 1375469 1336172 1269779 1380362 1311308 1614020 998128 1286403 1506743 1602790 1751037
16918 1751037 1439934 1554225 1435183 1687181 1493064 1247006 1404710 1560958 1897802
16909 1897802 1944668 1650861 1953197 1767216 1782135 2005766 1832351 1711044 1763752 1583550
16899 1583550 2211153 1919200 1966218 1942854 1647192 1632031 2070877 1974131 1614706 1792382
16889 1792382 2110709 2023570 2192573 2311471 2113684 2280793 2151116 1846806 2383810 2266857
16879 2266857 2247395 2252197 2343275 1983508 2479825 2514903 2611554 2802646 2687331 2838838
16869 2838838 2496425 2943596 2981433 2888841 2911923 2828887 3138749 3035168 2981825 2937935
16859 2937935 2855610 2952695 3004606 3603556 2905430 3354451 3370802 3141359 2974035 3707434
$$ packed form
16928A375469l9297o6393J10583o9054L02712o15892K88275K20340R6047J48247
16918A751037l11103J14291j19042K51998j94117k46058J57704J56248L36844
16909A897802M6866k93807L02336j85981J4919K23631j73415j21307N2708j80202
16899A583550O27603k91953M7018k3364k95662j5161M38846r6746l59425J77676
16889A792382L18327q7139J69003J18898j97787J67109j29677l04310N37004j16953
16879B266857j9462M802R1078l59767M96317L5078R6651J91092j15315J51507
16869B838838l42413M47171L7837r2592K3082q3036L09862j03581n3343m3890
16859B937935q2325R7085N1911N98950o98126M49021J6351k29443j67324P33399
$$ plain form
16849 3707434 3540279 3575756 3600268 3573679 3517787 3882962 3931370 3599913 4008252 4083715
16839 4083715 3909486 4206464 4420630 4428489 3928604 4749115 4359467 4976706 4847606 4744609
16829 4744609 4698484 5038309 4603008 5145171 5124820 5012462 5029770 5369808 5798958 5598616
16819 5598616 5783188 5987882 6043678 6010319 6390807 6180022 6662581 6561022 6669899 6885093
16809 6885093 6898900 6975591 7280704 7591035 7636906 7779200 8094667 8089090 8279870 8303439
16799 8303439 8678709 9056857 9553164 9239070 9822065 9906154 9811153 10247818 10823903 11093528
16789 11093528 10956215 11781799 11810728 12044063 12401568 12939281 13153388 13740936 13794101 14419889
16779 14419889 14719601 15629716 16150629 16258581 16821353 17669490 17937156 18961408 19456143
$$ packed form
16849C707434j67155L5477K4512k6589n5892L65175M8408l31457M08339P5463
16839D083715j74229K96978K14166P859m99885Q20511l89648O17239j29100j02997
16829D744609m6125L39825m35301N42163k0351j12358J7308L40038M29150k00342
16819E598616J84572K04694N5796l3359L80488k10785M82559j01559J08877K15194
16809F885093J3807P6691L05113L10331M5871J42294L15467n577J90780K3569
16799H303439L75270L78148M96307l14094N82995Q4089r5001M36665N76085K69625
16789A1093528j37313Q25584K8929K33335L57505N37713K14107N87548N3165O25788
16779A4419889K99712R10115N20913J07952N62772Q48137K67666J024252M94735
$$ plain form
16770 19456143 20166137 20743166 21488777 22236450 22972839 24166027 25040789 25964253 26836489
16761 26836489 28112910 29230998 30391030 31737752 33321766 34362980 36049864 37721075
16753 37721075 39866212 41450651 43518538 45707129 47844108 50285321 52882373 55515365
16745 55515365 58805079 61641794 65197313 69231908 72997298 77054858 81593158 86104538
16737 86104538 91167590 96340481 102065741 108326553 114460719 120909451 127491532 134583963
16729 134583963 141499567 148476436 155621010 162562029 168659952 174726046 180259532 184504541
16721 184504541 187910590 190032927 191442760 191536336 190409583 188276692 185032610 180792180
16713 180792180 175453076 169773193 163177267 156366638 149238569 141984260 134693781 127963035
$$ packed form
16770A9456143P09994N77029P45611P47673P36389J193188Q74762R23464Q72236
16761B6836489J276421J118088J160032J346722J584014J041214J686884J671211
16753C7721075K145137J584439K067887K188591K136979K441213K597052K632992
16745E5515365L289714K836715L555519M034595L765390M057560M538300M511380
16737H6104538N063052N172891N725260O260812O134166O448732O582081P092431
16729A34583963O915604O976869P144574O941019O097923O066094N533486M245009
16721A84504541L406049K122337J409833R3576j126753k132891l244082m240430
16713A80792180n339104n679883o595926o810629p128069p254309p290479o730746
$$ plain form
16705 127963035 120943921 114097361 107920878 101759088 95709691 90172413 85033160 80234367
16697 80234367 75833079 71465406 67421104 63921279 60336242 57200961 53884948 51435477
16689 51435477 48765797 46570950 44227518 42350911 40026841 38098888 36159612 34505057
16681 34505057 33490385 31449039 30380973 29423372 27701217 26545724 25338823 24672270
16673 24672270 23634576 22673176 22003685 21371419 20373013 19551584 18786420 18006237 17556018
16664 17556018 17099218 16213942 15620820 15329070 14802930 14198027 13740864 13506381 13212758
16655 13212758 12748839 12388493 12020612 11872035 11185261 10947326 10621661 10526301 10105062
16646 10105062 10166358 9551561 9523951 8951534 8617907 8618983 8337363 8036809 8062939 7666757
$$ packed form
16705A27963035p019114o846560o176483o161790o049397n537278n139253m798793
16697H0234367m401288m367673m044302l499825l585037l135281l316013k449471
16689E1435477k669680k194847k343432j876607k324070j927953j939276j654555
16681C4505057j014672k041346j068066r57601j722155j155493j206901o66553
16673B4672270j037694r61400o69491o32266r98406q21429p65164p80183m50219
16664A7556018m56800q85276n93122k91750n26140o04903m57163k34483k93623
16655A3212758m63919l60346l67881j48577o86774k37935l25665r5360m21239
16646A0105062O1296o14797k7610n72417l33627J076k81620l00554K6130l96182
$$ plain form
16636 7666757 7832643 7644447 6930382 7012157 6759996 6919241 6146734 6444396 6208389 6049090
16626 6049090 6184108 6004226 5706862 5529247 5518728 5288385 5305183 5030331 5274200 4941978
16616 4941978 4718068 4701457 4546986 4500832 4370417 4797354 4223248 4342521 4210397 3991291
16606 3991291 3709382 4155682 3809303 3975289 3672326 3795925 3545413 3385132 3396159 3271421
16596 3271421 3112098 3239022 3241562 3307110 3220918 3110703 3161878 3000061 2967471 2855726
16586 2855726 3107815 2815102 2881455 2630950 2644288 2442358 2682401 2384846 2445146 2224490
16576 2224490 2318223 2167832 2154575 2248317 2514610 2100795 2166639 2364706 1883767 2178019
16566 2178019 1954939 2394676 2287940 2478855 1927814 1923727 1910407 1564871 2076286 1858282
$$ packed form
16636G666757J65886j88196p14065Q1775k52161J59245p72507K97662k36007j59299
16626F049090J35018j79882k97364j77615j0519k30343J6798k74852K43869l32222
16616D941978k23910j6611j54471m6154j30415M26937n74106J19273j32124k19106
16606C991291k81909M46300l46379J65986l02963J23599k50512j60281J1027j24738
16596C271421j59323J26924K540O5548q6192j10215N1175j61817l2590j11745
16586B855726K52089k92713O6353k50505J3338k01930K40043k97555O0300k20656
16576B224490R3733j50391j3257R3742K66293m13815O5844J98067m80939K94252
16566B178019k23080M39737j06736J90915n51041m087j3320l45536N11415k18004
$$ plain form
16556 1858282 2111396 1562215 1726104 1941720 1643974 1810851 1514481 1684811 1711111 1644362
16546 1644362 1606633 1487141 1794994 1848383 1365442 1665576 1854296 1379326 1284054 1577188
16536 1577188 1391323 1270545 1690336 989786 1345272 1389745 1575072 1138532 1222321 1433852
16526 1433852 1216229 1326214 1261526 1492758 1588742 1329705 1132029 1273175 1098908 1054803
16516 1054803 1335154 1054431 1118745 959512 1415807 1274887 1287863 1400150 1186214 1057277
16506 1057277 1143228 987070 889808 830665 945491 1115549 1000523 813634 1193919 1160646
16496 1160646 1180052 728877 1288068 616058 742047 670460 1008303 525944 1038277 670654
16486 670654 571997 926751 998246 763008 1021730 861765 801075 1045556 853711 820192
$$ packed form
16556A858282K53114n49181J63889K15616k97746J66877k96370J70330K6300o6749
16546A644362l7729j19492L07853N3389m82941L00134J88720m74970r5272K93134
16536A577188j85865j20778M19791p00550L55486M4473J85327m36540Q3789K11531
16526A433852k17623J09985o4688K31232R5984k59037j97676J41146j74267m4105
16516A054803K80351k80723O4314j59233M56295j40920J2976J12287k13936j28937
16506A057277Q5951j56158r7262n9143J14826J70058j15026j86889L80285l3273
16496A160646J9406m51175N59191F16058J25989p1587L37843m82359N12333l67623
16486F70654r8657L54754P1495k35238K58722j59965o0690K44481j91845l3519
$$ plain form
16476 820192 846293 784963 1051804 680474 412595 763046 662490 479919 559123 408337
16466 408337 532287 401066 809461 499626 416282 642474 770034 622864 528715 569883
16456 569883 474863 614803 835983 495299 422348 341737 529634 544336 906462 758550
16446 758550 735407 488107 680186 598228 954436 708113 679366 512079 527747 695928
16436 695928 471288 650988 674487 386497 423673 405447 472631 565746 689181 456652
16426 456652 491753 522058 668454 389408 603097 352848 216534 220153 685013 387239
16416 387239 415453 482688 213224 168191 258806 177712 295632 150247 181314 471757 653670
16405 653670 163148 327120 328601 674925 558856 642986 293792 304066 217705 559182
$$ packed form
16476H20192K6101o1330K66841l71330k67879L50451j00556j82571P9204j50786
16466D08337J23950j31221M08395l09835q3344K26192J27560j47170r4149M1168
16456E69883r5020J39940K21180l40684p2951q0611J87897J4702L62126j47912
16446G58550k3143k47300J92079q1958L56208k46323k8747j67287J5668J68181
16436F95928k24640J79700K3499k87990L7176j8226O7184R3115J23435k32529
16426D56652L5101L0305J46396k79046K13689k50249j36314L619M64860k97774
16416C87239K8214O7235B13224m5033R0615q1094J17920j45385L1067K90443J81913
16405F53670A63148J63972J481L46324j16069Q4130B93792J0274q6361L41477
$$ plain form
16395 559182 683568 310461 222834 314260 693426 484620 86958 425957 235060 488253
16385 488253 210964 177539 687922 199963 610021 300450 800416 400444 174868 382255
16375 382255 454779 494922 300065 251159 406140 492963 257304 377825 285267 620384
16365 620384 172989 134580 451106 445199 261809 520072 258823 84355 543059 285065
16355 285065 378728 257611 69259 407984 215208 436504 200754 217844 277187 195531
16345 195531 53127 489113 417760 477860 142346 480113 -19021 84649 283639 -11194 276342
16333 196531 172375 18693 20815 105881 340445 623565 130903 469290 407922 454472 148987
16321 262662 305159 103621 259463 336493 208508 337143 250596 305243 179342 24607
$$ packed form
16395E59182J24386C10461q7627R1426L79166k08806H6958L38999j90897K53193
16385D88253B10964l3425N10383A99963M10058C00450M99966l99972A74868K07387
16375C82255P2524M0143j94857m8906J54981Q6823k35659J20521r2558L35117
16365F20384A72989l8409L16526n907j83390K58263B58823H4355M58704k57994
16355B85065R3663j21117F9259L38725j92776K21296B00754J7090N9343q1656
16345A95531E3127M35986p1353O0100A42346L37767a9021H4649J98990a1194B76342
16333A96531k4156A8693K122Q5066K34564K83120A30903L38387o1368M6550A48987
16321B62662M2497A03621J55842P7030j27985J28635q6547N4647j25901B4607
$$ plain form
16310 231878 240902 287529 64574 124810 153432 -132508 296360 -162266 170178 224941 -49015
16298 319929 238547 104840 388346 -40068 31075 112202 344816 329341 209434 276502 -13723
16286 408726 -18829 355357 43424 283910 251505 194314 74541 125647 305794 97080 -101378
16274 -16570 97869 332566 284743 117068 664452 201187 142863 372858 -60703 493580
16263 45325 143041 145366 58237 278249 313097 37848 -3425 35787 -125861 52858 142631 474572
16251 474572 194337 -26793 -10427 -92849 96225 74550 388384 151821 180465 6630 129828
16240 129828 -41194 160594 -71371 186546 248218 10592 319857 -162187 -48426 131352
16229 -176044 67635 -140099 59517 114923 53126 -167929 471043 206325 468887 194092
$$ packed form
16310B31878R024M6627F4574O0236K8622a32508B96360a62266A70178N4763d9015
16298C19929q1382A04840K83506d0068C1075Q1127K32614j5475j19907O7068a3723
16286D08726a8829C55357D3424K40486l2405n7191G4541N1106J80147I7080a01378
16274a6570I7869K34697m7823A17068N47384B01187n8324K29995f0703D93580
16263D5325R7716K325E8237K20012L4848C7848c425C5787a25861E2858Q9773L31941
16251D74572A94337b6793a0427q2422I6225k1675L13834A51821K8644F630J23198
16240A29828d1194A60594g1371A86546O1672A0592L09265a62187d8426A31352
16229a76044F7635a40099E9517N5406E3126a67929D71043B06325K62562A94092
$$ plain form
16218 291703 46580 146203 401453 183432 93193 176273 30039 198130 156741 417580 -88596
16206 98653 250450 91065 -160874 188033 305141 43150 -24276 393931 195578 -91228
16195 -101899 169512 156586 -57174 -128846 6471 221355 -154481 107774 57830 71887 -18703
16183 131252 64015 -288013 360131 -58484 135618 92034 21187 -49910 228507 -206425
16172 43655 -37027 -27573 -74627 351510 -191628 517913 -176021 117817 -224707 139760
16161 -14119 -77241 244340 18257 173020 40030 -73728 192813 -70012 50536 131852 398325
16150 398325 27671 -50939 -156128 -23163 217214 -90685 -289061 -180945 -134611 234858
16139 21973 -20435 -206740 192730 -36033 21773 -3272 28889 -20411 215099 169069 -206180
$$ packed form
16218B91703D6580R9623K55250A83432r0239Q3080C0039J68091m1389K60839h8596
16206I8653J51797I1065a60874A88033J17108D3150b4276C93931A95578i1228
16195a01899A69512j2926e7174p1672F471K14884a54481A07774m9944J4057a8703
16183A31252F4015b88013C60131e8484A35618m3584B1187d9910B28507b06425
16172D3655c7027R454m7054C51510a91628E17913a76021A17817b24707A39760
16161a4119o3122B44340A8257J54763D0030g3728A92813g0012E0536Q1316K66473
16150C98325B7671e0939j05189b3163B17214i0685j98376J08116M6334B34858
16139B1973b0435j86305A92730c6033B1773c272B8889b0411B15099m6030b06180
$$ plain form
16127 205267 -63508 292937 204277 -221799 131650 211916 79339 -178935 193078 30696
16116 25624 -217982 109931 -201933 -284742 237825 -159459 -144653 55380 -185568 156597
16105 -130239 -278707 42768 -91166 -172442 153896 112971 91423 -129676 -195085 55405 -39931
16093 -149344 -301249 -275166 -113740 30301 112027 129118 99025 -197041 225486 52679 313630
16082 313630 55186 79163 95008 -18744 -106698 73097 -43418 -207000 -123327 -59409 299576
16070 138425 40509 -48100 -89700 127695 -145877 -107487 -3318 -102807 -138118 -177554 -77164
16058 23659 -78014 -66222 -52338 148916 -37909 197283 371557 89667 57742 -237083 206335
16046 200072 249048 -50465 -34411 -74937 346503 174575 229076 145874 -22722 238749 -16725
$$ packed form
16127B05267f3508B92937q8660b21799A31650Q0266G9339a78935A93078C0696
16116B5624b17982A09931b01933q2809B37825a59459J4806E5380a85568A56597
16105a30239j48468D2768i1166q1276A53896m0925k1548a29676o5409E5405c9931
16093a49344j51905K6083a13740C0301Q1726J7091l0093a97041B25486E2679K60951
16082C13630E5186K3977J5845a8744q7954G3097d3418j63582Q3673e9409B99576
16070A38425D0509d8100m1600A27695a45877L8390c318r9489l5311l9436g7164
16058B3659g8014J1792J3884A48916c7909A97283J74274H9667l1925b37083B06335
16046B00072M8976e0465J6054m0526C46503j71928N4501q3202b2722B38749a6725
$$ plain form
16034 -93372 -299949 -162043 104243 149392 -103542 -295235 23527 -270872 52190 -250496
16023 71379 -32731 17924 91977 -87899 140222 160478 -104669 206360 18639 -215720 -152250
16012 -152250 115605 182223 -216964 58715 -54577 -130453 -46290 -14763 -57869 138232 -52228
16000 194668 -342782 -400122 -161783 125571 250624 -73458 -145814 -342173 -340367 131533
15989 -298040 191834 70698 -11033 -182434 120970 294122 222143 63083 430878 144040
15978 524987 332508 -50898 -233071 -152257 -206659 207809 -74826 -95636 108407 -41998 233370
15966 192909 107326 119455 68032 25719 -111844 238395 -6737 36710 162189 -322427 -235649
15955 -235649 -265393 143848 123243 -364108 143943 -52367 149923 25547 -131439 -276636
$$ packed form
16034i3372k06577J37906A04243M5149a03542j91693B3527b70872E2190b50496
16023G1379c2731A7924P4053h7899A40222K0256a04669B06360A8639b15720O3470
16012a52250A15605O6618b16964E8715e4577p5876d6290a4763m3106A38232e2228
16000A94668c42782n7340a61783A25571J25053g3458p2356j96359J806A31533
15989b98040A91834G0698a1033j71401A20970J73152p1979F3083L67795A44040
15978E24987j92479e0898j82173Q0814n4402B07809g4826k0810A08407d1998B33370
15966A92909q5583J2129n1423B5719a11844B38395f737C6710J25479c22427Q6778
15955b35649k9744A43848k0605c64108A43943e2367A49923B5547a31439j45197
$$ plain form
15945 -276636 -75738 -265876 -199241 115857 -156827 -65258 -104024 86181 -57665 91270 209783
15934 209783 -115140 -162709 -100655 -212365 -78147 45936 -7421 -110504 -265542 -65338 309586
15922 62381 141306 35001 43193 178832 35060 94827 -216119 328166 94775 -84256 -51618
15911 -51618 149493 -66473 -114384 -81594 40530 96212 -82135 166430 -53107 -352198 312772
15899 -394933 75157 -4617 159249 66233 -84736 -4276 -105064 -34680 102853 -134064 -64785
15887 -99933 -77993 -218645 -171692 239610 88066 55447 -29489 53373 164792 -11235 190306
15875 -283198 92712 153297 -358879 -59574 -12278 -181690 216191 -176664 220623 -221258
15864 -215913 188446 -452717 -166310 -73135 7773 -233007 43998 135453 -3664 -282433 -206365
$$ packed form
15945b76636g5738j90138O6635A15857a56827f5258l8766H6181e7665I1270J18513
15934B09783a15140m7569O2054j11710g8147D5936g421j03083j55038f5338C09586
15922F2381P8925C5001Q192J35639C5060N9767b16119C28166I4775h4256L2638
15911e1618A49493f6473m7911L2790D0530N5682h2135A66430e3107k99091C12772
15899c94933G5157d617A59249F6233h4736d276j00788c4680A02853a34064f4785
15887i9933K1940j40652M6953B39610H8066l2619b9489E3373J11419a1235A90306
15875b83198I2712O0585c58879e9574a2278j69412B16191a76664B20623b21258
15864b15913A88446d52717a66310g3135G773b33007D3998R1455c664k78769P6068
$$ plain form
15853 -206365 -226530 -128406 -441723 -20988 -12482 214049 -66892 -116325 -342676 -282972 -22662
15841 4248 -4070 -169408 12042 -243990 -69959 103029 31894 -145758 172076 74922 -3196
15829 -349837 -245809 105118 -154374 -66297 -53033 -77514 -295899 -129667 -199532 39096
15818 20927 150608 -287345 221205 155048 -173650 29191 324002 -141275 74569 86619
15808 86619 -127739 90944 -146926 266216 -7208 -57425 -94880 131346 23327 98618 -189987
15796 -191313 29792 281608 -74420 -7584 177807 116730 36304 -182176 319299 14201 -17580
15784 -508203 -393686 19873 -93860 252359 -68201 21656 92976 -159648 -143229 179294 309787
15773 309787 -474882 -28045 -216706 63510 -33458 -131444 7533 -386660 40985 146182 -295151
$$ packed form
15853b06365k0165R8124l13317b0988Q506B14049f6892m9433k26351N9704b2662
15841D248d070j65338A2042b43990f9959A03029C1894a45758A72076G4922c196
15829c49837J04028A05118a54374f6297J3264k4481k18385a29667o9865C9096
15818B0927J29681b87345B21205o6157a73650B9191K94811a41275G4569J2050
15808H6619a27739I0944a46926B66216g208n0217l7455A31346B3327P5291a89987
15796a91313B9792K51816g4420g584A77807o1077C6304a82176C19299A4201a7580
15784e08203J14517A9873i3860B52359f8201B1656P1320a59648J6419A79294J30493
15773C09787d74882b8045j88661F3510c3458r7986G533c86660D0985J05197b95151
$$ plain form
15761 -178980 141232 -40706 196849 -58527 155797 -40404 36687 103521 131612 -123912 -92053
15750 -92053 203996 -138423 -121341 -117357 -86808 185848 133719 176863 34515 -47068 93695
15738 -250414 -10333 -421002 -182496 168424 45748 -52261 -137320 -242823 259075 -112509
15727 34087 -55078 118877 -284404 -176332 -93955 -142239 136161 124738 -330444 135528
15716 -99719 -179287 -329557 4131 -60946 -389555 416492 -68743 -27123 -273946 -419976 212561
15704 -179719 -2517 -140698 -12240 95573 -304060 -86563 -274016 -19155 -218116 151511 84490
15693 84490 50392 -43918 -92358 -288580 -78704 -147940 112015 -317666 -221415 149280 -283087
15681 109176 -7935 220600 17909 35431 210693 -308392 -159163 102780 9542 -78864 -29566
$$ packed form
15761a78980A41232d0706A96849e8527A55797d0404C6687O6834K8091a23912L1859
15750i2053B03996a38423J7082L984L0549A85848n2129M3144C4515d7068I3695
15738b50414a0333m10669a82496A68424D5748e2261q5059j05503B59075a12509
15727C4087e5078A18877b84404J08072Q2377m8284A36161j1423c30444A35528
15716i9719p9568j50270D131f0946l28609D16492f8743b7123k46823j46030B12561
15704a79719b517j38181a2240I5573c04060h6563j87453a9155j98961A51511o7021
15693H4490l4098d3918m8440j96222g8704o9236A12015c17666R6251A49280b83087
15681A09176g935B20600A7909J7522J75262c08392J49229A02780I542g8864b9566
$$ plain form
15669 -94880 -55935 147415 -3749 -296039 -277785 121487 94329 -33261 -93741 120415 18455
15657 89635 85630 17606 -141771 -258824 128801 19878 3707 -18865 290953 207340 -61641
15645 108569 -18367 94822 131204 320037 156173 -107145 -170366 54322 56991 262226 118514
15633 -137334 -100915 198099 -355593 167283 21685 -56990 85049 38151 -26944 50694 -132272
15621 125964 -49975 272094 47456 -75309 -141166 54612 -57952 414859 -59852 -185983 99612
15609 -118859 31397 42099 -237902 -64216 88478 -168370 -152783 -154542 -15752 234800 -228714
15597 130863 91616 -280211 83148 -259021 -66176 -157519 -270540 38290 -339776 202243
15586 -214970 -44169 108906 174030 217712 114969 -92651 23987 -15007 -116211 -27877 33102
$$ packed form
15669i4880L8945A47415c749k92290J8254A21487k7158c3261o0480A20415A8455
15657H9635m005A7606a41771j17053A28801A9878C707a8865B90953q3613f1641
15645A08569a8367I4822L6382J88833A56173a07145o3221E4322K669K05235A18514
15633a37334L6419A98099c55593A67283B1685e6990H5049C8151b6944E0694a32272
15621A25964d9975B72094D7456g5309o5857E4612e7952D14859e9852j26131I9612
15609a18859C1397J0702b37902f4216H8478a68370J5587j759a5752B34800b28714
15597A30863l9247b80211H3148b59021f6176r1343j13021C8290c39776B02243
15586b14970d4169A08906O5124M3682j02743i2651B3987a5007j01204b7877C3102
$$ plain form
15574 -306028 -107860 -158228 -110240 -101356 -286533 165361 -145347 -361206 -151658 -283323
15564 -283323 172025 -181919 50050 115905 -87873 202731 16918 322438 -122033 4371 -43156
15552 -28628 -82043 61588 -406551 -198281 51417 -113688 91236 -156247 -175646 -366355 311309
15540 -99212 66229 -74434 -52532 -191762 -84448 -406807 -28286 269247 49009 -214506 336001
15528 -120302 138248 -98596 44162 9620 14568 103071 -8516 22148 1929 163022 63695 157660
15516 157660 26403 -51837 438388 10526 124703 40122 -320091 128535 90981 270637
15506 270637 -88421 11672 25382 -49907 250999 83786 -123429 10701 31300 158963 -36909
15494 254228 -100331 134422 44470 -8173 20962 -173663 80851 -210482 -215303 -83539 116158
$$ packed form
15574c06028a07860n0368M7988Q884j85177A65361a45347k15859a51658j31665
15564b83323A72025a81919E0050O5855h7873B02731A6918L05520a22033D371d3156
15552b8628n3415F1588d06551a98281E1417a13688I1236a56247j9399j90709C11309
15540i9212F6229g4434K1902j39230h4448l22359b8286B69247D9009b14506C36001
15528a20302A38248i8596D4162I620M948Q8503h516B2148A929J61093F3695R3965
15516A57660B6403e1837D38388A0526J14177D0122c20091A28535l7554J79656
15506B70637h8421A1672J3710d9907B50999H3786a23429A0701K0599J27663c6909
15494B54228a00331A34422D4470h173B0962a73663H0851b10482m821h3539A16158
$$ plain form
15482 -113070 105317 -10210 -97580 -171293 -57917 13595 200906 66248 -479396 73344 -55713
15470 223214 192785 202520 333126 -242312 457919 -106268 -211886 112888 -97141 166855
15459 21432 234265 252307 301046 189977 111720 82424 194434 -205568 8467 -147726 -83941
15448 -83941 22694 -9362 200972 -34618 -325575 -38309 -19224 -276307 -295873 -95130 -120514
15437 -120514 -68175 56189 -158860 297406 24285 100892 -279298 165398 -103926 -63398
15427 -63398 -127442 76117 65002 -109742 121073 330283 -110386 -182722 51818 -268541 -5022
15415 -113459 -113572 83185 121863 -27324 -231156 171216 255594 163989 -98645 -360573 32307
15403 351515 218846 73954 -26331 466862 -33520 129346 -46370 2391 175024 -5416 102226
$$ packed form
15482a13070A05317a0210q7370p3713e7917A3595J87311F6248d79396G3344e5713
15470B23214l0429R735J30606b42312D57919a06268j05618A12888i7141A66855
15459B1432K12833J8042M8739j11069p8257k9296J12010b05568H467a47726O3785
15448h3941B2694i362B00972c4618k90957c8309J9085k57083j9566i5130k5384
15437a20514N2339E6189a58860B97406B4285P6607b79298A65398a03926M0528
15427f3398o4044G6117j1115a09742A21073K09210a10386p2336E1818b68541e022
15415a13459j13H3185L8678b7324k03832A71216Q4378r1605i8645k61928C2307
15403C51515j32669G3954b6331D66862c3520A29346d6370B391J72633e416A02226
$$ plain form
15391 65345 -45614 199210 -180569 227044 -69637 73338 313399 155594 -11135 -201772
15381 -201772 131672 -192964 -25255 -208433 -42299 -279673 334032 -111209 -150995 -139224
15371 -139224 261674 -13796 244083 87645 205559 310305 13480 203602 -21791 -177541
15361 -177541 -143070 19137 77225 -151769 219056 243590 -150075 -74568 -310736 -111512
15350 123464 65981 -285566 55650 316190 -112488 -16783 55958 -265649 76617 -360294
15339 80946 72011 -181534 -83412 172551 411799 -69791 101820 -136462 347975 37130 400847
15328 400847 143871 -3803 -608488 -87904 33507 56729 -173264 34143 -223325 -11689 -69513
15317 -69513 51676 173562 -50327 -59191 27438 -94708 -54494 -107496 151025 284472 -167335
$$ packed form
15391F5345d5614A99210a80569B27044f9637G3338K40061A55594a1135j90637
15381b01772A31672a92964b5255j83178d2299k37374C34032a11209l9786J1771
15371a39224B61674a3796B44083H7645J17914J04746A3480J90122b1791j55750
15361a77541L4471A9137N8088a51769B19056K4534a50075g4568k36168a11512
15350A23464n7483b85566E5650K60540a12488a6783E5958b65649G6617c60294
15339H0946q935a81534h3412A72551K39248f9791A01820a36462C47975C7130L63717
15328D00847A43871c803o04685h7904C3507K3222a73264C4143b23325a1689n7824
15317f9513E1676J21886e0327q864B7438i4708M0214n3002A51025J33447a67335
$$ plain form
15305 -186580 -27142 25461 105437 -110256 -214178 -112525 -53376 269468 -32526 -75838 173416
15293 51709 -83413 200841 -249802 278326 254097 -4493 -136240 301524 184635 -134028
15282 -178965 214481 110018 -231177 -179049 232208 -141274 -56695 162944 -37209 137351
15271 217906 50867 32071 -164057 -363161 124421 87302 -132602 216711 431410 244647
15261 244647 -5124 -84416 102275 -53478 151320 255171 276172 -99782 19697 269268 220948
15250 220948 704484 1223098 1120354 1176835 1114988 564501 372833 -50702 99451 128851
15240 128851 102459 131966 -36907 756807 57781 -112519 287462 -221687 -150998 -146977 97700
15228 95681 92710 262886 -257269 187804 166450 -53525 -109090 185932 223446 -72732 -142441
$$ packed form
15305a86580b7142B5461P9976a10256j03922J01653e3376B69468c2526m3312A73416
15293E1709h3413B00841b49802B78326k4229d493j31747C01524j16889a34028
15282a78965B14481j04463b31177N2128B32208a41274e6695A62944c7209A37351
15271B17906E0867j8796a64057j99104A24421l7119a32602B16711K14699j86763
15261B44647e124p9292A02275e3478A51320J03851K1001i9782A9697K49571m8320
15250B20948M83536N18614j02744N6481o1847n50487j91668e0702I9451K9400
15240A28851k6392K9507c6907G56807E7781a12519B87462b21687P0689M021I7700
15228I5681k971J70176b57269A87804k1354e3525n5565A85932L7514g2732o9709
$$ plain form
15217 -142441 270905 208069 -108991 -17762 -138287 200514 119783 166498 -12777 35142 77746
15206 77746 330722 78139 -197852 -254846 -61180 -73806 28063 155150 217118 113957 -227531
15194 -9424 273441 47204 59019 -178322 -120927 100785 -231591 34127 258350 200188 72146
15182 -289689 147957 -55260 175884 -51854 311992 -85493 152529 -104321 28755 358530
15172 358530 159786 1913 8982 266235 282929 276337 -117983 -126706 -162914 513554 195672
15160 387308 -110187 430169 22194 81854 -137704 -194064 -175176 300719 -147534 -151886 -57408
15148 481883 -72507 101989 -146991 -23923 82941 -117623 195023 412173 282217 -20382
15137 269943 -6756 324869 -35926 47175 173117 209394 16847 85800 70534 218931 -9828
$$ packed form
15217a42441B70905o2836a08991a7762j20525B00514q0731M6715a2777C5142M2604
15206G7746K52976G8139a97852n6994f1180j2626B8063J27087O1968j03161b27531
15194i424B73441D7204J1815a78322N7395A00785b31591C4127K24223n8162G2146
15182b89689A47957e5260A75884e1854C11992h5493A52529a04321B8755L29775
15172C58530A59786A913P069K57253J6694o592a17983q723l6208E13554A95672
15160C87308a10187D30169B2194N9660a37704n6360J8888C00719a47534m352e7408
15148D81883g2507A01989a46991b3923H2941a17623A95023K17150j29956b0382
15137B69943f756C24869c5926D7175J25942L6277A6847O8953j5266J48397i828
$$ plain form
15125 42258 337816 -11550 355564 328673 -76517 121751 164866 300201 122897 -201427
15114 235822 22137 43829 263531 210524 95833 305371 496439 157019 18669 119438
15104 119438 191063 -107771 -43708 58065 227265 219505 480086 368426 184885 -3761 128575
15092 391179 -291184 107340 -54332 -10996 109950 210421 -132256 292382 -51835 -53964
15082 -53964 -58615 448415 189906 240305 338929 137988 247405 -67975 10379 65292 249234
15071 249234 141267 148956 79938 212444 -26513 309742 431096 181763 217380 233261 -120660
15059 437115 220521 100408 -2303 17067 210841 87514 133382 138701 191885 -172510 185032
15047 237379 423767 254728 314577 237616 529121 -19652 249302 -10956 -44377 429657
$$ packed form
15125D2258K95558a1550C55564k6891g6517A21751M3115J35335A22897b01427
15114B35822B2137K1692K19702n3007I5833K09538J91068A57019A8669J00769
15104A19438P1625a07771d3708E8065J69200p760K60581j11660j83541c761A28575
15092C91179b91184A07340e4332a0996A09950J00471a32256B92382e1835k129
15082e3964m651D48415A89906N0399R8624A37988J09417f7975A0379N4913J83942
15071B49234j07967P689o9018J32506b6513C09742J21354A81763L5617J5881a20660
15059D37115k16594A00408b303A7067J93774H7514M5868N319N3184a72510A85032
15047B37379J86388j69039N9849p6961K91505a9652B49302a0956l3421D29657
$$ plain form
15036 -192880 -87546 39776 69858 555 -28551 233162 -86013 375889 269470 364721 93374
15024 349089 54623 344800 515441 240595 -228074 3414 214900 81124 -35702 145267
15013 -57 93352 144821 198509 339257 115281 116860 526736 16683 408363 366073 163492
15001 160579 339649 158138 224253 191498 290469 316281 257147 163650 263717 218480 -56586
14989 248282 345501 88093 5105 107167 222957 478112 111351 306342 425453 235658
14979 235658 521580 265420 508950 265521 -117402 256516 386141 148290 184315 126429
14969 126429 227771 134670 38932 93558 519568 153109 -60417 316725 402974 259156
14959 259156 497888 429864 364334 351235 323527 417001 159909 -77930 212511 541739 300083
$$ packed form
15036a92880h7546C9776L0082E55b8551B33162h6013C75889j06419R5251I3374
15024C49089E4623K90177J70641B40595b28074C414K11486H1124c5702A45267
15013e7I3352N1469N3688J40748A15281J579M09876A6683L91680m2290A63492
15001A60579J79070A58138O6115l2755R8971K5812n9134r3497J00067m5237e6586
14989B48282R7219H8093E105J02062J15790K55155A11351J94991J19111j89795
14979B35658K85922k56160K43530k43429a17402B56516J29625A48290L6025n7886
14969A26429J01342r3101C8932N4626M26010A53109f0417C16725Q6249j43818
14959B59156K38732o8024o5530j3099k7708R3474A59909g7930B12511L29228k41656
$$ plain form
14948 300083 565404 421598 636974 225785 236458 425466 419752 226121 388765 390135
14938 390135 251428 254588 232199 518521 290862 284513 261803 471883 351794 155650 254224
14927 254224 685659 402835 280731 307114 141976 181519 160239 383757 283491 310301
14917 310301 595040 491808 478008 44372 472083 330055 205020 169833 294923 420979
14907 420979 618731 396931 143822 179791 191186 137166 328482 262319 561675 418437
14897 418437 548024 230499 301660 331906 166752 542929 269797 103056 351397 483187
14887 483187 523446 531628 882546 292917 131797 370092 430759 393093 295741 535678 306414
14876 306414 499727 520311 675520 596555 518022 404143 638777 274658 687614 194678
$$ packed form
14948C00083K65321j43806K15376B25785J0673J89008n714j93631J62644J370
14938C90135j38707L160k2389K86322k27659o349k2710K10080j20089A55650R8574
14927B54224M31435k82824j22104K6383A41976L9543k1280K23518j00266K6810
14917C10301K84739j03232j3800D4372M27711j42028j25035l5187J25090J26056
14907D20979J97752k21800A43822L5969J1395n4020J91316o6163K99356j43238
14897D18437J29587B30499P1161L0246j65154L76177B69797A03056K48341J31790
14887D83187M0259Q182L50918B92917A31797K38295O0667l7666r7352K39937k29264
14876C06414J93313K0584J55209p8965p8533j13879K34634B74658M12956A94678
$$ plain form
14865 162615 436621 375974 305363 434382 379454 416854 452208 484358 539137 405925 342840
14854 342840 590006 294109 501983 400181 348326 543761 647010 434557 297720 367458
14844 367458 390133 275320 452277 281761 424235 457985 458919 432350 476069 202082 667316
14833 667316 493791 831505 778659 497829 203105 299324 516202 846098 610616 72718
14822 593649 607045 544472 430218 601365 739280 308022 199261 243137 716930 537584
14812 537584 421348 808600 686133 559414 427609 539816 334256 306107 456573 401211
14802 401211 501905 792863 736568 144239 395268 996943 637160 747979 508953 548831
14792 548831 433323 542812 722990 363676 677507 850957 1066752 771788 381471 675636
$$ packed form
14865A62615K74006o0647p0611J29019n4928L7400L5354L2150N4779j33212o3085
14854C42840K47166B94109K07874j01802n1855J95435J03249k12453j36837O9738
14844C67458K2675j14813J76957j70516J42474L3750R34k6569M3719B02082M65234
14833F67316j73525L37714n2846k80830B03105R6219K16878L29896k35482G2718
14822E93649J3396o2573j14254J71147J37915C08022j08761M3876M73793j79346
14812E37584j16236L87252j22467j26719j31805J12207k05560k8149J50466n5362
14802D01211J00694K90958n6295A44239K51029O01675l59783J10819k39026L9878
14792E48831j15508J09489J80178l59314L13831J73450K15795k94964C81471K94165
$$ plain form
14782 675636 291674 670386 590720 700830 307822 897472 580432 593618 571497 772278
14772 772278 710030 411960 610655 302604 722832 762086 921535 492075 636133 566362
14762 566362 679486 583433 476550 705228 761716 454894 401552 508504 539123 651662
14752 651662 488692 865727 757615 606713 892548 725723 971022 514117 764317 943820
14742 943820 559423 771351 908023 770657 1190958 725274 706783 735766 841178 686044
14732 686044 468784 870048 710627 817986 972990 1007356 729633 851910 1151748 849955
14722 849955 825942 648589 889901 759174 794398 603922 529819 1072743 1202353 618019
14712 618019 1233992 798764 820933 1045240 907484 1009028 890102 1102630 775877 731113
$$ packed form
14782F75636B91674L78712p9666J10110C07822N89650l17040J3186k2121K00781
14772G72278o2248k98070J98695C02604M20228L9254J59449m29460J44058o9771
14762E66362J13124r6053j06883K28678N6488l06822n3342J06952L0619J12539
14752F51662j62970L77035j08112j50902K85835j66825K45299m56905K50200J79503
14742I43820l84397K11928J36672j37366M20301m65684j8491K8983J05412j55134
14732F86044k17260M01264j59421J07359J55004L4366k77723J22277K99838l01793
14722H49955k4013j77353K41312j30727L5224j90476p4103N42924J29610n84334
14712F18019O15973m35228K2169K24307j37756J01544j18926K12528l26753m4764
$$ plain form
14702 731113 1113783 1211295 746434 757803 985430 1214432 1160716 852894 722972 973160
14692 973160 915504 927981 1137538 1093812 1097984 990737 1255922 1167086 905906 898588 1144868
14681 1144868 881842 951965 1125239 1232106 951797 1013607 939887 1102211 1128624 973424
14671 973424 1125157 1416888 854238 1162098 1153810 1249320 1025932 1028586 988857 1049680 1279943
14660 1279943 1224992 1169355 1204060 1380199 1096986 1361050 949437 1508250 1492245 1180221
14650 1180221 1316513 1156755 1117514 1111632 1413716 1273058 1629817 1426662 906932 1339767
14640 1339767 1625917 1240120 1241704 1296943 1892928 1392824 1312818 1530925 1347933 1557787
14630 1557787 1152535 1744776 1446920 1520579 1401894 1592338 1565419 1339060 1745351 1763289
$$ packed form
14702G31113L82670R7512m64861J1369K27627K29002n3716l07822j29922K50188
14692I73160n7656J2477K09557m3726M172j07247K65185q8836k61180p318K46280
14681A144868k63026P0123J73274J06867k80309O1810p3720J62324K6413j55200
14671I73424J51733K91731n62650L07860q288R5510k23388K654l9729O0823K30263
14660A279943n4951n5637L4705J76139k83213K64064m11613N58813j6005l12024
14650A180221J36292j59758l9241n882L02084j40658L56759k03155n19730M32835
14640A339767K86150l85797J584N5239N95985n00104q0006K18107j82992K09854
14630A557787m05252N92241k97856P3659j18685J90444k6919k26359M06291J7938
$$ plain form
14620 1763289 1735340 1853592 1624913 1620584 1077306 1640249 1646812 1508711 1668248 1671630 1621158
14609 1621158 1508511 1623913 1580140 1778418 1786361 1768606 1702832 1910202 1559994 1800761
14599 1800761 1658711 1847464 2043332 1945260 1776309 1451970 1800122 1742238 2012720 1968491
14589 1968491 1760812 1797942 1931424 1935383 2345198 2372507 1816755 2360013 1888620 2159652
14579 2159652 2205495 2049819 2271399 2327650 2408505 1877951 2304917 2449041 2221907 2338621
14569 2338621 2439802 2312859 2374170 2696514 2596209 2973125 2804328 2686298 2792702 2680408
14559 2680408 2963911 3177610 3221126 3443610 3448541 3821100 3943050 4573105 4983515 6442372
14549 6442372 8453858 13409382 23293354 38844852 40571775 21549605 10186568 5542499
$$ packed form
14620A763289k7949J18252k28679m329n43278N62943O563j38101J59537L382n0472
14609A621158j12647J15402m3773J98278P943j7755o5774K07370l50208K40767
14599A800761j42050J88753J95868r8072j68951l24339L48152n7884K70482m4229
14589A968491k07679L7130J33482L959M09815K7309n55752N43258m71393K71032
14579B159652M5843j55676K21580N6251Q0855n30554M26966J44124k27134J16714
14569B338621J01181j26943O1311L22344j00305L76916j68797j18030J06404j12294
14559B680408K83503K13699M3516K22484M931L72559J21950O30055M10410J458857
14549F442372K011486M955524R883972J5551498J726923j9022170A0186568m644069
$$ plain form
14541 5542499 3743517 3159360 2229585 1945770 2272052 2049483 2210786 2111219 2648273
14532 2648273 2457435 2174668 2136201 2433989 2369951 2652926 2304930 2056039 3030706 2515870
14522 2515870 2648710 2639339 2732813 2773075 3273518 2446276 2956725 2993189 3107386 2903803
14512 2903803 2764860 2983291 3007356 2901829 2890728 3026274 2989040 3241488 3249836 3252989 3357707
14501 3357707 3277959 3465405 3461349 3408863 3729344 3335262 3107328 3513135 3602723 3522994
14491 3522994 3380504 3633200 3919611 3476418 3901021 3653679 3910351 3927316 4297332 3960432
14481 3960432 4253958 4048916 4214418 4185616 4573653 4009189 4475128 4510522 4785610 4458104
14471 4458104 4857373 4576667 4561573 4813149 4694337 5097583 4967440 5072106 4915863 4818400
$$ packed form
14541E542499j798982n84157r29775k83815L26282k22569J61303r9567N37054
14532B648273j90838k82767l8467K97788o4038K82975l47996k48891R74667n14836
14522B515870J32840r371R3474M0262N00443q27242N10449L6464J14197k03583
14512B903803j38943K18431K4065j05527j1101J35546l7234K52448Q348L153J04718
14501C357707p9748J87446m056n2486L20481l94082k27934M05807Q9588p9729
14491C522994j42490K52696K86411m43193M24603k47342K56672J6965L70016l36900
14481C960432K93526k05042J65502k8802L88037n64464M65939L5394K75088l27506
14471D458104L99269k80706j5094K51576j18812M03246j30143J04666j56243r7463
$$ plain form
14461 4818400 5017713 5163810 4794963 5384960 5147971 5380664 5408283 5623648 5622343 5694217
14451 5694217 5903579 5960876 5524488 6025154 5958685 6064466 6127311 6065461 6238572 6560464
14441 6560464 6514073 6366945 6565031 6799381 6840560 7106979 6937718 6988460 6981861 7288065
14431 7288065 7609038 7275377 7448163 7570885 7676609 7888050 7820280 7883337 7987264 7915699
14421 7915699 8037312 8644759 8692543 8855253 8696479 8868038 9324398 9179280 9277132 9181424
14411 9181424 9613351 9759059 9654789 9909208 10208517 10358034 10361943 10720094 10645293 10908936
14401 10908936 11169832 11756243 11640584 11972780 11796283 12005387 12472785 12543792 12782814
14392 12782814 12726003 12991184 12960753 13048512 13485145 14071518 13873099 14546419 14824324 14909355
$$ packed form
14461D818400J99313J46097l68847N89997k36989K32693K7619K15365j305P1874
14451E694217K09362N7297m36388N00666o6469J05781O2845o1850J73111L21892
14441F560464m6391j47128J98086K34350M1179K66419j69261N0742o599L06204
14431G288065L20973l33661J72786J22722J05724K11441o7770O3057J03927p1565
14421G915699J21613O07447M7784J62710j58774J71559M56360j45118R7852r5708
14411I181424M31927J45708j04270K54419K99309J49517L909L58151p4801K63643
14401A0908936K60896N86411j15659L32196j76497K09104M67398P1007K39022
14392A2782814n6811K65181l0431Q7759M36633N86373j98419O73320K77905Q5031
$$ plain form
14382 14909355 15143842 15473900 15786405 15791660 16315037 16651303 16813899 17058613 17806354 17609449
14372 17609449 18195695 18270453 19090420 19217222 20029097 20166100 20404116 21031376 21455197
14363 21455197 21686216 22370405 22916616 23098763 23963696 24059255 24368923 24899619 25855155
14354 25855155 26709097 27089577 27774044 28770188 29172804 29599253 30644581 31049725 31935400
14345 31935400 32795116 33406219 34608019 35506835 36371134 37471221 38350677 39629977 40367845
14336 40367845 41658817 42858712 44022050 45450250 46790033 48058024 49351481 50946092
14328 50946092 52698854 54674038 56022377 57783539 60076623 61792535 63592276 65871944
14320 65871944 68325665 70628442 73144360 75824106 78518250 81221488 84450719 87966790
$$ packed form
14382A4909355K34487L30058L12505N255N23377L36266J62596K44714P47741j96905
14372A7609449N86246P4758Q19967J26802Q11875J37003K38016O27260M23821
14363B1455197K31019O84189N46211J82147Q64933R5559L09668N30696R55536
14354B5855155Q53942L80480O84467R96144M02616M26449J045328M05144Q85675
14345C1935400Q59716O11103J201800Q98816Q64299J100087Q79456J279300P37868
14336D0367845J290972J199895J163338J428200J339783J267991J293457J594611
14328E0946092J752762J975184J348339J761162K293084J715912J799741K279668
14320F5871944K453721K302777K515918K679746K694144K703238L229231L516071
$$ plain form
14312 87966790 91165879 94934207 98754769 102888081 106855982 111222395 116248442 121288991
14304 121288991 126545007 132022831 138242512 144301521 150715800 157806266 165095343 173269760
14296 173269760 181446908 189926549 199260962 208953016 219359027 229601696 240863199
14289 240863199 252575322 264761236 277090699 290293218 303760829 317456152 331632141
14282 331632141 345616891 359618218 373554895 387101844 400140672 412435492 423403858
14275 423403858 433481621 441576718 446043938 447751912 447656478 447948605 448190730 446295608
14267 446295608 442827350 438490460 431771002 423718679 414282458 402970468 390593534 377086319
14259 377086319 363045702 348323350 333453439 319331622 305321697 291467327 277875010
$$ packed form
14312H7966790L199089L768328L820562M133312L967901M366413N026047N040549
14304A21288991N256016N477824O219681O059009O414279P090466P289077Q174417
14296A73269760Q177148Q479641R334413R692054J0406011J0242669J1261503
14289B40863199J1712123J2185914J2329463J3202519J3467611J3695323J4175989
14282C31632141J3984750J4001327J3936677J3546949J3038828J2294820J0968366
14275D23403858J0077763Q095097M467220J707974r5434K92127K42125j895122
14267D46295608l468258m336890o719458q052323r436221j1311990j2376934j3507215
14259C77086319j4040617j4722352j4869911j4121817j4009925j3854370j3592317
$$ plain form
14252 277875010 264886376 252040341 240093610 228709479 217634366 207250332 197610485
14245 197610485 188326334 179603340 171152030 163318100 156098143 148986397 142225147 136697904
14237 136697904 130940380 125260556 119672977 114597352 110147862 105798580 101966673 97871621
14229 97871621 93789529 90338894 86679696 83421133 80254475 77123149 74590390 71985472
14221 71985472 69681245 67707200 65208834 62971692 60849198 58783327 56778095 55434464
14213 55434464 54112049 52225111 50307397 48972934 47396112 46548244 45334708 43985821
14205 43985821 42334389 41348074 40270837 38974030 38383024 37599516 36233147 35137564
14197 35137564 34448984 33239939 32348731 31938320 30954176 30391513 29567859 28637295 28369260
$$ packed form
14252B77875010j2988634j2846035j1946731j1384131j1075113j0384034r639847
14245A97610485r284151q722994q451310p833930p219957p111746o761250n527243
14237A36697904n757524n679824n587579n075625m449490m349282l831907m095052
14229I7871621m082092l450635l659198l258563l166658l131326k532759k604918
14221G1985472k304227j974045k498366k237142k122494k065871k005232j343631
14213E5434464j322415j886938j917714j334463j576822q47868j213536j348887
14205D3985821j651432r86315j077237j296807n91006p83508j366369j095583
14197C5137564o88580j209045q91208m10411r84144n62663q23654r30564k68035
$$ plain form
14188 28369260 27573304 26906978 26373608 25663571 24742864 24851295 24050842 23501344 23057357
14179 23057357 22528637 22233654 21242007 21008267 20735918 20127446 19762486 19643897 19115505
14170 19115505 18508640 18199675 18033231 17690197 16891907 16656114 16492524 16325372 16190164
14161 16190164 15815678 15111248 15158750 15040706 14615567 14725641 14182078 13716673 13552964
14152 13552964 13609531 13242221 12981775 13221690 12274907 12407944 12340931 11905834 11803076 11682867
14142 11682867 11307082 11161465 11155125 11086532 10888389 10563497 10789571 10186116 10123463 9778230
14132 9778230 10167850 9667077 9567547 9517821 9297260 9201696 9212729 8839770 8722503 8645673
14122 8645673 8844747 8187405 8542810 8298142 8285464 7959555 7908356 8109468 7601526 7342242
$$ packed form
14188B8369260p95956o66326n33370p10037r20707J08431q00453n49498m43987
14179B3057357n28720k94983r91647k33740k72349o08472l64960j18589n28392
14170A9115505o06865l08965j66444l43034p98290k35793j63590j67152j35208
14161A6190164l74486p04430M7502j18044m25139J10074n43563m65405j63709
14152A3552964N6567l67310k60446K39915r46783J33037o7013m35097j02758j20209
14142A1682867l75785j45617o340o8593j98143l24892K26074o03455o2653l45233
14132I778230L89620n00773r9530m9726k20561r5564J1033l72959j17267p6830
14122H645673J99074o57342L55405k44668j2678l25909n1199K01112n07942k59284
$$ plain form
14112 7342242 7764079 7455411 7404589 7281071 7116090 7177310 6798720 6962851 6804442 6758778
14102 6758778 6374886 6479864 6544409 6497579 6272342 6036186 6247292 6321648 5900044 6039593
14092 6039593 6129941 6060139 5874004 5724972 5686647 5569998 5478251 5497648 5291711 5318865
14082 5318865 5164175 5255172 5134182 5122233 5175489 5031349 4971780 5012835 4894761 4804328
14072 4804328 4648664 4907799 4664743 4478557 4619462 4881796 4429426 4320740 4535959
14063 4535959 4344485 4189633 4273826 4311080 4096432 3833936 4140924 3815918 4337994 3653393
14053 3653393 3914348 3868123 3862050 4054176 3667120 3644582 3566238 3358089 3494917 3621399
14043 3621399 3706648 3530022 3576789 3589210 3485854 3856317 3345241 3508263 3512991 3368924
$$ packed form
14112G342242M21837l08668n0822j23518j64981O1220l78590J64131j58409m5664
14102F758778l83892J04978O4545m6830k25237k36156K11106P4356m21604J39549
14092F039593R0348o9802j86135j49032l8325j16649r1747J9397k05937K7154
14082E318865j54690R0997j20990j1949N3256j44140n9569M1055j18074r0433
14072D804328j55664K59135k43056j86186J40905K62334m52370j08686K15219
14063D535959j91474j54852Q4193L7254k14648k62496L06988l25006N22076o84601
14053C653393K60955m6225o073J92126l87056k2538p8344k08149J36828J26482
14043C621399Q5249j76626M6767J2421j03356L70463n11076J63022M728j44067
$$ plain form
14033 3368924 3250918 3180994 3310218 3308014 3216147 2960490 3163212 3187072 3160012 3055077
14023 3055077 2774013 2756158 2848462 2939449 2535508 2553683 2752215 2703807 3031199 2717890
14013 2717890 2800364 2515015 2592430 2332221 2549402 2261475 2426986 2584346 2471565 2446071
14003 2446071 2669442 2559601 2494135 2434654 2223647 2334378 2288133 2053746 2280426 2226531
13993 2226531 2328645 2457860 2569739 3011554 4203294 7750623 15829236 32376155 40676279
13984 40676279 26563617 15252342 9650815 6787882 5415226 4426334 4055814 3512053
13976 3512053 3639985 3776131 3247597 3246659 3365011 2767447 2722140 2716013 2760534 2492083 2447635
13965 2447635 2494634 2529069 2118515 2432226 2078823 2074772 2600596 2247998 2063987 2260009
$$ packed form
14033C368924j18006o9924J29224k204r1867k55657K02722K3860k7060j04935
14023C055077k81064j7855R2304R0987m03941J8175J98532m8408L27392l13309
14013B717890Q2474k85349P7415k60209K17181k87927J65511J57360j12781k5494
14003B446071K23371j09841o5466n9481k11007J10731m6245k34387K26680n3895
13993B226531J02114J29215J11879M41815J191740L547329Q078613J6546919Q300124
13984D0676279j4112662j1311275n601527k862933j372656r88892l70520n43761
13976C512053J27932J36146n28534r38J18352n97564m5307o127M4521k68451m4448
13965B447635M6999L4435m10554L13711l53403m051N25824l52598j84011J96022
$$ plain form
13955 2260009 2107935 1985911 2094097 2037635 2060489 1933199 2101456 1639456 1712664 1949451
13945 1949451 1863378 1956910 2133453 1621986 1846686 1711240 1867007 2101788 1882369 1803539
13935 1803539 1686023 1514984 1567921 1675443 1712866 1628168 1788879 1606747 1429124 1659559
13925 1659559 1401493 1912204 1652147 1724607 1342380 1836982 1844599 1682406 1337338 1223026
13915 1223026 1566381 1233343 1491319 1508167 1672493 1505470 1465946 1208293 1364713 1247451
13905 1247451 1295325 1398183 1593564 1330339 1458661 1378169 1416208 1398865 1461474 1418458
13895 1418458 1444460 1331109 1426767 1378251 1074589 1316801 1623513 1509715 1314584 1118179
13885 1118179 1711300 1079466 1433382 1168126 1158792 1189983 1306608 1313871 1302293 922380
$$ packed form
13955B260009j52074j22024J08186n6462K2854j27290J68257m62000P3208K36787
13945A949451q6073R3532J76543n11467K24700j35446J55767K34781k19419p8830
13935A803539j17516j71039N2937J07522L7423q4698J60711j82132j77623K30435
13925A659559k58066N10711k60057P2460l82227M94602P617j62193l45068j14312
13915A223026L43355l33038K57976J6848J64326j67023l9524k57653J56420j17262
13905A247451M7874J02858J95381k63225J28322q0492L8039j7343O2609m3016
13895A418458K6002j13351R5658m8516l03662K42212L06712j13798j95131j96405
13885A118179N93121o31834L53916k65256r334L1191J16625P263j1578l79913
$$ plain form
13875 922380 1357731 721330 1197660 1399079 1129230 1206917 1142143 1214318 1014752 1231379
13865 1231379 1255958 1329746 1079615 1242812 1257390 1177385 1651867 1037869 1305237 1161590
13855 1161590 1154386 1180300 1153006 1413706 1195178 1111568 1066067 1121799 1341728 985213 1221657
13844 1221657 733916 1239983 874836 1040961 1179346 845166 975884 945219 957649 836086
13834 836086 1070352 977761 1228499 987475 1010355 803162 1031462 916216 868823 936357
13824 936357 701890 1054911 877314 972848 1038683 971155 797812 783065 723039 935891
13814 935891 740830 714439 738744 901625 1056433 1214153 772375 654202 784803 961530
13804 961530 734995 1062426 1093151 712329 706624 575738 995723 501120 884778 865661
$$ packed form
13875I22380M35351o36401M76330K01419k69849P7687o4774P2175j99566K16627
13865A231379K4579P3788k50131J63197J4578q0005M74482o13998K67368j43647
13855A161590p204K5914k7294K60700k18528q3610m5501N5732K19929l56515K36444
13844A221657m87741N06067l65147J66125J38385l34180J30718l0665J2430j21563
13834H36086K34266r2591K50738k41024K2880k07193K28300j15246m7393O7534
13824I36357k34467L53021j77597R5534O5835o7528j73343j4747o0026K12852
13814I35891j95061k6391K4305J62881J54808J57720m41778j18173J30601J76727
13804I61530k26535L27431L0725l80822n705j30886M19985m94603L83658j9117
$$ plain form
13794 865661 1071549 679378 721585 820443 671421 1160982 702626 822615 701130 905901
13784 905901 450536 942197 1135559 768075 733608 825211 476398 825582 610218 765292
13774 765292 853082 599947 618310 574961 738017 535094 550336 743081 767157 808567 736583
13763 736583 599673 584092 777890 493316 771372 526442 880996 421467 505419 767117
13753 767117 639769 558885 1053978 733717 524749 389888 854063 683255 433603 275023
13743 275023 722866 896493 603705 615176 564699 577585 608847 249494 669316 497102
13733 497102 896105 674066 562254 563537 555550 801874 802741 615513 619736 417797 273282
13722 273282 789309 766963 525633 486648 565839 654869 778710 576173 575759 644151 662728
$$ packed form
13794H65661K05888l92171M2207R8858j49022M89561m58356J19989j21485K04771
13784I05901D50536M91661J93362l67484l4467R1603l48813L49184k15364J55074
13774G65292Q7790k53135J8363m3349J63056k02923J5242J92745K4076M1410p1984
13763G36583j36910j5581J93798k84574K78056k44930L54554D21467Q3952K61698
13753G67117j27348q0884M95093l20261k08968j34861M64175j70808k49652j58580
13743B75023M47843J73627k92788J1471n0477J2886L1262B49494M19822j72214
13733D97102L99003k22039j11812J283p987K46324Q67j87228M223k01939j44515
13722B73282N16027k2346k41330l8985P9191Q9030J23841k02537m14O8392J8577
$$ plain form
13711 662728 423899 655201 532130 715766 425127 384498 661205 592249 482712 759109
13701 759109 524846 427067 670153 472838 723248 946688 416904 442172 468777 461236
13691 461236 337754 472491 437769 670773 785875 499185 649915 478593 344253 597244
13681 597244 577341 581042 187998 514897 520893 464635 229565 471612 340256 503331 732821
13670 732821 531518 586369 595148 590217 421784 487358 451752 721457 553639 304433 538801
13659 538801 667942 309520 234263 373196 280014 376464 520080 622352 409999 470534
13649 470534 624026 417179 792131 533991 342314 481190 666244 605695 640060 314709
13638 326726 465941 389198 497736 599145 225857 262020 528080 509879 418435 310546
$$ packed form
13711F62728k38829K31302j23071J83636k90639m0629K76707o8956j09537K76397
13701G59109k34263r7779K43086j97315K50410K23440D16904K5268K6605p541
13691D61236j23482J34737l4722K33004J15102k86690J50730j71322j34340K52991
13681E97244j9903L701A87998L26899N996n6258B29565K42047j31356J63075K29490
13670G32821k01303N4851Q779m931j68433O5574l5606K69705j67818k49206K34368
13659E38801J29141C09520p5257J38933r3182R6450J43616J02272k12353O0535
13649D70534J53492k06847L74952k58140j91677J38876J85054o0549L4365C14709
13638C26726J39215p6743J08538J01409B25857L6163K66060j8201r1444j07889
$$ plain form
13628 310546 150169 472769 318287 680312 162347 518703 231465 616591 499741 377264
13618 377264 488384 774401 566217 520085 485603 273258 433122 484243 175005 252734
13608 252734 242225 406415 114638 489957 515513 64776 723671 552374 202615 420471
13598 420471 552361 480082 373257 8272 495970 290227 265488 53942 364263 678911
13588 678911 320614 703675 133445 425115 246730 384018 44688 315134 81092 47300
13578 47300 43792 239433 503751 327780 571508 424396 113501 136371 562555 486591
13568 486591 419951 503254 197728 308755 287401 261919 182757 376123 -21852 494349 325037
13557 325037 320127 231097 314503 301680 234722 155345 309790 39864 151453 309899 308947
$$ packed form
13628C10546A50169L22600j54482L62025A62347L56356B31465L85126j16850j22477
13618C77264J11120K86017k08184m6132l4482k12345J59864N1121A75005P7729
13608B52734j0509J64190A14638L75319K5556F4776O58895j71297B02615K17856
13598D20471J31890p2279j06825H272M87698k05743k4739E3942L10321L14648
13588F78911C20614L83061A33445K91670j78385J37288D4688K70446H1092l3792
13578D7300l508J95641K64318j75971K43728j47112A13501K2870M26184p5964
13568D86591o6640Q3303A97728J11027k1354k5482p9162J93366b1852D94349j69312
13557C25037m910q9030Q3406j2823o6958p9377J54445C9864J11589J58446r52
$$ plain form
13546 308947 -72679 224805 335651 408986 576655 142569 430006 28179 547602 243868
13535 410806 65831 594407 245833 237640 43413 265699 101180 201969 402888 368513
13525 368513 322221 -42699 353020 482003 299185 395132 403206 474822 78864 401149 370280
13514 370280 -75183 42043 549661 246806 375821 186650 455002 213886 285149 159080
13504 159080 375479 333770 269811 329608 325894 189173 531994 439727 42016 341352 359151
13493 359151 328155 165976 329410 395693 256550 230195 203494 225594 296016 413018 658857
13482 658857 591508 50168 119686 92284 138146 397923 237921 80191 148740 219773 257092
13471 257092 409151 342637 212966 273422 501173 545868 447985 44908 -28467 224840 192033
$$ packed form
13546C08947g2679B24805J10846P3335J67669A42569K87437B8179N19423B43868
13535D10806F5831N28576B45833q193D3413K22286A01180J00789K00919l4375
13525C68513m6292d2699C53020J28983j82818R5947Q074P1616G8864L22285l0869
13514C70280g5183D2043N07618B46806J29015A86650K68352B13886P1263j26069
13504A59080K16399m1709o3959N9797l714j36721L42821r2267D2016K99336J7799
13493C59151l0996j62179J63434O6283j39143k6355k6701K2100P0422J17002K45839
13482F58857o7349E0168O9518k7402M5862K59777j60002H0191O8549P1033L7319
13471B57092J52059o6514j29671O0456K27751M4695r7883D4908b8467B24840l2807
$$ plain form
13460 192033 111829 330375 201164 128692 458458 346269 53445 290855 371463 62556
13449 328284 521625 287332 305659 269608 89412 336656 214620 320689 448164 425296
13439 425296 271332 -39198 239447 22579 302936 340043 81003 168367 238434 287605 296858
13428 296858 -38595 -165380 397237 30086 233995 275319 127213 360063 319518 112706
13417 191625 70586 194890 81332 203572 -37890 337771 126420 161175 -172234 281976
13406 -75858 266984 -146420 232238 149671 27365 327290 144851 309274 349216 233335
13396 233335 125200 227113 141113 381785 399437 250013 45507 345909 471863 -109742
13385 167122 125922 169420 336536 83307 -159866 213292 270411 312901 48692 319537 173144
$$ packed form
13460A92033q0204K18546j29211p2472L29766j12189E3445K37410Q0608F2556
13449C28284J93341k34293J8327l6051H9412K47244j22036J06069J27475k2868
13439D25296j53964c9198B39447B2579K80357L7107H1003Q7364P0067M9171R253
13428B96858c8595j26785C97237C0086K03909M1324A27213K32850m0545A12706
13417A91625G0586J24304H1332J22240c7890C37771A26420L4755a72234B81976
13406g5858B66984a46420B32238q2567B7365K99925A44851J64423L9942j15881
13396B33335j08135J01913q6000K40672J7652j49424D5507L00402J25954a09742
13385A67122m1200M3498J67116H3307a59866B13292N7119M2490D8692K70845j46393
$$ plain form
13374 173144 126753 377271 138108 353966 559192 338630 543882 226863 -9328 294954
13363 -19707 387763 13459 263032 390156 48263 509620 282413 204336 215321 192534 237022
13352 237022 194870 308875 202317 210819 313376 487423 621660 286175 217115 589711
13342 589711 273679 338634 -122521 542046 168646 330187 86543 318042 146479 64673
13331 -63124 182729 189870 408180 350106 247515 150486 209626 369073 368364 227010 444512
13320 444512 445060 127315 -157286 432228 284466 444935 374385 157020 186851 -40595 -99777
13309 -99777 238484 233861 301119 161187 201774 277403 37371 62585 32226 410685 -54395
13297 42352 251961 -76930 100588 69079 133611 -13227 422353 412074 220977 389662 -35396
$$ packed form
13374A73144m6391K50518A38108K15858K05226k20562K05252B26863i328B94954
13363a9707C87763A3459K49573J27124D8263M61357k27207p8077J0985k2787M4488
13352B37022m2152J14005j06558Q502J02557J74047J34237B86175o9060L72596
13342E89711B73679O4955a22521E42046A68646J61541H6543K31499A46479F4673
13331f3124A82729P141K18310n8074j02591r7029N9140J59447p09j41354K17502
13320D44512N48A27315a57286D32228j47762J60469p0550A57020K9831d0595n9182
13309i9777B38484m623O7258j39932M0587P5629C7371K5214l0359L78459e4395
13297D2352K09609g6930A00588l1509O4532a3227D22353j0279j91097J68685c5396
$$ plain form
13285 4759 22218 -163324 23018 252019 64058 -104994 253657 -299345 -41689 345305 320014
13274 320014 -7360 39331 113552 -15908 21133 125514 -33224 -74598 142931 289011 248167
13263 248167 -280475 219777 -139987 161079 432529 304079 453415 267127 -96982 332366
13252 91277 244745 156079 -222439 -55157 -76490 81070 75578 240290 110721 86691 -41001
13240 239491 -50170 170854 356909 53479 121763 50643 -86985 309429 377846 253639 375183
13229 375183 291449 -152355 299384 -24262 14896 226901 154340 301186 -134613 -3579 -44071
13218 -44071 312198 242908 105071 180116 488314 48730 -66791 76570 -21452 133831 -161712
13206 -25304 190389 -76702 371653 16640 -143297 53777 -131969 -22378 103559 54940 314872
$$ packed form
13285D759J7459a63324B3018K29001F4058a04994B53657b99345d1689C45305k5291
13274C20014g360C9331P4221a5908B1133J04381c3224m1374A42931J46080m0844
13263B48167b80475B19777a39987A61079K71450j28450J49336j86288i6982C32366
13252I1277J53468q8666b22439e5157k1333H1070n492J64712A10721k4030d1001
13240B39491e0170A70854J86055E3479O8284E0643h6985C09429O8417j24207J21544
13229C75183q3734a52355B99384b4262A4896K12005p2561J46846a34613c579m0492
13218d4071C12198o9290A05071P5045L08198D8730f6791G6570b1452A33831a61712
13206b5304A90389g6702C71653A6640a43297E3777a31969b2378A03559m8619K59932
$$ plain form
13195 314872 28122 -76849 282082 322355 340624 172931 89522 -82204 238668 104367 123636
13184 123636 420264 101435 237962 167262 197016 12952 -21003 -146891 -112722 -102280 193705
13172 160801 149090 -75764 118775 -39397 29976 99428 -84697 89268 149061 -105025 230780
13160 203378 265367 60711 274232 -40163 -9479 80595 177606 22417 -173828 -79776 -20186
13148 -153986 269763 162334 8546 266387 -90568 39515 61908 57342 279 -161878 -74631
13136 -16740 42960 52455 -183480 27308 166563 -61899 332690 226999 -94748 -39729 56623
13124 -51630 -221353 224510 -3993 389268 -133033 -42406 63612 -205898 -258212 21266 -328942
13112 244972 81304 91492 -245208 347124 -29716 -112791 -84489 -184490 276497 19479 334703
$$ packed form
13195C14872B8122g6849B82082M0273J8269j67693q3409h2204B38668A04367J9269
13184A23636K96628A01435J36527p0700K9754A2952b1003j25888L4169J0442A93705
13172A60801j1711g5764A18775c9397B9976O9452h4697H9268N9793a05025B30780
13160B03378O1989F0711K13521d0163i479H0595R7011B2417a73828g9776b0186
13148a53986B69763j07429H546K57841i0568C9515K2393m566B79a61878g4631
13136a6740D2960R495a83480B7308J39255f1899C32690j05691i4748c9729E6623
13124e1630j69723B24510c993C89268a33033d2406F3612b05898n2314B1266c28942
13112B44972H1304J0188b45208C47124b9716q3075K8302j00001B76497A9479L15224
$$ plain form
13101 334703 248837 113786 142061 514390 -163119 284002 56133 -10577 -39820 20917 292527
13090 292527 -28137 40991 -117049 254052 44415 -5296 -72828 -23835 418042 200790 132975
13079 132975 148239 -40388 -64740 26327 168760 305916 -183754 34837 49492 94030 194232
13068 194232 93122 -74092 -286624 400855 -83285 230573 51380 233407 59483 -26599 61194
13056 -45295 -177486 -146110 243417 275346 -71551 191056 206177 289889 -5172 -34719 178779
13044 -334343 167854 229000 -55630 412922 -99354 7800 74353 202568 166706 -88929 186771
13032 230475 173765 171216 260638 -110890 -74095 70678 94051 226673 234173 19527 95543
13021 95543 415817 -120762 135802 223965 -27745 31941 -46995 24169 249502 -186965 70267
$$ packed form
13101C34703q5866A13786K8275L72329a63119B84002E6133a0577k9243B0917K71610
13090B92527b8137D0991a17049B54052D4415e296o7532b3835D18042B00790o7815
13079A32975J5264d0388k4352B6327J42433J37156a83754C4837J4655M4538J00202
13068A94232I3122g4092k12532D00855h3285B30573E1380J82027E9483b6599F1194
13056d5295j32191L1376B43417L1929g1551A91056J5121Q3712e172k9547A78779
13044c34343A67854O1146e5630D12922i9354G800O6553J28215l5862h8929A86771
13032B30475n6710k549Q9422a10890L6795G0678K3373J32622P500A9527P6016
13021I5543L20274a20762A35802Q8163b7745C1941d6995B4169K25333a86965G0267
$$ plain form
13009 110421 -281916 285664 -56741 156360 126679 366086 148730 -198123 180567 215682
12999 215682 16777 348729 321087 414360 136992 -188756 64199 -83075 -363183 54535 97563
12988 97563 313557 51454 198974 -38195 -78957 134387 204833 3668 -101196 -93779 -151319
12977 -151319 -50726 309025 107800 -65007 -14880 -135049 -37235 -158879 360479 9042 200592
12966 200592 -159245 -102564 39128 54761 179617 -83044 218735 -38387 -169432 -17108 -56939
12955 -56939 -175084 315364 -145356 -79254 -322498 -139512 55305 50972 119914 208134 165032
12944 165032 -37773 291015 162213 -20128 -266855 92345 -66042 260635 -87670 -378100
12934 -378100 -26207 -4719 73015 134465 40054 68411 -57792 827 -270866 373831 216732
$$ packed form
13009A10421b81916B85664e6741A56360k9681K39407A48730a98123A80567L5115
12999B15682A6777L31952k7642R3273A36992a88756F4199h3075k80108E4535M3028
12988I7563K15994E1454J47520c8195m0762A34387P0446C668a01196P417n7540
12977a51319e0726C09025A07800f5007a4880j20169c7235j21644C60479I042J91550
12966B00592a59245N6681C9128J5633J24856h3044B18735c8387j31045a7108l9831
12955e6939j18145C15364a45356O6102k43244a39512E5305m333O8942Q8220m3102
12944A65032c7773B91015j28802b0128k46727I2345f6042B60635h7670k90430
12934c78100b6207d719G3015O1450D0054K8357e7792H27b70866C73831j57099
$$ plain form
12923 216732 408279 75374 306598 308879 233943 -88044 -49996 -298302 -19242 26150 -227145
12911 -57941 178855 208016 237680 162779 125538 246882 -31352 -185351 257320 107463 123956
12900 123956 17483 188315 -18412 -121889 101108 139516 -69495 78813 10435 173673 85217
12888 137521 24224 92554 128954 -142115 119619 -124230 169616 160499 127034 85196 204402
12877 204402 188504 118259 2599 74280 -353274 159060 209798 67434 273636 278631 -6705
12865 -3328 -114406 -98867 106182 155143 92633 247451 53002 -73500 89022 -40569 45565
12853 58386 -222166 27902 -55277 103556 408286 -5999 464124 -3102 252575 219441 409542
12842 409542 -103528 -54717 262417 -216276 -145227 -90942 -187867 -68204 -129148 180874 -153769
$$ packed form
12923B16732J91547G5374K31224K281p4936h8044L8048k48306a9242B6150b27145
12911e7941A78855K9161K9664p4901l7241J21344c1352j53999B57320A07463J6493
12900A23956A7483J70832a8412j03477A01108L8408f9495G8813A0435J63238H5217
12888A37521B4224O8330L6400a42115A19619a24230A69616r117l3465m1838J19206
12877B04402j5898p0245B599P1681c53274A59060N0738F7434K06202M995f705
12865c328j11078J5539A06182M8961o2510J54818E3002g3500H9022d0569D5565
12853E8386b22166B7902e5277A03556L04730e999D64124c102B52575l3134J90101
12842D09542a03528M8811B62417b16276P1049N4285r6925f8204o0944A80874a53769
$$ plain form
12830 -72021 -257911 30196 -54145 111064 -73815 -125039 269038 238382 -86369 46879 56938
12819 56938 305842 -125098 -65808 -139254 449704 -56253 -203781 -132313 227528 -120328
12808 174393 89984 -192803 22258 340923 -154877 180759 103306 197163 -175152 12884
12797 -32857 96431 219158 134778 -17841 -73549 -201911 -382039 -21355 -228203 -899 82500
12785 -345555 51102 -330982 -392243 96844 6248 -147525 -181526 -206016 247071 -333293 -75444
12773 -11649 -105514 27838 -217087 71875 67249 87075 56954 -232846 -189153 175754 205788
12762 205788 149134 50001 -78079 -283374 212572 -32537 -437716 141642 15620 1245 -164248
12750 117233 -252406 113663 87791 542145 159583 36530 -22706 29973 -91283 -78927 179580
$$ packed form
12830g2021j85890C0196e4145A11064g3815n1224B69038l0656h6369D6879J0059
12819E6938K48904a25098N9290p3446D49704e6253j47528P1468B27528a20328
12808A74393q4409a92803B2258L18665a54877A80759p7453R3857a75152A2884
12797c2857I6431J22727q4380a7841n5708j28362j80128b1355k06848h99H2500
12785c45555E1102c30982o1261I6844F248a47525l4001k4490B47071c33293g5444
12773a1649r3865B7838b17087G1875m626J9826l0121b32846M3693A75754L0034
12762B05788n6654E0001g8079k05295B12572c2537m05179A41642A5620A245a64248
12750A17233b52406A13663k5872M54354A59583C6530b2706B9973i1283J2356A79580
$$ plain form
12738 -33862 108478 -127643 133883 -59550 340436 131379 195409 358925 113682 271754
12728 271754 -140941 278576 25595 8464 118580 -6013 107540 -93612 196224 162757 687
12716 255983 -73209 -319106 -237195 115110 38743 128037 439 149095 212553 10387 503299
12705 503299 198757 -25674 58691 124836 142609 127562 61674 283835 9798 74998 -161379
12693 473721 89861 -75078 -72071 300703 67435 -73109 183049 50033 183521 -29772 96841
12681 -15045 218580 15162 92761 134657 -141372 -72116 -88523 102208 -63231 361562 225387
12670 225387 48198 -82069 -60966 -147147 69567 407938 -271541 256021 -32396 494072 326603
12659 326603 49157 52245 497122 312494 317634 -134726 79893 221070 58075 102689 456624
$$ packed form
12738c3862A08478a27643A33883e9550C40436A31379O4030J63516A13682J58072
12728B71754a40941B78576B5595H464J10116f013A07540i3612A96224l3467F87
12716B55983g3209k45897Q1911A15110C8743Q9294D39J48656O3458A0387M92912
12705E03299A98757b5674E8691O6145J7773j5047F1674K22161I798O5200a61379
12693D73721H9861g5078L007C00703F7435g3109A83049E0033J33488b9772I6841
12681a5045B18580A5162P7599M1896a41372O9256j6407A02208f3231C61562j36175
12670B25387D8198h2069K1103q6181F9567L38371b71541B56021c2396D94072j67469
12659C26603D9157L088M44877j84628N140a34726G9893J41177E8075M4614L53935
$$ plain form
12648 456624 193844 332319 -145460 7492 -331087 210542 -108338 -302046 84493 -62266
12637 121488 242582 247726 225739 153133 9527 -68407 125010 106914 390791 305760 477443
12626 477443 -78745 438247 55673 -13645 292151 -48297 199375 34074 -109416 154350
12615 94697 167543 351717 -229352 -71453 404425 54372 72383 -79310 191958 90438 -116637
12603 37250 -137751 -192856 278814 279972 92208 204759 294758 4555 96939 294443 56027
12591 26268 -59113 117539 -16067 19350 243821 187025 226454 -130848 147323 272862 33015
12579 -220902 140268 14632 48671 39705 -85760 471091 56358 141667 209081 68352 -45715
12567 31439 42957 -85606 -18051 421241 28064 166620 139484 -256868 156407 486377 -204325
$$ packed form
12648D56624A93844J38475a45460G492c31087B10542a08338j93708H4493f2266
12637A21488J21094N144k1987p2606I527f8407A25010j8096K83877q5031J71683
12626D77443g8745D38247E5673a3645B92151d8297A99375C4074a09416A54350
12615I4697P2846J84174b29352g1453D04425E4372J8011g9310A91958I0438a16637
12603C7250a37751n5105B78814J158I2208J12551Q9999D555R2384J97504E6027
12591B6268e9113A17539a6067A9350K24471n6796L9429a30848A47323J25539C3015
12579b20902A40268A4632L4039q966h5760D71091E6358Q5309O7414F8352d5715
12567C1439J1518h5606a8051D21241B8064J38556k7136b56868A56407L29970b04325
$$ plain form
12555 251854 157268 -66507 36249 -337181 -12841 -303008 -26909 -176161 -105044 90776 -211257
12543 137405 -70487 -232044 -86507 282149 -4582 178911 -24637 6449 -114849 -50197 233871
12531 43766 62217 -13347 102413 -88980 112888 278956 166379 -135245 26003 -76741 -404523
12520 -404523 87619 -4451 126493 25797 -45305 -129998 353402 -199209 110391 461493 -133036
12508 155574 80120 140993 155876 266777 -82318 -186730 273171 -256113 95147 -261493
12497 -133 -247517 -12621 -51889 255196 8152 -252157 236676 -69915 80825 45724 167612
12486 167612 351999 50123 282251 -146782 121618 -7828 -208700 -135694 -172387 -59065 -121800
12475 -121800 -210092 -146439 -21287 -186203 -1333 308971 -139339 87710 -172352 -6261 85828
$$ packed form
12555B51854r4586f6507C6249c37181a2841k90167b6909j49252P1117I0776b11257
12543A37405g0487j61557h6507B82149d582A78911b4637F449a14849e0197B33871
12531D3766J8451a3347A02413h8980A12888J66068j12577a35245B6003g6741l27782
12520d04523H7619d451A26493B5797d5305q4693C53402a99209A10391L51102a33036
12508A55574p5454O0873J4883J10901h2318j04412B73171b56113I5147b61493
12497a33k47384a2621l9268B55196H152b52157B36676f9915H0825l5101J21888
12486A67612J84387E0123K32128a46782A21618g828k00872P3006l6693e9065o2735
12475a21800q8292O3653b1287j64916a333C08971a39339H7710a72352f261H5828
$$ plain form
12463 -15211 -94160 -74536 316611 171831 -143377 -22687 -64436 244489 48528 -249468 282800
12451 196077 -60768 33488 -49599 254975 378740 11315 103237 216126 -13117 2575 453917
12440 453917 -69998 112236 5606 58395 -27344 128919 158261 137194 -10750 -193608 -92354
12428 -19018 91852 -86974 60165 74386 -223926 -359060 233800 151483 -227297 -70508 -127701
12417 -127701 70416 182468 189117 81192 -175381 -229955 147223 210066 242583 10353 -51292
12405 -170086 -132741 -328031 -245424 53565 84962 88714 -302734 -212256 192708 -116166 -374445
12394 -374445 -182565 470172 254748 -113709 -103843 -184377 263128 152526 140849 18682
12383 -300722 -370632 350277 -141476 143700 -3325 -195660 -135985 158 6926 100161 342974
$$ packed form
12463a5211p8949J9624C16611j44780a43377b2687m1749B44489D8528b49468B82800
12451A96077f0768C3488d9599B54975J23765A1315R1922J12889a3117B575M51342
12440D53917f9998A12236E606N2789b7344A28919K9342k1067a0750j82858i2354
12428a9018I1852h6974F0165J4221b23926j35134B33800q2317b27297g0508n7193
12417a27701G0416J12052O649H1192a75381n4574A47223O2843L2517A0353e1292
12405a70086L7345j95290Q2607E3565L1397L752c02734R0478A92708a16166k58279
12394c74445a82565D70172k15424a13709R866q0534B63128j10602j1677A8682
12383c00722o9910C50277a41476A43700c325j92335N9675A58O768R3235K42813
$$ plain form
12372 342974 -31320 -206613 -218658 9058 113802 48900 36379 89076 49093 -78323 120724
12360 93774 -29653 50953 106115 -14143 252357 268524 166234 -80866 -80448 -87619 341752 -55955
12347 52775 -40863 -48592 70077 53049 55410 -37753 -19334 -13151 197526 -22396 171152 -12929
12334 -273726 -110145 -348295 53809 -70426 -28188 84775 -91571 -78582 165635 -73363 32381
12322 55839 -41881 79708 -333095 -200053 66139 -86823 -115566 26833 78602 -100737 144923
12310 -55643 -143326 188880 -149824 78257 196792 108986 39474 -38701 -39126 178926 43279
12298 -258098 23144 101186 32831 -73029 272308 -47946 49158 -79049 -198714 23837 -188266
12286 297527 205926 17094 -151916 392359 -19777 -158624 91160 -46841 113163 83960 5244
$$ packed form
12372C42974c1320j75293j2045I058J04744D8900j2521N2697l9983g8323A20724
12360I3774b9653E0953N5162a4143B52357J6167j02290h0866M18p171C41752e5955
12347E2775d0863p729G0077j7028K361c7753J8419O183A97526b2396A71152a2929
12334b73726a10145k38150E3809g0426b8188H4775i1571J2989A65635g3363C2381
12322E5839d1881G9708c33095J33042F6139h6823k8743B6833N1769a00737A44923
12310e5643q7683A88880a49824G8257J18535q7806C9474c8701m25A78926D3279
12298b58098B3144P8042C2831g3029B72308d7946D9158g9049j19665B3837a88266
12286B97527r1601A7094a51916C92359a9777j38847I1160d6841A13163k9203E244
$$ plain form
12274 -167769 58371 36437 134082 72117 -269347 191155 49316 -258094 134356 250546
12264 250546 345893 257485 105652 -163313 -132450 396284 -267022 158355 132821 240608
12254 240608 40682 221945 100773 94454 -81257 359872 134670 302973 -86608 170150
12243 83346 -105878 107552 236640 -178085 13858 -141676 -31187 131637 8119 197613
12233 197613 326063 -44092 240392 110519 -298968 637219 159666 554149 216380 86767
12222 304523 571795 -83488 125729 296385 123669 141880 19094 223848 324426 363676
12212 363676 22316 196425 -86409 -216701 212848 173373 -65820 381120 30063 218428
12202 218428 318079 16535 -128121 6761 462301 334093 124448 204605 -57347 -29727 258273
$$ packed form
12274a67769E8371k1934R7645o1965b69347A91155D9316b58094A34356J16190
12264B50546R5347q8408A05652a63313L0863C96284b67022A58355k5534J07787
12254B40608D0682J81263A00773o319h1257C59872A34670J68303h6608A70150
12243H3346a05878A07552J29088a78085A3858a41676c1187A31637H119J89494
12233A97613J28450d4092B40392A10519b98968F37219A59666L94483B16380H6767
12222C04523K67272h3488A25729J70656A23669J8211A9094K04754J00578L9250
12212C63676B2316J74109h6409j30292B12848l9475f5820C81120C0063J88365
12202B18428R9651A6535a28121F761M55540j28208A24448Q0157e7347K7620B58273
$$ plain form
12190 434498 214786 189520 406717 41960 79520 257708 -73500 -49405 120501 78967 44152
12179 44152 336861 30267 66061 202870 42349 194188 -48791 27717 177971 -11988 220654
12167 -21744 -106170 267513 -117732 81584 17251 67427 -134123 29835 -69194 330665 -135430
12155 -124624 -48325 -87561 67000 -144433 -108228 -116391 -180342 69784 18159 118780 19802
12143 -133884 -266430 21573 -165494 -56842 88453 291425 -47748 125417 84849 94257 145751
12132 145751 -75307 -88339 67019 23040 58909 189945 -18804 208914 -38897 66655 6788
12120 -27999 162167 -163442 -12115 151413 -220137 -46996 10737 198534 -29587 -337285
12110 -337285 -27594 37260 -92524 162012 85059 335879 -101976 102986 -179952 91518
$$ packed form
12190D34498B14786k5266K17197D1960L7560J78188g3500K4095A20501m1534l4815
12179D4152K92709C0267L5794J36809D2349J51839d8791B7717J50254a1988B20654
12167b1744q4426B67513a17732H1584A7251N0176a34123B9835f9194C30665a35430
12155a24624d8325l9236F7000a44433L6205q163o3951F9784A8159J00621A9802
12143a33884j32546B1573a65494e6842H8453K02972d7748A25417m0568R408N1494
12132A45751g5307j3032F7019B3040L5869J31036a8804B08914c8897F6655F788
12120b7999A62167a63442a2115A51413b20137d6996A0737J87797b9587l07698
12110c37285b7594C7260i2524A62012p6953K50820a01976A02986a79952I1518
$$ plain form
12099 -87755 204458 121600 -41494 -89726 170061 -113611 22895 39741 -114359 -302857 177444
12087 -41635 26252 -26850 -167842 -41889 344648 3010 -15256 -512804 -41527 267235 242173
12076 242173 -142531 175985 67519 203935 354691 1345117 1464675 329836 586458 -89870
12065 25579 -960 136436 80564 -71431 73511 76145 67208 49896 45282 -33345 85692 -341128
12052 -246976 -123039 42537 92235 82782 -54677 -216660 -421675 31188 3612 212941 -278179
12040 -185852 176741 260651 -87643 211162 118907 15755 309565 -224581 -7220 -147834 78277
12028 -155438 -175870 -37932 -260786 171424 -517431 -45356 1824 212471 -31986 -74349 123218
12016 138596 -81625 -111479 139531 103803 -63039 139539 -133173 -60601 -145656 94397 -95913
$$ packed form
12099h7755B04458q2858d1494m8232A70061a13611B2895J6846a14359j88498A77444
12087d1635B6252b6850j40992d1889C44648C010a5256m97548d1527B67235k5062
12076B42173a42531A75985F7519J36416J50756R90426J19558C29836K56622h9870
12065B5579i60A36436n5872g1431G3511K634q937j7312m614c3345H5692c41128
12052b46976a23039D2537M9698r453e4677j61983k05015C1188C612K09329b78179
12040a85852A76741Q3910h7643B11162r2255A5755K93810b24581g220j40614G8277
12028a55438k0432c7932k22854A71424e17431d5356A824K10647c1986m2363A23218
12016A38596h1625k9854A39531l5728f3039A39539a33173f0601q5055I4397i5913
$$ plain form
12004 -109313 86770 -77225 -251749 103919 167523 104206 -60695 -369394 -187543 16118 -269547
11992 -38692 153052 -299544 319629 24949 -120426 -44457 -167158 -48509 -44612 90682 310730
11981 310730 -193736 -28277 87477 43775 -140475 428107 118466 -127327 65420 22648
11970 -762 7060 340976 -302287 -151936 -335010 29146 -72967 -374175 82753 261913 -40895
11958 107156 -131396 164995 160274 -19861 46821 8867 -321151 138269 -1881 -4182 -62080
11947 -62080 27421 24800 32871 -185520 -390640 180768 -106776 -281430 -32348 -72001 -102670
11936 -102670 254263 -129298 230865 173995 11946 -78230 52016 -16307 71126 -97200 -280750
11925 -280750 -295927 377763 -282140 -151897 -80305 165425 134583 115399 84937 -139405
$$ packed form
12004a09313H6770g7225j74524A03919O3604o3317f0695l08699J81851A6118b69547
11992c8692A53052b99544C19629B4949a20426d4457j22701d8509L897I0682K20048
11981C10730a93736b8277H7477m3702a40475D28107A18466a27327F5420B2648
11970g62G060L33916c02287J50351j83074B9146g2967l01208H2753J79160d0895
11958A07156a31396A64995m721a9861D6821H867c21151A38269a881k301n7898
11947f2080B7421k621Q071a85520k05120A80768a06776j74654c2348l9653l0669
11936a02670B54263a29298B30865n6870A1946g8230E2016a6307G1126i7200j83550
11925b80750j5177C77763b82140J30243P1592A65425l0842j9184l0462a39405
$$ plain form
11914 239640 -181492 140774 -191788 -255017 136962 142197 -131814 -342481 16500 2947 138471
11903 138471 -73154 -93714 53252 -481697 -189447 187595 -27014 108469 -44097 -80607 224011
11891 -30686 391354 -406577 21196 29494 175311 -294884 362699 327580 -15310 173805 -474139
11879 -270004 18201 -88536 -19996 -98969 50283 59423 -47268 39806 -296276 22182 -135236
11867 -434462 -32942 -188872 -10886 -273299 -58784 -357767 -144924 -371971 408021 121129
11856 -128359 -12418 202189 86855 -102604 70892 222071 468774 -19677 -114645 296400
11845 -12210 -40896 -150883 -189263 60258 82711 -251544 -167957 -26795 169345 102051 -271592
11833 -86774 -410947 -188558 208622 -79164 34242 -85976 123313 133193 362731 -35306 157314
$$ packed form
11914B39640a81492A40774a91788o3229A36962N235a31814k10667A6500B947J35524
11903A38471g3154k0560E3252d81697a89447A87595b7014A08469d4097l6510B24011
11891c0686C91354d06577B1196Q298J45817b94884C62699l5119a5310A73805d74139
11879b70004A8201h8536a9996p8973E0283R140d7268C9806b96276B2182a35236
11867d34462c2942j55930a0886k62413e8784k98983a44924k27047D08021A21129
11856a28359a2418B02189H6855a02604G0892J51179K46703a9677r4968B96400
11845a2210k8686j09987l8380F0258K2453b51544Q3587b6795A69345o7294b71592
11833h6774l24173a88558B08622g9164C4242h5976A23313R880K29538c5306A57314
$$ plain form
11821 -190467 -153934 -239037 -233209 133856 302126 -110578 167446 -167965 24199 -4433 -45597
11810 -45597 -222678 12183 137376 -118472 257336 -127359 -87126 -81282 -128616 128463 137964
11799 137964 -110816 28015 -227306 -81810 98172 -164661 -51322 94860 227925 222676 2116
11787 -30353 -53810 -283045 -7256 -32913 -199668 272374 81071 41714 -269185 -23818 264821
11775 -18603 -302032 -89951 -238374 -150286 41980 228694 14091 -364615 -77599 142995 7061
11763 -142831 -118450 -140981 -191722 -361010 133129 -218257 115936 279059 -39509 -251795
11753 -251795 88542 92670 43278 -4644 -23996 -60913 -249098 84109 -18204 348804 -112168
11741 115103 158608 -223258 -15369 161702 -153996 -255353 -63556 280189 42835 -134302
$$ packed form
11821a90467L6533q5103N828A33856J68270a10578A67446a67965B4199d433m1164
11810d5597j77081A2183J25193a18472B57336a27359M0233N844m7334A28463R501
11799A37964a10816B8015b27306h1810I8172a64661e1322I4860J33065n249B116
11787c0353k3457k29235g256k5657j66755B72374H1071l9357b69185b3818B64821
11775a8603k83429h9951j48423Q8088D1980J86714A4091c64615g7599A42995G061
11763a42831K4381k2531n0741j69288A33129b18257A15936J63123c9509k12286
11753b51795H8542M128D3278d644j9352l6917j88185H4109a8204C48804a12168
11741A15103M3505b23258a5369A61702a53996j01357f3556B80189D2835a34302
$$ plain form
11730 304159 -259148 -22942 -27377 -33707 9821 -31606 -122574 116244 -189736 112782 -198791
11718 127338 -101594 255105 75004 30081 73336 228416 79700 -18028 245348 -99844 24279
11706 324371 278718 99883 -171250 265298 -156632 -206310 -96320 -8061 104952 -244099 117667
11694 -418860 219366 76733 30186 75420 -221281 25864 8043 -78114 158717 95947 -180900
11682 -104037 220625 -386298 324860 288345 -154767 -319786 -245970 17112 -90342 -90247 165371
11670 419229 -266555 -210178 224890 265130 25793 -122120 86869 148933 -203794 -124172 -188335
11659 -188335 -70061 152629 -127808 -74932 -131162 113136 -247715 203197 -422846 -36343
11648 74921 -81653 -1238 -154733 -111686 -246250 138736 46757 -178414 -27613 168772 -92554
$$ packed form
11730C04159b59148b2942m435o330I821c1606r0968A16244a89736A12782a98791
11718A27338a01594B55105G5004C0081M3255J55080G9700a8028B45348i9844B4279
11706C24371m5653I9883a71250B65298a56632m9678i6320h061A04952b44099A17667
11694d18860B19366G6733C0186M5234b21281B5864H043g8114A58717o2770a80900
11682a04037B20625c86298C24860l6515a54767j65019P3816A7112i0342R5A65371
11670D19229b66555N6377B24890M0240B5793a22120H6869O2064b03794P9622o4163
11659a88335g0061A52629a27808N2876n6230A13136b47715B03197d22846c6343
11648G4921h1653a238j53495M3047j34564A38736D6757a78414b7613A68772i2554
$$ plain form
11636 -197024 -251937 -217090 -184540 134512 -79629 157535 89718 -352945 -26413 137869 13624
11624 75733 -33947 307089 -13672 209875 121737 127597 -109729 108277 59418 125641 -162825
11612 336148 -11593 88932 94061 -31984 -164386 78572 -199714 99175 -35856 -60652 69458
11600 159319 -30334 98764 66424 69657 -75574 88000 125298 54331 195050 118224 93816
11589 93816 39916 3054 23523 363075 204359 467708 -64870 -52737 142113 245959 246078
11578 246078 1041 70862 328182 -132618 234426 243087 162183 -119851 -108369 225396 40830
11566 39454 72027 -21022 95573 405917 155486 202092 219581 -23358 -33040 1424 31026 -101730
11553 -181199 221186 12796 227451 -63545 48444 74692 -48713 178853 -186581 255189
$$ packed form
11636a97024n4913L4847L2550A34512g9629A57535o7817c52945b6413A37869A3624
11624G5733c3947C07089a3672B09875q8138N860a09729A08277m8859O6223a62825
11612C36148a1593H8932N129c1984j32402G8572a99714I9175c5856k4796F9458
11600A59319c0334I8764l2340L233g5574H8000L7298E4331J40719p6826k4408
11589I3816C9916C054K0469L39552j58716K63349f4870J2133A42113J03846J19
11578B46078A041O9821K57320a32618B34426Q661q0904a19851J1482B25396D0830
11566C9454L2573b1022I5573L10344A55486M6606J7489b3358r682A424K9602a01730
11553a81199B21186A2796K14655f3545D8444K6248d8713A78853a86581B55189
$$ plain form
11542 189735 98021 237406 213022 269576 128606 -6981 -183071 210081 29266 334524 231223
11531 231223 168609 93179 -206029 156111 -160505 67407 190648 155880 174228 -56657 -30051
11520 -30051 76447 39291 223292 131529 19442 -133103 -120848 114025 57263 -101426 130499
11508 56870 420790 261877 467153 369593 -13430 -121740 164002 100224 -64610 74561 426531
11497 426531 -86 338972 -8991 -21445 443805 32399 35167 -38591 411154 119676 -42838 -109998
11485 -109998 -19417 -253495 198488 245622 177959 322693 556678 -9785 308208 107822
11474 71298 89926 46188 391288 205216 -149227 333677 45479 232041 -146218 -37938
11463 92417 102480 -35966 -117977 195541 63736 84963 -172182 312319 235035 189538 51649
$$ packed form
11542A89735r1714J39385k4384N6554A28606f981j76090B10081B9266L05258j03301
11531B31223o2614p5430b06029A56111a60505F7407J23241l4768J8348e6657K6606
11520c0051G6447l7156J84001r1763A9442a33103J2255A14025n6762a01426A30499
11508E6870L63920j58913K05276r7560a3430j08310A64002o3778f4610G4561L51970
11497D26531h6C38972h991j2454D43805C2399K768c8591D11154A19676d2838o7160
11485a09998a9417k34078A98488M7134o7663J44734K33985i785C08208A07822
11474G1298J8628m3738L45100j86072a49227C33677D5479J86562a46218c7938
11463I2417J0063c5966q2011A95541F3736K1227a72182C12319p7284m5497E1649
$$ plain form
11451 7104 115940 91022 219868 -282411 400297 387037 178858 153330 61998 12361 13974
11440 13974 26159 323954 495869 110198 266260 86794 247608 22171 -187540 51100
11429 23585 29483 2204 -13075 -150445 26449 -283424 -159569 221272 68459 -24691 -234302
11418 -234302 -60845 -22057 212737 -79215 81779 58440 80482 361712 521257 19499 -62315
11406 -51879 -69754 -172052 358970 83312 -124224 546685 -53954 137766 321734 181279
11396 181279 36388 -521 398376 -30335 -52230 -106344 -10331 36859 126068 -66110 -52870 72472
11383 13185 -56691 26180 115247 -201351 -1446 54508 285948 -54450 -49314 -203795 -96617
11371 175593 -9006 -194925 215428 382993 70934 147687 245822 69941 -165775 161922 -166911
$$ packed form
11451G104J08836k4918J28846b82411D00297j3260A78858k5528F1998A2361J613
11440A3974J2185K97795J71915A10198J56062H6794J60814B2171a87540E1100
11429B3585N898B204a3075j37370B6449b83424J23855B21272F8459b4691k09611
11418b34302f0845b2057B12737g9215H1779k3339K2042K81230J59545A9499f2315
11406e1879j7875j02298C58970H3312a24224E46685e3954A37766J83968j40455
11396A81279C6388e21C98376c0335k1895n4114a0331C6859Q9209f6110J3240G2472
11383A3185e6691B6180Q9067b01351a446E4508K31440e4450N136j54481i6617
11371A75593i006j85919B15428J67565G0934P6753R8135F9941a65775A61922a66911
$$ plain form
11359 -186179 -23109 71804 157137 -15809 61877 177187 253097 217774 220199 463054 114966
11347 385363 176132 207126 -10955 -33622 -119832 -162907 -5825 -118931 97875 146043 -135849
11335 256231 -18901 -60742 140231 -29908 119533 -112359 49282 -72112 -135641 -26815 -286606
11324 -286606 -62347 -44061 203331 -101412 35735 -155313 -442806 -99766 -149902 8353 -199731
11312 -72211 15297 27022 25676 -39019 94207 -309847 -186616 -224657 -113874 -111907 -90750
11301 -90750 -194686 35898 -101285 -5306 163218 -69534 6339 -12718 -62564 66583 126388
11290 126388 205710 -185635 67043 -28008 -220493 42824 74616 -114495 -48950 97586 5491
11278 259218 -42705 -283734 14300 -101295 -21299 -306025 -251706 -165653 -124522 29808 282498
$$ packed form
11359a86179b3109G1804Q5333a5809F1877J15310P5910l5323K425K42855A14966
11347C85363A76132L0994a0955k2667q6210m3075e825j13106I7875M8168a35849
11335B56231a8901m1841A40231b9908A19533a12359D9282g2112o3529b6815k59791
11324b86606f2347J8286B03331a01412C5735a55313k87493i9766n0136H353a99731
11312g2211A5297J1725j346c9019I4207c09847J23231l8041J10783J967K1157
11301i0750j03936C5898a01285e306A63218f9534F339a2718m9846F6583N9805
11290A26388P9322a85635F7043b8008j92485D2824L1792a14495d8950I7586E491
11278B59218d2705k41029A4300a01295b1299k84726N4319Q6053M1131B9808K52690
$$ plain form
11267 282498 49190 -100122 -225404 -3920 126187 -140774 -158080 8939 110670 -14475 6565
11255 -73107 132997 81294 -148258 33381 -54140 60761 344308 93250 155831 -160816 -224898
11244 -224898 -109044 -2589 -460464 -146929 -9087 56758 -11483 274276 -501743 11900 -276711
11232 233715 -45176 311785 16605 -7334 107349 155584 -202426 -118573 2094 151388 -36055
11220 -169612 33819 -353422 -200429 -23807 167760 -12703 81879 87404 -357371 94019 130523
11209 130523 33290 -114938 28142 -237314 -251707 -383624 -377351 -24509 208588 -71175 260091
11197 -257043 -155045 -206379 83823 77581 -433393 38499 -175681 -223350 -271838 -23985 39265
11185 -54737 32566 10784 43060 -232553 -292086 64863 -203872 120596 -91176 62268 -4305
$$ packed form
11267B82498D9190a00122j25282c920A26187a40774j7306H939J01731a4475F565
11255g3107A32997n1703a48258C3381e4140F0761K83547I3250O2581a60816o4082
11244b24898a09044b589m57875a46929i087E6758a1483B74276e01743A1900b76711
11232B33715d5176C11785A6605g334A07349M8235b02426Q3853B094J49294c6055
11220a69612C3819c53422J52993b3807A67760a2703H1879N525c57371I4019L6504
11209A30523C3290a14938B8142b37314j4393j31917O273b4509B08588g1175B60091
11197b57043J01998n1334H3823o242d33393C8499a75681m7669m8488b3985C9265
11185e4737C2566A0784L2276b32553n9533F4863b03872A20596i1176F2268d305
$$ plain form
11173 -3427 -57380 -96992 -7793 -15011 -14585 -350468 -122594 -78698 272069 -151181 168872 -2069
11160 328874 -209514 -14272 -112253 -386641 102549 -71040 -198114 -261212 -34813 -333146
11150 -333146 -3279 26056 112458 54678 -58194 113564 -154351 -30744 -2570 64657 187210
11139 187210 -283133 108511 -253912 124792 9584 -128963 419831 235800 124164 -115843
11128 57611 125873 181383 178287 147219 8073 202360 231206 104208 162673 -106410 -3141 274412
11115 192880 -168465 -62833 11908 25278 -18422 280504 -58078 244160 16937 290997 8930
11103 391042 -88882 120084 355230 24785 -14193 112966 316717 146259 138767 143458 101702
11092 101702 79575 244068 307266 192929 203067 156645 200247 38117 167019 277610 551457
$$ packed form
11173c427n3953l9612g793p218M26l35883a22594M3896B72069a51181A68872b069
11160C28874b09514a4272r7981k74388A02549g1040j27074o3098c4813k98333
11150c33146c279B6056Q6402E4678e8194A13564a54351c0744b570F4657J22553
11139A87210b83133A08511b53912A24792I584a28963D19831j84031j11636a15843
11128E7611O8262N5510l096l1068H073J94287K8846A04208N8465a06410c141B74412
11115A92880a68465f2833A1908J3370a8422B80504e8078B44160A6937K74060H930
11103C91042h8882A20084K35146B4785a4193A12966K03751A46259p492M691m1756
11092A01702k2127J64493O3198j14337J0138m6422M3602C8117J28902J10591K73847
$$ plain form
11081 551457 370020 416992 188081 278110 381151 441113 280409 268116 629870 527202
11071 527202 334365 211010 243332 248479 340311 480429 131157 442508 663941 668771 724999
11060 724999 638055 492748 642769 584529 646098 578355 839971 699008 797842 374006
11049 673211 1116217 532681 1186294 929148 777346 831544 790783 753255 880215 841683
11039 841683 724194 657393 791292 1052201 979486 516958 607919 831886 990768 653573
11029 653573 854464 705934 909053 723305 870840 708261 783927 897001 781458 786562
11019 786562 1012664 455782 822039 895425 747585 464565 585940 723399 789862 927011
11009 927011 627178 405360 437117 1039535 504283 590398 703923 520146 411066 720154
$$ packed form
11081E51457j81437M6972A88081R0029J03041N9962j60704j2293L61754j02668
11071E27202j92837j23355L2322N147R1832J40118A31157L11351K21433M830N6228
11060G24999q6944j45307J50021n8240O1569o7743K61616j40963R8834C74006
11049F73211M43006E32681O53613k57146j51802N4198m0761l7528J26960l8532
11039H41683j17489o6801J33899K60909p2715m62528R0961K23967J58882l37195
11029F53573K00891j48530K03119j85748J47535j62579P5666J13074j15543N104
11019G86562K26102D55782L66257P3386j47840k83020J21375J37459O6463J37149
11009I27011k99833k21818L1757O02418E04283Q6115J13525j83777j09080L09088
$$ plain form
10999 720154 460161 353806 460362 515845 1063078 658069 599168 655557 1150480 862564
10989 862564 691937 749968 1192741 549188 843139 1046385 1188992 689882 1466721 1401760
10979 1401760 1469933 1661375 1985776 2196045 2205694 2520637 2910435 3182652 3226957 3381886
10969 3381886 2869645 2982979 2767748 2379751 1826668 1689526 1374558 1736577 1592116
10960 1592116 1349734 1587326 1803448 1425958 1935689 1667462 1335227 1190645 1169886 849929
10950 849929 599246 764482 619557 531227 484106 289410 193286 171546 113362 250241
10940 250241 119928 62617 151549 57766 176740 131661 168652 -305812 -150382 -29728 592127
10928 292608 -49721 233691 106077 87487 233226 513800 135894 -17106 51943 -5538 -8472
$$ packed form
10999G20154k59993j06355J06556N5483N47233m05009n8901N6389M94923k87916
10989H62564j70627N8031M42773E49188K93951K03246J42607m99110P76839o4961
10979A401760O8173J91442L24401K10269R649L14943L89798K72217M4305J54929
10969C381886n12241J13334k15231l87997n53083j37142l14968L62019j44461
10960A592116k42382K37592K16122l77490N09731k68227l32235j44582k0759l19957
10950H49929k50683J65236j44925q8330m7121j94696r6124k1740n8184J36879
10940B50241A19928n7311Q8932E7766J18974m5079L6991c05812a50382b9728E92127
10928B92608d9721B33691A06077j8590J45739K80574A35894a7106E1943e538k934
$$ plain form
10917 -8472 119010 187707 121501 -27131 -113136 -44662 -27180 -84848 -122350 70479 51389 124049
10905 124049 178613 161765 -150465 162856 -62881 6398 175133 -25346 368046 -95752 27583
10893 -8361 -248075 34400 -52729 -68239 -59406 -35822 -19659 -134634 -99865 -116931 174426
10881 214969 -15626 6382 -173799 -175373 -78778 -224046 -182230 18338 -77120 226701 201026
10870 201026 -88216 -81010 -168007 -60972 100887 -95008 5229 6169 165667 -5438 -95249 -65071
10858 -65071 -166425 -7979 -312984 -63029 103560 34857 -8587 -24041 -301757 63590 -371963
10846 -37022 -19230 3934 161200 -288002 -124290 -67805 42828 -83123 -63858 150029 -231707
10834 -17162 26492 -238566 287791 -98275 -291392 67299 -414937 152657 -495832 -129722
$$ packed form
10917h472A19010O8697o6206b7131q6005d4662J7482n7668l7502G0479j9090P2660
10905A24049N4564j6848a50465A62856f2881F398J68735b5346C68046i5752B7583
10893h361k39714C4400e2729j5510Q833K3584J6163j14975L4769j7066A74426
10881B14969a5626F382a73799j574g8778j45268M1816A8338g7120B26701k5675
10870B01026h8216P206q6997f0972A00887i5008E229R40J59498e438q9811L0178
10858f5071j01354g979l05005f3029A03560C4857h587j5454k77716F3590c71963
10846c7022J7792C934J57266b88002a24290N6485D2828h3123J9265A50029b31707
10834a7162B6492b38566B87791i8275j93117F7299d14937A52657d95832a29722
$$ plain form
10823 -144195 -81718 86281 13185 146423 -104288 -250818 219863 -160217 -296772 -8092
10812 -146253 102811 -198676 205361 -390759 -16702 -183465 29144 -2779 -142853 -84831
10802 -84831 -253944 -32375 -48433 -236214 -327933 73436 -8640 43531 -78605 48501 -435492
10790 -19575 8952 -172366 -117641 56652 -232074 -21547 80787 -16133 118247 144084 -390276
10778 107477 -65017 98592 -178044 36819 1698 30152 93302 110186 10785 -11370 -82305
10767 -82305 169120 119205 -585 62135 28521 178350 -83471 -51777 153728 -113333 64681
10755 -76934 -31467 -76890 -211300 366057 -23501 295190 105335 121012 21127 171067 129944
10744 129944 -143265 101794 -417400 101419 75367 -204488 84485 -342233 211404 24963
$$ packed form
10823a44195O2477H6281A3185J33238a04288j46530B19863a60217j36555h092
10812a46253A02811a98676B05361c90759a6702j66763B9144b779j40074N8022
10802h4831j69113c2375j6058j87781r1719G3436h640D3531g8605D8501d35492
10790a9575H952a72366N4725E6652b32074b1547H0787a6133A18247K5837c90276
10778A07477f5017I8592a78044C6819A698K8454O3150J6884A0785a1370p0935
10767h2305A69120m9915e85F2135B8521J49829h3471L1694A53728a13333F4681
10755g6934c1467m5423j34410C66057b3501B95190A05335J5677B1127J49940m1123
10744A29944a43265A01794d17400A01419k6052b04488H4485c42233B11404B4963
$$ plain form
10733 276352 -161620 -29339 340365 -257500 70722 -31369 -30590 -231397 9417 -4137 -126545
10722 -126545 -71977 -134697 127725 -130944 -2913 -313973 -212042 288126 8282 -29664 -338351
10711 -338351 -202988 -239013 6449 -230976 -261770 158344 -644899 -63880 -371632 -106706
10700 -69314 -31244 -9862 -126820 -9177 -167855 -353958 34729 413029 -39436 -97640 10109
10688 315550 -10221 146574 -181897 -169387 22064 -14493 66745 -100239 -164969 324539 -10749
10676 -209208 -22510 106210 -30706 -135675 9931 144029 -200171 -124228 312489 -12573 -57799
10665 -57799 -58292 -196338 45011 -303222 194488 219724 93593 -100443 -196941 -118137 92987
10653 -181314 -127485 -262996 -8560 -225903 7115 70801 32140 -176568 327359 -297608 63827
$$ packed form
10733B76352a61620b9339C40365b57500G0722c1369P79k00807I417d137j22408
10722a26545N4568o2720A27725a30944b913l11060J01931B88126H282b9664l08687
10711c38351J35363l6025F449b30976l0794A58344f44899f3880l07752a06706
10700f9314c1244i862j16958i177j58678j86103C4729L78300c9436n8204A0109
10688C15550a0221A46574a81897J2510B2064a4493F6745a00239o4730C24539a0749
10676b09208b2510A06210c0706j04969I931J34098b00171P5943C12489a2573m5226
10665e7799m93j38046D5011c03222A94488K5236I3593a00443r6498P8804I2987
10653a81314N3829j35511h560k17343G115O3686C2140a76568C27359b97608F3827
$$ plain form
10641 -113725 -230645 -280930 -324886 -43327 217626 95055 245567 54472 171137 -19161 85958
10629 -167578 -283322 256864 162779 -47223 11481 56870 46155 -101214 -268538 46219 -320823
10617 -30451 -157987 -163583 76602 -71363 115131 -203193 -68462 -68597 -367882 -356981 271342
10605 -97480 238970 -270490 20449 103926 -190081 -10751 -210248 -31108 -399098 128315
10594 -181593 -4923 -169242 -415 -94018 -245888 -124397 -38791 -50044 -20075 -240541 -257358
10583 -257358 187963 201616 -367645 -327755 213666 160631 47354 13732 72913 -71679 151806
10571 -128108 4714 -86519 41920 199845 -67370 -379558 73056 -32071 -40439 198476 50207
10559 -117609 122993 -196496 -167126 -112592 -222735 184165 -375200 -196172 20619 -22526
$$ packed form
10641a13725j16920n0285m3956d3327B17626I5055J50512E4472J16665a9161H5958
10629a67578j15744B56864r4085d7223A1481M5389j0715a01214j67324D6219c20823
10617c0451j27536n596G6602g1363A15131b03193f8462j35k99285J0901B71342
10605i7480B38970b70490B0449Q3477a90081a0751j99497c1108l67990A28315
10594a81593d923j64319d15r3603j51870J21491c8791j1253b0075k20466j6817
10583b57358A87963J3653c67645L9890B13666n3035D7354A3732N9181g1679A51806
10571a28108D714h6519D1920J57925f7370l12188G3056c2071q368A98476E0207
10559a17609A22993a96496K9370N4534j10143A84165c75200J79028B0619b2526
$$ plain form
10548 55806 -81495 10212 -257544 -168214 -87849 -194456 -49340 56299 100511 12694 -9210
10536 17022 -273465 -33539 54307 32890 -179818 323912 -62139 -22634 108385 -51832 -234861
10525 -234861 -398014 -38520 47251 -141089 -227630 62929 232411 -274848 -91578 -333288
10515 -333288 -172759 125591 -97555 -333995 -57528 -199167 9575 -2724 -345249 -308370 232480
10503 -336150 134505 23661 98089 -37111 -217324 -106003 -196346 67154 10068 -15808 -180323
10492 -180323 88220 -44953 -72703 -28065 63903 47535 -110009 1328 198237 130251 310943
10481 310943 326522 309927 520345 336955 579242 -151474 139491 -285398 816 213850
10471 213850 -54990 19840 120967 -36388 -84947 -72104 -196524 376533 5437 -131568 -123503
$$ packed form
10548E5806h1495A0212b57544Q9330Q0365j06607d9340E6299M4212A2694i210
10536A7022b73465c3539E4307k1417a79818C23912f2139b2634A08385e1832j83029
10525b34861j63153c8520D7251a41089q6541F2929J69482b74848i1578k41710
10515c33288J60529A25591i7555k36440e7528j41639I575b724l42525L6879B32480
10503c36150A34505B3661P4428c7111j80213a06003r0343F7154A0068a5808j64515
10492a80323H8220d4953k7750b8065F3903j6368a10009A328J96909o7986J80692
10481C10943J5579j6595K10418j83390K42287a51474A39491b85398H16K13034
10471B13850e4990A9840J01127c6388m8559J2843j24420C76533E437a31568Q065
$$ plain form
10460 -123503 -231986 -113781 35024 -145479 -105523 49196 -227565 -321775 158406 94892
10450 94892 -55614 -167736 33663 -11738 33809 -346833 -109512 -238387 27490 -54501 -33668
10439 -33668 79220 -67468 -55304 104505 153030 -8438 -321138 -347216 -416442 -116375 75436
10427 -16550 -45494 209432 -265242 -5492 215098 91476 115581 14988 -374178 430224 118435
10415 -217900 -280057 48791 -329302 88141 72514 125529 247417 247274 -82019 -201101 177148
10403 -170491 60781 -25705 89904 -35138 195901 -37445 -147810 27355 138244 106299 5477
10391 76262 212534 129272 288806 48326 -53172 33892 207040 128268 539679 355127 151903
10379 -107577 167479 -3899 265612 406833 715755 87857 104416 -115411 356550 517996
$$ packed form
10460a23503j08483a13781C5024a45479L9956D9196b27565r4210A58406o3514
10450I4892e5614j12122C3663a1738C3809c46833a09512j28875B7490e4501K0833
10439c3668G9220f7468J2164A04505M8525h438l12700k6078o9226a16375G5436
10427a6550k8944B09432b65242e492B15098I1476K4105A4988c74178D30224A18435
10415b17900o2157D8791c29302H8141j5627N3015J21888j43h2019j19082A77148
10403a70491F0781b5705H9904c5138A95901c7445j10365B7355J10889l1945E477
10391G6262J36272q3262J59534D8326e3172C3892J73148p8772M11411j84552A51903
10379a07577A67479c899B65612J41221L08922H7857J6559a15411C56550J61446
$$ plain form
10369 517996 470054 350489 522077 562920 603717 325725 137651 406892 390505 434461
10359 434461 315130 237956 168543 286751 575845 287570 150947 524171 995648 638025
10349 638025 450388 582707 346343 8202 475967 301049 475862 117617 -1785 173049
10338 265281 125457 103752 245891 10760 97116 205017 121796 -161765 -125636 -41323 275659
10326 51073 391768 9684 262545 -205261 216923 -83882 350756 143731 236473 23953 188449
10315 188449 298433 -46869 66071 -39112 30560 52761 78913 -139747 -274508 43067 55095
10304 55095 238776 -259495 -44008 -24345 100575 -111769 149276 -234701 -203667 -150945
10294 -150945 -216928 177248 7078 -515606 178668 1850 -212988 -476680 -102515 -21781 -314820
$$ packed form
10369E17996m7942j19565J71588M0843M0797k77992A37651K69241j6387M3956
10359D34461j19331p7174o9413J18208K89094B87570j36623L73224M71477l57623
10349F38025j87637J32319k36364H202M67765j74918J74813A17617a785A73049
10338B65281A25457k1705J42139A0760Q6356J07901q3221a61765L6129d1323B75659
10326E1073L40695I684K52861b05261B16923h3882C50756A43731R2742B3953J64496
10315A88449J09984d6869F6071c9112C0560K2201K6152a39747j34761D3067J2028
10304E5095J83681b59495d4008J9663A00575a11769A49276b34701L1034N2722
10294a50945o5983A77248G078e15606A78668A850b12988k63692a02515b1781k93039
$$ plain form
10283 -314820 -82481 -273277 -190901 -163055 -33584 -343203 156826 -85434 -34386 -67454 48237
10271 -170918 43976 -149188 163706 85684 -251602 -249277 46794 146527 42109 190814 383613
10260 383613 315514 257392 -76929 328053 262227 -55232 38775 -128983 -45393 191591 68012
10248 120161 103438 -46853 33605 56705 283380 -220921 9164 25019 -326413 -40831 -95482
10237 -95482 -77262 35270 19403 143169 -52759 90158 -192225 -560292 -226610 121956 -76643
10225 -20495 -46940 -92964 174547 23563 -124226 -152474 243903 -143829 7547 114709 -86737
10213 -94191 117059 -272624 -80057 -116543 -169133 46407 -7471 -224745 -148307 -77207 -16877
10201 1448 298943 -10817 271482 218646 270121 -298824 -66900 -27507 -170228 61017 -818
$$ packed form
10283c14820h2481j90796Q2376K7846c3584l09619A56826h5434c4386l3068D8237
10271a70918D3976a49188A63706p8022b51602K325D6794R9733D2109J48705J92799
10260C83613o8099n8122g6929C28053o5826e5232C8775a28983d5393A91591F8012
10248A20161j6723d6853C3605K3100K26675b20921I164J5855c26413d0831n4651
10237i5482J8220C5270j5867J23766e2759I0158a92225l68067b26610A21956g6643
10225b0495k6445m6024A74547B3563a24226k8248B43903a43829G547J07162h6737
10213i4191A17059b72624h0057l6486n2590D6407g471k17274P6438P1100a6877
10201A448K97495a0817B71482n2836N1475b98824f6900b7507j42721F1017h18
$$ plain form
10189 194595 -236671 33108 63357 -37556 33805 -185236 -152866 359240 -154628 -42639 -162990
10178 -162990 285279 -13268 86410 -186408 99092 -139126 -219006 188170 -387003 -229506
10168 -229506 -253037 159888 -52621 137645 -273156 10001 -204235 -319148 30012 167370
10158 167370 -274741 -200033 40105 -181202 -87721 -247688 159729 -98433 -231380 -145923
10148 -145923 -254864 -223341 100001 -263435 -494252 -286812 133078 -48807 143339 9333
10137 -33184 -204564 13911 -130171 -238801 -68055 34746 164929 -70602 -74277 65653 -210556
10125 -137831 -261305 -297040 133111 -80409 -211281 -275048 45408 19896 67748 -199052 55255
10113 -64087 -286711 -51360 -77262 -148667 -265636 178553 -18947 296922 175560 -196273
$$ packed form
10189A94595b36671C3108L0249c7556C3805a85236L2370C59240a54628d2639j20351
10178a62990B85279a3268H6410a86408I9092a39126p9880A88170c87003J57497
10168b29506k3531A59888e2621A37645b73156A0001b04235j14913C0012J37358
10158A67370b74741P4708D0105a81202h7721j59967A59729i8433j32947Q5457
10148a45923j08941L1523A00001b63435k30817K07440A33078d8807A43339I333
10137c3184j71380A3911a30171j08630f8055C4746J30183g0602l675F5653b10556
10125a37831j23474l5735A33111h0409j30872o3767D5408A9896M7852a99052E5255
10113f4087k22624e1360k5902p1405j16969A78553a8947B96922j21362a96273
$$ plain form
10102 -75950 109092 -125206 -114582 -30613 -110224 4922 -185932 86991 95355 -134147 114335
10090 9100 -43953 147517 447033 106231 5156 -24712 94172 -64947 6783 158896 -175604
10078 -100963 -1998 -295526 196770 -111595 -88978 -373010 -111314 102026 -240854 -73957
10067 -144052 -27920 -160978 -403941 314991 -99073 -65473 318661 190719 -217868 -24133
10056 -364705 -386137 -140522 51124 200600 192307 -149083 -11952 283384 -30221 16008 254985
10045 254985 -89708 -109547 131765 -34832 -273153 -16586 -50314 -110403 -416776 -278442 65611
10033 158420 -191916 -426294 -237158 -112099 -288124 -73308 -308348 -255770 -239728 -71651
10022 -61856 151555 -203972 -468179 -442486 -196488 -186881 -395172 124615 -117132 -18924
$$ packed form
10102g5950A09092a25206J0624c0613p9611D922a85932H6991Q364a34147A14335
10090I100d3953A47517K99516A06231E156b4712I4172f4947F783J52113a75604
10078a00963a998k93528A96770a11595K2617k84032a11314A02026b40854g3957
10067a44052b7920j33058k42963C14991i9073L3600C18661j27942b17868b4133
10056c64705k1432a40522E1124J49476q293a49083a1952B83384c0221A6008K38977
10045B54985h9708j9839A31765c4832k38321a6586l3728o0089l06373J38334F5611
10033A58420a91916k34378J89136a12099j76025g3308k35040N2578J6042g1651
10022f1856A51555b03972k64207K5693a96488R607k08291A24615a17132a8924
$$ plain form
10011 58829 92674 -65187 -151341 -33996 118406 -269178 -233501 88126 -12700 -328766 51075
9999 70444 70600 35490 -202632 -110484 -256128 -158251 -202762 212393 25647 204123 -12317
9987 -27815 -126837 -238913 -54297 -14938 -156102 -82124 -160486 -473941 -223784 38418 -108821
9975 -249506 -17050 45070 -16170 -71800 264947 -123766 -101746 72616 269367 -213209 43238
9963 -306520 -23911 -264194 -166845 -21791 27230 -65032 -56205 312568 -63274 -169175 -218721
9952 -218721 -28453 219610 -188898 -276157 -296630 -115976 -9691 -392624 -43103 -204625 46079
9940 211933 -481311 31379 -109687 -260235 139761 -95404 -225375 -416603 -54171 39222
9929 -6316 375337 43151 125891 171487 21313 -32723 37512 -46457 -73981 -2577 150577 -174419
$$ packed form
10011E8829L3845f5187q6154c3996A18406b69178L5677H8126a2700l16066E1075
9999G0444J56l5110b02632R2148j45644R7877m4511B12393B5647J78476a2317
9987b7815r9022j12076e4297a4938j41164P3978p8362l13455b23784C8418a08821
9975b49506a7050D5070a6170n5630B64947a23766K2020G2616J96751b13209D3238
9963c06520b3911k40283R7349b1791B7230f5032Q827C12568f3274j05901m9546
9952b18721b8453B19610a88898q7259k0473a15976i691l82933d3103j61522D6079
9940B11933d81311C1379a09687j50548A39761i5404j29971j91228e4171C9222
9929f316C75337D3151Q2740M5596B1313c2723C7512d6457k7524b577A50577a74419
$$ plain form
9916 -254843 216580 -210220 -139256 -106554 -285740 -183776 -176933 45679 165946 287631 -316782
9904 -77507 -46947 -73936 -56282 -75203 178278 -356706 296124 64955 -1768 -272918 -245367
9893 -245367 103029 88711 223654 51262 -656601 101345 -170059 18552 -163216 94762
9882 4925 -313146 -131445 -87172 448512 108661 -189077 213833 -95048 95776 -102602 85066
9870 -65872 -412029 -237535 -248526 198355 -157659 -286439 -2350 -415523 -331385 -156086 -256889
9859 -256889 -27337 109298 -58099 -224830 -217152 -477724 -208190 -278030 -64873 -74361 -96296
9848 -96296 109188 295528 160184 -267491 -151582 71948 148203 23903 111205 -141463 -172072
9837 -172072 -3551 -270814 -76525 -269639 -77311 -89291 -103003 -143951 23457 -35521 10584
$$ packed form
9916b54843B16580b10220P0964L2702j79186J01964O843D5679J20267J21685c16782
9904g7507L0560k6989J7654j8921A78278c56706B96124F4955a768k71150K7551
9893b45367A03029j4318J34943E1262f56601A01345a70059A8552a63216I4762
9882D925c13146a31445M4273D48512A08661a89077B13833i5048I5776a02602H5066
9870f5872l46157J74494j0991A98355a57659j28780b350m13173Q4138a56086j00803
9859b56889b7337A09298e8099j66731P678k60572b08190o9840f4873r488k1935
9848i6296A09188J86340j35344b67491J15909G1948P6255B3903Q7302a41463l0609
9837a72072c551k67263g6525j93114g7311j1980j3712m0948B3457c5521A0584
$$ plain form
9825 97865 -68610 135424 156196 73760 -60217 -99724 -223460 271268 -49649 -153451 -122248
9814 -122248 -97623 -246349 99264 114730 -49399 -154809 177932 122357 -107524 -89416 -45140
9803 -45140 78768 -357716 -65247 -115794 127368 261620 151553 -237994 202255 158842 -143366
9791 -125466 -140409 -383576 -28257 -21744 -527301 -278567 -15095 52728 76684 -131290 162263
9779 195059 -329121 -16383 -293966 30373 57703 35697 -15878 -282338 -208579 -125344 62197
9767 238563 -228213 86429 -53528 -21357 339452 188795 34389 -184612 22075 -57385 -156053
9756 -156053 15344 -121179 115267 -88998 -162899 211821 291851 -69147 -141438 -209273 -458576
9745 -458576 -37273 35332 -32517 -197316 53316 -224356 -95805 -29735 106322 -213260 50941
$$ packed form
9825I7865f8610A35424K0772G3760f0217l9507j23736B71268d9649j03802L1203
9814a22248K4625j48726I9264J5466d9399j05410A77932n5575a07524J8108M4276
9803d5140G8768c57716f5247n0547A27368J34252j10067b37994B02255m3413a43366
9791a25466j4943k43167b8257O513n05557K48734a5095E2728K3956a31290A62263
9779A95059c29121a6383k77583C0373K7330k2006a5878k66460P3759Q3235F2197
9767B38563b28213H6429e3528b1357C39452j50657C4389a84612B2075e7385r8668
9756a56053A5344a21179A15267h8998p3901B11821Q0030f9147p2291o7835k49303
9745d58576c7273C5332c2517j64799E3316b24356i5805b9735A06322b13260E0941
$$ plain form
9733 -105726 8767 -15270 -14993 -45601 -216016 -87952 -174698 133151 91582 5647 117247 1436
9720 -79315 -278406 -143640 -21000 19244 127824 28662 359871 -68583 -129011 183269 -134679
9708 -242190 58470 63921 16267 -57540 275379 -69156 90120 -169081 115447 117896 -73368
9696 227158 -188882 -140428 -337691 -185708 110551 -48061 11949 -271561 -189929 135680
9685 -311570 -1889 -393958 19154 174407 -239220 -396821 -25575 -236185 114452 41204 -317004
9673 -47838 -80486 -287809 259365 186565 154242 125303 -57934 -238928 -227312 -516234 139221
9661 -133293 -211116 -378966 -10187 209766 -222542 -178855 -87006 29216 12235 -107542 -153778
9650 -153778 -246550 56322 114415 -58727 -5094 -75720 41761 -213897 -290115 -76463 -28279 97514
$$ packed form
9733a05726H767a5270K77l0608j70415h7952q6746A33151m1569E647J11600A436
9720g9315j99091J34766b1000A9244J08580B8662L31209f8583o0428A83269a34679
9708b42190E8470N451A6267e7540B75379f9156I0120a69081A15447K449g3368
9696B27158a88882M8454j97263J51983A10551d8061A1949b71561Q1632A35680
9685c11570a889l92069A9154J55253b39220j57601b5575k10610A14452D1204c17004
9673d7838l2648k07323B59365p2800l2323k8939e7934j80994J1616k88922A39221
9661a33293p7823j67850a0187B09766b22542M3687h7006B9216A2235a07542m6236
9650a53778r2772E6322N8093e8727e094p0626D1761b13897p6218g6463b8279I7514
$$ plain form
9637 58188 69448 -50450 141398 -244506 -13427 -106929 -163778 -40149 -39878 -61265 -109230 2708
9624 71407 -286964 202074 -278042 51310 32982 -44748 242217 -102044 -311880 -28544 -110496
9613 -110496 -64087 44977 417441 22104 24099 -100239 -63498 -129569 -252153 -15520 -160452
9602 -160452 -135505 165983 89857 1263 134958 -70332 35059 -215434 113910 258056 -139830
9590 -97475 -196180 -39501 122421 -74966 -33345 -49392 -53992 -165338 166795 179952 -334213
9578 -137394 34193 -157566 124699 157930 99666 -103685 -143172 27897 -79293 62310 -57691
9566 104509 -164632 247404 -239881 -107229 32840 126388 -109479 422611 63257 -41760
9555 -200124 -155914 -88680 -208105 -128015 59791 10752 30512 237811 87289 26527 -1135
$$ packed form
9637E8188J1260e0450A41398b44506a3427r3502n6849d0149K71k1387m7965B708
9624G1407b86964B02074b78042E1310j8328d4748B42217a02044k09836b8544q1952
9613a10496M6409D4977L72464B2104J995a00239L6741o6071j22584a5520j44932
9602a60452K4947A65983p6126A263J33695g0332C5059b15434A13910J44146a39830
9590i7475r8705c9501A22421g4966c3345j6047m600j11346A66795J3157c34213
9578a37394C4193a57566A24699L3231n8264a03685l9487B7897g9293F2310e7691
9566A04509a64632B47404b39881a07229C2840R3548a09479D22611F3257d1760
9555b00124M4210O7234j19425Q0090E9791A0752J9760K07299H7289B6527a135
$$ plain form
9543 225391 156707 -90550 -283932 -309339 62131 -161357 -68122 -276658 255622 -66920 130545
9531 -186814 -321155 36164 -424406 -18480 -463242 -238655 -86374 -147803 -37470 -172247 -28146
9519 789 -150309 -31205 15525 -20716 -265132 -414077 -181929 19250 -123110 -129474 130370
9507 -357166 9410 -11525 -309453 22672 87339 -78074 -44884 -49602 -112277 -21951 -258515 85550
9494 200047 -179786 -65142 -95698 -69973 18920 -85422 15427 154754 -221205 -2837 -144233
9483 -144233 -270175 157563 -167829 3615 110989 64367 92136 66151 -26209 -49229 -122932
9472 -122932 -215961 -166063 318542 -256584 5217 68271 260961 -80595 -170697 111007 -356676
9460 122611 -154083 -105037 -208461 -77641 -92874 135294 -100997 -171451 -192442 67879 -309125
$$ packed form
9543B25391o8684i0550j93382k5407F2131a61357f8122k08536B55622f6920A30545
9531a86814j34341C6164d24406a8480m44762K24587h6374o1429c7470j34777b8146
9519G89a50309c1205A5525b0716k44416j48945a81929A9250a23110o364A30370
9507c57166I410a1525k97928B2672O4667g8074L3190m718o2675b1951k36564H5550
9494B00047a79786f5142l0556K5725A8920h5422A5427J39327b21205b837j41396
9483a44233j25942A57563a67829C615J07374m6622K7769k5985b6209k3020p3703
9472a22932r3029M9898C18542b56584E217O3054J92690h0595r0102A11007c56676
9460A22611a54083M9046j03424g7641j5233A35294a00997p0454k0991F7879c09125
$$ plain form
9448 163973 -134578 -177086 -74978 -100588 -107875 -215573 -55178 -2472 23356 -98885 182402
9436 -3728 -390423 65233 -245972 317331 -218773 244994 -100826 86704 62011 -75524 -217913
9425 -217913 -224109 292201 -205182 -48393 -251376 170411 -66588 -296052 -28458 -254612 -196555
9414 -196555 -296690 246542 -201176 -151287 87202 125189 -203762 -236814 295497 -147470
9403 -226807 -145275 -24947 134651 143353 -31225 -256867 -317134 -144335 -21175 -223976 -192349
9392 -192349 179775 -165728 -150870 -302472 -2355 -204605 173939 -190083 -90370 -118326 -164927
9381 -164927 -61636 -283547 -265202 120565 -266870 -99970 176254 -347897 -17087 36885 -197743
9369 -34896 69504 -336259 -189234 -124619 209568 42467 -61546 -8768 -169322 -109050 277211
$$ packed form
9448A63973a34578m2508g4978k5610p287j07698e5178b472B3356i8885A82402
9436c728l86695F5233b45972C17331b18773B44994a00826H6704k4693g5524j42389
9425b17913o196B92201b05182d8393k02983A70411f6588k29464b8458k26154N8057
9414a96555j00135B46542b01176M9889H7202L7987b03762l3052B95497a47470
9403b26807Q1532b4947A34651Q702c1225k25642o0267a44335b1175k02801L1627
9392a92349A79775a65728J4858j51602b355k02250A73939a90083i0370k7956m6601
9381a64927f1636k21911J8345A20565b66870i9970A76254c47897a7087C6885a97743
9369c4896F9504c36259J47025O4615B09568D2467f1546h768j60554O0272B77211
$$ plain form
9357 93418 96200 141338 81533 -180459 -42080 -12071 -33755 -167610 99252 -231140 862 -119287
9344 103438 -230927 -67984 -224378 264839 -224546 -126748 -295766 -102098 58402 93645
9334 93645 -82336 -19452 -308933 -206545 9812 20539 -292781 -85752 224419 -83679 126585
9322 -230090 3319 -58318 -253497 -126331 -77170 83163 2011 10417 -26608 284513 -92825 -446424
9310 -446424 4200 45980 -411951 -323285 132394 -150427 -336722 30465 -57293 -100696 -159616
9299 -159616 -262107 37644 -111167 69443 232426 73765 -181881 -6447 -91035 93863 97167
9288 97167 26748 -112006 -32246 -92653 -131893 -275355 208749 28663 196697 9755 90058
9277 90058 194558 -224085 -274977 -99473 116753 131112 -45815 -64173 224960 -26185 -177973
$$ packed form
9357I3418K782M5138n9805a80459d2080a2071k1684j33855I9252b31140H62a19287
9344A03438b30927f7984j56394B64839b24546R7798j69018a02098E8402L5243
9334I3645h2336a9452k89481J02388I812J0727b92781h5752B24419h3679A26585
9322b30090C319e8318j95179a26331M9161H3163B011Q406b6608B84513i2825l53599
9310d46424D200M1780d11951Q8666A32394a50427j86295C0465e7293m3403n8920
9299a59616j02491C7644a11167F9443J62983G3765a81881f447q4588I3863L304
9288I7167B6748a12006c2246o0407l9240j43462B08749B8663J68034I755Q0303
9277I0058J04500b24085n0892i9473A16753J4359d5815j8358B24960b6185j51788
$$ plain form
9266 -177973 -180299 -128844 140867 -42712 -61405 473163 19607 -176521 242574 -128885 -74424
9255 -74424 385155 -129421 39088 -440005 27645 -230601 55015 20281 -27802 -113524 -187972
9244 -187972 -166939 -220670 128095 -290160 -84919 -37201 -163372 204746 -204585 -23070 382186
9232 180625 21278 44573 122466 98832 -1580 -139284 -411304 22566 -258369 -44443 -185284
9221 -185284 116222 -225450 -133350 -39773 81982 -223134 -472093 -374912 149628 104664 32769
9209 -120605 -125095 312666 19262 -110125 -221399 -136776 444203 -218805 -225953 156779 3202
9197 -107096 -212324 35018 100448 -437587 -179895 -57228 -140237 37569 -256360 -142628 223044
9185 -82175 -58141 54440 -81495 -28034 -85189 -430446 -209087 12828 -152852 -173489 182272
$$ packed form
9266a77973k326N1455A40867d2712j8693D73163A9607a76521B42574a28885N4461
9255g4424C85155a29421C9088d40005B7645b30601E5015B0281b7802q5722p4448
9244a87972K1033n3731A28095b90160h4919c7201j26171B04746b04585b3070C82186
9232A80625B1278K3295P7893k3634a580j37704k72020B2566b58369d4443j40841
9221a85284A16222b25450R2100c9773H1982b23134k48959R7181A49628m4964C2769
9209a20605m490C12666A9262a10125j11274Q4623D44203b18805p148A56779C202
9197a07096j05228C5018O5430d37587a79895e7228q3009C7569b56360J13732B23044
9185h2175K4034E4440h1495b8034n7155l45257b09087A2828a52852k0637A82272
$$ plain form
9173 -11321 176219 -115098 3449 22158 -33287 233319 -81849 222928 -142149 -247748 6339
9161 176544 -290886 13659 -27781 138783 -112187 -94490 56774 65224 452303 89463 -65322
9149 85080 -5394 1365 -251489 -153032 -290804 143874 23861 76357 95562 -224980 -234686 -216573
9137 -216573 94462 -32830 -54700 206468 232431 17442 47539 -115227 -128371 -367239 -127738
9125 90110 -36549 64397 -66154 -63820 108667 -260680 -87187 32530 -82057 -186117 -102550
9114 -102550 -144102 35142 -396758 20857 87241 326507 -202035 16537 -217871 -258382 -220925
9103 -220925 -101808 -110518 131579 154864 42309 107816 45108 -99189 119678 176874 -48438
9091 -312471 -98871 43939 -142243 -219626 -5926 -194245 -352820 -111805 18924 251365 -29608
$$ packed form
9173a1321A76219a15098C449J8709c3287B33319h1849B22928a42149j05599F339
9161A76544b90886A3659b7781A38783a12187J7697E6774Q450L87079H9463f5322
9149H5080e394A365b51489R8457j37772A43874B3861N2496J9205b24980r706J8113
9137b16573I4462c2830k1870B06468K5963A7442L0097a15227j3144k38868a27738
9125I0110c6549F4397f6154K334A08667b60680h7187C2530h2057j04060Q3567
9114a02550m1552C5142c96758B0857O6384K39266b02035A6537b17871m0511L7457
9103b20925a01808q710A31579K3285D2309O5507D5108i9189A19678N7196d8438
9091c12471i8871D3939a42243p7383e926j88319j58575a11805A8924K32441b9608
$$ plain form
9079 -253291 -18455 -36389 -102831 113366 -100544 -384916 -179205 -111421 -378493 58459 62943
9068 62943 29058 36276 -80853 52663 -129831 -4496 -247827 -383769 -182950 16730 -67971
9056 163159 100016 46286 111350 19903 102546 -397832 -158922 17239 -106541 240673 71909
9044 -369553 -85079 -143057 -195169 -40629 109804 -154990 152475 61328 -154555 203960 227643
9033 227643 -187216 15745 68123 -287554 -354617 135908 319549 -88713 -45341 -361790 -61213
9021 -52485 -101242 -373364 -12142 65971 -122804 -10292 141117 -107895 181110 -320903 97881
9009 153323 134709 -19312 -123775 -267836 -188614 198458 -321805 -110701 2393 -204794 211429
8997 68667 -126693 -100421 30613 -61454 -39172 -149062 -179011 36886 69244 -10422 76410
$$ packed form
9079b53291a8455j7934o6442A13366a00544k84372a79205O7784k67072E8459M484
9068F2943B9058P218h0853E2663a29831d496k43331j35942a82950A6730f7971
9056A63159o3143D6286O5064A9903Q2643c97832a58922A7239a06541B40673G1909
9044c69553h5079n7978n2112d0629A09804a54990A52475F1328a54555B03960K3683
9033B27643a87216A5745N2378b87554o7063A35908J83641h8713M3372l16449f1213
9021e2485m8757k72122a2142F5971a22804a0292A41117a07895A81110c20903I7881
9009A53323j8614a9312j04463j44061P9222A98458c21805a10701B393b04794B11429
8997F8667a26693K6272C0613f1454K2282j09890k9949C6886L2358a0422G6410
$$ plain form
8985 115682 175192 -218865 -153690 -48805 -12009 -255114 339907 -485670 -22955 -147374 172910
8973 -4075 164905 -181405 86300 -186745 -129893 -76071 -10432 -231510 -346612 161671 -107153
8961 -356897 -51713 179732 -224701 -72710 55472 41995 -135494 -96325 -75209 -63507 156001
8949 9483 -165275 -112324 5138 -151520 -199181 -47485 -31949 -112783 251458 212091 -126515
8937 -84534 45699 116974 -290100 -126370 175661 11598 71004 -101176 -251998 67629 109145
8926 109145 -281471 -63824 90959 264512 444303 643967 201018 41444 19212 9830 -131569
8914 6625 10614 -61038 -88697 -56297 485510 174262 262834 28008 -175300 186047 -360312
8902 -51981 -132331 32032 59986 -148940 188029 -162272 -46531 -145283 -169253 -96668 -32865
$$ packed form
8985A15682N9510b18865O5175d8805a2009k43105C39907d85670b2955j24419A72910
8973d075A64905a81405H6300a86745N6852N3822a0432k21078j15102A61671a07153
8961c56897e1713A79732b24701g2710E5472j3477a35494L9169K1116J1702A56001
8949I483a65275N2951E138a51520m7661d7485J5536q0834B51458l9367a26515
8937h4534D5699P1275b90100a26370A75661A1598N9406a01176j50822F7629M1516
8926A09145b81471f3824I0959J73553J79791J99664B01018D1444A9212r382a31569
8914F625L989f1038k7659L2400D85510A74262Q8572B8008a75300A86047c60312
8902e1981q0350C2032K7954a48940A88029a62272d6531r8752k3970P2585c2865
$$ plain form
8890 -320204 -54282 200772 86924 -158744 98013 -21645 -19441 214744 -274812 76329 -210929
8878 206684 467640 -270281 195743 -18653 -157306 135811 -59624 -199756 170783 222735
8868 222735 -119697 -12418 -22524 99307 11075 -213152 145493 18901 6953 3169 6986 -194900
8855 -99735 -133464 -91759 132235 -221427 -348585 85029 111762 -335982 71743 -219637 -43650
8843 35177 -278520 146509 65725 -217287 81557 -116480 14949 -111740 -235874 -12449 -276000
$$ packed form
8890c20204e4282B00772H6924a58744I8013b1645K204B14744b74812G6329b10929
8878B06684K60956b70281A95743a8653j38653A35811e9624j40132A70783N1952
8868B22735a19697a2418j0106I9307A1075b13152A45493A8901F953C169L817a94900
8855i9735l3729M1705A32235b21427j27158H5029K6733c35982G1743b19637d3650
8843C5177b78520A46509F5725b17287H1557a16480A4949a11740j24134a2449k63551
$$ [...]
##END NTUPLES=NMR SPECTRUM
##END=
