##TITLE=AC1464_TOLI813270_8026490_rph5gjRkHF
##JCAMPDX= 6.0         $$ Bruker NMR JCAMP-DX V2.0
##DATA TYPE= NMR SPECTRUM
##DATA CLASS= NTUPLES
##ORIGIN= BRUKER
##OWNER= Administrator
$$ 1.72 TOPSPIN		Version 2.1
$$ 2013-07-11 19:40:54.299 -0700  Administrator@X
$$ Compression mode = diff/dup
##.OBSERVE FREQUENCY= 400.02188249412
##.OBSERVE NUCLEUS= ^1H
##.ACQUISITION MODE= SIMULTANEOUS (DQD)
##.ACQUISITION SCHEME= undefined
##.AVERAGES= 64
##.DIGITISER RES= 22
##SPECTROMETER/DATA SYSTEM= spect
##.PULSE SEQUENCE= noesygpps1d.comp
##.SOLVENT NAME= COFFEE_meoh
##.SHIFT REFERENCE= INTERNAL, COFFEE_meoh, 1, 14.96083
##AUDIT TRAIL= $$ (NUMBER, WHEN, WHO, WHERE, PROCESS, VERSION, WHAT)
$$ ##TITLE= Audit trail, TOPSPIN		Version 2.1
$$ ##JCAMPDX= 5.01
$$ ##ORIGIN= Bruker BioSpin GmbH
$$ ##OWNER= Administrator
$$ $$ E:\/data/COFFEE/nmr/AC1464_TOLI813270_8026490_rph5gjRkHF/12/pdata/1/auditp.txt
$$ ##AUDIT TRAIL=  $$ (NUMBER, WHEN, WHO, WHERE, PROCESS, VERSION, WHAT)
(   1,<2013-07-11 19:40:49.377 -0700>,<Administrator>,<X>,<go>,<TOPSPIN 2.1>,
      <created by zg
	started at 2013-07-11 19:29:19.893 -0700,
	POWCHK enabled, PULCHK disabled,
       configuration hash MD5:
       C8 4E 4E 5D D3 5C D8 9E 9F 52 82 E0 59 8A DE 15
       data hash MD5: 64K
       CB F9 FF CE 4B D7 36 4F E3 5D 6F 41 58 F4 84 44>)
(   2,<2013-07-11 19:40:52.314 -0700>,<Administrator>,<X>,<proc1d>,<TOPSPIN 2.1>,
      <Start of raw data processing
       efp LB = 0.3 FT_mod = 6 PKNL = 1 PHC0 = 0 PHC1 = 0 SI = 128K 
       data hash MD5: 128K
       DA B8 45 BF 94 E6 8A 86 F3 FD 0E F1 D2 A5 88 FD>)
(   3,<2013-07-11 19:40:53.268 -0700>,<Administrator>,<X>,<proc1d>,<TOPSPIN 2.1>,
      <pk PHC0 = -79.54651 PHC1 = 0 
       data hash MD5: 128K
       4E 9B B6 2D 66 DB 7D E0 54 7B 26 D3 B8 5C EC 86>)
(   4,<2013-07-11 19:40:53.689 -0700>,<Administrator>,<X>,<proc1d>,<TOPSPIN 2.1>,
      <abs ABSG = 1 
       data hash MD5: 128K
       66 9F 6D 3C 32 DB D9 19 5A B7 D8 6A AC B4 63 75>)
(   5,<2013-07-11 19:40:53.814 -0700>,<Administrator>,<X>,<proc1d>,<TOPSPIN 2.1>,
      <abs ABSG = 2 
       data hash MD5: 128K
       E6 E4 90 25 B4 FE F0 A4 BD E9 83 CE A4 69 62 DE>)
(   6,<2013-07-11 19:40:53.924 -0700>,<Administrator>,<X>,<proc1d>,<TOPSPIN 2.1>,
      <abs ABSG = 3 
       data hash MD5: 128K
       B4 FD 00 E1 19 A8 C6 74 05 0A EB 06 89 F3 D6 5B>)
(   7,<2013-07-11 19:40:54.033 -0700>,<Administrator>,<X>,<proc1d>,<TOPSPIN 2.1>,
      <abs ABSG = 4 
       data hash MD5: 128K
       2F BB 3D BB A2 C9 8C AE 6E 14 9D 80 7B 97 BF C7>)
(   8,<2013-07-11 19:40:54.143 -0700>,<Administrator>,<X>,<proc1d>,<TOPSPIN 2.1>,
      <abs ABSG = 5 
       data hash MD5: 128K
       12 E2 8E 61 0F 63 18 98 73 77 74 83 D9 B1 59 CB>)
$$ ##END=
$$ 
$$ $$ hash MD5
$$ $$ C4 5E 5F B7 F3 0F 9D 0E 57 A8 01 2A 80 4E 0B D3
##$RELAX= 
##$RELAX= 
##$RELAX= 
##$RELAX= 
##$RELAX= 
##$RELAX= 
##$RELAX= 
##$RELAX= 
$$ Bruker specific parameters
$$ --------------------------
##$DU= <E:\>
##$EXPNO= 12
$$ [...]
##$TP07= 0
##$TPNAME0= <>
##$TPNAME1= <>
##$TPNAME2= <>
##$TPNAME3= <>
##$TPNAME4= <>
##$TPNAME5= <>
##$TPNAME6= <>
##$TPNAME7= <>
##$TPOAL= (0..7)
0.5 0.5 0.5 0.5 0.5 0.5 0.5 0.5
##$TPOFFS= (0..7)
0 0 0 0 0 0 0 0
##$TUNHIN= 0
##$TUNHOUT= 0
##$TUNXOUT= 0
##$USERA1= <user>
##$USERA2= <user>
##$USERA3= <user>
##$USERA4= <user>
##$USERA5= <user>
##$V9= 5
##$VALIST= <valist>
##$VCLIST= <CCCCCCCCCCCCCCC>
##$VD= 0
##$VDLIST= <DDDDDDDDDDDDDDD>
##$VPLIST= <PPPPPPPPPPPPPPP>
##$VTLIST= <TTTTTTTTTTTTTTT>
##$WBST= 1024
##$WBSW= 4
##$XGAIN= (0..3)
0 0 0 0
##$XL= 0
##$YL= 0
##$YMAX_a= 6518558
##$YMIN_a= -12711601
##$ZGOPTNS= <>
##$ZL1= 120
##$ZL2= 120
##$ZL3= 120
##$ZL4= 120
##$ABSF1= 14.96083
##$ABSF2= -5.597352
##$ABSG= 5
##$ABSL= 3
##$ALPHA= 0
##$AQORDER= 0
##$ASSFAC= 0
##$ASSFACI= 0
##$ASSFACX= 0
##$ASSWID= 0
##$AUNMP= <proc_prof1d_extract.lims>
##$AXLEFT= 0
##$AXNAME= <>
##$AXNUC= <1H>
##$AXRIGHT= 0
##$AXTYPE= 0
##$AXUNIT= <>
##$AZFE= 0.1
##$AZFW= 0.1
##$BCFW= 0
##$BC_mod= 0
##$BYTORDP= 0
##$COROFFS= 0
##$CY= 15
##$DATMOD= 1
##$DC= 0
##$DFILT= <>
##$DTYPP= 0
##$F1P= 0
##$F2P= 0
##$FCOR= 0.5
##$FTSIZE= 131072
##$FT_mod= 6
##$GAMMA= 0
##$GB= 0
##$INTBC= 1
##$INTSCL= 1
##$ISEN= 128
##$LB= 0.3
##$LEV0= 0
##$LPBIN= 0
##$MAXI= 10000
##$MC2= 0
##$MEAN= 0
##$ME_mod= 0
##$MI= 0
##$NCOEF= 0
##$NC_proc= -2
##$NLEV= 6
##$NOISF1= 0
##$NOISF2= 0
##$NSP= 0
##$NTH_PI= 0
##$NZP= 0
##$OFFSET= 14.96083
##$PC= 1
##$PHC0= -79.54651
##$PHC1= 0
##$PH_mod= 1
##$PKNL= yes
##$PPARMOD= 0
##$PPDIAG= 0
##$PPIPTYP= 0
##$PPMPNUM= 2147483647
##$PPRESOL= 1
##$PSCAL= 4
##$PSIGN= 0
##$PYNMP= <proc.py>
##$REVERSE= no
##$SF= 400.020009704377
##$SI= 131072
##$SIGF1= 0
##$SIGF2= 0
##$SINO= 400
##$SIOLD= 131072
##$SPECTYP= <>
##$SREGLST= <1H.CDCl3>
##$SSB= 0
##$STSI= 131072
##$STSR= 0
##$SW_p= 8223.68421052631
##$SYMM= 0
##$S_DEV= 0
##$TDeff= 65536
##$TDoff= 0
##$TI= <>
##$TILT= no
##$TM1= 0
##$TM2= 0
##$TOPLEV= 0
##$USERP1= <user>
##$USERP2= <user>
##$USERP3= <user>
##$USERP4= <user>
##$USERP5= <user>
##$WDW= 1
##$XDIM= 131072
##$YMAX_p= 387745005
##$YMIN_p= -11367
##$CURPLOT= <Network HP LaserJet P1505>
##$CURPRIN= <$Network HP LaserJet P1505>
##$DFORMAT= <normdp>
##$LAYOUT= <+/1D_H.xwp>
##$LFORMAT= <normlp>
##$PFORMAT= <normpl>
##$SURQMSG= 1
$$ End of Bruker specific parameters
$$ ---------------------------------
##NTUPLES= NMR SPECTRUM
##VAR_NAME=  FREQUENCY,     SPECTRUM/REAL,   SPECTRUM/IMAG
##SYMBOL=    X,             R,               I
##VAR_TYPE=  INDEPENDENT,   DEPENDENT,       DEPENDENT
##VAR_FORM=  AFFN,          ASDF,            ASDF
##VAR_DIM=   131072,        131072,          131072
##UNITS=     HZ,            ARBITRARY UNITS, ARBITRARY UNITS
##FACTOR=    0.0627417313425164, 1,          1
##FIRST=     8223.62146879497, -406,         -58287
##LAST=      0,             1415,            -58935
##MIN=       0,             -11367,          0
##MAX=       8223.62146879497, 387745005,    0
$$ Real data points
##PAGE= N=1
##DATA TABLE= (X++(R..R)), XYDATA
$$ [...]
$$ plain form
63919 3256990 3110446 2951611 2785072 2614609 2443172 2273272 2107119 1946709 1794126
63910 1794126 1651499 1520379 1401237 1293726 1197296 1111505 1035920 969891 912341 861851
63900 861851 817162 777640 742987 712512 685061 659718 636092 613811 592195 570879 550417
63889 550417 531874 515968 502818 492131 483289 475563 468739 463406 460270 459425 460641 463977 469501
63876 469501 476727 485094 494924 507039 521393 536915 552968 570123 589015 609118 629307 649135
63864 649135 668911 688851 708740 728202 746652 763125 776798 787716 796494 803331 807753 809285
63852 809285 807744 802830 794087 781619 766380 749413 731119 711572 691084 670017 648273 625504
63840 625504 601730 577410 553049 529171 506504 485549 465849 446286 426533 407793 391624
$$ packed form
63919C256990j46544j58835j66539j70463j71437j69900j66153j60410j52583
63910A794126j42627j31120j19142j07511r6430q5791p5585o6029n7550n0490
63900H61851m4689l9522l4653l0475k7451k5343k3626k2281k1616k1316k0462
63889E50417j8543j5906j3150j0687q842p726o824n333l136q45J216L336N524
63876D69501P226Q367R830J2115J4354J5522J6053J7155J8892K0103K0189J9828
63864F49135J9776J9940J9889J9462J8450J6473J3673J0918Q778O837M422J532
63852H09285j541m914q743j2468j5239j6967j8294j9547k0488k1067k1744k2769
63840F25504k3774k4320k4361k3878k2667k0955j9700j9563j9753j8740j6169
$$ plain form
63829 391624 378235 366434 355162 344489 334947 326422 318172 309720 301238 293034 285113 277446 270346
63816 270346 264221 259039 254367 249975 246086 242872 240008 237015 234023 231853 231210 231900 232900 233098 232011
63801 232011 230008 227935 226347 224982 223107 220455 217601 215238 213368 211519 209558 207821 206530 205566
63787 205566 204852 204420 203918 202617 200329 197945 196606 196484 196742 196483 195442 193958 192740 192497 193331 194532
63771 194532 195346 195870 196748 198147 199576 200727 201831 203001 203768 203619 202579 201029 199329 197870 197086 197028
63755 197028 197250 197376 197547 198056 198914 200011 201334 202637 203357 203341 203309 204065 205527 207068 208489 210008 211572
63738 211572 212996 214683 217369 221006 224640 227563 229973 232304 234659 237187 240328 244123 247867 250995
63724 250995 253975 257777 262769 268573 274766 281147 287455 293331 298524 302821 305896 307568 308075 307725 306471
$$ packed form
63829C91624j3389j1801j1272j0673r542q525q250q452q482q204p921p667p100
63816B70346o125n182m672m392l889l214k864k993k992k170o43O90J000J98j087
63801B32011k003k073j588j365j875k652k854k363j870j849j961j737j291r64
63787B05566p14m32n02j301k288k384j339j22K58k59j041j484j218k43Q34J201
63771A94532Q14N24Q78J399J429J151J104J170P67j49j040j550j700j459p84n8
63755A97028K22J26J71N09Q58J097J323J303P20j6l2P56J462J541J421J519J564
63738B11572J424J687K686L637L634K923K410K331K355K528L141L795L744L128
63724B50995K980L802M992N804O193O381O308N876N193M297L075J672N07l50j254
$$ plain form
63709 306471 304189 301193 297993 294694 291179 287790 285176 283365 281527 278954 275875 273130 271440 271150
63695 271150 272194 273951 275518 276506 277387 278703 280289 281662 282853 284256 285796 286969 287816 289156 291482
63680 291482 294104 295851 296350 296146 295810 295499 295371 295821 297081 298978 301306 304105 307318 310494 313222 315669
63664 315669 318353 321506 324933 328258 330872 331861 330691 328011 325133 322497 319218 314494 308828 303336
63650 303336 298344 293385 288323 283692 279947 277040 274905 273729 273490 273721 274041 274530 275332 276262 277267 278958
63634 278958 282202 287128 292903 298523 303615 308440 313393 318666 324341 330648 338012 346757 356798 367771
63620 367771 379531 392385 406765 422813 440389 459381 479852 501967 525898 551729 579380
63609 579380 608674 639584 672265 706700 742347 778252 813268 845980 874606 897532 914158
$$ packed form
63709C06471k282k996l200l299l515l389k614j811j838k573l079k745j690k90
63695B71150J044J757J567R88Q81J316J586J373J191J403J540J173Q47J340K326
63680B91482K622J747M99k04l36l11j28M50J260J897K328K799L213L176K728K447
63664C15669K684L153L427L325K614R89j170k680k878k636l279m724n666n492
63650C03336m992m959n062m631l745k907k135j176k39K31L20M89Q02R30J005J691
63634B78958L244M926N775N620N092M825M953N273N675O307P364Q745J0041J0973
63620C67771J1760J2854J4380J6048J7576J8992K0471K2115K3931K5831K7651
63609E79380K9294L0910L2681L4435L5647L5905L5016L2712K8626K2926J6626
$$ plain form
63598 914158 925015 930895 932140 928943 922104 913022 902938 892383 881405 869893 857430 843108
63586 843108 825977 805845 783476 759916 735731 710895 685239 658949 632822 608072 585740
63575 585740 566136 548990 534160 521881 512252 504880 499406 496047 495155 496434 499205 503379 509517
63562 509517 517754 527235 536971 546879 557674 570045 584267 600322 617962 636840 656984 679103
63550 679103 704162 732712 764823 800439 839384 881053 924405 968174 1010721 1049574 1081587
63539 1081587 1104047 1115870 1117919 1112313 1101473 1087585 1072568 1058050 1044974 1033196 1021842 1010150
63527 1010150 997736 983987 967738 947894 924097 896484 865197 830644 794011 756876 720353
63516 720353 685042 651679 621091 593382 567800 543717 521319 501046 482730 465748 449791
$$ packed form
63598I14158J0857N880J245l197o839r082j0084j0555j0978j1512j2463j4322
63586H43108j7131k0132k2369k3560k4185k4836k5656k6290k6127k4750k2332
63575E85740j9604j7146j4830j2279r629p372n474l359q92J279K771M174O138
63562E09517Q237R481R736R908J0795J2371J4222J6055J7640J8878K0144K2119
63550F79103K5059K8550L2111L5616L8945M1669M3352M3769M2547L8853L2013
63539A081587K2460J1823K049n606j0840j3888j5017j4518j3076j1778j1354j1692
63527A010150j2414j3749j6249j9844k3797k7613l1287l4553l6633l7135l6523
63516G20353l5311l3363l0588k7709k5582k4083k2398k0273j8316j6982j5957
$$ plain form
63505 449791 435160 422316 411369 401963 393583 385984 379310 373705 368924 364544 360482 356968 354043
63492 354043 351447 349063 347086 345698 344908 344792 345451 346593 347611 348323 349229 350858 353303 356646 361234
63477 361234 366997 372952 378081 382495 387096 392140 396739 399813 400966 400339 398143 394658 390358 385683
63463 385683 380765 375561 370217 365140 360697 356888 353334 349698 346148 343313 341762 341601 342568 344334 346704
63448 346704 349819 354267 360687 369122 379035 390078 402404 416102 430908 446955 465268 486883
63436 486883 511803 539470 569860 603197 638633 674032 707150 736385 760442 778347 790329
63425 790329 798031 803375 807633 811947 818112 828175 843458 864345 890727 922142 957613 995804
63413 995804 1035329 1074780 1112585 1147080 1176596 1199492 1214526 1221566 1221674 1216280 1206489 1193363
$$ packed form
63505D49791j4631j2844j0947r406q380p599o674n605m781m380m062l514k925
63492C54043k596k384j977j388p90j16O59J142J018P12R06J629K445L343M588
63477C61234N763N955N129M414M601N044M599L074J153o27k196l485m300m675
63463C85683m918n204n344n077m443l809l554l636l550k835j551j61R67J766K370
63448C46704L115M448O420Q435R913J1043J2326J3698J4806J6047J8313K1615
63436D86883K4920K7667L0390L3337L5436L5399L3118K9235K4057J7905J1982
63425G90329P702N344M258M314O165J0063J5283K0887K6382L1415L5471L8191
63413I95804L9525L9451L7805L4495K9516K2896J5034P040J08n394r791j3126
$$ plain form
63401 1193363 1178313 1162599 1146535 1129556 1110899 1089832 1065513 1037283 1005221 970116 932886
63390 932886 894326 855341 816970 780080 745247 712911 683314 656268 631343 608417 587906
63379 587906 570454 556622 546699 540420 536798 534644 533495 533875 536582 541895 549524 559033 570177 582997
63365 582997 597813 615051 634981 657598 682730 710138 739627 771266 805513 842809 882951
63354 882951 924950 967542 1009594 1050006 1087450 1120394 1147313 1166909 1178476 1182326 1179793 1172631
63342 1172631 1162347 1149957 1136121 1121284 1105720 1089505 1072366 1053518 1031839 1006452 977219
63331 977219 944723 909880 873705 837343 802116 769265 739525 712973 689453 669219 652961
63320 652961 641059 632859 626854 621447 615292 607028 595154 578577 557386 533072 507962 484168
$$ packed form
63401A193363j5050j5714j6064j6979j8657k1067k4319k8230l2062l5105l7230
63390I32886l8560l8985l8371l6890l4833l2336k9597k7046k4925k2926k0511
63379E87906j7452j3832r923o279l622k154j149L80K707N313P629R509J1144J2820
63365E82997J4816J7238J9930K2617K5132K7408K9489L1639L4247L7296M0142
63354H82951M1999M2592M2052M0412L7444L2944K6919J9596J1567L850k533p162
63342A172631j0284j2390j3836j4837j5564j6215j7139j8848k1679k5387k9233
63331I77219l2496l4843l6175l6362l5227l2851k9740k6552k3520k0234j6258
63320F52961j1902q200o005n407o155q264j1874j6577k1191k4314k5110k3794
$$ plain form
63308 484168 462775 443881 427401 413597 402635 393882 386125 378544 371144 364243 357994 352481 347773
63295 347773 343565 339185 334366 329748 326178 323628 321161 317955 314030 310106 307021 305244 304491 303745 301968
63280 301968 299007 295713 293121 291609 290826 290179 289284 288132 287055 286522 286823 287853 289113 289941 289893 289080
63264 289080 288160 287909 288736 290527 292795 294960 296745 298496 300984 304657 309128 313619 317799 321927 326215
63249 326215 330455 334454 338601 343707 350310 358274 367113 376601 386942 398261 410113 421844 433614
63236 433614 446683 462278 480262 499408 518915 539124 560597 583084 605816 628407 650911
63225 650911 673149 694594 715052 735059 755462 776804 799116 821991 844731 866719 887803
63214 887803 908126 927330 944171 957196 965764 970122 970543 966704 958056 944529 926602 904799 879454
$$ packed form
63308D84168k1393j8894j6480j3804j0962q753p757p581p400o901o249n513m708
63295C47773m208m380m819m618l570k550k467l206l925l924l085j777p53p46j777
63280C01968k961l294k592j512p83o47q95j152j077n33L01J030J260Q28m8q13
63264B89080r20k51Q27J791K268K165J785J751K488L673M471M491M180M128M288
63249C26215M240L999M147N106O603P964Q839R488J0341J1319J1852J1731J1770
63236D33614J3069J5595J7984J9146J9507K0209K1473K2487K2732K2591K2504
63225F50911K2238K1445K0458K0007K0403K1342K2312K2875K2740K1988K1084
63214H87803K0323J9204J6841J3025Q568M358M21l839q648j3527j7927k1803k5345
$$ plain form
63201 879454 851133 821048 790783 761563 733927 708131 684648 664090 646764 632553 621301
63190 621301 613099 608082 606087 606703 609633 614785 622044 631160 641948 654387 668355 683356 698772
63177 698772 714346 730220 746440 762659 778428 793616 808368 822756 836604 849494 860749
63166 860749 869546 875322 878127 878333 875972 870527 861365 848097 830537 808743 783414 755978 727868
63153 727868 699715 671500 643392 616132 590583 567222 546178 527435 510795 495794 481956
63142 481956 469155 457626 447616 439157 432131 426404 421784 417890 414284 410807 407729 405382 403656
63129 403656 402011 400040 397826 395678 393786 392371 391915 392788 394674 396761 398635 400681 403460 406962 410668
63114 410668 414141 417317 420337 423269 425927 427967 429270 430300 431834 434214 437024 439594 441575 442939
$$ packed form
63201H79454k8321l0085l0265k9220k7636k5796k3483k0558j7326j4211j1252
63190F21301q202n017j995O16K930N152P259R116J0788J2439J3968J5001J5416
63177F98772J5574J5874J6220J6219J5769J5188J4752J4388J3848J2890J1255
63166H60749Q797N776K805K06k361n445r162j3268j7560k1794k5329k7436k8110
63153G27868k8153k8215k8108k7260k5549k3361k1044j8743j6640j5001j3838
63142D81956j2801j1529j0010q459p026n727m620l894l606l477l078k347j726
63129D03656j645j971k214k148j892j415m56Q73J886K087J874K046K779L502L706
63114D10668L473L176L020K932K658K040J303J030J534K380K810K570J981J364
$$ plain form
63100 442939 443797 444490 445552 447178 448882 449969 450245 449971 449401 448754 448433 448742 449429 450017 450493 451206 452118
63083 452118 452833 453444 454678 456895 459569 462158 464949 468604 473319 478970 485610 493151 500824 507805 514357
63068 514357 521684 530576 540822 552106 564768 579272 595431 612719 631101 651115 673277 697855
63056 697855 725181 755741 789719 826680 865913 907051 950310 996198 1044999 1096411 1149517
63045 1149517 1203205 1256802 1310332 1364052 1417687 1470345 1521377 1571201 1620997 1671507 1722361
63034 1722361 1772637 1821739 1869433 1915077 1957199 1993932 2023724 2045510 2058319 2060983 2052436 2032330
63022 2032330 2001268 1960376 1910827 1853889 1791259 1724995 1657085 1589371 1523836 1462465 1406490
63011 1406490 1356033 1310753 1270664 1236125 1207400 1184651 1168163 1158125 1154229 1155821 1162385 1173580
$$ packed form
63100D42939Q58O93J062J626J704J087K76k74n70o47l21L09O87N88M76P13R12
63083D52118P15O11J234K217K674K589K791L655M715N651O640P541P673O981O552
63068E14357P327Q892J0246J1284J2662J4504J6159J7288J8382K0014K2162K4578
63056F97855K7326L0560L3978L6961L9233M1138M3259M5888M8801N1412N3106
63045A149517N3688N3597N3530N3720N3635N2658N1032M9824M9796N0510N0854
63034A722361N0276M9102M7694M5644M2122L6733K9792K1786J2809K664q547k0106
63022B032330l1062m0892m9549n6938o2630o6264o7910o7714o5535o1371n5975
63011A406490n0457m5280m0089l4539k8725k2749j6488j0038l896J592O564J1195
$$ plain form
62999 1173580 1188902 1207702 1229467 1253718 1279736 1306870 1334969 1363956 1392974 1420740 1446971
62988 1446971 1472749 1498939 1524701 1548089 1567735 1583336 1594771 1601431 1602448 1597010 1584346 1563892
62976 1563892 1535735 1500650 1459510 1412891 1361422 1306374 1249631 1193072 1138012 1085154 1034909
62965 1034909 987596 943361 902063 863547 828052 796046 767510 741575 717092 693424 670568
62954 670568 648792 628482 610116 593834 578981 564533 550156 536479 524166 513009 502214
62943 502214 491276 480239 469288 458540 448240 438760 430231 422450 415328 409172 404223 400030 395660
62930 395660 390635 385384 380633 376594 372990 369661 366783 364440 362382 360259 357868 355035 351625 347938
62916 347938 344829 343030 342386 342090 341593 340925 340150 339050 337621 336455 336141 336447 336500 335778 334555 333301 332066
$$ packed form
62999A173580J5322J8800K1765K4251K6018K7134K8099K8987K9018K7766K6231
62988A446971K5778K6190K5762K3388J9646J5601J1435O660J017n438j2664k0454
62976A563892k8157l5085m1140m6619n1469n5048n6743n6559n5060n2858n0245
62965A034909m7313m4235m1298l8516l5495l2006k8536k5935k4483k3668k2856
62954F70568k1776k0310j8366j6282j4853j4448j4377j3677j2313j1157j0795
62943E02214j0938j1037j0951j0748j0300r480q529p781p122o156m949m193m370
62930C95660n025n251m751m039l604l329k878k343k058k123k391k833l410l687
62916C47938l109j799o44k96m97o68p75j100j429j166l14L06N3p22j223j254j235
$$ plain form
62899 332066 330665 329252 328367 328453 329473 330978 332456 333663 334720 335866 337120 338328 339552 341094 342892
62884 342892 344172 344145 342922 341345 340002 338965 338474 339153 341219 344026 346797 349349 351660 353283 353882
62869 353882 353962 354225 354396 353582 351753 349933 348762 347817 346766 346272 347036 348631 350121 351486 353483 356204
62853 356204 358588 359586 359283 358645 358505 358985 359649 360043 360177 360521 361445 362752 363909 364614 364953 365153 365429 365949
62835 365949 366681 367335 367753 368256 369316 370942 372716 374346 375873 377372 378869 380588 382826 385431 387776
62820 387776 389438 390628 391834 393336 395321 398129 402023 406752 411647 416157 420173 423881 427461 430978
62806 430978 434522 438382 443010 448717 455459 462977 471130 479991 489715 500483 512517 525874 540222
62793 540222 555059 570267 586387 604325 624945 648908 676623 708269 743976 784003 828657
$$ packed form
62899C32066j401j413q85Q6J020J505J478J207J057J146J254J208J224J542J798
62884C42892J280k7j223j577j343j037m91O79K066K807K771K552K311J623N99
62869C53882Q0K63J71q14j829j820j171r45j051m94P64J595J490J365J997K721
62853C56204K384R98l03o38j40M80O64L94J34L44R24J307J157P05L39K00K76N20
62835C65949P32O54M18N03J060J626J774J630J527J499J497J719K238K605K345
62820C87776J662J190J206J502J985K808L894M729M895M510M016L708L580L517
62806D30978L544L860M628N707O742P518Q153Q861R724J0768J2034J3357J4348
62793E40222J4837J5208J6120J7938K0620K3963K7715L1646L5707M0027M4654
$$ plain form
62782 828657 878096 932408 991751 1056115 1125024 1197869 1274542 1355214 1439267 1524870 1609808
62771 1609808 1692296 1770652 1842687 1905991 1958663 1999291 2026461 2038990 2036756 2020769 1992186
62760 1992186 1951616 1899603 1837488 1767478 1691941 1612903 1532099 1451206 1371791 1295044 1221627
62749 1221627 1151856 1086014 1024395 967104 914022 865087 820399 779850 742911 709131 678740
62738 678740 652311 629771 610164 592515 576561 562445 550110 539358 530177 522514 515889 509711
62726 509711 503971 499161 495507 492752 490801 490005 490526 491916 493786 496536 500914 507056 514544 523205 533208
62711 533208 544381 556212 568853 583565 601637 623235 647715 674779 704833 738414 775791
62700 775791 817142 862636 912197 965380 1021550 1080000 1139963 1200751 1261858 1322705 1382303
$$ packed form
62782H28657M9439N4312N9343O4364O8909P2845P6673Q0672Q4053Q5603Q4938
62771A609808Q2488P8356P2035O3304N2672M0628K7170J2529k234j5987k8583
62760A992186m0570n2013o2115p0010p5537p9038q0804q0893p9415p6747p3417
62749A221627o9771o5842o1619n7291n3082m8935m4688m0549l6939l3780l0391
62738F78740k6429k2540j9607j7649j5954j4116j2335j0752r181p663o625o178
62726E09711n740m810l654k755j951p96N21J390J870K750M378O142P488Q661J0003
62711E33208J1173J1831J2641J4712J8072K1598K4480K7064L0054L3581L7377
62700G75791M1351M5494M9561N3183N6170N8450N9963O0788O1107O0847N9598
$$ plain form
62689 1382303 1439314 1492258 1539371 1578450 1607374 1624923 1630898 1625515 1609090 1582237 1545855 1500818
62677 1500818 1448165 1389688 1327765 1264305 1200302 1136676 1074920 1016346 961128 908810 859538
62666 859538 814077 772661 734619 699360 667070 638088 612072 588266 566340 546506 528951
62655 528951 513587 500299 488915 478820 469082 459344 450308 442881 436920 431316 425354 419503 414558
62642 414558 410488 406700 403142 400485 399168 398857 399021 399515 400311 401146 401841 402593 403529 404268 404382 404095 403960
62625 403960 403965 403489 402181 400422 398844 397881 397875 399160 401717 405046 408599 412105 415443 418599 422017 426516
62609 426516 432484 439442 446815 454873 464360 475394 487406 500212 514498 530994 549701 570350
62597 570350 593180 618793 647418 678810 712754 749199 787846 828034 869093 910467 951265
$$ packed form
62689A382303N7011N2944M7113L9079K8924J7549N975n383j6425k6853l6382m5037
62677A500818n2653n8477o1923o3460o4003o3626o1756n8574n5218n2318m9272
62666H59538m5461m1416l8042l5259l2290k8982k6016k3806k1926j9834j7555
62655E28951j5364j3288j1384j0095r738r738r036p427n961n604n962n851m945
62642D14558m070l788l558k657j317l11J64M94P96Q35O95P52R36P39J14k87j35
62625D03960Nm76j308j759j578r63oJ285K557L329L553L506L338L156L418M499
62609D26516N968O958P373Q058R487J1034J2012J2806J4286J6496J8707K0649
62597E70350K2830K5613K8625L1392L3944L6445L8647M0188M1059M1374M0798
$$ plain form
62586 951265 989919 1024522 1053397 1075355 1089711 1096348 1095670 1088273 1074634 1055133 1030249 1000613
62574 1000613 967023 930505 892227 853256 814421 776463 740063 705589 673021 642376 614038
62563 614038 588442 565559 544947 526235 509311 494087 480333 467785 456217 445434 435369
62552 435369 426176 418120 411431 406225 402353 399197 395979 392577 389712 387967 386966 386073 385600 386463 388664
62537 388664 390948 392267 392894 393715 395007 396440 397852 399499 401703 404747 408959 414575 421583 429970 439969
62522 439969 451779 465181 479734 495344 512473 531832 553923 578775 606049 635517 667388
62511 667388 701891 738568 776345 814304 851883 888252 922138 952553 979119 1001327 1018084
62500 1018084 1028606 1033270 1032967 1028005 1018346 1004629 988196 970203 951412 932816 915770 901402
$$ packed form
62586I51265L8654L4603K8875K1958J4356O637o78p397j3639j9501k4884k9636
62574A000613l3590l6518l8278l8971l8835l7958l6400l4474l2568l0645k8338
62563F14038k5596k2883k0612j8712j6924j5224j3754j2548j1568j0783j0065
62552D35369r193q056o689n206l872l156l218l402k865j745j001q93m73Q63K201
62537C88664K284J319O27Q21J292J433J412J647K204L044M212N616P008Q387R999
62522D39969J1810J3402J4553J5610J7129J9359K2091K4852K7274K9468L1871
62511F67388L4503L6677L7777L7959L7579L6369L3886L0415K6566K2208J6757
62500A018084J0522M664l03m962r659j3717j6433j7993j8791j8596j7046j4368
$$ plain form
62488 901402 890325 882873 879076 878519 880869 886641 896846 911775 930622 952379 976493 1002475 1029374
62475 1029374 1055835 1080258 1100873 1116291 1126188 1130892 1130163 1123054 1109217 1089550 1064997 1035407
62463 1035407 1000357 960703 918408 874943 830648 785774 741430 699132 659831 623760 591019
62452 591019 561901 536539 514545 495207 478051 463007 449954 438370 427701 417950 409557 402753
62440 402753 397360 393205 390244 388163 386284 384165 381922 379771 377653 375623 374182 373686 373604 372846 370833
62425 370833 367855 364489 361140 358138 355760 353905 352101 350138 348481 347726 347674 347306 345823 343559 341660
62410 341660 340917 341082 341379 341373 341164 340959 340754 340426 339841 338885 337683 336791 336865 337984 339603 341245 342979 345095
62392 345095 347638 350427 353242 355734 357494 358525 359453 360947 363092 365621 368589 372404 377288 383087
$$ packed form
62488I01402j1077p452l797n57K350N772J0205J4929J8847K1757K4114K5982K6899
62475A029374K6461K4423K0615J5418R897M704p29p109j3837j9667k4553k9590
62463A035407l5050l9654m2295m3465m4295m4874m4344m2298l9301l6071l2741
62452E91019k9118k5362k1994j9338j7156j5044j3053j1584j0669r751q393o804
62440D02753n393m155k961k081j879k119k243k151k118k030j441m96q2p58k013
62425C70833k978l366l349l002k378j855j804j963j657p55n2l68j483k264j899
62410C41660p43J65K97ok09k05k05l28n85r56j202q92P4J119J619J642J734K116
62392C45095K543K789K815K492J760J031R28J494K145K529K968L815M884N799
$$ plain form
62378 383087 389588 396654 404064 411621 419494 428112 437593 447653 458214 469823 483178 498516 515772
62365 515772 535108 556836 580865 606747 634498 665099 699864 739449 783690 832250 885049
62354 885049 942062 1002972 1067065 1133011 1198543 1260724 1316963 1365760 1406293 1437551 1458354
62343 1458354 1468228 1467852 1458553 1441558 1417710 1387551 1351458 1309842 1263333 1212796 1159329 1104414
62331 1104414 1049826 997032 946692 899063 854729 814425 778212 745389 715313 687810 662679
62320 662679 639465 618015 598700 581625 566046 551003 536200 521852 508130 495260 483812
62309 483812 474175 465851 457854 449780 442033 435079 428987 423687 419221 415633 412933 411198 410390 410116 409921
62294 409921 409783 409972 410454 410889 411226 411830 412866 414019 415087 416532 419109 423079 428020 433327 438689 444107
$$ packed form
62378C83087O501P066P410P557P873Q618R481J0060J0561J1609J3355J5338J7256
62365E15772J9336K1728K4029K5882K7751L0601L4765L9585M4241M8560N2799
62354H85049N7013O0910O4093O5946O5532O2181N6239M8797M0533L1258K0803
62343A458354R874l76r299j6995k3848l0159l6093m1616m6509n0537n3467n4915
62331A104414n4588n2794n0340m7629m4334m0304l6213l2823l0076k7503k5131
62320F62679k3214k1450j9315j7075j5579j5043j4803j4348j3722j2870j1448
62309D83812r637q324p997q074p747o954o092n300m466l588k700j735q08k74j95
62294D09921j38J89M82M35L37O04J036J153J068J445K577L970M941N307N362N418
$$ plain form
62278 444107 449548 454720 459314 463485 467923 473249 479483 486310 493773 502450 513004 525722 540434
62265 540434 556694 574165 593092 614293 638487 665825 696433 731144 771179 817067 868314
62254 868314 924077 983687 1046401 1111075 1176194 1239897 1299910 1353835 1399644 1435702 1460579
62243 1460579 1473530 1475265 1467535 1451629 1427725 1395905 1357114 1312650 1263257 1209364 1151929 1092514
62231 1092514 1032770 974311 918771 867299 820005 776444 736665 701349 670969 645276 623655
62220 623655 605518 590258 577257 566209 557175 550194 545032 541374 538980 537596 536983 537181 538439 540718
62206 540718 543468 546082 548333 550227 551683 552642 553341 554056 554554 554110 552220 549160 545743 542680 540354
62191 540354 539102 539372 541387 544798 548958 553607 559082 565675 573003 580277 587181 594161 601757 609930
$$ packed form
62278D44107N441N172M594M171M438N326O234O827P463Q677J0554J2718J4712
62265E40434J6260J7471J8927K1201K4194K7338L0608L4711M0035M5888N1247
62254H68314N5763N9610O2714O4674O5119O3703O0013N3925M5809L6058K4877
62243A460579J2951J735p730j5906k3904l1820l8791m4464m9393n3893n7435n9415
62231A092514n9744n8459n5540n1472m7294m3561l9779l5316l0380k5693k1621
62220F23655j8137j5260j3001j1048r034o981n162l658k394j384o13J98J258K279
62206E40718K750K614K251J894J456R59O99P15M98m44j890l060l417l063k326
62191E40354j252K70K015L411M160M649N475O593P328P274O904O980P596Q173
$$ plain form
62177 609930 618195 626192 633811 641021 648077 655927 665922 678759 694007 711069 730456 753700 782042
62164 782042 815614 853911 896489 942803 991678 1041362 1089963 1135569 1176155 1209900 1235705
62153 1235705 1253160 1262081 1262485 1255042 1241050 1221671 1197325 1168022 1133988 1095793 1054134 1009918
62141 1009918 964499 919528 876434 836099 798924 765047 734499 707378 683984 664752 649936
62130 649936 639248 631795 626550 623047 621609 622778 626622 632775 640988 651213 663089 675739 688229
62117 688229 699913 710187 718427 724510 729064 732758 735599 737343 738295 738993 739181 737753 733862 727582
62103 727582 719379 709631 699086 689205 681329 675598 671213 667790 666083 667255 671732 678903 687686 697215
62089 697215 707085 717173 727405 737759 748372 759463 771091 783181 795833 809416 824203 840097
$$ packed form
62177F09930Q265P997P619P210P056P850R995J2837J5248J7062J9387K3244K8342
62164G82042L3572L8297M2578M6314M8875M9684M8601M5606M0586L3745K5805
62153A235705J7455Q921M04p443j3992j9379k4346k9303l4034l8195m1659m4216
62141A009918m5419m4971m3094m0335l7175l3877l0548k7121k3394j9232j4816
62130F49936j0688p453n245l503j438J169L844O153Q213J0225J1876J2650J2490
62117F88229J1684J0274Q240O083M554L694K841J744R52O98J88j428l891o280
62103G27582q203r748j0545r881p876n731m385l423j707J172M477P171Q783R529
62089F97215R870J0088J0232J0354J0613J1091J1628J2090J2652J3583J4787J5894
$$ plain form
62077 840097 856975 875161 895197 917118 940319 964287 989144 1015158 1041937 1068611 1094909
62066 1094909 1121637 1149790 1179432 1209910 1241096 1273738 1308175 1343112 1376273 1406134 1432368
62055 1432368 1454572 1471413 1481614 1485264 1483402 1476563 1464425 1446863 1424464 1397665 1366045 1329075
62043 1329075 1287222 1241782 1193802 1143772 1092403 1041164 991758 945228 901726 860945 822575
62032 822575 786480 752770 721927 694748 671847 652950 636711 621554 606857 593177 581237
62021 581237 570904 561252 551432 541202 530805 520621 510885 501513 492233 483083 474655 467560 461755
62008 461755 456700 452148 448458 446131 445398 446259 448538 451790 455560 459916 465410 472238 479708 486731 492607
61993 492607 497137 500274 502096 503016 503591 503936 503437 501139 496477 489750 481932 473944 466169 458708 451863
$$ packed form
62077H40097J6878J8186K0036K1921K3201K3968K4857K6014K6779K6674K6298
62066A094909K6728K8153K9642L0478L1186L2642L4437L4937L3161K9861K6234
62055A432368K2204J6841J0201L650j862o839j2138j7562k2399k6799l1620l6970
62043A329075m1853m5440m7980n0030n1369n1239m9406m6530m3502m0781l8370
62032H22575l6095l3710l0843k7179k2901j8897j6239j5157j4697j3680j1940
62021E81237j0333r652r820j0230j0397j0184r736r372r280r150q428p095n805
62008D61755n055m552l690k327p33Q61K279L252L770M356N494O828P470P023N876
61993D92607M530L137J822R20N75L45m99k298m662o727p818p988p775p461o845
$$ plain form
61978 451863 445928 440596 435149 429430 424102 419652 415659 411487 407251 403527 400414 397582 395113 393578
61964 393578 393220 393650 394481 395773 397569 399502 401222 402955 405289 408545 412643 417478 423139 429691 436949
61949 436949 444583 452468 460865 470271 481135 493710 508073 524140 541773 561081 582488 606148
61937 606148 631326 656844 682269 708155 734885 761879 788363 814286 839698 863556 884122
61926 884122 900594 913654 924319 932821 938709 941417 940462 935635 927276 916125 902854 888182 873456
61913 873456 860509 850689 844394 841669 842751 847782 856519 868617 883779 901370 920316 939655 958675
61900 958675 976219 990405 999598 1003294 1001650 994594 982060 964783 944179 921383 896879 870992
61888 870992 844222 817150 790433 764976 741613 720418 700589 681191 661932 643231 625757
$$ packed form
61978D51863n935n332n447n719n328m450l993m172m236l724l113k832k469j535
61964C93578l58M30Q31J292J796J933J720J733K334L256M098M835N661O552P258
61949D36949P634P885Q397R406J0864J2575J4363J6067J7633J9308K1407K3660
61937F06148K5178K5518K5425K5886K6730K6994K6484K5923K5412K3858K0566
61926H84122J6472J3060J0665Q502N888K708r55m827q359j1151j3271j4672j4726
61913H73456j2947r820o295k725J082N031Q737J2098J5162J7591J8946J9339J9020
61900I58675J7544J4186R193L696j644p056j2534j7277k0604k2796k4504k5887
61888H70992k6770k7072k6717k5457k3363k1195j9829j9398j9259j8701j7474
$$ plain form
61877 625757 609960 595862 583141 571337 560034 549037 538636 529631 522789 518200 515432 514276
61865 514276 514984 517699 522143 528077 535612 544844 555662 568280 583559 602298 624569 650082 678823
61852 678823 710820 745715 783230 823697 867383 913408 960140 1006630 1052888 1098607 1142357
61841 1142357 1182321 1217279 1246502 1269234 1284762 1292866 1293887 1288484 1277580 1262443 1244629 1225765
61829 1225765 1207326 1190558 1176673 1167112 1163209 1165219 1171924 1181675 1193697 1207819 1223051 1237083
61817 1237083 1247401 1252363 1251021 1242558 1226421 1202740 1172200 1135604 1093821 1048038 999845 951126
61805 951126 903768 859090 817326 777906 740503 705650 674185 646294 621341 598486 577247
61794 577247 557559 539519 523139 508327 495077 483549 473709 464945 456404 447854 439946 433468 428506
$$ packed form
61877F25757j5797j4098j2721j1804j1303j0997j0401r005o842m589k768j156
61865E14276P08K715M444N934P535R232J0818J2618J5279J8739K2271K5513K8741
61852F78823L1997L4895L7515M0467M3686M6025M6732M6490M6258M5719M3750
61841A142357L9964L4958K9223K2732J5528Q104J021n403j0904j5137j7814j8864
61829A225765j8439j6768j3885r561l903K010O705R751J2022J4122J5232J4032
61817A237083J0318M962j342q463j6137k3681l0540l6596m1783m5783m8193m8719
61805I51126m7358m4678m1764l9420l7403l4853l1465k7891k4953k2855k1239
61794E77247j9688j8040j6380j4812j3250j1528r840q764q541q550p908o478m962
$$ plain form
61781 428506 424497 420876 417410 414065 410798 407523 404186 400875 397884 395554 394014 393109 392567 392129 391620
61766 391620 391091 390917 391543 393084 395274 397774 400354 402853 405234 407657 410226 412653 414474 415611 416419
61751 416419 417156 417750 418147 418492 418821 418925 418712 418393 418119 417695 416796 415270 413179 410867 409003 408127 408047 408150
61733 408150 408438 409602 411729 413656 414257 413940 414139 415582 417739 419819 421597 423247 425038 427344 430428
61718 430428 434002 437422 440431 443365 446456 449264 451063 451576 451196 450644 450441 450484 450064 448491 445752 442413
61702 442413 438941 435387 431711 428010 424326 420558 416736 413158 410074 407424 405006 402720 400507 398257
61688 398257 395943 393720 391783 390187 388840 387535 386014 384221 382513 381379 380881 380670 380593 380893 381649 382449
61672 382449 383003 383665 384845 386100 386469 385734 384710 384079 383483 382201 380370 378953 378513 378559 378320 377813 377849
$$ packed form
61781D28506m009l621l466l345l267l275l337l311k991k330j540r05n42m38n09
61766C91620n29j74O26J541K190K500K580K499K381K423K569K427J821J137Q08
61751D16419P37N94L97L45L29J04k13l19k74m24q99j526k091k312j864q76q0J03
61733D08150K88J164K127J927O01l17J99J443K157K080J778J650J791K306L084
61718D30428L574L420L009K934L091K808J799N13l80n52k03M3m20j573k739l339
61702D42413l472l554l676l701l684l768l822l578l084k650k418k286k213k250
61688C98257k314k223j937j596j347j305j521j793j708j134m98k11p7L00P56Q00
61672C82449N54O62J180J255L69p35j024o31n96j282j831j417m40M6k39n07L6
$$ plain form
61655 377849 379059 381220 383549 385453 386889 388152 389538 391163 392951 394684 396183 397530 399118 401413
61641 401413 404601 408458 412544 416492 420089 423079 425014 425483 424536 422737 420595 418000 414422 409667 404252
61626 404252 398982 394327 390291 386594 382812 378565 373882 369408 365973 363928 363036 362913 363238 363591 363444
61611 363444 362579 361222 359578 357456 354583 351055 347190 343104 338814 334627 330934 327541 323693 319016
61597 319016 314129 310068 307277 305358 303587 301393 298523 295114 291679 288729 286328 284084 281583 278743
61583 278743 275791 273040 270639 268472 266325 264194 262307 260752 259314 257898 256872 256620 256790 256405 254847
61568 254847 252408 249761 247279 245113 243622 243260 244030 245415 246921 248405 249705 250231 249373 247369 245489
61553 245489 245034 246201 248066 249655 250726 251529 252160 252477 252444 252245 252067 252022 252260 252940 254013 255176 256106
$$ packed form
61655C77849J210K161K329J904J436J263J386J625J788J733J499J347J588K295
61641D01413L188L857M086L948L597K990J935M69r47j799k142k595l578m755n415
61626D04252n270m655m036l697l782m247m683m474l435k045q92j23L25L53j47
61611C63444q65j357j644k122k873l528l865m086m290m187l693l393l848m677
61597C19016m887m061k791j919j771k194k870l409l435k950k401k244k501k840
61583B78743k952k751k401k167k147k131j887j555j438j416j026k52J70l85j558
61568B54847k439k647k482k166j491l62P70J385J506J484J300N26q58k004j880
61553B45489m55J167J865J589J071Q03O31L17l3j99j78m5K38O80J073J163R30
$$ plain form
61536 256106 256675 256993 257375 258204 259582 261184 262604 263811 265047 266283 267139 267386 267205 266836 266225 265264 264155
61519 264155 263225 262487 261613 260350 258760 257093 255635 254719 254697 255698 257388 259097 260211 260467 259918 258789
61503 258789 257470 256492 256209 256410 256465 255973 255143 254424 253967 253620 253284 253012 252872 252955 253450 254447 255680 256686
61485 256686 257229 257410 257409 257315 257188 257151 257452 258415 260114 262023 263374 264124 265128 266987 269106 270484 271077 271591
61467 271591 272164 272227 271755 271696 272751 274445 275879 276838 277691 278610 279359 279560 278882 277299 275413 274144 273867
61450 273867 274259 275092 276584 278657 280600 281988 283271 284841 286110 286403 286252 286857 288479 290310 291889
61435 291889 293685 296087 298694 300968 303009 305288 307998 310995 314126 317344 320627 323913 327015 329660
61421 329660 331796 333796 336109 338847 341941 345476 349472 353500 357032 360055 362847 365178 366342 366083
$$ packed form
61536B56106N69L18L82Q29J378J602J420J207J236J236Q56K47j81l69o11r61j109
61519B64155r30p38q74j263j590j667j458r16k2J001J690J709J114K56n49j129
61503B58789j319r78k83K01N5m92q30p19m57l47l36k72j40Q3M95R97J233J006
61485B56686N43J81jr4j27l7L01R63J699J909J351P50J004J859K119J378N93N14
61467B71591N73O3m72n9J055J694J434R59Q53R19P49K01o78j583j886j269k77
61450B73867L92Q33J492K073J943J388J283J570J269K93j51O05J622J831J579
61435B91889J796K402K607K274K041K279K710K997L131L218L283L286L102K645
61421C29660K136K000K313K738L094L535L996M028L532L023K792K331J164k59
$$ plain form
61407 366083 364924 363381 361340 358472 354920 351286 348175 345855 344058 341981 338884 334948 331261 328736
61393 328736 327210 325748 323637 320951 318377 316632 315872 315544 314951 313956 312932 312114 311401 310798 310518 310464 310124
61376 310124 309377 308960 309678 311414 313481 315790 318985 323255 327537 330366 331342 331409 331753 332773 334230 335976
61360 335976 338145 340789 343820 347426 352100 358027 364691 371398 378036 385063 392944 401819 411512 421575
61346 421575 431432 440765 449684 458337 466591 474294 481552 488394 494492 499665 504375 509176 513914 518052
61332 518052 521550 524663 526995 527581 526008 522748 518275 512655 506216 499826 494035 488564 483069 477835
61318 477835 473241 469070 464963 461218 458527 457097 456487 456227 456276 456944 458635 461543 465409 469665 473783
61303 473783 477350 479939 481435 482369 483299 483741 482470 479118 474600 469612 463633 456191 448236 441253 435505
$$ packed form
61407C66083j159j543k041k868l552l634l111k320j797k077l097l936l687k525
61393C28736j526j462k111k686k574j745p60l28n93r95j024q18p13o03k80n4l40
61376C10124p47m17P18J736K067K309L195M270M282K829R76O7L44J020J457J746
61360C35976K169K644L031L606M674N927O664O707O638P027P881Q875R693J0063
61346D21575R857R333Q919Q653Q254P703P258O842O098N173M710M801M738M138
61332E18052L498L113K332N86j573l260m473n620o439o390n791n471n495n234
61318D77835m594m171m107l745k691j430o10k60M9O68J691K908L866M256M118
61303D73783L567K589J496R34R30M42j271l352m518m988n979p442p955o983n748
$$ plain form
61288 435505 430252 425377 421580 418962 416580 413758 411035 409374 409009 409483 410422 411953 414554 418635 424029
61273 424029 429920 435528 440884 446569 452780 459135 465390 471797 478613 485769 493223 501254 510101 519626
61259 519626 529533 539719 550252 561225 572676 584352 595518 605372 613781 621240 627999 633716 638180
61246 638180 641860 645271 648106 649486 648904 646472 642338 636341 628395 618929 608848 599152 590529 583039
61232 583039 576134 569180 562005 554879 548051 541657 536111 532084 529698 527945 525399 521596 517345 513565
61218 513565 510209 506706 503100 500206 498592 497909 497364 496493 495263 493769 492156 490620 489173 487595 485878
61203 485878 484568 484273 484974 486236 488141 491558 497298 505277 514724 525116 536605 549539 563705 578160
61189 578160 591814 604129 615197 625262 634421 642840 650901 658881 666587 673596 679765 685256 690109
$$ packed form
61288D35505n253m875l797k618k382k822k723j661l65M74R39J531K601M081N394
61273D24029N891N608N356N685O211O355O255O407O816P156P454Q031Q847R525
61259E19626R907J0186J0533J0973J1451J1676J1166R854Q409P459O759N717M464
61246F38180L680L411K835J380n82k432m134n997p946r466j0081r696q623p490
61232E83039o905o954p175p126o828o394n546m027k386j753k546l803m251l780
61218E13565l356l503l606k894j614o83n45q71j230j494j613j536j447j578j717
61203D85878j310k95P01J262J905L417N740P979R447J0392J1489J2934J4166J4455
61189E78160J3654J2315J1068J0065R159Q419Q061P980P706P009O169N491M853
$$ plain form
61176 690109 694122 697238 699819 702348 704945 707287 708944 709688 709437 708005 705087 700648 695186 689370 683403
61161 683403 676910 669481 661045 651681 641446 630615 619853 609886 601092 593539 587194 581944 577693
61148 577693 574621 573053 572760 572648 571449 568544 563907 557648 550074 541877 533656 525374 516793 508358 501103
61133 501103 495668 491880 489268 487507 486352 485724 485962 487562 490543 494514 499357 505297 512266 519895 528408
61118 528408 538830 551808 566706 582413 598724 616401 635998 657138 678850 700232 720818
61107 720818 740699 760384 780282 800226 819510 837303 852922 865870 875867 882804 886569 886937
61095 886937 883846 877715 869285 859090 847242 833769 819002 803454 787383 770704 753439 736052
61083 736052 719051 702429 685946 669970 655417 642587 630540 618133 605283 592680 580700
$$ packed form
61176F90109M013L116K581K529K597K342J657P44k51j432k918m439n462n816n967
61161F83403o493p429q436r364j0235j0831j0762r967q794p553o345n250m251
61148E77693l072j568k93j12j199k905m637o259p574q197q221q282q581q435p255
61133E01103n435l788k612j761j155o28K38J600K981L971M843N940O969P629Q513
61118E28408J0422J2978J4898J5707J6311J7677J9597K1140K1712K1382K0586
61107G20818J9881J9685J9898J9944J9284J7793J5619J2948R997O937L765L68
61095H86937l091o131q430j0195j1848j3473j4767j5548j6071j6679j7265j7387
61083G36052j7001j6622j6483j5976j4553j2830j2047j2407j2850j2603j1980
$$ plain form
61072 580700 569389 559267 551143 545013 539970 535528 532279 530824 530755 531222 532058 533727 536445 539899 543762
61057 543762 548118 553444 560346 569104 579288 589986 600660 611531 623023 635171 647844 661294
61045 661294 676166 693127 712595 734553 758459 783611 809816 837542 867360 899591 934469
61034 934469 972114 1012141 1053840 1096964 1141821 1188411 1236182 1284979 1335555 1388640 1444250
61023 1444250 1502591 1565024 1633426 1709152 1793338 1887642 1993780 2113004 2247270 2400858
61013 2400858 2579982 2791223 3041424 3338835 3693229 4115272 4617253 5214155 5922244
61004 5922244 6756592 7732013 8865589 10171304 11642506 13232692 14850579 16374327
60996 16374327 17676659 18652481 19247041 19480213 19451612 19311058 19199653 19192015 19272183 19350106
$$ packed form
61072E80700j1311j0122q124o130n043m442l249j455o9M67Q36J669K718L454L863
61057E43762M356N326O902Q758J0184J0698J0674J0871J1492J2148J2673J3450
61045F61294J4872J6961J9468K1958K3906K5152K6205K7726K9818L2231L4878
61034I34469L7645M0027M1699M3124M4857M6590M7771M8797N0576N3085N5610
61023A444250N8341O2433O8402P5726Q4186R4304J06138J19224J34266J53588
61013B400858J79124K11241K50201K97411L54394M22043N01981N96902P08089
61004E922244Q34348R75421J133576J305715J471202J590186J617887J523748
60996A6374327J302332R75822N94560K33172k8601j40554j11405p638Q0168P7923
$$ plain form
60986 19350106 19299034 18992902 18339405 17310241 15957528 14399327 12776089 11204904 9758338
60977 9758338 8469771 7347814 6386478 5571126 4883845 4307310 3825469 3422896 3085277
60968 3085277 2800480 2558643 2351564 2172408 2015675 1877078 1753605 1643651 1546500 1461261
60958 1461261 1386481 1320826 1263538 1213982 1171121 1133645 1100283 1069882 1041673 1015712 992640
60947 992640 972676 955171 939354 925192 913260 904123 897960 894279 891631 888075 882510 875405 867927
60934 867927 860637 853344 845848 838242 830667 823346 816817 811688 808146 806043 805321 806007 807945 811113 816121
60919 816121 823756 833882 845409 857643 871177 887028 905282 925112 945965 968109 991833 1016405
60907 1016405 1040102 1061317 1079581 1095481 1109557 1121364 1129728 1133772 1133453 1129141 1121108 1109590
$$ packed form
60986A9350106n1072l06132o53497j029164j352713j558201j623238j571185j446566
60977I758338j288567j121957r61336q15352o87281n76535m81841m02573l37619
60968C085277k84797k41837k07079j79156j56733j38597j23473j09954r7151q5239
60958A461261p4780o5655n7288m9556m2861l7476l3362l0401k8209k5961k3072
60947I92640j9964j7505j5817j4162j1932r137o163l681k648l556n565p105p478
60934H67927p290p293p496p606p575p321o529n129l542k103p22O86J938L168N008
60919H16121P635J0126J1527J2234J3534J5851J8254J9830K0853K2144K3724K4572
60907A016405K3697K1215J8264J5900J4076J1807Q364M044l19m312q033j1518
$$ plain form
60895 1109590 1095019 1077881 1058525 1037389 1015153 992361 969056 945189 921204 897692 874523
60884 874523 850982 826983 803570 781738 761207 740917 720501 700686 682316 665588 650342
60873 650342 636494 623887 612159 601139 591121 582409 574863 568242 562731 558594 555406 552162 548253
60860 548253 543850 539222 534138 528275 521860 515473 509400 503531 497775 492171 486610 480826 474766 468673
60846 468673 462678 456554 450090 443586 437705 432837 428711 424708 420425 415864 411081 405876 400051 393918
60832 393918 388236 383434 379137 374770 370553 367452 366038 365698 365245 364123 362779 361937 361882 362507 363752 365641
60816 365641 367986 370349 372480 374598 377000 379512 381655 383364 385124 387276 389552 391592 393510 395484
60802 395484 397074 397637 397402 397394 398091 398795 398690 397959 397283 396653 395396 393215 390579 387991 385452 382843 380379
$$ packed form
60895A109590j4571j7138j9356k1136k2236k2792k3305k3867k3985k3512k3169
60884H74523k3541k3999k3413k1832k0531k0290k0416j9815j8370j6728j5246
60873F50342j3848j2607j1728j1020j0018q712p546o621n511m137l188l244l909
60860E48253m403m628n084n863o415o387o073n869n756n604n561n784o060o093
60846D68673n995o124o464o504n881m868m126m003m283m561m783n205n825o133
60832C93918n682m802m297m367m217l101j414l40m53j122j344q42n5O25J245J889
60816C65641K345K363K131K118K402K512K143J709J760K152K276K040J918J974
60802C95484J590N63k35qO97P04j05p31o76o30j257k181k636k588k539k609k464
$$ plain form
60785 380379 378368 376706 374899 372473 369222 365097 360151 354685 349399 345097 342041 339681 337314 335016
60771 335016 333511 333060 332979 332559 331977 331777 331852 331670 331314 331439 332226 333144 333890 334740 335678 336049 335663 335474 336433
60752 336433 338175 339720 341037 342925 345521 348099 350525 353806 358597 363943 368278 371207 373499 375630
60738 375630 377179 377640 377012 375259 371910 366758 360659 355005 350426 346358 341941 336927 331627 326356 321239
60723 321239 316353 311758 307405 303289 299655 296862 294967 293582 292170 290396 288288 286178 284451 283168
60709 283168 281991 280645 279329 278395 277765 277056 276261 275778 275638 275252 274286 273277 272896 272988 272908 272531 272256 272135
60691 272135 271735 271029 270724 271451 273130 275470 278552 282452 286619 290201 292914 295183 297590 300559 304438
60676 304438 309297 314505 319040 322476 325392 328552 331983 335218 338191 341350 344829 347969 350002 350939
$$ packed form
60785C80379k011j662j807k426l251m125m946n466n286m302l056k360k367k298
60771C35016j505m51q1m20n82k00P5j82l56J25P87R18P46Q50R38L71l86j89R59
60752C36433J742J545J317J888K596K578K426L281M791N346M335K929K292K131
60738C75630J549M61o28j753l349n152o099n654m579m068m417n014n300n271n117
60723C21239m886m595m353m116l634k793j895j385j412j774k108k110j727j283
60709B83168j177j346j316r34o30p09p95m83j40l86r66j009l81R2q0l77k75j21
60691B72135m00p06l05P27J679K340L082L900M167L582K713K269K407K969L879
60676C04438M859N208M535L436K916L160L431L235K973L159L479L140K033R37
$$ plain form
60662 350939 351428 351820 351765 350817 349131 347328 345820 344524 343099 341322 339246 337173 335454 334169 333111
60647 333111 332240 331952 332513 333282 332975 330948 327834 324671 321752 318665 315215 311777 308750 306110 303579
60632 303579 300905 297857 294310 290520 287151 284821 283702 283579 284053 284571 284563 283867 282925 282318 282176 282258 282514
60615 282514 283187 284299 285360 285839 285799 285784 286115 286475 286319 285589 284835 284594 284848 285253 285888 287397 290155 293496
60597 293496 296108 297291 297613 298208 299575 301175 302142 302235 302046 302313 303106 303729 303426 302127 300508 299438 299438
60580 299438 300458 301978 303364 304295 304931 305621 306639 308332 311215 315526 320800 326377 332353 339522 348221
60565 348221 357731 367103 376074 384681 392429 398427 402237 404035 404026 402269 399160 395569 392262 389438 386977
60550 386977 384852 383139 381903 381333 381883 384110 388324 394412 401951 410527 420013 430441 441537 452600
$$ packed form
60662C50939M89L92n5r48j686j803j508j296j425j777k076k073j719j285j058
60647C33111q71k88N61P69l07k027l114l163k919l087l450l438l027k640k531
60632C03579k674l048l547l790l369k330j119j23M74N18qo96r42o07j42Q2K56
60615B82514O73J112J061M79m0j5L31L60j56p30p54k41K54M05O35J509K758L341
60597B93496K612J183L22N95J367J600R67R3j89K67P93O23l03j299j619j070%
60580B99438J020J520J386R31O36O90J018J693K883M311N274N577N976P169Q699
60565C48221R510R372Q971Q607P748N998L810J798rj757l109l591l307k824k461
60550C86977k125j713j236n70N50K227M214O088P539Q576R486J0428J1096J1063
$$ plain form
60536 452600 463017 472667 481512 489044 494602 498076 499745 499506 496914 492152 486396 480933 476349 472706
60522 472706 469904 467516 464817 461569 458437 456126 454371 452336 449857 447766 447007 447860 450005 452932 456331
60507 456331 460403 465810 473053 482075 492817 505895 522100 541269 562369 584970 610044 638875
60495 638875 671534 706821 743314 779877 815163 847297 874376 895037 908232 912660 906925 890595
60483 890595 864963 832512 795646 756139 715649 676115 639242 605792 575735 548912 525193
60472 525193 504167 485199 467926 452348 438393 425781 414423 404516 395964 388040 380047 372136
60460 372136 365119 359443 354684 350157 345796 342195 339836 338390 336917 334720 331939 329274 327209 325652
60446 325652 324318 323215 322610 322586 322830 322865 322352 321174 319376 317225 315252 313950 313303 312773 311924 310933 310327
$$ packed form
60536D52600J0417R650Q845P532N558L474J669k39k592m762n756n463m584l643
60522D72706k802k388k699l248l132k311j755k035k479k091p59Q53K145K927L399
60507D56331M072N407P243R022J0742J3078J6205J9169K1100K2601K5074K8831
60495F38875L2659L5287L6493L6563L5286L2134K7079K0661J3195M428n735j6330
60483H90595k5632l2451l6866l9507m0490l9534l6873l3450l0057k6823k3719
60472E25193k1026j8968j7273j5578j3955j2612j1358r907q552p924p993p911
60460C72136p017n676m759m527m361l601k359j446j473k197k781k665k065j557
60446C25652j334j103o05k4K44L5n13j178j798k151j973j302o47n30q49r91o06
$$ plain form
60429 310327 310325 310684 311121 311529 311781 311676 311210 310620 310030 309437 309124 309643 311067 312691 313922 315086 316793 318792
60411 318792 320190 320741 321141 321883 322488 322292 321462 320754 320534 320550 320585 320820 321440 322209 322765 323272 324486 326959
60393 326959 330273 333324 335444 336985 338728 341035 343791 346753 349549 351645 352901 354028 355919 358552
60379 358552 361111 363188 365232 367679 370313 372760 375036 377213 379029 380260 381156 382173 383587 385628
60365 385628 388532 391993 395021 396903 398071 399496 401520 403920 406810 410724 415759 421324 426908 432607
60351 432607 438799 445762 453706 462573 471624 479714 486268 491574 495847 498501 498771 496686 492885 487724
60337 487724 481134 473344 465221 457684 451104 445385 440400 436135 432548 429506 426902 424797 423342 422465
60323 422465 421630 420124 417739 415019 412635 410718 409141 408256 408780 410816 413557 416296 419407 423954 430652
$$ packed form
60429C10327kL59M37M08K52j05m66n90n90n93l13N19J424J624J231J164J707J999
60411C18792J398N51M00P42O05j96q30p08k20J6L5K35O20P69N56N07J214K473
60393C26959L314L051K120J541J743K307K756K962K796K096J256J127J891K633
60379C58552K559K077K044K447K634K447K276K177J816J231Q96J017J414K041
60365C85628K904L461L028J882J168J425K024K400K890L914N035N565N584N699
60351D32607O192O963P944Q867R051Q090O554N306M273K654K70k085l801n161
60337D87724o590p790q123p537o580n719m985m265l587l042k604k105j455q77
60323D22465q35j506k385k720k384j917j577q85N24K036K741K739L111M547O698
$$ plain form
60308 430652 439653 451065 465019 481225 499037 518041 538013 558103 576670 592331 604698 613635
60296 613635 618185 616890 609062 595269 576770 555124 532311 510518 491347 475417 462700 452858
60284 452858 445148 438610 432713 427584 423364 419678 416056 412548 409495 406870 404256 401436 398608 396013
60270 396013 393685 391628 389833 387960 385356 381803 378076 375318 373732 372327 370194 367749 366215 365997
60256 365997 366169 365718 364726 363927 363565 363331 363168 363401 364002 364386 364148 363535 362956 362473 362069 362045 362725 363941 365125
60237 365125 365833 365952 365576 364959 364511 364639 365539 367195 369438 372012 374772 377822 381204 384413 386634 387602
60221 387602 387926 388384 389306 390806 393135 396296 399676 402609 405187 408132 411943 416541 421612 426919 432323
60206 432323 437851 443622 449434 454584 458566 461803 465181 468875 472145 474378 475850 477307 479207 481566
$$ packed form
60308D30652R001J1412J3954J6206J7812J9004J9972K0090J8567J5661J2367Q937
60296F13635M550j295p828j3793j8499k1646k2813k1793j9171j5930j2717r842
60284D52858p710o538n897n129m220l686l622l508l053k625k614k820k828k595
60270C96013k328k057j795j873k604l553l727k758j586j405k133k445j534k18
60256C65997J72m51r92p99l62k34j63K33O01L84k38o13n79m83m04k4O80J216J184
60237C65125P08J19l76o17m48J28R00J656K243K574K760L050L382L209K221R68
60221C87602L24M58R22J500K329L161L380K933K578K945L811M598N071N307N404
60206D32323N528N771N812N150L982L237L378L694L270K233J472J457J900K359
$$ plain form
60192 481566 484200 486887 489478 492048 494736 497377 499454 500513 500428 499289 497303 494895 492524 490219 487535
60177 487535 484078 479905 475366 470859 466875 463864 461823 460240 458682 457186 455858 454446 452660 450712
60163 450712 449061 447806 446771 446115 446284 447244 448268 448788 449089 449866 451297 452943 454356 455426 456165 456546
60147 456546 456659 456737 456959 457438 458527 460847 464785 470096 476171 482507 488803 494861 500834 507416 515256
60132 515256 524053 532566 539676 545192 549442 552417 553654 552889 550569 547695 545210 543445 542024 540365
60118 540365 538363 536473 535126 534267 533609 533103 532873 532827 532612 531989 531004 529705 527906 525403 522381 519490
60102 519490 517382 516187 515518 514991 514606 514531 514698 514863 514980 515268 515985 517358 519647 522854 526452 529846 533185
60085 533185 537181 541945 546551 550147 552982 555829 558789 561297 563131 564720 566353 567606 567724 566254
$$ packed form
60192D81566K634K687K591K570K688K641K077J059q5j139j986k408k371k305k684
60177D87535l457m173m539m507l984l011k041j583j558j496j328j412j786j948
60163D50712j651j255j035o56J69R60J024N20L01P77J431J646J413J070P39L81
60147D56546J13P8K22M79J089K320L938N311O075O336O296O058N973O582P840
60132E15256Q797Q513P110N516M250K975J237p65k320k874k485j765j421j659
60118E40365k002j890j347q59o58n06k30m6k15o23r85j299j799k503l022k891
60102E19490k108j195o69n27l85p5J67J65J17K88P17J373K289L207L598L394L339
60085E33185L996M764M606L596K835K847K960K508J834J589J633J253J18j470
$$ plain form
60071 566254 563115 558349 552032 544415 535993 527367 518950 510825 502966 495527 488669 482128 475352 468215
60057 468215 461240 454935 449268 444037 439356 435436 432236 429668 427812 426544 425347 423959 422894 422823 423810
60042 423810 425654 428591 432894 438049 443076 447576 451802 455852 459578 463150 466846 470165 472051 472182
60028 472182 471340 470224 468625 466003 462231 457530 452306 447320 443275 439830 435734 430426 424899 420451
60014 420451 417134 414032 410543 406715 402711 398693 395040 392016 389342 386619 384109 382486 381776 381042 379300
59999 379300 376509 373563 371522 370883 371435 372709 374464 376575 378619 380024 380783 381624 383227 385589 388357
59984 388357 391357 394433 397150 399146 400633 402117 403673 404824 405043 404166 402410 400226 398031 395895 393637
59969 393637 391381 389788 389478 390369 391729 392710 392803 392161 391637 392142 393690 395426 396782 398087 399740 401373
$$ packed form
60071E66254l139m766o317p617q422q626q417q125p859p439o858o541o776p137
60057D68215o975o305n667n231m681l920l200k568j856j268j197j388j065p1R87
60042D23810J844K937M303N155N027M500M226M050L726L572L696L319J886J31
60028D72182q42j116j599k622l772m701n224m986m045l445m096n308n527m448
60014D20451l317l102l489l828m004m018l653l024k674k723k510j623p10p34j742
59999C79300k791k946k041o39N52J274J755K111K044J405P59Q41J603K362K768
59984C88357L000L076K717J996J487J484J556J151K19q77j756k184k195k136k258
59969C93637k256j593l10Q91J360R81R3o42n24N05J548J736J356J305J653J633
$$ plain form
59953 401373 402496 403470 405048 407080 408439 408299 406907 405035 403149 401277 399316 397306 395530 394279 393408
59938 393408 392332 390718 388940 387544 386594 385942 385729 386069 386494 386378 385805 385426 385654 386611 388645 391993 395966
59921 395966 399377 401983 404690 408108 411811 415506 420040 426452 434492 442812 450345 456869 462409 466814
59907 466814 469982 472018 473027 473049 472296 471222 470263 469571 468948 467988 466377 464185 461843 459844 458583 458386
59891 458386 459276 460627 461497 461643 461932 463411 466202 469699 473563 477994 483008 488036 492504 496471 500429
59876 500429 504604 508728 512404 515498 518129 520439 522393 523739 524126 523363 521646 519497 517357 515310 513264
59861 513264 511355 509925 509056 508452 508012 508288 509984 513039 516624 520152 523922 528532 533889 539117 543346
59846 543346 546265 547866 548004 546516 543741 540590 537955 536066 534548 532953 531003 528410 524832 520196
$$ packed form
59953D01373J123R74J578K032J359j40j392j872j886j872j961k010j776j251q71
59938C93408j076j614j778j396r50o52k13L40M25j16n73l79K28R57K034L348L973
59921C95966L411K606K707L418L703L695M534O412Q040Q320P533O524N540M405
59907D66814L168K036J009K2p53j074r59o92o23r60j611k192k342j999j261j97
59891D58386Q90J351Q70J46K89J479K791L497L864M431N014N028M468L967L958
59876E00429M175M124L676L094K631K310J954J346L87p63j717k149k140k047k046
59861E13264j909j430q69o04m40K76J696L055L585L528L770M610N357N228M229
59846E43346K919J601J38j488k775l151k635j889j518j595j950k593l578m636
$$ plain form
59832 520196 514850 509247 503678 498493 494277 491430 489656 488226 486728 485234 483752 481865 479125 475666
59818 475666 472232 469615 468030 467021 466035 465064 464517 464420 464122 463035 461353 459623 457865 455678 453093 450690
59802 450690 448770 446898 444464 441304 437618 433691 429918 426683 423961 421267 418239 415061 412187 409967
59788 409967 408679 408509 409172 409828 409781 409163 408683 408868 409726 410935 412086 412846 413147 413220 413415 414113 415782 418689
59770 418689 422427 426113 429318 432432 435832 439148 441813 443927 445959 447884 449332 450501 452139 454478
59756 454478 456840 458565 459797 461111 462841 465121 468157 471990 476221 480334 484182 487863 491330 494500
59742 494500 497598 500990 504598 507820 510139 511674 513030 514715 516723 518553 519602 519601 518736 517377 515834
59727 515834 514417 513487 513208 513302 513316 513122 512935 512884 512863 512886 513207 513819 514043 512994 510489 507332 504694 503340
$$ packed form
59832E20196n346n603n569n185m216k847j774j430j498j494j482j887k740l459
59818D75666l434k617j585j009r86r71n47r7k98j087j682j730j758k187k585k403
59802D50690j920j872k434l160l686l927l773l235k722k694l028l178k874k220
59788D09967j288j70O63O56m7o18m80J85Q58J209J151P60L01P3J95O98J669K907
59770D18689L738L686L205L114L400L316K665K114K032J925J448J169J638K339
59756D54478K362J725J232J314J730K280L036L833M231M113L848L681L467L170
59742D94500L098L392L608L222K319J535J356J685K008J830J049jq65j359j543
59727E15834j417r30k79R4J4j94j87n1k1K3L21O12K24j049k505l157k638j354
$$ plain form
59709 503340 503320 504145 505169 506015 506761 507681 508857 510122 511353 512604 513907 515234 516695 518510 520555 522195
59693 522195 522901 522931 523077 523748 524605 525102 525024 524371 523077 521213 519322 518135 517897 518191 518472 518491 518061 516735
59675 516735 514105 510413 506508 503041 499882 496476 492579 488439 484357 480423 476696 473408 470794 468842
59661 468842 467320 465998 464799 463750 462839 461946 460969 460104 459846 460503 461763 463015 464097 465420 467218 468996
59645 468996 469966 469813 468791 467288 465647 464260 463392 462777 461703 459650 456795 453822 451378 449759 448954
59630 448954 448811 449120 449607 449984 450117 450095 449965 449448 448100 445861 443196 440613 438268 436127 434194 432300
59614 432300 429972 426925 423596 420792 418815 417286 415854 414735 414461 415263 416820 418463 419676 420618 422084
59599 422084 424668 427873 430316 430936 429882 428251 427173 427220 428364 430216 432247 433956 435033 435541 435980
$$ packed form
59709E03340k0Q25J024Q46P46R20J176J265J231J251J303J327J461J815K045J640
59693E22195P06L0J46O71Q57M97p8o53j294j864j891j187k38K94K81J9m30j326
59675E16735k630l692l905l467l159l406l897m140m082l934l727l288k614j952
59661D68842j522j322j199j049r11q93r77q65k58O57J260J252J082J323J798J778
59645D68996R70j53j022j503j641j387q68o15j074k053k855k973k444j619q05
59630D48954j43L09M87L77J33k2j30n17j348k239k665k583k345k141j933j894
59614D32300k328l047l329k804j977j529j432j119k74Q02J557J643J213R42J466
59599D22084K584L205K443O20j054j631j078M7J144J852K031J709J077N08M39
$$ plain form
59584 435980 436902 438308 439584 440135 439859 438755 436476 432760 428133 423635 419816 416443 413222 410277 407742
59569 407742 405359 402745 399827 396919 394656 393905 395184 397844 400186 400861 400040 398982 398671 399142 399956 400906
59553 400906 402198 404139 406724 409520 412068 414424 417194 420951 425787 431438 437612 444128 451039 458812
59539 458812 468177 479592 492960 507872 523786 539755 554253 565602 572540 574442 571481 564999
59527 564999 557344 550728 546092 543247 541896 542036 543458 545473 547472 549448 551639 553779 555019 554580 552321
59512 552321 548632 543950 538486 532262 525165 516950 507477 497175 487123 478361 471109 464873 459251 454386
59498 454386 450544 447615 445273 443413 442166 441499 441048 440436 439687 439287 439723 440955 442379 443409 444028 444679
59482 444679 445760 447428 449744 452692 456035 459477 463059 467132 471888 477082 482253 487021 491152 494595
$$ packed form
59584D35980R22J406J276N51k76j104k279l716m627m498l819l373l221k945k535
59569D07742k383k614k918k908k263p51J279K660K342O75q21j058l11M71Q14R50
59553D00906J292J941K585K796K548K356K770L757M836N651O174O516O911P773
59539D58812R365J1415J3368J4912J5914J5969J4498J1349O938J902k961o482
59527E64999p655o616m636k845j351J40J422K015J999J976K191K140J240m39k259
59512E52321l689m682n464o224p097q215r473j0302j0052q762p252o236n622m865
59498D54386l842k929k342j860j247o67m51o12p49m00M36J232J424J030O19O51
59482D44679J081J668K316K948L343L442L582M073M756N194N171M768M131L443
$$ plain form
59468 494595 497463 499721 500939 500657 499106 497262 496102 496015 496924 498602 500796 503409 506721 511151 516779
59453 516779 523448 531281 540581 551042 561633 571502 580583 589072 596811 603487 608888 612563 613715 611933
59439 611933 607691 601699 594218 585490 576367 567795 559921 552365 545202 538948 533684 528896 524270 520108
59425 520108 516888 514906 514407 515628 518597 523334 530260 539923 552177 566090 580905 596806 614565
59412 614565 634686 656983 680583 703948 724915 740940 749648 749740 741909 728882 714189 700634
59400 700634 689844 682727 679669 680136 682497 684485 683709 678043 666306 649038 628409 606973 586481
59387 586481 567699 550880 536038 522989 511533 501744 493958 488415 484884 482629 480773 478773 476615
59374 476615 474646 473279 472779 473094 473893 475000 476833 480003 484300 488511 491627 493910 496402 499639 503422
$$ packed form
59468D94595K868K258J218k82j551j844j160q7R09J678K194K613L312M430N628
59453E16779O669P833R300J0461J0591R869R081Q489P739O676N401L675J152j782
59439F11933m242n992p481q728r123q572p874p556p163o254n264m788m626m162
59425E20108l220j982m99J221K969M737O926R663J2254J3913J4815J5901J7759
59412F14565K0121K2297K3600K3365K0967J6025Q708R2p831j3027j4693j3555
59400G00634j0790p117l058M67K361J988p76n666j1737j7268k0629k1436k0492
59387E86481j8782j6819j4842j3049j1456r789p786n543l531k255j856k000k158
59374D76615j969j367n00L15P99J107J833L170M297M211L116K283K492L237L783
$$ plain form
59359 503422 507575 512284 517670 523620 530183 537646 546054 555102 564655 575000 586405 598757 611841
59346 611841 625690 640423 655956 672017 688236 704093 719014 732675 744960 755478 763367 767852
59334 767852 768912 767214 763416 757701 749926 740060 728391 715335 701164 686075 670467 654976 640177
59321 640177 626457 614243 603955 595462 587900 580468 573287 567126 562467 559253 557427 557150 558454 561132
59307 561132 565141 570783 578358 587865 599094 611687 624944 637698 648408 655390 657306 653885 646148
59294 646148 635701 623885 611767 600471 590791 582563 575046 567918 561368 555302 549245 543226 538072
59281 538072 534498 532431 531474 531498 532436 534001 535987 538548 541866 545953 550981 557365 565159 573705 582198
59266 582198 590234 597560 603843 609130 614073 619043 623261 625367 624755 621895 617501 611867 605001 596976
$$ packed form
59359E03422M153M709N386N950O563P463Q408R048R553J0345J1405J2352J3084
59346F11841J3849J4733J5533J6061J6219J5857J4921J3661J2285J0518P889M485
59334G67852J060j698l798n715p775r866j1669j3056j4171j5089j5608j5491j4799
59321F40177j3720j2214j0288q493p562p432p181o161m659l214j826k77J304K678
59307E61132M009N642P575R507J1229J2593J3257J2754J0710O982J916l421p737
59294F46148j0447j1816j2118j1296r680q228p517p128o550o066o057o019n154
59281E38072l574k067r57K4R38J565J986K561L318M087N028O384P794Q546Q493
59266E82198Q036P326O283N287M943M970M218K106o12k860m394n634o866q025
$$ plain form
59252 596976 588142 579226 571143 564409 558791 553794 549366 545820 543235 541307 539806 538796 538391 538586 539353
59237 539353 540641 542301 544284 546912 550596 555156 559703 563356 565888 567543 568448 568519 567823 566635 564977
59222 564977 562403 558576 553936 549390 545284 541173 536788 532762 529874 527933 526034 523786 521586 519631
59208 519631 517427 514593 511473 508508 505525 502294 499437 498099 498702 500565 502730 504749 506571 508189
59194 508189 509701 511439 513598 515759 517107 517325 517070 517331 518417 519865 521329 523052 525228 527353 528734
59179 528734 529393 529961 530792 531701 532494 533238 534009 534938 536502 539136 542495 545773 548962 553048 558675 565275
59163 565275 571992 578797 586105 593768 601084 607460 612463 615593 616663 616266 615231 613743 611490 608502
59149 608502 605168 601502 597032 591616 585847 580476 575767 571536 567490 563329 558814 553972 549113 544464
$$ packed form
59252E96976q834q916q083o734n618m997m428l546k585j928j501j010m05J95P67
59237E39353J288J660J983K628L684M560M547L653K532J655R05P1o96j188j658
59222E64977k574l827m640m546m106m111m385m026k888j941j899k248k200j955
59208E19631k204k834l120k965k983l231k857j338O03J863K165K019J822J618
59194E08189J512J738K159K161J348K18k55K61J086J448J464J723K176K125J381
59179E28734O59N68Q31R09P93P44P71R29J564K634L359L278L189M086N627O600
59163E65275O717O805P308P663P316O376N003L130J070l97j035j488k253k988
59149F08502l334l666m470n416n769n371m709m231m046m161m515m842m859m649
$$ plain form
59135 544464 539807 534635 528750 522747 517750 514505 512713 511474 510358 509693 509766 510175 510301 510158 510490 512122
59119 512122 515348 519809 524855 530216 536380 544002 552953 562358 571637 580980 590663 600542 610556 620993
59105 620993 631759 642039 651385 660539 670334 680214 688810 695737 701735 707043 710756 712156 711818 710850
59091 710850 709624 707819 705319 702471 699594 696691 693720 690868 688291 685595 681809 676177 668940 661003
59077 661003 652832 644134 634789 625437 616724 608471 600198 592017 584318 576955 569556 562483 556564 551897
59063 551897 547704 543503 539640 536476 533757 531057 528300 525520 522628 519639 516671 513554 509952 506045
59049 506045 502598 500079 498182 496420 494697 493066 491437 489884 488736 488037 487414 486906 487382 489569 492992
59034 492992 496503 499641 502926 506887 511443 516369 521916 528610 536580 545309 554220 563489 574137 587078
$$ packed form
59135E44464m657n172n885o003m997l245j792j239j116o65P3M09J26j43L32J632
59119E12122L226M461N046N361O164P622Q951R405R279R343R683R879J0014J0437
59105F20993J0766J0280R346R154R795R880Q596O927N998N308L713J400l38r68
59091G10850j226j805k500k848k877k903k971k852k577k696l786n632p237p937
59077F61003q171q698r345r352q713q253q273q181p699p363p399p073n919m667
59063E51897m193m201l863l164k719k700k757k780k892k989k968l117l602l907
59049E06045l447k519j897j762j723j631j629j553j148o99o23n08M76K187L423
59034D92992L511L138L285L961M556M926N547O694P970Q729Q911R269J0648J2941
$$ plain form
59020 587078 602158 618380 634978 651809 668661 684772 699418 712446 723660 731989 736024 735540
59008 735540 732005 727357 722564 717608 712563 708149 705103 703355 702245 701510 701643 703129 705652 708389 710789
58993 710789 712656 713706 713642 712642 711192 709256 706129 701322 695092 687839 679469 669835 659483 649410
58979 649410 640206 631865 624368 617991 612933 608974 605677 602800 600450 598995 598863 600273 603064 606808
58965 606808 611130 615903 621138 626750 632479 638040 643268 648047 652179 655454 657846 659402 659834 658507
58951 658507 655053 649787 643265 635641 626802 616993 606852 596913 587484 578956 571723 565703 560409 555624
58937 555624 551646 548710 546638 545191 544285 543587 542374 540230 537525 534751 531661 527603 522570 517448 513196
58922 513196 510139 508035 506484 505153 503924 502939 502297 501677 500516 498716 496921 495861 495613 495818 496580 498721
$$ packed form
59020E87078J5080J6222J6598J6831J6852J6111J4646J3028J1214Q329M035m84
59008G35540l535m648m793m956n045m414l046j748j110p35J33J486K523K737K400
58993G10789J867J050o4j000j450j936l127m807o230p253q370r634j0352j0073
58979F49410r204q341p497o377n058l959l297k877k350j455j32J410K791L744
58965F06808M322M773N235N612N729N561N228M779M132L275K392J556M32j327
58951F58507l454n266o522p624q839r809j0141r939r429q528p233o020n294m785
58937E55624l978k936k072j447r06o98j213k144k705k774l090m058n033n122m252
58922E13196l057k104j551j331j229r85o42o20j161j800j795j060k48K05P62K141
$$ plain form
58906 498721 502881 508652 514979 521370 528298 536320 545256 554435 563367 571832 579714 587217 595052 603831
58892 603831 613324 622831 632258 642322 653686 666451 680566 696094 712730 729569 745793 761218
58880 761218 775768 788723 798988 806013 810072 811707 811212 808614 803779 796486 786631 774532 761045
58867 761045 747330 734439 722985 713065 704532 697250 691013 685327 679533 673219 666359 659021 651103
58854 651103 642385 632722 622273 611733 602159 594128 587096 579997 572539 565496 559644 554902 550712 546783
58840 546783 543064 539310 535099 530201 524748 519159 513950 509283 504604 499092 492732 486624 481980 479090
58826 479090 477418 476247 474904 472830 470065 467459 465909 465403 465181 464652 463824 462986 462422 462380 462997 464265
58810 464265 466259 469106 472377 474844 475470 474564 473409 472800 472590 472640 473426 475281 477610 479377 480103 480052 479726
$$ packed form
58906D98721M160N771O327O391O928Q022Q936R179Q932Q465P882P503P835Q779
58892F03831R493R507R427J0064J1364J2765J4115J5528J6636J6839J6224J5425
58880G61218J4550J2955J0265P025M059J635m95k598m835p293r855j2099j3487
58867G61045j3715j2891j1454r920q533p282o237n686n794o314o860p338p918
58854F51103q718r663j0449j0540r574q031p032p099p458p043n852m742m190l929
58840E46783l719l754m211m898n453n589n209m667m679n512o360o108m644k890
58826D79090j672j171j343k074k765k606j550n06k22n29q28q38n64m2O17J268
58810D64265J994K847L271K467O26r06j155o09k10N0P86J855K329J767P26n1l26
$$ plain form
58793 479726 479583 480059 481349 483171 485019 486625 487954 488871 489281 489633 490890 493735 497983 502911 507959
58778 507959 512948 517860 522704 527467 531904 535474 537769 538959 539475 539286 537883 535046 531232 527050 522745
58763 522745 518421 514399 511000 508283 506277 505238 505305 506220 507742 510029 513096 516210 518473 519963 521651
58748 521651 524165 527170 530095 532855 535722 538938 542678 546985 551567 556018 560427 565392 571307 577974
58734 577974 585061 592496 600229 608076 616135 625050 635426 647114 659239 670755 680903 689407 696523
58721 696523 702749 708351 713250 717357 720874 724335 728546 734284 741617 749664 757499 765130 772937 780268
58707 780268 785548 787975 788211 786996 783914 778112 769497 758481 745098 729229 711416 692641 673438
58694 673438 653871 634302 615473 597762 580904 564643 549329 535688 524171 514597 506333 498834
$$ packed form
58793D79726j43M76J290J822J848J606J329R17M10L52J257K845M248M928N048
58778E07959M989M912M844M763M437L570K295J190N16j89j403k837l814m182m305
58763E22745m324m022l399k717k006j039O7R15J522K287L067L114K263J490J688
58748E21651K514L005K925K760K867L216L740M307M582M451M409M965N915O667
58734E77974P087P435P733P847Q059Q915J0376J1688J2125J1516J0148Q504P116
58721F96523O226N602M899M107L517L461M211N738P333Q047P835P631P807P331
58707G80268N280K427K36j215l082n802q615j1016j3383j5869j7813j8775j9203
58694F73438j9567j9569j8829j7711j6858j6261j5314j3641j1517r574q264p499
$$ plain form
58682 498834 492034 486181 481362 477411 474239 471831 469882 467875 465743 464067 463444 463966 465439 467669 470394
58667 470394 473463 477346 482960 490637 499592 508691 517293 525201 532311 538662 544261 548517 550495 550109
58653 550109 548453 546478 544013 540601 536562 532537 528701 525211 522762 521682 520991 519395 516878 514364
58639 514364 512180 509950 507701 505885 504408 502851 501680 502015 503948 506167 507656 508788 510328 512287
58625 512287 514302 516362 518512 520427 521970 523740 526410 529757 532883 535301 537425 540060 543625 547826
58611 547826 551972 555681 559234 563049 566926 570132 572165 573029 572808 571506 569473 567465 565963 564715 563132
58596 563132 560949 558339 555676 553339 551592 550496 549998 550146 551045 552689 555020 558083 561905 566341 571314
58581 571314 577107 584079 592188 601091 610597 620665 631001 641094 650679 659883 668960 678182 687908
$$ packed form
58682D98834o800n853m819l951l172k408j949k007k132j676o23N22J473K230K725
58667D70394L069L883N614P677Q955R099Q602P908P110O351N599M256J978l86
58653E50109j656j975k465l412m039m025l836l490k449j080o91j596k517k514
58639E14364k184k230k249j816j477j557j171L35J933K219J489J132J540J959
58625E12287K015K060K150J915J543J770K670L347L126K418K124K635L565M201
58611E47826M146L709L553L815L877L206K033Q64k21j302k033k008j502j248j583
58596E63132k183k610k663k337j747j096m98J48Q99J644K331L063L822M436M973
58581E71314N793O972Q109Q903R506J0068J0336J0093R585R204R077R222R726
$$ plain form
58568 687908 698409 709727 722038 735967 752095 770299 790118 811706 835776 862465 890797
58557 890797 919385 947174 973364 997141 1017874 1035227 1048820 1058066 1062676 1063137 1060420 1055232 1047765
58544 1047765 1038141 1026827 1014405 1000921 985721 968200 948567 927594 905785 883373 861047
58533 861047 839848 820060 801001 782467 765656 751930 741170 732145 724091 717068 711098 705964
58521 705964 701840 699251 698256 698251 698582 698830 698632 697850 696884 696202 695628 694587 692907 690780 688139 684792 681061
58504 681061 677507 674112 670492 666920 664326 663206 663133 663358 663244 662222 660134 657730 656096 655527 655521 655833
58488 655833 656770 658506 660914 664112 668381 673556 679321 686106 694808 705576 717788 731242 746253
58475 746253 762355 778060 792367 805530 817794 828256 835610 839310 839482 836289 829987 821143 810418
$$ packed form
58568F87908J0501J1318J2311J3929J6128J8204J9819K1588K4070K6689K8332
58557H90797K8588K7789K6190K3777K0733J7353J3593R246M610M61k717n188p467
58544A047765r624j1314j2422j3484j5200j7521j9633k0973k1809k2412k2326
58533H61047k1199j9788j9059j8534j6811j3726j0760r025q054p023n970n134
58521G05964m124k589r95nL31K48j98p82r66o82n74j041j680k127k641l347l731
58504F81061l554l395l620l572k594j120p3K25j14j022k088k404j634n69oL12
58488F55833R37J736K408L198M269N175N765O785Q702J0768J2212J3454J5011
58475G46253J6102J5705J4307J3163J2264J0462P354L700J72l193o302q844j0725
$$ plain form
58462 810418 798576 786869 776774 768991 763313 759681 758576 760013 762945 766234 769689 773720 778506
58449 778506 783926 789769 795564 800613 804431 806756 807073 804878 800664 795899 791749 788488 786393 786257 788526
58434 788526 792777 798748 807189 819085 834666 853790 876703 903598 933724 965432 996714 1025117
58422 1025117 1047605 1061394 1065265 1060063 1048085 1031998 1013846 994751 975498 957002 939759 923262
58410 923262 906886 891169 877240 865087 853623 842575 833013 825530 819196 812952 806996 802063 798310
58397 798310 795655 794352 794413 795174 796165 797704 799998 802472 804741 807411 811005 814769 817507 819147 820614
58382 820614 822591 825076 827688 829555 829317 826114 820506 814012 807979 803280 800522 800005 801783 806124 813408
58367 813408 823282 834514 846123 857972 869916 881238 891640 902076 913879 927473 942431 958079
$$ packed form
58462H10418j1842j1707j0095p783n678l632j105J437K932L289L455M031M786
58449G78506N420N843N795N049L818K325L17k195m214m765m150l261k095j36K269
58434G88526M251N971Q441J1896J5581J9124K2913K6895L0126L1708L1282K8403
58422A025117K2488J3789L871n202j1978j6087j8152j9095j9253j8496j7243j6497
58410I23262j6376j5717j3929j2153j1464j1048r562p483o334o244n956m933l753
58397G98310k655j303O1P61R91J539K294K474K269K670L594L764K738J640J467
58382H20614J977K485K612J867k38l203n608o494o033m699k758n17J778M341P284
58367H13408R874J1232J1609J1849J1944J1322J0402J0436J1803J3594J4958J5648
$$ plain form
58355 958079 973426 987148 998434 1007550 1015133 1021394 1026410 1030541 1034113 1037252 1040387 1044212 1048802
58342 1048802 1053540 1058259 1063609 1069969 1077010 1084754 1093925 1104615 1115792 1126885 1138750 1152213 1166731
58329 1166731 1181399 1196222 1211349 1226047 1239535 1252011 1263813 1274380 1283092 1290346 1296769 1302211
58317 1302211 1306651 1311273 1317369 1324730 1332297 1339945 1348523 1358567 1370008 1382817 1397037 1412388 1428430
58304 1428430 1444786 1460871 1476138 1491029 1506847 1524183 1542356 1560751 1579556 1598727 1617632
58293 1617632 1636460 1656526 1678285 1700451 1722031 1743805 1766815 1790898 1815832 1842343 1870643
58282 1870643 1899504 1928235 1958076 1990179 2023661 2057269 2091505 2127439 2164895 2203564 2244485
58271 2244485 2288481 2334396 2380841 2428548 2479114 2532593 2588237 2646460 2708090 2772696 2839547
$$ packed form
58355I58079J5347J3722J1286R116P583O261N016M131L572L139L135L825M590
58342A048802M738M719N350O360P041P744R171J0690J1177J1093J1865J3463J4518
58329A166731J4668J4823J5127J4698J3488J2476J1802J0567Q712P254O423N442
58317A302211M440M622O096P361P567P648Q578J0044J1441J2809J4220J5351J6042
58304A428430J6356J6085J5267J4891J5818J7336J8173J8395J8805J9171J8905
58293A617632J8828K0066K1759K2166K1580K1774K3010K4083K4934K6511K8300
58282A870643K8861K8731K9841L2103L3482L3608L4236L5934L7456L8669M0921
58271B244485M3996M5915M6445M7707N0566N3479N5644N8223O1630O4606O6851
$$ plain form
58260 2839547 2909221 2982535 3058987 3137816 3219195 3302627 3385816 3467101 3547532 3628631 3709949
58249 3709949 3791042 3873967 3961213 4052908 4148634 4250266 4360142 4478017 4602695 4735142
58239 4735142 4877108 5028303 5187939 5357482 5538814 5731324 5934023 6148820 6378474
58230 6378474 6623134 6882364 7158780 7456085 7775439 8117565 8486362 8886384 9318842
58221 9318842 9784435 10288096 10836424 11432730 12079575 12784182 13556307 14403159 15332034
58212 15332034 16356029 17491879 18755055 20163568 21744583 23531549 25558731 27867343
58204 27867343 30516534 33583623 37159273 41351797 46292192 52125575 59003666 67100055
58196 67100055 76632105 87857646 101052854 116498810 134470619 155210246 178901402
$$ packed form
58260B839547O9674P3314P6452P8829Q1379Q3432Q3189Q1285Q0431Q1099Q1318
58249C709949Q1093Q2925Q7246R1695R5726J01632J09876J17875J24678J32447
58239D735142J41966J51195J59636J69543J81332J92510K02699K14797K29654
58230F378474K44660K59230K76416K97305L19354L42126L68797M00022M32458
58221I318842M65593N03661N48328N96306O46845P04607P72125Q46852R28875
58212A5332034J023995J135850J263176J408513J581015J786966K027182K308612
58204B7867343K649191L067089L575650M192524M940395N833383O878091Q096389
58196F7100055R532050J1225541J3195208J5445956J7971809K0739627K3691156
$$ plain form
58189 178901402 205647077 235352925 267427649 300427780 331954565 358972142 378401909
58182 378401909 387745005 385629022 372225731 349337776 319944724 287337529 254309829
58175 254309829 222787606 193880693 168097035 145540364 126067228 109409314 95245075
58168 95245075 83232162 73036981 64365546 56972102 50647676 45214339 40528386 36474405
58160 36474405 32951636 29871155 27162903 24774345 22660175 20779231 19099708 17598537
58152 17598537 16253992 15044348 13953272 12969908 12082930 11279528 10550185 9889074 9289193
58143 9289193 8741526 8239082 7777440 7351224 6954178 6582891 6236846 5914795 5614419
58134 5614419 5335098 5077413 4840023 4620172 4416749 4229556 4056100 3892590 3737839
$$ packed form
58189A78901402K6745675K9705848L2074724L3000131L1526785K7017577J9429767
58182C78401909R343096k115983j3403291k2887955k9393052l2607195l3027700
58175B54309829l1522223k8906913k5783658k2556671j9473136j6657914j4164239
58168I5245075j2012913j0195181q671435p393444o324426n433337m685953m053981
58160C6474405l522769l080481k708252k388558k114170j880944j679523j501171
58152A7598537j344545j209644j091076r83364q86978q03402p29343o61111n99881
58143I289193n47667n02444m61642m26216l97046l71287l46045l22051l00376
58134E614419k79321k57685k37390k19851k03423j87193j73456j63510j54751
$$ plain form
58125 3737839 3592949 3457493 3329270 3207540 3093201 2985829 2883592 2786096 2694408 2608219
58115 2608219 2525757 2446517 2371466 2300613 2232921 2168495 2108262 2051512 1996302 1942302 1890866
58104 1890866 1842321 1795550 1750184 1706788 1664866 1623075 1581540 1541770 1504154 1467680 1432153
58093 1432153 1398571 1367208 1337366 1309080 1283085 1259063 1235977 1214129 1194822 1177829 1161249
58082 1161249 1144098 1127142 1110891 1094632 1077830 1060809 1043703 1026176 1008402 990946 973669
58071 973669 956043 938383 921341 904493 886996 869381 853055 838286 824391 811534 800457
58060 800457 790653 780749 770620 761162 752063 741802 729955 717573 705137 692117 678781 666556
58048 666556 656199 647237 639374 632765 626843 620671 614574 609568 605096 599406 592374 585786 580354 574688
$$ packed form
58125C737839j44890j35456j28223j21730j14339j07372j02237r7496r1688q6189
58115B608219q2462p9240p5051p0853o7692o4426o0233n6750n5210n4000n1436
58104A890866m8545m6771m5366m3396m1922m1791m1535l9770l7616l6474l5527
58093A432153l3582l1363k9842k8286k5995k4022k3086k1848j9307j6993j6580
58082A161249j7151j6956j6251j6259j6802j7021j7106j7527j7774j7456j7277
58071I73669j7626j7660j7042j6848j7497j7615j6326j4769j3895j2857j1077
58060H00457r804r904j0129r458r099j0261j1847j2382j2436j3020j3336j2225
58048F66556j0357q962p863o609n922o172o097n006m472n690p032o588n432n666
$$ plain form
58034 574688 567926 561175 555323 549350 542039 533740 525219 516213 506325 496236 486911 478520 470987 464635
58020 464635 459531 455119 451161 448082 445791 443256 439895 436436 433753 431764 430057 428600 427298 425775
58006 425775 424124 422969 422356 421506 419999 418077 415454 411116 404913 398123 391735 385365 378653 372615 368700
57991 368700 367325 368113 370742 374746 379235 383568 387699 391386 393831 394657 394411 393552 391819 389227 386718
57976 386718 384949 383114 379874 374956 369262 363921 359861 357701 357288 357593 357587 356979 355961 354726 353474 352351
57960 352351 351208 349953 349147 349441 350337 350486 349417 347986 346819 345396 343185 340618 338390 336678 335594
57945 335594 335497 336295 337351 338676 341256 345569 350739 355877 361319 367728 374905 382422 390609 399817 409360
57930 409360 418174 426048 433255 439479 444073 447020 448680 448886 447148 443592 438885 433405 427169 420439
$$ packed form
58034E74688o762o751n852n973p311q299q521r006r888j0089r325q391p533o352
58020D64635n104m412l958l079k291k535l361l459k683j989j707j457j302j523
58006D25775j651j155o13q50j507j922k623m338o203o790o388o370o712o038l915
57991C68700j375P88K629M004M489M333M131L687K445Q26k46q59j733k592k509
57976C86718j769j835l240m918n694n341m060k160m13L05oo08j018j235j252j123
57960C52351j143j255q06K94Q96J49j069j431j167j423k211k567k228j712j084
57945C35594r7P98J056J325K580M313N170N138N442O409P177P517Q187R208R543
57930D09360Q814P874P207O224M594K947J660K06j738l556m707n480o236o730
$$ plain form
57916 420439 413766 407512 401819 396881 392759 389067 385283 381267 377230 373485 370439 368442 367266 366044
57902 366044 364032 361164 357702 353891 350198 347204 344826 342185 338729 334982 331767 329213 327060 325451
57888 325451 324861 325556 327541 330580 333895 336332 337399 337763 338369 339413 340494 341189 341098 339925 337988 336104
57872 336104 334491 332432 329542 326725 325159 324811 324696 324186 323462 323029 323400 324849 326893 328434 329061 329797
57856 329797 331871 335132 338406 341108 343694 346596 349473 351592 352538 352515 352225 352266 352424 351840 350068 347572
57840 347572 344849 341631 337430 332387 327023 321544 315973 310653 306110 302669 300537 299831 300069 300175 299599
57825 299599 299020 299357 300516 301754 302905 304484 306829 309876 313571 317767 321711 324244 324610 322814 319302
57810 319302 314571 308939 302495 295498 288811 283343 278878 274221 268977 264404 261875 261123 260744 259823 258318
$$ packed form
57916D20439o673o254n693m938m122l692l784m016m037l745l046j997j176j222
57902C66044k012k868l462l811l693k994k378k641l456l747l215k554k153j609
57888C25451n90O95J985L039L315K437J067L64O06J044J081O95r1j173j937j884
57872C36104j613k059k890k817j566l48j15n10p24m33L71J449K044J541O27P36
57856C29797K074L261L274K702K586K902K877K119R46k3k90M1J58n84j772k496
57840C47572k723l218m201n043n364n479n571n320m543l441k132p06K38J06n76
57825B99599n79L37J159J238J151J579K345L047L695M196L944K533L66j796l512
57810C19302m731n632o444o997o687n468m465m657n244m573k529p52l79r21j505
$$ plain form
57795 258318 256475 254797 254244 255490 258148 261330 264612 267878 270778 273244 276009 279627 283392 286280
57781 286280 288634 291696 295673 299523 302697 305911 309954 314734 319739 324508 328319 330309 330391 329427 328155
57766 328155 326495 324147 321243 318021 314360 310040 305187 300251 295707 291793 288270 284560 280473 276693
57752 276693 274112 272839 272340 272282 272649 273223 273705 274356 275778 277996 280410 282664 284892 286984 288416 289038
57736 289038 289418 290117 291065 291868 292285 292231 291731 290957 289947 288283 285596 282413 279923 278744 278371 277976 277199
57719 277199 276073 274759 273584 272839 272262 271155 269180 266646 263891 260914 257824 255137 253235 251831 250260
57704 250260 248090 245323 242335 239802 238387 238245 238962 240007 241023 241695 241747 241204 240388 239508 238437 236893
57688 236893 234685 231872 228935 226651 225409 224811 224242 223635 223270 223135 223224 224342 227853 234514 244100 256197
$$ packed form
57795B58318j843j678n53J246K658L182L282L266K900K466K765L618L765K888
57781B86280K354L062L977L850L174L214M043M780N005M769L811J990Q2r64j272
57766C28155j660k348k904l222l661m320m853m936m544l914l523l710m087l780
57752B76693k581j273m99n8L67N74M82O51J422K218K414K254K228K092J432O22
57736B89038L80O99R48Q03M17n4n00p74j010j664k687l183k490j179l73l95p77
57719B77199j126j314j175p45n77j107j975k534k755k977l090k687j902j404j571
57704B50260k170k767k988k533j415j42P17J045J016O72N2n43q16q80j071j544
57688B36893k208k813k937k284j242n98n69o07l65j35Q9J118L511O661R586J2097
$$ plain form
57672 256197 270667 287266 305631 326098 349975 378512 411671 447824 484037 516428 540886
57661 540886 554205 554887 543250 521259 492171 459558 426177 393793 363862 337774 316276 299153
57649 299153 285621 274682 265207 256379 248247 241362 235794 231045 226984 224034 222182 220596 218686 216934
57635 216934 216102 216139 216369 216339 215957 215194 214240 213669 213878 214470 214639 214046 212932 211515 209764 207743 205829 204443
57617 204443 203673 203188 202533 201593 200766 200469 200546 200446 199985 199525 199363 199360 199329 199301 199169 198496 197074 195348 193922
57598 193922 192834 191678 190264 188788 187391 185862 183838 181229 178432 176134 174811 174364 174315 174209 173764
57583 173764 172860 171731 171001 171085 171581 171657 170989 169877 168510 166733 164631 162763 161543 160830 160310 159852 159284
57566 159284 158297 156863 155350 153976 152532 150901 149492 148843 149002 149580 150208 150835 151755 153360 155543 157447
$$ packed form
57672B56197J4470J6599J8365K0467K3877K8537L3159L6153L6213L2391K4458
57661E40886J3319O82j1637k1991k9088l2613l3381l2384k9931k6088k1498j7123
57649B99153j3532j0939r475q828q132o885n568m749m061k950j852j586j910j752
57635B16934q32L7K30l0l82p63r54n71K09N92J69n93j114j417j751k021j914j386
57617B04443p70m85o55r40q27k97P7j00m61m60j62ll1k8j32o73j422j726j426
57598A93922j088j156j414j476j397j529k024k609k797k298j323m47m9j06m45
57583A73764r04j129p30Q4M96P6o68j112j367j777k102j868j220p13n20m58n68
57566A59284r87j434j513j374j444j631j409o49J59N78O28O27R20J605K183J904
$$ plain form
57550 157447 158298 158544 159518 161751 164196 165417 165091 163977 162912 162237 161933 161933 162403 163774 166179 168877 170775
57533 170775 171607 172006 172289 172002 170961 169907 169566 169728 169915 170313 171278 172409 172943 172823 172623 172650 172859 173486
57515 173486 175008 177358 179741 181326 181820 181489 181049 181378 182820 184734 186094 186480 186251 185970 186013 186533 187311
57498 187311 187761 187537 187051 186917 186960 186323 184628 182526 180906 179918 179019 177794 176424 175288 174268 172751
57482 172751 170454 167969 166163 165202 164675 164521 165069 166035 166362 165580 164587 164452 164965 165097 164501 163757 163393 163414
57464 163414 163720 164312 165024 165592 165975 166277 166441 166416 166444 166790 167348 167909 168513 169111 169286 168966 169050 170468 172759
57445 172759 174507 175184 175692 176922 178663 180298 181845 183724 185975 188181 189936 191027 191380 191134 190660
57430 190660 190303 190156 190143 190138 190055 190056 190624 192062 193906 195244 195744 196007 196732 197818 198564 198498 197824 197129 196836 196944
$$ packed form
57550A57447Q51K46R74K233K445J221l26j114j065o75l04%M70J371K405K698J898
57533A70775Q32L99K83k87j041j054l41J62J87L98R65J131N34j20k00K7K09O27
57515A73486J522K350K383J585M94l31m40L29J442J914J360L86k29k81M3N20P78
57498A87311M50k24m86j34M3o37j695k102j620r88q99j225j370j136j020j517
57482A72751k297k485j806r61n27j54N48R66L27p82r93j35N13J32n96p44l64K1
57464A63414L06N92P12N68L83L02J64k5K8L46N58N61O04N98J75l20Q4J418K291
57445A72759J748O77N08J230J741J635J547J879K251K206J755J091L53k46m74
57430A90660l57j47j3nq3JN68J438J844J338N00K63P25J086P46o6o74o95k93J08
$$ plain form
57410 196944 197269 197878 199162 201342 204052 206573 208328 208997 208469 207121 205952 205929 207076 208490 209264 209156
57394 209156 208471 207736 207600 208657 211137 214809 219133 223404 226988 229748 232132 234547 236785 238414 239555
57379 239555 240811 242525 244593 246956 249703 252535 254710 255759 255993 256100 256534 257389 258529 259651 260502
57364 260502 261190 262085 263288 264439 265180 265624 266233 267344 268898 270599 272355 274551 277630 281282 284434
57349 284434 286438 287992 290342 293754 297344 300342 302803 305009 306879 308351 309772 311493 313375 315078
57335 315078 316590 318154 319885 321782 324018 326865 330288 333834 337018 339778 342452 345247 347838 349743
57321 349743 351098 352705 355093 357943 360756 363725 367354 371467 375218 378098 380395 382632 385077 387870
57307 387870 391136 394806 398694 402844 407426 412296 417057 421596 426163 430876 435609 440374 445329 450351
$$ packed form
57410A96944L25O09J284K180K710K521J755O69n28j348j169k3J147J414P74j08
57394B09156o85p35j36J057K480L672M324M271L584K760K384K415K238J629J141
57379B39555J256J714K068K363K747K832K175J049K34J07M34Q55J140J122Q51
57364B60502O88Q95J203J151P41M44O09J111J554J701J756K196L079L652L152
57349B84434K004J554K350L412L590K998K461K206J870J472J421J721J882J703
57335C15078J512J564J731J897K236K847L423L546L184K760K674K795K591J905
57321C49743J355J607K388K850K813K969L629M113L751K880K297K237K445K793
57307C87870L266L670L888M150M582M870M761M539M567M713M733M765M955N022
$$ plain form
57293 450351 455093 459538 464009 468548 472820 476766 480872 485593 491001 497057 503689 510451 516737 522623
57279 522623 528993 536634 545672 556010 567635 580189 592916 605466 618202 631376 644591 657433
57267 657433 670040 682561 694715 706459 718434 731015 743446 754770 765229 775928 787275
57256 787275 798640 809504 820178 831258 842861 854546 865666 875878 885590 895736 906782 918239
57244 918239 929571 941138 953620 966860 980148 993469 1007498 1022280 1036831 1050431 1063583
57233 1063583 1077272 1091817 1106952 1122580 1138870 1155774 1172881 1189809 1206523 1223273 1240338
57222 1240338 1257766 1275378 1293123 1311377 1330673 1351142 1372454 1394301 1416661 1439498 1462531
57211 1462531 1485531 1508692 1532542 1557495 1583552 1610405 1637826 1665975 1695161 1725165 1755021
$$ packed form
57293D50351M742M445M471M539M272L946M106M721N408O056O632O762O286N886
57279E22623O370P641R038J0338J1625J2554J2727J2550J2736J3174J3215J2842
57267F57433J2607J2521J2154J1744J1975J2581J2431J1324J0459J0699J1347
57256G87275J1365J0864J0674J1080J1603J1685J1120J0212R712J0146J1046J1457
57244I18239J1332J1567J2482J3240J3288J3321J4029J4782J4551J3600J3152
57233A063583J3689J4545J5135J5628J6290J6904J7107J6928J6714J6750J7065
57222A240338J7428J7612J7745J8254J9296K0469K1312K1847K2360K2837K3033
57211A462531K3000K3161K3850K4953K6057K6853K7421K8149K9186L0004K9856
$$ plain form
57200 1755021 1783788 1811455 1838771 1866234 1893641 1920679 1947511 1974604 2002279 2030641 2059687
57189 2059687 2089251 2119014 2148817 2178919 2209844 2242049 2275733 2310772 2346704 2382972 2419349
57178 2419349 2456053 2493394 2531448 2570072 2608981 2647641 2685377 2721850 2757317 2792222 2826658
57167 2826658 2860440 2893583 2926304 2958589 2990118 3020732 3050652 3080026 3108562 3135911 3162283
57156 3162283 3188320 3214348 3240089 3265207 3289806 3314173 3338277 3361828 3384680 3406847 3428101
57145 3428101 3447908 3465854 3481972 3496599 3510074 3522637 3534371 3545162 3555040 3564738 3575756 3589610
57133 3589610 3607065 3628210 3653066 3681853 3714783 3751842 3792753 3836991 3883877 3932822 3983529
57122 3983529 4035881 4089843 4145658 4204013 4265739 4331535 4402356 4480023 4567025 4665542 4776902
$$ packed form
57200A755021K8767K7667K7316K7463K7407K7038K6832K7093K7675K8362K9046
57189B059687K9564K9763K9803L0102L0925L2205L3684L5039L5932L6268L6377
57178B419349L6704L7341L8054L8624L8909L8660L7736L6473L5467L4905L4436
57167B826658L3782L3143L2721L2285L1529L0614K9920K9374K8536K7349K6372
57156C162283K6037K6028K5741K5118K4599K4367K4104K3551K2852K2167K1254
57145C428101J9807J7946J6118J4627J3475J2563J1734J0791R878R698J1018J3854
57133C589610J7455K1145K4856K8787L2930L7059M0911M4238M6886M8945N0707
57122C983529N2352N3962N5815N8355O1726O5796P0821P7667Q7002R8517J11360
$$ plain form
57111 4776902 4902012 5041981 5198410 5373756 5571867 5797962 6057988 6358634 6708473
57102 6708473 7118715 7602358 8173066 8845601 9636820 10564913 11647401 12900652 14341133
57093 14341133 15985492 17848129 19938389 22258816 24802981 27552791 30478133 33538617
57085 33538617 36681664 39835692 42909312 45806991 48452176 50794763 52794399 54398813
57077 54398813 55541322 56158574 56209866 55684972 54603149 53009391 50967703 48551140 45834156
57068 45834156 42891691 39801596 36644017 33496750 30429917 27501821 24755862 22219482
57060 22219482 19906176 17818990 15952977 14296613 12833687 11545600 10412833 9415803
57052 9415803 8536161 7758078 7068223 6454825 5907289 5416461 4974575 4574927 4212014
$$ packed form
57111D776902J25110J39969J56429J75346J98111K26095K60026L00646L49839
57102F708473M10242M83643N70708O72535P91219R28093J082488J253251J440481
57093A4341133J644359J862637K090260K320427K544165K749810K925342L060484
57085C3538617L143047L154028L073620K897679K645185K342587J999636J604414
57077E4398813J142509O17252N1292n24894j081823j593758k041688k416563k716984
57068D5834156k942465l090095l157579l147267l066833k928096k745959k536380
57060B2219482k313306k087186j866013j656364j462926j288087j132767r97030
57052I415803q79642p78083o89855o13398n47536m90828m41886l99648l62913
$$ plain form
57043 4212014 3881884 3581729 3309084 3061733 2838205 2637806 2460037 2304269 2169719
57034 2169719 2055314 1959813 1882705 1824825 1786993 1767171 1758900 1752673 1739019 1710890 1664435
57023 1664435 1598866 1516433 1422394 1324012 1228113 1138680 1056667 981949 914855 855607 803300
57012 803300 756428 714184 676453 642728 612001 583825 558698 537023 518189 500975 484468
57001 484468 468354 452733 437987 424587 412759 402448 393624 386378 380576 375702 371260 367260 364158
56988 364158 362445 362340 363805 366791 371401 377663 384965 391845 396531 397722 394877 388032 377655 364556
56974 364556 349674 333941 318402 304143 291827 281476 272996 266693 262934 261570 262146 264604 269331
56961 269331 276594 286332 298483 313033 329619 347287 364595 379693 390472 395109 392708 383422
$$ packed form
57043D212014l30130l00155k72645k47351k23528k00399j77769j55768j34550
57034B169719j14405r5501p7108n7880l7832j9822q271o227j3654k8129m6455
57023A664435o5569q2433r4039r8382r5899q9433q2013p4718o7094n9248n2307
57012H03300m6872m2244l7731l3725l0727k8176k5127k1675j8834j7214j6507
57001D84468j6114j5621j4746j3400j1828j0311q824p246n802m874m442m000l102
56988C64158j713j05J465K986M610O262P302O880M686J191k845o845j0377j3099
56974C64556j4882j5733j5539j4259j2316j0351q480o303l759j364N76K458M727
56961B69331P263R738J2151J4550J6586J7668J7308J5098J0779M637k401r286
$$ plain form
56949 383422 368316 349410 329422 310614 293715 278289 264116 251836 242382 236345 233898 234852
56937 234852 238750 245392 255303 269248 287279 308593 332116 356507 379634 398857 412062 417977
56925 417977 415575 404199 384675 359550 331681 303039 275075 249348 226956 207806 191189 176834
56913 176834 164871 155147 147279 141200 136946 133995 131439 128835 126427 124486 123020 122186 122432 123958
56899 123958 126444 129595 133660 139132 146183 154728 164873 176834 190418 205040 220495 237376 256319
56886 256319 276910 297714 317291 334720 349066 359006 363497 362592 357219 348476 337544 325992 315446
56873 315446 306909 300810 297617 297880 301720 308869 319341 333584 351898 374244 400779 432029 468208
56860 468208 508653 551933 595838 637013 671259 694907 705998 704273 690766 667789 638760 607274
$$ packed form
56949C83422j5106j8906j9988j8808j6899j5426j4173j2280r454o037k447R54
56937B34852L898O642R911J3945J8031K1314K3523K4391K3127J9223J3205N915
56925D17977k402j1376j9524k5125k7869k8642k7964k5727k2392j9150j6617j4355
56913A76834j1963r724p868o079m254k951k556k604k408j941j466q34K46J526
56899A23958K486L151M065N472P051Q545J0145J1961J3584J4622J5455J6881J8943
56886B56319K0591K0804J9577J7429J4346R940M491r05n373q743j0932j1552j0546
56873C15446q537o099l193K63L840P149J0472J4243J8314K2346K6535L1250L6179
56860D68208M0445M3280M3905M1175L4246K3648J1091j725j3507k2977k9029l1486
$$ plain form
56848 607274 576262 548044 524597 507265 496503 492412 495372 505879 524086 549997 583895 626120
56836 626120 676589 734842 800143 870717 942705 1010266 1066831 1106288 1123773 1116770 1086390 1037446
56824 1037446 976740 910810 844729 782163 725753 677205 637210 605742 582762 568623 563617
56813 563617 567281 578641 597336 624070 659550 703088 752327 803799 853180 895303 924892 937966
56801 937966 932794 909916 871820 822551 766925 709366 653221 600917 554304 514558 481955 456112
56789 456112 436591 423200 415793 414029 417523 426209 440320 459829 483813 510332 536691 559752
56777 559752 576274 583561 580161 566077 542451 511296 475390 437863 401366 367509 336978 309931
56765 309931 286148 265136 246475 230098 216153 204596 194976 186549 178594 170759 163166 156175 150095
$$ packed form
56848F07274l1012k8218k3447j7332j0762m091K960J0507J8207K5911L3898M2225
56836F26120N0469N8253O5301P0574P1988O7561N6565L9457J7485p003l0380m8944
56824A037446o0706o5930o6081o2566n6410m8548l9995l1468k2980j4139n006
56813E63617L664J1360J8695K6734L5480M3538M9239N1472M9381M2123K9589J3074
56801I37966n172k2878l8096m9269n5626n7559n6145n2304m6613l9746l2603k5843
56789D56112j9521j3391p407j764L494Q686J4111J9509K3984K6519K6359K3061
56777E59752J6522P287l400j4084k3626l1155l5906l7527l6497l3857l0531k7047
56765C09931k3783k1012j8661j6377j3945j1557r620q427p955p835p593o991o080
$$ plain form
56752 150095 145209 141786 139649 137808 135026 130968 126492 122673 119863 117817 116255 114961 113649 112230
56738 112230 111092 110764 111242 111811 111577 110113 107809 105676 104646 104840 105602 106278 106766 107242 107657 107774 107554
56721 107554 107275 107277 107695 108413 109308 110594 112750 115834 119015 121242 122382 123217 124329 125522 126482 127356 128305
56704 128305 129018 129143 128863 128576 128303 127784 126953 126015 125237 124901 125143 125636 125786 125498 125316 125529 125663 125295 124822
56685 124822 124790 124908 124446 123334 122127 121107 120164 119507 119692 120852 122466 124021 125411 126629 127588 128378
56669 128378 129303 130511 131885 133304 134662 135724 136408 137198 138765 141055 143221 144573 145232 145749 146518 147707
56653 147707 149276 150787 151574 151474 151202 151667 152975 154349 155025 155022 154987 155421 156202 156941 157631 158642 160055 161296
56635 161296 161670 161096 160112 159268 158639 157763 155965 152980 149516 146937 146108 146650 147399 147356 146117 143813 141069
$$ packed form
56752A50095m886l423k137j841k782m058m476l819k810k046j562j294j312j419
56738A12230j138l28M78N69k34j464k304k133j030J94P62O76M88M76M15J17k20
56721A07554k79KM18P18Q95J286K156L084L181K227J140Q35J112J193R60Q74R49
56704A28305P13J25k80k87k73n19q31r38p78l36K42M93J50k88j82K13J34l68m73
56685A24822l2J18m62j112j207j020r43o57J85J160J614J555J390J218R59P90
56669A28378R25J208J374J419J358J062O84P90J567K290K166J352O59N17P69J189
56653A47707J569J511P87j00k72M65J308J374O76ll5M34P81P39O90J011J413J241
56635A61296L74n74r84q44o29q76j798k985l464k579q29N42P49m3j239k304k744
$$ plain form
56618 141069 138737 137308 136718 136845 137780 139273 140429 140521 139776 138884 138098 137331 136741 136453 135967 134643 132741
56601 132741 131254 130739 130930 131419 132009 132429 132471 132560 133442 135048 136305 136378 135626 135073 135323 136221 137262 138099
56583 138099 138848 139963 141599 143272 144493 145485 146757 148188 149207 149800 150579 151828 153287 154991 157509
56568 157509 161089 165274 169672 174416 179536 184595 189488 195042 202305 211589 222577 234881 247997
56555 247997 261091 273305 284072 292929 299521 304131 307770 311252 314479 316990 318769 319998 320415 319613
56541 319613 317776 315546 313157 310221 306369 301703 296518 290972 285129 279134 273160 267261 261279 254918
56527 254918 248034 240885 234050 228073 223242 219577 216732 213973 210639 206733 202801 199208 195929 193088
56513 193088 191140 190217 189721 188967 188008 187423 187452 187647 187330 186154 184318 182391 180953 180256 180177 180414 180625 180563
$$ packed form
56618A41069k332j429n90J27R35J493J156R2p45q92p86p67n90k88m86j324j902
56601A32741j487n15J91M89N90M20M2Q9Q82J606J257P3p52n53K50Q98J041Q37
56583A38099P49J115J636J673J221R92J272J431J019N93P79J249J459J704K518
56568A57509L580M185M398M744N120N059M893N554P263R284J0988J2304J3116
56555B47997J3094J2214J0767Q857O592M610L639L482L227K511J779J229M17q02
56541C19613j837k230k389k936l852m666n185n546n843n995n974n899n982o361
56527B54918o884p149o835n977m831l665k845k759l334l906l932l593l279k841
56513A93088j948r23m96p54r59n85K9J95l17j176j836j927j438o97p9K37K11o2
$$ plain form
56495 180563 180315 180347 180989 181879 182195 181454 179856 177933 176205 175033 174373 173719 172758 171972 172093 173015 173923 174471
56477 174471 175055 175767 175954 175211 174103 173382 173108 173083 173563 174848 176557 178020 179151 180312 181496 182258 182435
56460 182435 182402 182547 182882 183244 183590 183984 184483 185084 185701 186156 186220 185694 184554 183178 182206 181936 182021 182089 182434
56441 182434 183534 185064 186123 186512 187015 188198 189643 190697 191306 191708 191951 192210 193002 194473 195879 196374
56425 196374 195998 195421 195028 194736 194439 194110 193661 193196 193271 194436 196561 198940 200978 202521 203610 204166 204004
56408 204004 203181 202367 202545 203863 205071 204795 203366 202567 203490 205478 207430 209140 210848 212399 213546 214449
56392 214449 215235 215631 215624 215855 216728 217795 218606 219531 221010 222684 224116 225688 227835 229982 231309 232112 233207
56375 233207 234278 234071 232247 229986 228644 228611 229555 230957 232277 233247 234099 235098 236008 236527 236903 237438 237775
$$ packed form
56495A80563k48L2O42Q90L16p41j598j923j728j172o60o54r61p86J21R22R08N48
56477A74471N84P12J87p43j108p21k74k5M80J285J709J463J131J161J184P62J77
56460A82435l3J45L35L62L46L94M99O01O17M55O4n26j140j376r72k70Q5O8L45
56441A82434J100J530J059L89N03J183J445J054O09M02K43K59P92J471J406M95
56425A96374l76n77l93k92k97l29m49m65P5J165K125K379K038J543J089N56j62
56408B04004q23q14J78J318J208k76j429p99R23J988J952J710J708J551J147R03
56392B14449P86L96pK31Q73J067Q11R25J479J674J432J572K147K147J327Q03J095
56375B33207J071k07j824k261j342l3R44J402J320R70Q52R99R10N19L76N35L37
$$ plain form
56358 237775 237580 237522 238489 239944 240331 239194 237813 237474 238118 239048 239952 240691 240905 240502 240060 240242 241105 242321
56340 242321 243663 245049 246448 248004 249930 252127 254250 256180 258044 259728 260891 261574 262311 263499 265068
56325 265068 266889 269069 271625 274243 276518 278220 279253 279629 279532 279180 278701 278312 278365 278848 279149 278816 278238
56308 278238 278010 277974 277668 277497 278492 280931 284092 287436 291104 295055 298689 301742 304780 308252 311711 314454
56292 314454 316388 317747 318429 318202 317301 316304 315573 315178 315258 316086 317747 319891 321873 323214 324027 324907 326247
56275 326247 327845 329323 330649 331969 333228 334428 335920 337903 339928 341534 343144 345624 349148 353299
56261 353299 358133 364146 371059 377635 383100 388054 393685 400670 409118 418932 429763 441113 452896
56248 452896 465624 479774 495277 511794 529158 547378 566482 586424 606877 627128 646472
$$ packed form
56358B37775j95n8R67J455L87j137j381l39O44R30R04P39K14m03m42J82Q63J216
56340B42321J342J386J399J556J926K197K123J930J864J684J163O83P37J188J569
56325B65068J821K180K556K618K275J702J033L76r7l52m79l89N3M83L01l33n78
56308B78238k28l6l06j71R95K439L161L344L668L951L634L053L038L472L459K743
56292C14454J934J359O82k27r01r97p31l95Q0Q28J661K144J982J341Q13Q80J340
56275C26247J598J478J326J320J259J200J492J983K025J606J610K480L524M151
56261C53299M834O013O913O576N465M954N631O985Q448R814J0831J1350J1783
56248D52896J2728J4150J5503J6517J7364J8220J9104J9942K0453K0251J9344
$$ plain form
56237 646472 664585 681160 695469 706905 715714 722467 726978 728560 727271 723996 719138 712204 702926
56224 702926 692007 680395 668489 656356 644083 631594 618724 605750 593313 581653 570557
56213 570557 560169 551094 543405 536291 529092 522058 515704 510034 504768 499835 495252 491004 487367 484857
56199 484857 483553 482899 482366 481838 481230 480325 479275 478741 479251 480877 483536 487013 490573 493266 494911 496199
56183 496199 497748 499669 502126 505397 509123 512378 514903 517522 520972 525014 529089 533103 537122 541041
56169 541041 545057 549885 555962 562891 570019 577149 584399 591989 600415 610233 621357 633105 645119
56156 645119 657669 670968 685064 700584 718692 739905 763702 789623 818024 849502 884560
56145 884560 924301 970591 1025000 1088238 1160783 1243065 1334507 1433257 1537294 1644850 1753310
$$ packed form
56237F46472J8113J6575J4309J1436Q809O753M511J582j289l275m858o934r278
56224G02926j0919j1612j1906j2133j2273j2489j2870j2974j2437j1660j1096
56213E70557j0388r075p689p114p199p034o354n670n266m933m583m248l637k510
56199D84857j304o54n33n28o08r05j050n34N10J626K659L477L560K693J645J288
56183D96199J549J921K457L271L726L255K525K619L450M042M075M014M019L919
56169E41041M016M828O077O929P128P130P250P590Q426R818J1124J1748J2014
56156F45119J2550J3299J4096J5520J8108K1213K3797K5921K8401L1478L5058
56145H84560L9741M6290N4409O3238P2545Q2282R1442R8750J04037J07556J08460
$$ plain form
56134 1753310 1858847 1958035 2049159 2131528 2204585 2268513 2324893 2375811 2422595 2465631 2504305
56123 2504305 2536424 2558658 2568629 2566343 2553374 2531433 2501955 2465662 2421494 2366795 2299466 2219514
56111 2219514 2128295 2027588 1920315 1811084 1704785 1604986 1514105 1433962 1365137 1306548
56101 1306548 1256664 1214606 1179556 1150145 1125350 1105165 1089492 1077221 1067264 1059608 1054505 1051475
56089 1051475 1050053 1050565 1053178 1057007 1061131 1065648 1070816 1076107 1081134 1086640 1093474 1101397 1109857 1119022
56075 1119022 1129051 1139353 1149614 1160574 1172679 1185040 1196924 1209207 1223035 1238055 1253358
56064 1253358 1269093 1285692 1302487 1318631 1334576 1351162 1368135 1385124 1403194 1423700 1446278
56053 1446278 1469543 1493064 1517050 1540855 1563556 1585523 1607841 1630673 1653665 1677306 1702302
$$ packed form
56134A753310J05537R9188R1124Q2369P3057O3928N6380N0918M6784M3036L8674
56123B504305L2119K2234R971k286j2969k1941k9478l6293m4168n4699o7329p9952
56111B219514r1219j00707j07273j09231j06299r9799r0881q0143o8825n8589
56101A306548m9884m2058l5050k9411k4795k0185j5673j2271r957p656n103l030
56089A051475j422N12K613L829M124M517N168N291N027N506O834P923Q460R165
56075A119022J0029J0302J0261J0960J2105J2361J1884J2283J3828J5020J5303
56064A253358J5735J6599J6795J6144J5945J6586J6973J6989J8070K0506K2578
56053A446278K3265K3521K3986K3805K2701K1967K2318K2832K2992K3641K4996
$$ plain form
56042 1702302 1728177 1754073 1780410 1808285 1837766 1868222 1899674 1932414 1966068 2000528 2036998
56031 2036998 2076540 2118383 2161257 2205416 2251657 2299378 2347566 2396840 2448530 2502499 2557794
56020 2557794 2614738 2674439 2737033 2802234 2870714 2942964 3017835 3094375 3174083 3259072 3348930
56009 3348930 3441776 3537545 3637817 3743215 3853443 3969155 4091366 4219824 4354300 4496564
55999 4496564 4648604 4809855 4978666 5155378 5341420 5536767 5741245 5957042 6186830
55990 6186830 6430655 6687831 6960576 7252436 7564656 7897781 8255416 8642482 9061114
55981 9061114 9512312 10000226 10530625 11106748 11731358 12411484 13156384 13972600 14866494
55972 14866494 15850391 16941014 18153824 19505465 21021048 22733651 24679370 26901093
$$ packed form
56042A702302K5875K5896K6337K7875K9481L0456L1452L2740L3654L4460L6470
56031B036998L9542M1843M2874M4159M6241M7721M8188M9274N1690N3969N5295
56020B557794N6944N9701O2594O5201O8480P2250P4871P6540P9708Q4989Q9858
56009C348930R2846R5769J00272J05398J10228J15712J22211J28458J34476J42264
55999D496564J52040J61251J68811J76712J86042J95347K04478K15797K29788
55990F186830K43825K57176K72745K91860L12220L33125L57635L87066M18632
55981I061114M51198M87914N30399N76123O24610O80126P44900Q16216Q93894
55972A4866494R83897J090623J212810J351641J515583J712603J945719K221723
$$ plain form
55964 26901093 29457501 32423535 35885809 39945999 44726089 50361741 56995273 64789025
55956 64789025 73946946 84714621 97360538 112163265 129400194 149320541 172121961
55949 172121961 197938635 226749819 258102972 290743480 322448145 350271798 371112158
55942 371112158 382347502 382407257 371209043 350286436 322408917 290781184 258238576
55935 258238576 226822224 197767474 171685104 148753647 128880149 111827614 97293244
55928 97293244 84945990 74457273 65532251 57921026 51409660 45814839 40987594 36809517
55920 36809517 33179878 30010374 27229653 24782635 22622359 20707251 19005032 17491321
55912 17491321 16142476 14934584 13848951 12872474 11992034 11193784 10468080 9809468 9210925
$$ packed form
55964B6901093K556408K966034L462274M060190M780090N635652O633532P793752
55956F4789025R157921J0767675J2645917J4802727J7236929J9920347K2801420
55949A72121961K5816674K8811184L1353153L2640508L1704665K7823653K0840360
55942C71112158J1235344N9755j1198214k0922607k7877519l1627733l2542608
55935B58238576l1416352k9054750k6082370k2931457j9873498j7052535j4534370
55928I7293244j2347254j0488717q925022p611225o511366n594821m827245m178077
55920C6809517l629639l169504k780721k447018k160276j915108j702219j513711
55912A7491321j348845j207892j085633r76477q80440p98250p25704o58612n98543
$$ plain form
55903 9210925 8662772 8157761 7692544 7263473 6865447 6495691 6154372 5840362 5549974
55894 5549974 5280600 5032020 4803288 4591679 4395459 4214625 4048162 3893454 3748849
55885 3748849 3613892 3486605 3363501 3242938 3125738 3012093 2900744 2791779 2687473
55876 2687473 2589463 2497438 2411148 2331162 2256902 2186233 2117896 2052407 1990069 1930118 1872329
55865 1872329 1817479 1765730 1716400 1669655 1626417 1586212 1547117 1508244 1470343 1433661 1397244
55854 1397244 1360987 1326341 1294250 1264015 1234799 1206659 1179576 1152998 1126730 1100884 1074779
55843 1074779 1047623 1020545 996050 974956 955491 935840 915937 896361 877292 859235 843113
55832 843113 828889 815461 802449 790676 780364 770371 759819 749093 738616 728027 717115 706261
$$ packed form
55903I210925n48153n05011m65217m29071l98026l69756l41319l14010k90388
55894E549974k69374k48580k28732k11609j96220j80834j66463j54708j44605
55885C748849j34957j27287j23104j20563j17200j13645j11349j08965j04306
55876B687473r8010r2025q6290p9986p4260p0669o8337o5489o2338n9951n7789
55865A872329n4850n1749m9330m6745m3238m0205l9095l8873l7901l6682l6417
55854A397244l6257l4646l2091l0235k9216k8140k7083k6578k6268k5846k6105
55843A074779k7156k7078k4495k1094j9465j9651j9903j9576j9069j8057j6122
55832H43113j4224j3428j3012j1773j0312r993j0552j0726j0477j0589j0912j0854
$$ plain form
55820 706261 695392 683769 671356 659062 647196 635025 622421 610520 600151 590916 582415 575034
55808 575034 568832 563001 557197 552247 548846 546728 545818 546963 550682 556235 562633 569596 576886 583789
55794 583789 589986 595879 601426 605694 608256 609885 611100 611152 609252 605729 601091 594948 586822 577066 566062
55779 566062 553521 539675 526299 515328 507077 500894 496901 495895 497997 502543 508911 516211 522330
55766 522330 524488 521033 512060 498442 481084 461259 440744 421022 402484 384590 366729 348966
55754 348966 332143 317337 305228 295918 289061 283882 279363 274970 271127 268480 266822 265338 263776
55741 263776 262597 262006 261736 261866 262863 264448 265299 264450 262379 260279 258794 257854 257104 256018 254032 251007
55725 251007 247283 243103 238512 233952 230289 227886 226197 224645 223425 223075 223673 224803 226094 227679 230409
$$ packed form
55820G06261j0869j1623j2413j2294j1866j2171j2604j1901j0369r235q501p381
55808E75034o202n831n804m950l401k118r10J145L719N553O398O963P290O903
55794E83789O197N893N547M268K562J629J215N2j900l523m638o143q126r756j1004
55779E66062j2541j3846j3376j0971q251o183l993j006K102M546O368P300O119
55766E22330K158l455q973j3618j7358j9825k0515j9722j8538j7894j7861j7763
55754C48966j6823j4806j2109r310o857n179m519m393l843k647j658j484j562
55741B63776j179n91k70J30R97J585Q51q49k071k100j485r40p50j086j986l025
55725B51007l724m180m591m560l663k403j689j552j220l50N98J130J291J585K730
$$ plain form
55710 230409 235360 242556 250309 256613 261031 264343 266485 266174 262842 257649 251980 246063 239717 233344
55696 233344 227254 220820 213398 205588 198734 193478 189487 186254 183560 181425 180102 179824 180244 180576 180634
55681 180634 181190 182911 185523 188414 191372 194213 196367 197527 198205 199008 199844 200346 200550 200544 199980 198658 197170
55664 197170 196313 196143 196156 196006 195579 194842 194210 194600 196399 198722 200338 201045 201643 202905 205107 208153 211538
55647 211538 214502 216873 219413 222773 226428 229205 230530 230528 229295 226805 223265 218838 213189 205981 197716
55632 197716 189523 182170 175743 170098 165110 160619 156594 153242 150568 148097 145426 142782 140619 138983
55618 138983 137677 136657 135752 134362 132094 129406 127083 125335 123956 122936 122226 121218 119280 116642 114060
55603 114060 111754 109433 107207 105651 104961 104789 104961 105603 106369 106307 104904 102822 101236 100703 100903 101276 101638
$$ packed form
55710B30409M951P196P753O304M418L312K142l11l332n193n669n917o346o373
55696B33344o090o434p422p810o854n256l991l233k694k135j323k78M20L32N8
55681A80634N56J721K612K891K958K841K154J160O78Q03Q36N02K04on64j322j488
55664A97170q57j70J3j50m27p37o32L90J799K323J616P07N98J262K202L046L385
55647B11538K964K371K540L360L655K777J325kj233k490l540m427n649p208q265
55632A97716q193p353o427n645m988m491m025l352k674k471k671k644k163j636
55618A38983j306j020r05j390k268k688k323j748j379j020p10j008j938k638k582
55603A14060k306k321k226j556o90j72J72O42P66o2j403k082j586n33K00L73L62
$$ plain form
55586 101638 102217 103243 104598 105975 107272 108567 109733 110536 111231 112554 114843 117674 120684 124245 128884
55571 128884 134490 140606 147057 153735 160172 165867 170693 174437 176407 176169 174313 171755 168552 164166
55557 164166 158671 152947 147757 143294 139491 136099 132571 128544 124436 120970 118211 115620 112938 110369
55543 110369 108038 105879 104003 102630 101745 101363 101875 103469 105428 106758 107327 107629 107660 106984 105892 105425
55527 105425 106064 107247 108378 109433 110234 109991 108113 104977 101508 98393 95870 93813 91764 89382 87056
55512 87056 85629 85305 85331 84924 84077 83235 82669 82383 82303 82337 82508 83008 83814 84386 84241 83671 83255 82805 81632
55493 81632 79837 78411 77822 77428 76662 75958 75941 76395 76655 76531 76289 76167 76369 77147 78359 79293 79448 79191
55475 79191 79228 79696 80190 80414 80414 80374 80535 81070 81735 81920 81297 80168 78866 77281 75320 73463 72296 71759
$$ packed form
55586A01638N79J026J355J377J297J295J166Q03O95J323K289K831L010L561M639
55571A28884N606O116O451O678O437N695M826L744J970k38j856k558l203m386
55557A64166n495n724n190m463l803l392l528m027m108l466k759k591k682k569
55543A10369k331k159j876j373q85l82N12J594J959J330N69L02L1o76j092m67
55527A05425O39J183J131J055Q01k43j878l136l469l115k523k057k049k382k326
55512H7056j427l24K6m07q47q42n66k86q0L4J71N00Q06N72j45n70m16m50j173
55493H1632j795j426n89l94p66p04j7M54K60j24k42j22K02P78J212R34J55k57
55475G9191L7M68M94K24%m0J61N35O65J85o23j129j302j585j961j857j167n37
$$ plain form
55457 71759 71400 71186 71516 72490 73693 74726 75498 75960 76012 75856 76059 76949 78117 78826 78840 78587 78469 78343 77945
55438 77945 77590 77935 78970 79765 79539 78641 78071 78322 79134 80133 81117 81886 82404 83119 84516 86283 87465 87533
55420 87533 86818 85875 85059 84800 85566 87195 88780 89629 89950 90328 90925 91499 91794 91637 90949 89879 88620 86955
55402 86955 84440 81216 78142 75933 74675 74290 74762 75551 75562 74349 72796 72009 72010 72203 72587 73572 74885
55385 74885 75660 75719 75912 76905 78254 79088 79251 79377 79971 80776 81087 80538 79388 78086 76811 75679 75085 75351
55367 75351 76089 76534 76604 76946 77758 78295 78055 77706 78103 78889 78941 77915 76514 75335 74317 73405 72994 73388
55349 73388 74295 75133 75511 75313 74634 73786 73093 72601 72161 71745 71405 71043 70617 70512 71212 72525 73619 73973
55331 73973 73897 73862 73760 73147 72022 70962 70490 70567 70757 70785 70825 71229 72006 72687 72788 72285 71566 71047 70954 71260
$$ packed form
55457G1759l59k14L30R74J203J033P72M62N2j56K03Q90J168P09J4k53j18j26l98
55438G7945l55L45J035P95k26q98n70K51Q12R99R84P69N18P15J397J767J182O8
55420H7533p15r43q16k59P66J629J585Q49L21L78N97N74K95j57o88j070j259j665
55402H6955k515l224l074k209j258l85M72P89J1j213j553p87JJ93L84R85J313
55385G4885P75N9J93R93J349Q34J63J26N94Q05L11n49j150j302j275j132n94K66
55367G5351P38M45P0L42Q12N37k40l49L97P86N2j026j401j179j018r12m11L94
55349G3388R07Q38L78j98o79q48o93m92m40m16l40l62m26j05P00J313J094L54
55331G3973p6l5j02o13j125j060m72P7J90K8M0M04P77O81J01n03p19n19r3L06
$$ plain form
55311 71260 71643 71663 71227 70785 70809 71176 71376 71251 71194 71645 72726 74346 76271 77983 78835 78629 77868 77238 77042
55292 77042 77294 78092 79488 80992 81645 80869 79163 77718 77304 77678 78053 77921 77294 76428 75665 75386 75746 76367
55274 76367 76664 76556 76579 77207 78358 79637 80647 80964 80292 79021 78203 78483 79319 79658 79173 78378 77764 77367
55256 77367 77105 76993 76969 76942 77069 77609 78425 79015 79086 78762 78186 77367 76572 76402 77136 78222 78697 78018 76357
55237 76357 74315 72567 71611 71542 72009 72516 72783 72815 72778 72858 73196 73752 74279 74470 74205 73624 73032 72727 72873 73460
55217 73460 74350 75304 76014 76201 75778 74930 74030 73483 73532 74084 74713 75029 75065 75167 75490 75775 75731 75426 75212 75430
55197 75430 76234 77446 78504 78837 78555 78492 79298 80648 81630 81714 81066 80137 79361 79180 79856 81107 82214 82628
55179 82628 82385 81923 81662 81755 82011 82051 81650 80995 80495 80404 80714 81319 82119 83001 83828 84448 84724 84688 84619 84702 84604
$$ packed form
55311G1260L83K0m36m42K4L67K00j25n7M51J081J620J925J712Q52k06p61o30j96
55292G7042K52P98J396J504O53p76j706j445m14L74L75j32o27q66p63k79L60O21
55274G6367K97j08K3O28J151J279J010L17o72j271q18K80Q36L39m85p95o14l97
55256G7367k62j12k4k7J27N40Q16N90P1l24n76q19p95j70P34J086M75o79j661
55237G6357k042j748r56o9M67N07K67L2l7Q0L38N56N27J91k65n81n92l05J46N87
55217G3460Q90R54P10J87m23q48r00n47M9N52O29L16L6J02L23K85m4l05k14K18
55197G5430Q04J212J058L33k82o3Q06J350R82Q4o48r29p76j81O76J251J107M14
55179H2628k43m62k61R3K56M0m01o55n00r1L10O05Q00Q82Q27O20K76l6o9Q3r8
$$ plain form
55158 84604 83785 82365 81173 80716 80619 80464 80617 81561 82854 83593 83632 83492 83220 82303 80805 79572 79017 78544
55140 78544 77669 76901 76929 77560 78164 78706 79584 80767 81858 82824 83938 84979 85159 84047 82083 80085 78633
55123 78633 78038 78357 79097 79307 78433 76959 75909 75798 76341 77073 77815 78513 79003 79206 79267 79256 78956 78320 78023
55104 78023 79010 81396 84173 86169 86959 86738 85785 84484 83520 83411 83923 84362 84469 84572 84884 85151 85170 85222
55086 85222 85701 86564 87378 87764 87611 87035 86321 85807 85640 85645 85522 85133 84575 84037 83624 83303 83018 82861 82988 83272
55066 83272 83230 82572 81716 81461 82121 83262 84296 85088 85873 86812 87739 88281 88153 87456 86692 86368 86593 87126 87717
55047 87717 88296 88929 89783 90938 92045 92413 91805 90949 90816 91495 92272 92707 93018 93353 93370 92807 92011 91515 91458
55028 91458 91621 91755 91636 91157 90567 90291 90326 90161 89506 88709 88164 87783 87478 87774 89364 92125 95006 96858
$$ packed form
55158H4604q19j420j192m57r7j55J53R44J293P39L9j40k72r17j498j233n55m73
55140G8544q75p68K8O31O04N42Q78J183J091R66J114J041J80j112j964j998j452
55123G8633n95L19P40K10q74j474j050j11N43P32P42O98M90K03O1j1l00o36k97
55104G8023R87K386K777J996P90k21r53j301r64j09N12M39J07J03L12K67J9N2
55086H5222M79Q63Q14L86j53n76p14n14j67Nj23l89n58n38m13l21k85j57J27K84
55066H3272m2o58q56k55O60J141J034P92P85R39R27N42j28o97p64l24K25N33N91
55047H7717N79O33Q54J155J107L68o08q56j33O79P77M35L11L35J7n63p96m96n7
55028I1458J63J34j19m79n90k76L5j65o55p97n45l81l05K96J590K761K881J852
$$ plain form
55010 96858 97181 96230 94802 93818 93698 94064 94228 93972 93732 94087 95194 96606 97554 97537 96817 96183 96174 96710 97494
54991 97494 98369 99114 99341 98975 98565 98697 99300 99799 99771 99169 98187 97310 97194 98040 99221 99960 100166 100195 100051
54972 100051 99456 98596 98111 98289 98838 99525 100470 101622 102539 102954 103111 103332 103616 103918 104314 104642 104461 103812
54954 103812 103623 104734 106713 108185 108335 107594 106840 106393 105967 105243 104204 103090 102273 102098 102649 103665 104732
54937 104732 105557 106064 106349 106567 106766 106753 106266 105411 104781 104949 105921 107299 108861 110646 112517 114114 115453
54920 115453 117100 119357 121689 123580 125695 129356 134716 140188 144101 146387 148102 149707 150488 149542 146760
54905 146760 142780 138427 134317 130646 127161 123499 119724 116421 114183 113064 112567 112120 111532 111011 110707
54890 110707 110355 109578 108522 107921 108352 109665 111259 112599 113308 113164 112485 112279 113461 116003 119225 122743
$$ packed form
55010I6858L23r51j428r84j20L66J64k56k40L55J107J412R48j7p20o34rN36P84
54991I7494Q75P45K27l66m10J32O03M99k8o02r82q77j16Q46J181P39K06K9j44
54972A00051n95q60m85J78N49O87R45J152R17M15J57K21K84L02L96L28j81o49
54954A03812j89J111J979J472J50p41p54m47m26p24j039j114q17j75N51J016J067
54937A04732Q25N07K85K18J99j3m87q55o30J68R72J378J562J785J871J597J339
54920A15453J647K257K332J891K115L661N360N472L913K286J715J605P81r46k782
54905A46760l980m353m110l671l485l662l775l303k238j119m97m47n88n21l04
54890A10707l52p77j056o01M31J313J594J340P09j44o79k06J182K542L222L518
$$ plain form
54874 122743 126578 130404 133445 135385 136891 138878 141581 144568 147276 149226 150050 149761 148833 147632 145846
54859 145846 142876 138771 134477 131058 128853 127420 126103 124527 122643 120526 118202 115708 113226 111078
54845 111078 109509 108526 107920 107378 106598 105395 103810 102082 100456 99064 98015 97530 97864 99004 100471 101596
54829 101596 102155 102701 103987 105935 107435 107419 106003 104320 103300 102945 102749 102450 102181 102156 102465 103114 104138
54812 104138 105680 107896 110561 112795 113509 112404 110380 108753 108126 108118 108010 107435 106500 105535 104781 104219 103641
54795 103641 102959 102429 102478 103257 104419 105383 105840 106023 106502 107716 109618 111674 113198 113749 113398 112660 112116
54778 112116 111994 112132 112338 112622 113012 113430 113972 115146 117409 120463 123411 125761 127991 130928 134836 139346
54762 139346 144042 148782 153543 158266 162898 167326 171187 173905 175017 174390 172132 168431 163546 157911
$$ packed form
54874A22743L835L826L041J940J506J987K703K987K708J950Q24k89r28j201j786
54859A45846k970m105m294l419k205j433j317j576j884k117k324k494k482k148
54845A11078j569r83o06n42p80j203j585j728j626j392j049m85L34J140J467J125
54829A01596N59N46J286J948J500j6j416j683j020l55j96k99k69k5L09O49J024
54812A04138J542K216K665K234P14j105k024j627o27qj08n75r35r65p54n62n78
54795A03641o82n30M9P79J162R64M57J83M79J214J902K056J524N51l51p38n44
54778A12116j22J38K06K84L90M18N42J174K263L054K948K350K230K937L908M510
54762A39346M696M740M761M723M632M428L861K718J112o27k258l701m885n635
$$ plain form
54748 157911 152132 146844 142503 139222 136750 134631 132416 129825 126878 123909 121367 119420 117819 116266
54734 116266 114914 114301 114722 115815 116960 118000 119297 121036 122707 123544 123405 123045 123519 125489 129028 133791
54718 133791 139133 144304 148807 152539 155485 157459 158350 158498 158419 158135 157106 154943 151940 148729 145678
54703 145678 142811 140074 137357 134344 130748 126785 123160 120471 118796 117896 117609 117776 118006 117815 117045 115886
54687 115886 114484 112835 111224 110391 110822 111997 112739 112416 111438 110560 110072 109948 110376 111652 113618 115612
54671 115612 117056 117905 118445 118808 118710 117698 115727 113525 112141 111926 112219 112249 112044 112070 112238 111951 111132 110532
54653 110532 110815 111814 112984 114068 114921 115149 114603 114031 114594 116510 118666 119783 119687 119179 118848 118420 117355
54636 117355 115803 114594 114266 114428 114384 114129 114282 115040 115759 115816 115436 115197 115057 114441 113231 112065 111508 111371
$$ packed form
54748A57911n779n288m341l281k472k119k215k591k947k969k542j947j601j553
54734A16266j352o13M21J093J145J040J297J739J671Q37j39l60M74J970L539M763
54718A33791N342N171M503L732K946J974Q91J48p9k84j029k163l003l211l051
54703A45678k867k737k717l013l596l963l625k689j675r00k87J67K30j91p70j159
54687A15886j402j649j611q33M31J175P42l23r78q78m88j24M28J276J966J994
54671A15612J444Q49N40L63r8j012j971k202j384k15K93L0k05K6J68k87q19o00
54653A10532K83R99J170J084Q53K28n46n72N63J916K156J117r6n08l31m28j065
54636A17355j552j209l28J62m4k55J53P58P19N7l80k39j40o16j210j166n57j37
$$ plain form
54618 111371 111149 110806 110711 110952 111105 110752 109989 109326 109190 109590 110174 110569 110714 110878 111289 111774 111912 111592 111234
54599 111234 111339 111956 112745 113423 113905 114077 113817 113256 112734 112330 111752 110872 110058 109742 109911 110378 111307 112992
54581 112992 115159 116988 117881 117891 117345 116486 115624 115222 115494 116161 116849 117544 118395 119216 119517 119040 118056 117088
54563 117088 116503 116412 116808 117693 119022 120609 122161 123452 124415 125007 125145 124912 124666 124749 125111 125428 125508 125372
54545 125372 125051 124696 124794 125829 127663 129604 131224 132682 134109 135123 135306 134836 134280 133950 133783 133634 133376
54528 133376 132892 132304 132081 132565 133438 133963 133746 133038 132327 131848 131477 130956 130205 129469 129013 128682 128054 127116 126426
54509 126426 126313 126307 125732 124563 123167 121509 119310 116983 115669 116092 117811 119850 121634 123057 124064 124655
54493 124655 125161 126083 127585 129302 130675 131376 131446 131154 130779 130524 130592 131219 132529 134396 136495 138448 139856
$$ packed form
54618A11371k22l43r5K41J53l53p63o63j36M00N84L95J45J64M11M85J38l20l58
54599A11234J05O17P89O78M82J72k60n61n22m04n78q80q14l16J69M67R29J685
54581A12992K167J829Q93J0n46q59q62m02K72O67O88O95Q51Q21L01m77r84r68
54563A17088n85r1L96Q85J329J587J552J291R63N92J38k33k46Q3L62L17Q0j36
54545A25372l21l55R8J035J834J941J620J458J427J014J83m70n56l30j67j49k58
54528A33376m84n88k23M84Q73N25k17p08p11m79l71n21p51p36m56l31o28r38o90
54509A26426j13on75j169j396j658k199k327j314M23J719K039J784J423J007N91
54493A24655N06R22J502J717J373P01P0k92l75k55O8O27J310J867K099J953J408
$$ plain form
54476 139856 140383 140038 139352 139054 139510 140537 141742 142888 144018 145385 147204 149318 151122 152031 152008 151544
54460 151544 151179 151169 151489 151948 152330 152587 152844 153077 153002 152466 151706 150930 149983 148855 148243 148871 150274 151040 150479
54441 150479 149380 148788 148627 148074 146828 145312 143816 142093 139932 137703 136143 135749 136448 137683 138824
54426 138824 139638 140377 141347 142476 143418 144012 144479 145159 146151 147228 148069 148613 149102 149674 149939 149280 147681 145990
54408 145990 145101 145018 145011 144626 144244 144598 145923 147707 149175 149945 150282 150771 151781 153220 154699 155826 156394
54391 156394 156452 156292 156250 156459 156810 157119 157258 157134 156705 156077 155444 154882 154308 153699 153262 153316 153998 155050 155873
54372 155873 155942 155331 154698 154564 154759 154826 154771 154946 155347 155611 155790 156453 157741 158923 159340 159325 159633 160297 160712
54353 160712 160670 160669 161140 161886 162423 162461 161920 160809 159341 157930 156886 156207 155754 155480 155397 155475 155633 155744 155555
$$ packed form
54476A39856N27l45o86k98M56J027J205J146J130J367J819K114J804R09k3m64
54460A51544l65j0L20M59L82K57K57K33p5n36p60p76r47j128o12O28J403P66n61
54441A50479j099n92j61n53j246j516j496j723k161k229j560l94O99J235J141
54426A38824Q14P39R70J129R42N94M67O80R92J077Q41N44M89N72K65o59j599j691
54408A45990q89q3pl85l82L54J325J784J468P70L37M89J010J439J479J127N68
54391A56394N8j60m2K09L51L09J39j24m29o28o33n62n74o09m37N4O82J052Q23
54372A55873O9o11o33j34J95O7n5J75M01K64J79O63J288J182M17j5L08O64M15
54353A60712m2jM71P46N37L8n41j111j468j411j044o79m53k74q3P8J58J11j89
$$ plain form
54334 155555 154752 153224 151274 149486 148281 147578 146935 146102 145379 145242 145678 146142 146195 145925 145663 145597 145801 146319
54316 146319 146939 147162 146698 145815 144936 144137 143337 142701 142399 142165 141537 140499 139506 138949 138951 139537 140544 141474 141969
54297 141969 142407 143506 145218 146550 146627 145577 144248 143452 143540 144228 144709 144373 143603 143374 143992 144749 145016 144964
54279 144964 144855 144349 143173 141934 141487 141789 142121 142253 142610 143358 144084 144490 144707 144777 144526 144247 144846 146756
54261 146756 149082 150390 150230 149456 149097 149344 149726 149946 150330 151409 153218 155061 156084 156032 155351 154550 153683
54244 153683 152567 151355 150623 150831 151799 152802 153186 152917 152499 152344 152293 151834 150725 149189 147517 145741 143900
54227 143900 142403 141759 141957 142412 142678 143012 143987 145675 147457 148643 149010 148696 147860 146678 145524 144829 144789
54210 144789 145369 146492 147967 149240 149624 148927 147596 146103 144475 142687 141202 140679 141192 142133 142952 143635
$$ packed form
54334A55555q03j528j950j788j205p03o43q33p23j37M36M64N3k70k62o6K04N18
54316A46319O20K23m64q83q79p99q00o36l02k34o28j038r93n57KN86J007R30M95
54297A41969M38J099J712J332P7j050j329p96Q8O88M81l36p70k29O18P57K67n2
54279A44964j09n06j176j239m47L02L32J32L57P48P26M06K17P0k51k79N99J910
54261A46756K326J308j60p74l59K47L82K20L84J079J809J843J023n2o81q01q67
54244A53683j116j212p32K08R68J003L84k69m18j55n1m59j109j536j672j776j841
54227A43900j497o44J98M55K66L34R75J688J782J186L67l14q36j182j154o95m0
54210A44789N80J123J475J273L84o97j331j493j628j788j485n23N13R41Q19O83
$$ plain form
54194 143635 144364 145080 145581 145828 145832 145383 144233 142583 141099 140325 140225 140456 140877 141551 142323 142742 142583 142194
54176 142194 142100 142373 142670 142798 142874 142907 142582 141679 140411 139171 138138 137369 137018 137093 137176 136824 136185 135828 135938
54157 135938 136106 136047 136099 136710 137750 138707 139408 140147 141127 142054 142419 141989 140908 139503 138176 137489 138078 140145
54139 140145 142973 145167 145684 144693 143317 142572 142696 143381 144309 145320 146338 147330 148263 149012 149513 150023 150948
54122 150948 152182 152932 152565 151457 150634 150601 150976 151293 151690 152539 153705 154533 154485 153601 152403 151532 151364 151747
54104 151747 152113 152027 151630 151401 151522 151678 151532 151094 150562 149990 149429 149237 149853 151177 152493 153244 153701 154554
54086 154554 155916 157067 157257 156500 155420 154551 154037 153875 154111 154738 155654 156808 158217 159765 161214 162619
54070 162619 164565 167681 171840 176129 179782 183005 186660 191196 196139 200655 204354 207283 209293 209776
$$ packed form
54194A43635P29P16N01K47Mm49j150j650j484p74j00K31M21O74P72M19j59l89
54176A42194r4K73K97J28P6L3l25r03j268j240j033p69l51P5Q3l52o39l57J10
54157A35938J68n9N2O11J040R57P01P39R80R27L65m30j081j405j327o87N89K067
54139A40145K828K194N17r91j376p45J24O85R28J011J018R92R33P49N01N10R25
54122A50948J234P50l67j108q23l3L75L17L97Q49J166Q28m8q84j198q71j68L83
54104A51747L66q6l97k29J21J56j46m38n32n72n61j92O16J324J316P51M57Q53
54086A54554J362J151J90p57j080q69n14j62K36O27R16J154J409J548J449J405
54070A62619J946L116M159M289L653L223L655M536M943M516L699K929K010M83
$$ plain form
54056 209776 208184 204693 200248 195984 192596 190132 188250 186666 185391 184575 184226 184264 184778 186012 187930
54041 187930 190074 192057 194103 196809 200418 204596 208964 213564 218640 224194 229938 235576 240838 245311
54027 245311 248515 250321 251180 251828 252769 254112 255774 257590 259171 259898 259357 257795 255943 254313 252823
54012 252823 251125 249076 246708 243973 240792 237326 233920 230737 227644 224448 221021 217226 213015 208788
53998 208788 205323 203096 201780 200669 199507 198627 198349 198588 199196 200354 202322 204893 207391 209318 210868
53983 210868 212660 215058 217848 220492 222496 223549 223552 222710 221486 220245 218938 217206 214737 211408 207264
53968 207264 202633 198207 194671 192137 190157 188393 187023 186354 186280 186387 186455 186617 187136 188187 189763 191582
53952 191582 193202 194427 195503 196704 197903 198878 199919 201695 204490 207918 211504 215168 219008 222983
$$ packed form
54056B09776j592l491m445m264l388k464j882j584j275q16l49L8N14J234J918
54041A87930K144J983K046K706L609M178M368M600N076N554N744N638N262M473
54027B45311L204J806Q59O48R41J343J662J816J581P27n41j562j852j630j490
54012B52823j698k049k368k735l181l466l406l183l093l196l427l795m211m227
53998B08788l465k227j316j111j162q80k78K39O08J158J968K571K498J927J550
53983B10868J792K398K790K644K004J053Lq42j224j241j307j732k469l329m144
53968B07264m631m426l536k534j980j764j370o69p4J07O8J62N19J051J576J819
53952A91582J620J225J076J201J199R75J041J776K795L428L586L664L840L975
$$ plain form
53938 222983 227061 231400 236085 240873 245480 249953 254482 258972 263109 266801 270301 274006 278377 283988
53924 283988 291224 299895 309463 319728 330996 343494 356962 370923 384899 398054 409012 416552
53912 416552 420432 421254 419700 416315 411885 407342 403030 398463 393052 386808 380136 373335 366656 360589
53898 360589 355621 351739 348479 345384 342121 338241 333273 327161 320373 313494 306930 300937 295563 290438
53884 290438 284962 278925 272760 267078 262153 257901 254063 250256 246180 241984 238194 235062 232313 229694
53870 229694 227370 225433 223415 220858 218081 215743 213782 211464 208540 205712 203738 202601 201757 200773 199448
53855 199448 197755 195997 194751 194294 194309 194285 193968 193314 192405 191663 191661 192320 192682 191946 190450 189113 188223 187375
53837 187375 186406 185716 185604 185936 186544 187446 188528 189523 190476 191690 193007 193701 193418 192790 192661 193097 193654 194281
$$ packed form
53938B22983M078M339M685M788M607M473M529M490M137L692L500L705M371N611
53924B83988P236Q671R568J0265J1268J2498J3468J3961J3976J3155J0958P540
53912D16552L880Q22j554l385m430m543m312m567n411o244o672o801o679o067
53898C60589m968l882l260l095l263l880m968o112o788o879o564n993n374n125
53884B90438n476o037o165n682m925m252l838l807m076m196l790l132k749k619
53870B29694k324j937k018k557k777k338j961k318k924k828j974j137q44r84j325
53855A99448j693j758j246m57J5k4l17o54r09p42kO59L62p36j496j337q90q48
53837A87375r69o90j12L32O08R02J082R95R53J214J317O94k83o28j29M36N57O27
$$ plain form
53819 194281 195315 196686 197815 198463 199163 200506 202342 204028 205346 206856 209307 212886 217123 221415 225547
53804 225547 229704 234122 238802 243489 247814 251466 254384 256791 258970 261051 263156 265614 268668 271911
53790 271911 274471 275969 276936 277998 278976 279262 278787 278047 277285 276256 274801 273076 271072 268502 265412 262305
53774 262305 259320 255854 251512 246990 243332 240612 238022 235131 232267 229650 226932 223900 220986 218633
53760 218633 216590 214286 211600 208877 206441 204484 203185 202504 202035 201470 201084 201336 202154 203093 204062 205281
53744 205281 206480 206844 206042 204749 203787 203215 202751 202653 203520 205321 207275 208767 209911 211079 212301 213374
53728 213374 214287 215253 216460 217966 219762 221781 223915 226091 228265 230282 231835 232697 232961 233016 233333 234272
53712 234272 235986 238442 241558 245226 249103 252536 255018 256758 258426 260244 261714 262512 263237 264841 267549
$$ packed form
53819A94281J034J371J129O48P00J343J836J686J318J510K451L579M237M292M132
53804B25547M157M418M680M687M325L652K918K407K179K081K105K458L054L243
53790B71911K560J498R67J062R78K86m75p40p62j029j455j725k004k570l090l107
53774B62305k985l466m342m522l658k720k590k891k864k617k718l032k914k353
53760B18633k043k304k686k723k436j957j299o81m69n65l86K52Q18R39R69J219
53744B05281J199L64q02j293r62n72m64r8Q67J801J954J492J144J168J222J073
53728B13374R13R66J207J506J796K019K134K176K174K017J553Q62K64N5L17R39
53712B34272J714K456L116L668L877L433K482J740J668J818J470P98P25J604K708
$$ plain form
53697 267549 270865 274480 278483 282600 286018 288379 290491 293416 297094 300415 302548 303638 304149 304085 303245
53682 303245 301889 300689 300020 299629 299073 298273 297454 296665 295585 293973 292140 290765 290206 290211 290395 290750 291414
53665 291414 292118 292279 291647 290545 289368 288158 286869 285758 285201 285183 285213 284771 283792 282772 282478 283322 284880
53648 284880 286148 286471 286127 285838 285927 286197 286451 286685 286819 286668 286394 286643 287996 290379 293129 295500 297119
53631 297119 298217 299554 301843 304998 308139 310522 312339 314359 316996 320076 323419 327167 331352 335515
53617 335515 339121 342288 345791 350259 355561 361073 366358 371377 376171 380709 385193 390182 396105 402740
53603 402740 409487 416060 422549 428745 433859 437219 438998 439951 440518 440451 439320 437099 434194 431009 427590
53588 427590 423722 419384 415030 411241 408068 404938 401384 397721 394776 392981 391957 390932 389447 387627
$$ packed form
53697B67549L316L615M003M117L418K361K112K925L678L321K133J090N11o4q40
53682C03245j356j200o69l91n56q00q19p89j080j612j833j375n59NJ84L55O64
53665B91414P04J61o32j102j177j210j289j111n57j8L0m42r79j020k94Q44J558
53648B84880J268L23l44k89Q9K70K54K34J34j51k74K49J353K383K750K371J619
53631B97119J098J337K289L155L141K383J817K020K637L080L343L748M185M163
53617C35515L606L167L503M468N302N512N285N019M794M538M484M989N923O635
53603D02740O747O573O489O196N114L360J779R53N67o7j131k221k905l185l419
53588D27590l868m338m354l789l173l130l554l663k945j795j024j025j485j820
$$ plain form
53574 387627 385937 384693 383736 382599 381035 379299 377840 376861 376310 376186 376589 377422 378264 378650 378484 378142 378142
53557 378142 378565 378839 378338 377330 377014 378338 381020 384045 386903 389795 392776 395377 397348 399222 401757
53542 401757 405104 408922 413109 417966 423651 429790 435816 441583 447569 454488 462741 472260 482808 494214
53528 494214 506185 518150 529745 541471 554434 569205 585186 601307 617165 633306 650598
53517 650598 669531 689918 711021 732134 753294 775421 799606 826266 854968 884781 914643
53506 914643 943745 971951 999764 1027622 1055337 1082468 1109052 1135613 1162525 1189608 1216241
53495 1216241 1241616 1265172 1287251 1309206 1332255 1356137 1379374 1400952 1421238 1441170 1461111
53484 1461111 1480862 1500224 1519077 1537186 1554467 1571283 1588066 1604733 1620743 1635548 1648559
$$ packed form
53574C87627j690j244r57j137j564j736j459r79n51j24M03Q33Q42L86j66l42%
53557C78142M23K74n01j008l16J324K682L025K858K892K981K601J971J874K535
53542D01757L347L818M187M857N685O139O026N767N986O919Q253R519J0548J1406
53528D94214J1971J1965J1595J1726J2963J4771J5981J6121J5858J6141J7292
53517F50598J8933K0387K1103K1113K1160K2127K4185K6660K8702K9813K9862
53506I14643K9102K8206K7813K7858K7715K7131K6584K6561K6912K7083K6633
53495A216241K5375K3556K2079K1955K3049K3882K3237K1578K0286J9932J9941
53484A461111J9751J9362J8853J8109J7281J6816J6783J6667J6010J4805J3011
$$ plain form
53473 1648559 1658877 1665577 1668408 1667892 1664668 1658937 1650509 1639130 1624816 1608202 1590497 1572679 1554720
53460 1554720 1535920 1516025 1495418 1474133 1451354 1426446 1400098 1373808 1348374 1323406 1298368
53449 1298368 1273523 1249580 1226699 1204210 1181353 1158150 1135530 1114681 1096364 1080844 1068259
53438 1068259 1058669 1051709 1046530 1042347 1038918 1036340 1034705 1034237 1035465 1038745 1043718 1049720 1056761 1065622
53424 1065622 1076883 1090326 1105467 1122220 1140747 1160992 1182734 1205911 1230582 1256702 1284234
53413 1284234 1313390 1344443 1377310 1411554 1446885 1483547 1522168 1563201 1606517 1651654 1698543
53402 1698543 1747864 1800417 1856240 1914693 1975231 2037560 2101028 2164690 2228341 2292833 2358818
53391 2358818 2425700 2492388 2558539 2624191 2688565 2750298 2808907 2865096 2919362 2971000 3018788
$$ packed form
53473A648559J0318O700K831n16l224n731q428j1379j4314j6614j7705j7818j7959
53460A554720j8800j9895k0607k1285k2779k4908k6348k6290k5434k4968k5038
53449A298368k4845k3943k2881k2489k2857k3203k2620k0849j8317j5520j2585
53438A068259r590o960n179m183l429k578j635m68J228L280M973O002P041Q861
53424A065622J1261J3443J5141J6753J8527K0245K1742K3177K4671K6120K7532
53413A284234K9156L1053L2867L4244L5331L6662L8621M1033M3316M5137M6889
53402A698543M9321N2553N5823N8453O0538O2329O3468O3662O3651O4492O5985
53391B358818O6882O6688O6151O5652O4374O1733N8609N6189N4266N1638M7788
$$ plain form
53380 3018788 3062134 3101283 3136851 3169356 3198678 3223786 3243452 3257388 3266179 3269958 3267813 3258751
53368 3258751 3242554 3219176 3187932 3148054 3099774 3044387 2983504 2918700 2851472 2782949 2713709
53357 2713709 2644288 2575520 2507967 2441479 2375971 2312271 2251338 2192834 2135409 2078470 2022770
53346 2022770 1969039 1916902 1865615 1815187 1766192 1718911 1673326 1629754 1588876 1551084 1516167
53335 1516167 1483770 1453938 1427146 1403852 1383999 1366890 1351553 1337255 1323646 1310488 1297456
53324 1297456 1284303 1271110 1258284 1246266 1235234 1225091 1215861 1208048 1202275 1198445 1195580 1192889
53312 1192889 1190759 1190307 1192113 1195903 1201328 1208392 1216979 1226587 1236874 1248131 1260949 1275737 1292809
53299 1292809 1312552 1335074 1359869 1386167 1413577 1442224 1472364 1504024 1536892 1570393 1603917
$$ packed form
53380C018788M3346L9149L5568L2505K9322K5108J9666J3936Q791L779k145r062
53368C258751j6197k3378l1244l9878m8280n5387o0883o4804o7228o8523o9240
53357B713709o9421o8768o7553o6488o5508o3700o0933n8504n7425n6939n5700
53346B022770n3731n2137n1287n0428m8995m7281m5585m3572m0878l7792l4917
53335A516167l2397k9832k6792k3294j9853j7109j5337j4298j3609j3158j3032
53324A297456j3153j3193j2826j2018j1032j0143r230p813n773l830k865k691
53312A192889k130m52J806L790N425P064Q587R608J0287J1257J2818J4788J7072
53299A292809J9743K2522K4795K6298K7410K8647L0140L1660L2868L3501L3524
$$ plain form
53288 1603917 1637020 1669267 1699967 1728393 1754311 1777984 1799547 1818733 1835338 1849536 1861397
53277 1861397 1870419 1875860 1877357 1874994 1868994 1859568 1846847 1830776 1811347 1789079 1764850 1738995
53265 1738995 1711021 1680536 1647996 1614084 1578880 1542242 1504592 1466562 1428258 1389663 1351464
53254 1351464 1314434 1278146 1241466 1204518 1168994 1136064 1104943 1074137 1043216 1012601 982380
53243 982380 952363 922901 894595 867348 840557 814229 789125 765733 743884 723528 705222
53232 705222 689477 676044 664121 652977 642244 631987 622627 614377 606560 597885 587719 576696
53220 576696 565767 555015 543768 531581 518601 505136 491438 477944 465281 453866 443710
53209 443710 434632 426425 418811 411505 404386 397314 389861 381636 373001 365007 358319 352491 346586 340236
$$ packed form
53288A603917L3103L2247L0700K8426K5918K3673K1563J9186J6605J4198J1861
53277A861397R022N441J497k363o000r426j2721j6071j9429k2268k4229k5855
53265A738995k7974l0485l2540l3912l5204l6638l7650l8030l8304l8595l8199
53254A351464l7030l6288l6680l6948l5524l2930l1121l0806l0921l0615l0221
53243I82380l0017k9462k8306k7247k6791k6328k5104k3392k1849k0356j8306
53232G05222j5745j3433j1923j1144j0733j0257r360q250p817q675j0166j1023
53220E76696j0929j0752j1247j2187j2980j3465j3698j3494j2663j1415j0156
53209D43710r078q207p614p306p119p072p453q225q635p994o688n828n905o350
$$ plain form
53195 340236 333756 327467 321383 315466 309748 304207 298940 294430 291181 288910 286565 283408 279757 276422
53181 276422 273760 271638 269989 268817 267723 266031 263609 261189 259619 258968 258576 257863 256864 255979 255369 254757
53165 254757 253835 252776 252100 251955 251796 251002 249647 248349 247438 246665 245750 244813 244102 243598 243113 242524 241731 240650
53147 240650 239479 238727 238686 239035 239198 238938 238301 237214 235564 233619 231980 231124 231270 232578 235008 237911
53131 237911 240270 241563 242121 242534 243027 243548 244055 244445 244515 244302 244209 244565 245297 246292 247716 249534 251022 251341
53113 251341 250531 249498 249056 249353 250078 250670 250316 248441 245487 242732 241014 239989 238889 237586 236457 235546
53097 235546 234400 232695 230624 228642 227159 226464 226617 227286 227903 228128 228088 228159 228592 229361 230279 231213 232164 233098
53079 233098 233728 233666 232891 231860 231069 230631 230457 230597 231108 231653 231638 230853 229776 229053 228797 228557 227977 227373 227437
$$ packed form
53195C40236o480o289o084n917n718n541n267m510l249k271k345l157l651l335
53181B76422k662k122j649j172j094j692k422k420j570o51l92p13r99q85o10o12
53165B54757r22j059o76j45j59p94j355j298r11p73r15r37p11n04m85n89p93j081
53147B40650j171p52m1L49J63k60o37j087j650j945j639q56J46J308K430K903
53131B37911K359J293N58M13M93N21N07L90P0k13r3L56P32R95J424J818J488L19
53113B51341q10j033m42K97P25N92l54j875k954k755j718j025j100j303j129r11
53097B35546j146j705k071j982j483o95J53O69O17K25m0P1M33P69R18R34R51R34
53079B33098O30o2p75j031p91m38j74J40N11N45j5p85j077p23k56k40n80o04O4
$$ plain form
53060 227437 228356 229441 229859 229571 229195 229045 228779 228103 227235 226442 225631 224749 224140 224025 224055 223942 224078 224829 225566
53041 225566 225260 223947 222724 222220 221944 221264 220194 218935 217489 216153 215633 216072 216619 216546 216293 216724 217845
53024 217845 218988 219927 221014 222359 223544 224200 224305 224008 223640 223809 224919 226605 228124 229226 230176 230987
53008 230987 231277 230973 230581 230515 230593 230349 229530 228227 226870 226142 226436 227292 227799 227663 227466 227721 228249 228709 229174
52989 229174 229753 230098 229848 229321 229199 229608 229961 229764 229252 229127 229833 231139 232394 233240 234035 235347 237049
52972 237049 238368 239039 239941 242043 245080 247906 250069 252263 255059 257874 259684 260315 260446 260484 260048 258610
52956 258610 256247 253512 250902 248681 246974 245704 244502 243013 241324 239877 238927 238327 237849 237347 236502
52941 236502 234836 232367 229958 228521 227994 227571 226863 226334 226449 226993 227460 227714 227835 227650 226896 225761 224808
$$ packed form
53060B27437R19J085M18k88l76j50k66o76q68p93q11q82o09j15L0j13J36P51P37
53041B25566l06j313j223n04k76o80j070j259j446j336n20M39N47p3k53M31J121
53024B17845J143R39J087J345J185O56J05k97l68J69J110J686J519J102R50Q11
53008B30987K90l04l92o6P8k44q19j303j357p28K94Q56N07j36j97K55N28M60M65
52989B29174N79L45k50n27j22M09L53j97n12j25P06J306J255Q46P95J312J702
52972B37049J319O71R02K102L037K826K163K194K796K815J810O31J31L8m36j438
52956B58610k363k735k610k221j707j270j202j489j689j447r50o00m78n02q45
52941B36502j666k469k409j437n27m23p08n29J15N44M67K54J21j85p54j135r53
$$ plain form
52924 224808 224330 224100 223795 223376 222941 222426 221682 220827 220314 220580 221647 223123 224612 226015 227344 228356 228563
52907 228563 227711 226115 224492 223454 223096 222890 222040 220148 217626 215358 213940 213459 213849 215075 216862 218604
52891 218604 219850 220641 221197 221527 221584 221595 221900 222570 223407 224216 224830 225045 224787 224279 223810 223470 223315 223626 224600
52872 224600 225900 226931 227618 228528 230116 232120 233822 234715 234828 234632 234721 235378 236320 236995 237097 236677 235813
52855 235813 234525 233086 231999 231471 231122 230440 229333 228025 226615 225077 223588 222509 221945 221470 220422
52840 220422 218450 215839 213395 211937 211748 212431 213283 213799 213831 213476 213021 212946 213703 215296 217127 218401 218709
52823 218709 218251 217537 216937 216502 216087 215563 214927 214262 213608 212903 212178 211772 212197 213533 215116 216164 216733 217691
52805 217691 219592 221880 223481 223865 223198 221723 219540 216971 214575 212597 210771 208849 206970 205312 203709
$$ packed form
52924B24808m78k30l05m19m35n15p44q55n13K66J067J476J489J403J329J012K07
52907B28563q52j596j623j038l58k06q50j892k522k268j418m81L90J226J787J742
52891B18604J246P91N56L30N7J1L05O70Q37Q09O14K15k58n08m69l40j55L11R74
52872B24600J300J031O87R10J588K004J702Q93J13j96Q9O57R42O75J02m20q64
52855B35813j288j439j087n28l49o82j107j308j410j538j489j079n64m75j048
52840B20422j972k611k444j458j89O83Q52N16L2l55m55p5P57J593J831J274L08
52823B18709m58p14o00m35m15n24o36o65o54p05p25m06M25J336J583J048N69R58
52805B17691J901K288J601L84o67j475k183k569k396j978j826j922j879j658j603
$$ plain form
52790 203709 201969 200354 199374 199179 199479 199986 200570 201018 201065 200869 201164 202591 204961 207416 209308 210643 211689
52773 211689 212483 212941 213195 213465 213632 213272 212229 210897 209816 209181 208890 208807 208727 208289 207229 205779 204577
52756 204577 204127 204440 205122 205710 205982 206048 206104 206116 205966 205979 206906 209060 211767 214025 215482 216395 216984 217459 218403
52737 218403 220292 222625 224327 225226 226307 228200 230228 231501 232232 233192 234353 234898 234406 233303 232182
52722 232182 231279 230614 230087 229371 228153 226544 224970 223662 222571 221620 220675 219457 217938 216696 216324 216581
52706 216581 216727 216625 216849 217626 218400 218648 218482 218201 217880 217780 218490 220089 221677 222353 222360 222667 223680 224979
52688 224979 226130 227097 227919 228575 229260 230238 231223 231359 230010 227392 224356 221772 220130 219357 218922 218366 217851
52671 217851 217872 218453 219053 219416 220029 221398 223275 225048 226582 228132 229579 230423 230633 230896 231765 233001 234147
$$ packed form
52790B03709j740j615r80j95L00N07N84M48M7j96K95J427K370K455J892J335J046
52773B11689P94M58K54K70J67l60j043j332j081o35k91q3q0m38j060j450j202
52756B04577m50L13O82N88K72O6N6J2j50J3R27K154K707K258J457R13N89M75R44
52737B18403J889K333J702Q99J081J893K028J273P31R60J161N45m92j103j121
52722B32182r03o65n27p16j218j609j574j308j091r51r45j218j519j242l72K57
52706B16581J46j02K24P77P74K48j66k81l21j00P10J599J588O76PL07J013J299
52688B24979J151R67Q22O56O85R78R85J36j349k618l036k584j642p73m35n56n15
52671B17851K1N81O00L63O13J369J877J773J534J550J447Q44K10K63Q69J236J146
$$ plain form
52654 234147 235372 237232 239728 242111 243668 244304 244243 243553 242242 240561 238907 237489 236273 235209 234354
52639 234354 233757 233333 232851 232061 230982 230045 229781 230253 231020 231719 232368 232932 232989 232285 231352 231036 231453 231920 231873
52620 231873 231352 230520 229360 228087 227348 227572 228414 229190 229620 229853 230091 230486 231175 232065 232810 233300 233875 234734
52602 234734 235480 235724 235821 236357 237073 237056 235997 234592 233544 232900 232626 233097 234461 235982 236722 236744 237078 238528
52584 238528 240882 243309 245162 246301 246927 247281 247430 247349 247228 247549 248599 249954 250716 250386 249356 248431 247942
52567 247942 247469 246435 244846 243385 242748 243008 243682 244265 244523 244351 243735 242998 242768 243380 244407 245027 244765
52550 244765 243760 242459 241337 240812 241012 241530 241693 241243 240559 240120 239980 239920 239895 240090 240592 241244 241763 241929
52532 241929 241749 241606 242017 242991 243710 243248 241663 240007 239133 238864 238592 238319 238605 239591 240663 241227 241423 241870
$$ packed form
52654B34147J225J860K496K383J557O36o1o90j311j681j654j418j216j064q55
52639B34354n97m24m82p90j079r37k64M72P67O99O49N64N7p04r33l16M17M67m7
52620B31873n21q32j160j273p39K24Q42P76M30K33K38L95O89Q90P45M90N75Q59
52602B34734P46K44R7N36P16j7j059j405j048o44k74M71J364J521P40K2L34J450
52584B38528K354K427J853J139O26L54J49q1j21L21J050J355P62l30j030r25m89
52567B47942m73j034j589j461o37K60O74N83K58j72o16p37k30O12J027O20k62
52550B44765j005j301j122n25K00N18J63m50o84m39j40o0k5J95N02O52N19J66
52532B41929j80j43M11R74P19m62j585j656q74k69k72k73K86R86J072N64J96M47
$$ plain form
52514 241870 242968 244683 246726 248676 250115 251018 251925 253397 255357 257222 258660 259793 260635 260791 260005
52499 260005 258648 257293 256012 254567 253163 252508 252885 253574 253525 252459 251031 250030 249707 249867 250243 250598
52483 250598 250733 250601 250377 250205 250065 250032 250478 251654 253146 254193 254654 255270 256713 258715 260443 261503 262213
52466 262213 262997 263958 265060 266324 267678 268899 269868 270754 271801 273013 274138 274846 274830 273853 271818 268879
52450 268879 265478 262231 259604 257554 255594 253344 250935 248767 247057 245840 245207 245143 245176 244706 243796 243255
52434 243255 243760 245137 246667 247763 248177 247856 246960 245914 245211 245167 245846 247033 248250 249096 249774 250983 253078
52417 253078 255576 257742 259476 261313 263761 266934 270745 275154 280233 286217 293466 302189 312201 322950
52403 322950 333578 342868 349463 352432 351605 347329 340234 331402 322288 313982 306718 300419 295346 291714
$$ packed form
52514B41870J098J715K043J950J439R03R07J472J960J865J438J133Q42J56p86
52499B60005j357j355j281j445j404o55L77O89m9j066j428j001l23J60L76L55
52483B50598J35j32k24j72j40l3M46J176J492J047M61O16J443K002J728J060P10
52466B62213P84R61J102J264J354J221R69Q86J047J212J125P08j6r77k035k939
52450B68879l401l247k627k050j960k250k409k168j710j217o33o4L3m70r10n41
52434B43255N05J377J530J096M14l21q96j046p03m4O79J187J217Q46O78J209K095
52417B53078K498K166J734J837K448L173L811M409N079N984P249Q723J0012J0749
52403C22950J0628R290O595K969q27m276p095q832r114q306p264o299n073l632
$$ plain form
52389 291714 288992 286310 283560 281461 280476 280229 280159 280215 280563 281079 281473 281753 282277 283454 285523 288420 291745
52372 291745 294980 297915 300836 304295 308691 313905 319195 323652 326997 329742 332322 334441 335691 336448
52358 336448 337423 338496 338866 338403 338029 338509 339655 341030 342608 344226 345149 345020 344780 345848 348580 352170
52342 352170 355879 359712 363950 368601 373452 378307 383223 388802 396065 405603 416909 428916 441118
52329 441118 453814 467408 481940 497254 513205 529655 546624 564398 583202 602789 622677
52318 622677 642683 662882 683188 703359 723309 742885 761444 778279 793583 808420 823527
52307 823527 838543 852582 865123 876188 886072 895185 903727 911287 917121 921112 924061 926709 928840
52294 928840 929743 929163 927254 923821 918296 910592 901577 892501 884178 876772 870115 864088 858809 854590 851707
$$ packed form
52389B91714k722k682k750k099r85k47p0N6L48N16L94K80N24J177K069K897L325
52372B91745L235K935K921L459M396N214N290M457L345K745K580K119J250P57
52358C36448R75J073L70m63l74M80J146J375J578J618R23j29k40J068K732L590
52342C52170L709L833M238M651M851M855M916N579P263R538J1306J2007J2202
52329D41118J2696J3594J4532J5314J5951J6450J6969J7774J8804J9587J9888
52318F22677K0006K0199K0306K0171J9950J9576J8559J6835J5304J4837J5107
52307H23527J5016J4039J2541J1065R884R113Q542P560N834L991K949K648K131
52294I28840R03n80j909l433n525p704r015r076q323p406o657o027n279m219k883
$$ plain form
52279 851707 850270 850354 852078 855375 859870 865281 871946 880609 891588 904356 918045 932131 946475
52266 946475 960948 975292 989272 1002682 1015189 1026480 1036685 1046399 1056033 1065287 1073506 1080548
52254 1080548 1086950 1093147 1098802 1103168 1105905 1107266 1107530 1106635 1104475 1101241 1097139 1091809 1084416 1074511
52240 1074511 1062657 1049936 1036887 1023228 1008780 994310 981040 969439 958973 949162 940344 933071
52228 933071 927110 921555 915856 910367 905872 902878 901328 900707 900363 900005 899919 900581 902106 904309 907182 910912
52212 910912 915422 920325 925468 931106 937311 943556 949197 954104 958459 962210 965187 967685 970430 973792
52198 973792 977413 980793 983961 987257 990654 993658 995937 997727 999556 1001743 1004325 1007210 1010169 1012785
52184 1012785 1014688 1015811 1016098 1014996 1011625 1005615 997578 988640 979734 971403 963901 957140 950810 944864
$$ packed form
52279H51707j437Q4J724L297M495N411O665Q663J0979J2768J3689J4086J4344
52266I46475J4473J4344J3980J3410J2507J1291J0205R714R634R254Q219P042
52254A080548O402O197N655M366K737J361K64q95k160l234m102n330p393r905
52240A074511j1854j2721j3049j3659j4448j4470j3270j1601j0466r811q818p273
52228I33071n961n555n699n489m495k994j550o21l44l58q6O62J525K203K873L730
52212I10912M510M903N143N638O205O245N641M907M355L751K977K498K745L362
52198I73792L621L380L168L296L397L004K279J790J829K187K582K885K959K616
52184A012785J903J123K87j102l371o010q037q938q906q331p502o761o330n946
$$ plain form
52170 944864 939749 935894 933188 931257 930022 929587 929728 930027 930459 931432 933193 935558 938243 941109 944003
52155 944003 946733 949221 951423 953124 954207 955107 956518 958571 960725 962519 963967 965144 966032 967041 969073
52140 969073 972537 976594 979856 981715 982746 984043 986476 990399 995764 1002595 1011413 1022928 1037174 1053348
52126 1053348 1070783 1089690 1110609 1133522 1157934 1183495 1210063 1237369 1265173 1293524 1322238
52115 1322238 1350216 1375944 1398785 1419310 1438278 1455751 1471363 1484894 1496246 1505201 1511561 1515390
52103 1515390 1516880 1516175 1513587 1509840 1505697 1501254 1495793 1488530 1479444 1469314 1458982 1448722 1438310
52090 1438310 1427432 1415842 1403288 1389698 1375503 1361509 1348345 1336249 1325431 1316386 1309650 1305478
52078 1305478 1303856 1304667 1307722 1312851 1320092 1329537 1340916 1353604 1367171 1381594 1396834 1412560 1428467
$$ packed form
52170I44864n115l855k706j931j235m35J41K99M32R73J761K365K685K866K894
52155I44003K730K488K202J701J083R00J411K053K154J794J448J177Q88J009K032
52140I69073L464M057L262J859J031J297K433L923N365O831Q818J1515J4246J6174
52126A053348J7435J8907K0919K2913K4412K5561K6568K7306K7804K8351K8714
52115A322238K7978K5728K2841K0525J8968J7473J5612J3531J1352Q955O360L829
52103A515390J490p05k588l747m143m443n461p263r086j0130j0332j0260j0412
52090A438310j0878j1590j2554j3590j4195j3994j3164j2096j0818r045o736m172
52078A305478j622Q11L055N129P241R445J1379J2688J3567J4423J5240J5726J5907
$$ plain form
52065 1428467 1444406 1459951 1474368 1487395 1499561 1511223 1521721 1530074 1536151 1540470 1543135 1543836
52053 1543836 1542764 1540652 1537729 1533351 1526887 1518431 1508381 1496753 1483216 1467537 1449818 1430513
52041 1430513 1410243 1389339 1367663 1345259 1323078 1302501 1284098 1267336 1251575 1236826 1223417
$$ packed form
52065A428467J5939J5545J4417J3027J2166J1662J0498Q353O077M319K665P01
52053A543836j072k112k923m378o464q456j0050j1628j3537j5679j7719j9305
52041A430513k0270k0904k1676k2404k2181k0577j8403j6762j5761j4749j3409
$$ [...]
##END NTUPLES=NMR SPECTRUM
##END=
