##TITLE=AC1464_TOLI813270_7819174_qUB2r8xD2C
##JCAMPDX= 6.0         $$ Bruker NMR JCAMP-DX V2.0
##DATA TYPE= NMR SPECTRUM
##DATA CLASS= NTUPLES
##ORIGIN= BRUKER
##OWNER= Administrator
$$ 1.72 TOPSPIN		Version 2.1
$$ 2013-05-01 00:03:35.946 -0700  Administrator@X
$$ Compression mode = diff/dup
##.OBSERVE FREQUENCY= 400.02188249412
##.OBSERVE NUCLEUS= ^1H
##.ACQUISITION MODE= SIMULTANEOUS (DQD)
##.ACQUISITION SCHEME= undefined
##.AVERAGES= 8
##.DIGITISER RES= 22
##SPECTROMETER/DATA SYSTEM= spect
##.PULSE SEQUENCE= zg30
##.SOLVENT NAME= COFFEE_meoh
##.SHIFT REFERENCE= INTERNAL, COFFEE_meoh, 1, 14.98509
##AUDIT TRAIL= $$ (NUMBER, WHEN, WHO, WHERE, PROCESS, VERSION, WHAT)
$$ ##TITLE= Audit trail, TOPSPIN		Version 2.1
$$ ##JCAMPDX= 5.01
$$ ##ORIGIN= Bruker BioSpin GmbH
$$ ##OWNER= Administrator
$$ $$ E:\/data/COFFEE/nmr/AC1464_TOLI813270_7819174_qUB2r8xD2C/10/pdata/1/auditp.txt
$$ ##AUDIT TRAIL=  $$ (NUMBER, WHEN, WHO, WHERE, PROCESS, VERSION, WHAT)
(   1,<2013-05-01 00:03:29.243 -0700>,<Administrator>,<X>,<go>,<TOPSPIN 2.1>,
      <created by zg
	started at 2013-05-01 00:02:23.461 -0700,
	POWCHK enabled, PULCHK disabled,
       configuration hash MD5:
       F7 49 AB AC A2 8D 51 76 73 8D C1 9A A6 38 9F DE
       data hash MD5: 64K
       D1 94 88 3E 24 80 9A E6 30 F9 25 E6 82 BA 99 22>)
(   2,<2013-05-01 00:03:32.149 -0700>,<Administrator>,<X>,<proc1d>,<TOPSPIN 2.1>,
      <Start of raw data processing
       efp LB = 0 FT_mod = 6 PKNL = 1 PHC0 = 0 PHC1 = 0 SI = 32K 
       data hash MD5: 32K
       F5 0C 0C CF 14 64 43 18 77 EA 36 CA 25 56 EE 06>)
(   3,<2013-05-01 00:03:32.461 -0700>,<Administrator>,<X>,<proc1d>,<TOPSPIN 2.1>,
      <pk PHC0 = 119.5972 PHC1 = 0 
       data hash MD5: 32K
       85 1E 31 09 F2 DE 90 10 80 22 A3 93 4D 53 BB 92>)
(   4,<2013-05-01 00:03:32.586 -0700>,<Administrator>,<X>,<proc1d>,<TOPSPIN 2.1>,
      <abs ABSG = 1 
       data hash MD5: 32K
       0D 5B A5 FA 02 A2 8D 3F 87 F6 9F 29 0A 6F 40 A4>)
(   5,<2013-05-01 00:03:32.680 -0700>,<Administrator>,<X>,<proc1d>,<TOPSPIN 2.1>,
      <abs ABSG = 2 
       data hash MD5: 32K
       52 29 44 25 94 9D FC 8D 68 1C B4 B1 8B 5B 67 D0>)
(   6,<2013-05-01 00:03:32.758 -0700>,<Administrator>,<X>,<proc1d>,<TOPSPIN 2.1>,
      <abs ABSG = 3 
       data hash MD5: 32K
       BF CB 8C C7 D5 3A A0 36 F0 1A 34 B5 B0 46 E8 86>)
(   7,<2013-05-01 00:03:32.821 -0700>,<Administrator>,<X>,<proc1d>,<TOPSPIN 2.1>,
      <abs ABSG = 4 
       data hash MD5: 32K
       1C 88 F4 33 07 CF 93 44 CD 08 AE A7 45 03 1A 09>)
(   8,<2013-05-01 00:03:32.868 -0700>,<Administrator>,<X>,<proc1d>,<TOPSPIN 2.1>,
      <abs ABSG = 5 
       data hash MD5: 32K
       A1 9E C3 49 2A 97 EF 30 72 44 8A 43 C5 A2 93 FD>)
$$ ##END=
$$ 
$$ $$ hash MD5
$$ $$ 55 7B 68 8E D6 27 8C 62 C6 24 C4 55 70 5B 33 F8
##$RELAX= 
##$RELAX= 
##$RELAX= 
##$RELAX= 
##$RELAX= 
##$RELAX= 
##$RELAX= 
$$ Bruker specific parameters
$$ --------------------------
##$DU= <E:\>
##$EXPNO= 10
##$NAME= <AC1464_TOLI813270_7819174_qUB2r8xD2C>
$$ [...]
##$TP= (0..7)
150 150 150 150 150 150 150 150
##$TP07= 0
##$TPNAME0= <>
##$TPNAME1= <>
##$TPNAME2= <>
##$TPNAME3= <>
##$TPNAME4= <>
##$TPNAME5= <>
##$TPNAME6= <>
##$TPNAME7= <>
##$TPOAL= (0..7)
0.5 0.5 0.5 0.5 0.5 0.5 0.5 0.5
##$TPOFFS= (0..7)
0 0 0 0 0 0 0 0
##$TUNHIN= 0
##$TUNHOUT= 0
##$TUNXOUT= 0
##$USERA1= <user>
##$USERA2= <user>
##$USERA3= <user>
##$USERA4= <user>
##$USERA5= <user>
##$V9= 5
##$VALIST= <valist>
##$VCLIST= <CCCCCCCCCCCCCCC>
##$VD= 0
##$VDLIST= <DDDDDDDDDDDDDDD>
##$VPLIST= <PPPPPPPPPPPPPPP>
##$VTLIST= <TTTTTTTTTTTTTTT>
##$WBST= 1024
##$WBSW= 4
##$XGAIN= (0..3)
0 0 0 0
##$XL= 0
##$YL= 0
##$YMAX_a= 632571
##$YMIN_a= -577991
##$ZGOPTNS= <>
##$ZL1= 120
##$ZL2= 120
##$ZL3= 120
##$ZL4= 120
##$ABSF1= 14.98509
##$ABSF2= -5.573092
##$ABSG= 5
##$ABSL= 3
##$ALPHA= 0
##$AQORDER= 0
##$ASSFAC= 0
##$ASSFACI= 0
##$ASSFACX= 0
##$ASSWID= 0
##$AUNMP= <proc_prof1d_extract_pilot.lims>
##$AXLEFT= 0
##$AXNAME= <>
##$AXNUC= <1H>
##$AXRIGHT= 0
##$AXTYPE= 0
##$AXUNIT= <>
##$AZFE= 0.1
##$AZFW= 0.1
##$BCFW= 0
##$BC_mod= 0
##$BYTORDP= 0
##$COROFFS= 0
##$CY= 15
##$DATMOD= 1
##$DC= 0
##$DFILT= <>
##$DTYPP= 0
##$F1P= 0
##$F2P= 0
##$FCOR= 0.5
##$FTSIZE= 32768
##$FT_mod= 6
##$GAMMA= 0
##$GB= 0
##$INTBC= 1
##$INTSCL= 1
##$ISEN= 128
##$LB= 0
##$LEV0= 0
##$LPBIN= 0
##$MAXI= 10000
##$MC2= 0
##$MEAN= 0
##$ME_mod= 0
##$MI= 0
##$NCOEF= 0
##$NC_proc= -8
##$NLEV= 6
##$NOISF1= 0
##$NOISF2= 0
##$NSP= 0
##$NTH_PI= 0
##$NZP= 0
##$OFFSET= 14.98509
##$PC= 1
##$PHC0= 119.5972
##$PHC1= 0
##$PH_mod= 1
##$PKNL= yes
##$PPARMOD= 0
##$PPDIAG= 0
##$PPIPTYP= 0
##$PPMPNUM= 2147483647
##$PPRESOL= 1
##$PSCAL= 4
##$PSIGN= 0
##$PYNMP= <proc.py>
##$REVERSE= no
##$SF= 400.02
##$SI= 32768
##$SIGF1= 0
##$SIGF2= 0
##$SINO= 400
##$SIOLD= 32768
##$SPECTYP= <>
##$SREGLST= <1H.CDCl3>
##$SSB= 0
##$STSI= 32768
##$STSR= 0
##$SW_p= 8223.68421052631
##$SYMM= 0
##$S_DEV= 0
##$TDeff= 65536
##$TDoff= 0
##$TI= <>
##$TILT= no
##$TM1= 0
##$TM2= 0
##$TOPLEV= 0
##$USERP1= <user>
##$USERP2= <user>
##$USERP3= <user>
##$USERP4= <user>
##$USERP5= <user>
##$WDW= 1
##$XDIM= 32768
##$YMAX_p= 461188411
##$YMIN_p= -740000
##$CURPLOT= <Network HP LaserJet P1505>
##$CURPRIN= <$Network HP LaserJet P1505>
##$DFORMAT= <normdp>
##$LAYOUT= <+/1D_H.xwp>
##$LFORMAT= <normlp>
##$PFORMAT= <normpl>
##$SURQMSG= 1
$$ End of Bruker specific parameters
$$ ---------------------------------
##NTUPLES= NMR SPECTRUM
##VAR_NAME=  FREQUENCY,     SPECTRUM/REAL,   SPECTRUM/IMAG
##SYMBOL=    X,             R,               I
##VAR_TYPE=  INDEPENDENT,   DEPENDENT,       DEPENDENT
##VAR_FORM=  AFFN,          ASDF,            ASDF
##VAR_DIM=   32768,         32768,           32768
##UNITS=     HZ,            ARBITRARY UNITS, ARBITRARY UNITS
##FACTOR=    0.250966925370066, 1,           1
##FIRST=     8223.43324360094, -78588,       154990
##LAST=      0,             -114480,         111358
##MIN=       0,             -740000,         0
##MAX=       8223.43324360094, 461188411,    0
$$ Real data points
##PAGE= N=1
##DATA TABLE= (X++(R..R)), XYDATA
$$ [...]
19552h8023k61990i3197G8075b07488c9808l49988j4933D2993M2214a85219A31312
$$ -88023 -350013 -93197 78075 -207488 -39808 -389796 -404729 42993 85207 -185219 131312
19540B10241q8643K3472h6314Q776B52475A4523a93192a6861B1127b06576k8359
$$ 210241 121598 145070 -86314 -77538 252475 14523 -193192 -16861 21127 -206576 -234935
19529b34935A18538d3673A37520d6352j02443N2323j3759q2096B5607J43810b00252
$$ -234935 118538 -43673 137520 -46352 -148795 -96472 -110231 -192327 25607 169417 -200252
19517A35845E048a50172o0433j90390J13396g2075a8038I9765B4689K0874E785
$$ 135845 5048 -150172 -210605 -400995 -287599 -72075 -18038 99765 24689 45563 5785
19505a08137l7136m0547A4339k495a63745B2547q264b50073A0737f4536N055A02172
$$ -108137 -145273 -185820 14339 11844 -163745 22547 14283 -250073 10737 -64536 -59481 102172
19492c26686i0867n8271A38090L4647a36353b703A8235c3423C6197O3223B7834
$$ -326686 -90867 -149138 138090 172737 -136353 -2703 18235 -33423 36197 99420 27834
19480a62463j21933A07265J7589b14687G4645D271b88149f8972k97097D142b2430
$$ -162463 -284396 107265 124854 -214687 74645 4271 -288149 -68972 -366069 4142 -22430
19468G552g8120A49094P8159d892j43336G1377h4176A03234b63911d3851n0714
$$ 7552 -78120 149094 227253 -4892 -148228 71377 -84176 103234 -263911 -43851 -94565
19457i4565J6121P628j00271A3583b04270I837b46573G4017k4439d62073a9661
$$ -94565 -78444 -70816 -171087 13583 -204270 9837 -246573 74017 49578 -462073 -19661
19445A50999a89110A4014K1751l28Q2029A6142f1990j96457e4998k55869C29954
$$ 150999 -189110 14014 35765 35437 117466 16142 -61990 -258447 -54998 -310867 329954
19433a7299H9031c17196J57666A40485b87543a00463A82002a07255A90475e860
$$ -17299 89031 -317196 -159530 140485 -287543 -100463 182002 -107255 190475 -5860
19422f9708M088j02271n0341g362l54338a14232m47735B2868J42683b60582j2990
$$ -69708 -65620 -167891 -218232 -7362 -361700 -114232 -561967 22868 165551 -260582 -273572
19411b73572K3162K4148A10314E2658J45632E6442e3604B742K13471d8154k69465
$$ -273572 -250410 -226262 110314 52658 198290 56442 -53604 2742 216213 -48154 -317619
19400c17619k11612O6317A622a39517M2609A52535c3142m9084j09142L2332I4993
$$ -317619 -529231 -462914 1622 -139517 -96908 152535 -33142 -82226 -191368 -159036 94993
19388c09360a37724k22462G3667i9415C943b16943n0112P6260Q7480A76512a4073
$$ -309360 -137724 -360186 73667 -99415 3943 -216943 -267055 -190795 -103315 176512 -14073
19376a06245N1013f14H7926b1613j98890p7700E5438A8705b80683B55692b95231
$$ -106245 -55232 -614 87926 -21613 -220503 -298203 55438 18705 -280683 255692 -295231
19364g6701K6875E0790d08457J38730A15015a95117L4378C35383e7775m4162A8178
$$ -76701 -49826 50790 -408457 -269727 115015 -195117 -160739 335383 -57775 -101937 18178
19352b49420c3002n8128L0170R439j1271B29855a41318k37798h715D321d5258
$$ -249420 -33002 -91130 -60960 -51521 -62792 229855 -141318 -379116 -8715 4321 -45258
19340B73280g3398k05799I5774e5099I915N2038d8615o3606p315j20965B8163
$$ 273280 -73398 -279197 95774 -55099 9915 61953 -48615 -112221 -119536 -240501 28163
19328B5509d4138A96805a03945A62871b1529j59269p931k85925a162j41777A78143
$$ 25509 -44138 196805 -103945 162871 -21529 -180798 -188729 -474654 -1162 -142939 178143
19316e3643l20826a61670L6266e177p7641o275k97897d8056A47879a64349N6349
$$ -53643 -374469 -161670 -125404 -5177 -82818 -89093 -386990 -48056 147879 -164349 -108000
19305a08000q773j27190B59826a18869D66167e5151e843p2561C70331a3012j08983
$$ -108000 -116773 -243963 259826 -118869 466167 -55151 -5843 -78404 370331 -13012 -121995
19294a21995b0844A27616A7139H020a32151q197O1177l69481R9162D1342f2509
$$ -121995 -20844 127616 17139 8020 -132151 -140348 -79171 -448652 -349490 41342 -62509
19282b74861E5154c41660g3204k51551A22652h4617C23566c3786j32222B72219
$$ -274861 55154 -341660 -73204 -324755 122652 -84617 323566 -33786 -166008 272219
19271B51053a94998d0308F632b75658h4232N611r75K1811j21978l3499l4515d2341
$$ 251053 -194998 -40308 6632 -275658 -84232 -78621 -79596 -57785 -179763 -213262 -247777 -42341
19258A6780b49222A212L73351a68626M9398D1743a1216j36233n4029K7315k51543
$$ 16780 -249222 1212 374563 -168626 -119228 41743 -11216 -147449 -201478 -174163 -425706
19247d25706e1039j1883l9915C84977g2583R434n5794o7171d1215j46017a8125
$$ -425706 -51039 -62922 -102837 384977 -72583 -63149 -118943 -186114 -41215 -187232 -18125
19235B1608K06142a76480j61433R6853J07514F138J6322a17508k0825N033C83841
$$ 21608 227750 -176480 -337913 -241060 -133546 6138 22460 -117508 -138333 -133300 383841
19223g2593j0984c7708D9188a20859k97510A14033b25484J12248a79B0121h3674
$$ -72593 -83577 -37708 49188 -120859 -418369 114033 -225484 -113236 -179 20121 -83674
19211i3259I1141D0015J6023l14P1007b16633A12221C2530i3181j23380f7712
$$ -93259 91141 40015 56038 55724 126731 -216633 112221 32530 -93181 -216561 -67712
19199A77741J16265D4900f4599I4451b4645j7983k19468b6883l09860a48410l02411
$$ 177741 294006 44900 -64599 94451 -24645 -42628 -262096 -26883 -336743 -148410 -450821
19188d50821A65946c9215r0570o8907i5098L0325K376l7181M267b5453n0969F7843
$$ -450821 165946 -39215 -129785 -198692 -95098 -64773 -62397 -99578 -95311 -25453 -76422 67843
19175B86893c23839j93371b5145A15727b20211E7818J34819L5118a39350b5386
$$ 286893 -323839 -517210 -25145 115727 -220211 57818 192637 227755 -139350 -25386
19164A00208B308e8601j33715e1537k06721i8264j74456a07861g968C10111f5731
$$ 100208 2308 -58601 -192316 -51537 -258258 -98264 -272720 -107861 -7968 310111 -65731
19152b8783k68555A02768h207o0766B8888e1239j42055O5601m2113J980M2649
$$ -28783 -297338 102768 -8207 -68973 28888 -51239 -193294 -127693 -169806 -167826 -125177
19141a25177q6196e4682j27406C35327g0605E3431b85582A59171E5901e3979b2803
$$ -125177 -211373 -54682 -182088 335327 -70605 53431 -285582 159171 55901 -53979 -22803
19129a4696A62239B7044K83133a05531j51892B06559n6777J59807a81102A6004
$$ -14696 162239 27044 310177 -105531 -257423 206559 149782 309589 -181102 16004
19118E6656O9616b2694C0586K05101e05505d6636o9088g653l899A20920a16188
$$ 56656 126272 -22694 30586 235687 -505505 -46636 -115724 -7653 -11552 120920 -116188
19106c9394A00214a48972B25017h366I88L41320b28435a08744j45237B96850b67881
$$ -39394 100214 -148972 225017 -8366 988 342308 -228435 -108744 -253981 296850 -267881
19094A40289b9903a0077B8292b01565A96981g1071o3692j77181a14236n9156N3148
$$ 140289 -29903 -10077 28292 -201565 196981 -71071 -134763 -311944 -114236 -173392 -120244
19083a20244q1229b9778J717l1034A03863b36436h7692A57611G6924C380a17605
$$ -120244 -201473 -29778 -28061 -59095 103863 -236436 -87692 157611 76924 3380 -117605
19071a24811k3554r1588Q5908A84448B7857n510L76161E4315a44786o1949d0555
$$ -124811 -148365 -239953 -154045 184448 27857 22347 398508 54315 -144786 -206735 -40555
19059D6190O6785J4183e7654j15366j9908B23923n4096D9550a03060B8874b8936
$$ 46190 112975 127158 -57654 -173020 -192928 223923 169827 49550 -103060 28874 -28936
19047G5828B6824g0052I3a43891J842C95283A58857d7963E3414L9758k7727f2751
$$ 75828 26824 -70052 93 -143891 -142049 395283 158857 -47963 53414 93172 65445 -62751
19034A80325K18786c86291B52087J66140a5108C42771k1907e62015F7962N06254
$$ 180325 399111 -386291 252087 418227 -15108 342771 320864 -562015 67962 574216
19024E74216A6270b49701a5767p2705c5213A38906g9596p1060B18414a79438h8931
$$ 574216 16270 -249701 -15767 -88472 -35213 138906 -79596 -150656 218414 -179438 -88931
19012G0798d05383f8612C84094A06703O4446k4375a40793C24115a28736E7964
$$ 70798 -405383 -68612 384094 106703 171149 146774 -140793 324115 -128736 57964
19001A42781a55554B64948a60855B07237b4550D3710D494b69695F6388N970c02062
$$ 142781 -155554 264948 -160855 207237 -24550 43710 4494 -269695 66388 72358 -302062
18989b72436h1645c0849E3591c7479B501h5795E383i4049l22009B06724i7513
$$ -272436 -81645 -30849 53591 -37479 2501 -85795 5383 -94049 -416058 206724 -97513
18977a96434A65955M5893b20287B1718a39554A1084a09262A67034J45662C6560
$$ -196434 165955 211848 -220287 21718 -139554 11084 -109262 167034 312696 36560
18966C3246d29537B20771d104C5645f8140j96670E1846K5622K65565j64185h5045
$$ 33246 -429537 220771 -4104 35645 -68140 -264810 51846 77468 343033 178848 -85045
18954a90469A1527O9876c0367C8122d22534K01475J02796B48900n752b86668a216
$$ -190469 11527 81403 -30367 38122 -422534 -221059 -118263 248900 243148 -286668 -1216
18942A10562b32129E1630i3255L3078k61772a8511p1228k24732O840a34598B06408
$$ 110562 -232129 51630 -93255 -60177 -321949 -18511 -89739 -314471 -307631 -134598 206408
18930a30092n7236R2674c6532E3697b37654j24310f6781k06813A05309c3416o9203
$$ -130092 -187328 -94654 -36532 53697 -237654 -361964 -66781 -273594 105309 -33416 -102619
18919a02619L0028j58145a08270J8629l01467d0424j56282J1850j11715f9042
$$ -102619 -72591 -230736 -108270 -89641 -391108 -40424 -196706 -184856 -296571 -69042
18908d5028j05854A26017b71803e0886p812j23079A15497h0104e532H5978P0350
$$ -45028 -150882 126017 -271803 -50886 -58698 -181777 115497 -80104 -5532 85978 156328
18897A56328p5288Q4037b00472A35131A4666K46552a82949E813c4816j493I1367
$$ 156328 81040 165077 -200472 135131 14666 261218 -182949 5813 -34816 -36309 91367
18885a38297q004E145b02536l6227A03699a58182A41098I061L3364a13571F4481
$$ -138297 -146301 5145 -202536 -238763 103699 -158182 141098 9061 42425 -113571 64481
18873B86072C2789g2628j4717A2130P8036a60526k376N4869G2642h4559c0277
$$ 286072 32789 -72628 -87345 12130 90166 -160526 -162902 -108033 72642 -84559 -30277
18861b11435O2498C55091A37009e6971B7923d2674A8055b93804A16580L1746A7097
$$ -211435 -148937 355091 137009 -56971 27923 -42674 18055 -293804 116580 148326 17097
18849a04285A74213h8201j44436B56227A3454b01721j89731a06730j07202A85420
$$ -104285 174213 -88201 -232637 256227 13454 -201721 -391452 -106730 -213932 185420
18838B61096a0254E8729c39098A12248a37573J2812B42098C044a31027n5418C3718
$$ 261096 -10254 58729 -339098 112248 -137573 -124761 242098 3044 -131027 -186445 33718
18826B26402I1667K44461a2934j25682O8052p9980B97K31836g7826I6550b65827
$$ 226402 91667 336128 -12934 -138616 -70564 -150544 297 232133 -77826 96550 -265827
18814a91870L5887A16731P7053I6075a04262C85721A18174B9507a5440I4795e0499
$$ -191870 -155983 116731 193784 96075 -104262 385721 118174 29507 -15440 94795 -50499
18802G1197e063C02836F5591b33538C2001O9296l854f64C7959d81549b40174O3463
$$ 71197 -5063 302836 65591 -233538 32001 101297 97443 -664 37959 -481549 -240174 -176711
18790a76711N1743b8838B20020b01108E6305J25797g1105B35111E8960a05856
$$ -176711 -124968 -28838 220020 -201108 56305 182102 -71105 235111 58960 -105856
18779a91114R3251q848B4742c15253b5773p3128K8132J117q4712L7879L5393A37190
$$ -191114 -97863 -106711 24742 -315253 -25773 -98901 -70769 -69652 -154364 -116485 -81092 137190
18766c10579g6628j53686J14042j64615C95320H0012d1050A55461a53405a8866
$$ -310579 -76628 -230314 -116272 -280887 395320 80012 -41050 155461 -153405 -18866
18755a07097j0096J1042b616o0814j28127q7629A41814l1719A2286a24195C4905
$$ -107097 -117193 -106151 -2616 -63430 -191557 -279186 141814 110095 12286 -124195 34905
18743a36343J5171j17295R5941k19166o3963B46147K8905a690k46959B364J4237
$$ -136343 -121172 -238467 -142526 -361692 -425655 246147 275052 -1690 -248649 2364 16601
18732A6601c29323J30977m3173A528a79237C0615i1148k06105q3015f5493C346
$$ 16601 -329323 -198346 -241519 1528 -179237 30615 -91148 -297253 -380268 -65493 3346
18720a27391j40798A29605b54165j3405A69923m6930a7739B89613a46040e9752
$$ -127391 -268189 129605 -254165 -267570 169923 122993 -17739 289613 -146040 -59752
18709A6226P2753a29807B68834B8924b29403a12344E1014c18763e9217j12749
$$ 16226 88979 -129807 268834 28924 -229403 -112344 51014 -318763 -59217 -171966
18699a71966j23720H6825a69229H344K00632A01466a4889k32750h3398o3877k22648
$$ -171966 -295686 86825 -169229 8344 208976 101466 -14889 -247639 -83398 -147275 -369923
18688c69923A50847b9571r152j74229A2620a86940Q8321r507k30474A93333f5028
$$ -369923 150847 -29571 -38723 -212952 12620 -186940 -98619 -108126 -338600 193333 -65028
18676c33073a64779N5331j17439J08048j04416j63296B50388C9835d5319l42179
$$ -333073 -164779 -109448 -226887 -118839 -223255 -386551 250388 39835 -45319 -387498
18666c87498a67435E2049a76707C3014M3544j3998E044a87091b6741n5616p341
$$ -387498 -167435 52049 -176707 33014 76558 62560 5044 -187091 -26741 -82357 -89698
18655h9698J4708I5659b01787q9716F8168Q1788a02425J0497k20110A38994f7746
$$ -89698 -74990 95659 -201787 -291503 68168 149956 -102425 -91928 -312038 138994 -67746
18643a68676b9617j92973A28241a85290B83133B7513a00423j64701H1950a13929
$$ -168676 -29617 -222590 128241 -185290 283133 27513 -100423 -265124 81950 -113929
18632a50130K5376I0727f5890B24131o8738a13232B95448j0465b38237p438e9954
$$ -150130 -124754 90727 -65890 224131 155393 -113232 295448 284983 -238237 -245675 -59954
18620a93421e430n87333A41996a72303k13160a9839k41862A5480L7277M0011h3324
$$ -193421 -5430 -592763 141996 -172303 -385463 -19839 -261701 15480 52757 92768 -83324
18608a68897A15695d2336i306k3273a5440A25548a38491A8155K82406j32758g588
$$ -168897 115695 -42336 -9306 -32579 -15440 125548 -138491 18155 300561 167803 -7588
18596b53581J21939A17962c08515c6995l4079j25418j08389J32350r2184a20466
$$ -253581 -131642 117962 -308515 -36995 -71074 -196492 -304881 -172531 -264715 -120466
18585d8114A1764i9577a173C22132a95623A75314b32118H6978L1904D7919j3873
$$ -48114 11764 -99577 -1173 322132 -195623 175314 -232118 86978 118882 47919 34046
18574C4046a30705J2890M3818j91916D0946c31611g5499H4537a24571I564K28838
$$ 34046 -130705 -117815 -73997 -265913 40946 -331611 -75499 84537 -124571 9564 238402
18563B38402f3010j2296n0772o4864H1622j2719a18957e1103j89838A41579r781
$$ 238402 -63010 -75306 -126078 -190942 81622 68903 -118957 -51103 -240941 141579 131798
18552A31798h6464d2551j94463c7258F4136g7044o0040B04669f0087A04413h8740
$$ 131798 -86464 -42551 -237014 -37258 64136 -77044 -137084 204669 -60087 104413 -88740
18540a24822j00603A35302h6917q7793J5171A93156a52431l6854C5231N8961a68380
$$ -124822 -225425 135302 -86917 -174710 -159539 193156 -152431 -189285 35231 94192 -168380
18528a11990o850k1807e511j59370A72444g2081k40440P4750R174B18632a52783
$$ -111990 -118840 -140647 -5511 -164881 172444 -72081 -312521 -237771 -228597 218632 -152783
18516a66308b4917F7338J65888e5897j55040h4811C65866e7714j49625J7082j6603
$$ -166308 -24917 67338 233226 -55897 -210937 -84811 365866 -57714 -207339 -190257 -206860
18505b06860h1555B06115c1158j89177H2519b71631h2026L649C7719K4493a66224
$$ -206860 -81555 206115 -31158 -220335 82519 -271631 -82026 -78377 37719 62212 -166224
18493a27718q3692P4451j62939A55648a32977L1431B32863F2580O2324a0279n8615
$$ -127718 -211410 -136959 -299898 155648 -132977 -101546 232863 62580 124904 -10279 -68894
18482f8894j16254A65526a60902a113j55812e2475E3314b50003A29755a44949
$$ -68894 -185148 165526 -160902 -1113 -156925 -52475 53314 -250003 129755 -144949
18471a39261H8515c7607r1013i636k87109h4887b4846k83330a10184L4677C26312
$$ -139261 88515 -37607 -128620 -9636 -296745 -84887 -24846 -308176 -110184 -75507 326312
18459b21754J00746A12090J37510b27104A66326a90921f9965j39342Q2322E3144
$$ -221754 -121008 112090 249600 -227104 166326 -190921 -69965 -209307 -126985 53144
18448b09762H0893b52566g7974B6386a22372k5189A52637a2087j25001L6302f755
$$ -209762 80893 -252566 -77974 26386 -122372 -147561 152637 -12087 -137088 -100786 -6755
18436b87107A18015J01194b2762j00542i914C2832b79906A49439C581a1787G211
$$ -287107 118015 219209 -22762 -123304 -9914 32832 -279906 149439 3581 -11787 7211
18424C9898J72015P89h1999A14970a49884o1227A30743A0449a94862f8669B4163
$$ 39898 211913 212702 -81999 114970 -149884 -211111 130743 10449 -194862 -68669 24163
18412b1644B6273J19680q000a24386B11893b37871a8980k3452G6245J57306e8761
$$ -21644 26273 145953 137953 -124386 211893 -237871 -18980 -42432 76245 233551 -58761
18400c1629A16559K34240c04014f7041C6746b27123A30886a22293A85214a15951
$$ -31629 116559 350799 -304014 -67041 36746 -227123 130886 -122293 185214 -115951
18389A40972c15266J36516g5512o9994j12086c4806H6470a77658A10453N9565
$$ 140972 -315266 -178750 -75512 -145506 -257592 -34806 86470 -177658 110453 170018
18379A70018J00793F6081a61199c7318g630A25268a24160l6831G3593i7361j95091
$$ 170018 270811 66081 -161199 -37318 -7630 125268 -124160 -160991 73593 -97361 -292452
18368b92452a45404j86591A84634a5738C15170m2234C2501M3082b04828r5524
$$ -292452 -145404 -331995 184634 -15738 315170 272936 32501 75583 -204828 -300352
18358c00352a27593B13197r5504B4278J90624b09497A15622a08114j55258A23895
$$ -300352 -127593 213197 117693 24278 214902 -209497 115622 -108114 -263372 123895
18347d6592A47988K08066a81209c2101A22430k7592P4051b60205A22131L5703
$$ -46592 147988 356054 -181209 -32101 122430 94838 168889 -260205 122131 157834
18337A57834L37629A04030a30333B73968d9254A65986m9732a13578b2005B02894
$$ 157834 495463 104030 -130333 273968 -49254 165986 116254 -113578 -22005 202894
18326a21146A4949b31565J11289p5121O2798o2027B0060J4690O4074a79939B58848
$$ -121146 14949 -231565 -120276 -195397 -132599 -194626 20060 34750 98824 -179939 258848
18314a12159B71465e5491p2920c803E2741P8815a24018g112j48434r4219E1953
$$ -112159 271465 -55491 -128411 -3803 52741 131556 -124018 -7112 -155546 -249765 51953
18302B6635a40243b3360D526c45908A31645a36708E5436f5894H6227g6143j35282
$$ 26635 -140243 -23360 4526 -345908 131645 -136708 55436 -65894 86227 -76143 -211425
18291b11425A5944c06554a29634j08049i2472K8986r7728m4734A91345a23829
$$ -211425 15944 -306554 -129634 -237683 -92472 -63486 -161214 -205948 191345 -123829
18280g5020A45346e7680A01146k6499J39091a84458h4838D3311Q1420b25390D525
$$ -75020 145346 -57680 101146 74647 213738 -184458 -84838 43311 124731 -225390 4525
18268i7939l2036O4813k07224A50744b7860o6162a7421N705j0672g152L136A81221
$$ -97939 -129975 -65162 -272386 150744 -27860 -94022 -17421 -11716 -22388 -7152 -4016 181221
18255i6231j32364H9813a49001Q907c0683A06453L8202e0549m494p8474M4082
$$ -96231 -228595 89813 -149001 -140094 -30683 106453 144655 -50549 -55043 -133517 -89435
18244h9435j72737E1525a18613C0561i3833B12198c64419H4504j1197j5206b33012
$$ -89435 -262172 51525 -118613 30561 -93833 212198 -364419 84504 73307 58101 -233012
18232I5572M4003P7404H6242J10658C5187a96110M6512C3475a07688r5281g0060
$$ 95572 139575 216979 86242 196900 35187 -196110 -149598 33475 -107688 -202969 -70060
18220A2906K7736g8936a0839j56187b7649k9445j87819R3117j10201A95000A348
$$ 12906 40642 -78936 -10839 -167026 -27649 -57094 -244913 -151796 -261997 195000 1348
18208h2528j92283F6077K18522c25977i0352F2706d05987I1346b35359D58J0103
$$ -82528 -274811 66077 284599 -325977 -90352 62706 -405987 91346 -235359 458 10561
18197A0561a87193c616m14839B17490c2592q0291B7943a63645g3085L134J3705
$$ 10561 -187193 -3616 -418455 217490 -32592 -112883 27943 -163645 -73085 -69951 -56246
18186e6246a0761E9609d09421C03294d7500A39438a67449a6220F08J3142O8630
$$ -56246 -10761 59609 -409421 303294 -47500 139438 -167449 -16220 608 13750 82380
18175H2380O7398f665m55096D6378J32205C0756e9577A93895n4101a31856d6449
$$ 82380 149778 -6665 -461761 46378 178583 30756 -59577 193895 139794 -131856 -46449
18163A33242a8850k9617k25458B33882L0975D6384Q3677a56290C4208a54567A45531
$$ 133242 -18850 -48467 -273925 233882 264857 46384 130061 -156290 34208 -154567 145531
18151b84057i3547d1536j724k51458J41002G1177h1956n6539O2704r6591M6776
$$ -284057 -93547 -41536 -43260 -294718 -153716 71177 -81956 -138495 -75791 -172382 -125606
18140a25606b4382A68204i57B58575a82277J826P3121E952i9263J4705a8597k85110
$$ -125606 -24382 168204 -957 258575 -182277 -180451 -107330 5952 -99263 -84558 -18597 -303707
18128c03707J20062B92065D4360J59389J33374D3621J31045d01371B05722A00405
$$ -303707 -183645 292065 44360 203749 337123 43621 174666 -401371 205722 100405
18117h79j28471A64969h7384C40599d0439B11681a83225B15674c9362C7180h5113
$$ -879 -129350 164969 -87384 340599 -40439 211681 -183225 215674 -39362 37180 -85113
18105A91909A4453h3276A94999e58880A57323J01344m9012k1228c05421H1466
$$ 191909 14453 -83276 194999 -558880 157323 258667 209655 188427 -305421 81466
18094f3455A10455b3919J838j39430C1271a54538A84224b77170J27593d6039C9167
$$ -63455 110455 -23919 -22081 -161511 31271 -154538 184224 -277170 -149577 -46039 39167
18082b11673D3499a89871D4546h4573c4846I515K7630c77055A76619d3185m6634
$$ -211673 43499 -189871 44546 -84573 -34846 9515 37145 -377055 176619 -43185 -89819
18071h9819A84704a87022H4662a75884p5755a5429m1945l27681A39703j1462a61661
$$ -89819 184704 -187022 84662 -175884 -251639 -15429 -57374 -385055 139703 128241 -161661
18059a10987j66014H9529a6615A6367e3845A45624a45359g915m6357A51408h7750
$$ -110987 -277001 89529 -16615 16367 -53845 145624 -145359 -7915 -54272 151408 -87750
18047B2666b44739J22136C2180f7671k7591B2472J48946a71424M635L3386D33430
$$ 22666 -244739 -122603 32180 -67671 -95262 22472 171418 -171424 -166789 -133403 433430
18035a91577E7422M0817P5819c30451a42574j39468Q3821Q5294C32363a94923
$$ -191577 57422 98239 174058 -330451 -142574 -282042 -198221 -112927 332363 -194923
18024E0343e3601b4298k17388d9179A61347A8685a69932G5656e9601k96201Q9389
$$ 50343 -53601 -24298 -241686 -49179 161347 18685 -169932 75656 -59601 -355802 -266413
18013b66413g6698B48453f4616B26614f2697j14784f9266B78891a89062E3357
$$ -266413 -76698 248453 -64616 226614 -62697 -177481 -69266 278891 -189062 53357
18002b10153d2j91891a2473j67995d2153A58349a93740A57060E9620d39726B53222
$$ -210153 -42 -191933 -12473 -180468 -42153 158349 -193740 157060 59620 -439726 253222
17990g32H3263b9077F6218J8731K20731b58630B73440F0852a87597b6420H9571
$$ -732 83263 -29077 66218 84949 305680 -258630 273440 60852 -187597 -26420 89571
17978A69593B805J27323K910b29291J01136A03654a51607f6811q5158F4407a11546
$$ 169593 2805 130128 133038 -229291 -128155 103654 -151607 -66811 -151969 64407 -111546
17966g6627C3232A3977Q1127K0182G782a98568A05298d8147k7938r0363A13447
$$ -76627 33232 13977 95104 115286 7782 -198568 105298 -48147 -76085 -166448 113447
17954b4078a05l24996G822c5420k5823A6517P0028a26830j11994q5779A5153N810
$$ -24078 -105 -325101 7822 -35420 -61243 16517 86545 -126830 -238824 -324603 15153 20963
17942B0963b50811a12616A73617J0293i6773E2542a44596B58913f5794A59651
$$ 20963 -250811 -112616 173617 183910 -96773 52542 -144596 258913 -65794 159651
17931a91688O5584B4206P660c2803l22468d8776k30748h0558o5530o3114C9162
$$ -191688 -126104 24206 31866 -32803 -355271 -48776 -279524 -80558 -146088 -209202 39162
17919A38279O436a46258A27185K1534e3170k5215j3303B7855M6793L16485i7004
$$ 138279 144715 -146258 127185 148719 -53170 -78385 -91688 27855 74648 391133 -97004
17907C70207a64255C55154D1347F236J20838b7467Q52A25271b54103A64378a6015
$$ 370207 -164255 355154 41347 6236 127074 -27467 -26615 125271 -254103 164378 -16015
17895A25519Q9234c7373k50762B33831o1422a12584B22920g0936H1396b13979
$$ 125519 214753 -37373 -288135 233831 172409 -112584 222920 -70936 81396 -213979
17884a2377q5443I4241j1842j8986j6804K64219a48659f4368A53132J3301m2835
$$ -12377 -97820 94241 82399 63413 46609 310828 -148659 -64368 153132 166433 123598
17873A23598J47782b82543I5890b2285k27871A54051A6927a07689A43045E5159
$$ 123598 271380 -282543 95890 -22285 -250156 154051 16927 -107689 143045 55159
17862A70047g8159A26738D6450c30188A29393b59338C298K86843A12146j1806
$$ 170047 -78159 126738 46450 -330188 129393 -259338 3298 290141 112146 100340
17852A00340K241a62851j5546A65777j1383b5822G3181b20075A58715d6395m5042
$$ 100340 102581 -162851 -178397 165777 154394 -25822 73181 -220075 158715 -46395 -91437
17841i1437m1947A49705i0543C05353j9716a22640d7328J2346m8514G5969f0358
$$ -91437 -133384 149705 -90543 305353 285637 -122640 -47328 -34982 -83496 75969 -60358
17829A66662b10334f7963R590A13736b08358A21697d3558B93704i2430A25828
$$ 166662 -210334 -67963 -58373 113736 -208358 121697 -43558 293704 -92430 125828
17818A87381J13317a78162C43596c491D1229J891K50178j6439b1194N306A64234
$$ 187381 300698 -178162 343596 -3491 41229 43120 293298 276859 -21194 -15888 164234
17806h6246I4598d9755j87405J16212C3982K80981A12583A4043e9883H4354a09799
$$ -86246 94598 -49755 -237160 -120948 33982 314963 112583 14043 -59883 84354 -109799
17794a61315A72191l6135b17563g510p2476A20383c30656J04438h5268E6867A6389
$$ -161315 172191 136056 -217563 -7510 -79986 120383 -330656 -226218 -85268 56867 16389
17782a52521A1925a23954B04799F0175A4722L3234e3119A11656f2492G2086a9657
$$ -152521 11925 -123954 204799 60175 14722 47956 -53119 111656 -62492 72086 -19657
17770F9213O600C4304J83765K2218F624a65280D41011B4881J02987b05172l544
$$ 69213 75813 34304 218069 240287 6624 -165280 441011 24881 127868 -205172 -208716
17759b08716C17357e6871i825D5846a14063A28948a15915M2573a5061G4336a56070
$$ -208716 317357 -56871 -9825 45846 -114063 128948 -115915 -73342 -15061 74336 -156070
17747a29327d8030a3664C9767O0682j1825c51113A8791a40532k8378j35201B1208
$$ -129327 -48030 -13664 39767 100449 88624 -351113 18791 -140532 -168910 -304111 21208
17735a55752A42445a00586B40069A18417e9170j55669a7004j2359A30190f8852
$$ -155752 142445 -100586 240069 118417 -59170 -214839 -17004 -29363 130190 -68852
17724b13819d9889a2757m6531j50944C93725c24995H0203P9803l7117C8184J76186
$$ -213819 -49889 -12757 -59288 -210232 393725 -324995 80203 160006 122889 38184 214370
17713B14370b56791d5593j82533h1942c9904A6300J41746a37909K3338A43747
$$ 214370 -256791 -45593 -228126 -81942 -39904 16300 158046 -137909 -114571 143747
17702I1210A4005O3033L4179d3515k06240C8620J84896A03943F416K44249I958
$$ 91210 14005 77038 111217 -43515 -249755 38620 223516 103943 6416 250665 9958
17690e9476J0050n6287B11474F178L15391j13891a00093c4272C6220i9818A40217
$$ -59476 -49426 -105713 211474 6178 321569 207678 -100093 -34272 36220 -99818 140217
17678i9694A15254i6746b9608k54077B74270A12331d4534C47842A9267J6305m562
$$ -99694 115254 -96746 -29608 -283685 274270 112331 -44534 347842 19267 35572 31010
17667C1010K48792p4976H1724c12429F6734K13273c1712F754c4629B30250H6208
$$ 31010 279802 204826 81724 -312429 66734 280007 -31712 6754 -34629 230250 86208
17655E9689c2467m1793D7588b25016m4143b9253j70798f8829A69892J95701A32993
$$ 59689 -32467 -74260 47588 -225016 -269159 -29253 -200051 -68829 169892 365593 132993
17643A91316b38049K5627f2479r5949A08605m1127L3799g5153B28434e4378B31399
$$ 191316 -238049 -212422 -62479 -158428 108605 67478 101277 -75153 228434 -54378 231399
17631c31428A12321b36026A69450E030a84894L5096A65634e0131B10356d8496
$$ -331428 112321 -236026 169450 5030 -184894 -149798 165634 -50131 210356 -48496
17620B6525N6776J64465g804A95970a24090g54D863J68664J29283r8030a53623
$$ 26525 83301 247766 -7804 195970 -124090 -754 4863 173527 302810 204780 -153623
17608g9599C2479N3704J24659E1299g0451K1025n9898I537J84982Q9678q3470
$$ -79599 32479 86183 210842 51299 -70451 -49426 -109324 9537 194519 284197 200727
17597B00727b72879B40095a10795E889M7797c90129A5623M04267C1175d06090
$$ 200727 -272879 240095 -110795 5889 53686 -390129 15623 419890 31175 -406090
17586b0126j91577A0583a11322D575h9894A17365J04873E4112L78480E1485N4655
$$ -20126 -211703 10583 -111322 4575 -89894 117365 222238 54112 432592 51485 106140
17575A06140i5332A86673k4371p9152K80645c6650P901N27p1404E6424J97359
$$ 106140 -95332 186673 162302 83150 363795 -36650 -28749 -28222 -99626 56424 253783
17564B53783G1621J78660j16309f272B0729J24412h0646J6536B76786g3026G7715
$$ 253783 71621 250281 133972 -6272 20729 145141 -80646 -64110 276786 -73026 77715
17552B02084A3963M3077a20945A14878d20358b4301A14251M7460R0453j00298
$$ 202084 13963 57040 -120945 114878 -420358 -24301 114251 161711 252164 151866
17542A51866J65120a6144k08667B3998M40358E7838L1321J2171J19521j10250
$$ 151866 316986 -16144 -224811 23998 464356 57838 89159 101330 220851 110601
17532A10601a41285j3268A11145J41661g3489j03738F1523e0983A12320K86156
$$ 110601 -141285 -154553 111145 252806 -73489 -177227 61523 -50983 112320 398476
17522C98476F8009b51032L2045A35129J90475A45559J13840l2162K972I7547F392
$$ 398476 68009 -251032 -218987 135129 325604 145559 259399 227237 230209 97547 6392
17510A71029n6247l3922K00826p9730K0623K14029A4078b6375O131q6993j49112
$$ 171029 114782 80860 281686 201956 222579 436608 14078 -26375 -20244 -107237 -256349
17499b56349D73137G8143J76427L138b41499A21015J86662A06661K52559O0585
$$ -256349 473137 78143 254570 257708 -241499 121015 307677 106661 359220 419805
17489D19805j45936A21200K44749G7162K31761a50466O9465c5630A23161K66977
$$ 419805 273869 121200 365949 77162 308923 -150466 -81001 -35630 123161 390138
17479C90138i0367B87851K65091B23460L5749m4475a9032A7185K56711m6582I4996
$$ 390138 -90367 287851 552942 223460 259209 214734 -19032 17185 273896 227314 94996
17467B31538k8832L8606b2910B67945o0970J12273j20636Q6256A19796L0330K19577
$$ 231538 202706 241312 -22910 267945 206975 319248 198612 284868 119796 150126 369703
17456C69703b6124E69223H6549J54887q8659e8302C68033A67064K89687j32218
$$ 369703 -26124 569223 86549 241436 152777 -58302 368033 167064 456751 324533
17446C24533H6877J80556J95267j37637P8943j4304j56358J64771m9752j09955
$$ 324533 86877 267433 462700 325063 404006 389702 233344 398115 348363 238408
17436B38408b54292D53103j51177a044D41186q3286J77987B43389J42072A61041
$$ 238408 -254292 453103 301926 -1044 441186 357900 535887 243389 385461 161041
17425e6002C26643j03849A01817J97379J32689j12673m1263N317B3067M95581
$$ -56002 326643 222794 101817 299196 431885 319212 277949 283266 23067 518648
17415E18648k3778J77091C18651K1509a16718C08222A03927L12855c9901I6041
$$ 518648 494870 671961 318651 340160 -116718 308222 103927 416782 -39901 96041
17404C65249a29303o597C07417f0582p3649B99969O2750j61593e2029A58834i729
$$ 365249 -129303 -135900 307417 -60582 -134231 299969 362719 201126 -52029 158834 -9729
17392H9931J84996C2567g4330B03252l0340j2459D8270N5146D7602P8647K53337
$$ 89931 274927 32567 -74330 203252 172912 160453 48270 103416 47602 126249 379586
17381C79586e4158o257p095D28798I5489a96941C58053b96440J38123B90862A42199
$$ 379586 -54158 -60415 -67510 428798 95489 -196941 358053 -296440 -158317 290862 142199
17369G9492J47897e068A85726J96265A03242J36795F9633Q9361j8449N3092q9883
$$ 79492 227389 -5068 185726 381991 103242 240037 69633 158994 140545 193637 103754
17358A03754Q0666B1578P5004n643a6307B32324m2490J89916d20r4393F5699a14415
$$ 103754 184420 21578 96582 90939 -16307 232324 189834 379750 -420 -94813 65699 -114415
17345d6933A64841E5499K36753p6208j00483J60265j37083B9949L09039a82C91562
$$ -46933 164841 55499 292252 216044 115561 275826 138743 29949 338988 -182 391562
17333B25766A08644A4104J50318c4537n4323C06680P0325A36281q131K3181K33856
$$ 225766 108644 14104 164422 -34537 -88860 306680 377005 136281 128150 151331 385187
17322C85187j24209d493A82059D3781J3470J02913L7027j4836D7214P0050K74116
$$ 385187 260978 -4493 182059 43781 57251 160164 197191 182355 47214 117264 391380
17311C91380A60e9281r0882A68087N6813o8383B4332J89605H1252J73491J13960
$$ 391380 160 -59281 -150163 168087 224900 156517 24332 213937 81252 254743 368703
17300C68703J2053m4593P8663j71585A18442R3963I2516l1585K94798I4983J77609
$$ 368703 380756 336163 414826 243241 118442 212405 92516 60931 355729 94983 272592
17289B72592B5129K68453F3168J69505a1697B63947o0608a11885b0419A37921
$$ 272592 25129 293582 63168 232673 -11697 263947 203339 -111885 -20419 137921
17278B53652K6164J9394j21302a82091H8425K56683j47866j703b19281C98512
$$ 253652 279816 299210 177908 -182091 88425 345108 197242 195539 -219281 398512
17267A10577E0684K96312B3790J91917F917R3269J74668e9071a6495j41646B66349
$$ 110577 50684 346996 23790 215707 6917 100186 274854 -59071 -16495 -158141 266349
17255e5638B18853l8343J35650q1714K03773f275A86023a66883E12032k36531
$$ -55638 218853 180510 316160 234446 438219 -6275 186023 -166883 512032 275501
17245B75501B4420m54M5842J61292G8528J86025b58215A91021J78506I243M11294
$$ 275501 24420 23966 69808 231100 78528 264553 -258215 191021 369527 9243 420537
17234D20537A80463K28937j69913j16908O904B4334J17328a2700B14434a50341
$$ 420537 180463 409400 239487 122579 129483 24334 141662 -12700 214434 -150341
17223E18585a38124D7244J80800a45145A00631O7441J17510A27690i36A52694
$$ 518585 -138124 47244 228044 -145145 100631 168072 285582 127690 -936 152694
17212e840A44428i3252C03096f6253C67318m6895R4446A51919i7170B9378K54430
$$ -5840 144428 -93252 303096 -66253 367318 320423 414869 151919 -97170 29378 283808
17201B83808J86402B31892J36797H8335J79044Q1144j29307J07730o7267I2001
$$ 283808 470210 231892 368689 88335 267379 348523 219216 326946 259679 92001
17190A48707K56391A73294J14588j04802K03737A56230p6562J26648K46211A92708
$$ 148707 405098 173294 287882 183080 386817 156230 79668 206316 452527 192708
17179C17029m6340e6128E55665o4008k14082K10767j14832l7215R6406j51391
$$ 317029 270689 -56128 555665 491657 277575 488342 373510 336295 432701 281310
17169B81310K6410A48654J88365A533O1118K93129H6414L30475K56529B36165
$$ 281310 307720 148654 337019 1533 62651 355780 86414 416889 673418 236165
17158C86563O638L7046j11675b5096B35061n368K34494k13697L53671D8721L9468
$$ 386563 393201 430247 318572 -25096 235061 229693 464187 250490 604161 48721 88189
17147H8189L20526j89968r597K10403A90466J53423Q0634A73279J39933J28410
$$ 88189 408715 218747 209150 419553 190466 343889 424523 173279 313212 441622
17137D41622p1787j24027r7627C1218L03779k5730r8429f5104B95570J76512j03634
$$ 441622 369835 245808 148181 31218 334997 309267 210838 -65104 295570 472082 368448
17126C68448A62452P1937K24082A76032R6843o1254J81969p231o7148P6525A17989
$$ 368448 162452 234389 458471 176032 272875 211621 393590 386359 319211 395736 117989
17114B17838r2328M1917J30714M71023A29227K68423j43904K2932L3111H5369
$$ 217838 125510 167427 298141 769164 129227 397650 253746 276678 309789 85369
17103E59986k23045K59847j91302j79936J69162j74930o9918K96203B08999M26696
$$ 559986 336941 596788 405486 225550 394712 219782 149864 446067 208999 635695
17093F35695C16519N5316M54525C51751o5629k2676o7427K76077k8964A72628
$$ 635695 316519 371835 826360 351751 286122 263446 196019 472096 443132 172628
17082D95162B01544L06887J66480j56457J30804k26564L19024k95330A77112M60489
$$ 495162 201544 508431 674911 518454 649258 422694 741718 446388 177112 637601
17072F37601B79553L71044B65164n9242O27352B42579J35029K39771J58602k21349
$$ 637601 279553 650597 265164 205922 833274 242579 377608 617379 775981 554632
17062E54632j09883j15525O4543J48089j00888j9407l0683J41041k08105K15276
$$ 554632 444749 329224 393767 541856 440968 421561 390878 531919 323814 539090
17052E39090k25869M32572k83077k18753K00694L0532J21898P9479B96420A12213
$$ 539090 313221 745793 462716 243963 444657 475189 597087 676566 296420 112213
17041D71967O8498q8605J23162j20370O1237J80774k47394J58378J9129Q4248
$$ 471967 540465 451860 575022 454652 515889 696663 449269 607647 626776 711024
17031G11024q5560k6404j61114K73403A81802O09546k35455k65255K46386R6725
$$ 711024 625464 599060 437946 711349 181802 791348 555893 290638 537024 633749
17021F33749J0344N3794C31687K29427m3793j66229K67500l9095l587m3753k64225
$$ 633749 644093 697887 331687 561114 517321 351092 618592 579497 575910 532157 267932
17010B67932N61564k73533k01015L59447j1754k25497j50657M0383L02755N8127
$$ 267932 829496 555963 354948 714395 702641 477144 326487 366870 669625 727752
17000G27752J48675l9235k70665K53614o5071o6434J71181k93646L77680k50587
$$ 727752 876427 837192 566527 820141 755070 688636 859817 566171 943851 693264
16990F93264j06888K40296j07189k62915M46173k57935j77324L55914L31052m19663
$$ 693264 586376 826672 719483 456568 902741 644806 467482 823396 1154448 734785
16980G34785J36193k65713K2369K57655q4795j49528P5328L50287l51603L41571
$$ 734785 870978 605265 627634 885289 800494 650966 726294 1076581 724978 1066549
16970A066549l76649M3793L1471j00474N76462n53925K52857r9032J77642J12368
$$ 1066549 689900 733693 765164 664690 1241152 687227 940084 841052 1018694 1131062
16960A131062j87702J53977r5860k43870j69215L65683K0155J15676k41759p0289
$$ 1131062 943360 1097337 1001477 757607 588392 954075 974230 1089906 848147 777858
16950G77858K51933l14113M11156P1466J10184k53569J38951l8713r8794o8583
$$ 777858 1029791 715678 1126834 1198300 1308484 1054915 1193866 1155153 1056359 987776
16940I87776j61803L93190j30841j71869N7990M39622n02196L08634k32210N47117
$$ 987776 825973 1219163 1088322 916453 974443 1414065 911869 1220503 988293 1535410
16930A535410k83822j82461M60331l40326L76093k8069k37346J42475P9l44466
$$ 1535410 1251588 1069127 1529458 1189132 1565225 1537156 1299810 1442285 1442364 1097898
16920A097898J25415K27674k97487L80355L6370j27275k64079K56336p3125r5320
$$ 1097898 1223313 1450987 1153500 1533855 1570225 1442950 1178871 1435207 1362082 1266762
16910A266762K62706p7488O1971J57110m18974R529R9665K99123j05234J97213
$$ 1266762 1529468 1451980 1513951 1671061 1252087 1261616 1361281 1660404 1555170 1752383
16900A752383P5318k88437k34043P24193m49051L97000k46760l7673k65098M52601
$$ 1752383 1827701 1539264 1305221 2029414 1580363 1977363 1730603 1692930 1427832 1880433
16890A880433n2113M37944l64972j19961J80125k22127J55331k1868L987K19252
$$ 1880433 1828320 2266264 1901292 1781331 1961456 1739329 1894660 1872792 1876779 2096031
16880B096031j75424J86601j81742K89459k63977M57032l40992K06120k17649
$$ 2096031 1920607 2107208 1925466 2214925 1950948 2407980 2066988 2273108 2055459
16871B055459J06746k5798K98607k02829M6115O2396m6100L70864p5818Q1295
$$ 2055459 2162205 2136407 2435014 2232185 2278300 2340696 2294596 2665460 2589642 2670937
16861B670937J39110P8972k15930K47269J16904j52489J1728O8490l34954P69749
$$ 2670937 2810047 2889019 2673089 2920358 3037262 2884773 2896501 2964991 2630037 3399786
16851C399786l72148n6034N9296j0822n2145J0194Q3114L43229l88032L27284
$$ 3399786 3027638 2971604 3030900 3020078 2967933 2978127 3061241 3404470 3016438 3343722
16841C343722k8066L42007p09L0045o1887L758L58894k61271K27206r444O682
$$ 3343722 3315656 3657663 3656954 3686999 3625112 3628870 3987764 3726493 3953699 3944255 3950937
16830C950937L31069J09042J39836j40213l04703M28809J07091J71522j30199
$$ 3950937 4282006 4391048 4530884 4390671 4085968 4514777 4621868 4793390 4663191
16821D663191j76767M83517j01752K83277M27741j34836j90161R3686J98164k28326
$$ 4663191 4486424 4969941 4868189 5151466 5579207 5444371 5254210 5347896 5546060 5317734
16811E317734L73040J8699J34849J76967L7226K51056K00348J11332L23724R9592
$$ 5317734 5690774 5709473 5844322 6021289 6058515 6309571 6509919 6621251 6944975 7044567
16801G044567j39587K49168J94622J55125N38515k67107N95359M0181o574J37393
$$ 7044567 6904980 7154148 7348770 7503895 8042410 7775303 8370662 8410843 8404269 8541662
16791H541662L87051L02128J61677J57776L09223M70649l2109L30334O73624M61951
$$ 8541662 8928713 9230841 9392518 9550294 9859517 10330166 10298057 10628391 11302015 11763966
16781A1763966l77476Q71862K21838L96684Q6547Q18670L6167L56219N93441M31524
$$ 11763966 11386490 12258352 12480190 12876874 12963421 13782091 13818258 14174477 14767918 15199442
16771A5199442N86669P70394N78291M04959P84549L36616O50082O34843Q19322
$$ 15199442 15786111 16556505 17134796 17539755 18324304 18660920 19311002 19945845 20765167
16762B0765167J176797M57934J123101R63368Q64849P47538J587621R62832J144656
$$ 20765167 21941964 22399898 23522999 24486367 25351216 26098754 27686375 28649207 29793863
16753B9793863J566693J770449Q63240J512583J977907J657251K232661K093837
$$ 29793863 31360556 33131005 33994245 35506828 37484735 39141986 41374647 43468484
16745D3468484K091248K599670K625541L111411K903299L305941K970820L744712
$$ 43468484 45559732 48159402 50784943 53896354 56799653 60105594 63076414 66821126
16737F6821126M105771M499727M878313M836450N424945N354664O287799O743197
$$ 66821126 70926897 75426624 80304937 85141387 90566332 95920996 102208795 108951992
16729A08951992O446922P225924P714635P677252P870036Q599633P808732Q178345
$$ 108951992 115398914 122624838 130339473 138016725 145886761 154486394 162295126 170473471
16721A70473471P442508O440195O570622M665213L920367K488768P58620o59284
$$ 170473471 177915979 184356174 190926796 195592009 199512376 202001144 202759764 202100480
16713B02100480k256125l086761m913129n748512o758985p672726p826935q101584
$$ 202100480 199844355 196757594 191844465 186095953 179336968 171664242 163837307 155735723
16705A55735723q381695q086846p955594p746982p235081p424989o502210o212599
$$ 155735723 147354028 139267182 131311588 123564606 116329525 108904536 102402326 96189727
16697I6189727o225590n231219n177806m743668m373109m299023l757914l429618
$$ 96189727 89964137 84732918 79555112 74811444 70438335 66139312 62381398 58951780
16689E8951780l479081l109799k947018k150920k955341j884927j937333k257498
$$ 58951780 55472699 52362900 49415882 47264962 44309621 42424694 40487361 38229863
16681C8229863k138520j571700j573001j691240j498641q23198j254978j575382
$$ 38229863 36091343 34519643 32946642 31255402 29756761 28933563 27678585 26103203
16673B6103203q53082j355444l61321j471238r83259p01361o86209q52825n45559
$$ 26103203 25250121 23894677 23533356 22062118 21078859 20377498 19691289 18838464 18292905
16664A8292905j036527m02667j59805p95113j021625k18958m41385k95213n43670
$$ 18292905 17256378 16853711 16693906 15898793 14877168 14658210 14216825 13921612 13377942
16655A3377942o73649r0912p17776j14594o36341j70299l06652j03974n63254
$$ 13377942 12704293 12613381 11895605 11781011 11144670 10974371 10667719 10563745 10000491
16646A0000491j88177m41112K63947j101962M88785p41010k9878J05573l91026
$$ 10000491 9812314 9371202 9635149 8533187 9021972 8280962 8251084 8356657 7965631
16637G965631q9407l11678k75526l87958N5718j64723o6246q1855l86193k24022
$$ 7965631 7876224 7564546 7289020 6901062 6956780 6792057 6725811 6643956 6257763 6033741
16627F033741j24076P545N6922l96365m41576J14810j17865j94957k783r1836
$$ 6033741 5909665 5917210 5974132 5577767 5136191 5251001 5133136 4938179 4935396 4843560
16617D843560K22799l86349p7896q5486j48650j06112j9869J74290n14821R689
$$ 4843560 5066359 4680010 4602114 4516628 4367978 4261866 4241997 4416287 3901466 3911155
16607C911155j05841J23279j41178j838k69974J70915O426l65915k57432j0113
$$ 3911155 3805314 3928593 3787415 3785577 3515603 3686518 3692944 3327029 3069597 3059484
16597C059484j07767k10822K60488J14075k01523o072j41001K30641r254l62292
$$ 3059484 2951717 2740895 3001383 3115458 2913935 2907863 2766862 2997503 2988249 2625957
16587B625957Q105k07480J23581L3969J40435k90192k63537K40741l0141l09258
$$ 2625957 2634062 2426582 2550163 2584132 2724567 2434375 2170838 2411579 2381438 2072180
16577B072180M03100j16456l17030J79856J14987l28026J53032r6818k75042J36275
$$ 2072180 2475280 2358824 2041794 2221650 2336637 2008611 2161643 2064825 1789783 1926058
16567A926058q6564K59245k7713l52553L08910r2273j44828q4124O1051j19032
$$ 1926058 1839494 2098739 2071026 1718473 2027383 1935110 1790282 1706158 1767209 1648177
16557A648177k9887r7734J44349k6444J73791l3743L09988m17395p9962J15570
$$ 1648177 1618290 1520556 1664905 1638461 1812252 1778509 2088497 1671102 1591140 1706710
16547A706710m18963P2744N6907K32171k43796j15782J46053K1468j8025n5168
$$ 1706710 1287747 1360491 1417398 1649569 1405773 1289991 1436044 1457512 1439487 1384319
16537A384319p1756L5311Q5691j05296J79257l05750L10786k15674F44105L30119
$$ 1384319 1312563 1347874 1433565 1328269 1507526 1201776 1512562 1296888 644105 974224
16527I74224M34707N3564k15563j62290j16126J74438j67041j81528L16166k32823
$$ 974224 1408931 1462495 1246932 1084642 968516 1142954 975913 794385 1110551 877728
16517H77728J35290J18514o4607R2169M9147j73777J78276m10039L10821n8912
$$ 877728 1013018 1131532 1066925 1159094 1208241 1034464 1212740 802701 1113522 1054610
16507A054610k76166L14519k71768k27222N1513K07183O3105J95801k71972j65432
$$ 1054610 778444 1092963 821195 593973 645486 852669 915774 1111575 839603 674171
16497F74171J70138R5505q4282p8780Q2026j69346L2549j2280J70272j61693k12427
$$ 674171 844309 939814 855532 776752 858778 689432 721981 709701 879973 718280 505853
16486E05853J87585K58103r6684M3385j79736K92966k64897L533j35530M46509
$$ 505853 693438 951541 854857 898242 718506 1011472 746575 750108 614578 1061087
16476A061087D96235J28941j75788K20334k45126J16503K92910m5987q4278l43003
$$ 1061087 496235 625176 449388 669722 424596 541099 834009 788022 703744 360741
16466C60741K83946L77770D14921m9509J17653J37593j80910J14308J63399A70159
$$ 360741 644687 1022457 414921 365412 483065 620658 439748 554056 717455 170159
16455D38217M774J08742k74414M27195p9045j62393R8831L04077l00461n8201
$$ 438217 442991 551733 277319 704514 625469 463076 561907 865984 565523 507322
16445E07322j96165J17495o445L15456j58762R2635k27508J57988j72934J90636
$$ 507322 311157 428652 422207 737663 578901 671536 444028 602016 429082 619718
16435F19718j98711K76649k98872l0094J15505J8340p335j55862A02119J94261
$$ 619718 421007 697656 398784 368690 484195 502535 495200 339338 102119 296380
16425B96380J82822P6467B03427K27170A20002N65229k37692L4396B33276Q057
$$ 296380 479202 555669 203427 430597 120002 685231 447539 481935 233276 241333
16415B41333L26596j34200J85083k67189J82985A49627M83518A91159L31707B02410
$$ 241333 567929 433729 618812 351623 534608 149627 633145 191159 522866 202410
16404C67748j6364m4379O6464j47973I5431M62996A81607a34919C73495A23237
$$ 367748 351384 307005 373469 225496 95431 558427 181607 -134919 373495 123237
16393B68543O3533A08102D0950J17184L25388K2070A76160J45066J3373m6473
$$ 268543 332076 108102 40950 158134 483522 505592 176160 321226 334599 288126
16383B88126A29932R6152D9723L3183a1166C98109A22259J63909K19706l9466
$$ 288126 129932 226084 49723 82906 -11166 398109 122259 286168 505874 466408
16373D66408j05982j33650A2907L15727j59598J41583K4861P0136j20271A31492
$$ 466408 360426 226776 12907 328634 169036 310619 335480 405616 285345 131492
16362F7232L52041N7513l9688A12619M3817r556J59991j1304Q9808M1700A71966
$$ 67232 419273 476786 437098 112619 156436 146880 306871 295567 385375 427075 171966
16350D81208a04270C87413A09651J01684R5441j19828K07766A01096C9763J90390
$$ 481208 -104270 387413 109651 211335 306776 186948 394714 101096 39763 230153
16340B30153a50074g0443D2063K70536m4774J67878A76807j4142K75364C9775
$$ 230153 -150074 -70443 42063 312599 267825 435703 176807 162665 438029 39775
16329A82958o4904O375k5459L3026K02301A10922L27440B5644J04890h1413B86116
$$ 182958 118054 124429 98970 131996 334297 110922 438362 25644 130534 -81413 286116
16317C02343b46617A06130J83897j04262L69023k47640E9613J03061r142J36836
$$ 302343 -246617 106130 290027 185765 554788 307148 59613 162674 153532 290368
16307B90368a42381J6444B86734a34050A77855c4141C3710R7670J85347a08756
$$ 290368 -142381 -125937 286734 -134050 177855 -34141 33710 131380 316727 -108756
16296C96122c8459D28183B03856E4755P2773a11841C37925a47904B2074K99506
$$ 396122 -38459 428183 203856 54755 127528 -111841 337925 -147904 22074 321580
16286C21580A2719J87079a06244A42296F8833g508B02409k232C8861K24678D6452
$$ 321580 12719 199798 -106244 142296 68833 -7508 202409 200177 38861 263539 46452
16274D49985B03894C512g753j122M410k19714A42284M635J67233j44603L8939
$$ 449985 203894 3512 -7753 -8875 -4465 -224179 142284 146919 314152 169549 208488
16263B08488n8273K3021h8539A74019C5111A5645d8357B29544q565j3083p0125
$$ 208488 150215 173236 -88539 174019 35111 15645 -48357 229544 220979 207896 137771
16252A37771N9703l3094D4189L31329A14427O7127A8974c42038C4197J56157K16638
$$ 137771 197474 164380 44189 375518 114427 181554 18974 -342038 34197 190354 406992
16241D06992H4488f1125A87951J9879J38051R7568A52547p5536L02674j63781
$$ 406992 84488 -61125 187951 207830 345881 443449 152547 77011 379685 215904
16231B15904A01431c4460B68422a16001c3594B8811a27926A21596B1250L5926
$$ 215904 101431 -34460 268422 -116001 -33594 28811 -127926 121596 21250 57176
16221E7176J15427c0461A11278K7041E8136b1834B98974l8270d7339A04594J97514
$$ 57176 172603 -30461 111278 138319 58136 -21834 298974 260704 -47339 104594 302108
16210C02108k1734a08029A21196P5106c18122C08529e8201n2379B11007Q689c01379
$$ 302108 280374 -108029 121196 196302 -318122 308529 -58201 -110580 211007 219696 -301379
16198a26398L7794A33734k5779a82395j66857A77824b09215A90829C5497P5355
$$ -126398 -88604 133734 107955 -182395 -349252 177824 -209215 190829 35497 110852
16188A10852c32099I4650B287Q4056a3335C40104A07318d4927F9135J18917H9824
$$ 110852 -332099 94650 2287 86343 -13335 340104 107318 -44927 69135 188052 89824
16176A80036p9376d5820l2195B56815e3280A96700f1318a5853B951d036k37979
$$ 180036 100660 -45820 -78015 256815 -53280 196700 -61318 -15853 2951 -4036 -242015
16165b42015g403C62831a85849l8460A40314J74242r8132i4887C07250Q0911G5077
$$ -242015 -7403 362831 -185849 -224309 140314 314556 216424 -94887 307250 388161 75077
16153A25832b4541B91017a30762A69394c35358A05420k1185d1069I5157f5498
$$ 125832 -24541 291017 -130762 169394 -335358 105420 84235 -41069 95157 -65498
16142C12485L9566A21354C6542c1849B60146A23530m3218f4167G4056a29542D5727
$$ 312485 352051 121354 36542 -31849 260146 123530 80312 -64167 74056 -129542 45727
16130B9077J4336b53236D235i6269D0011a31602M2403b3385r9483A48394o9376
$$ 29077 43413 -253236 4235 -96269 40011 -131602 -89199 -23385 -122868 148394 79018
16119G9018h5975k63019F4961J76570l0290l640b92408a04873F9380R578a6789
$$ 79018 -85975 -348994 64961 241531 211241 207601 -292408 -104873 69380 78958 -16789
16107d57717g7071A86589L9766A3779J70904P878a4892C38256j19686H686b19617
$$ -457717 -77071 186589 226355 13779 184683 192561 -14892 338256 218570 8686 -219617
16095b110l7507j8726j84701n0653l5377R8583e4904H1259j1708a32550A84919
$$ -2110 -39617 -58343 -243044 -293697 -329074 -230491 -54904 81259 69551 -132550 184919
16083A64347a63422d8695A34947a50948k3060A38530J00367f9627l7215a8808
$$ 164347 -163422 -48695 134947 -150948 -174008 138530 238897 -69627 -106842 -18808
16072B35051D9594c4240j46584B1736a86745d8054k5316m7659D321d7013j9107
$$ 235051 49594 -34240 -180824 21736 -186745 -48054 -73370 -121029 4321 -47013 -66120
16061f6120A55364d4814D1930J57185J515p2381c3446k05392C58K3376K75606
$$ -66120 155364 -44814 41930 199115 200630 128249 -33446 -238838 358 23734 299340
16050B99340a80798L2131F1141b53746D0131J16747J45503m8844b27569R7606
$$ 299340 -180798 -148667 61141 -253746 40131 156878 302381 253537 -227569 -129963
16040a29963H5552P4925b5692H6960e1964r0697e2871k80431f9861A16041a25877
$$ -129963 85552 160477 -25692 86960 -51964 -142661 -52871 -333302 -69861 116041 -125877
16028f425A32606a05952q3722O8833B46896J66202a45235n3829j04650F3908R2998
$$ -6425 132606 -105952 -189674 -120841 246896 413098 -145235 -199064 -303714 63908 156906
16017A56906O4660a7816H6981c05281m7437b5641k58770B27957q8720b18011J6405
$$ 156906 221566 -17816 86981 -305281 -352718 -25641 -284411 227957 139237 -218011 -201606
16006b01606i4527j09067d5537j46166c604k13528g5528q8678j51829A37075a69784
$$ -201606 -94527 -203594 -45537 -191703 -3604 -217132 -75528 -164206 -316035 137075 -169784
15994a54183M3177B66405a30630H9270N4f3620n382I9661H662M60188A45654L4866
$$ -154183 -111006 266405 -130630 89270 89324 -63620 -69002 99661 8662 468850 145654 180520
15982A80520l9079O1145B6450R4912N7352b61986M4635e293l6349j13556r2999
$$ 180520 141441 202586 26450 121362 178714 -261986 -217351 -5293 -41642 -155198 -248197
15971b48197k7598A35453a064E10592c1062o9985G1720d4285j57871A37968i145
$$ -248197 -275795 135453 -1064 510592 -31062 -101047 71720 -44285 -202156 137968 -9145
15959c66762A83404a0113A77005D1905d00237A5768J26921b81678A21755c2496
$$ -366762 183404 -10113 177005 41905 -400237 15768 142689 -281678 121755 -32496
15948A49819O61J07575b6104k41799B02760f496A47557J95386B8348b8893j16622
$$ 149819 150480 258055 -26104 -267903 202760 -6496 147557 342943 28348 -28893 -145515
15937a45515H2496a84769k28551J88391b2393k72999J05369A98012F4017c0412
$$ -145515 82496 -184769 -413320 -224929 -22393 -295392 -190023 198012 64017 -30412
15926a31045o8452J1566Q1775H4758M5539a66488f1709j02772b5821B1447i1038
$$ -131045 -199497 -187931 -106156 84758 130297 -166488 -61709 -164481 -25821 21447 -91038
15914b58924a23120A22746b80412b3378m14087A58536C6825J56596a77557N4353
$$ -258924 -123120 122746 -280412 -23378 -437465 158536 36825 193421 -177557 -123204
15904a23204D1875a06727A12824n0004L04396I3952a21998G5602b33671e5533
$$ -123204 41875 -106727 112824 62820 367216 93952 -121998 75602 -233671 -55533
15893a72177C6080K77900j07480c68340C886P5103b6858m6407B00374f852k3550
$$ -172177 36080 313980 206500 -368340 3886 78989 -26858 -73265 200374 -6852 -30402
15882c0402m9986l09413F4624L47124b04046N8563B28161c28778a21121A4116
$$ -30402 -80388 -389801 64624 411748 -204046 -145483 228161 -328778 -121121 14116
15871B3963d0288j87590K7381G4766b76085B79621c28016I1626B3229J9617a37551
$$ 23963 -40288 -227878 -200497 74766 -276085 279621 -328016 91626 23229 42846 -137551
15859G5689J61752R131E6080J79510b24112e9413D30986a29281B48372e5263n3707
$$ 75689 237441 246572 56080 235590 -224112 -59413 430986 -129281 248372 -55263 -108970
15848a08970B06098b9145B25212a57105n2758h9656A02496b25873K5121P4425
$$ -108970 206098 -29145 225212 -157105 -209863 -89656 102496 -225873 -200752 -126327
15838a26327j76365a33308n1251O9846K3135r0108h5705k37902a6060E28186A62781
$$ -126327 -302692 -133308 -184559 -114713 -91578 -181686 -85705 -323607 -16060 528186 162781
15826B24029n1621C2861c65739G2319c80193b7980k5840A13514C3250a3283l2673
$$ 224029 172408 32861 -365739 72319 -380193 -27980 -53820 113514 33250 -13283 -45956
15815d5956a9652j04629o7224a8151j33887H7399a06971C451c18141F4380a56985
$$ -45956 -19652 -124281 -191505 -18151 -152038 87399 -106971 3451 -318141 64380 -156985
15803G2182b4417j31604B12005c76289C28435a32433A59656l0893m88A1027d3685
$$ 72182 -24417 -156021 212005 -376289 328435 -132433 159656 128763 128275 11027 -43685
15791A02233a28575e4201E6771b99355J15884r9251A39456n6122N4102J19151
$$ 102233 -128575 -54201 56771 -299355 -183471 -282722 139456 83334 137436 256587
15781B56587e5992j16821H7813J8800b65507p4077a46492P2386p4388B96436B7411
$$ 256587 -55992 -172813 87813 106613 -265507 -339584 -146492 -74106 -148494 296436 27411
15769B67709c46000a34760p6927f2535k41390A32938b82852l10156A20892J31149
$$ 267709 -346000 -134760 -211687 -62535 -303925 132938 -282852 -593008 120892 252041
15759B52041o1147c67484A8787J09906L7347J7737H6594a82816D5593c0707K650
$$ 252041 190894 -367484 18787 128693 166040 183777 86594 -182816 45593 -30707 -28057
15748b8057B65040a8859E7407J68884J66393b78040a30957I9449k8590d4401j16627
$$ -28057 265040 -18859 57407 226291 392684 -278040 -130957 99449 70859 -44401 -161028
15737a61028k77993e8672n2161D9058J77241f19413B52350a44825C2838a450r4421
$$ -161028 -439021 -58672 -110833 49058 226299 -619413 252350 -144825 32838 -1450 -95871
15726i5871j29738A00953m095b96345P3794C246b1696l2887r6944K4192A33722
$$ -95871 -225609 100953 96858 -296345 -222551 3246 -21696 -54583 -151527 -127335 133722
15714a07035C9672c43509c6624B88540e2586E5643a58297A94377r1532a44470
$$ -107035 39672 -343509 -36624 288540 -52586 55643 -158297 194377 102845 -144470
15703b72401A11660h8067A74960d6166B03579A9266a84133E4224B3683a00826
$$ -272401 111660 -88067 174960 -46166 203579 19266 -184133 54224 23683 -100826
15692d42292e747j40089a9472p0282A70711a01670H4614a54465F3816b96563N4842
$$ -442292 -5747 -145836 -19472 -89754 170711 -101670 84614 -154465 63816 -296563 -241721
15681b41721B2169a11531I421f7501k08274a1852k62847P9350F664M2141J4080
$$ -241721 22169 -111531 9421 -67501 -275775 -11852 -274699 -195349 6664 48805 62885
15670F2885B1971P3898i8555A4467Q6037d45938a55956O5017K0387q3015D7532
$$ 62885 21971 95869 -98555 14467 100504 -445938 -155956 -90939 -70552 -153567 47532
15658E7286M6551g6782A5666g1863e360k39653f7040k05708i2719E2980e2945
$$ 57286 103837 -76782 15666 -71863 -5360 -245013 -67040 -272748 -92719 52980 -52945
15646C361g0891C03740h2109I9251j0333B196J51574h2322C40993j01844i7317
$$ 3361 -70891 303740 -82109 99251 88918 2196 153770 -82322 340993 239149 -97317
15634a64484G2790b02351f3544C4379h8573b0316A24511h9079G6239c28168O3647
$$ -164484 72790 -202351 -63544 34379 -88573 -20316 124511 -89079 76239 -328168 -264521
15623b64521H7733j7401j4029F010d38188A08871c7656m3914A08326c73934c9929
$$ -264521 87733 70332 56303 6010 -438188 108871 -37656 -81570 108326 -373934 -39929
15611b51188A4084M1607b58562c0241o4918B11351R6948a69259j77334h8383A04461
$$ -251188 14084 55691 -258562 -30241 -95159 211351 308299 -169259 -346593 -88383 104461
15599a65146A26120J57515b40995A04222b07389j65133R1202Q098M9578B41830
$$ -165146 126120 283635 -240995 104222 -207389 -372522 -281320 -273222 -223644 241830
15588A0939J1443d9410B51505c05886R1098F1499a37144A70443c90770C38895
$$ 10939 22382 -49410 251505 -305886 -214788 61499 -137144 170443 -390770 338895
15577B65519i3663I8065a88983k2959D4826g9653L1484j32742B05903D473c1864
$$ 265519 -93663 98065 -188983 -211942 44826 -79653 -48169 -180911 205903 4473 -31864
15565e08151K1461a8214l24133C21239a9881A79460J8097h0375r620n874q903
$$ -508151 -486690 -18214 -342347 321239 -19881 179460 197557 -80375 -89995 -95869 -104772
15554a04772D2728L24124d9418C4330i6345D8676J05047B3122N7318a85839K4203
$$ -104772 42728 366852 -49418 34330 -96345 48676 153723 23122 80440 -185839 -161636
15543a61636j81501a22941L3627A75826c28030B45720a54604A12894b28379B83776
$$ -161636 -343137 -122941 -89314 175826 -328030 245720 -154604 112894 -228379 283776
15532g2630A98750b73449B8162a69294A63945j0241c5896l1539j19233H0807J68051
$$ -72630 198750 -273449 28162 -169294 163945 153704 -35896 -67435 -186668 80807 248858
15521B48858a8560j76782C307R3217J74076a00462L7645K2207j27658d1608m1735
$$ 248858 -18560 -195342 3307 96524 270600 -100462 -62817 -40610 -168268 -41608 -83343
15510h3343j52609a10791r1383A3636L08414a34816O4325p7185j42677A72466
$$ -83343 -235952 -110791 -202174 13636 322050 -134816 -70491 -147676 -290353 172466
15499F5645a64206n9064g6872A28970A8609d75015e5523I0532K07609a08803j78792
$$ 65645 -164206 -223270 -76872 128970 18609 -475015 -55523 90532 298141 -108803 -287595
15488b87595P9640B8654a42962H0393j8631i664k28163A36740h6273l300K1737
$$ -287595 -207955 28654 -142962 80393 61762 -9664 -237827 136740 -86273 -89573 -67836
15477f7836A30092i6496l4124E2494J2875b02925L9842H2986i6297a0176C1130
$$ -67836 130092 -96496 -130620 52494 65369 -202925 -163083 82986 -96297 -10176 31130
15465a6473p6197K1883a7291A3987J58008a12932B27138i5949A23618a05952C37971
$$ -16473 -92670 -70787 -17291 13987 171995 -112932 227138 -95949 123618 -105952 337971
15453A84972p7046b03949K1336G6082c4285A13448h8891A72644l2770e8404b3327
$$ 184972 107926 -203949 -182613 76082 -34285 113448 -88891 172644 139874 -58404 -23327
15441b01926c956j1669d180E8061a96975B9558Q5858n0804a20906k19429P7091
$$ -201926 -3956 -15625 -4180 58061 -196975 29558 115416 64612 -120906 -340335 -263244
15430b63244f644D87670d9001d861F5570J55669E2509d2143B62932n9720i3032
$$ -263244 -6644 487670 -49001 -4861 65570 221239 52509 -42143 262932 203212 -93032
15418c8081A12245B0560a69183I5533b88280B0101J4336J17951a60940A88025
$$ -38081 112245 20560 -169183 95533 -288280 20101 34437 152388 -160940 188025
15407F7337b9607j17898J3712B69437a36698o5399D6460a57925f2169D8308a81752
$$ 67337 -29607 -147505 -133793 269437 -136698 -202097 46460 -157925 -62169 48308 -181752
15395A9890J88876a38701B4132R2585a6778A51772a18352j38942d3294G6013J3481
$$ 19890 208766 -138701 24132 116717 -16778 151772 -118352 -257294 -43294 76013 89494
15384H9494a78033E9027a9778j5161j37806B33075B4620K98420g3627A83543c55860
$$ 89494 -178033 59027 -19778 -34939 -172745 233075 24620 323040 -73627 183543 -355860
15372h7871C77102A84071a16314E7290K15181a92975A01658g1315H5154a34576
$$ -87871 377102 184071 -116314 57290 272471 -192975 101658 -71315 85154 -134576
15361H019a64525C71376a20543k71056C9791a70013I1649J24138q2286b42373
$$ 8019 -164525 371376 -120543 -391599 39791 -170013 91649 215787 133501 -242373
15350H3250K00715j11661E4869C374h5590I8654b2781A4967N976M4601J10982
$$ 83250 283965 172304 54869 3374 -85590 98654 -22781 14967 20943 65544 176526
15339A76526A9495f5971A34143R3355d6448A00901J73692C2260a04255k03959
$$ 176526 19495 -65971 134143 227498 -46448 100901 274593 32260 -104255 -308214
15329c08214J38134g6370C6661K28722m9306b41426j7377J26342o971k48921I7111
$$ -308214 -170080 -76370 36661 265383 216077 -241426 -258803 -132461 -139432 -388353 97111
15317A8957K21411q9038J62966d4988A56553N3056a66204D5690J68026M6293C9848
$$ 18957 240368 151330 314296 -44988 156553 209609 -166204 45690 213716 260009 39848
15305b78228B25865a30390D31930F6271a00089M5329r4829B25506A06150J42766
$$ -278228 225865 -130390 431930 66271 -100089 -54760 -149589 225506 106150 248916
15295B48916i9361H3453L7142j9670K47705E5291K4724R8130a43499N938f3529
$$ 248916 -99361 83453 120595 100925 348630 55291 80015 178145 -143499 -137561 -63529
15283E2083c35292C87216b39226H1342C3483L3857J39290g4213E590J34726A3839
$$ 52083 -335292 387216 -239226 81342 33483 67340 206630 -74213 5590 140316 13839
15271E5734Q8329P7333J75549A73996E6748e0889A50366K4582b72173a2685A44565
$$ 55734 144063 221396 396945 173996 56748 -50889 150366 174948 -272173 -12685 144565
15259a29493j29918G8909k8135k3713K30414p8239a06038H5339J8471n385Q77554
$$ -129493 -259411 78909 50774 27061 257475 179236 -106038 85339 103810 98425 975979
15248I75979P78386o83220L30038R106E36386A95660A2430f9401B46010h1226
$$ 975979 1754365 1071145 1401183 1410289 536386 195660 12430 -69401 246010 -81226
15237A22627m2136J04167d3212k7617I1709c26038B25540K74810i5125h454A74192
$$ 122627 80491 184658 -43212 -70829 91709 -326038 225540 500350 -95125 -8454 174192
15225B83276n5049h3912A79481M2916a44667f7311H6758K37520H2107B1876O5503
$$ 283276 228227 -83912 179481 222397 -144667 -67311 86758 324278 82107 21876 87379
15214H7379a11256b7146o8803A45570K3408D9416L82988A28129J77954e1098B20002
$$ 87379 -111256 -27146 -95949 145570 168978 49416 432404 128129 306083 -51098 220002
15202a70394G7087J81567d3101A46534C7941P1993K14201A19266P5382P8863m1116
$$ -170394 77087 258654 -43101 146534 37941 109934 324135 119266 194648 273511 232395
15191B32395A00459h341I7249J80636A37153c96546a17736E6861J90779q8640
$$ 232395 100459 -8341 97249 277885 137153 -396546 -117736 56861 247640 159000
15181A59000g6086C659d079j24638B12652J63114J22887A9160b87841a38383a0921
$$ 159000 -76086 3659 -4079 -128717 212652 375766 498653 19160 -287841 -138383 -10921
15169a98605O2480C9794K33436g7482A53745a77542B50700l7993j1932J77728
$$ -198605 -136125 39794 273230 -77482 153745 -177542 250700 212707 200775 378503
15159C78503b15370C49053A47740B5922K58602J87708F5684K19835m2896n5508
$$ 378503 -215370 349053 147740 25922 284524 472232 65684 285519 242623 187115
15149A87115a63505d0566j6856c59A21725k8214a78612F4329j9564a0841A31108
$$ 187115 -163505 -40566 -57422 -359 121725 93511 -178612 64329 44765 -10841 131108
15137b89357D96862c54262g0188B02188G7768J17341J44308I6886J31547d1109
$$ -289357 496862 -354262 -70188 202188 77768 195109 339417 96886 228433 -41109
15126A72438m6532J58434J2935H9110M04663k16824A00693k0906Q3157a6033A27005
$$ 172438 125906 284340 297275 89110 493773 276949 100693 79787 162944 -16033 127005
15114H1518b10148A573L89036A28009g4791n2637A97635a90217d1670G356J46826
$$ 81518 -210148 1573 390609 128009 -74791 -127428 197635 -190217 -41670 7356 154182
15103A54182G8J39202D315K50248J08023A22106L6250L785E9410g2446b4236A07961
$$ 154182 78 139280 4315 254563 362586 122106 158356 162141 59410 -72446 -24236 107961
15090A20053C3202J35706K51371d3444D2057b1328B34977e4566C76454A27278
$$ 120053 33202 168908 420279 -43444 42057 -21328 234977 -54566 376454 127278
15079A7586J04112J03644H4395e326B0191J36366K31947p8143j9947C7923a35212
$$ 17586 121698 225342 84395 -5326 20191 156557 388504 310361 290414 37923 -135212
15067a89474e8838C19936B753P681c0124B75397l7440J57416a7779A57082j5194
$$ -189474 -58838 319936 2753 10434 -30124 275397 237957 395373 -17779 157082 141888
15056A41888K56882D8887g6423G0583L12094j56981I0144K7897a25575A74012
$$ 141888 398770 48887 -76423 70583 382677 225696 90144 118041 -125575 174012
15045B5831K88782A41394R9714l31A07564J96174A04763c03232h5909A47858J72121
$$ 25831 314613 141394 241108 240777 107564 303738 104763 -303232 -85909 147858 319979
15034C19979n7696a8636B28114R7144M0581m1030q5753a65486C75832j70890j6190
$$ 319979 262283 -18636 228114 325258 365839 324809 239056 -165486 375832 204942 188752
15023A88752j75h9871A47390J6503c1128C24405B2910K44972D2748L98583K25950
$$ 188752 188577 -89871 147390 163893 -31128 324405 22910 267882 42748 441331 667281
15012F67281A48696m5992j4238L28791j73388n1817N4202j7798m1922I540L21283
$$ 667281 148696 102704 88466 417257 243869 192052 246254 228456 186534 9540 330823
15001C30823A25733A9184f4815D57567B9053a06760B62303p867j02817J37273
$$ 330823 125733 19184 -64815 457567 29053 -106760 262303 254436 151619 288892
14991B88892p4673J02982A14691a714l554A61315L65316A97211A0939N76922B79243
$$ 288892 214219 317201 114691 -1714 -5268 161315 526631 197211 10939 587861 279243
14979D33824j86247e000q7346B31260p9576I234K32368j09057E9748L64302j31212
$$ 433824 247577 -5000 -92346 231260 151684 9234 241602 132545 59748 424050 292838
14968B92838J66320D3976I130c7052D28766A06357D0023e8857A10723M09396k4071
$$ 292838 459158 43976 9130 -37052 428766 106357 40023 -58857 110723 520119 496048
14957D96048B1005J11783K35695D6504L26352j7549A16094K35263n2783c4452
$$ 496048 21005 132788 368483 46504 372856 355307 116094 351357 298574 -34452
14946C86765C5948J17797E6176M53955G1420K53995q8498J46472m9582N1615K497
$$ 386765 35948 153745 56176 510131 71420 325415 236917 383389 333807 385422 387919
14935C87919K5953j27499q9234Q2365A31455N26652B26021M7601A17251J1156
$$ 387919 413872 286373 197139 279504 131455 658107 226021 273622 117251 128407
14925A28407L64007J06071A19464L88380k09496K6265J22724J65227B54037j1846
$$ 128407 492414 598485 119464 507844 298348 324613 447337 612564 254037 242191
14915B42191L2451L2117j25800n722K12942j53559L3302L9784E2261K25933L03290
$$ 242191 274642 306759 180959 175237 388179 234620 267922 307706 52261 278194 581484
14904E81484j8585k49899m5294P7481Q1928b710C11022K69185m5005B59081j0617
$$ 581484 562899 313000 267706 345187 427115 -2710 311022 580207 535202 259081 248464
14893B48464j02707K75200j52483C1548M70949o1611k07202L12656R6050B05206
$$ 248464 145757 420957 268474 31548 502497 440886 233684 546340 642390 205206
14882D59638B15109L52305B24957K8092E097M27683j35943c5288A81912J3719
$$ 459638 215109 567414 224957 253049 5097 432780 296837 -35288 181912 195631
14872A95631j0613K85929M6875j18866O7258j34475K68989k76149J05592O7817
$$ 195631 185018 470947 517822 398956 466214 331739 600728 324579 430171 497988
14862D97988k633o7113j86278K82074A37961c3344D86265k18936N94649l96973
$$ 497988 495355 428242 241964 524038 137961 -33344 486265 267329 861978 465005
14852D65005j69378J94652J9672r5579O323j16895K80676A75251K33016J27157
$$ 465005 295627 490279 509951 414372 420695 303800 584476 175251 408267 535424
14842E35424j15202B07062K80071j10433N0245A83702L23688P8079J52293l0493
$$ 535424 420222 207062 487133 376700 426945 183702 507390 585469 737762 707269
14832G07269l04742M25354l43445l4338k04938J28926J43785N3824B27752J07205
$$ 707269 402527 827881 484436 450098 245160 374086 517871 571695 227752 334957
14822C34957N221J98460k6067k13609L44702r3260J5053j08300K14330l13609
$$ 334957 340178 538638 512571 298962 643664 550404 565457 457157 671487 357878
14812C57878J47425Q9225J2484k49286j74924K56340K17154j72097k31908J03455
$$ 357878 505303 594528 607012 357726 182802 439142 656296 484199 252291 355746
14802C55746J10585P812M30363B02434N25450l17398l8484L41355k5020q4772
$$ 355746 466331 474143 904506 202434 727884 410486 372002 713357 688337 603565
14792F03565J28582j90350J63826k21035j30494m7340m2022M01527Q0016q5278
$$ 603565 732147 541797 705623 484588 354094 306754 264732 666259 746275 660997
14782F60997j60802L5363j1138M2563M56313E10407P0614J62716p1525q3774L1859
$$ 660997 500195 535558 524420 566983 1023296 510407 581021 743737 672212 588438 620297
14771F20297O5329j16722K9961J19451l32327p6758J34732O4448q9699L69220
$$ 620297 685626 568904 598865 718316 385989 309231 443963 508411 418712 787932
14761G87932n4593j06490j52586N0135J73211j76629j3461J43570k43698J11599
$$ 787932 733339 626849 474263 524398 697609 520980 507519 651089 407391 518990
14751E18990n7185L03737j49477j56220N40692C37596L510R8642J45496L19188
$$ 518990 461805 765542 616065 459845 1000537 337596 341106 439748 585244 904432
14741I04432k49871r306L261L35432P9620k43793L3709J20976m0011j46619K65832
$$ 904432 654561 645255 648516 983948 1063568 819775 853484 974460 934449 787830 1053662
14730A053662m54621j5765L20898j99182j20274O2031K11466l98853M43759l38969
$$ 1053662 599041 583276 904174 704992 584718 646749 858215 459362 903121 564152
14720E64152K13516K35171j28422o3046q6568J60529l87677K05310K75474k21178
$$ 564152 777668 1012839 884417 821371 734803 895332 507655 712965 988439 767261
14710G67261M1179J5383K9828J06231K21586k09325J4091j20263M2018J32154
$$ 767261 808440 823823 853651 959882 1181468 972143 986234 865971 907989 1040143
14700A040143J17587l79119J64710j4628M042N1294k61767M0006J09145k19704
$$ 1040143 1157730 778611 943321 928693 932735 984029 722262 762268 871413 651709
14690F51709L80452k05319J01196K51101l15334r2603Q4754K43242J43008l02133
$$ 651709 1032161 826842 928038 1179139 863805 771202 855956 1099198 1242206 940073
14680I40073n2720K8861R4100o7288j12363P4651O8735k67756K50059K37870j81821
$$ 940073 887353 916214 1010314 943026 830663 905314 974049 706293 956352 1194222 1012401
14669A012401j12243k9550L88304k95945l5557K47650L0912j17295l63994N89446
$$ 1012401 900158 870608 1258912 962967 927410 1175060 1205972 1088677 724683 1314129
14659A314129O3350l71478m2092J54182J83858m52793N49934l41035j36386K57330
$$ 1314129 1377479 1006001 963909 1118091 1301949 849156 1399090 1058055 921669 1178999
14649A178999p8043K5742M33519l63843K48730l9367l78749K70997j39170L24219
$$ 1178999 1100956 1126698 1560217 1196374 1445104 1405737 1026988 1297985 1158815 1483034
14639A483034m78162L79486N7112j69801l6112l139K20542j59205L99646k89088
$$ 1483034 1004872 1384358 1441470 1271669 1235557 1232418 1452960 1293755 1693401 1404313
14629A404313j0493M35817l09369m86832M87706k41785K12829k58332j21891M60907
$$ 1404313 1393820 1829637 1520268 1033436 1521142 1279357 1492186 1233854 1111963 1572870
14619A572870n1412j56919J67611j9219l71168M89259K2945k35656j81001M52124
$$ 1572870 1521458 1364539 1532150 1512931 1141763 1631022 1653967 1418311 1237310 1689434
14609A689434l33301j05694K24070J99924J76959n08131J84632j01950J7341j0247
$$ 1689434 1356133 1250439 1474509 1674433 1851392 1343261 1527893 1425943 1443284 1433037
14599A433037J76594k77869K47599J21747L25695n7825J87567l92064J22314k70358
$$ 1433037 1609631 1331762 1579361 1701108 2026803 1968978 2156545 1764481 1886795 1616437
14589A616437L28428R4692j34709J36777R9334l01102k644J19294N2587k584q1611
$$ 1616437 1944865 2039557 1904848 2041625 2140959 1839857 1837213 1956507 2009094 2006510 1924899
14578A924899K50848l2655n4674K9967J74734j78730J26609J12886J1815k7754
$$ 1924899 2175747 2143092 2088418 2118385 2293119 2114389 2240998 2353884 2365699 2337945
14568B337945k1786P6544l8464M17593k85744j21480Q2094J63527q3790K4935
$$ 2337945 2316159 2392703 2354239 2771832 2486088 2364608 2446702 2610229 2526439 2551374
14558B551374N608M86989k26173M51367J84995m5484N22163N49357O88118J815928
$$ 2551374 2556982 3043971 2817798 3269165 3454160 3408676 3930839 4480196 5168314 6984242
14548F984242L072082Q947397K2440072O491439B3022049I621654m606977j904343
$$ 6984242 10056324 19003721 41443793 47935232 23022049 9621654 5014677 3110334
14540C110334n12538j37878K18697m92251r9745K16833n36958J40905K33239J54223
$$ 3110334 2597796 2459918 2678615 2186364 2086619 2303452 1766494 1907399 2140638 2294861
14530B294861l47260J7828J55945K94236Q2984k93682L6948N7295L04697k54029
$$ 2294861 1947601 1965429 2121374 2415610 2498594 2204912 2241860 2299155 2603852 2349823
14520B349823J81260K33478k53727L61193k43280K34214p8264n8222J74744j38307
$$ 2349823 2531083 2764561 2510834 2872027 2628747 2862961 2784697 2726475 2901219 2762912
14510B762912K9264M9074K32207m55854M07156O137J06236J4233K5640l31539
$$ 2762912 2792176 2841250 3073457 2617603 3024759 3030896 3137132 3151365 3177005 2845466
14500B845466M10929l96826M95518l4484J81554P5410k97438J68892K6900L88113
$$ 2845466 3256395 2859569 3355087 3320603 3502157 3577567 3280129 3449021 3475921 3864034
14490C864034k82390J14348Q3504j10841J74303m7257j27441J07729P9768p7418
$$ 3864034 3581644 3695992 3779496 3668655 3842958 3795701 3668260 3775989 3855757 3778339
14480C778339L76229o635m52171M73153J30976j56053J29819J25152k93169L10821
$$ 3778339 4154568 4147933 3695762 4168915 4299891 4143838 4273657 4398809 4105640 4416461
14470D416461l07293L73038J7297J99008k47240R1560L36850j85826J42148J49337
$$ 4416461 4109168 4482206 4499503 4698511 4451271 4542831 4879681 4693855 4836003 4985340
14460D985340j18842L05738n00803L32464N046K35408K14456k61181L88893J74274
$$ 4985340 4866498 5172236 4671433 5003897 5008943 5244351 5458807 5197626 5586519 5760793
14450E760793k60892K62487j24366K44541o78743N53646l7556Q2134n2801J28242
$$ 5760793 5499901 5762388 5638022 5882563 5203820 5757466 5719910 5802044 5749243 5877485
14440E877485K17937K26672K1290L7872j13579J81462L02407j54820R688L19052
$$ 5877485 6095422 6322094 6343384 6381256 6267677 6449139 6751546 6596726 6606414 6925466
14430F925466j15438O34976k15147l0150j61406J74928L65119Q2026L87074j95865
$$ 6925466 6810028 7445004 7229857 7199707 7038301 7213229 7578348 7660374 8047448 7851583
14420G851583L87288l93114P8617M68400k6099J38476p987k0576O04357J58643
$$ 7851583 8238871 7845757 7924374 8392774 8366675 8505151 8497164 8476588 9080945 9239588
14410I239588l83079L11646L83809k22584J90953M05845J36222K43590j11030
$$ 9239588 8856509 9168155 9551964 9329380 9520333 9926178 10062400 10305990 10194960
14401A0194960M88407k08257M34157p4475J99563k52749Q43553K0729P10888m13184
$$ 10194960 10683367 10475110 10909267 10834792 11034355 10781606 11625159 11645888 12356776 11943592
14391A1943592O78836j25125K06787K04053J40333M48911Q0882m3739N29132N63778
$$ 11943592 12622428 12497303 12704090 12908143 13048476 13497387 13578269 13534530 14063662 14627440
14381A4627440K3287M45145l4629K27870K87320J92111K22467P09684j92231O06291
$$ 14627440 14650727 15095872 15061243 15289113 15576433 15768544 15991011 16700695 16508464 17114755
14371A7114755K48393N65773K2372N14161J37866Q03931K60339J15465N39922
$$ 17114755 17363148 17928921 17951293 18465454 18603320 19407251 19667590 19783055 20322977
14362B0322977N99512K69006K72299O92716L54006N98438P04840L36392P20529
$$ 20322977 20922489 21191495 21463794 22156510 22510516 23108954 23813794 24150186 24870715
14353B4870715K51208Q71358P88935L11009J106382M40714R93776R4632J044052
$$ 24870715 25121923 25993281 26782216 27093225 28199607 28640321 29634097 29728729 30772781
14344C0772781P12795P02119J163119Q51865J013803J043382J102525N97060J217919
$$ 30772781 31485576 32187695 33350814 34202679 35216482 36259864 37362389 37959449 39177368
14335C9177368J091449J384911J117330J072794J346246J499652J300912J451167
$$ 39177368 40268817 41653728 42771058 43843852 45190098 46689750 47990662 49441829
14327D9441829J972012J328302J831115J681589K138481J944201J827314K177721
$$ 49441829 51413841 52742143 54573258 56254847 58393328 60337529 62164843 64342564
14319F4342564K564230K193692K788878K579292K739328L004444K849952L431481
$$ 64342564 66906794 69100486 71889364 74468656 77207984 80212428 83062380 86493861
14311H6493861L595053L399480M069325L997163M836597M074186N109339M867812
$$ 86493861 90088914 93488394 97557719 101554882 106391479 110465665 115575004 120442816
14303A20442816N768015N554819O105522O331645O952850P545887P897960P822433
$$ 120442816 126210831 131765650 137871172 144202817 151155667 158701554 166599514 174421947
14295A74421947Q739426R089816J0124307J0246133J0824486J1235605J2044224
$$ 174421947 183161373 192251189 202375496 212621629 223446115 234681720 246725944
14288B46725944J2496554J3096756J3587038J4292514J4433662J4784980J5171440
$$ 246725944 259222498 272319254 285906292 300198806 314632468 329417448 344588888
14281C44588888J5165166J4987833J4602222J4296098J3185966J2684542J1054868
$$ 344588888 359754054 374741887 389344109 403640207 416826173 429510715 440565583
14274D40565583R254464O599984L254165J185378L28837k372543l540529k166308
$$ 440565583 449820047 456420031 459674196 460859574 461188411 458815868 455275339 453109031
14266D53109031n053724p900722r692001j1775439j3063740j4121835j4611345
$$ 453109031 448055307 440154585 430462584 418687145 405623405 391501570 376890225
14259C76890225j5393466j5024063j5388863j5438387j3472753j4455406j3584893
$$ 376890225 361496759 346472696 331083833 315645446 302172693 287717287 274132394
14252B74132394j3378186j2959300j2077163j1409817j1026793j0272042j0155859
$$ 274132394 260754208 247794908 235717745 224307928 213281135 203009093 192853234
14245A92853234r085173q592848q076522p996883p509837o884698o806131n704013
$$ 192853234 183768061 175175213 167098691 159101808 151591971 144707273 137901142 132197129
14237A32197129n769012n468764n393253m845478m490348m157629l953047l752042
$$ 132197129 126428117 120959353 115566100 110720622 106230274 102072645 98119598 94367556
14229I4367556l853030l592632l560086k997037k987512l125158k450272k447981
$$ 94367556 90514526 86921894 83361808 80364771 77377259 74252101 71801829 69353848
14221F9353848k604775k060113k373169j952612k182589j759407j628428j674117
$$ 69353848 66749073 64688960 62315791 60363179 58180590 56421183 54792755 53118638
14213E3118638q95808k379139j518194j623661j458941j116108j87337k021886
$$ 53118638 52222830 49843691 48325497 46701836 45242895 44126787 43939450 41917564
14205D1917564q35849j658497j043852j010809r84533j83650j337210j009764
$$ 41917564 41081715 39423218 38379366 37368557 36384024 36200374 34863164 33853400
14197C3853400r22749j264443p07583q85174k43689r94321m24037j078518o60404
$$ 33853400 32930651 31666208 30958625 30073451 29829762 28835441 28411404 27332886 26672482
14188B6672482p27306k034n07388r98425n59848o18064l61407j49116j005217
$$ 26672482 25945176 25943142 25435754 24437329 23877481 23259417 22898010 22748894 21743677
14179B1743677r5715p84954n33992L4133q19811k09543k99637n44190r086o24397
$$ 21743677 21647962 20863008 20329016 20363149 19543338 19333795 19034158 18489968 18480882 17856485
14169A7856485l04332n43363k15416l32621k98465l20634k46815k67660k08898
$$ 17856485 17552153 17008790 16793374 16460753 16162288 15841654 15594839 15327179 15118281
14160A5118281l86443j82815m25512l60063J4582n58503J43736j96158m11914
$$ 15118281 14731838 14549023 14123511 13763448 13778030 13219527 13363263 13167105 12755191
14151A2755191l65712N3676k01000n9317m20910m6025l24678j04737l66803L32311
$$ 12755191 12389479 12443155 12242155 12182838 11761928 11715903 11391225 11286488 10919685 11251996
14141A1251996q03884n7447k166Q8563m08846p5680l43268J54136n3441k84191
$$ 11251996 10448112 10390665 10388499 10477062 10068216 9992536 9649268 9803404 9749963 9465772
14131I465772l9666k84077j26900j14760q2724j11630j86505j66063J71677l67395
$$ 9465772 9426106 9142029 9015129 8900369 8817645 8706015 8519510 8353447 8525124 8157729
14121H157729q4350l62410J62902j59831P7978k00674j15655J78794n77419J29513
$$ 8157729 8073379 7710969 7873871 7714040 7792018 7591344 7475689 7654483 7077064 7206577
14111G206577n4676j21766M3815n63860R6523Q3630j86183P343N7497k95382J75657
$$ 7206577 7151901 7030135 7073950 6510090 6606613 6690243 6504060 6511403 6568900 6273518 6449175
14100F449175k59113L2410k34536k11520J04102J38119k78576j75187k39986K34720
$$ 6449175 6190062 6222472 5987936 5776416 5880518 6018637 5740061 5564874 5324888 5559608
14090E559608J47632m14327K16573k79170J12115K6772j71301j72033Q880l54948
$$ 5559608 5707240 5292913 5509486 5230316 5342431 5369203 5197902 5025869 5034749 4679801
14080D679801M21062P8065j92993m48086O4385Q461J82307j80853k08820R1098
$$ 4679801 5100863 5178928 4985935 4537849 4602234 4610695 4793002 4612149 4403329 4494427
14070D494427r1766o5648k45975J42760j18905J6219N4470l6191r5850n3552J44629
$$ 4494427 4402661 4337013 4091038 4233798 4114893 4131112 4185582 4149391 4053541 3999989 4144618
14059D144618n277n0857m61708m5605K58237k46960P8254J37225k20130j58927
$$ 4144618 4139341 4088484 3626776 3581171 3839408 3592448 3670702 3807927 3587797 3428870
14049C428870K29719j42261K13037k71919k57086J56053Q9984j0712J09749l03547
$$ 3428870 3658589 3516328 3729365 3457446 3200360 3356413 3446397 3435685 3545434 3241887
14039C241887k7960j31886R9198J36445l54446J30867J22828r1507m23408P39541
$$ 3241887 3213927 3082041 3181239 3317684 2963238 3094105 3216933 3125426 2702018 3441559
14029C441559j72582p23806M45658l66875K23880K38485l75111K04523m86373
$$ 3441559 3268977 2545171 2990829 2623954 2847834 3086319 2711208 2915731 2429358
14020B429358L51110l07754J58951J13648J89181K1808l42315J38805k32371k50041
$$ 2429358 2780468 2472714 2631665 2745313 2934494 2956302 2613987 2752792 2520421 2270380
14010B270380L58312n6007Q303j80887o0319m6410m27938M51142j33281Q6928
$$ 2270380 2628692 2572685 2580988 2400101 2339782 2293372 1865434 2316576 2183295 2270223
14000B270223j28737L12690m06088J65604n1819j62912r4462m8941l3123J32327
$$ 2270223 2141486 2454176 2048088 2213692 2161873 1998961 1904499 1855558 1822435 1954762
13990A954762K04465Q22645K169069O591551K0722852J7816910k3557770j2499883
$$ 1954762 2159227 2981872 5150941 11742492 32465344 50282254 26724484 14224601
13982A4224601n553357k437921q87772j175035k39466l94350n03150k58760M5491
$$ 14224601 8671244 6233323 5345551 4170516 3931050 3536700 3033550 2774790 2820281
13973B820281j33954n4530j18630P2357L15637l35727l8280k04253k03280K3776
$$ 2820281 2686327 2631797 2513167 2585524 2901161 2565434 2527154 2322901 2119621 2143397
13963B143397P1813M9083j42448m8930N1558m0655k66034M16228k69996l18703
$$ 2143397 2215210 2264293 2121845 2072915 2124473 2083818 1817784 2234012 1964016 1645313
13953A645313M29166L14340m56667K7001J24937k29134k58789K09101k05970K43539
$$ 1645313 2074479 2388819 1932152 1959153 2084090 1854956 1596167 1805268 1599298 1842837
13943A842837J66029k79135R3391P0920k81513L6599Q5773J62149l31044Q5985
$$ 1842837 2008866 1729731 1823122 1894042 1612529 1649128 1734901 1897050 1566006 1651991
13933A651991K3091P347r02R1791N1852k33339Q5877k01808P7558L0818j70096
$$ 1651991 1675082 1682429 1681527 1773318 1825170 1591831 1677708 1475900 1553458 1584276 1414180
13922A414180N7224M08154Q5581l44255k66956j45920K08601J27664J64593k29963
$$ 1414180 1471404 1879558 1965139 1620884 1353928 1208008 1416609 1544273 1708866 1478903
13912A478903K2400j33460j74582J93886j28510K57482J47472j63452j15952K77710
$$ 1478903 1501303 1367843 1193261 1387147 1258637 1516119 1663591 1500139 1384187 1661897
13902A661897l22491J28397N9590l85381J91334k34558j4291K40229Q4805j37215
$$ 1661897 1339406 1467803 1527393 1142012 1333346 1098788 1084497 1324726 1409531 1272316
13892A272316O569Q2993j33708L58336k11733n3708j72238J36528J59213j44160
$$ 1272316 1278885 1361878 1228170 1586506 1374773 1321065 1148827 1285355 1444568 1300408
13882A300408k14398j99434M39667k01400J09277j76857J87808l31162K64106
$$ 1300408 1086010 886576 1326243 1124843 1234120 1057263 1245071 913909 1178015
13873A178015k88958n3902M62454j50251N2411l04469M5632M60054n85595M35059
$$ 1178015 889057 835155 1297609 1147358 1199769 895300 940932 1400986 815391 1250450
13863A250450k48617P2553k9719m5517m5655L20599J43916k82807j81361M5230
$$ 1250450 1001833 1074386 1044667 999150 953495 1274094 1418010 1135203 953842 999072
13853I99072L87219l57001k79507L30991J6089J1404j09681L12294l04939l7352
$$ 999072 1386291 1029290 749783 1080774 1096863 1108267 998586 1310880 1005941 968589
13843I68589J53056r2517L34713l34655J835q8945K07631k25877j04207K24839
$$ 968589 1121645 1029128 1363841 1029186 1031021 942076 1149707 923830 819623 1044462
13833A044462k96633L33546R5616j22188N4296m20451M89500k32797k0458o8181
$$ 1044462 747829 1081375 1176991 1054803 1109099 688648 1178148 945351 924893 856712
13823H56712J1220q2353P3285j57711J37480l5325J42420j8510j41137J59729
$$ 856712 867932 785579 858864 701153 838633 803308 945728 927218 786081 945810
13813I45810k48714J91921D31118K18690K81742j86885J74556k55911K96700j18766
$$ 945810 697096 889017 431118 649808 931550 744665 919221 663310 960010 841244
13803H41244M95172n93422P7331j76535M4683J10138l66559M06850j63391K29127
$$ 841244 1336416 742994 820325 643790 688473 798611 432052 838902 675511 904638
13793I04638j22049k163C39309L90294J37326l41106N88396m6220D86163J09511
$$ 904638 782589 780426 339309 729603 866929 525823 1114219 1067999 486163 595674
13783E95674M468K41876j52702J80972j30017L2404O3241N9900l68095J41961
$$ 595674 600142 842018 689316 870288 740271 772675 835916 895816 527721 669682
13773F69682N22910D10550P0361K71717J40448l10464P3692J98944j51578P5344
$$ 669682 1192592 410550 480911 752628 893076 582612 656304 855248 703670 779014
13763G79014R5760l43692P1990J07632j77433L68521l16842M21188m58476Q5943
$$ 779014 874774 531082 603072 710704 533271 901792 584950 1006138 547662 633605
13753F33605J4244J18289K51039C99583K18150j22023P2918J0006K28753l20127
$$ 633605 647849 766138 1017177 399583 617733 495710 568628 578634 807387 487260
13743D87260K92850j41416K38449k07964K29600k59372M9234q1807Q8558o3995
$$ 487260 780110 638694 877143 669179 898779 639407 688641 606834 695392 631397
13733F31397j03529J66373p093j75174K06436o5809B37997L09685K3053J2737
$$ 631397 527868 694241 687148 511974 718410 652601 237997 547682 570735 583472
13723E83472k30008K60759J3693k0186Q4668N010l6588M2179J34957C34184L41023
$$ 583472 353464 614223 627916 607730 692398 697408 660820 702999 837956 334184 675207
13712F75207j86623M5936r238j21640J45679j76364L02450J16096C28084N74828
$$ 675207 488584 534520 525282 403642 549321 372957 675407 791503 328084 902912
13702I02912m19780l2522B24721Q9438N28929k74742B46708K04939J90560k54132
$$ 902912 483132 450610 224721 314159 843088 568346 246708 451647 642207 388075
13692C88075J54852m9636K52900C66827J45485M42853C32305J52774q3823M13419
$$ 388075 542927 493291 746191 366827 512312 955165 332305 485079 401256 814675
13682H14675B75013K79455B14336m6550K15568N11534k54489j18607J0500j26723
$$ 814675 275013 554468 214336 167786 383354 894888 640399 521792 532292 405569
13672D05569L81132j82576A89322J29061J32295R3266B58008L15244I3398N0391
$$ 405569 786701 604125 189322 318383 450678 543944 258008 573252 93398 143789
13662A43789O38493j67754o4480L3586l0384m1078j20847O6487l5599j71794L7531
$$ 143789 782282 614528 550048 583634 553250 512172 391325 457812 422213 250419 287950
13651B87950J14430P7564m3533r3855M9373J16360l3306j38149J7278j34330L40896
$$ 287950 402380 479944 436411 342556 391929 508289 474983 336834 354112 219782 560678
13640E60678J8463P3048j23406p8436j55754J25210M5050k10989O3958l8829J08788
$$ 560678 579141 652189 528783 450347 294593 419803 464853 253864 317822 278993 387781
13629C87781M0461J69036B02073K78807j62560J61614j33599M10242A54383K41961
$$ 387781 428242 597278 202073 480880 318320 479934 346335 756577 154383 396344
13619C96344o4593J61909r5156D6316J97970O7446i9196C01402K28697A09726
$$ 396344 331751 493660 398504 46316 244286 311732 -99196 301402 530099 109726
13608C18234k9818A14974M12448n1561j51342o8752O7826J89020j19375H6856
$$ 318234 288416 114974 527422 475861 324519 255767 323593 512613 393238 86856
13597E18333A56526K25092I8440L44842m3173J10644f3311A97500M69010k37744
$$ 518333 156526 381618 98440 443282 400109 510753 -63311 197500 666510 428766
13587D28766A37439J53964K9639Q3530R2607r8540K03883j34481K12475k55236
$$ 428766 137439 291403 321042 404572 497179 398639 602522 468041 680516 425280
13577D25280n7491k8543L3903J08164n5375E3032J20839K20772R0114k30656K9535
$$ 425280 367789 339246 373149 481313 425938 53032 173871 394643 484757 254101 283636
13566B83636J30567j54001P4995L56730d1405B11212p1781J46322l4738o3804
$$ 283636 414203 260202 335197 691927 -41405 211212 139431 285753 251015 187211
13556A87211J65150j73066K14140j14165G7555K48130o5084k0945E8662K61213
$$ 187211 352361 179295 393435 279270 77555 325685 260601 239656 58662 319875
13546C19875L2062N9685R2906I6777J92090n6425L40417B79467J59558l9004p1251
$$ 319875 351937 411622 504528 96777 288867 232442 572859 279467 439025 400021 328770
13535C28770m2410A31241J54055J15685a27769C0987K32973k8184F0984M63140
$$ 328770 286360 131241 285296 400981 -127769 30987 263960 235776 60984 524124
13525E24124k25618A34757L96849k56904L32634B25402L09579j92132J30839K0900
$$ 524124 298506 134757 531606 274702 607336 225402 534981 342849 473688 494588
13515D94588A63908N1741I4230p297P201a62239B55952m3915A0679L42149B6613
$$ 494588 163908 215649 94230 86933 94134 -162239 255952 212037 10679 352828 26613
13503A90361P899I3769a7648B80274K62444i1958C19774C6919K83528r6928N6897
$$ 190361 198260 93769 -17648 280274 542718 -91958 319774 36919 320447 223519 280416
13492B80416A2562L34052m6367l3092a06663C30452J04921j97922K7790j03840
$$ 280416 12562 346614 300247 267155 -106663 330452 435373 237451 265241 161401
13482A61401J11191K0636M3888j10685J0393J04002A0260K38494N7977m9918j9752
$$ 161401 272592 293228 337116 226431 236824 340826 10260 248754 306731 256813 237061
13471B37061M763J19678j01285J20597O1454j82056a03551B48220j2026J54614
$$ 237061 241824 361502 260217 380814 442268 260212 -103551 248220 236194 390808
13461C90808B2613L99445A74304J48640l1553r3908M5759C525L25254K5110J15645
$$ 390808 22613 422058 174304 322944 291391 197483 243242 3525 328779 353889 469534
13450D69534b47490D78426A24307l7515J11829r3598j2993j9667B7485J98641
$$ 469534 -247490 478426 124307 86792 198621 105023 92030 72363 27485 226126
13440B26126J3078a72707A0914L01277M326l1884n4578R811m9486j0399L4228
$$ 226126 239204 -172707 10914 312191 316517 284633 230055 239866 190380 179981 214209
13429B14209J65276J66408G5459N28919A30047i8465i999D45555c334C0545L39791
$$ 214209 379485 545893 75459 604378 130047 -98465 -9999 445555 -3334 30545 370336
13418C70336j12739I4075m0827a10644B67821F4227K53713l2767M5108d9273A79664
$$ 370336 257597 94075 53248 -110644 267821 64227 317940 285173 330281 -49273 179664
13406d5916n8759B78755e3507E16183j42899A49997J55089Q7188J00145k06414
$$ -45916 -104675 278755 -53507 516183 373284 149997 305086 392274 492419 286005
13396B86005o6646K61967i0594C39907A69511O527K3053J39419q6297L2545b4626
$$ 286005 219359 481326 -90594 339907 169511 176038 199091 338510 252213 284758 -24626
13384I6222R1731c9177C39432j24772B2384K87523J57062J16140B01421K75931
$$ 96222 187953 -39177 339432 214660 22384 309907 466969 583109 201421 477352
13374D77352j6778h3181A26323J86054j07033K54974j83800o4567L5665H861J02313
$$ 477352 460574 -83181 126323 312377 205344 460318 276518 211951 247616 8861 111174
13363A11174Q1719m7029K57040J13776j11989e1555A67978J7392H0802K68682
$$ 111174 192893 145864 402904 516680 404691 -51555 167978 185370 80802 349484
13353C49484j0862r6225J62266j88632O8138f0305C50933c3450E7411j6269M36062
$$ 349484 338622 242397 404663 216031 284169 -60305 350933 -33450 57411 41142 477204
13342D77204l8344J9203k26376j02015L46071j49018j1340A15881L86003I9589
$$ 477204 438860 458063 231687 129672 475743 326725 315385 115881 501884 99589
13331E9038j9145L99115H5449J90189J5927F6009K65987E4557M6050J05955p501
$$ 59038 39893 439008 85449 275638 291565 66009 331996 54557 100607 206562 199061
13320A99061K48451I1939K98128E9309K5149L44258a79974I0514J08709J37475
$$ 199061 447512 91939 390067 59309 84458 428716 -179974 90514 199223 336698
13310C36698r1894K18804A98039K64706A17339f2540A07499m7992L22108j50457
$$ 336698 244804 463608 198039 462745 117339 -62540 107499 59507 381615 231158
13300B31158e4066B15005a13515B10901M77122A01801K58147E4249J41159J05898
$$ 231158 -54066 215005 -113515 210901 688023 101801 359948 54249 195408 301306
13290C01306C426d3675A66811J7963p8268b71041D60640a40269A89199J31144
$$ 301306 3426 -43675 166811 184774 106506 -271041 460640 -140269 189199 320343
13280C20343G6785J30505m4049f8914C7184A0731J80110f3787D74732A79543q9514
$$ 320343 76785 207290 163241 -68914 37184 10731 190841 -63787 474732 179543 90029
13269I0029a7997o7972k19089A35401a01691B62818g5178D75388j21049a11234
$$ 90029 -17997 -85969 -305058 135401 -101691 262818 -75178 475388 354339 -111234
13258a44467A69435g1118C52423r0002J4610i8707A75629E2375o064a28718J1338
$$ -144467 169435 -71118 352423 262421 277031 -98707 175629 52375 46311 -128718 -117380
13247a17380A20674R5782f1506g330A49699J97202A34832J4770j4066J44557e8775
$$ -117380 120674 216456 -61506 -7330 149699 346901 134832 149602 135536 280093 -58775
13235a29346N6336a0652B02097J28201I4433J26077R494m0983d4643B28850E2119
$$ -129346 -73010 -10652 202097 330298 94433 220510 230004 189021 -44643 228850 52119
13223A29929E4750R8846n7713C3356f0060H3535M0335C7179a54170B11309E5294
$$ 129929 54750 153596 95883 33356 -60060 83535 123870 37179 -154170 211309 55294
13211H5258d9240q1579A63925F5532b2437A67002h7697G5040a24441B36060K20118
$$ 85258 -49240 -130819 163925 65532 -22437 167002 -87697 75040 -124441 236060 456178
13200D56178A01070l7539R7804J38589a53481N1013A6311h2290A03426i9664b698
$$ 456178 101070 63531 161335 299924 -153481 -102468 16311 -82290 103426 -99664 -2698
13188a54270B84628A08315b5871A80171J74815F9206J47779M7676a21735H3219
$$ -154270 284628 108315 -25871 180171 354986 69206 216985 264661 -121735 83219
13177A29163J26101A5118b077F3848a48093C7249J87542h3918I0175Q5562A473
$$ 129163 255264 15118 -2077 63848 -148093 37249 224791 -83918 90175 175737 1473
13165a43084A64282L20262A82973J26847A07865J08545r8533L3082I867b38485
$$ -143084 164282 484544 182973 309820 107865 216410 117877 150959 9867 -238485
13154B17270p4873F5146J3305J63174A8170b30595b3411p3431B95208j09643K03847
$$ 217270 142397 65146 78451 241625 18170 -230595 -23411 -96842 295208 185565 389412
13143C89412g384B08924d2146n6469C04171E8033d3127I0408B4883Q7339L7753
$$ 389412 -7384 208924 -42146 -98615 304171 58033 -43127 90408 24883 112222 149975
13132A49975R2284A20799J51423c1994A83425a16856C18177C0361J47678o4969
$$ 149975 242259 120799 272222 -31994 183425 -116856 318177 30361 178039 113070
13122A13070j7143J60057b8781B7073L48834A63149a41480A95644E6919i4398
$$ 113070 95927 255984 -28781 27073 375907 163149 -141480 195644 56919 -94398
13111b7601j67358B8251b9494A47161H70J05545J83630A12368j6146K10510h3035
$$ -27601 -194959 28251 -29494 147161 870 106415 290045 112368 96222 306732 -83035
13099A26448B9239J31101a24592A15746a18005m6591E6322a45331C34248A47119
$$ 126448 29239 160340 -124592 115746 -118005 -164596 56322 -145331 334248 147119
13088A56430F0035J57589G5694O1971C7913A7245M9664K06611J68937d402D48544
$$ 156430 60035 217624 75694 137665 37913 17245 66909 273520 442457 -4402 448544
13076H5665h8748D13596I6173P770i3935A17085J25578E3504f5882H2688b21012
$$ 85665 -88748 413596 96173 103943 -93935 117085 242663 53504 -65882 82688 -221012
13064b6613C69663j25257k0889a37816B63696b43769d4462D28235j34654m8089
$$ -26613 369663 244406 223517 -137816 263696 -243769 -44462 428235 293581 245492
13054B45492B8649R0132C6824K16198P2051E0529K03481a38179d8827E1803A9271
$$ 245492 28649 118781 36824 253022 325073 50529 254010 -138179 -48827 51803 19271
13042h5172A89592b04005C64084j20258I7496J85778I4036N443K00563E3780n289
$$ -85172 189592 -204005 364084 243826 97496 283274 94036 99479 300042 53780 48491
13031D8491K51192a45913B58913O1107C4002A3112K04766C8512b38206i9304F1061
$$ 48491 299683 -145913 258913 320020 34002 13112 217878 38512 -238206 -99304 61061
13019A69701a28100C4361a8272B40518K9155a72725B07809p6458d1904A41274
$$ 169701 -128100 34361 -18272 240518 269673 -172725 207809 131351 -41904 141274
13008B70435F9162j0805J65646c4740i131B15249b5328A49475g4841B08826G3667
$$ 270435 69162 58357 224003 -34740 -9131 215249 -25328 149475 -74841 208826 73667
12996a76588A07260a28258M8906F0612J36807a5219H3296a71367d7401p3311A42037
$$ -176588 107260 -128258 -79352 60612 197419 -15219 83296 -171367 -47401 -120712 142037
12984A2646P6869K01442a49646B74097d2464j22904D17582o7117a36120e4450
$$ 12646 89515 290957 -149646 274097 -42464 -165368 417582 350465 -136120 -54450
12973e0049B330a42085B11822Q830J19169A21640g3220j15554A11273J39694b0884
$$ -50049 2330 -142085 211822 220652 339821 121640 -73220 -188774 111273 250967 -20884
12961b15711d6688A28810K3761K29333I4784l7929a82422C48768R5849E721e9010
$$ -215711 -46688 128810 152571 381904 94784 56855 -182422 348768 444617 5721 -59010
12949a76868D02792A96435n55J14937p6366K28D347N00746c83435I7339C9465
$$ -176868 402792 196435 195880 310817 234451 234679 4347 505093 -383435 97339 39465
12937F5520P2437a91610M3871G4391J11648g7011E9712K89642j02032h8153b2519
$$ 65520 137957 -191610 -147739 74391 186039 -77011 59712 349354 247322 -88153 -22519
12925B69019a85154C10848e6086B515a00401D1570R7364k2023C1469l718J07156
$$ 269019 -185154 310848 -56086 2515 -100401 41570 138934 116911 31469 27751 134907
12914A34907k6084a14978j95537a40440q169k444B979K37062a26184c3019A40776
$$ 134907 108823 -114978 -310515 -140440 -148609 -151053 2979 240041 -126184 -33019 140776
12902B55339F5789f9499m2986L5140A30562a34292C9009J46273D3150Q422e7129
$$ 255339 65789 -69499 -112485 -77345 130562 -134292 39009 185282 43150 51572 -57129
12890e560A50947K4828a67528B19479k5083K81213b01086Q5611A53130c09954
$$ -5560 150947 175775 -167528 219479 194396 475609 -201086 -115475 153130 -309954
12879A92901l0376b76819G6586K65761i5210A73678d81682f7133L3162q0818l38817
$$ 192901 162525 -276819 76586 342347 -95210 173678 -481682 -67133 -33971 -114789 -453606
12868d53606d1118o7778c0768B59623D2288K27737F0182L03216r5859a55631K7164
$$ -453606 -41118 -108896 -30768 259623 42288 270025 60182 363398 267539 -155631 -128467
12857a28467E41766A11232l6626J87072A29645i2572A66092a78740H8234i9A49777
$$ -128467 541766 111232 74606 261678 129645 -92572 166092 -178740 88234 -99 149777
12845c2271j58980P5651M3808B57506b0131j86534A47166F7466o7Q9042o7280
$$ -32271 -191251 -115600 -71792 257506 -20131 -206665 147166 67466 67399 156441 89161
12834H9161j4765k5267K40152j29560A3930J13910p724J03953q9347K88418a1454
$$ 89161 74396 49129 289281 159721 13930 127840 120116 224069 134722 423140 -11454
12822D60791B8454R3179b2664A0551M6296d2590B22318b43827n467J10594A68370
$$ 460791 28454 121633 -22664 10551 56847 -42590 222318 -243827 -249294 -138700 168370
12810G4846J9282a18252L6341a977A79596C4343J66874A7008L06437f116j57627
$$ 74846 94128 -118252 -81911 -1977 179596 34343 201217 17008 323445 -6116 -163743
12799a63743M3301b1293h138C27831H0161C2083A156g9898G3468B2035Q9630b40600
$$ -163743 -120442 -21293 -8138 327831 80161 32083 1156 -79898 73468 22035 111665 -240600
12786A9912L2838J25845F0913J49433E4902j0313a04748M9170a8069A08774d6082
$$ 19912 52750 178595 60913 210346 54902 44589 -104748 -55578 -18069 108774 -46082
12774E2604B5642e0343i018l05004E7838J77664d8202j56465k80521B90971L8264
$$ 52604 25642 -50343 -9018 -314022 57838 235502 -48202 -204667 -485188 290971 329235
12763C29235D6940a95358I1614c75392A8734c929A12456J9626j3947R914g832
$$ 329235 46940 -195358 91614 -375392 18734 -3929 112456 132082 118135 128049 -7832
12751D8618d0947j16629L432I5475h3543B3361a53j13918n3245D9071J0480R4063
$$ 48618 -40947 -157576 -154144 95475 -83543 23361 -153 -114071 -167316 49071 59551 153614
12739A53614M6640A5721K19002L4920a16261D39086B14536D5059J89456G53a36529
$$ 153614 200254 15721 234723 269643 -116261 439086 214536 45059 234515 753 -136529
12727i0996A40705J30788I2639K6741E0283i658D7960a99990B57203D3935L4045
$$ -90996 140705 271493 92639 119380 50283 -9658 47960 -199990 257203 43935 77980
12716G7980J07236a72756M4747n489r0425R4013E8624J81619q9113L35806j33771
$$ 77980 185216 -172756 -128009 -133498 -223923 -129910 58624 240243 151130 486936 353165
12705C53165A34967E7127M9724R8135o1176A1402b922H2319L97619b0774k29979
$$ 353165 134967 57127 106851 204986 143810 11402 -2922 82319 479938 -20774 -250753
12694b50753C9477b539A00294a55601J8394J5890b1741B2627a53471B45585A08090
$$ -250753 39477 -2539 100294 -155601 -137207 -121317 -21741 22627 -153471 245585 108090
12682A59682J49001e581B88657m0872l887j00678J26969g8235a0938E3801K3126
$$ 159682 308683 -5581 288657 247785 243898 143220 270189 -78235 -10938 53801 76927
12671G6927f9429H0606k7258L8859b07397g8923H0274J47880g3231F195e0916
$$ 76927 -69429 80606 53348 92207 -207397 -78923 80274 228154 -73231 6195 -50916
12659A60784f6816D02657E0128a1642j6767H4347a91851A71680K6406b54705C76952
$$ 160784 -66816 402657 50128 -11642 -28409 84347 -191851 171680 198086 -254705 376952
12647e886A1533i2035I3960l0002g2688G9263a9308A15995a63788d4698A07500
$$ -5886 11533 -92035 93960 63958 -72688 79263 -19308 115995 -163788 -44698 107500
12635B59667o7636D0408J63806I8664P4235e2679B58069r3287a1275A84312J20656
$$ 259667 192031 40408 204214 98664 172899 -52679 258069 164782 -11275 184312 304968
12624C04968R0800r3514L70883A37833J76010a44822A30387R642K66281B01331
$$ 304968 395768 302254 673137 137833 313843 -144822 130387 140029 406310 201331
12613g0899O501K180j6737A95673E7643R6784b49890i8271j31479g4260o0260
$$ -70899 -64398 -62218 -78955 195673 57643 154427 -249890 -98271 -229750 -74260 -134520
12602a34520C0978a77673e1453G5211l1229K15791A26618b2632A06296j4815D3614
$$ -134520 30978 -177673 -51453 75211 43982 259773 126618 -22632 106296 91481 43614
12590H0700c65948h8218E8020K49764C4468c58067A76471p1465a30182C44948
$$ 80700 -365948 -88218 58020 307784 34468 -358067 176471 105006 -130182 344948
12579A75254i4877j07730d4138B96645e968C15368H2896I742b4150F4688c5343
$$ 175254 -94877 -202607 -44138 296645 -5968 315368 82896 9742 -24150 64688 -35343
12567A07773J10729a67082C1843L00935d19570a55193G78N2248a7246k48496E5394
$$ 107773 218502 -167082 31843 332778 -419570 -155193 778 53026 -17246 -265742 55394
12555G7485K28834f525j46263B12042B0216Q2314h3949L3040k83388J59103H2774
$$ 77485 306319 -6525 -152788 212042 20216 102530 -83949 -50909 -334297 -175194 82774
12543a46881B6859a53496O9685B4735J78375a17664A10804f0142m3924a2708p0516
$$ -146881 26859 -153496 -83811 24735 203110 -117664 110804 -60142 -104066 -12708 -83224
12532h3224j26425O3927A64281f1362C18890p6784G1779A7338J21402R674J2889
$$ -83224 -209649 -145722 164281 -61362 318890 242106 71779 17338 138740 148414 161303
12521A61303D5792J25695b9360j02969a888C33245a62200H0911a748B90840a66749
$$ 161303 45792 171487 -29360 -132329 -1888 333245 -162200 80911 -1748 290840 -166749
12509A07557e5084l3926B28392b1169A3995O5356i8822L606C5415h5387j32826
$$ 107557 -55084 -89010 228392 -21169 13995 79351 -98822 -95216 35415 -85387 -218213
12498b18213A82142o5376j2199K115a13842L4818o2177A742L31932F0897J7001
$$ -218213 182142 116766 104567 106682 -113842 -79024 -141201 1742 333674 60897 77898
12487G7898L6871O2476b76858a31233j69103i403B85910c7163l84909B59307d7388
$$ 77898 114769 177245 -276858 -131233 -300336 -9403 285910 -37163 -422072 259307 -47388
12475A44735J81937d544B01331C1853O7473l0245K48348a08818k41357a17126
$$ 144735 326672 -4544 201331 31853 99326 69081 317429 -108818 -350175 -117126
12464c87851a9108B96788J13116l222b280r9176D5262Q144b446l42944a58012
$$ -387851 -19108 296788 409904 406682 -2280 -101456 45262 53406 -2446 -345390 -158012
12452h2241B69234A23590E6838J67153a74776A74311o8659n1441b0914j40551
$$ -82241 269234 123590 56838 223991 -174776 174311 105652 54211 -20914 -161465
12442a61465L4089g978j04171N1709o1425E513J49362j9493a23305e6332H9599
$$ -161465 -127376 -7978 -112149 -60440 -121865 5513 154875 135382 -123305 -56332 89599
12430a32509m08771a10329A82046a6511j46580j67075a32015o3198A69054b43908
$$ -132509 -541280 -110329 182046 -16511 -163091 -330166 -132015 -195213 169054 -243908
12419I536b44965C3977a64374j43185f3366j41869A29346B7451J58997c2055A63102
$$ 9536 -244965 33977 -164374 -307559 -63366 -205235 129346 27451 186448 -32055 163102
12407d709l29087A07685M0204m6753J46697j07172a54999c0306A29782J91519
$$ -4709 -333796 107685 147889 101136 247833 140661 -154999 -30306 129782 321301
12397C21301d85875B5131B270Q4375K54758A15461J73241a67072P4723r1994A007
$$ 321301 -485875 25131 2270 86645 341403 115461 288702 -167072 -92349 -184343 1007
12385A88985c8720k10903a20805o6000B17114j03069R8682g872k01336A9512J22054
$$ 188985 -38720 -249623 -120805 -186805 217114 114045 212727 -7872 -209208 19512 141566
12374A41566J22990M7086C6677a6869k45391E6208K81678b55630F4932Q6354B4380
$$ 141566 264556 311642 36677 -16869 -262260 56208 337886 -255630 64932 151286 24380
12362B26052b22776k2698H956f4106F9460O5197K06425b6788j79645h727r4798
$$ 226052 -222776 -245474 8956 -64106 69460 134657 341082 -26788 -206433 -8727 -103525
12351a03525d6128j87355a1173B05127r7968B4571R0502B5986f2765H4159M9246
$$ -103525 -46128 -233483 -11173 205127 107159 24571 115073 25986 -62765 84159 133405
12340A33405n1879c30029A20799K18167e0333A82622b27039B07605f9249A33460
$$ 133405 81526 -330029 120799 338966 -50333 182622 -227039 207605 -69249 133460
12329a61921B9670J62423b82800b3134j16370M2509b1112j01170A99253o9420
$$ -161921 29670 192093 -282800 -23134 -139504 -96995 -21112 -122282 199253 129833
12319A29833r900A5243a03703o2743P1737C90044I7958G544a70008P1731A94773
$$ 129833 119933 15243 -103703 -166446 -94709 390044 97958 7544 -170008 -98277 194773
12307A73125c71082E8302a33697b8562C3863a6788j10630B7509a11133o3780k3655
$$ 173125 -371082 58302 -133697 -28562 33863 -16788 -127418 27509 -111133 -174913 -198568
12296a98568I6545b0505m14879A94599r904j784e9614K2342D4135a04492B81697
$$ -198568 96545 -20505 -435384 194599 184695 182911 -59614 -37272 44135 -104492 281697
12284A22671A9242f8147C02891j15519b29855R1340A10406b28417A16056c1001
$$ 122671 19242 -68147 302891 187372 -229855 -138515 110406 -228417 116056 -31001
12273h3525B04440R4584F6966a21197A57417b76890B55687A01643J18963o4589
$$ -83525 204440 299024 66966 -121197 157417 -276890 255687 101643 220606 156017
12263A56017c2249j70787B88729D0534a04408A3539g6929B90992j32430j3049
$$ 156017 -32249 -203036 288729 40534 -104408 13539 -76929 290992 158562 145513
12253A45513D367L95448A24172k7554J7062L3936k6860J51537G4873e4115E04635
$$ 145513 4367 399815 124172 96618 113680 147616 120756 272293 74873 -54115 504635
12241F3045A0582a7014j66975k16929a83279I0452B0011K84594j7762c5855A89816
$$ 63045 10582 -17014 -183989 -400918 -183279 90452 20011 304605 286843 -35855 189816
12229B68202E9156J15387C8417J10435J08615p025Q6872j2428D0421N24703a35653
$$ 268202 59156 174543 38417 148852 257467 250442 337314 324886 40421 565124 -135653
12217A82447J66455j49424n1885J86395j35687J31770c2959B25706D1118a0911
$$ 182447 348902 199478 147593 333988 198301 330071 -32959 225706 41118 -10911
12206c4260I2351D1566M2513b7447A69698b0427j1565j8663B76731q3889I4785
$$ -34260 92351 41566 84079 -27447 169698 -20427 -31992 -50655 276731 192842 94785
12194B96391k3534j05159m7976M1937J34377C9137O1354g295C01008j35030a78852
$$ 296391 272857 167698 119722 161659 296036 39137 100491 -7295 301008 165978 -178852
12182F8641b95127A52770P0525k7321j4695k8385K98073a31460A89002e0227A79395
$$ 68641 -295127 152770 223295 195974 181279 152894 450967 -131460 189002 -50227 179395
12170a05427j5344A68162J6726A2513N27M48149b40769R1799A25966M7567e6516
$$ -105427 -120771 168162 184888 12513 13040 461189 -240769 -148970 125966 173533 -56516
12158f6405H151a78272B76592j28395b49931c6718C0613b04104B77853E0550Q9636
$$ -66405 8151 -178272 276592 148197 -249931 -36718 30613 -204104 277853 50550 140186
12147A40186b96808e0353l5028H2791k9886M934L98981G6420h06k10782H6861
$$ 140186 -296808 -50353 -85381 82791 52905 57839 456820 76420 -806 -211588 86861
12135h2068C9628a33830l3592m697A51146c7419J4854j02123G6365b01443M1710
$$ -82068 39628 -133830 -167422 -172119 151146 -37419 -22565 -124688 76365 -201443 -159733
12124a59733P5775A78194K33475A38967b10182G2069h0526E9690a7209r1370B5938
$$ -159733 -83958 178194 411669 138967 -210182 72069 -80526 59690 -17209 -108579 25938
12112D1463a38928A59611a52731b3164C18622b39284C94577A03948j8157a79273
$$ 41463 -138928 159611 -152731 -23164 318622 -239284 394577 103948 85791 -179273
12101g0583a8029D9843a36583k10653A74986b2831A44334b5374A74670j2995e2226
$$ -70583 -18029 49843 -136583 -347236 174986 -22831 144334 -25374 174670 161675 -52226
12089a51849a8297j87093P3941A59747b81608A91005p3238a0312B56651b21810
$$ -151849 -18297 -205390 -131449 159747 -281608 191005 117767 -10312 256651 -221810
12078a54441B07350j022b57182b76C03215j10714A3868L53773L17681K143109
$$ -154441 207350 206328 -257182 -276 303215 192501 13868 367641 685322 2828431
12068B828431H04018B17539n8584c6562j13935K7918e6323j245B82869c392G0164
$$ 2828431 804018 217539 158955 -36562 -150497 -122579 -56323 -57568 282869 -3392 70164
12056G7071i7841H944J44287b77325F3802R0286c14811a13589G0572B9208c48980
$$ 77071 -97841 8944 153231 -277325 63802 154088 -314811 -113589 70572 29208 -348980
12044A11909b70139f9184G1357a64590H3750k6941a15087b4506l55170i7593L346
$$ 111909 -270139 -69184 71357 -164590 83750 56809 -115087 -24506 -379676 -97593 -94247
12033i4247A62016h4420A38632a29950c7009j42824J3706J6340b9910k89888a31616
$$ -94247 162016 -84420 138632 -129950 -37009 -179833 -166127 -149787 -29910 -319798 -131616
12021F4154J18594B383a41528N1942G31J44085b13410B7179q735M8978C0879j4065
$$ 64154 182748 2383 -141528 -89586 731 144816 -213410 27179 18444 67422 30879 16814
12009A6814J05468a00359m9775P0962p416j12954B43290e2986D4036b16204A8200
$$ 16814 122282 -100359 -150134 -79172 -86588 -199542 243290 -52986 44036 -216204 18200
11997H8181a32437A48906a11676A12929j1683b05106i0337j1441A25118g6066
$$ 88181 -132437 148906 -111676 112929 101246 -205106 -90337 -101778 125118 -76066
11986g4387E1018b64470EM3475a22651B1514K30578j03409b26455B37568a14515
$$ -74387 51018 -264470 5 43480 -122651 21514 252092 148683 -226455 237568 -114515
11974B04470K30237k6516g039k99849I2825J15706d8948R558E9287b17549C60536
$$ 204470 434707 408191 -7039 -306888 92825 208531 -48948 -39390 59287 -217549 360536
11962C0775p019c2026A88673J17019b62936e23p246A8230h0300j77165a27006
$$ 30775 23756 -32026 188673 305692 -262936 -523 -7769 18230 -80300 -257465 -127006
11950a25466A63889J43801A6418N8664d4600r6953e9748j87302d36H3238O2350
$$ -125466 163889 307690 16418 75082 -44600 -141553 -59748 -247050 -436 83238 145588
11939A45588a29503k5157j50339Q8325l0610N5585A04658h2708l3113B61111i6575
$$ 145588 -129503 -154660 -304999 -216674 -247284 -191699 104658 -82708 -115821 261111 -96575
11927A31223J00920c44172C03504E1622h2860c9592A94073g246I9685a05931k54278
$$ 131223 232143 -344172 303504 51622 -82860 -39592 194073 -7246 99685 -105931 -360209
11916c60209C2180e0413k9975E0713b00136A84494c43705g0049A00632a62748
$$ -360209 32180 -50413 -80388 50713 -200136 184494 -343705 -70049 100632 -162748
11905C45902B6754b17705B52644j11915b02239D32636A85292b3422j13130N2866
$$ 345902 26754 -217705 252644 140729 -202239 432636 185292 -23422 -136552 -83686
11895h3686j89812B90998k8089i5992A0159i8694B67117a9303E2994J77128C5623
$$ -83686 -273498 290998 262909 -95992 10159 -98694 267117 -19303 52994 230122 35623
11883e7701j38529c7217j11658D1838Q3682J98258a6935k95763B61128a72420
$$ -57701 -196230 -37217 -148875 41838 125520 323778 -16935 -312698 261128 -172420
11872b99526h8335l02687A73968o4621b17794P6971k10453f871m43893A08032
$$ -299526 -88335 -391022 173968 109347 -217794 -140823 -351276 -6871 -450764 108032
11861a79081A7893J2461c12385e9629o7452b1274H9614b80459a1817n9549k25257
$$ -179081 17893 30354 -312385 -59629 -127081 -21274 89614 -280459 -11817 -71366 -296623
11850b96623a11050j50792A68528C0878a57669A50870b5272k49313e2086j38223
$$ -296623 -111050 -261842 168528 30878 -157669 150870 -25272 -274585 -52086 -190309
11840a90309f7922B39981j06495b33101L2969r3645B01500p0908b29908A96159
$$ -190309 -67922 239981 133486 -233101 -200132 -293777 201500 130592 -229908 196159
11829g8851j59078A8576a00760K3766k29768A41011E0984a80342d6354A93878
$$ -78851 -237929 18576 -100760 -76994 -306762 141011 50984 -180342 -46354 193878
11818A63862B6377b75782l4219I5742b52732F1985a58543A92973e6567q1610B14919
$$ 163862 26377 -275782 -310001 95742 -252732 61985 -158543 192973 -56567 -138177 214919
11806A53052a42101B82794C8624K05909b01116a0771q1457B83241h1503k833K2740
$$ 153052 -142101 282794 38624 244533 -201116 -10771 -92228 283241 -81503 -84336 -61596
11795f1596R220k812D3734a64251A01708J18592D9280b10279D5988c05081D2537
$$ -61596 -52376 -55188 43734 -164251 101708 220300 49280 -210279 45988 -305081 42537
11783e2318j59992A62416A4296a10767F2297b95186A84033c6602n2018c0906B2656
$$ -52318 -212310 162416 14296 -110767 62297 -295186 184033 -36602 -88620 -30906 22656
11771i11j9004j2617E7035P4053N0893N41E1460d6418A95977g4307F3527c15954
$$ -911 -19915 -32532 57035 131088 181981 182522 51460 -46418 195977 -74307 63527 -315954
11758B50935c3003k26388c0807A90963f6420l55942H4048h8183q8993N729c6290
$$ 250935 -33003 -259391 -30807 190963 -66420 -422362 84048 -88183 -177176 -171447 -36290
11746b6373m03220O3833a00222m7466m3712f9776k79006A60295Q8077A3774a10658
$$ -26373 -429593 -365760 -100222 -147688 -191400 -69776 -348782 160295 248372 13774 -110658
11734a21916a230k13267A56225m6624C693M21835p7952j34194a2235A10069J56032
$$ -121916 -1230 -214497 156225 109601 3693 425528 347576 213382 -12235 110069 266101
11723B66101A0127a40806c9524j38270H2623N0126F1246J03485J22952d36840
$$ 266101 10127 -140806 -39524 -177794 82623 132749 61246 164731 287683 -436840
11712B33604q1184f7328B73745a15990A29205d4436A79434n5137J955J98307j13677
$$ 233604 152420 -67328 273745 -115990 129205 -44436 179434 124297 126252 324559 210882
11701B10882G4476K35942j11335c3446m124B8878a53080N005i558q0770A23984
$$ 210882 74476 310418 199083 -33446 -37570 28878 -153080 -148075 -9558 -90328 123984
11689B13091b0765H0666B7704J43690K1632H2922a67137A42983a54125P3109G3181
$$ 213091 -20765 80666 27704 171394 193026 82922 -167137 142983 -154125 -81016 73181
11677g9233A12284a8383j02213e3206A8637c7230A45971C1935J00557c0278m1650
$$ -79233 112284 -18383 -120596 -53206 18637 -37230 145971 31935 132492 -30278 -71928
11666g1928j50081K7677D5259d2565j94957A7558J10328a39662B71708J6520H0540
$$ -71928 -222009 -194332 45259 -42565 -237522 17558 127886 -139662 271708 288228 80540
11654a38307b2619A27813l3567c93239A09019j064b42841P8195D17341j59730
$$ -138307 -22619 127813 94246 -393239 109019 107955 -242841 -164646 417341 257611
11644B57611b80586K6986C48241a86851H6790a97745A68246H093J99942b15785
$$ 257611 -280586 -253600 348241 -186851 86790 -197745 168246 8093 208035 -215785
11633H4848J75857j09927c2385B8580b17624j75186E4818K96435A46930c14872
$$ 84848 260705 150778 -32385 28580 -217624 -392810 54818 351253 146930 -314872
11622A76345j6792l7186h9855H8775i0506A43454E5354N3111J48109i4423m9201
$$ 176345 159553 122367 -89855 88775 -90506 143454 55354 108465 256574 -94423 -143624
11611a43624B30380O6085A26883F0475a62313A7788c1065E3445P2344a7627p1113
$$ -143624 230380 296465 126883 60475 -162313 17788 -31065 53445 125789 -17627 -88740
11600h8740F1377P396a17213J0273B3609h0461j60767G1381J32787E2228J47536
$$ -88740 61377 68773 -117213 -106940 23609 -80461 -241228 71381 204168 52228 199764
11589A99764J4532P7082N735I6067K55639j54813A8230i2329E4473j8803a50520
$$ 199764 214296 291378 297113 96067 351706 196893 18230 -92329 54473 35670 -150520
11577A38616B5462a17358j6718A52312K63932c2946j05403H3934b14115J3417
$$ 138616 25462 -117358 -134076 152312 416244 -32946 -138349 83934 -214115 -200698
11567b00698B26741H4086b77491H2108b42276A722R9989D3501i5663A23146i8328
$$ -200698 226741 84086 -277491 82108 -242276 1722 101711 43501 -95663 123146 -98328
11555I0328a4878A20070a88931M851a5616j74853I4898e2004m0209A07107k8725
$$ 90328 -14878 120070 -188931 -184080 -15616 -190469 94898 -52004 -92213 107107 78382
11544G8382h7183j92872A49169C8232K75585n3912N1005j39899Q757q4431J32360
$$ 78382 -87183 -280055 149169 38232 313817 259905 310910 171011 179768 95337 227697
11533B27697d34010G8568R1003i9424q8283B38876a29217F6419a63756A86024
$$ 227697 -434010 78568 169571 -99424 -187707 238876 -129217 66419 -163756 186024
11522e3228A78807P0693b19719B53903f5691B43596E1214j2968e9863j56874C32492
$$ -53228 178807 249500 -219719 253903 -65691 243596 51214 38246 -59863 -216737 332492
11510a78869A28509J74065h1350C72543o2852j03641H8234d8528J5100m2315B75222
$$ -178869 128509 302574 -81350 372543 309691 206050 88234 -48528 -33428 -75743 275222
11498D21654A18325n3023G421M35492A78650J27852L2877b7556A72789K57800
$$ 421654 118325 65302 7421 442913 178650 306502 339379 -27556 172789 430589
11488D30589c1351A25195D1933e8604H1423f1499C22469j8130b248n3355B0121
$$ 430589 -31351 125195 41933 -58604 81423 -61499 322469 304339 -2248 -55603 20121
11476B66024k8293R3616j63509d0296C31039D716M18669j69328j20843e3510j4679
$$ 266024 237731 331347 167838 -40296 331039 4716 423385 254057 133214 -53510 -68189
11465f8189B96226h2383k5659b4851B39140J95262j43728A23156l5616N2813K1491
$$ -68189 296226 -82383 -108042 -24851 239140 434402 290674 123156 87540 140353 161844
11454A61844K08449g0493A43429C6763R8229j4569k4314R933J27669d8832E0470
$$ 161844 370293 -70493 143429 36763 134992 120423 96109 106042 233711 -48832 50470
11442A50770J02874j00174o5277h1837H6745e3788j92268a02315A73837p7296
$$ 150770 253644 153470 88193 -81837 86745 -53788 -246056 -102315 173837 96541
11432I6541b78814C7021h2971m671B13719d8019C9790f1348G4886a45322b9771
$$ 96541 -278814 37021 -82971 -87642 213719 -48019 39790 -61348 74886 -145322 -29771
11420a61091B35748j05171E9799B7394j525c2264B3971a52674C50138l5261C9498
$$ -161091 235748 130577 59799 27394 25869 -32264 23971 -152674 350138 314877 39498
11408B0606Q9719b14221F8964d9325A29051g3538H4379g7584G0433K7654P7566
$$ 20606 110325 -214221 68964 -49325 129051 -73538 84379 -77584 70433 98087 175653
11397A75653a15741K7121L5061j24612D01852b31953i4346A88011I2499a69563
$$ 175653 -115741 -88620 -53559 -178171 401852 -231953 -94346 188011 92499 -169563
11386H4408O950c0878q3271A06165j6031K32282b4197G7700J30065d9396B62287
$$ 84408 91358 -30878 -114149 106165 90134 322416 -24197 77700 207765 -49396 262287
11374b8171A88428A0351O7191d15903A47242G27d8287a0338m8772H8043d1921
$$ -28171 188428 10351 77542 -415903 147242 727 -48287 -10338 -59110 88043 -41921
11362f3643j65093J00680q62j75088l3345B90120F4039d29492K11979C12169c92517
$$ -63643 -228736 -128056 -128918 -304006 -337351 290120 64039 -429492 -217513 312169 -392517
11350A2146J74746A3083a04822I0608B1579J04183i2599A10490a56730C99178
$$ 12146 186892 13083 -104822 90608 21579 125762 -92599 110490 -156730 399178
11339a05723e0719I6340B5704a18522j04087A65494J33517F1165b0882C06503
$$ -105723 -50719 96340 25704 -118522 -222609 165494 299011 61165 -20882 306503
11328g1417Q083A53097c7175A65985b5423A36288g6973C4573c12920d5205q5324
$$ -71417 -63334 153097 -37175 165985 -25423 136288 -76973 34573 -312920 -45205 -130529
11317a30529A97221c31926c267o6886C63436A24807P3779a15888M8542a161I989
$$ -130529 197221 -331926 -3267 -70153 363436 124807 198586 -115888 -67346 -1161 9989
11305a52778I382Q95a07377d5430k9443m2469l7441K4455B7614a24115p6934N9150
$$ -152778 9382 10277 -107377 -45430 -74873 -117342 -154783 -130328 27614 -124115 -201049 -141899
11293a41899f1831q9892g1998A58215a98044A50940B3116i4245r5901R1032Q955
$$ -141899 -61831 -151723 -71998 158215 -198044 150940 23116 -94245 -190146 -99114 -90159
11282i0159A88886I0184a96820B2861K35429c2748H5448d4357k81480G6969b1661
$$ -90159 188886 90184 -196820 22861 258290 -32748 85448 -44357 -325837 76969 -21661
11270B02652c53518A56433K3070C8060J55754o6565K26423F9968a5556D6837h4311
$$ 202652 -353518 156433 179503 38060 193814 127249 353672 69968 -15556 46837 -84311
11258c6885j18183q9169A28082R8273j1408H3064P2921o7520Q8086j0874f0103
$$ -36885 -155068 -244237 128082 226355 214947 83064 155985 88465 176551 165677 -60103
11246a52075L2849b545j52478m5122l1470k9817m7876a19629j38916e8042A24040
$$ -152075 -119226 -2545 -155023 -200145 -231615 -261432 -309308 -119629 -258545 -58042 124040
11234a65306H9428m0288a767k66368Q393J06952j24450h1965m85466a34857p7618
$$ -165306 89428 49140 -1767 -268135 -259742 -152790 -277240 -81965 -567431 -134857 -212475
11223b12475A26067i607j12065B1321N0607O3497f1069D89816a52165L8538A10182
$$ -212475 126067 -9607 -121672 21321 71928 135425 -61069 489816 -152165 -113627 110182
11211a8959I5456a57807N4272A55620b23162A8025K60235c7769C62138b56636
$$ -18959 95456 -157807 -103535 155620 -223162 18025 278260 -37769 362138 -256636
11200d9705k4043j65745I9275m2846c72252g2049A05391N9788a3894A23915J8813
$$ -49705 -73748 -239493 99275 56429 -372252 -72049 105391 165179 -13894 123915 142728
11189A42728D8820K4044c2194A22469k4648a2104k20691B16589A1336b32461Q7839
$$ 142728 48820 72864 -32194 122469 97821 -12104 -232795 216589 11336 -232461 -144622
11178a44622D545P6790a4998j46762c3425l9434r8617A51309b60624d24A70437
$$ -144622 4545 81335 -14998 -161760 -33425 -72859 -171476 151309 -260624 -424 170437
11166A21343g1836j43596k4728A91661m2051G1897d9523j48359P7293B55560k3101
$$ 121343 -71836 -215432 -240160 191661 149610 71897 -49523 -197882 -120589 255560 232459
11155B32459g2694C0447L8428a04653j33794F589C084b2691j4668l1610G5086
$$ 232459 -72694 30447 68875 -104653 -238447 6589 3084 -22691 -37359 -68969 75086
11143a228A33088i165r6049c2092B02185J642J5691A0816M6569i6393j75883B42347
$$ -1228 133088 -9165 -105214 -32092 202185 203827 219518 10816 57385 -96393 -272276 242347
11130D2463G548K8132j3149J63107e1807D86864F6233a27272G7076k6045J53435
$$ 42463 7548 35680 22531 185638 -51807 486864 66233 -127272 77076 51031 204466
11119B04466b48553n9995C42732E2958a23654C9073J39600l8678b1253B57249
$$ 204466 -248553 -308548 342732 52958 -123654 39073 178673 139995 -21253 257249
11108b25195C09637A47097a62616A83896k7301E6128c4828B47285E865K25454
$$ -225195 309637 147097 -162616 183896 156595 56128 -34828 247285 5865 231319
11098B31319A7915L58088c4468A65474j9964c8769B38836A06732K23634B2580
$$ 231319 17915 376003 -34468 165474 145510 -38769 238836 106732 330366 22580
11087A5461J25870c2465A28792M8296J60650A64714m4555a47649b1237B86327
$$ 15461 141331 -32465 128792 177088 337738 164714 120159 -147649 -21237 286327
11076A28199J72943l2623K17121j20991J83598j00080l4562J78820r1175j20428
$$ 128199 301142 268519 485640 364649 548247 448167 413605 592425 501250 380822
11066C80822L9675n6946j9179l1552p6935M12272j27371R8896l09826K87034j86652
$$ 380822 420497 363551 344372 312820 235885 648157 520786 619682 309856 596890 410238
11055D10238K36160J00133p9743K48094P8504k83734J39089Q2941l97630J14606
$$ 410238 646398 746531 666788 914882 993386 709652 848741 931682 534052 648658
11045F48658O5030Q765J51319O2195l49162N68841D92850L34171K92155n8302
$$ 648658 713688 722453 873772 935967 586805 1155646 492850 827021 1119176 1060874
11035A060874j02156m54602L43045j38562n458j30234J26637k31478N03119D73354
$$ 1060874 958718 504116 847161 708599 703141 572907 699544 468066 971185 473354
11024I84616j31518j60457p6071K31757l32069P8315P0545k21161K44155m6769
$$ 984616 853098 692641 616570 848327 516258 594573 665118 443957 688112 641343
11014F41343J66229Q051R2300m33180L93975k25876k3988J4033k35624K34254
$$ 641343 807572 815623 907923 474743 868718 642842 618854 632887 397263 631517
11004F31517K88597j63598l6156J2708j8906K23649l06932L8245K14207N3352
$$ 631517 920114 756516 720360 733068 714162 937811 630879 669124 883331 936683
10994I36683C67171K0733q2866K98948M83046n6867l05036M08063O9373k06989
$$ 936683 367171 387904 305038 603986 1087032 1030165 725129 1133192 1202565 995576
10984I95576M713q6073P9198J05324L31490k2160q4314L47258M24722M05405J06567
$$ 995576 1000289 914216 993414 1098738 1430228 1408068 1323754 1671012 2095734 2501139 2607706
10973B607706M27632Q8266J00869O8847k78923l56054k15777j26853o58229J06398
$$ 2607706 3035338 3123604 3224473 3293320 3014397 2658343 2442566 2315713 1657484 1763882
10963A763882o6217j67777K32762j67325j2189J96983R6089k84545q6151l61827
$$ 1763882 1697665 1529888 1762650 1595325 1583136 1780119 1876208 1591663 1505512 1143685
10953A143685p5221J86606k70732Q5577k15064k48164b9346B99460Q0913P4344
$$ 1143685 1068464 1255070 984338 1069915 854851 606687 -29346 299460 380373 454717
10943D54717r2196J15486j2950a59760H0048A9135L9503P7681K240K60399A02237
$$ 454717 362521 478007 465057 -159760 80048 19135 58638 136319 138559 398958 102237
10931A7493J71982H5080J10746H761a15775B27900a48400j3734g4360C47044d115
$$ 17493 189475 85080 195826 8761 -115775 227900 -148400 -162134 -74360 347044 -4115
10919B0437J10572D5987L933L29220A04163J9222b39653e8288p9969G9593i6111
$$ 20437 131009 45987 49920 379140 104163 123385 -239653 -58288 -138257 79593 -96111
10907I716M4692d26562a19915H8641a29494j57892J34137d5273j04134d8879B12570
$$ 9716 54408 -426562 -119915 88641 -129494 -287386 -153249 -45273 -149407 -48879 212570
10895A34013l444e4649j65395O0315E0635j9413J51386b10847B46908a35306G7447
$$ 134013 130569 -54649 -220044 -159729 50635 31222 182608 -210847 246908 -135306 77447
10883E2445K02581q6664J9103a12059E6348b6062q0491k82042C9783a95483q6529
$$ 52445 255026 168362 187465 -112059 56348 -26062 -106553 -388595 39783 -195483 -282012
10872b82012j7166B58861a94405A02047d5637p00B59514c7031k36687A23308n449
$$ -282012 -299178 258861 -194405 102047 -45637 -46337 259514 -37031 -273718 123308 117859
10861A17859J5557C7653b55524k1111k15431A62677b61546B54156a83388B40875
$$ 117859 133416 37653 -255524 -276635 -492066 162677 -261546 254156 -183388 240875
10850d5043D0307O1502O9545c19537b185D1279K74977i8673A72923o8064a80537
$$ -45043 40307 101809 171354 -319537 -2185 41279 316256 -98673 172923 104859 -180537
10838i3278j5903l6277g563q4981j86129g1046r6844c9581A28686h4686A1559
$$ -93278 -109181 -145458 -7563 -92544 -278673 -71046 -167890 -39581 128686 -84686 11559
10826A5860c74425A70675a7342m6248k6075j01202b3316B39484b01178j80271
$$ 15860 -374425 170675 -17342 -63590 -89665 -190867 -23316 239484 -201178 -381449
10816c81449J83191g817A89614B422f6A24657J09698b962l5833E0928J63694b09590
$$ -381449 -198258 -7817 189614 2422 -66 124657 234355 -2962 -38795 50928 214622 -209590
10803b20813a6099A21853e2756G8620e8170D34198A02201a9119k9950G78g0488
$$ -220813 -16099 121853 -52756 78620 -58170 434198 102201 -19119 -49069 778 -70488
10791c51157H9490a99020R946A5251i1224D2365a93194C5338f2022C3472a10798
$$ -351157 89490 -199020 -189074 15251 -91224 42365 -193194 35338 -62022 33472 -110798
10779d7440A66875A5792a22376C68102C6169K5250c39379A2048L1901m549R041
$$ -47440 166875 15792 -122376 368102 36169 61419 -339379 12048 43949 39400 48441
10768D8441i2707o0776n2534D8236J80987D1577a01841G9732b46494i151j72373
$$ 48441 -92707 -153483 -206017 48236 229223 41577 -101841 79732 -246494 -9151 -181524
10757a81524A04444K10781a83304A52006a13680A28848e5302A70735a483A71562
$$ -181524 104444 315225 -183304 152006 -113680 128848 -55302 170735 -1483 171562
10746b62541A03119a32661A2412J84462b17403O9269Q169D1229b47752C15122
$$ -262541 103119 -132661 12412 196874 -217403 -148134 -139965 41229 -247752 315122
10735a05506B5533c1574m26204b9508p0753A24606b54319a26347L1427K046m0045
$$ -105506 25533 -31574 -457778 -29508 -100261 124606 -254319 -126347 -94920 -92874 -132919
10724a32919A72881c02883i4264A1415J21132f3483j3592j09144A68185e34037
$$ -132919 172881 -302883 -94264 11415 132547 -63483 -77075 -186219 168185 -534037
10713A38657c04775j8549A50288E7345K63530b50250P2420O1499F3801N8495i5712
$$ 138657 -304775 -323324 150288 57345 320875 -250250 -177830 -116331 63801 122296 -95712
10701a75212e7179j386k85123A60691O5144b97089P3652A45201c1945m4293A57728
$$ -175212 -57179 -58565 -343688 160691 225835 -297089 -223437 145201 -31945 -76238 157728
10689h0558D1854b3382D9481g0773j52628A15795J00925A05018d32818c1259A704
$$ -80558 41854 -23382 49481 -70773 -223401 115795 216720 105018 -432818 -31259 1704
10677B35344N6844D5008J63945b50840A10337A5404c56634C57349a8420j76864
$$ 235344 292188 45008 208953 -250840 110337 15404 -356634 357349 -18420 -195284
10667a95284d9457B27848c63147a46087B81781A29224a45133c227n1932B11499
$$ -195284 -49457 227848 -363147 -146087 281781 129224 -145133 -3227 -55159 211499
10656a6663H8285b7784G2006P980d8813n6323K064L8573G8263b36600o1385c3288
$$ -16663 88285 -27784 72006 79986 -48813 -105136 -103072 -64499 78263 -236600 -297985 -33288
10643b3590p7166n8883D1682c52489F6895J53152D3594a56097c9953l4299A4406
$$ -23590 -100756 -159639 41682 -352489 66895 220047 43594 -156097 -39953 -74252 14406
10631c03693E779b94081a13958J010A23534e3177a2524k23683r7122I7327a38524
$$ -303693 5779 -294081 -113958 -112948 123534 -53177 -12524 -236207 -333329 97327 -138524
10619H7456J90323a77002B1661R3339h7927k11280A48511a285A97669K7404m7585
$$ 87456 277779 -177002 21661 115000 -87927 -299207 148511 -1285 197669 225073 177488
10608A77488Q2058F6407c54131J66454C2016b23913h9409k20221g9931d044k3575
$$ 177488 259546 66407 -354131 -187677 32016 -223913 -89409 -309630 -79931 -4044 -27619
10597b7619A94450m8645f0674l27259E2441B2669f5289a4690k5344A96448a85288
$$ -27619 194450 145805 -60674 -387933 52441 22669 -65289 -14690 -40034 196448 -185288
10585b32096A35327b88177G3085A3866J19203b43240f7198H5563b53672d4070
$$ -232096 135327 -288177 73085 13866 133069 -243240 -67198 85563 -253672 -44070
10574b61644G147R2887a46569A01820a75793e2275k119j47311j91168J16183J5209
$$ -261644 7147 100034 -146569 101820 -175793 -52275 -54394 -201705 -392873 -276690 -261481
10563b61481B52291c67I1450b02737k3526e0973A66678m3028a51088j07739f2066
$$ -261481 252291 -367 91450 -202737 -226263 -50973 166678 123650 -151088 -258827 -62066
10551d31630b2462p9843F8142J11424G8864a61846L1459A12850b7170j45001j46213
$$ -431630 -22462 -102305 68142 179566 78864 -161846 -130387 112850 -27170 -172171 -318384
10540c18384P918O6892A71091g6716k5138B5410c27951I0517a26451B59785b42372
$$ -318384 -310466 -243574 171091 -76716 -101854 25410 -327951 90517 -126451 259785 -242372
10528B86749g9106b4364A641J6634J13225n4297d4480k09654j11346i6557A1963
$$ 286749 -79106 -24364 1641 18275 131500 77203 -44480 -254134 -365480 -96557 11963
10516a33728N9117B77113H5637J36545r1132h288j47634I8961J94355a41500L6985
$$ -133728 -74611 277113 85637 222182 131050 -8288 -155922 98961 293316 -141500 -104515
10505a04515B05797D9503g8478J5236B05296I2848P624d2877l2462A61558f0439
$$ -104515 205797 49503 -78478 -63242 205296 92848 100472 -42877 -75339 161558 -60439
10493b34531A75615h6172A54627E9452a76263f704A42499K2962p1416J48484j1288
$$ -234531 175615 -86172 154627 59452 -176263 -6704 142499 165461 94045 242529 231241
10482B31241L4697L40095j54194J18459k49846m1932F9875R525J62131A9858c07477
$$ 231241 265938 606033 451839 570298 320452 278520 69875 79400 241531 19858 -307477
10470a34094I5955B1647b43158M8602A80823p3237f462l39336B30668a82498m5035
$$ -134094 95955 21647 -243158 -194556 180823 107586 -6462 -345798 230668 -182498 -227533
10459b27533b2924n1372L4637j13430N8157A28973O6821b00716O6592b3644q5223
$$ -227533 -22924 -74296 -39659 -153089 -94932 128973 195794 -200716 -134124 -23644 -108867
10448a08867G6040d748B19883q4217J51420a49999A10200d6175A28320J2560R5020
$$ -108867 76040 -4748 219883 135666 287086 -149999 110200 -46175 128320 140880 235900
10437B35900d0358l41965N8104g5966f451A92095C9259k976a68953k6890A82404
$$ 235900 -40358 -382323 -324219 -75966 -6451 192095 39259 36283 -168953 -195843 182404
10425a79987K753B7028a26779B6312H906a37495G9998b11399E0731c16046a24040
$$ -179987 -177234 27028 -126779 26312 8906 -137495 79998 -211399 50731 -316046 -124040
10413B625e8357m1511E8308b6855j57454A447e8027A9070a25106b8636A62785
$$ 2625 -58357 -99868 58308 -26855 -184309 1447 -58027 19070 -125106 -28636 162785
10401H4487d3187F1234d9518C3325K28695A4512K72660e7564p0753A85920E2678
$$ 84487 -43187 61234 -49518 33325 262020 14512 287172 -57564 -128317 185920 52678
10389e6354B09491H6388a63487A87154C3405Q8656a61688A05097K5902j5730M7359
$$ -56354 209491 86388 -163487 187154 33405 122061 -161688 105097 130999 115269 162628
10378A62628E7925K19911R0434J11013j79674l5460l3828K24076M3605B13437
$$ 162628 57925 277836 368270 479283 299609 264149 230321 454397 498002 213437
10367B23172L28480l7804k28415L25594B36720K46369k07787A00107L06559a78963
$$ 223172 551652 513848 285433 611027 236720 483089 275302 100107 406666 -178963
10356B6307K35772q0255O2581J38713J82638j2519K35105l54667J57272A80290
$$ 26307 262079 181824 244405 383118 565756 553237 788342 433675 590947 180290
10345C67115M09716k66062O576B17722o3100d0269D81898A48921a90148B04113
$$ 367115 776831 510769 517345 217722 154622 -40269 481898 148921 -190148 204113
10334B89440A33962J40453C7968a18842C39231P679A10008b4506C04695A9230
$$ 289440 133962 274415 37968 -118842 339231 346910 110008 -24506 304695 19230
10323B62436g8262G3417K31599j01831m7542c440A77883J73910f3577C12331e0730
$$ 262436 -78262 73417 305016 203185 155643 -3440 177883 351793 -63577 312331 -50730
10311A37884D175a41467D14533B8298J09936a32441G7668c5947B93907Q0483j58817
$$ 137884 4175 -141467 414533 28298 138234 -132441 77668 -35947 293907 374390 215573
10300B15573a1944A6983a11377I2525J03360g1604K5790j14275C0937L0403M449
$$ 215573 -11944 16983 -111377 92525 195885 -71604 -45814 -160089 30937 61340 65789
10289F5789b14309G2242J66762c6190C7950J26904a71230e7178l1687p6867A50247
$$ 65789 -214309 72242 239004 -36190 37950 164854 -171230 -57178 -88865 -165732 150247
10277A97900J66231a57588P1505A16665f3359A61554c34356i8300j92842C12174
$$ 197900 364131 -157588 -86083 116665 -63359 161554 -334356 -98300 -291142 312174
10266c0621A3717K05002R273a80733A81994a17119A10177M00800A71616d5975
$$ -30621 13717 218719 227992 -180733 181994 -117119 110177 510977 171616 -45975
10255B98855j20867o0814J29636n7066c23229c8470k34019O3750d6069k29495
$$ 298855 177988 117174 246810 189744 -323229 -38470 -272489 -208739 -46069 -275564
10245b75564e0568p2038k75224k8108A40789i0989l22335J48840b4940k09221
$$ -275564 -50568 -122606 -397830 -425938 140789 -90989 -413324 -264484 -24940 -234161
10235b34161D76213D70M126b2102l26936A5385J20555h7834I8639C1342m303b04299
$$ -234161 476213 470 4596 -22102 -349038 15385 135940 -87834 98639 31342 27039 -204299
10222A38399c04994c1537H9032o571a49529J8349p4699A0369L06202E0742a79276
$$ 138399 -304994 -31537 89032 82461 -149529 -131180 -205879 10369 316571 50742 -179276
10210D9621J46192F5912J12219c4468D6371M8218B0828N7709h0440m6708A35119
$$ 49621 195813 65912 178131 -34468 46371 94589 20828 78537 -80440 -127148 135119
10198a48221a8251A17422a54734j50047f6521N752k79692a4023j43432M0263C9423
$$ -148221 -18251 117422 -154734 -304781 -66521 -60769 -340461 -14023 -157455 -117192 39423
10186a90884M9374g0178D2568a87956a2238k62178a2870k9916b0907p5143j75460
$$ -190884 -141510 -70178 42568 -187956 -12238 -274416 -12870 -42786 -20907 -96050 -271510
10175b71510J25749A76006a47571E2932b86007h5293D195a8094B14630D0060b26740
$$ -271510 -145761 176006 -147571 52932 -286007 -85293 4195 -18094 214630 40060 -226740
10163A74904d0041o8142j89595Q1628P6436j75109J10526A83806b5995k7917A5088
$$ 174904 -40041 -108183 -297778 -216150 -139714 -314823 -204297 183806 -25995 -53912 15088
10151B9173a2792N709j7365H4856a25308j0590C44313n0655q1955E939b52499
$$ 29173 -12792 -7083 -24448 84856 -125308 -135898 344313 293658 211703 5939 -252499
10139b09905m3510a0299B07649c59273J56467B04476b42555Q0261J6415f0602
$$ -209905 -253415 -10299 207649 -359273 -202806 204476 -242555 -162294 -145879 -60602
10128A5830P0520a57108A05731N913m7234c68549B40982q1307c16105E632b28836
$$ 15830 86350 -157108 105731 111644 64410 -368549 240982 159675 -316105 5632 -228836
10116a57557J6347C4348b08437g1662o6432B15393a66413k79078A43685f8237
$$ -157557 -141210 34348 -208437 -71662 -138094 215393 -166413 -445491 143685 -68237
10105b8984a51A32923c1405B03247c06803B5200e3531j48480F2122a93074J3506
$$ -28984 -151 132923 -31405 203247 -306803 25200 -53531 -202011 62122 -193074 -179568
10094a79568h6203g869q6529j3617m5687d0689D0055J48971A5959c03824Q5962
$$ -179568 -86203 -7869 -94398 -108015 -153702 -40689 40055 189026 15959 -303824 -217862
10083b17862h450j88059r430C6874j2825a12067H5033A1973a22664L8149L0293
$$ -217862 -8450 -196509 -205939 36874 24049 -112067 85033 11973 -122664 -84515 -54222
10072e4222k69034A36955D9364d3725G2807e9518C1059J01057d6472C49912b01854
$$ -54222 -323256 136955 49364 -43725 72807 -59518 31059 132116 -46472 349912 -201854
10060F4888a2671H3968c34577a06584d3475j06559B49803f9778n7754r3727J1575
$$ 64888 -12671 83968 -334577 -106584 -43475 -150034 249803 -69778 -127532 -221259 -209684
10049b09684j01914j85898a01902F8452g9575A47600o3312a21593k747j08111
$$ -209684 -311598 -497496 -101902 68452 -79575 147600 84288 -121593 -124340 -232451
10039b32451K3661c2695j70275B7137a12028j82472c3376j01598j74649m5235
$$ -232451 -208790 -32695 -202970 27137 -112028 -294500 -33376 -134974 -309623 -354858
10029c54858J01178F7636a76392q3584e8245l7770B53453a73790K7728n4895M3239
$$ -354858 -253680 67636 -176392 -259976 -58245 -96015 253453 -173790 -146062 -200957 -157718
10018a57718j54342a07688l8299b6478j00012L1231A68420a13953j0724J3099
$$ -157718 -312060 -107688 -145987 -26478 -126490 -95259 168420 -113953 -124677 -111578
10008a11578k36642A50915i3250j17149E942b29545M7376C60767h2632j43577
$$ -111578 -348220 150915 -93250 -210399 5942 -229545 -182169 360767 -82632 -226209
9998b26209B2129a95677F4257a51087b1874n35078a74835n4717H939K10701D0184
$$ -226209 22129 -195677 64257 -151087 -21874 -556952 -174835 -229552 8939 219640 40184
9986a18585q8216B26501a04038K3839B7737L5528a17338h29j60854p9862Q1790
$$ -118585 -206801 226501 -104038 -80199 27737 63265 -117338 -829 -161683 -241545 -159755
9975a59755C834L39989j11816c0707j77251B85984I5260L32012e43424A71323
$$ -159755 3834 343823 232007 -30707 -207958 285984 95260 427272 -543424 171323
9964h1666k7377G4738d5922B1681a73558E7780a3659A48708b73175F2851k9934
$$ -81666 -109043 74738 -45922 21681 -173558 57780 -13659 148708 -273175 62851 32917
9953C2917g9420L6191B70934c74143b1233k36117a9415j05978B0295K996e33k72543
$$ 32917 -79420 -43229 270934 -374143 -21233 -257350 -19415 -125393 20295 23291 -533 -273076
9941b73076G6510J83882b29520H3268c15557r9210A43338l4760g1467A23212c6521
$$ -273076 76510 260392 -229520 83268 -315557 -414767 143338 108578 -71467 123212 -36521
9929a95689f8526D0353b90581B66369D4811a69022e0784q4210A42735h9725L9479
$$ -195689 -68526 40353 -290581 266369 44811 -169022 -50784 -134994 142735 -89725 -50246
9918e0246d915k50336b8910B16820Q1734e3466k4137A1436d57768H0364h1940
$$ -50246 -4915 -255251 -28910 216820 298554 -53466 -77603 11436 -457768 80364 -81940
9906b51205F4237a46619k72807D8641a62027B20362b34643i9017d5617H1173b16764
$$ -251205 64237 -146619 -419426 48641 -162027 220362 -234643 -99017 -45617 81173 -216764
9894a50160B00984n0016b69488L9170N7538m9527b3677p1480k1786G4286J00514
$$ -150160 200984 150968 -269488 -230318 -172780 -222307 -23677 -95157 -116943 74286 174800
9883A74800c5968m66112g9966L0552A61955b07903A30065b48258p5517f7086g965
$$ 174800 -35968 -502080 -79966 -49414 161955 -207903 130065 -248258 -323775 -67086 -7965
9871A23978n9619O7216b03496A06992m8057e27211b02651G9074a41071M9903G0486
$$ 123978 64359 131575 -203496 106992 58935 -527211 -202651 79074 -141071 -91168 70486
9859A7004e1775j75197j16435A07470e8501C8873J08818h9671r6973j04898C8340
$$ 17004 -51775 -226972 -343407 107470 -58501 38873 147691 -89671 -186644 -291542 38340
9847d17870B2914b25881B85991a50779q3060H7534a71493a2592B04388f1113O353
$$ -417870 22914 -225881 285991 -150779 -233839 87534 -171493 -12592 204388 -61113 -54760
9836e4760Q494j39150c2712k10075A49727h7301G0399g4692E9188e0757C0109
$$ -54760 -46266 -185416 -32712 -242787 149727 -87301 70399 -74692 59188 -50757 30109
9824a47502B09898p1807J18416a16371j06632K1372o2005A27869l1054e3884r7422
$$ -147502 209898 138091 256507 -116371 -223003 -201631 -263636 127869 96815 -53884 -151306
9813a51306F2035a21433e1707j2956K2403D9564b47516F5655c35981e0126D78842
$$ -151306 62035 -121433 -51707 -64663 -42260 49564 -247516 65655 -335981 -50126 478842
9801E9974K20384b88032A91314D0864R1209e6965D1327K8042b11675B8913a80779
$$ 59974 280358 -288032 191314 40864 132073 -56965 41327 69369 -211675 28913 -180779
9789E6361b73871l6247A67857a62780B69501f2595k8880j09230e8621g678B6477
$$ 56361 -273871 -310118 167857 -162780 269501 -62595 -91475 -200705 -58621 -7678 26477
9777a29483J5183b74p3482b0215k89641B5731R580K6249J91086b76727G4593a94799
$$ -129483 -114300 -274 -73756 -20215 -309856 25731 35311 61560 252646 -276727 74593 -194799
9764A65050k6385b87202A49042c7382j53954j54294B07540h6036j88491b7767
$$ 165050 138665 -287202 149042 -37382 -191336 -345630 207540 -86036 -274527 -27767
9753b81220A05436c08822G0770d58183J74135B56044r2500m6857e5709F486N026
$$ -281220 105436 -308822 70770 -458183 -284048 256044 163544 116687 -55709 6486 11512
9742A1512L37081h7407B68904b52471a1576E7842a1301l16958D2382e6077M716
$$ 11512 348593 -87407 268904 -252471 -11576 57842 -11301 -328259 42382 -56077 -51361
9731e1361B916P9927C9223d29808a08050l92367A28027A7119b22594R8837k34279
$$ -51361 2916 82843 39223 -429808 -108050 -500417 128027 17119 -222594 -123757 -358036
9720c58036A19338C5172b05870I0146P4298c2029B30514a75694n7957A60200F0005
$$ -358036 119338 35172 -205870 90146 164444 -32029 230514 -175694 -233651 160200 60005
9708f0392B32322d45299F484c5552A83099b97755e4438f480j84951Q8999k36092
$$ -60392 232322 -445299 6484 -35552 183099 -297755 -54438 -6480 -191431 -102432 -338524
9697c38524f3634j96711L4791J12359A49375b88661a37262J2539K3685L7078I7845
$$ -338524 -63634 -260345 -225554 -113195 149375 -288661 -137262 -124723 -101038 -63960 97845
9685a80390o7742g7881J3692k41658J32868a2025k45454J21247B13461n7938c58202
$$ -180390 -248132 -77881 -64189 -305847 -172979 -12025 -257479 -136232 213461 155523 -358202
9673c30842d0906A1956K2110a27170j1028F7271d321j38928k57768J12154A13397
$$ -330842 -40906 11956 34066 -127170 -138198 67271 -4321 -143249 -401017 -288863 113397
9661c13331F7150i7055K2571b0997C31647d05393J02055e5488F6326a14584l5017
$$ -313331 67150 -97055 -74484 -20997 331647 -405393 -303338 -55488 66326 -114584 -149601
9650a49601J0461e4241k74425J43876k10089h1069m1530o9582K1752F4264i6020
$$ -149601 -139140 -54241 -328666 -184790 -394879 -81069 -122599 -192181 -170429 64264 -96020
9638i4444B8998J16538C6105J2930L9705J13324c12871B27132a70946q5762O7018
$$ -94444 28998 145536 36105 49035 88740 202064 -312871 227132 -170946 -256708 -189690
9627a89690A64151c1436k28224l9001A26600a17647k6158A55319b88461A501i0125
$$ -189690 164151 -31436 -259660 -298661 126600 -117647 -143805 155319 -288461 1501 -90125
9615G1035M2157a75169L019N4737A18966b04197A6345a57427I1429c02044g7285
$$ 71035 113192 -175169 -172150 -117413 118966 -204197 16345 -157427 91429 -302044 -77285
9603B32584b40804j13991D8974a09359r8565k8467g1237p3847j59516N0777j02768
$$ 232584 -240804 -354795 48974 -109359 -207924 -236391 -71237 -145084 -304600 -253823 -356591
9592c56591b2868A72837a80084A33944a31750l81022b00768C8961K09778E3612
$$ -356591 -22868 172837 -180084 133944 -131750 -512772 -200768 38961 248739 53612
9581e63794A39139b8171j10555E9871A8156b33610B09093b03989I5238d97071
$$ -563794 139139 -28171 -138726 59871 18156 -233610 209093 -203989 95238 -497071
9570c11179i6575B9245b85005i369A22794c5971j29081N4164j07912c106j37886
$$ -311179 -96575 29245 -285005 -9369 122794 -35971 -165052 -110888 -218800 -3106 -140992
9559a40992j82427J10649C35536b307C18151C0587a6304m5809j11614h4859B1762
$$ -140992 -323419 -212770 335536 -2307 318151 30587 -16304 -62113 -173727 -84859 21762
9547e8211p0300n4327A93533f0771j34445H0246h1628d768E6466B382b83231A78957
$$ -58211 -128511 -182838 193533 -60771 -195216 80246 -81628 -4768 56466 2382 -283231 178957
9534E7122K17601j0997L9491r2567e1663m5729o4917e0408r4696A42502n7110
$$ 57122 274723 263726 303217 210650 -51663 -97392 -162309 -50408 -145104 142502 85392
9523H5392b15198C85807A51470a43353k01532O5960e6796m19292J00156q0014
$$ 85392 -215198 385807 151470 -143353 -344885 -278925 -56796 -476088 -375932 -455946
9513d55946a57749f3495m3440n0675h204D5081K74513j49694c319n3802b6028
$$ -455946 -157749 -63495 -106935 -157610 -8204 45081 319594 169900 -3319 -57121 -26028
9501a58099b4934m1400J9952A70628A6131a48388b7014I9168b14812b1368k13761
$$ -158099 -24934 -66334 -46382 170628 16131 -148388 -27014 99168 -214812 -21368 -235129
9490b35129o1688A49534J10939I2083a38817j7351I380B19f2000A01748k9193
$$ -235129 -296817 149534 260473 92083 -138817 -156168 9380 219 -62000 101748 72555
9479G2555c29054a46066A3837a01545D6111a0349O91o3689m274I6614d46712a59601
$$ 72555 -329054 -146066 13837 -101545 46111 -10349 -9658 -73347 -77621 96614 -446712 -159601
9466a5184q8173l57041O8157O6215a1834r6516j70525a05273M6711m0715l2610
$$ -15184 -103357 -460398 -392241 -326026 -11834 -108350 -278875 -105273 -58562 -99277 -131887
9455a31887B34414e5045q029g148r430j61553e0476I0150J01338a76484e8977
$$ -131887 234414 -55045 -63074 -7148 -16578 -178131 -50476 90150 191488 -176484 -58977
9443a45543D0684J35559F1161p742j4325a11839J3044d8528k40596A2844a0627
$$ -145543 40684 176243 61161 53419 39094 -111839 -98795 -48528 -289124 12844 -10627
9431I2241h8424k4530o4801E7607b10446G3742b34999K8362r0654G0587O2749
$$ 92241 -88424 -112954 -177755 57607 -210446 73742 -234999 -206637 -297291 70587 133336
9420A33336b44828E8682J13749o8863L1613K53745a51531N7387B68123b13892
$$ 133336 -244828 58682 172431 103568 135181 388926 -151531 -94144 268123 -213892
9409G3250r631N3718M7856g731m4340C0200b28166L3447G687a04912j38117A24489
$$ 73250 63619 117337 165193 -7731 -52071 30200 -228166 -194719 7687 -104912 -243029 124489
9396a58934f8646P270B2008K04029b12300A72189a67227B78254c67927A87459
$$ -158934 -68646 -61376 22008 226037 -212300 172189 -167227 278254 -367927 187459
9385D7325L91411A21492c35843h8120j30979H3499M7130a64487B63130b1567A248
$$ 47325 438736 121492 -335843 -88120 -219099 83499 130629 -164487 263130 -21567 1248
9373e7674k6686e991k62971A7977a85090b839k07941M9163p3221A28433c1003
$$ -57674 -84360 -5991 -268962 17977 -185090 -2839 -210780 -161617 -234838 128433 -31003
9361c29544J03613Q1203D4950g109I1227B2193a14519j69497A35672C3868D862
$$ -329544 -225931 -144728 44950 -7109 91227 22193 -114519 -284016 135672 33868 4862
9349c55348h4326j12463j18917c8494F3342a6339j08902d556j45630A09668N4665
$$ -355348 -84326 -196789 -315706 -38494 63342 -16339 -125241 -4556 -150186 109668 164333
9338A64333a3200a711C0875c02801G8382a51024C3137a58358C06826B1315a13428
$$ 164333 -13200 -1711 30875 -302801 78382 -151024 33137 -158358 306826 21315 -113428
9326a0810j08630k92187J7145A97912a16980A10523E1913N4694i1923k54513A61417
$$ -10810 -119440 -411627 -394482 197912 -116980 110523 51913 106607 -91923 -346436 161417
9314i4431l23238g7232j07081L2096Q04A4332Q5572k7644C0220h7951k8327q905
$$ -94431 -417669 -77232 -184313 -152217 -151413 14332 99904 72260 30220 -87951 -116278 -125183
9302a25183j69029C45978h3566j30127P3103k47002a257A96314C471b6982j63419
$$ -125183 -294212 345978 -83566 -213693 -140590 -387592 -1257 196314 3471 -26982 -190401
9291a90401i4751p3248j70958A07591e919j08927q613N1170B3422K40890a42399
$$ -190401 -94751 -167999 -338957 107591 -5919 -114846 -123459 -72289 23422 264312 -142399
9279b46644a622k37226A3307J74384a13476A5391b62502h3139k76962J32150M2277
$$ -246644 -1622 -238848 13307 187691 -113476 15391 -262502 -83139 -360101 -227951 -185674
9268a85674l9244c4613m59797A38447b01572a2707A34436A5790a67210H0589l7388
$$ -185674 -224918 -34613 -494410 138447 -201572 -12707 134436 15790 -167210 80589 43201
9257D3201b5081B95065A13642b39016A36094D8157i6520J2609n2044r2697G4486
$$ 43201 -25081 295065 113642 -239016 136094 48157 -96520 -83911 -135955 -228652 74486
9245A6363K34490A5867e1063B29554b06796o4755g8452A14750h4560C9788G396
$$ 16363 250853 15867 -51063 229554 -206796 -271551 -78452 114750 -84560 39788 7396
9233a40422J4451C2356d1213B41135a83647a789k44700A24629L226b22418G6864
$$ -140422 -125971 32356 -41213 241135 -183647 -1789 -246489 124629 127855 -222418 76864
9221i6464I1440a95498j39347G0271a10785E4929d6667m9036A28060i4959b4035
$$ -96464 91440 -195498 -334845 70271 -110785 54929 -46667 -95703 128060 -94959 -24035
9209b31329a4596o7312A34924B6957a90434C5737a78131G0543a25371J9178m4952
$$ -231329 -14596 -81908 134924 26957 -190434 35737 -178131 70543 -125371 -106193 -151145
9198a51145j33575b086p6127n0127J1294F1073h8523k07373P1292c7044l3307
$$ -151145 -284720 -2086 -78213 -128340 -117046 61073 -88523 -295896 -224604 -37044 -70351
9187g0351q4262N4403j4202M6106B5914a96369a7799k31695A94246g1847B8409
$$ -70351 -154613 -100210 -114412 -68306 25914 -196369 -17799 -249494 194246 -71847 28409
9175c22679J8264a083k90288M8731D5423b26082E9835c12089I0035a17850C1188
$$ -322679 -304415 -1083 -291371 -242640 45423 -226082 59835 -312089 90035 -117850 31188
9163A38687a56089a0077j61040I6710N8058b23872a05732p7844P7038o7376f9710
$$ 138687 -156089 -10077 -171117 96710 154768 -223872 -105732 -183576 -106538 -173914 -69710
9151i5274B8117a07898R351G0221c28046j02153J42014B6095b71628C5531p008
$$ -95274 28117 -107898 -98547 70221 -328046 -430199 -288185 26095 -271628 35531 28523
9140B8523i1726r8791L1355j95733D3584a37533A97847b58304A24837f8554L0821
$$ 28523 -91726 -190517 -159162 -354895 43584 -137533 197847 -258304 124837 -68554 -37733
9129c7733B17406g0086l06171A04131a6518O766k24803A59707n672f8178J9008
$$ -37733 217406 -70086 -376257 104131 -16518 -9752 -234555 159707 154035 -68178 -49170
9118d9170G9232b45620D2173K47169i3692k04645E5599e3662o4755l3268G4545
$$ -49170 79232 -245620 42173 289342 -93692 -298337 55599 -53662 -118417 -151685 74545
9106B25640a27921A81441M9771a04830A891N115O8627a27698A64761a91800R0500
$$ 225640 -127921 181441 231212 -104830 1891 7006 75633 -127698 164761 -191800 -101300
9095a01300d6158F1716K34696b56731f1747D3085C378b01796A4484N2404J68739
$$ -101300 -46158 61716 296412 -256731 -61747 43085 3378 -201796 14484 66888 235627
9084B35627K2762G3342a15114b9931A3015g7459k08045J15674A03165b26249g3129
$$ 235627 258389 73342 -115114 -29931 13015 -77459 -285504 -169830 103165 -226249 -73129
9072H0006b74915o6689a09180n0561j41221D444K86315b44852L6152A7496e4487
$$ 80006 -274915 -341604 -109180 -159741 -300962 4444 290759 -244852 -208700 17496 -54487
9060c49718J66979A78358G112a84234D008b87640a39425j72250G3927C521h2250
$$ -349718 -182739 178358 7112 -184234 4008 -287640 -139425 -311675 73927 3521 -82250
9048c53142b4738f53n6875j45683F3071h147r8393I883d37953I879b4079E968
$$ -353142 -24738 -653 -57528 -203211 63071 -8147 -106540 9883 -437953 9879 -24079 5968
9035e7662H2132J24348F7884b03439H2127j5421a41829B54255b93269g2776m24402
$$ -57662 82132 206480 67884 -203439 82127 66706 -141829 254255 -293269 -72776 -497178
9024d97178B30903a07451b4601l02398B72028b685B769J13136b23061a10323C69861
$$ -497178 230903 -107451 -24601 -326999 272028 -2685 2769 115905 -223061 -110323 369861
9012A02894a02245j58554g668k23337N2432e9710H1111a14700k11503J57106L247
$$ 102894 -102245 -260799 -7668 -231005 -178573 -59710 81111 -114700 -326203 -169097 -165850
9001a65850D343a73482F751a93713P808f2327A9543f966C20749b40998A8269a36990
$$ -165850 4343 -173482 6751 -193713 -185905 -62327 19543 -6966 320749 -240998 18269 -136990
8988a17756A79476n5388b06148f1879k4778l8847M8140a4434k56430C41903b54633
$$ -117756 179476 124088 -206148 -61879 -86657 -125504 -77364 -14434 -270864 341903 -254633
8976I878a09826A8190c1442A13651i0009l4582O866F4086a67541r3572h9688A4909
$$ 9878 -109826 18190 -31442 113651 -90009 -124591 -117725 64086 -167541 -261113 -89688 14909
8963a61237E415a27026C26290q4586F424f2833J5594k37226H3489R312a38342
$$ -161237 5415 -127026 326290 241704 6424 -62833 -47239 -284465 83489 92801 -138342
8951b86837l7105N332a17359q0051k6839A33876a44185A21119D2251i2888j18051
$$ -286837 -323942 -318610 -117359 -197410 -224249 133876 -144185 121119 42251 -92888 -210939
8940b10939f3074A88039c26697r7379a69975B156c3614F0237a57510B8421d42415
$$ -210939 -63074 188039 -326697 -424076 -169975 2156 -33614 60237 -157510 28421 -442415
8928a06183k8287H109J93172b33591A22487J06885J966945G43712C01050J43841
$$ -106183 -134470 8109 201281 -233591 122487 229372 2196317 743712 301050 444891
8918D44891j25892j57123D106Q1375a45003B57946d4778E2502i586j25951G688
$$ 444891 318999 161876 4106 85481 -145003 257946 -44778 52502 -9586 -135537 7688
8906e902n4580A47093b58594J05740A93863a13749I5988b48274h9128A39516h5948
$$ -5902 -60482 147093 -258594 -152854 193863 -113749 95988 -248274 -89128 139516 -85948
8894C6249P3792C3294d36835B23954J28401A35c88072g7914c864k43506A49679
$$ 36249 110041 33294 -436835 223954 352355 135 -388072 -77914 -3864 -247370 149679
8882a4615l7676r953A03099b6275j58232L5194A35462J1790K84615I653n98c26341
$$ -14615 -52291 -62244 103099 -26275 -184507 -149313 135462 147252 431867 9653 9055 -326341
8869g3166A8294Q671J08981b31812C07012f2956k92296C32724b74391i8950d5547
$$ -73166 18294 26965 135946 -231812 307012 -62956 -355252 332724 -274391 -98950 -45547
8857b61653g6865A02418K7560d8599A0005b96668F3542b92277a03326H3547L8996
$$ -261653 -76865 102418 129978 -48599 10005 -296668 63542 -292277 -103326 83547 122543
$$ [...]
##END NTUPLES=NMR SPECTRUM
##END=
