##TITLE=AC1465_CTIAH13296_8011935_zdZF67pWNe
##JCAMPDX= 6.0         $$ Bruker NMR JCAMP-DX V2.0
##DATA TYPE= NMR SPECTRUM
##DATA CLASS= NTUPLES
##ORIGIN= BRUKER
##OWNER= Administrator
$$ 1.72 TOPSPIN		Version 2.1
$$ 2013-07-05 17:50:06.220 -0700  Administrator@X
$$ Compression mode = diff/dup
##.OBSERVE FREQUENCY= 400.02188249412
##.OBSERVE NUCLEUS= ^1H
##.ACQUISITION MODE= SIMULTANEOUS (DQD)
##.ACQUISITION SCHEME= undefined
##.AVERAGES= 8
##.DIGITISER RES= 22
##SPECTROMETER/DATA SYSTEM= spect
##.PULSE SEQUENCE= zg30
##.SOLVENT NAME= COFFEE_meoh
##.SHIFT REFERENCE= INTERNAL, COFFEE_meoh, 1, 14.98509
##AUDIT TRAIL= $$ (NUMBER, WHEN, WHO, WHERE, PROCESS, VERSION, WHAT)
$$ ##TITLE= Audit trail, TOPSPIN		Version 2.1
$$ ##JCAMPDX= 5.01
$$ ##ORIGIN= Bruker BioSpin GmbH
$$ ##OWNER= Administrator
$$ $$ E:\/data/COFFEE/nmr/AC1465_CTIAH13296_8011935_zdZF67pWNe/10/pdata/1/auditp.txt
$$ ##AUDIT TRAIL=  $$ (NUMBER, WHEN, WHO, WHERE, PROCESS, VERSION, WHAT)
(   1,<2013-07-05 17:49:58.845 -0700>,<Administrator>,<X>,<go>,<TOPSPIN 2.1>,
      <created by zg
	started at 2013-07-05 17:48:52.947 -0700,
	POWCHK enabled, PULCHK disabled,
       configuration hash MD5:
       C8 4E 4E 5D D3 5C D8 9E 9F 52 82 E0 59 8A DE 15
       data hash MD5: 64K
       53 EC 8B 78 AE 62 CE 6E AC 76 A0 63 7F 4C 27 E6>)
(   2,<2013-07-05 17:50:01.798 -0700>,<Administrator>,<X>,<proc1d>,<TOPSPIN 2.1>,
      <Start of raw data processing
       efp LB = 0 FT_mod = 6 PKNL = 1 PHC0 = 0 PHC1 = 0 SI = 32K 
       data hash MD5: 32K
       CA 66 14 AF CF 81 32 7C BB 60 14 30 C4 3D 4E D3>)
(   3,<2013-07-05 17:50:02.298 -0700>,<Administrator>,<X>,<proc1d>,<TOPSPIN 2.1>,
      <pk PHC0 = 96.1908 PHC1 = 0 
       data hash MD5: 32K
       07 B1 1A 24 46 9E E7 C2 31 4D 73 3F 29 4B 61 71>)
(   4,<2013-07-05 17:50:02.517 -0700>,<Administrator>,<X>,<proc1d>,<TOPSPIN 2.1>,
      <abs ABSG = 1 
       data hash MD5: 32K
       2D 32 79 E6 9B 2E DB 61 76 9F B7 9C C1 EB B2 C0>)
(   5,<2013-07-05 17:50:02.580 -0700>,<Administrator>,<X>,<proc1d>,<TOPSPIN 2.1>,
      <abs ABSG = 2 
       data hash MD5: 32K
       E0 6A 9D EF E6 A6 73 1A 78 B3 3A 06 C2 F6 5B DA>)
(   6,<2013-07-05 17:50:02.658 -0700>,<Administrator>,<X>,<proc1d>,<TOPSPIN 2.1>,
      <abs ABSG = 3 
       data hash MD5: 32K
       DD 0F 5E DC 47 18 55 FC BC 7B 10 B1 3A 2B BC FD>)
(   7,<2013-07-05 17:50:02.720 -0700>,<Administrator>,<X>,<proc1d>,<TOPSPIN 2.1>,
      <abs ABSG = 4 
       data hash MD5: 32K
       08 CF 51 D9 58 8E BC D8 7F C9 43 3F D9 4A CE D2>)
(   8,<2013-07-05 17:50:02.767 -0700>,<Administrator>,<X>,<proc1d>,<TOPSPIN 2.1>,
      <abs ABSG = 5 
       data hash MD5: 32K
       FA 3E FA 62 25 5D 0B CE DC 95 8F D2 86 19 B8 7D>)
$$ ##END=
$$ 
$$ $$ hash MD5
$$ $$ 2E A2 C5 C5 CA E0 60 0F 74 28 62 87 E0 D4 24 7D
##$RELAX= 
##$RELAX= 
##$RELAX= 
##$RELAX= 
##$RELAX= 
##$RELAX= 
##$RELAX= 
$$ Bruker specific parameters
$$ --------------------------
##$DU= <E:\>
##$EXPNO= 10
##$NAME= <AC1465_CTIAH13296_8011935_zdZF67pWNe>
$$ [...]
##$TP= (0..7)
150 150 150 150 150 150 150 150
##$TP07= 0
##$TPNAME0= <>
##$TPNAME1= <>
##$TPNAME2= <>
##$TPNAME3= <>
##$TPNAME4= <>
##$TPNAME5= <>
##$TPNAME6= <>
##$TPNAME7= <>
##$TPOAL= (0..7)
0.5 0.5 0.5 0.5 0.5 0.5 0.5 0.5
##$TPOFFS= (0..7)
0 0 0 0 0 0 0 0
##$TUNHIN= 0
##$TUNHOUT= 0
##$TUNXOUT= 0
##$USERA1= <user>
##$USERA2= <user>
##$USERA3= <user>
##$USERA4= <user>
##$USERA5= <user>
##$V9= 5
##$VALIST= <valist>
##$VCLIST= <CCCCCCCCCCCCCCC>
##$VD= 0
##$VDLIST= <DDDDDDDDDDDDDDD>
##$VPLIST= <PPPPPPPPPPPPPPP>
##$VTLIST= <TTTTTTTTTTTTTTT>
##$WBST= 1024
##$WBSW= 4
##$XGAIN= (0..3)
0 0 0 0
##$XL= 0
##$YL= 0
##$YMAX_a= 642523
##$YMIN_a= -546198
##$ZGOPTNS= <>
##$ZL1= 120
##$ZL2= 120
##$ZL3= 120
##$ZL4= 120
##$ABSF1= 14.98509
##$ABSF2= -5.573092
##$ABSG= 5
##$ABSL= 3
##$ALPHA= 0
##$AQORDER= 0
##$ASSFAC= 0
##$ASSFACI= 0
##$ASSFACX= 0
##$ASSWID= 0
##$AUNMP= <proc_prof1d_extract_pilot.lims>
##$AXLEFT= 0
##$AXNAME= <>
##$AXNUC= <1H>
##$AXRIGHT= 0
##$AXTYPE= 0
##$AXUNIT= <>
##$AZFE= 0.1
##$AZFW= 0.1
##$BCFW= 0
##$BC_mod= 0
##$BYTORDP= 0
##$COROFFS= 0
##$CY= 15
##$DATMOD= 1
##$DC= 0
##$DFILT= <>
##$DTYPP= 0
##$F1P= 0
##$F2P= 0
##$FCOR= 0.5
##$FTSIZE= 32768
##$FT_mod= 6
##$GAMMA= 0
##$GB= 0
##$INTBC= 1
##$INTSCL= 1
##$ISEN= 128
##$LB= 0
##$LEV0= 0
##$LPBIN= 0
##$MAXI= 10000
##$MC2= 0
##$MEAN= 0
##$ME_mod= 0
##$MI= 0
##$NCOEF= 0
##$NC_proc= -8
##$NLEV= 6
##$NOISF1= 0
##$NOISF2= 0
##$NSP= 0
##$NTH_PI= 0
##$NZP= 0
##$OFFSET= 14.98509
##$PC= 1
##$PHC0= 96.1908
##$PHC1= 0
##$PH_mod= 1
##$PKNL= yes
##$PPARMOD= 0
##$PPDIAG= 0
##$PPIPTYP= 0
##$PPMPNUM= 2147483647
##$PPRESOL= 1
##$PSCAL= 4
##$PSIGN= 0
##$PYNMP= <proc.py>
##$REVERSE= no
##$SF= 400.02
##$SI= 32768
##$SIGF1= 0
##$SIGF2= 0
##$SINO= 400
##$SIOLD= 32768
##$SPECTYP= <>
##$SREGLST= <1H.CDCl3>
##$SSB= 0
##$STSI= 32768
##$STSR= 0
##$SW_p= 8223.68421052631
##$SYMM= 0
##$S_DEV= 0
##$TDeff= 65536
##$TDoff= 0
##$TI= <>
##$TILT= no
##$TM1= 0
##$TM2= 0
##$TOPLEV= 0
##$USERP1= <user>
##$USERP2= <user>
##$USERP3= <user>
##$USERP4= <user>
##$USERP5= <user>
##$WDW= 1
##$XDIM= 32768
##$YMAX_p= 467804857
##$YMIN_p= -770400
##$CURPLOT= <Network HP LaserJet P1505>
##$CURPRIN= <$Network HP LaserJet P1505>
##$DFORMAT= <normdp>
##$LAYOUT= <+/1D_H.xwp>
##$LFORMAT= <normlp>
##$PFORMAT= <normpl>
##$SURQMSG= 1
$$ End of Bruker specific parameters
$$ ---------------------------------
##NTUPLES= NMR SPECTRUM
##VAR_NAME=  FREQUENCY,     SPECTRUM/REAL,   SPECTRUM/IMAG
##SYMBOL=    X,             R,               I
##VAR_TYPE=  INDEPENDENT,   DEPENDENT,       DEPENDENT
##VAR_FORM=  AFFN,          ASDF,            ASDF
##VAR_DIM=   32768,         32768,           32768
##UNITS=     HZ,            ARBITRARY UNITS, ARBITRARY UNITS
##FACTOR=    0.250966925370066, 1,           1
##FIRST=     8223.43324360094, -159928,      -276694
##LAST=      0,             222164,          -32172
##MIN=       0,             -770400,         0
##MAX=       8223.43324360094, 467804857,    0
$$ Real data points
##PAGE= N=1
##DATA TABLE= (X++(R..R)), XYDATA
$$ [...]
19560A63217k1474a53477k3631H4045b74426h9546o0384A4438a2904r9702a5878
19548d21962A12741j3765a54343B2298h1056b7241A94139o2757a94414A22506
19537a66753A91784c0431j33004o7282k8326A59025k4681a24255C21204a56838
19526a42451H4174C6670d9805J7772A28527b37980Q4132j2175m593I1280N3923
19515A45203b19090A7448J05176a17000k9326M5591j50237L7022E6528a02427
19504B43473E6822K1599J37579G37K34234C769b86090K6532A97933D7784c52980
19492C30355j62797b91153g6083D53530a78191n6559F9000h4916A03712b2906
19481g8516k84202h5486A91379a58491e3360l28591d1168r9307G4825a92199G5184
$$ y = [163217, 141743, -153477, -177108, 84045, -274426, -89546, -149930, 14438, -12904, -112606, -15878, -421962, 112741, 98976, -154343, 22298, -81056, -27241, 194139, 131382, -194414, 122506, -166753, 191784, -30431, -163435, -230717, -259043, 159025, 134344, -124255, 321204, -156838, -142451, 84174, 36670, -49805, -32033, 128527, -237980, -153848, -166023, -170616, 91280, 145203, -219090, 17448, 122624, -117000, -146326, -100735, -250972, -213950, 56528, -102427, 243473, 56822, 78421, 216000, 737, 234971, 3769, -286090, -259558, 197933, 47784, -352980, 330355, 167558, -291153, -76083, 453530, -178191, -234750, 69000, -84916, 103712, -22906, -78516, -362718, -85486, 191379, -158491, -53360, -381951, -41168, -140475, 74825, -192199, 75184]
19469b49728J482B9343c1343j23779F7757J3228B1988a44227o8865p8219I1141
19457g9204j41993c0290H4840K5931c60689o3984a27761l06342K11297B68988
19446a97368e0246A20406a98356o1093P6695B66787I4264P7552c4077j11172j95805
19435c41054i6476k23530J47882N7128C58694e1926j17683A63723E8443Q0836
19425A39279a72541F3119a40348A69688J1861d75704f5634C5986G866a46267b0074
19413e1150b2779j11750r2300F6733N4348m2495j4618e1070B142a72421N4150
19402a18271p1164E151b77298A38403n6973P7761f8896q0016A1717a49352m1079
19391a90431O1762d8267I9967a47932F9235a21073k4779L0115L4572j38486C00025
$$ y = [-249728, -248246, 29343, -31343, -155122, 67757, 80985, 21988, -144227, -213092, -291311, 91141, -79204, -221197, -30290, 84840, 110771, -360689, -424673, -127761, -434103, -222806, 268988, -197368, -50246, 120406, -198356, -259449, -182754, 266787, 94264, 171816, -34077, -145249, -341054, -96476, -320006, -172124, -114996, 358694, -51926, -169609, 163723, 58443, 139279, -172541, 63119, -140348, 169688, 181549, -475704, -65634, 35986, 7866, -146267, -20074, -51150, -22779, -134529, -226829, 66733, 121081, 78586, 63968, -51070, 2142, -172421, -118271, -189435, 5151, -277298, 138403, 81430, 159191, -68896, -148912, 11717, -149352, -190431, -128669, -48267, 99967, -147932, 69235, -121073, -145852, -115737, -81165, -219651, 300025]
19379a15190l9109O1452k2496l0371k40282j29869b13155q0287A24799a16727
19368A3390R8611a01866j38035m0126C19472b16865e1223j49845k90908K43406
19358b48570o6907j49761a90970a5152B67167A4539l731g3899K6706C3364a00589
19346a72227F2825d72455B78827A27632c19907A80728H9018R5776C3487O1182
19336I4669b742A06223b23033J04966B02624b55780P0992F0148K70464d6873j09388
19325a56261G5356h9240B9207d7958A1870K51764a24709m3445l42500G1309C1071
19313H3308I656M4644J27250b2648o5818n3473E5278a39232A37865b97547a43048
19301b52323e2608j79148B67465A272K82269A03003J75104a40629c2195B1203
$$ y = [-115190, -154299, -92847, -115343, -145714, -385996, -515865, -213155, -293442, 124799, -116727, 13390, 112001, -101866, -239901, -280027, 319472, -216865, -51223, -201068, -491976, -248570, -315477, -465238, -190970, -15152, 267167, 14539, 10808, -73899, -47193, 33364, -100589, -172227, 62825, -472455, 278827, 127632, -319907, 180728, 89018, 184794, 33487, 94669, -2742, 106223, -223033, -118067, 202624, -255780, -184788, 60148, 330612, -46873, -156261, 75356, -89240, 29207, -47958, 11870, 263634, -124709, -168154, -510654, 71309, 31071, 83308, 9656, 54300, 181550, -22648, -88466, -141939, 55278, -139232, 137865, -297547, -143048, -252323, -52608, -231756, 267465, 1272, 283541, 103003, 278107, -140629, -32195, 21203]
19290i1534A45937b62204d1489J2247j70794A05620d94780A00086a51371E7774
19279a08480G404h6176l57157h7920B63774d55861A1350h485j05880k53442a7806
19267E7497K1123L23996b41724e5905k0647k99924a27361K6985R174F3987a24350
19255a50364n8702A21784a07549G9659a70228k9617R8287j84988R2117O1184B51304
19243a85519g3669F4295J8938d3735k56299E250P2733a76718L7901B71304c08572
19231b0737I2078c4442p6412M2440k46323E0512c820l85446J34842a5253A00898
19219a28970e4407l7535a8889D6348a56786n4058B69109n1102C4206a78038a2086
19207a8067G4578a55656d4783A55508d62842B2696b66795O1402O6444j6985A42244
$$ y = [-91534, 145937, -262204, -41489, -29242, -200036, 105620, -494780, 100086, -151371, 57774, -108480, 7404, -86176, -443333, -87920, 263774, -455861, 11350, -8485, -114365, -367807, -17806, 57497, 78620, 402616, -241724, -55905, -76552, -376476, -127361, -100376, -91202, 63987, -124350, -150364, -209066, 121784, -107549, 79659, -170228, -199845, -101558, -286546, -194429, -133245, 251304, -185519, -73669, 64295, 83233, -43735, -300034, 5250, 77983, -176718, -138817, 271304, -308572, -20737, 92078, -34442, -110854, -68414, -314737, 50512, -3820, -389266, -254424, -15253, 100898, -128970, -54407, -91942, -18889, 46348, -156786, -210844, 269109, 218007, 34206, -178038, -12086, -18067, 74578, -155656, -44783, 155508, -462842, 22696, -266795, -205393, -138949, -155934, 142244]
19195g7400j89806o6870g7876m3375M9314j05703N5751A49298c64601B44269c744
19183B4963c08307l7564A13518a1370B31021b3109m26520E5645b87486c6042A25494
19171e5278j77144k01507a43678m6019k361M5693D752b10688d0948K012j57843
19160a96779m6992R745D7754A1788a48300q709A23584b42127d6687m6977C28176
19148e1041A24132R3646c34634A62203a06168B80565c40355H1788d54114D0550
19137C90258i3954A80840g70400B62617j9938b68842C03477i3476K7031A89746
19126h2118L3381E5435A7880f4135B66238C8697K57191I1518A00a9024n789F7785
19113d29603C2269A672a11768r2515D4193d8210C02196b4287o0186m497C3685
$$ y = [-77400, -267206, -334076, -77876, -121251, -71937, -177640, -121889, 149298, -364601, 244269, -3744, 24963, -308307, -345871, 113518, -11370, 231021, -23109, -449629, 55645, -287486, -36042, 125494, -55278, -232422, -433929, -143678, -189697, -192058, -146365, 4752, -210688, -40948, -38936, -196779, -243771, -234026, 47754, 11788, -148300, -157009, 123584, -242127, -46687, -93664, 328176, -51041, 124132, 217778, -334634, 162203, -106168, 280565, -340355, 81788, -454114, 40550, 390258, -93954, 180840, -770400, 262617, 242679, -268842, 303477, -93476, -66445, 189746, -82118, -48737, 55435, 17880, -64135, 266238, 38697, 295888, 91518, 100, -19024, -24813, 67785, -429603, 32269, 1672, -111768, -204283, 44193, -48210, 302196, -24287, -84473, -88970, 33685]
19101D5078Q854Q7719c97946A62479p1057i1279j86634B4154i8470j87948h6959
19089a46120j52675a19195N6569j96675N6281d8595B12055r1683b91152H1863
19078B7157N93N2051c51333C58291f0274j52615r7340C0484b43684D0453c17809
19066c6014j1946C39431c34849A08343G866a92803k1573g4613K6602F9672J990
19055G1662B2363K0393K54338j24710f8562j8055b1486k44129J26055f0042f097
19043E705a7598o2745r0686k06094C727c8519B57371j18400b51186c9357j74558
19032b13915A64438a00231A51907c894j79812c211k71679J33978B2487b9800A10956
19020e2871C80990a58427K9368H3646b3834r6341I4849d6777j04710l227B85899
$$ y = [45078, 53932, 141651, -397946, 162479, 91422, -91279, -277913, 24154, -98470, -286418, -86959, -146120, -298795, -119195, -62626, -259301, -203020, -48595, 212055, 120372, -291152, 81863, 27157, 27750, 79801, -351333, 358291, -60274, -212889, -310229, 30484, -243684, 40453, -317809, -36014, -47960, 339431, -334849, 108343, 7866, -192803, -214376, -74613, -48011, 69672, 71662, 22363, 42756, 297094, 172384, -68562, -86617, -21486, -265615, -139560, -60042, -6097, 5705, -17598, -80343, -171029, -377123, 3727, -38519, 257371, 138971, -251186, -39357, -213915, 164438, -100231, 151907, -3894, -183706, -3211, -274890, -140912, 22487, -29800, 110956, -52871, 380990, -158427, -129059, 83646, -23834, -120175, 94849, -46777, -151487, -154714, 285899]
19008a12691o3263B49852a15320A78990h4394A7091a8742k86170G4346a61454
18997B02607a41860o9337q128G363a54524e2011A42170C3764K07962C3685a46919
18985b11654j6478m6636A14874a77589A0306b9589j47283J2970B4993I412a87852
18973b3858C2753b61653Q2621f612E6358M0272I18J31278C8030g0168q3138N5454
18961i7852G3026l909J37048R7990a56083d8150B7691a53421E301a44770j3809
18950a58579F3974e5584l38376a44455j4968B49049L2000a1457j8566G6704a17683
18938E7809N263K3501L48156a0364c405B31258C6135H44b63252b7844J1891q6347
18926a02300d4010r7289j51413F1701B6050M1274K69506c02698b9699k42353A70794
$$ y = [-112691, -175954, 249852, -115320, 178990, -84394, 17091, -18742, -304912, 74346, -161454, 202607, -141860, -211197, -219325, 7363, -154524, -52011, 142170, 33764, 241726, 33685, -146919, -211654, -228132, -274768, 114874, -177589, 10306, -29589, -176872, -163902, 24993, 9412, -187852, -23858, 32753, -261653, -179032, -6612, 56358, 96630, 918, 132196, 38030, -70168, -153306, -97852, 73026, 69117, 206165, 304155, -156083, -48150, 27691, -153421, 5301, -144770, -158579, 63974, -55584, -393960, -144455, -159423, 249049, 281049, -11457, -30023, 76704, -117683, 57809, 63072, 86573, 434729, -10364, -3405, 231258, 36135, 844, -263252, -27844, -15953, -102300, -44010, -141299, -292712, 61701, 26050, 67324, 336830, -302698, -29699, -272052, 170794]
18914A60722c18350a22630o2073B48928A18976b03404E4781b6455E4688A1113
18903i0136A6373b15438i4039L0420j16457B3045e8641A03031b96443e5533k28793
18892b84326J7428h2603E5502b3651m7751n1000j97339A69140c08983E5637a62014
18880D2416a12236A31946K6387f1584l48397I0807e0584A09327d0785E4745C269
18868F1805F870b9456A36732K08706d9134l626l9071A61421a34825E8892a69003
18856A29470b03603H6853B9199g5588A57142O0231n9414G8003h8459k9443F2341
18844b67457b2543l08714J31372A01858a10833j51527C45J03865a4195A70789
18833E464K6626b54187J04107N5686j32023B72738r7351a51516j2823I9442b70749
$$ y = [160722, -318350, -122630, -184703, 248928, 118976, -203404, 54781, -26455, 54688, 11113, -90136, 16373, -215438, -94039, -63619, -180076, 23045, -58641, 103031, -296443, -55533, -284326, -266898, -82603, 55502, -23651, -71402, -122402, -319741, 169140, -308983, 55637, -162014, 42416, -112236, 131946, 158333, -61584, -409981, 90807, -50584, 109327, -40785, 54745, 3269, 61805, 6870, -29456, 136732, 345438, -49134, -52760, -91831, 161421, -134825, 58892, -169003, 129470, -203603, 86853, 29199, -75588, 157142, 217373, 157959, 78003, -88459, -117902, 62341, -267457, -22543, -331257, -199885, 101858, -110833, -262360, 345, 104210, -14195, 170789, 5464, 32090, -254187, -150080, -94394, -226417, 272738, 175387, -151516, -164339, 99442, -270749]
18821a494j63820B9341e2291F533O2003C0512r958c33784O5351F5328K70965A65989
18808A37557a37569B20477d1325D4650J21857b1445n8611B58715b63768a17518
18797D7948J11236J02307F8418b20318A79292a41500j51804B16508a43940A87605
18786a27156A18162a26403E1421L17720d6701C2593Q6115b8260N75m36309d9226
18774A40055a77889h5664b8072B95610a66022G7374C5704a2664B6485a5323k57596
18763b72919A47336b51395C3330b85638j1837g6781A97758f6961j036A5863a19499
18751H2559b54257l0000g2876n8422a9081k39810A10462f4139l85a4409l9032
18740e3441l8237B0152c8870k18760A77095a71945m3298k71490b17950H6832b1575
$$ y = [-1494, -165314, 29341, -52291, 6533, 68536, 30512, 20554, -333784, -268433, 65328, 336293, 165989, 137557, -137569, 220477, -41325, 44650, 166507, -21445, -80056, 258715, -263768, -117518, 47948, 159184, 261491, 68418, -220318, 179292, -141500, -293304, 216508, -143940, 187605, -127156, 118162, -126403, 51421, 369141, -46701, 32593, 118708, -28260, -27685, -463994, -49226, 140055, -177889, -85664, -28072, 295610, -166022, 77374, 35704, -12664, 26485, -15323, -272919, 147336, -251395, 33330, -285638, -297475, -76781, 197758, -66961, -67997, 15863, -119499, 82559, -254257, -284257, -72876, -131298, -19081, -258891, 110462, -64139, -64524, -14409, -53441, -91678, 20152, -38870, -257630, 177095, -171945, -215243, -486733, -217950, 86832, -21575]
18728h9689A59687h012G6081a17629F7922a51649B09353b4015k38171D81266k19030
18717B62236a25063j3000f2897J3982B82061h708p6824E1595b00164b2042j74922
18706a96964j42332a11479b3493A7928i6465F974J10428a88427A01819d0521l19465
18695c59986F9953a50738A06480a12455B0818e9932m7565o1198f2711F2403k3108
18684C9295a39849F3219K87701A34777n8933E664c30580f6658B06313r8916i583
18672e3417E2185a67725j36093B03458c49941L4550k2239J60949A822b31495B82963
18660b84240e0460j27390A179b49044i5660j37662a00841G3126B1475d59305e5913
18648b98284i0380f583k48125A81450a62096O0096a4511C03190j11295R3511j31382
$$ y = [-89689, 159687, -8012, 76081, -117629, 67922, -151649, 209353, -24015, -262186, 481266, 262236, -125063, -138063, -62897, -48915, 282061, -8708, -85532, 51595, -200164, -22042, -196964, -339296, -111479, -23493, 17928, -96465, 6974, 117402, -188427, 101819, -40521, -359986, 69953, -150738, 106480, -112455, 20818, -59932, -107497, -168695, -62711, 62403, 39295, -139849, 63219, 350920, 134777, 75844, 5664, -330580, -66658, 206313, 107397, -9583, -53417, 52185, -167725, -303818, 203458, -349941, -315391, -337630, -176681, 1822, -231495, 282963, -284240, -50460, -177850, 1179, -249044, -95660, -233322, -100841, 73126, 21475, -459305, -55913, -298284, -90380, -6583, -254708, 181450, -162096, -102000, -14511, 303190, 191895, 285406, 154024]
18637A54024b05266E3689c53930a71270A16637b71369A53725i673k13237M6359
18627a76551j01369d0761r1570B23030B1811M2511b38726Q7484c5956j62980G0008
18615F1778P6862a98694C56246I6579e5806K1439d830n8319B16925n0417c62880
18603D0095a94959Q2496L4202j18375A23791J65381a43264f0340A09799a02656
18592b2766A752c7853F4212b60917G4455b30836f3265b0300l24970D25465B7533
18580B05445D7813M3803B445a41113b9316q0406d3905m24220d3030j39519A28359
18568a42926d6034K0101D248b09401i4809l24003f1089m3980C5465O799c39852
18556B1203K12531b87298B20041a3229l14922a00347H3915M3833a85770c9476
$$ y = [154024, -205266, 53689, -353930, -171270, 116637, -271369, 153725, -9673, -222910, -176551, -277920, -40761, -132331, 223030, 21811, 64322, -238726, -151242, -35956, -198936, 70008, 61778, 138640, -198694, 356246, 96579, -55806, -34367, -4830, -63149, 216925, 166508, -362880, 40095, -194959, -112463, -78261, -196636, 123791, 289172, -143264, -60340, 109799, -102656, -22766, 1752, -37853, 64212, -260917, 74455, -230836, -63265, -20300, -345270, 425465, 27533, 205445, 47813, 91616, 2445, -141113, -29316, -109722, -43905, -468125, -43030, -182549, 128359, -142926, -46034, -25933, 4248, -209401, -94809, -418812, -61089, -105069, 35465, 42264, -339852, 21203, 233734, -287298, 220041, -13229, -328151, -100347, 83915, 127748, -185770, -39476]
18545B58139a98013i0522D0500f6292O488j21287l71920b14340C34830e017j81718
18534a86735J3909K4221A3332J13262J42522d10694J4338J05874A01601d7436
18523C1322d0282k15049J6635k30443a27271j42387A06713d8029B4981O8462N842
18512I9285L8090c76371A49075A8183g6021j12745k62137B79523a75821F9588
18501B01658a15571M3447B17080b35161B07388B9959L16188a1369q7489F454M17753
18490D24207A00886a13915B50960C27d4666j24191Q1685d1810k65319o8771A05490
18478b8731j04495B5842J01139c01292e0098j8947A14881b33630a859B26845C6506
18466c16802B2145R4351b70225a34221j01260c9496j57055i2391q9559C02313
$$ y = [258139, -198013, -90522, 40500, -66292, -59804, -181091, -553011, -214340, 334830, -5017, -186735, -172826, -148605, 13332, 126594, 269116, -410694, -396356, -290482, 101601, -47436, 31322, -40282, -255331, -238696, -469139, -127271, -269658, 106713, -48029, 24981, 93443, 99285, 137375, -376371, 149075, 18183, -76021, -188766, -450903, 279523, -175821, 69588, 201658, -115571, -72124, 217080, -235161, 207388, 29959, 346147, -11369, -98858, 6454, 424207, 100886, -113915, 250960, 327, -44666, -168857, -87172, -41810, -307129, -375900, 105490, -28731, -133226, 25842, 126981, -301292, -50098, -69045, 114881, -233630, -1859, 226845, 36506, -316802, 22145, 116496, -270225, -134221, -235481, -39496, -196551, -92391, -181950, 302313]
18455a45367D03293a53806H8514f9454o6445e365k3233B19136m27a02375p3237
18444a75612c2784k16669B03684j6413C3049a38725A60586a4151J138q6195j57055
18433b56263E3074a57090D70528f2674m5055K6853B15039a06183A6153b23332
18422a4280A02038B7126R2629g9402A95645b51124I5697b42212c8545p6031R730
18411a04846D930J62013l6829F2594N912b11705o3048a19262L1173A78035a48953
18399A58775Q8790a06626A26250a80837A08049a97542H2263c38539h4338A00192
18388a3621B87799g0931F5269a14679D5817K54490a33147k02876a53428d8572
18377B96361a89550g585F0564M5574b70166A50548a15114B02488i3581a372l1671
$$ y = [-145367, 403293, -153806, 88514, -69454, -135899, -5365, -28598, 219136, 218709, -102375, -175612, -32784, -249453, 203684, 187271, 33049, -138725, 160586, -14151, -13013, -99208, -256263, 53074, -157090, 470528, -62674, -107729, -80876, 215039, -106183, 16153, -223332, -14280, 102038, 27126, 119755, -79402, 195645, -251124, 95697, -242212, -38545, -114576, -104846, 4930, 166943, 130114, 62594, 68506, -211705, -274753, -119262, -88089, 178035, -148953, 158775, 247565, -106626, 126250, -180837, 108049, -197542, 82263, -338539, -84338, 100192, -13621, 287799, -70931, 65269, -114679, 45817, 300307, -133147, -336023, -153428, -48572, 296361, -189550, -7585, 60564, 106138, -270166, 150548, -115114, 202488, -93581, -1372, -33043]
18366c3043l9767E0953k1111K3437m134K02803c38130B43410b22044d9117j00042
18355a49159f6859p2017A29846m1927h2346j11898h9997d2838k50826J10693c628
18343a00214D13686c4533E4809b82056A23229M8936a36887B16095b30577b8603
18332H2767J26324b55196A81554j957c2041A44685h4531a5934j02999E1085e0993
18320a97315K4748j60294A16704a71597j98935J38447g7435k41524h8548j07005
18310a95553i073q4690A98696I2643f8035r5C18529j27422I826b80684A13799
18298G987b46603G1074a22443A0162d052I5347b127k08520E0404i5788j46619
18287b42407K926a11464r8505m9251g9196D65690b36675a1956A7235c19654h0649
$$ y = [-33043, -72810, 50953, 29842, 53279, 49145, 251948, -338130, 243410, -222044, -49117, -149159, -66859, -138876, 129846, 87919, -82346, -194244, -89997, -42838, -293664, -182971, -3628, -100214, 413686, -34533, 54809, -282056, 123229, 172165, -136887, 216095, -230577, -28603, 82767, 209091, -255196, 181554, 179597, -32041, 144685, -84531, -15934, -118933, 51085, -50993, -197315, -172567, -332861, 116704, -171597, -370532, -232085, -77435, -318959, -88548, -195553, -9073, -93763, 198696, 92643, -68035, -68130, 318529, 191107, 9826, -280684, 113799, 7987, -246603, 71074, -122443, 10162, -4052, 95347, -2127, -210647, 50404, -95788, -242407, -239481, -111464, -209969, -259220, -79196, 465690, -236675, -11956, 17235, -319654, -80649]
18275a09667r3949i1807D2878c68330A7104a23424p3573C3597b39430r0015J10965
18264b18480b4909a1394I8680b8195j39801b3321k02043b4168A04210b7827E1044
18252C2111J7003J18430b60488k32028g598l2630l7107k2359B48928A21989b16892
18240b99073B33345a17934k7774B32736a0225A23355L3110a76172C540J03464
18230A07004f6978k88020C07536A07291g5096j3189j18210J824A45958a02984
18219a80799j56252D5609M1144b26906I3601j6128J24492L3003H5805i4181B22443
18207a86451p5511J19945A53793C9674d9692A67564a40618H3608j9770a76888
18196b26657e5437F1693b44207m9999A33885a51969A99241a14498A19932b07493
$$ y = [-109667, -203616, -91807, 42878, -368330, 17104, -123424, -196997, 33597, -239430, -329445, -218480, -24909, -11394, 98680, -28195, -167996, -23321, -225364, -24168, 104210, -27827, 51044, 32111, 49114, 167544, -260488, -492516, -7598, -40228, -77335, -99694, 248928, 121989, -216892, -299073, 233345, -117934, -145708, 232736, -10225, 123355, 156465, -176172, 3540, 107004, -66978, -354998, 307536, 107291, -75096, -88285, -206495, -204671, 145958, -102984, -180799, -337051, 45609, 86753, -226906, 93601, 77473, 201965, 234968, 85805, -94181, 222443, -186451, -261962, -142017, 153793, 39674, -49692, 167564, -140618, 83608, 63838, -176888, -226657, -55437, 61693, -244207, -294206, 133885, -151969, 199241, -114498, 119932, -207493]
18185B7522J13327d6532k7468j00151A73007a43326f7801E7035b99045d4212G2419
18173a35546B86499g2476A75502c1360H9064A8896e8772F0772D3a52188q2597
18162b34785f3010k53986B80289a35225r9271I3245N4273b11115B65178a54183
18151A61569A6640b86293a13985l9520q0399A14860i4677j64338f4336I8807A1685
18139b5013j16709B78103b23527o2149B2223c39077i2760q2687k35500J59290
18129b51657a11029C30259h8789j19880d4137B12006g5470B26144G6102k1141
18119E4961e0494j65575A23688C1461C825J46467b75101a26874F1814b44423j28578
18108c73001e9642A00682c59016d0351A38252a14989C84934a65720k33329h2904
$$ y = [27522, 140849, -46532, -74000, -174151, 173007, -143326, -67801, 57035, -299045, -44212, 72419, -135546, 286499, -72476, 175502, -31360, 89064, 18896, -58772, 60772, 43, -152188, -234785, -63010, -316996, 280289, -135225, -234496, 93245, 147518, -211115, 265178, -154183, 161569, 16640, -286293, -113985, -153505, -233904, 114860, -94677, -259015, -64336, 98807, 11685, -25013, -141722, 278103, -223527, -285676, 22223, -339077, -92760, -175447, -410947, -251657, -111029, 330259, -88789, -208669, -44137, 212006, -75470, 226144, 76102, 54961, -50494, -216069, 123688, 31461, 3825, 150292, -275101, -126874, 61814, -244423, -373001, -59642, 100682, -359016, -40351, 138252, -114989, 384934, -165720, -399049, -82904]
18097A7801d5838j63380f471A08075a42988E549c74574m4540A79928o0086a90124
18085c20321l0866J61909H9757b05419B44773G6699b54654a24895e0884A6438
18074c54995j584A81038d7492A0981J37481J04960D0963d6218q2492I7391d100
18062e0019l9865M4234D1425a0333p5208D7959b8296j08113L9751a5150l9063
18051e4213m9978H9431l0449M7944N4935b96005h7652b2219k16006F9386a60017
18039e8977G9278C7379a27337N6658I1732E897g7231a1748A09875a28237A50726
18027d0080E7260K1466C8705N17415e05535A82855b02223A7196c88317a07994
18016a64975l1392B05641a44266r2463E4407b08613N4864A34441b31728A34904
$$ y = [17801, -45838, -209218, -6471, 108075, -142988, 5549, -374574, -419114, 179928, 119842, -190124, -320321, -351187, -189278, 89757, -205419, 244773, 76699, -254654, -124895, -50884, 16438, -354995, -356579, 181038, -47492, 10981, 148462, 253422, 40963, -46218, -128710, 97391, -4100, -50019, -89884, -45650, 41425, -10333, -85541, 47959, -28296, -136409, -96658, -15150, -54213, -104191, 89431, 58982, 106926, 161861, -296005, -87652, -22219, -238225, 69386, -160017, -58977, 79278, 37379, -127337, -70679, 91732, 5897, -77231, -11748, 109875, -128237, 150726, -40080, 57260, 78726, 38705, 556120, -505535, 182855, -202223, 17196, -388317, -107994, -164975, -196367, 205641, -144266, -236729, 54407, -208613, -153749, 134441, -231728, 134904]
18005b12774c6839J4550j00017d8185C90886f5731A79398a45816m4896M3726M3864
17994a03122A08139k5220d10427a25717A22229n0836a41798C10999a43327A50360
17983b66175C03330H3016K4852a75659D9179a89512A11288b92809H4102C2915
17972G2721a63564N7905m315B8921e7364E6813c3633A77631k8204J34563d40554
17960A90231C7305h0301p6345A1253J60959a92548j9901l433h0073m7631E6139
17948a87019R3161A41113a47969F1783e3102C7695K3679h779I5920j2849d3268
17936e7243B37313b69169c7446D7249K95875c14851a16226F4772R4673a78106
17925B26527c31714D5976J5058a57842b6985l09k10298I9142h152C7726a38184
$$ y = [-212774, -36839, -22289, -122306, -48185, 390886, -65731, 179398, -145816, -190712, -146986, -103122, 108139, 82919, -410427, -125717, 122229, 71393, -141798, 310999, -143327, 150360, -266175, 303330, 83016, 107868, -175659, 49179, -189512, 111288, -292809, 84102, 32915, 72721, -163564, -105659, -109974, 28921, -57364, 56813, -33633, 177631, 149427, 283990, -440554, 190231, 37305, -80301, -156646, 11253, 172212, -192548, -212449, -215882, -80073, -127704, 56139, -187019, -93858, 141113, -147969, 61783, -53102, 37695, 61374, -8779, 95920, 83071, -43268, -57243, 237313, -269169, -37446, 47249, 343124, -314851, -116226, 64772, 159445, -178106, 226527, -331714, 45976, 61034, -157842, -26985, -27294, -237592, 99142, -8152, 37726, -138184]
17913I7683b16356P2542L9148j21157B3366a36713B8260b76934L3339B819b24496
17901E8037g9328C9251b57323p659A8068a45349C5678L42277D6815b86600g8721
17889A85887a33360A54274m6230g8053A99257b8678p9029d6899A76507a50739
17878b2229r5595B2134a6133m3874j06368j20870e07m7034k32003I0359c57111
17866A23743d7715P847C5827J13664l3458n0122d9535D0661e4682B24981k824
17855B22157H7702e2055A43791B4952J71791O1036d12720a37703G7492K08458
17845B85950A35159E6460e2011A27271d0331q1540h099j11157N78j32380k022
17834b53080D4407a72801I043M00231j65180G4762J96897A7463J33249C9051a96986
$$ y = [97683, -216356, -143814, -104666, -225823, 23366, -136713, 28260, -276934, -243595, 2819, -224496, 58037, -79328, 39251, -257323, -264982, 18068, -145349, 35678, 377955, 46815, -286600, -78721, 185887, -133360, 154274, 108044, -78053, 199257, -28678, -107707, -46899, 176507, -150739, -22229, -117824, 22134, -16133, -60007, -166375, -287245, -507, -47541, -279544, 90359, -357111, 123743, -47715, -39868, 35827, 149491, 116033, 65911, -49535, 40661, -54682, 224981, 222157, 87702, -52055, 143791, 24952, 196743, 257779, -412720, -137703, 77492, 285950, 135159, 56460, -52011, 127271, -40331, -121871, -8099, -119256, -118678, -251058, -253080, 44407, -172801, 9043, 409274, 244094, 74762, 271659, 17463, 150712, 39051, -196986]
17822G0583e2838D2682N2624g1765j67416c9613A27833g9193O632m377E6325b36352
17809A70165L0461k6959J7062N500a9061n6027A06374I899a52528j32322D3866
17797c25194A60701b84987q3127a03375A29049a3976q7432A8185g2801F3462L3939
17786I7401J23069p395d1145G9395J04302C4411g6098b978k77953B92784A25827
17774a2834p8265b687o8171j17448R1905B18908N559G1303a53129N7249B98332
17762a66997m3542f0729o9750M005D1691P2865a53412A55976a43926B37088E1467
17750A25318a00916B38767j07710f2115q62a1233r5013b703k18674A9802O394
17739B6196K8910f5134B35771f1415q0478k49320I4298m5829a12801j05932A99567
$$ y = [70583, -52838, 42682, 95306, -71765, -239181, -39613, 127833, -79193, -72561, -76938, 56325, -236352, 170165, 200626, 173667, 190729, 196229, -19061, -75088, 106374, 9899, -152528, -284850, 43866, -325194, 160701, -284987, -368114, -103375, 129049, -13976, -101408, 18185, -72801, 63462, 97401, 220470, 213075, -41145, 79395, 183697, 34411, -76098, -2978, -280931, 292784, 125827, -12834, -91099, -2687, -70858, -188306, -96401, 218908, 224467, 71303, -153129, -95880, 298332, -166997, -210539, -60729, -130479, -126474, 41691, 114556, -153412, 155976, -143926, 237088, 51467, 125318, -100916, 238767, 131057, -62115, -62977, -11233, -106246, -2703, -221377, 19802, 26196, 55106, -65134, 235771, -61415, -141893, -391213, 94298, 48469, -112801, -218733, 199567]
17727a95699G1061f5888l7168A36327d67907I2592a521l127j4178B00403a98389
17715D6881j1553c0404r1657B4147K27975j07310D310J99935d0932B04892D4755
17703i4421r0177d7143D3262Q375g7997A37689P6289h0405B48310b86908A83903
17691b25981k607E776a18188J9812A02200I923a89994B39407g1926J916L2258
17680c7752B58467e9571l0125k2676A72278g1085B20545p0766B3360o746L36082
17669C52696B5885J61211O3208d5170A95235q4356A7147e7625o2863k675A92285
17657B8898O8595a86265B33873h017l90043B3554K908K87458D9766J56206C6272
17645B33089k0003h8660A22210a17820n1985n2279B76029C7648L40449b30789
$$ y = [-195699, 71061, -65888, -103056, 136327, -467907, 92592, -1521, -4648, -18826, 200403, -198389, 46881, 35328, -30404, -122061, 24147, 252122, 144812, 4310, 204245, -40932, 204892, 44755, -94421, -184598, -47143, 43262, 51637, -77997, 137689, 213978, -80405, 248310, -286908, 183903, -225981, -228588, 5776, -118188, -98376, 102200, 9923, -189994, 239407, -71926, -70010, -37752, 258467, -59571, -89696, -112372, 172278, -71085, 220545, 149779, 23360, 16614, 352696, 25885, 187096, 250304, -45170, 195235, 110879, 17147, -57625, -120488, -123163, 192285, 28898, 97493, -186265, 233873, -8017, -398060, 23554, 26462, 313920, 49766, 205972, 36272, 233089, 213086, -88660, 122210, -117820, -169805, -222084, 276029, 37648, 378097, -230789]
17634i1417j04028Q4913k0630j0211D74002c78907a42315D9234a48734A94298
17623a5479j57991j09344c4825A23724i9278L8940l25421g5653j759n3126I7162
17611F4425L60118A46603J44679j40156g2164o516A14065j7242a34726C14835
17600a19269A97346Q9218b70582i0991A70380Q4217G1734b08380e6467j81409
17590b37876d1027A79588j1795c65493e785E6312N966N2512n1897h0973B46582
17578H7375a03432a0714j31208A35969E8977d2637B4751c50777E9044k3840a06428
17566A02660e1055n3137A25618D2965a86589k03959A69878c80573G1445n699J1811
17555G7557k8074a84856C338a15531A21037N8972i0347I3475d9046j08596C67045
$$ y = [-91417, -195445, -110532, -131162, -141373, 474002, -378907, -142315, 49234, -148734, 194298, -15479, -173470, -282814, -34825, 123724, -99278, -60338, -385759, -75653, -77412, -130538, 97162, 64425, 424543, 146603, 291282, 151126, -72164, -78680, 114065, 96823, -134726, 314835, -119269, 197346, 286564, -270582, -90991, 170380, 254597, 71734, -208380, -56467, -237876, -41027, 179588, 167793, -365493, -5785, 56312, 62278, 114790, 62893, -80973, 246582, 87375, -103432, -10714, -141922, 135969, 58977, -42637, 24751, -350777, 59044, 35204, -106428, 102660, -51055, -104192, 125618, 42965, -186589, -390548, 169878, -380573, 71445, 65746, 77557, 49483, -184856, 3338, -115531, 121037, 180009, -90347, 93475, -49046, -157642, 367045]
17543a45812A14966C7601K87142K59238A35369A6759M11832e9744B10118O8894
17533B79012E7001b02896j44319e2738d159j81156A73503C0759a28589i510B11763
17521C42901a46828b7695l2200b3918A41231h3055C61312j56345a0496j20943
17511a31439j25686F9239P2011o0980J58902b20025B5508J87283L56202k68795
17501C00198j35161m2419l4988c643B78513r5195a02319A03519L5287O5247K74965
17490D79018A68616P7163Q4884I1966K58773e4330B18133L7556D0241J73411J73873
17479C87525E730P4956e4725K6485B74216m0703J26174B4249d4119o8346B48536
17467a19229C28950A15162L34886C3342J2521J40454a1012D9136J05068a21221
$$ y = [-145812, 114966, 37601, 324743, 583981, 135369, 16759, 428591, -59744, 210118, 279012, 57001, -202896, -347215, -52738, -4159, -185315, 173503, 30759, -128589, -9510, 211763, 342901, -146828, -27695, -59895, -23918, 141231, -83055, 361312, 204967, -10496, -131439, -257125, 69239, 141250, 80270, 239172, -220025, 25508, 212791, 568993, 300198, 165037, 122618, 87630, -3643, 278513, 183318, -102319, 103519, 138806, 204053, 479018, 168616, 245779, 330663, 91966, 350739, -54330, 218133, 255689, 40241, 213652, 387525, 5730, 80686, -54725, -28240, 274216, 233513, 359687, 24249, -44119, -112465, 248536, -119229, 328950, 115162, 450048, 33342, 45863, 186317, -11012, 49136, 154204, -121221]
17456C07306e5486B77430G0387J91603A1704K04803K03393K06770o5263A71497
17445B08723H6691J94410A15134C3590K32573M90534a15513A59574P706P4123
17435B41403L12879j61717I850M08578A36452a29289A34120K12546r0131b050
17424a6936C43538O7778j36546c9884k2642I7852c0702C60047M03429B95901C9235
17412D1392L80461q6095A16060Q0671p3664a12933A67061K7340e5404a817A63648
17400b0010B35887C8753a39443D15379b1673j48994n055A48086a13238A66508
17389D1340P6337c3867B81378r0271G469J68007P5791q1485H2798i1508B4999
17377c2911A49162g1494B50035J37930j90245P4089J66360j71760N3843A07951
$$ y = [307306, -55486, 277430, 70387, 261990, 11704, 216507, 419900, 626670, 561407, 171497, 208723, 86691, 281101, 115134, 33590, 266163, 756697, -115513, 159574, 167280, 241403, 554282, 392565, 9850, 418428, 136452, -129289, 134120, 346666, 256535, -2050, -16936, 343538, 411316, 274770, -39884, -62526, 97852, -30702, 360047, 763476, 295901, 39235, 41392, 421853, 335758, 116060, 196731, 123067, -112933, 167061, 194401, -55404, -1817, 163648, -20010, 235887, 38753, -139443, 415379, -21673, -170667, -175722, 148086, -113238, 166508, 41340, 117677, -33867, 281378, 191107, 7469, 175476, 251267, 169782, 82798, -91508, 24999, -32911, 149162, -71494, 250035, 387965, 197720, 271809, 438169, 266409, 320252, 107951]
17366g0128A87734O3171K41766c0009c410A65542p9804J3077L38056a06261C1572
17354C07543j42258G4728J42940R2380D5053K37906A2471K23611M1530n8969n0321
17343A68322G5306K15799o5407a32650G5462A9777L48057i5648c6444B75058J1726
17332B86784a07563C12411K12384a44223B91615j04603J80389n8038j38151e5178
17321h611C82302H1993a66123C5329K1797L77005A00029J00219k985l7583d913
17309B69556i4073h009C15265R038b9532A18228J77385B9394P5387a289k0427
17298b1716I8251e5170A84678J39265Q9962A96804a32959D11815C6961A7627M32493
17287D50120a25171K654B89166a5710N321A17320h9729D9471K61096j11873n8159
$$ y = [-70128, 187734, 250905, 492671, -30009, -3410, 165542, 85738, 98815, 436871, -106261, 31572, 307543, 165285, 74728, 217668, 310048, 45053, 282959, 12471, 236082, 277612, 218643, 168322, 75306, 291105, 225698, -132650, 75462, 19777, 367834, -95648, -36444, 275058, 286784, -107563, 312411, 524795, -144223, 291615, 187012, 367401, 309363, 171212, -55178, -8611, 382302, 81993, -166123, 35329, 57126, 434131, 100029, 200248, 197263, 159680, -4913, 269556, -94073, -8009, 315265, 324303, -29532, 118228, 295613, 29394, 104781, -1289, -21716, 98251, -55170, 184678, 323943, 413905, 196804, -132959, 411815, 36961, 17627, 450120, -125171, -122517, 289166, -15710, -10389, 117320, -89729, 49471, 310567, 198694, 140535]
17276A40535b83726E6746h7360D65101B04168I1286K83983l6284A55844i8615
17265B75653A07443B9386b71309A94528J08635D3731K56054A12566J81001Q2866
17255C76433c9010n3738N205B43281o835e6802b2985A16555Q7220a66174C53401
17243a67813J2091B91354D1677K03555n8864O8855J87974d0529C89567B0980J24668
17232A45648C8053J34625A5201J97958j319a76491O1200B21182h1491B45032k4709
17221B20323K66647A4957K07129A01806O5121C0647J33760g1870B27247K71303
17211D98550B22059q0620j1195A5418c2261D40196A64775R3067F2883M70117B51193
17199D98585A29042a58762C24376l5638Q755R3080j10939o7326J41905q7485j4921
$$ y = [140535, -283726, 56746, -87360, 465101, 204168, 91286, 375269, 338985, 155844, -98615, 275653, 107443, 29386, -271309, 194528, 303163, 43731, 299785, 112566, 293567, 376433, -39010, -92748, -87543, 243281, 236446, -56802, -22985, 116555, 203775, -166174, 353401, -167813, -155722, 291354, 41677, 245232, 186368, 255223, 443197, -40529, 389567, 20980, 145648, 38053, 172678, 15201, 213159, 211840, -176491, -115291, 221182, -81491, 245032, 220323, 486970, 14957, 222086, 101806, 166927, 30647, 164407, -71870, 227247, 498550, 222059, 141439, 130244, 15418, -32261, 440196, 164775, 257842, 62883, 533000, 251193, 498585, 129042, -158762, 324376, 288738, 297493, 390573, 279634, 212308, 354213, 266728, 251807]
17188B51807I0637J41746N2122j9752o0214I5176K62729d3055A96508q3754M15667
17177E28421A64777l9977K38558j64664I2133N07619j12750j72676r4043n5943
17167A64340M33632A84544K81362j06535J44504k34653d9154B99652A10206M23035
17157E33241B27285Q4483b13097G30467k52075a85758C60389j53593E8345J05983
17147A64328K44307q0220B5720J36148K3447Q7779r4619J83897m4369D8781M08065
17136D56846m8857a11458F43848A40744J50456j1962D7939L12392p9843j35231
17126A45257J68331N2292j12536J00700N46867C92855j55643L09050j60158K18016
17116F04120j62499j90703J81620Q7593k11921L23409k815k90079I2405L73138
$$ y = [251807, 90637, 232383, 284505, 264753, 204539, 95176, 357905, -43055, 196508, 112754, 528421, 164777, 124800, 363358, 198694, 92133, 599752, 487002, 314326, 220283, 164340, 597972, 184544, 465906, 359371, 503875, 269222, -49154, 299652, 110206, 533241, 227285, 311768, -213097, 730467, 478392, -185758, 360389, 206796, 58345, 164328, 408635, 328415, 25720, 161868, 185315, 273094, 178475, 362372, 318003, 48781, 456846, 407989, -111458, 643848, 140744, 291200, 279238, 47939, 360331, 280488, 145257, 313588, 365880, 253344, 354044, 900911, 392855, 237212, 546262, 386104, 604120, 441621, 250918, 432538, 520131, 308210, 631619, 628804, 338725, 92405, 465543]
17106D65543j53312J1976M7672J12248j09431J45536B56467L9937M27735n8592
17096F65547k00422A88053K51690Q7402k38746m1098l4274M26384k77108E5268
17085D94004B32872J16462K40107A09335L74878H1143M64283j01017l104p6077
17075C65228R8589j5307J45088k20592M41926l76250K5466m4582K8075J55363
17065F03004C01128J88723k18647R3649J15405J30020m2146P5647B86610J99953
17055D86563B09950L16876j26145K3898k4680R6067J27464K9108p0920J17265
17045F98883k99826M7243L09526C01219M11058C54014N0605K05717k95938J58281
17035D72679j07617M89849r326k43692J23401l53185L38915k32808K10651N4401
$$ y = [465543, 312231, 324207, 371879, 484127, 374696, 520232, 256467, 296404, 724139, 665547, 465125, 188053, 439743, 527145, 288399, 247301, 213027, 639411, 362303, 55268, 494004, 232872, 349334, 589441, 109335, 484213, 81143, 545426, 444409, 441305, 365228, 463817, 448510, 593598, 373006, 814932, 438682, 464148, 419566, 447641, 603004, 301128, 489851, 271204, 364853, 480258, 610278, 568132, 643779, 286610, 486563, 209950, 526826, 400681, 424579, 399899, 495966, 623430, 652538, 581618, 698883, 399057, 446300, 755826, 301219, 712277, 354014, 404619, 610336, 314398, 472679, 365062, 854911, 845585, 601893, 725294, 372109, 711024, 478216, 688867, 743268]
17025G43268j77175n2355l7678P7819M04788l82539j602K90286k73745J53986
17015G45053o6782q7560J33170p1979J17887L5318L05112m47072J32545k31913
17005E63779l7002J52153j20304J80690k38540K60664j73724L75416O8463p2206
16995I59389l13157j05389K31424L10480j29308C68826O24069p1674j47061p4844
16985F99316L9704R0358L6367j23420J96432l5756k8054O4051k82536M32326m69633
16974F19155M17771l03853P5292K77362m37036K48374j72930J14082K97488k65408
16964H70297M3102K60627Q708j97900P2845j60196o940K00279q7407K53287j67070
16953A089632j77730k6370K19920L05852m05138P7757J08021k86551K69594j31348
$$ y = [743268, 566093, 513738, 476060, 553879, 958667, 576128, 574526, 864812, 591067, 745053, 678271, 590711, 723881, 651902, 769789, 805107, 1110219, 663147, 795692, 563779, 526777, 678930, 558626, 739316, 500776, 761440, 587716, 963132, 1031595, 959389, 646232, 540843, 772267, 1082747, 953439, 368826, 992895, 921221, 774160, 699316, 739020, 829378, 865745, 742325, 938757, 903001, 874947, 938998, 656462, 1088788, 619155, 1036926, 733073, 808365, 1085727, 648691, 897065, 724135, 838217, 1135705, 870297, 913399, 1174026, 1182734, 984834, 1057679, 897483, 890543, 1090822, 1003415, 1256702, 1089632, 911902, 885532, 1105452, 1411304, 1006166, 1083923, 1191944, 905393, 1174987, 1043639]
16943A043639k03145M23351j21592j43463R2385j22788K42738J65038j03921M7956
16933A320198Q825m9582N3675m1924j51911L48927q6375R7883P0479m26887O856
16922A150164K80973J20615J38796m36050K67568j5731p351P0435j1251K4645
16912A582813K59640j51910m2099k07092K75238j82922K62475P9902J20375n1908
16902A944512k65056N7249K39655j93760m5522P4214K70627P8136k21543j36106
16892A802406L61053j80433k11464M09709k18617K24062l47135L00592O7978j39810
16882B068341L9277J79643o18280M67198K51862Q1764l72310N70728k30942L6285
16872B473566M5679p5513L18672J4245k25475n9078N57840o07841K69079J82816
$$ y = [1043639, 840494, 1263845, 1142253, 998790, 1091175, 968387, 1211125, 1376163, 1272242, 1320198, 1329023, 1279441, 1333116, 1291192, 1139281, 1488208, 1401833, 1499716, 1570195, 1143308, 1150164, 1431137, 1551752, 1690548, 1254498, 1522066, 1506335, 1498984, 1569419, 1558168, 1582813, 1842453, 1690543, 1648444, 1441352, 1716590, 1533668, 1796143, 1876045, 1996420, 1944512, 1679456, 1736705, 1976360, 1782600, 1737078, 1811292, 2081919, 2160055, 1938512, 1802406, 2163459, 1983026, 1771562, 2181271, 1962654, 2186716, 1839581, 2140173, 2208151, 2068341, 2107618, 2287261, 1668981, 2136179, 2388041, 2469805, 2097495, 2668223, 2437281, 2473566, 2519245, 2443732, 2762404, 2776649, 2551174, 2492096, 3049936, 2442095, 2711174, 2893990]
16862B893990l51339K84331J69569L5398k73212M39935j45103l42924M17880l2358
16852C096167K25749K08653o32611O81689k05794M02299k19196r7510K74158J57761
16842C891365q2174Q1779p6656N1802O6757K95051m96489N51923Q4196k24883
16832D142671N24970j48811k5K83832Q5627J09764j30369k38200M50650J37516
16822E217625j59158K07969J02557J99893K22169L14520l03352K62511K08887
16813F273621J51267J4862J42344O6499q8797J94526J14780L27042O0920L9609
16803G296673N08774J72415J95135j0583L60385L24731j38425J91210M86436L9543
16793I426294M32086p6295K97525L87539M91348R5330L49478K45122K04701N94468
$$ y = [2893990, 2542651, 2826982, 2996551, 3031949, 2758737, 3198672, 3053569, 2710645, 3128525, 3096167, 3321916, 3530569, 2897958, 3579647, 3373853, 3776152, 3556956, 3459446, 3733604, 3891365, 3809191, 3890970, 3814314, 3866116, 3932873, 4227924, 3731435, 4283358, 4367554, 4142671, 4667641, 4518830, 4518805, 4802637, 4888264, 4998028, 4867659, 4629459, 5080109, 5217625, 5058467, 5266436, 5368993, 5568886, 5791055, 6105575, 5802223, 6064734, 6273621, 6424888, 6439750, 6582094, 6648593, 6559796, 6754322, 6869102, 7196144, 7257064, 7296673, 7805447, 7977862, 8172997, 8162414, 8522799, 8847530, 8709105, 8900315, 9386751, 9426294, 9858380, 9782085, 10079610, 10467149, 10958497, 11053827, 11403305, 11648427, 11853128, 12447596]
16783A2447596O7005P04203L91380L1994M13083L52017O23047N21378N08159N54726
16773A6614588N39837M38086J084180M83045M63843M86791P11449R88840Q48891
16764B2659550R75941N96912R24251J285810Q15109J190387J128446J220656J271047
16755C2068109Q82316J968076J539580J482185J910076J878336K105850K092628
16747D5927156K253253K358244K618588K345350L193506K968852L633541L339769
16739F8638259L626555M142878M371218M486571M414146N614638M893712N327757
16731A05515734O201112O253353O222834O123572O531569O509057O351175N975146
16723A55683552N265779N342740M630996M153427K840022J992358P70001J44060
$$ y = [12447596, 12514601, 13218804, 13610184, 13642178, 14055261, 14407278, 15030325, 15551703, 16059862, 16614588, 17154425, 17592511, 18676691, 19159736, 19623579, 20110370, 20821819, 21810659, 22659550, 23635491, 24232403, 25156654, 26442464, 27257573, 28447960, 29576406, 30797062, 32068109, 32950425, 34918501, 36458081, 37940266, 39850342, 41728678, 43834528, 45927156, 48180409, 50538653, 53157241, 55502591, 58696097, 61664949, 65298490, 68638259, 72264814, 76407692, 80778910, 85265481, 89679627, 95294265, 100187977, 105515734, 111716846, 117970199, 124193033, 130316605, 136848174, 143357231, 149708406, 155683552, 160949331, 166292071, 170923067, 175076494, 177916516, 179908874, 180678875, 180822935]
16715A80822935j181466j954881l036809m169029m651401n232085n640816o210747
16707A48745701o376968o653376o386554o429992o166152o213029o087713n417591
16699I9014326n698100m762931n140360m325847m390792m284583l685715l305611
16691F3420387l321700l102587k778068k643351k757102k307544k402781j970723
16683D2136531j997814j727238j541575j838242j430456j612808j203893j344931
16675B9439574j613087n01002j423160q82874r27014j123833o93855p83010o25498
16666B0866241p47305p11527r63584n42611l92984p08368o30972m05228l78589
16657A5385073l63109o18310n81656k68184m38700k93482m01230o83529k11140
$$ y = [180822935, 179641469, 177686588, 174649779, 170480750, 165829349, 160597264, 154956448, 148745701, 142368733, 135715357, 129328803, 122898811, 116732659, 110519630, 104431917, 99014326, 93316226, 88553295, 83412935, 79087088, 74696296, 70411713, 66725998, 63420387, 60098687, 56996100, 54218032, 51574681, 48817579, 46510035, 44107254, 42136531, 40138717, 38411479, 36869904, 35031662, 33601206, 31988398, 30784505, 29439574, 27826487, 27325485, 25902325, 25019451, 24092437, 22968604, 22274749, 21491739, 20866241, 20118936, 19407409, 18443825, 17901214, 17508230, 16799862, 16168890, 15763662, 15385073, 15021964, 14403654, 13821998, 13553814, 13115114, 12821632, 12420402, 11736873, 11525733]
16648A1525733m202n09144l94612j1115n23489j15212k29250k16039k67954M9383
16638I304099p49882Q1895o94799K08924k92773l86645P5979m31505K18886l67394
16628F966785k51896m8755j59319j57959j1634n90154K28088N8368n29761L64083
16618E867846j80146J54202o86068J10605j78786j67541k6479J37538k89415j30811
16608D610945k62027Q7467R8837n37970K94612j01112k91383J33487j79686J70764
16598D023934l3825j46925n80512K66802J17860k74556l1311R5228l39831j6635
16588C080229L91264l68115K14644m74297k29167L45302k18779K57276k30965
16579B767392M1990j69436J76975k58214j05866L78086k51255k8850k10319K2754
$$ y = [11525733, 11521531, 11012387, 10617775, 10606660, 10083171, 9967959, 9738709, 9522670, 9254716, 9304099, 8554217, 8636112, 7941313, 8150237, 7857464, 7470819, 7546798, 7115293, 7334179, 6966785, 6714889, 6666134, 6506815, 6348856, 6337222, 5747068, 5975156, 6033524, 5503763, 5867846, 5687700, 5841902, 5155834, 5266439, 5087653, 4920112, 4893633, 5031171, 4741756, 4610945, 4348918, 4436385, 4535222, 3997252, 4291864, 4190752, 3899369, 4032856, 3853170, 4023934, 3990109, 3843184, 3262672, 3529474, 3647334, 3372778, 3341467, 3436695, 3096864, 3080229, 3471493, 3103378, 3318022, 2843725, 2614558, 2959860, 2741081, 2998357, 2767392, 2809382, 2639946, 2816921, 2558707, 2452841, 2830927, 2579672, 2550822, 2340503, 2363257]
16569B363257J36942k1429m7530M5613K39795l01011k56840k60751K60009L396
16559B161451j40393J95749m13636J63886k11037j2331L86238j74210K14659l10395
16549A859981K39132n00552K54859q5645j70408n3529L2303K98211k18887L68815
16539B024280m17616K24794k04238k92165J90985j036j19485M32342j36606j15503
16529A585752j61629j8461L48276l88831J43596l58538J94302K7818l6245K3744
16519A359784r0736q9482K83396n5745l85786L16156j25731j46826J35817l18831
16509H82016J56219k543M3975J54465J15457j95127q4626j28513L10481l11614
16499I40190r2475J63837q8977J01587K17057l41164k10112N2587L25028k88292
$$ y = [2363257, 2500199, 2478770, 2431240, 2476853, 2716648, 2415637, 2158797, 1898046, 2158055, 2161451, 2021058, 2216807, 1803171, 1967057, 1756020, 1743689, 2129927, 1955717, 2170376, 1859981, 2099113, 1598561, 1853420, 1767775, 1597367, 1543838, 1576141, 1874352, 1655465, 2024280, 1606664, 1831458, 1627220, 1335055, 1526040, 1525004, 1405519, 1837861, 1701255, 1585752, 1424123, 1405662, 1753938, 1365107, 1508703, 1150165, 1344467, 1372285, 1336040, 1359784, 1269048, 1179566, 1462962, 1407217, 1021431, 1337587, 1211856, 1065030, 1200847, 882016, 1038235, 1035692, 1079667, 1234132, 1349589, 1154462, 1069836, 941323, 1251804, 940190, 847715, 1011552, 922575, 1024162, 1241219, 900055, 689943, 742530, 1067558, 779266]
16489G79266K3903N59845m23587N9333j2491p9310q7775j72113K61295j59482
16479G48884J15699J09357l69183M95461J33836l16204C73999Q46664j62444k83526
16469G74693k51088K43332J20338j57387K94025l01490k18722N83356j15668j98255
16459G73134P0510k15052Q8642K66874l19592J57259j59902k20970L72733j89799
16449F23837p0193K18653k61047r6168r0122K89942q3252K38425k23224N50822
16439A097673D80893J49230k9564J1151K90770B65551L04736j42139J70042B24048
16428F95716k16245J74944l15437L70713B79907k2871J95456M7566l7581J30555
16418E93032j38524A39887N16025C22538J46513j1356J53165B36341J36749Q8828
$$ y = [779266, 803169, 1363014, 939427, 998760, 986269, 906959, 819184, 647071, 908366, 748884, 864583, 973940, 604757, 1100218, 1234054, 917850, 373999, 1220663, 1058219, 774693, 523605, 766937, 887275, 729888, 1023913, 722423, 503701, 1087057, 971389, 773134, 843644, 628592, 717234, 984108, 664516, 821775, 661873, 440903, 813636, 623837, 553644, 772297, 511250, 415082, 324960, 614902, 531650, 770075, 546851, 1097673, 480893, 630123, 600559, 611710, 902480, 265551, 570287, 428148, 598190, 224048, 695716, 479471, 654415, 338978, 709691, 279907, 257036, 452492, 500058, 462477, 593032, 454508, 139887, 655912, 322538, 469051, 457695, 610860, 236341, 373090, 461918]
16408D61918k7896L39928k68601k23003m5602L18191J31696J03063p9632l41958
16398C68104q4454K91426A81748L16886J0141K8489j21001K20087k14905R9042
16388E20487k17585K6139L50320k70911q1104K07489L475j75244J80511j86090
16378C57487J71377N8542B60676A10893J25320J42723L6614K0640j78482J46821
16368D04529A54867J17110K49343a50538D11290J81507f4583D52969J52530k76405
16358C29094J21943r742o4543j2175K48421j84508A64422M23672j05414j38587
16348C44093I9651f644B83181K3582A28202J0585J70155J08750J977A88851L82786
16337E71637A53642L93795b9544C69692F9953M00006j49804A46579J74044A43752
$$ y = [461918, 434022, 773950, 505349, 282346, 236744, 554935, 686631, 789694, 710062, 368104, 283650, 575076, 181748, 498634, 508775, 537264, 416263, 636350, 421445, 520487, 302902, 329041, 679361, 408450, 327346, 534835, 538310, 363066, 543577, 357487, 528864, 587406, 260676, 110893, 236213, 378936, 415550, 436190, 257708, 404529, 154867, 271977, 521320, -150538, 411290, 592797, -64583, 452969, 605499, 329094, 451037, 441295, 376752, 364577, 612998, 428490, 164422, 588094, 482680, 344093, 99651, -6644, 283181, 306763, 128202, 138787, 308942, 417692, 419669, 188851, 571637, 153642, 547437, -29544, 369692, 69953, 469959, 320155, 146579, 320623, 143752]
16326A60928K82390j09426r2735Q8531q9336L5934J15717n5773Q720A17874M15379
16315E33253j98022K0569J38226A53616o7363g1397B94894k2874R4826F5154J1648
16304G6802K83090o5579D2065f353k3968A58337f8538F7946K70966C5642n829
16293B9813d0571A31878M2965a06014I6925K43078j24099e0488B66510c3127g610
16281B5345K82923j03366r7570J4292K33876A27682n7634K72518j48363L55720
16271E49923B43960J92189n7098j03345o5850H9289J94488j20870F9358J81867
16261B51225M5680K38332a44213f35C0298K09580K02865p1649a0592E09325B48512
16249A04624a03701C33810d4328K1502l3350B91698J29575A4748K16919b08681
$$ y = [160928, 443318, 333892, 241157, 329688, 240352, 276286, 392003, 336230, 344950, 117874, 533253, 335231, 355800, 494026, 153616, 86253, -71397, 294894, 272020, 366846, 65154, 76802, 359892, 294313, 42065, -6353, -30321, 158337, -68538, 67946, 338912, 35642, 29813, -40571, 131878, 174843, -106014, 96925, 340003, 215904, -50488, 266510, -33127, -7610, 25345, 308268, 204902, 107332, 121624, 355500, 127682, 70048, 342566, 194203, 549923, 243960, 436149, 379051, 275706, 209856, 89289, 283777, 162907, 69358, 251225, 296905, 535237, -144213, -635, 30298, 239878, 442743, 371094, -10592, 509325, 248512, 104624, -103701, 333810, -44328, -22826, -56176, 291698, 421273, 14748, 231667, -208681]
16238A50710M7636R3775a05584F011L46003g6620A42712f4905G3392Q9783F0530
16226b35831d3448B2317M77762B06514b529G0281b64289J17225D85119h1977D22250
16214B87553a3866C4001E404a00814B75777C013a12128B13851I9307B2288N7776
16203H0064a02523A06937J49561a67085A75457N1609j08431d0995j27909d6353
16192A26712K8862L2112I0168K03527K62130b6548A20361Q2507M0864b83970B92791
16180c3009L712I0686a67292M291A95830N4834l2188m6262G0720M0007k1592J72423
16168B61558f24005D1334K48742j34633q026q639a21170B06354b6242j4003A66942
16156E9118d3465E3952b6133j03086d5706G52438c10823I694K83708g2217G276
$$ y = [150710, 198346, 292121, -105584, 6011, 352014, -76620, 142712, -64905, 73392, 163175, 60530, -235831, -43448, 22317, 500079, 206514, -2529, 70281, -264289, -147064, 485119, -81977, 422250, 287553, -13866, 34001, 5404, -100814, 275777, 3013, -112128, 213851, 99307, 22288, 80064, -102523, 106937, 256498, -167085, 175457, 227066, 118635, -40995, -168904, -46353, 126712, 155574, 187686, 90168, 293695, 555825, -26548, 120361, 202868, 243732, -283970, 292791, -33009, -29297, 90686, -167292, -163001, 195830, 250664, 218476, 172214, 70720, 110727, 89135, 261558, -624005, 41334, 290076, 155443, 147417, 138778, -121170, 206354, -26242, -40245, 166942, 59118, -43465, 53952, -26133, -129219, -45706, 752438, -310823, 9694, 293402, -72217, 7276]
16144E68204k23850B8067a5464k5581A08739c299j22020B9540K46630g8711B9776
16132a64649A59406B8547O9313g8265r0632r7003H8317a03878B48539q9991i1743
16120h9088B19481a34193o4416E8151a22304G720J38712M86071k71226I712L48379
16109C58091b34397c6401n6057A89846P6931f8297A14170b35355I0673N1857N47343
16098F89873b9275A24456J01723a07915n198q9324c6693B91123j28428g1579H7716
16086E9476K69161c0210O020A98521a72461j49188J31385j699c7674A54937g6222
16074B61725J134a70424K7338l1723A8124J52040e9510G6481d3785j43881A27763
16062I3378b32812D3269O3457a82007H6946K46037f0298g734o1238l8073d0150
$$ y = [568204, 344354, 28067, -15464, -41045, 108739, -3299, -125319, 29540, 276170, -78711, 29776, -164649, 159406, 28547, 97860, -78265, -168897, -265900, 88317, -103878, 248539, 158548, -91743, -89088, 219481, -134193, -198609, 58151, -122304, 7720, 146432, 632503, 361277, 9712, 358091, -234397, -36401, -92458, 189846, 266777, -68297, 114170, -235355, 90673, 142530, 689873, -29275, 124456, 226179, -107915, -113113, -202437, -36693, 291123, 162695, -71579, 87716, 59476, 328637, -30210, -24190, 198521, -172461, -321649, -190264, -191963, -37674, 154937, -76222, 261725, 262859, -170424, -143086, -174809, 18124, 170164, -59510, 76481, -43785, -187666, 127763, 93378, -232812, 43269, 106726, -182007, 86946, 332983, -60298, -7734, -68972, -107045, -40150]
16050a00569B07483H118b29366B33743a21362A60463a54291D4232G128c62426
16039a67074G677N0424e2115p9745k5651C3783b32231e4608K2923n525A71910
16027G457L14760G6595B551b71297h0913A58533p6356C1087K47652G4892P4539
16016A49431b65051Q0853j7001i3366a9554A26783a97992m9328C24354b27845
16005f9451o1013C10285b02399P5358C0161N0333h7537A61991b57737Q1550f9448
15993F3484a62039E007K32605f0597D37892e7754D09951N2813j88390J98040G0782
15981A78584n0433E7412J5266K17016d016D4301b1914C0740c6124I3552c7657
15969a74340A13067C6858O4439a65514O5170l7190O1629A41222a04574g441p4325
$$ y = [-100569, 207483, 8118, -229366, 233743, -121362, 160463, -154291, 44232, 7128, -362426, -167074, 7677, 58101, -52115, -131860, -157511, 33783, -232231, -54608, -31685, -37210, 171910, 7457, 322217, 76595, 2551, -271297, -80913, 158533, 82177, 31087, 278739, 74892, 149431, -265051, -184198, -201199, -93366, -19554, 126783, -197992, -247320, 324354, -227845, -69451, -130464, 310285, -202399, -127041, 30161, 80494, -87537, 161991, -257737, -176187, -69448, 63484, -162039, 5007, 237612, -60597, 437892, -57754, 409951, 462764, 274374, 472414, 70782, 178584, 128151, 57412, 72678, 289694, -4016, 44301, -21914, 30740, -36124, 93552, -37657, -174340, 113067, 36858, 101297, -165514, -100344, -137534, -75905, 141222, -104574, -7441, -81766]
15958h1766f107j41330l05020f7675n1971A69338J7977A7581b6016l79770a50487
15946F6485J7935d26394B48385i9692i294n56598a14346j21107e4730A83138h2765
15934b06481A40780a92219B954f1150H2529D528f2927O022j32557A66701l6725
15923A29976a20435c4820k17329A62163j4473e8676A17557K51522I59J10386c51466
15911a47750C9589b16258N6889e7748E7321b04145k6592A84533a08465C9989J7722
15900E7711a23430J085M8393F0586h4563k36132a24703d1588A13979g7933D4368
15888D1783A4413J79035d4417F037R4373a25234a4513C4835K2322J7876b39630
15876e283q2976A0384K31464a02732a4560A92919b1028B8254P2107B9795O4463
$$ y = [-81766, -6107, -147437, -452457, -67675, -119646, 169338, 187315, 17581, -26016, -405786, -150487, 66485, 84420, -426394, 248385, -99692, -9294, -565892, -114346, -235453, -54730, 183138, -82765, -206481, 140780, -192219, 2954, -61150, 82529, 4528, -62927, -56905, -189462, 166701, 129976, -120435, -34820, -252149, 162163, 147690, -58676, 117557, 369079, 959, 111345, -351466, -147750, 39589, -216258, -159369, -57748, 57321, -204145, -230737, 184533, -108465, 39989, 57711, -123430, -122345, -73952, 60586, -84563, -320695, -124703, -41588, 113979, -77933, 44368, 41783, 14413, 193448, -44417, 6037, 100410, -125234, -14513, 34835, 57157, 75033, -239630, -5283, -88259, 10384, 241848, -102732, -14560, 192919, -21028, 28254, 100361, 29795, 94258]
15865I4258b9039A58021a02959k97253C69102a68334e6744j35027C35962A46498
15854F5953A0928c6143j70831C46826b50824R036J08002k8755b8946A63116C679
15842F9837L7571b38055J08810A42584J94340g1319a2971j82401A11909d84292
15831a48688A3440b35604A28893C872J42196R1784D892R2903a54505p666B77472
15819A00327b4774j12453l053G6087b92581a37345n7301m0635a17591A5121c3731
15807A44453C3213J08595b00074i4321A27837a43823j69246d3124A65943a51720
15796B35108A11481A5221b13083B41660c10420a14473A3409c23859D19200i9602
15785f4744B18722c28064A61206k1750b07303M2304L6433I9913b18283B21119
$$ y = [94258, -29039, 158021, -102959, -400212, 369102, -168334, -56744, -191771, 335962, 146498, 65953, 10928, -36143, -206974, 346826, -250824, -241788, -133786, -162541, -28946, 163116, 3679, 69837, 107408, -238055, -129245, 142584, 336924, -71319, -12971, -195372, 111909, -484292, -148688, 13440, -235604, 128893, 3872, 146068, 237852, 4892, 97795, -154505, -162171, 277472, 100327, -24774, -137227, -140280, 76087, -292581, -137345, -194646, -235281, -117591, 15121, -33731, 144453, 33213, 141808, -200074, -94321, 127837, -143823, -313069, -43124, 165943, -151720, 235108, 111481, 15221, -213083, 241660, -310420, -114473, 13409, -323859, 419200, -99602, -64744, 218722, -328064, 161206, 139456, -207303, -164999, -128566, 99913, -218283, 221119]
15774a6199q8854o3052f6614j72226J09715K8544D39174c8514j75616f8957K0765
15763d8192I4207l4649a32333H3629Q8556O8102a9470A64567c5209B4302J35556
15752A59858c5115A01518q005b64929A96677O9844A28276m1274d5054o1137E4887
15740h4316j1673q1207g2599G7490j3022b86031A52915a88177A23908a78190F2040
15728A07783J22956j01406b40861o9403F4205a54868j94661l0632f5214j55140
15718b20354A48311g2702k27060d1535j16884I2270J03509A2872e870j89254j07254
15707c02378J8030b6995A1861J97438c12886B2747c10237j34148A3409a50141
15696D85521b53034P5910m8898G0670c9782A35969k5577J11066c11678J49800
$$ y = [-16199, -105053, -168105, -66614, -238840, -129125, -100581, 439174, -38514, -214130, -68957, -48192, 94207, 59558, -132333, 83629, 172185, 240287, -19470, 164567, -35209, 24302, 159858, -35115, 101518, 93513, -264929, 196677, 266521, 128276, 87002, -45054, -106191, 54887, -84316, -95989, -177196, -72599, 77490, 64468, -286031, 152915, -188177, 123908, -178190, 62040, 107783, 230739, 129333, -240861, -310264, 64205, -154868, -349529, -380161, -65214, -220354, 148311, -72702, -299762, -41535, -158419, 92270, 195779, 12872, -5870, -195124, -302378, -284348, -26995, 11861, 209299, -312886, 22747, -310237, -444385, 13409, -150141, 485521, -253034, -177124, -226022, 70670, -39782, 135969, 110392, 221458, -311678, -161878]
15686a61878B66502j31367n3535P3603f6079o9231k66508I5750N7910a54221a0634
15674b66207R6421A58693o4189J51592L6093G3038e3388H6716m0168b47662B2755
15662D5910L1918c87090A81214E0353a57199A36454a30790F2989i8148L7796n0489
15651a10841A10763l2661J05163H5183a45312d4370A42425a47554A25564c89206
15640a9428r8353I6022M4992B8900a28465j14859a2021j89429c341F4475a3466
15628A81535k2743F0688N3633b68997G3338J00994a12942A54168J10986l3486
15618B31668A0733b31194j12377H6569d1418L548k18342b1577A45389P01d7168
15606c16248J20146Q4404b4023j00041p0102I5265K8245f7441G049d28638c1414
$$ y = [-161878, 266502, 135135, 81600, 155203, -66079, -135310, -401818, 95750, 153660, -154221, -10634, -266207, -169786, 158693, 94504, 246096, 282189, 73038, -53388, 86716, 46548, -247662, 22755, 45910, 77828, -387090, 181214, 50353, -157199, 136454, -130790, 62989, -98148, -60352, -110841, 110763, 78102, 183265, 85183, -145312, -44370, 142425, -147554, 125564, -389206, -19428, -117781, 96022, 141014, 28900, -128465, -243324, -12021, -201450, -3341, 64475, -13466, 181535, 158792, 60688, 114321, -268997, 73338, 174332, -112942, 154168, 265154, 231668, 10733, -231194, -343571, 86569, -41418, -37870, -256212, -21577, 145389, 146090, -47168, -316248, -196102, -111698, -24023, -124064, -194166, 95265, 123510, -67441, 7049, -428638, -31414]
15594i4685H8049c33060J24108H1546b28845p5248F5599a03396m5981A52151B929
15582d58010A68104n4818b53158B24374a53611G6035g9562j51524L8468R0377
15572a02241k29387d1466D4372b1352j6999k60441i9212j12615i997A22651n9542
15561F3109a48210A04023a86160h4274B06025i4218J7662G8382h2134C63262b85144
15549b37602e692j59841L82C05760E5357L6748c1109a2592j6969A19339g3354
15537B07709G3989N1104a48060H026a24129j73672B6564L7066a0411A48671a88257
15525G9052O8951a81034j41391H9346q206Q0775J09423H6192b56748A23041N9154
15514A82195a30747B15064f4302A12054a07413A15895A2498d38929C5552g6434
$$ y = [-94685, 88049, -333060, -208952, 81546, -228845, -304093, 65599, -103396, -149377, 152151, 2929, -458010, 168104, 113286, -253158, 224374, -153611, 76035, -79562, -231086, -192618, -102241, -331628, -41466, 44372, -21352, -38351, -298792, -99212, -211827, -9997, 122651, 63109, -148210, 104023, -186160, -84274, 206025, -94218, -76556, 78382, -82134, 363262, -285144, -237602, -5692, -165533, -165151, 305760, 55357, 92105, -31109, -12592, -29561, 119339, -73354, 207709, 73989, 125093, -148060, 8026, -124129, -297801, 26564, 63630, -10411, 148671, -188257, 79052, 148003, -181034, -322425, 89346, 81140, 161915, 271338, 86192, -256748, 123041, 182195, -130747, 215064, -64302, 112054, -107413, 115895, 12498, -438929, 35552, -76434]
15503g6051f909j48750j77749B4845g3510C3596i7424A61567a85768L301f781
15491A08771A4564a66200I6847a96278A53722c67330J33096f3594k34189e536
15480a83117C36159a01362l93423b4193j72340l2984c8329A99216H3103a36501
15469C41342E9057a53982J3972M6036B75617q1686C5877a07565B3914J16121B6138
15457b01069A74835R2598m2690b53888A01065d1910A07903A5446a42411D5302
15446a17828d5711o0081J4170G6004R7649m2301D3341J4275b37786F5280a20054
15434A27224d8531k2034b7993k12733a0013m7319B5991N031E370L5524P4116B6232
15421G1083J3629b42271c5812A43807a17419k58772g331C3269e1198C10501b4142
$$ y = [-76051, -6909, -155659, -333408, 24845, -73510, 33596, -97424, 161567, -185768, -182467, -6781, 108771, 14564, -166200, 96847, -196278, 153722, -367330, -234234, -63594, -297783, -5536, -183117, 336159, -101362, -494785, -24193, -196533, -229517, -38329, 199216, 83103, -136501, 341342, 59057, -153982, -140010, -93974, 275617, 193931, 35877, -107565, 23914, 140035, 26138, -201069, 174835, 267433, 224743, -253888, 101065, -41910, 107903, 15446, -142411, 45302, -117828, -45711, -105792, -91622, 76004, 173653, 131352, 43341, 57616, -237786, 65280, -120054, 127224, -48531, -70565, -27993, -240726, -10013, -57332, 25991, 31022, 5370, 40894, 115010, 26232, 71083, 84712, -242271, -35812, 143807, -117419, -376191, -7331, 33269, -51198, 310501, -24142]
15409a31599f1585A00809K29451a83956A70131J61176H8257c94936G2352F018
15398a24871A24109f1549b36B60254N8937h3428n4673E9600k4005L8511Q657e66415
15385b07977h8925B4616l555J67729B9502a05204j49051F8287K07585g3733a7427
15373c43035A79251b16722c4943j63210A0014L25691A59615p429o2515i7150G4360
15361a78652B35294e4568b3323L096j911G2750b8024o0400A06133b77167B31580
15349f966j85089B69650q8217d53180E2195K8347J7141D7564k1568c90153e6261
15337c7707H914b56756B00631a22612a8630j34944B66578B9572O1278A7236J13046
15326A30282k1145K58581a67629F0448J63679H0098M0986M1156b56102d6961H7801
$$ y = [-131599, -61585, 100809, 330260, -183956, 170131, 331307, 88257, -394936, 72352, 6018, -124871, 124109, -61549, -236, 260254, 319191, -83428, -138101, 59600, 35595, 74106, 82763, -566415, -207977, -88925, 24616, 21061, 188790, 29502, -105204, -254255, 68287, 275872, -73733, -17427, -343035, 179251, -216722, -34943, -198153, 10014, 335705, 159615, 152186, 89671, -97150, 74360, -178652, 235294, -54568, -23323, -20227, -22138, 72750, -28024, -88424, 106133, -277167, 231580, -6966, -192055, 269650, 181433, -453180, 52195, 80542, 97683, 47564, 25996, -390153, -56261, -37707, 8914, -256756, 200631, -122612, -18630, -153574, 266578, 29572, 90850, 17236, 130282, 109137, 367718, -167629, 60448, 224127, 80098, 121084, 162240, -256102, -46961, 87801]
15314b50633F9673B1642a59279B49990K8905l2666E9150b53550C50097E7837e581
15302a16914C16996p5532D9887b01524A08397m03Q4127l8496E4265e744B92665
15290A63484Q5760j10219B0617f4048A69739b48087L8652c703A8341O8234d8060
15278a19286j46777j49784f8591C39973b68727a09086B53945f0018D66410b7664
15267H6787C4300J32825L6493c69150H9485a33662l3725B22448b794A30882J38772
15256B69654h3283o1935A5855K55925j31912J1898M04559O90629k91608J22119
15246A077465R8005m63106A40666J75477B0954d7301C6126a33259B01798d52868
15235C37155d9160o3545A01457Q3327E6728J86725D7710K18172b44498a9530A1383
$$ y = [-250633, 69673, 21642, -159279, 249990, 278895, 246229, 59150, -253550, 350097, 57837, -5581, -116914, 316996, 241464, 49887, -201524, 108397, 107994, 192121, 153625, 54265, -5744, 292665, 163484, 249244, 139025, 20617, -64048, 169739, -248087, -209435, -3703, 18341, 86575, -48060, -119286, -266063, -415847, -68591, 339973, -268727, -109086, 253945, -60018, 466410, -27664, 86787, 34300, 167125, 203618, -369150, 89485, -133662, -167387, 222448, -2794, 130882, 269654, -83283, -145218, 15855, 271780, 139868, 151766, 556325, 1246954, 955346, 1077465, 1175470, 712364, 140666, 316143, 20954, -47301, 36126, -133259, 201798, -452868, 337155, -49160, -112705, 101457, 184784, 56728, 243453, 47710, 265882, -244498, -19530, 11383]
15223A79675l1062o1561P441P1633a34629A32575a0788A75979b7053E3415L9556
15212I2971L7069J16310N1779h3252k3693l8200C28518b64442J14416j27282R5318
15201a81990J477A5413R911b82114A86192J6160A00716N2171a13630A84449p4724
15190A09725I20K83945q264n5107E0048J34465L3476a23892K4052c1617E6409
15178d8153B31471a39179H4144b21400C75446f5394F6803L91877f2881k18966
15168b81847R5217B03491g1322E544a68819A37376J11183D1912K82989E1893P3985
15157A25878j5425b9079F519J16782D5434J37362E4574A465J30353n0310a25704
15145B55126B4188R5562e8596A26407K5063J34995B0949M06991b44971F7579Q2300
$$ y = [179675, 148613, 87052, 94493, 166126, -134629, 132575, -10788, 175979, -27053, 53415, 92971, 130040, 246350, 298129, -83252, -106945, -145145, 328518, -264442, -150026, -277308, -181990, -180513, 15413, 25324, -282114, 186192, 202352, 100716, 152887, -113630, 184449, 109725, 920, 284865, 276601, 221494, 50048, 184513, 217989, -123892, -99840, -31617, 56409, -48153, 231471, -139179, 84144, -221400, 375446, -65394, 66803, 458680, -62881, -281847, -186630, 203491, -71322, 5544, -168819, 137376, 248559, 41912, 324901, 51893, 125878, 110453, -29079, 6519, 123301, 45434, 182796, 54574, 1465, 131818, 81508, -125704, 255126, 24188, 119750, -58596, 126407, 151470, 286465, 20949, 427940, -244971, 67579, 149879]
15134A49879n1880M81b46422a00314D6304A5159L36643A73113f9504B7321K11308
15123B38629a31344B5257a59262j72967C22457j22365k73b54080g0659I0352a57820
15111C2332K20115F7026M7135g0805A34366J1526P1015j2890G0278i4239j96900
15100b91139A49172d5290A27524J9040J2891E7320Q5381n2919M4035l2173K80737
15089C82381j26398j13175l2976a64224A97181f8467C29649j34168K13696l8205
15079C70972a99681B93978c4434j13547C02429r4342k423R2324j18554m854J9594
15068A94174B9582a27271A77420i1538B01780Q241G7234b5342m4088A38925K39499
15057C78424j72863o1572b19247A98014P148E2241J62821l5110M476J20316J2523
$$ y = [149879, 97999, 98480, -246422, -100314, 46304, 15159, 351802, 173113, -69504, 27321, 238629, -131344, 25257, -159262, -332229, 322457, 200092, 199819, -254080, -70659, 90352, -157820, 32332, 252447, 67026, 114161, -70805, 134366, 145892, 216907, 204017, 70278, -94239, -291139, 149172, -45290, 127524, 146564, 159455, 57320, 142701, 89782, 133817, 101644, 382381, 255983, 142808, 109832, -164224, 197181, -68467, 329649, 195481, 409177, 370972, -199681, 293978, -34434, -147981, 302429, 208087, 205664, 297988, 179434, 174580, 194174, 29582, -127271, 177420, -91538, 201780, 210021, 77234, -25342, -69430, 138925, 378424, 205561, 143989, -219247, 198014, 205162, 52241, 215062, 179952, 184428, 304744, 317267]
15046C17267g7470C9400J5928Q6765J97840E5898L52032g3839j30988C17693J95415
15035E13108B17798Q587I6986D2675a36852I003c6630A80777K10021L4752A46386
15023G7511c0173O692A61529C9764b3584l57629I1761d5360m2527A56591o2115
15012I4476K05384A31248E9036M71202j54478r4326k6718e7574D3891J8462b19672
15000B17072P2824a0200D52942D6662K04229L8705A7600J07456a19326H4431a37363
14988a46051D63268A67547M8291F9331L91495a0820A18873K28694j41733I4861
14977C11366j1153p8545O6415j24183p9765J75596J46710j40243J31013B7643
14966E13543a3049A90106L4228N2950j14364L9827O0018b0005D03851G3800L90582
$$ y = [317267, -77470, 39400, 55328, 142093, 339933, 55898, 407930, -73839, -204827, 317693, 513108, 217798, 226385, 96986, 42675, -136852, 9003, -36630, 180777, 390798, 425550, 146386, 77511, -30173, -23481, 161529, 39764, -23584, -381213, 91761, -45360, -87887, 156591, 94476, 299860, 131248, 59036, 530238, 375760, 281434, 254716, -57574, 43891, 62353, -219672, 217072, 289896, -10200, 452942, 46662, 250891, 289596, 17600, 125056, -119326, 84431, -137363, -146051, 463268, 167547, 215838, 69331, 460826, -10820, 118873, 347567, 205834, 94861, 311366, 300213, 221668, 288083, 163900, 84135, 259731, 406441, 266198, 397211, 27643, 513543, -13049, 190106, 224334, 277284, 162920, 202747, 262765, -20005, 403851, 73800, 464382]
14955D64382B11051L55540G6714A9768K77565G1661c5123H4325L29200A87264
14944A70018L14904k29135K87567A30038J24643L7477j2843C8785J46560d995
14933A62794L40448A16305K83896n2700Q2621A06502P0164K71831l1247K341n4517
14922C65074K1649j66209J33813j8472n281j3018N106K98391A68155k3861l2820
14911A11474K24642r7487n3988n532H6475L80408j87600j0053R594q0602G5359
14899A63556K0636J2143n3888M92129E6270K90319J33928A66647j1376K06235
14889C61506Q5129j86270k0240k9628J032J00006L17551j58014H8155K97697r1853
14878B93999n444L36220j32942j83581M7655B0365J63003Q4417k7916O5290j24087
$$ y = [464382, 211051, 566591, 76714, 19768, 297333, 71661, -35123, 84325, 413525, 187264, 170018, 484922, 255787, 543354, 130038, 254681, 292158, 279315, 38785, 185345, -4995, 162794, 503242, 116305, 400201, 347501, 430122, 106502, 176666, 448497, 417250, 419591, 365074, 386723, 220514, 354327, 335855, 330574, 317556, 322662, 621053, 168155, 144294, 111474, 336116, 238629, 184641, 179109, 86475, 466883, 279283, 269230, 278824, 198222, 75359, 163556, 184192, 196335, 142447, 634576, 56270, 346589, 480517, 166647, 155271, 361506, 446635, 260365, 240125, 210497, 211529, 311535, 629086, 471072, 88155, 385852, 293999, 288555, 624775, 491833, 308252, 355907, 20365, 183368, 267785, 239869, 305159, 181072]
14867A81072Q7704M8988L622K59626k40420j2473p4721P8803J17921L18188B62944
14855B36488J03436j15548J06545L62555A74661K44832j31695M596L07580A00516
14844B72497N8537N8471l6320M38838A41975J41467J68556J88543A4661M39752
14834D54413J31204k09663J03188A48542N21684B40319G0997J90046J8900J05376
14824C85319j20704M4536J08405A57256L6324K66439l8204j12399o1850K97997
14814E45563A69214K66198j85702L2180q7835L71713l5299N5713A72421M79584
14804F52005k71034L38786C31765O9778o4181J3094m7037Q6479K29281n2122J7141
14793E84198K6281a10375D03811L21242B88453o5168L67878J91179O9098C85284
$$ y = [181072, 268776, 317764, 321386, 581012, 340592, 328119, 253398, 332201, 450122, 768310, 262944, 236488, 339924, 224376, 330921, 693476, 174661, 419493, 287798, 292394, 599974, 100516, 272497, 331034, 389505, 353185, 792023, 141975, 283442, 451998, 640541, 14661, 454413, 585617, 375954, 479142, 148542, 670226, 240319, 70997, 261043, 279943, 385319, 264615, 309151, 417556, 157256, 193580, 460019, 421815, 309416, 247566, 545563, 169214, 435412, 249710, 281890, 194055, 565768, 530469, 586182, 172421, 652005, 380971, 719757, 331765, 401543, 337362, 350456, 303419, 389898, 619179, 567057, 584198, 610479, -110375, 403811, 725053, 288453, 223285, 591163, 782342, 851440, 385284]
14782B88432R8410b2224F23512J8695q458k67004K14171A57596J92591L49622
14772F99809J00482k07126j4941q6829J95207j76974J17898K52886m36723K41617
14762F85306k68274K2687L00535k01246k8171J52585O3803j87371J41582k16354
14752D65082L0827j9936M49973k28803j94800p908J46163L391q3543M5387j02878
14741E02955J91738j6130j46314J71222p3329o3224L26517j99453m3822k00438
14731D49722J02876q5401K65889A23826P68831k50515P3321B90141O48465j9640
14721I18966m38772M53276l36095L05420k78000K26352l7589Q717K01027k17030
14711H06272K8545k00412o2546K59088j13571l09757P8374M03690l07539J68623
$$ y = [288432, 386842, -22224, 623512, 642207, 633749, 366745, 580916, 157596, 350187, 699809, 800291, 593165, 578224, 491395, 686602, 509628, 627526, 880412, 443689, 685306, 417032, 439719, 740254, 539008, 510837, 663422, 727225, 539854, 681436, 465082, 495909, 475973, 925946, 697143, 502343, 494435, 640598, 643989, 560446, 605833, 502955, 694693, 678563, 532249, 703471, 630142, 566918, 893435, 693982, 650160, 449722, 552598, 467197, 733086, 123826, 892657, 642142, 715463, 290141, 938606, 918966, 480194, 933470, 597375, 902795, 624795, 851147, 813558, 822275, 1023302, 806272, 834817, 634405, 571859, 830947, 717376, 407619, 485993, 889683, 582144, 750767]
14701G50767K42326j68524p9778K65449m20692J73025J26145k24805L82411k24784
14691H21540k66313Q7572M96218n57993M68686k98380L28195K1838j86439O8760
14681I83684p3300P9177o2237K4249K08720k38243j09707K2684J0369K52885j05935
14670I92346j69126K57512q5773q1403j86237M61578M1126m15643L22917k6790
14660A110507J7960j65045K77411j54642j72816N4060J20383J26026J8375l56575
14650H75644M22858j55763J11641o8393K3914l52656J76869K81385k66335N5063
14640A104227J11971J06746k9858j14011m4557K22462j07854J50994l36730J89698
14630A253088l93706K07715L69364j65549k36110k13182K14208K27132P6511j04843
$$ y = [750767, 993093, 824569, 744791, 1010240, 589548, 762573, 888718, 663913, 1046324, 821540, 555227, 642799, 1139017, 581024, 1049710, 751330, 1079525, 1101363, 914924, 983684, 910384, 989561, 927324, 951573, 1160293, 922050, 812343, 835027, 845396, 1098281, 992346, 823220, 1080732, 994959, 913556, 727319, 1188897, 1230023, 814380, 1137297, 1110507, 1128467, 963422, 1240833, 1086191, 913375, 967435, 1087818, 1213844, 1232219, 875644, 1298502, 1142739, 1254380, 1185987, 1209901, 857245, 1034114, 1315499, 1049164, 1104227, 1216198, 1322944, 1293086, 1179075, 1134518, 1356980, 1249126, 1400120, 1063390, 1253088, 859382, 1067097, 1436461, 1270912, 1034802, 821620, 1035828, 1262960, 1339471, 1234628]
14620A234628o360K37960O6102o51792K75776L57868J28682k18086K93091k33288
14610A484581k48191J4301J68757K73876J36379l39319J38526j04964k97779O23793
14600A849960j74803k99634J39374p7394L5251l5247M58430l44193P4510J39206
14590A765460l17001J09884q2129J75992L22437l98077P423O6902N71375n3923
14580B168343l04733k81008L87520J2790R6836q825k6659J11256p4475j91915
14570A889130j00093n94K89869L11258r5631L13856j67083K3413J74856k44051
14560B394930K89515k75385K0779L79982n019J13730N74191Q0911K30004P60538
14550D564176R39740J846591N888874J1087397J6155091Q27984k0544341I454089
$$ y = [1234628, 1228268, 1466228, 1532330, 880538, 1156314, 1514182, 1642864, 1424778, 1717869, 1484581, 1236390, 1250691, 1419448, 1693324, 1829703, 1490384, 1628910, 1523946, 1226167, 1849960, 1675157, 1375523, 1514897, 1437503, 1472754, 1437507, 1895937, 1551744, 1626254, 1765460, 1448459, 1558343, 1476214, 1652206, 1974643, 1576566, 1583989, 1650891, 2222266, 2168343, 1863610, 1582602, 1970122, 1982912, 2079748, 2070923, 2044264, 2155520, 2081045, 1889130, 1789037, 1788443, 2078312, 2389570, 2293939, 2607795, 2440712, 2464125, 2638981, 2394930, 2684445, 2409060, 2429839, 2809821, 2804802, 2918532, 3492723, 3573634, 3803638, 4564176, 5503916, 7350507, 13239381, 24326778, 40481869, 41309853, 20765512, 9454089]
14541D923829k011459p19810r2415l53177m1985n0912J94814K13768R963j41586
14531A931030j37497M38382J27400o9695k09697K12554j30582m8353Q5642M81334
14521B680518j25160m8132J93779l50794j21281K24372K05351o9703o4943J26576
14511B650583j99496J63220K94589k64847K46821O3725l25788M00231m85109L75346
14501B919275L09253j53929J98009j96234J81461j36676j73272K35347K53366
14492C436600k04436K93320l48615M84211j08146k20182J46321K8153K6714K13787
14482C747727K28939o20061N80007r1302j95181J49036J86570j04680Q2509J076
14472C964640M3717Q7438K22230J7628j45282L6816N4111J10524J32303o4102
$$ y = [4923829, 2912370, 2192560, 2100145, 1746968, 1704983, 1654071, 1848885, 2062653, 2072616, 1931030, 1793533, 2231915, 2359315, 2289620, 2079923, 2292477, 2161895, 2113542, 2199184, 2680518, 2555358, 2507226, 2701005, 2350211, 2228930, 2453302, 2658653, 2588950, 2524007, 2650583, 2451087, 2614307, 2908896, 2644049, 2890870, 2954595, 2628807, 3029038, 2543929, 2919275, 3228528, 3074599, 3272608, 3076374, 3257835, 3121159, 2947887, 3183234, 3436600, 3232164, 3525484, 3176869, 3661080, 3552934, 3332752, 3479073, 3507226, 3533940, 3747727, 3976666, 3356605, 3936612, 3845310, 3650129, 3799165, 3985735, 3881055, 3963564, 3964640, 4008357, 4095795, 4318025, 4335653, 4190371, 4227187, 4281298, 4391822, 4524125, 4460023]
14462D460023J31017n1373J18392O42757n28015K08425j73535P9838P4337Q4456
14452E046322m4492J66286j08378M93697m20257j13117Q04773k90342J33260j52213
14442E515539K42485j3682P0689K91638j66136m5270L25522M0571J20334J51022
14432F532712j34242K89857j34300J94818J11090j81485L87719l611R1204J77930
14422G331692j03039L42679K51145M08286n27765L81707J16741n5312K07000K16019
14412H569153J24267r2224L89673J34642o0923M55845k52638P33437l84465R3345
14402I710112M26247l6477K29073J33659J66676m7102N29917K91544J32083k56282
14392A1279450L63918M96245k24677N40471L29275J9863L67699k3644O37985o5672
$$ y = [4460023, 4591040, 4539667, 4658059, 5300816, 4772801, 4981226, 4807691, 4887529, 4961866, 5046322, 5001830, 5168116, 5059738, 5553435, 5133178, 5020061, 5824834, 5534492, 5667752, 5515539, 5758024, 5744342, 5815031, 6106669, 5940533, 5895263, 6220785, 6261356, 6381690, 6532712, 6398470, 6688327, 6554027, 6748845, 6859935, 6678450, 7066169, 7062558, 7153762, 7331692, 7228653, 7571332, 7822477, 8230763, 7702998, 8084705, 8201446, 8146134, 8353134, 8569153, 8693420, 8601196, 8990869, 9125511, 9064588, 9520433, 9267795, 10001232, 9616767, 9710112, 10136359, 10099882, 10328955, 10462614, 10629290, 10582188, 11112105, 11403649, 11535732, 11279450, 11643368, 12139613, 11914936, 12455407, 12784682, 12804545, 13172244, 13148600, 13786585, 13720913]
14382A3720913M89390m0399j41884P43629L7809N73913J13533O7952K92615O81968
14372A6539439J79868K15093M29432j4380O06501L86828M15900M56928K52701
14363A9468310M62439K66958R51157J04731O73121M35787P50185K95175L16274
14354B3724137Q62919L37747P03044N73975M74816Q22643L94075Q26192R61537
14345B9681085Q42194M35715Q71590J078751Q49898J147565J101989P97519Q95683
14336C7701989Q92822J315615J318682R70926J355328J188818J451779J849813
14328D8045772J138607J911088J596176J835701J727511J594490K442901J878388
14320F2170634K226189K284217K843373K693506K388671L193136K838323L097217
$$ y = [13720913, 14210303, 14169904, 14028020, 14771649, 14809458, 15383371, 15496904, 15564856, 15857471, 16539439, 16719307, 16934400, 17363832, 17349452, 17955953, 18342781, 18758681, 19215609, 19468310, 19930749, 20197707, 21148864, 21253595, 21926716, 22362503, 23112688, 23407863, 23724137, 24587056, 24924803, 25627847, 26201822, 26676638, 27499281, 27893356, 28719548, 29681085, 30523279, 30958994, 31830584, 32909335, 33759233, 34906798, 36008787, 36806306, 37701989, 38594811, 39910426, 41229108, 42200034, 43555362, 44744180, 46195959, 48045772, 49184379, 51095467, 52691643, 54527344, 56254855, 57849345, 60292246, 62170634, 64396823, 66681040, 69524413, 72217919, 74606590, 77799726, 80638049, 83735266]
14312H3735266L880272L392755L613395M105585M377840M413607M745259N089014
14304A17352993N355670O058300N547292O756975O916815P061619P412711Q410571
14296A70872946Q363595R436254R488257J0547221J0991673J1069335J2104022
14289B42873303J2902941J2974334J3396008J4629170J4821053J5263154J5628595
14282C42488558J5543753J5350157J5447219J4957837J4293640J3196231J2333090
14275D43610485J0155645Q832058N181574K5095l390376k654570k132368m571607
14267D55055936l133151m926435p734125j0809142j2654461j4422618j5495867
14260C85880137j5967738j6294011j6148098j6217382j5032607j4561911j4336261
$$ y = [83735266, 87615538, 91008293, 94621688, 98727273, 103105113, 107518720, 112263979, 117352993, 122708663, 128766963, 134314255, 141071230, 147988045, 155049664, 162462375, 170872946, 179236541, 188672795, 198161052, 208708273, 219699946, 230769281, 242873303, 255776244, 268750578, 282146586, 296775756, 311596809, 326859963, 342488558, 358032311, 373382468, 388829687, 403787524, 418081164, 431277395, 443610485, 453766130, 462598188, 467779762, 467804857, 464414481, 461759911, 459627543, 455055936, 451922785, 446996350, 439262225, 428453083, 415798622, 401376004, 385880137, 369912399, 353618388, 337470290, 321252908, 306220301, 291658390, 277322129]
14253B77322129j3749950j3565420j2595124j1705452j1577735j0588017j0232305
14246A93308126r411765r396713p818814p960695p477760p231525o479014o321162
14238A31210678n298659n693212n112495n131094m784001m162750l904283l557353
14230I3566831l926045l771239l226850l205031l190002k532045k966151k247388
14222F8502080k606217j871187k218460j964073k019123k220745j648967j485477
14214E2467831j425637j481806j559663j721076j030717j660186q34024r47001
14206D1807721r09597j728301j325480p75799o35343j347830m27769q25448j341385
14197C2490769j055591j025143m05951k96188j039604o26628p05480o38400o05163
$$ y = [277322129, 263572179, 250006759, 237411635, 225706183, 214128448, 203540431, 193308126, 183896361, 174499648, 166680834, 158720139, 151242379, 144010854, 137531840, 131210678, 125912019, 120218807, 115106312, 109975218, 105191217, 101028467, 97124184, 93566831, 89640786, 85869547, 82642697, 79437666, 76247664, 73715619, 70749468, 68502080, 65895863, 64024676, 61806216, 59842143, 57823020, 55602275, 53953308, 52467831, 51042194, 49560388, 48000725, 46279649, 45248932, 43588746, 42754722, 41807721, 40898124, 39169823, 37844343, 37068544, 36433201, 35085371, 34657602, 33832154, 32490769, 31435178, 30410035, 30004084, 29707896, 28668292, 28041664, 27336184, 26697784, 26092621]
14188B6092621r09714q04510l16146l59050l11131r11684M6755r34085k76993
14179B1316063n16541m78700l12577p13591j97484n48850k83544k39096m12164
14170A7613516m69693j62065m15605j87682k44630o11317l11711J03748l77017
14161A4937544o26317r44k58732m11500q9952j00123n64643o1051j83733n7027
14151A2583522k52029l39349m46498L3689k5807k62305o6477k50014l52079L14240
14141A0936893n41143j09137m36388J72915k21971j27589j01267m40458N87246
14132I719101m17858m95586m6681k08638J96606l71482n3588M8438j27250j15580
14122H127482r0379l48082L78579l18357k78238j61540R7999J82076n55943j3016
$$ y = [26092621, 25182907, 24378397, 24062251, 23703201, 23392070, 22480386, 22527141, 21593056, 21316063, 20799522, 20320822, 20008245, 19294654, 19097170, 18548320, 18264776, 18025680, 17613516, 17143823, 16981758, 16566153, 16378471, 16133841, 15522524, 15210813, 15314561, 14937544, 14311227, 14310283, 14051551, 13640051, 13550099, 13449976, 12885333, 12824282, 12640549, 12583522, 12331493, 11992144, 11545646, 11579335, 11553528, 11291223, 11224746, 10974732, 10622653, 10936893, 10395750, 10286613, 9850225, 10023140, 9801169, 9673580, 9572313, 9131855, 9719101, 9301243, 8805657, 8758976, 8550338, 8746944, 8375462, 8321874, 8370312, 8243062, 8127482, 8037103, 7689021, 8067600, 7749243, 7471005, 7309465, 7407464, 7589540, 7033597, 7020581]
14112G020581K89504k60994N472m82404M780j99878M26187k38843j66708j57025
14102F240672q1794M0112n7630k03542k78729L85078k3606m61623r8222j45824
14092E314892K98915j90535l12956L02443J13691l52423N3280o6291q1202k9183
14082E050631k78457J80916l64322J40793j28192K33252k8798k93060K0178r3935
14072D439006j15215J85329k48077j36024j35353j77897J60530K45492k49535
14063C968256q8674L32901l16581J03736m6483J08164k00363K71702k50886j93878
14053C687894M7859j10501Q6808K10826j78207k93995j37438J13525j2112p2967
14043C341692n5203K72865k93554J32645k68215N2458k02482L8919J37197J02166
$$ y = [7020581, 7310085, 7049091, 7054563, 6572159, 6576939, 6377061, 6803248, 6564405, 6397697, 6240672, 6158878, 6198990, 6141360, 5937818, 5659089, 6044167, 6020561, 5558938, 5460716, 5314892, 5613807, 5423272, 5110316, 5412759, 5526450, 5174027, 5227307, 5161016, 5079814, 5050631, 4772174, 4953090, 4588768, 4729561, 4601369, 4834621, 4805823, 4512763, 4532941, 4439006, 4323791, 4509120, 4261043, 4125019, 3989666, 3811769, 3972299, 4217791, 3968256, 3879582, 4212483, 3895902, 3999638, 3953155, 4061319, 3860956, 4132658, 3881772, 3687894, 3735753, 3625252, 3712060, 3922886, 3744679, 3450684, 3313246, 3426771, 3414659, 3341692, 3286489, 3559354, 3265800, 3398445, 3130230, 3182688, 2980206, 3019125, 3156322, 3258488]
14033C258488l08115N57294m30305j91938J08509J02348k89215N1548j36737J37528
14023B859405J39677m40369o9391K14500N8505j5914k32273m4463J77276J39918
14013B786871k09556l1015k0258j49629M55801n89684L86316m35108K40181l43666
14003B090253L18855k93098j20986M00576J00768k33427k41315j42289K37522
13994B116859n1566j801K03577m10175P56299P53164L935842R450495J7391244
13985C4143938P409826j6083279j0995489n850598k341204j527436j010768j99537
13977C545453n22172J21348k21281J98402l34095l13192J03068K84069n486o86561
13967B169553Q0080P0001j75478J02340P5560Q657j32147k33135K83273k71996
$$ y = [3258488, 2950373, 3507667, 3077362, 2885424, 2993933, 3096281, 2807066, 2858614, 2721877, 2859405, 2999082, 2558713, 2489322, 2703822, 2762327, 2746413, 2514140, 2469677, 2646953, 2786871, 2577315, 2546300, 2526042, 2376413, 2832214, 2242530, 2628846, 2193738, 2433919, 2090253, 2409108, 2116010, 1995024, 2395600, 2496368, 2262941, 2021626, 1879337, 2116859, 2065293, 2063492, 2267069, 1856894, 2613193, 3366357, 7302199, 16752694, 34143938, 41553764, 25470485, 14474996, 8624398, 6283194, 4755758, 3744990, 3545453, 3023281, 3144629, 2923348, 3121750, 2787655, 2474463, 2577531, 2861600, 2856114, 2169553, 2249633, 2319634, 2144156, 2246496, 2322056, 2330713, 2198566, 1965431, 2248704, 1976708]
13957A976708J0765k73024L29267l52589J16782O4611J45682K79750k61416Q4400
13947B120936j79357J37315L4374j64604k93164L8680K42180k45704K3140K4022
13937A737818L25042n40677L33287J16095j0717l22665k66840K43128J45030R2065
13927A851566n6371j71097o2052N8648l44521K50323R5898J51090j89025J31693
13917A716152l1805m1112j64930R5106N7458j07057m18457N41025l21685K49089
13907A573784k21243L73731q9342j72875K10199j54683l17467M05849m96171L5041
13897A146823L66043K63928n05247J59375J6789Q0398r4337o347j94895q6161
13887A146369J04636K29407k88120K46120J4349l84577L58396M5907m31196k10472
$$ y = [1976708, 1987473, 1714449, 2043716, 1691127, 1807909, 1872520, 2018202, 2297952, 2036536, 2120936, 1941579, 2078894, 2113268, 1948664, 1655500, 1694180, 1936360, 1690656, 1713796, 1737818, 2062860, 1522183, 1855470, 1971565, 1960848, 1638183, 1371343, 1614471, 1759501, 1851566, 1795195, 1624098, 1562046, 1620694, 1276173, 1526496, 1622394, 1773484, 1584459, 1716152, 1684347, 1643235, 1478305, 1573411, 1630869, 1523812, 1105355, 1646380, 1324695, 1573784, 1352541, 1726272, 1636930, 1464055, 1674254, 1519571, 1202104, 1607953, 1111782, 1146823, 1512866, 1776794, 1271547, 1430922, 1447711, 1528109, 1433772, 1427425, 1232530, 1146369, 1251005, 1480412, 1192292, 1438412, 1452761, 1068184, 1426580, 1472487, 1041291, 830819]
13877H30819L30288j75321L2421K54925l38146j6507N01939k68812j97860J16646
13867A070392K37740R8461l66730J50408j0123l34519N09675k61694J96632l26778
13857I63464K26035k48272j13442l5723J15041L31049m5909k74417J25161J60868
13847A203855j99600j40843J6280n7850J34479M23107l61827r0469K83754K18782
13837A429668o66159L71737K2085m83160K93022L7246J39198q1192P5829J08792
13827A247066j98742j35991O2052j56347j00636j75094K87288L57504k26513J93402
13817A153989m2635k18826k88435J94962k09325N63071k88152q5879J94677D24682
13806F80020O00440n72090L36914N593l87983M16724l58665o6848K69973m39509
$$ y = [830819, 1161107, 985786, 1018207, 1273132, 934986, 918479, 1420418, 1151606, 953746, 1070392, 1308132, 1406593, 1039863, 1190271, 1180148, 845629, 1355304, 1093610, 1290242, 963464, 1189499, 941227, 827785, 792062, 907103, 1238152, 1192243, 917826, 1042987, 1203855, 1004255, 863412, 879692, 821842, 956321, 1379428, 1017601, 927132, 1210886, 1429668, 763509, 1135246, 1157331, 674171, 967193, 1004439, 1143637, 1062445, 1138274, 1247066, 1048324, 912333, 974385, 818038, 717402, 542308, 829596, 1187100, 960587, 1153989, 1111354, 892528, 604093, 799055, 589730, 1152801, 864649, 778770, 973447, 424682, 680020, 1280460, 708370, 1045284, 1050877, 662894, 1079618, 720953, 654105, 924078, 484569]
13796D84569K60978l1712K76014m07656J42643J26436M246J70284D93430O89830
13786A183260l00268j87344j49891J27248j36962L51539m4395K798j59622L31454
13776A017817l97091L8893K15214l7204O1361l93738M02012l51147K09498p7127
13766F88488j58814R2386J13322j48902L86520j51978N584k16126j8741K60067
13756H51806C79971L80752r1821k94489L24833m7909J13468j47137J10468j33214
13746E94922k04898j15622N10568j34714j59994O6485J84187l2910j65897j52284
13736C89843K42174R3579k06994J17998j18214j28208J91693L24444m35737Q1488
13726E52066L44724l23876J00696j35416K40032l34795j15286N49926j74739j3212
$$ y = [484569, 745547, 713835, 989849, 582193, 724836, 851272, 855518, 1025802, 493430, 1183260, 882992, 695648, 545757, 673005, 536043, 887582, 843187, 845985, 686363, 1017817, 620726, 659619, 874833, 837629, 898990, 505252, 907264, 556117, 765615, 688488, 529674, 622060, 735382, 586480, 973000, 821022, 826606, 610480, 591739, 851806, 379971, 760723, 668902, 374413, 699246, 651337, 764805, 617668, 728136, 594922, 390024, 274402, 784970, 650256, 490262, 556747, 740934, 708024, 542127, 389843, 632017, 725596, 518602, 636600, 518386, 390178, 581871, 906315, 470578, 552066, 896790, 572914, 673610, 538194, 778226, 443431, 328145, 878071, 703332, 690120]
13716F90120Q7781r058k35753K63895q6030j99231J95245K9827l07488R7930J93229
13705G20467K4840q7660k21054k4857K59253r4637K0327M2790m4297q1667q9875
13694D23630L64155l58566M70057C49189J7208K86609O850m0420K8913j91012
13684D57337J68367k18865j64265N72457k52595L20612B51006L55589k05178r7817
13674C03600M25829k72893J57331o5381j67439j28463J07601o3059J71277j32967
13664C35436J0873L7962J13415j92160J18287j36096Q397K60132j64546K20558
13654F12258a46795B88599L57178J44951k81846B32228L3607N389j25268K54264
13644D00220L15134k25434m0872L8299o4223K0833R6308j66029j30165M72033
$$ y = [690120, 777901, 768843, 533090, 796985, 710955, 511724, 706969, 736796, 429308, 527238, 720467, 745307, 657647, 436593, 411736, 670989, 576352, 596679, 639469, 595172, 513505, 423630, 787785, 429219, 899276, 349189, 366397, 653006, 659856, 619436, 648349, 457337, 625704, 406839, 242574, 815031, 562436, 883048, 251006, 606595, 401417, 303600, 729429, 456536, 613867, 548486, 381047, 252584, 360185, 297126, 468403, 335436, 346309, 384271, 497686, 305526, 423813, 287717, 296114, 556246, 391700, 612258, -146795, 288599, 645777, 790728, 508882, 232228, 265835, 271224, 145956, 400220, 715354, 489920, 449048, 487347, 423124, 443957, 540265, 374236, 244071, 716104]
13634G16104B58416K5329R587F9900J77417j06966K91396A65422M49186A92121
13623D83030J14338A062O64458C04580J13332J68291m0618k02428l3872K55009
13613E64294k8308J77630B82703K17548J09178k60979j3423R0666K54539l17952
13603C62280o8257K12047N8871B43703J39668J31552J77412A25219M23347J727
13593E50293A81766J90271K90821B64598K11361k9223J06784r1877j11543O3727
13583D13827j74269j8782F1612N05089k32970M9930J3396j62168K7200l5711L83140
13572F09518b246C19861K85415B24621L1953M30179A18417K37142K8763A82744
13561A86570L33755A82028J55298m2264K2710Q1167K73966k6613D6177L89180
$$ y = [716104, 258416, 283745, 293332, 69900, 247317, 140351, 431747, 165422, 614608, 192121, 483030, 597368, 1062, 665520, 304580, 417912, 586203, 545585, 343157, 309285, 564294, 535986, 713616, 282703, 500251, 609429, 348450, 335027, 425693, 680232, 362280, 294023, 506070, 564941, 243703, 383371, 514923, 692335, 125219, 548566, 550293, 181766, 372037, 662858, 264598, 475959, 446736, 553520, 461643, 350100, 413827, 239558, 220776, 61612, 566701, 333731, 383661, 397057, 234889, 262089, 226378, 609518, -2246, 319861, 605276, 224621, 256574, 686753, 118417, 355559, 384322, 182744, 186570, 520325, 182028, 337326, 295062, 317772, 398939, 672905, 646292, 46177, 435357]
13551D35357H3948a0766A25446K55625A47800L54514A49967M05410k44689A07247
13540C61334J45320M2534B65965K4117Q2799n7841M2116n8603L39428k46602j50271
13529B41108A15150M30698g5273G09282A96754L92281j74606J0063q2608K52886
13519E94770q0736B3625L24879K4239J91048j68572E6214K28270L97222j50459
13509E31247j86778F8804K18896J67763A31008K81234j55038j04612K84996B5302
13498D1310L92509H3286K66249A66845D3623K26021K43852d4612B88113C4364
13487D33726k05389r5905a05559B04272K35763A76711M4202C3903M13076a37160
13476D09788A39122J00896K22013j07701J43563B36907K98014B41553K70216A46027
$$ y = [435357, 83948, -10766, 125446, 381071, 147800, 502314, 149967, 555377, 310688, 107247, 361334, 506654, 549188, 265965, 290082, 372881, 315040, 357156, 298553, 637981, 391379, 241108, 115150, 545848, -75273, 709282, 196754, 589035, 414429, 424492, 341884, 594770, 514034, 23625, 348504, 372743, 563791, 395219, 56214, 284484, 681706, 531247, 344469, 68804, 287700, 455463, 131008, 412242, 257204, 152592, 437588, 25302, 41310, 433819, 83286, 349535, 166845, 43623, 269644, 513496, -44612, 288113, 34364, 433726, 228337, 132432, -105559, 204272, 440035, 176711, 220913, 33903, 446979, -137160, 409788, 139122, 240018, 462031, 354330, 497893, 236907, 534921, 241553, 511769, 146027]
13465I203N3840J77678j12474K62740j66574N1203p6685K72681A43701F4304J43838
13454B08142D6974J98182J69246a06837C16264c0074I5949J42175O7910A10107
13443b643A32872L55971j39922l454r0588H5843L71486J2645H2539b1242A4039
13431C00478A49239L97346N7192j86425A95030L42463B12792k7764p8528L21100
13421D27600i7168G3857l0477P1855O5903L888K13786L7753B6870L43180A74084
13409D63649A04823M46464j84575P6137d1319A34318L2216o5834A5140K67557
13399B82697E5673J83583N8125L0845M3593A46247K13838A54621K47188l1928
13389C69881j16495h1636C50854H4519j4724K17484A16994M8397c2023A78946
$$ y = [9203, 63043, 240721, 128247, 390987, 224413, 275616, 198931, 471612, 143701, 64304, 208142, 46974, 245156, 414402, -106837, 316264, -30074, 95949, 238124, 306034, 110107, -2643, 132872, 488843, 348921, 345467, 254879, 85843, 457329, 469974, 82539, -21242, 14039, 300478, 149239, 546585, 603777, 417352, 195030, 537493, 212792, 185028, 106500, 427600, -97168, 73857, 43380, 115235, 181138, 185026, 398812, 436565, 26870, 370050, 174084, 463649, 104823, 551287, 366712, 442849, -41319, 134318, 166534, 100700, 15140, 282697, 55673, 239256, 297381, 328226, 371819, 146247, 360085, 154621, 401809, 369881, 253386, -81636, 350854, 84519, 69795, 287279, 116994, 165391, -32023, 178946]
13378A2695O03842k66894j45366L22853k45697l6846J77534A60765a14398E12168
13367B24694K73056F4177K46411j02944M16046B87640J37359j85800A00854j3526
13357H7328B4406K88152r3757P5644O8297j30405J4953J29556A30374L59163j29826
13346C59711A45227J95765o268K4890H4485J28738J19202o9668L19825A10860
13335E25955D3692L66738A72427R0731j04372d6758A78985J92983A59546m1381
13325A18165K3337Q9068j14104M86619F0784a7887F6886N59753A91604j1653Q0990
13314B60941A03322j5405K91683j86577K8342a90668I5478R77K82278J60940a16673
13302B88196G5929J1209m758J75678j14925J71540j11185q4873c0080p6751C7000
$$ y = [12695, 616537, 349643, 204277, 527130, 281433, 244587, 422121, 160765, -114398, 512168, 224694, 497750, 64177, 310588, 207644, 623690, 287640, 424999, 239199, 100854, 87328, 24406, 312558, 218801, 294445, 362742, 232337, 247290, 376846, 130374, 489537, 359711, 145227, 340992, 334724, 359614, 84485, 213223, 332425, 262757, 582582, 110860, 525955, 43692, 410430, 172427, 263158, 158786, -46758, 178985, 371968, 159546, 118165, 141502, 230570, 116466, 603085, 60784, -17887, 66886, 626639, 191604, 179951, 260941, 103322, 87917, 379600, 193023, 221365, -190668, 95478, 96455, 378733, 539673, -116673, 288196, 75929, 87138, 82380, 258058, 143133, 314673, 203488, 118615, -30080, -106831, 37000]
13290C54148Q7149I7369e0179C08754h6590C604M04468e6069D62683A88640J39284
13279C27924a15165C4910K5987J23100A6095N7477a61820e4201c839C5909K35380
13268B71289h6741E2611Q7990j0969L43460f6644a1838E8229K12685p8810g1120
13256I0853k1869a89771D75535A47114N457J84129J24592A63649B4366K41739
13246B66105j0130j19247L2339h3077A89333K51244A11233d9150A92004B7216
13235E74752c530k04186a6946B52732J49811A35397K00742q1677A02151d6573
13224C6811K77039I7143J55470K5164j32445N0318J75401j37291l7814d55639
13213b05033e2197o5832J2917A18729n654I852J36984b26370Q5698H6873J05081
$$ y = [354148, 441297, 97369, -50179, 308754, -86590, 3604, 408072, -56069, 462683, 188640, 327924, -115165, 34910, 60897, 183997, 16095, 73572, -161820, -54201, -3839, 35909, 271289, -86741, 52611, 140601, 129632, 473092, -66644, -11838, 58229, 270914, 192104, -71120, 90853, 68984, -189771, 475535, 147114, 152571, 336700, 461292, 163649, 24366, 266105, 255975, 136728, 169067, -83077, 189333, 440577, 111233, -49150, 192004, 27216, 574752, -3530, -207716, -16946, 252732, 402543, 135397, 336139, 254462, 102151, -46573, 36811, 313850, 97143, 252613, 277777, 145332, 195650, 371051, 233760, 195946, -455639, -205033, -52197, -118029, -105112, 118729, 113075, 9852, 146836, -226370, -140672, 86873, 191954]
13202A91954a26234C68042b68907H6034j5775J41587B7210J83100I0041a46039
13191B60573I3191J56826N1128o242a14879M3287A84602N229M2406K18469A74480
13179B46326b5581m1693A16441b1546h59C53830D8075k1957J17919N457D9739
13167A09983a485C2043k447L14731a1226r7099B38792q6533O7676a04807b3758
13155b0822B05304h7078A93020K985g010B1734K18187k4352p4603J88422D3327
13143B56566Q7285j68210J01811b6310C08053o4040J35406A37394R3136a36661
13132c6621A82528J69044H5898J52347Q6226j49936B4757c39121A98393J24058
13122C22451A34206K23458b59003E3590k3049c7902C71218a34069B62664B8813
$$ y = [191954, -126234, 368042, -268907, 86034, 70259, 211846, 27210, 210310, 90041, -146039, 260573, 93191, 250017, 301145, 294903, -114879, -71592, 184602, 189831, 232237, 450706, 174480, 246326, -25581, -67274, 116441, -21546, -859, 353830, 48075, 26118, 144037, 149494, 49739, 109983, -1485, 32043, 29596, 344327, -11226, -108325, 238792, 152259, 219935, -104807, -23758, -20822, 205304, -87078, 193020, 196005, -7010, 21734, 239921, 215569, 140966, 329388, 43327, 256566, 343851, 175641, 277452, -26310, 308053, 244013, 379419, 137394, 230530, -136661, -36621, 182528, 351572, 85898, 238245, 324471, 174535, 24757, -339121, 198393, 322451, 134206, 357664, -259003, 53590, 30541, -37902, 371218, -134069, 262664, 28813]
13111A31618L29156E387N2879e7476G1986O5083b3254q5229F551b20821A57317
13099A0625J15039a58136a0345r3810M7022A50538a7150A9145d3436A95998J68549
13088C64547a44975b3696A20712l9121K26346q3080G1616N3552O7863k8315K25108
13077C89824A60474P1625d3640B33051G3457g4268c0914q763o3282j33211C42732
13065i3671A26404m1768R7743K39074E4692K37815b07274f1330j49139A55205
13054A50802a37534F3288K20547Q3774G9144f6783F2603b5896B88554A37742m4543
13043I3199Q10h6998A65177p6047a29881B2255K7563J06214c59896e6801n6041
13032a12842A14665J04018j04305k7519P3856b55788C73402A1428f0068m6605
$$ y = [131618, 460774, 5387, 58266, -57476, 71986, 137069, -23254, -108483, 6551, -220821, 157317, 10625, 125664, -158136, -10345, -104155, -57133, 150538, -17150, 19145, -43436, 195998, 364547, -144975, -23696, 120712, 81591, 307937, 224857, 71616, 125168, 193031, 164716, 389824, 160474, 232099, -43640, 233051, 73457, -74268, -30914, -39677, -102959, -236170, 342732, -93671, 126404, 84636, 182379, 421453, 54692, 292507, -207274, -61330, -210469, 155205, 150802, -137534, 63288, 283835, 367609, 79144, -66783, 62603, -25896, 288554, 137742, 93199, 94009, -86998, 165177, 89130, -129881, 22255, 49818, 156032, -359896, -56801, -112842, 114665, 218683, 114378, 86859, 160715, -255788, 373402, 11428, -60068, -106673]
13022a06673A19815D7511L05631r6143M6964K48133D9590M5128a84021b1482l9670
13011f1152B13163j5278r707p4150N8011J01385B314J90485I854f6497A92226
12999B09992b73751Q8002A91711o532F8350e6450B61495j9606b3328A44710j9254
12988A25456K7119b99176A80036q3175a72207A31840h0355A11747J41755A21428
12977C15862h9889H2545L5144n6017J27615a32991B01059q2963L9872A3638Q0550
12966I4188L68391c9215A42005h4221C20307a86284B9611K28891b31541D1379
12955F0855A0905J777L10517B6305O7012h3171I8707c2465k35864i1184k09518
12944c00702p3492D9669a9248F6880a8784A4238K02331H1635K76363j69272a28996
$$ y = [-106673, 119815, 47511, 353142, 256999, 303963, 552096, 49590, 94718, -184021, -21482, -61152, 213163, 197885, 188178, 114028, 172039, 273424, 2314, 192799, 9854, -66497, 192226, 209992, -273751, -185749, 191711, 185179, 68350, -56450, 261495, 241889, -23328, 144710, 125456, 152575, -299176, 180036, 96861, -172207, 131840, -80355, 111747, 253502, 121428, 315862, -89889, 82545, 117689, 61672, 189287, -132991, 201059, 118096, 157968, 13638, 94188, 462579, -39215, 142005, -84221, 320307, -186284, 29611, 258502, -231541, 41379, 60855, 10905, 12682, 323199, 26305, 93317, -83171, 98707, -32465, -268329, -91184, -300702, -374194, 49669, -19248, 66880, -18784, 14238, 216569, 81635, 357998, 188726, -128996]
12932A64315N5433r0607c8768C798J87458N5034A11439a17703B46030c8402j61603
12921b00005A39092a05537I4739J06080n8914M8387f7305B42140a6333F1608R6921
12910A58529b76783E04286g8076A70050J30268A03972a66861b1346l75170A01267
12899A09628M237B5067b08126B07052A385K37227F884K46562C9348J23660a16099
12887A83960K2806J42394b6732I6597K5802b7529H8327P9907G1876a19780M1680
12876g8100L4797D3117q779R92b59454A5748g9998A55868C1057J21725J19983
12865B72765A11096b96483F6568d9934A97463G8962J41961J93989a9865o7089
12855h6954q6951d4150j51171b8501A26804b23235A16714j898a12937A8537f3568
$$ y = [164315, 219748, 129141, -38768, 3798, 191256, 246290, 111439, -117703, 246030, -38402, -200005, 139092, -105537, 94739, 200819, 141905, 190292, -67305, 242140, -16333, 61608, 158529, -276783, 504286, -78076, 170050, 300318, 103972, -166861, -21346, -396516, 101267, 109628, 113865, 25067, -208126, 207052, 1385, 238612, 6884, 253446, 39348, 163008, -116099, 183960, 206766, 349160, -26732, 96597, 122399, -27529, 88327, 168234, 71876, -119780, -78100, -43303, 43117, 34338, 35330, -259454, 15748, -79998, 155868, 31057, 152782, 272765, 111096, -296483, 66568, -49934, 197463, 78962, 220923, 414912, -19865, -86954, -173905, -44150, -195321, -28501, 126804, -223235, 116714, 114816, -112937, 18537, -63568]
12843B95169n8701I8776m6289i8292A57803O9941A11599Q1833h9330n113E9136
12831A85336b18110O0977A23183d7977A46492m5658d8832G7303l611L9045N0576
12820A63313a49838N5919d0959A71096c575B2504g91q5943A09962M226K15863
12809C30051A38733K1383p6716d622A60600J96654a5349p5436n1630B18699a76463
12797D7841j5268g0165c901F1795K19637F2901K56300j14579C9298L5736k9792
12786D5242J19460J6827F685J9287d3930q9811j12084f6739j34717A96876k3686
12775A73190c7533J7926j54843b3923k6417A03247J99875q3776K33143Q674d8266
12763D8679h7086i00j10390D5706K15212h7139C4093J16341J05385A11619D1194
$$ y = [295169, 236468, 98776, 52487, -98292, 157803, 227744, 111599, 193432, -89330, -94443, 59136, 185336, -218110, -157133, 123183, -47977, 146492, 100834, -48832, 77303, 73692, 112737, 163313, -149838, -93919, -40959, 171096, -3575, 22504, -791, -86734, 109962, 114188, 330051, 138733, 160116, 83400, -4622, 160600, 357254, -15349, -90785, -142415, 218699, -176463, 47841, 32573, -70165, -3901, 61795, 281432, 62901, 319201, 204622, 39298, 75034, 45242, 164702, 181529, 6685, 25972, -43930, -133741, -245825, -66739, -201456, 196876, 173190, -37533, -19607, -174450, -23923, -50340, 103247, 303122, 219346, 452489, 461163, -48266, 48679, -87086, -900, -111290, 45706, 260918, -87139, 34093, 150434, 255819, 111619, 41194]
12751A53150a61933A34361a18004E1212a09870B17409a18068G6793B5179J02295
12741A27474b44011F1849b08193G4561K31316k4504j30554D0540A0730a61487
12730A67778m9525J22305g6845I6569B5824c18324A59759J9835a9347B02637k7113
12719A75524A7952a85591A01767J12573O7705c36354J33793G3005i9440B48346
12708B17579f739A82963G997R511O6282M45110B27041j0349a545B23155b34540
12696b4857A17243M8836f2763A11966c0656j63362c574G5345j2200i4778M6789
12685d7989n196A3529J68309e9560E40253b3345D05196I1989J96491a7022A01979
12673g6969D64976b85327C4096J50415O8245b93417A09733A8308N45016A22641
$$ y = [153150, -161933, 134361, -118004, 51212, -109870, 217409, -118068, 76793, 25179, 127474, -244011, 61849, -208193, 74561, 305877, 281373, 150819, 40540, 10730, -161487, 167778, 118253, 240558, -76845, 96569, 25824, -318324, 159759, 179594, -19347, 202637, 175524, 17952, -185591, 101767, 214340, 282045, -336354, -202561, 73005, -99440, 248346, 217579, -6739, 182963, 7997, 17508, 83790, 528900, 227041, 216692, -1545, 223155, -234540, -24857, 117243, 166079, -62763, 111966, -30656, -194018, -3574, 75345, 63145, -94778, -47989, -53185, 13529, 181838, -59560, 540253, -23345, 405196, 91989, 288480, -17022, 101979, -76969, 464976, -285327, 34096, 184511, 252756, -293417, 109733, 18308, 563324, 122641]
12662A40968J24227a52140B7787J3951O5208a43410C44374A20949J31957M2171
12652B95077A13919M2546m1246N4003n6130D0790c0579j19439A68698L9755a13124
12640A2990N1558B6036N6456I815J80945C5083Q9275j7390R8952M9139m0992r274
12628B04793L1217F5457L43913A74903a0922B34585m4951P0559A16414B2152a17627
12616B87713j29923d2928j83382A67136m6490G445a61027q590A82177c03018D3550
12604b4557F9951J46927a17514j19799E63801k11815F2043L6496e3892K0257A70636
12592A91277r0846d9877B53065b38057A54311G3868h8535m8358j39968A20174
12581A37302a72242k36141D3268R7833a55395d8214a803k368C7659K53684a24498
$$ y = [140968, 265195, -152140, 27787, 41738, 106946, -143410, 344374, 120949, 252906, 295077, 113919, 156465, 115219, 169222, 113092, 40790, -30579, -150018, 168698, 208453, -113124, 12990, 64548, 26036, 82492, 9815, 190760, 35083, 124358, 106968, 205920, 255059, 214067, 204793, 236010, 65457, 409370, 174903, -10922, 234585, 189634, 260193, 116414, 22152, -117627, 287713, 157790, -42928, -226310, 167136, 120646, 7445, -161027, -169617, 182177, -303018, 43550, -24557, 69951, 216878, -117514, -237313, 563801, 351986, 62043, 98539, -53892, -33635, 170636, 191277, 100431, -49877, 253065, -238057, 154311, 73868, -88535, -136893, -276861, 120174, 137302, -172242, -408383, 43268, 141101, -155395, -48214, -1803, -4171, 37659, 291343, -124498]
12569b73783D50589E999M4682b53006B42838j15877l7336O135J3913J20735b20075
12557g2810A11121K7333B4515K57056a65263a9088k6443A12754J77470B2250b0581
12545A31921a39113F3658B1170g5182C73135A41134O7201b6768p5097a4541k9214
12534d3755R141j72759R0213B55311a33211H5847O8175b58902A39213l2987b28510
12522B90015a70303B65730C614J22070g4547j08971i0652k0599M84B98569o1767
12511B36802b92279i0156C36656D5500g3327E457a13788d5204B38617k1639D2884
12499g1898B227J2987b61973G3814K0452k4203L34949D6236J33854a76035j3915
12488a89950A4806b56941I5239Q3785b00193B6710J89126b4483m4981b8361H5158
$$ y = [-273783, 450589, 5999, 50681, -253006, 242838, 126961, 89625, 95760, 109673, 230408, -220075, -72810, 111121, 138454, 24515, 281571, -165263, -19088, -45531, 112754, 290224, 22250, -20581, 131921, -139113, 63658, 21170, -75182, 373135, 141134, 208335, -26768, -101865, -14541, -43755, -34614, -207373, -117160, 255311, -133211, 85847, 154022, -258902, 139213, 106226, -228510, 290015, -170303, 265730, 3614, 125684, -74547, -183518, -90652, -111251, -110767, 298569, 236802, -292279, -90156, 336656, 45500, -73327, 5457, -113788, -45204, 238617, 216978, 42884, -71898, 2227, 15214, -261973, 73814, 94266, 70063, 405012, 46236, 180090, -176035, -189950, 14806, -256941, 95239, 179024, -200193, 26710, 215836, -24483, -69464, -28361, 85158]
12476b85927I5094a82224j27678c5100n6358M3072D7550b69202O721L5738K7373
12465a99370P5009C99578j78895i0660G516O4904k4188b55370A31837B7185P0319
12454I7504J21531a54414A07474K60064C8693K84788B8845d9454E3606a20091
12443a13393D3378N3961J06497j9573c12785g0371B52751c39883a23305N8903
12433f4402o0546B50997K56907i2825j53750c2466A9503P5307d6741a0146A09528
12421F4681b61662A1379L6840a39466B41405c9262o3160n4064l6466C402O1986
12410F5388a68591A15799N5064h376l1389l22948E8016m408k3089j104a52247
12398A32129J01333Q577a84172e366k4720l08896G2374a64921f6535k41064a4097
$$ y = [-285927, 95094, -182224, -309902, -35100, -91458, -48386, 47550, -269202, -262481, -226743, -199370, -124361, 399578, 220683, -90660, 7516, 72420, 48232, -255370, 131837, 27185, 97504, 219035, -154414, 107474, 367538, 38693, 323481, 28845, -49454, 53606, -120091, -113393, 43378, 97339, 203836, 184263, -312785, -70371, 252751, -339883, -123305, -64402, -124948, 250997, 507904, -92825, -246575, -32466, 19503, 94810, -46741, -10146, 109528, 64681, -261662, 11379, 48219, -139466, 241405, -39262, -102422, -156486, -192952, 3402, 65388, -168591, 115799, 170863, -8376, -39765, -362713, 58016, 53608, 30519, 29415, -152247, 132129, 233462, 242039, -184172, -5366, -30086, -338982, 72374, -164921, -66535, -307599, -14097]
12386B69325c82586O8268I4593c8545m9088M0329C87607j32710g5246A71059A0872
12374e848m4321E9370a24758k2037A58192E8578B2941Q0727b49195C67102a71387
12362a27011j1224f5163A96291J13311a1416A61891e0423A07727K542J08159n6383
12351A62045a22046j08036B76790I3336K2819c4353l60851A01625K4964a06616
12340b40357J18949B05660j673a62638m9397A21102a80347B0215d3959D81526
12329A13388K18760g4704B81899e2180C5013b33028C2583J74697c7830l0764F4514
12317A72789R6034G9517c3460A56533g0664I2211P9446e0277k63728H6790a60311
12305b53294C91426b51053H1934M3814d3671C3566a14962G0742a6697j07693A51667
$$ y = [269325, -382586, -314318, 94593, -38545, -87633, -47304, 387607, 254897, -75246, 171059, 10872, -5848, -50169, 59370, -124758, -146795, 158192, 58578, 22941, 103668, -249195, 367102, -171387, -127011, -138235, -65163, 196291, 309602, -11416, 161891, -50423, 107727, 110269, 218428, 162045, -122046, -230082, 276790, 93336, 116155, -34353, -395204, 101625, 126589, -106616, -240357, -121408, 205660, 203987, -162638, -212035, 121102, -180347, 20215, -43959, 481526, 113388, 332148, -74704, 281899, -52180, 35013, -233028, 32583, 207280, -37830, -68594, 64514, 172789, 268823, 79517, -33460, 156533, -70664, 92211, 171657, -50277, -314005, 86790, -160311, -253294, 391426, -251053, 81934, 125748, -43671, 33566, -114962, 70742, -16697, -124390, 151667]
12293h7820a6271l2845F7342a8152H9370a6254B27288O649I6781c9883j95665
12282b35548h4717A37884j2488C5289O42380h2555A91920e6129C2766J17861k680
12271A47947m5721D9747M5662a3240B25031c6544A35890e2501G4395J63419e4794
12259f8350G3263R379d294B83926n0699a15521H3824g6437C4093P9828C6012L6586
12247G2598q200J72066i6048D23649A90082P5174j17583P1772f3779j66527g9816
12235E4987J16745K71644a53397C3474R4555Q3035O0746G196h3529C47938A19896
12223C41084j36939l7190J94551l909h4782D989K6569a11130A60556o865J4445
12212A68136a56263L2313A40428J14351P5307a49017D79128f9944C7760J22509
$$ y = [-87820, -16271, -49116, 67342, -18152, 89370, -16254, 227288, 233937, 96781, -39883, -235548, -84717, 137884, 125396, 35289, 677669, -82555, 191920, -56129, 32766, 150627, 147947, 102226, 49747, 95409, -13240, 225031, -36544, 135890, -52501, 74395, 237814, -54794, -68350, 73263, 82642, -4294, 283926, 233227, -115521, 83824, -76437, 34093, 113921, 36012, 72598, 64398, 236464, -96048, 423649, 190082, 265256, 147673, 219445, -63779, -230306, -79816, 54987, 171732, 443376, -153397, 33474, 128029, 211064, 271810, 7196, -83529, 347938, 119896, 341084, 204145, 166955, 361506, 357597, -84782, 4989, 31558, -111130, 160556, 153691, 168136, -156263, -123950, 140428, 254779, 330086, -149017, 479128, -69944, 37760, 160269]
12202A60269a03829A23210K29990a83712B46701j22988P2065q6028K03335d9452
12191A99588N0491L6879j23441q0K7373n1131K05979A51015K3100P1153D7593
12179B01793K4281j11563K14734D5698J86411E5066d6833l4040E89768A16213
12168b3642E4985b0506m191k433C52341D8815K428P0149J47909j01863h7988b1451
12155B45094O9975D530a72192A35291g2123C5423K82098j32814r0051Q1046H7177
12143B9500b16458g3180H0056K37592e5101N968B3137J53368o4711P0105a30080
12131I0202B7397b17975A29432c39151H050K08957f9815p2549K9180E3693f4709
12119A43876l9160b12874B4342J71687E7003a65935E7602i4782G823b17584H418
$$ y = [160269, -103829, 123210, 353200, -183712, 246701, 123713, 195778, 109750, 313085, -49452, 199588, 250079, 286958, 163517, 163437, 190810, 139679, 345658, 151015, 174115, 245268, 47593, 201793, 226074, 114511, 329245, 45698, 232109, 55066, -46833, -80873, 589768, 116213, -23642, 54985, -20506, -24697, -27130, 352341, 48815, 51243, 121392, 269301, 167438, -87988, -21451, 245094, 315069, 4530, -172192, 135291, -72123, 35423, 317521, 184707, 94656, 175702, 87177, 29500, -216458, -73180, 80056, 317648, -55101, -49133, 23137, 176505, 111794, 181899, -130080, 90202, 27397, -217975, 129432, -339151, 8050, 217007, -69815, -142364, -113184, 53693, -64709, 143876, 104716, -212874, 24342, 196029, 57003, -165935, 57602, -94782, 7823, -217584, 8418]
12107A07475N3178b54647B5387L5284O2027a83621J9594f5867j76980F7419M6141
12096A13560J4036M05873A43443Q4841C1556K15608b16737e8428j38471j1279
12086b08178M1951E7653a06481h228k7490G4508b8751l82j77915c2865A20495
12074e8380j4660F52481N66827N48009G29275k64138k09715L72800A27248a39279
12063D0732N9583a55029A47077a02312j7145C06999c83597A39217a85434G3487
12052g7332Q976l213A44781a93502h5567I6161B2994J48484n9170b51060I7116
12040A81644E8002b42739C04961B6692c43509f594j39980N9056b5736D22137C0172
12028i8368a9182C5689N8177b40778Q9368e9339C76239b02640j70362J72152d0005
$$ y = [107475, 160653, -254647, 25387, 60671, 122698, -183621, -164027, -65867, -242847, 67419, 113560, 127596, 533469, 143443, 228284, 31556, 247164, -216737, -58428, -196899, -208178, -166227, 57653, -106481, -8228, -35718, 74508, -28751, -29133, -207048, -32865, 120495, -58380, -73040, 652481, 1219308, 1767317, 729275, 465137, 255422, 628222, 127248, -139279, 40732, 100315, -155029, 147077, -102312, -119457, 306999, -383597, 139217, -185434, 73487, -77332, -68356, -71569, 144781, -193502, -85567, 96161, 22994, 171478, 112308, -251060, 97116, 181644, 58002, -242739, 304961, 26692, -343509, -6594, -146574, -87518, -25736, 422137, 30172, -98368, -19182, 35689, 93866, -240778, -151410, -59339, 376239, -202640, -373002, -200850, -40005]
12016h0533B47450a97517B36810J68466B01387p5549K53218o2343G1993b10457
12005a03713B75902A01918K11733j38390i7722j55702G0416a5567q540j05540
11995a29647M3272p7675B20660b25480j43550a6820l35418I6246B9084K07033
11985B36117g1469A10101B3438P1848K22121G569h4365C1009J61822J4259c4902
11973c4855a1361j9015k54112J3330n3375G4902C2480g8208I2072a08543j44669
11962b53212b9838A93020E7630g0533B2584i5459b0783j88545A57815N1755c32740
11950B69842c8016j02094r9055j13634f1127m0693A62733d26969d1319j43814
11940a85133O6644I0704J01948H9586h9117j3699H1343i5056B02095d1438C9518
$$ y = [-80533, 247450, -197517, 236810, 405276, 201387, 125838, 379056, 316713, 71993, -210457, -103713, 275902, 101918, 313651, 175261, -97722, -253424, 70416, -15567, -24107, -129647, -86375, -164050, 220660, -225480, -369030, -16820, -352238, 96246, 29084, 236117, -71469, 110101, 23438, 95286, 317407, 7569, -84365, 31009, 192831, 207090, -34902, -34855, -11361, -30376, -284488, -271158, -324533, 74902, 32480, -78208, 92072, -108543, -253212, -29838, 193020, 57630, -70533, 22584, -95459, -20783, -209328, 157815, 209570, -332740, 269842, -38016, -140110, -239165, -352799, -61127, -101820, 162733, -426969, -41319, -185133, -118489, 90704, 192652, 89586, -89117, -102816, 81343, -95056, 202095, -41438, 39518]
11928e7960a5497C04614D661M2966L5494L6741b13110i283M543p8455a5879E01788
11915A5615a92760J6641E704J29829b90584A47973E6913i6309l9422M8399J2988
11904g4344A09112k3446K8928m9205J29510J85689a3193A31366c1528j70652g3874
11892i3728J3480p8700A67036a42858H9451a21690B38870k4518a10076L5508l30422
11881d04990J74917i7217K8976C5584a67478b2673A32328B1863J568J154J41465
11870A66050a07167k04905I3764M5765e0589I1702c11096F4453i5713A31371M2497
11859A73868g5558q9599m7470G4782B3545D469Q6219D3017c40153J8469g1280
11847b5492C86504b18188M7836M8778C5431c3325m802A11637a81978B43984B8526
$$ y = [-57960, -15497, 304614, 4661, 47627, 83121, 119862, -213110, -9283, -4740, -83195, -15879, 501788, 15615, -192760, -176119, 5704, 135533, -290584, 147973, 56913, -96309, -135731, -87332, -74344, 109112, 85666, 114594, 65389, 194899, 380588, -13193, 131366, -31528, -202180, -73874, -93728, -80248, -158948, 167036, -142858, 89451, -121690, 238870, 214352, -110076, -74568, -404990, -230073, -97217, -68241, 35584, -167478, -22673, 132328, 21863, 23431, 24585, 166050, -107167, -312072, 93764, 139529, -50589, 91702, -311096, 64453, -95713, 131371, 173868, -75558, -165157, -212627, 74782, 23545, 4469, 90688, 43017, -340153, -321684, -71280, -25492, 386504, -218188, -170352, -121574, 35431, -33325, -38127, 111637, -181978, 243984, 28526]
11835b29371A25792c25282N5365D13013k01643J4256J5287n4480d9452j76100
11825b25552q6725c2196o9164A2155b04963D7912K09350i8483G9193c06608i0112
11813c1005k26253h6326J921C07110A49205J19632H4683j8924a9206p4233D9106
11801h8233E5466r477a04880K8183B04480a6529l2213j54508A05354B2107a26304
11789A31284K4864a28921A68285m674C2637Q3871J0357b27820g9527C4174c576
11777C0462b36665d1479a6386A41154a8858j39478A05209i7208L1124j8893D4652
11765e9865k99659B26739Q0263b4210j76053G0077L4366B9647M06369c33895J08937
11754b24958i928B60108C8858c8873k18639B17241p1094r374J26853b18812m7066
$$ y = [-229371, 125792, -325282, -269917, 413013, 211370, 225626, 240913, 186433, -49452, -225552, -312277, -32196, -101360, 12155, -204963, 47912, 257262, -98483, 79193, -306608, -90112, -31005, -257258, -86326, -84405, 307110, 149205, 268837, 84683, 65759, -19206, -93439, 49106, -88233, 55466, 45989, -104880, -76697, 204480, -16529, -48742, -203250, 105354, 22107, -126304, 131284, 156148, -128921, 168285, 163611, 32637, 116508, 126865, -227820, -79527, 34174, -3576, 30462, -236665, -41479, -16386, 141154, -18858, -158336, 105209, -97208, -66084, -84977, 44652, -59865, -359524, 226739, 307002, -24210, -200263, 70077, 104443, 29647, 436016, -333895, -224958, -9928, 260108, 38858, -38873, -257512, 217241, 146147, 136773, 263626, -218812, -265878]
11743b65878c9771l2012o5723A38791b74928A7308J4684K4254i2046h556k51846
11732b60402H3857b42516M4173o7119M5649Q5833B83749A14016h86k1317B42730
11720b81181F8240M7398b26981Q5617O4561A58833m8477m3622a12364k21848A18677
11708I9720a19902j87559B28933a04417H7784a67157D6818c03494J7941P9126
11698b06427G094b29173A89591A9375K07798A1782l371K24884B0615b37689c5884
11686F8948d20203I5586c4014G7666L6335K92603F2989O9995O0332a06466i70
11674b83439N861H6212c42567B54348d6396b0640A0735L46929j56023a5806k01948
11663b17754Q1257A88265J5022b5905E3355b3441I5521a98574F464M4912b49251
$$ y = [-265878, -39771, -71783, -137506, 138791, -274928, 17308, 31992, 56246, -92046, -8556, -260402, 83857, -242516, -198343, -265462, -219813, -133980, 283749, 114016, -886, -22203, 242730, -281181, 68240, 115638, -226981, -141364, -76803, 158833, 110356, 66734, -112364, -334212, 118677, 99720, -119902, -307461, 228933, -104417, 87784, -167157, 46818, -303494, -285553, -206427, 7094, -229173, 189591, 19375, 227173, 11782, 8411, 233295, 20615, -237689, -35884, 68948, -420203, 95586, -34014, 77666, 114001, 406604, 62989, 132984, 193316, -106466, -970, -283439, -277578, 86212, -342567, 254348, -46396, -20640, 10735, 357664, 201641, -15806, -217754, -136497, 188265, 203287, -25905, 53355, -23441, 95521, -198574, 6464, 51376, -249251]
11651b41768B71183a975j18456A00597a44695J7803C3058b44538Q7271N9571J0201
11640h7495n6622C9173b77043m132J10848j3768H8457K17339o6051J4552a47199
11628G9962K53441m9744j40802e2418A68062B412J18308c37568c8912D02726a03911
11616A655P8267f3011m3106p7400b9908B75179e9032k02486B10221J7424c34427
11604h5418k1096B65860c4496j32114f471J116j96803B37701a36265E3677J52710
11593B06387a9010B67577a4736j00069p236B2204J40798f146F6153J38608p8966
11582A25795b67539f7846B77705p1240m482j00316K38439d16922e9423D4199K53954
11571B98153A11039b51959F827J19699o1605J70137m9520A5780N9396g1731I9711
$$ y = [-241768, 271183, -1975, -120431, 100597, -144695, -126892, 33058, -244538, -157267, -97696, -87495, -144117, 39173, -277043, -281175, -170327, -184095, 88457, 305796, 239745, 254297, -147199, 79962, 333403, 283659, 142857, -52418, 168062, 2412, 120720, -337568, -38912, 402726, -103911, 1655, 79922, -63011, -106117, -183517, -29908, 275179, -59032, -261518, 210221, 227645, -334427, -85418, -106514, 265860, -34496, -166610, -6471, -5355, -202158, 237701, -136265, 53677, 206387, -19010, 267577, -14736, -114805, -122041, 22204, 163002, -6146, 66153, 204761, 125795, -267539, -67846, 277705, 206465, 201983, 101667, 340106, -416922, -59423, 44199, 298153, 111039, -251959, 6827, 126526, 64921, 235058, 185538, 15780, 75176, -71731, 99711]
11559A68997H2300f3663j14236c8702C27060a0173B32841G5975K13268D159N6369
11548F0528J26833E451J65102h2221b7614G260J62892b3428I5073j8620K136a8021
11535a69953A51442b030m3543I2195K8801a87254B55847j19593P1576E2956a1121
11523B13737M0862j22282m7643C5197L34004A12860J96960A28898a79398B26538
11512H3033K37762a24247r9366B10569e1280C93924c60230D9373L2101c2239A12984
11500a7448H8143J98010M8919A36697d7936J9011E5514f9348B14509j5103F6948
11488D414J77553j7715R9670n3088A4817i7132B83916G8689a47056b7684A11765
11476H9603r697c2874B62241b40414A26487J35629L48255k86817A19228c42066
$$ y = [168997, 82300, -63663, -177899, -38702, 327060, -10173, 232841, 75975, 289243, 4159, 60528, 187361, 5451, 170553, -82221, -27614, 7260, 170152, -23428, 95073, 76453, 78589, -18021, -169953, 151442, -2030, -45573, 92195, 120996, -187254, 255847, 136254, 207830, 52956, -11121, 213737, 254599, 132317, 84674, 35197, 369201, 112860, 309820, 128898, -179398, 226538, 83033, 320795, -124247, -223613, 210569, -51280, 393924, -360230, 49373, 81474, -32239, 112984, -17448, 88143, 286153, 335072, 136697, -47936, -28925, 55514, -69348, 214509, 199406, 66948, 4414, 181967, 164252, 263922, 210834, 14817, -97132, 283916, 78689, -147056, -27684, 111765, 89603, 79906, -32874, 262241, -240414, 126487, 262116, 610371, 323554, 119228, -342066]
11465D17343r1277c6708H0785D740J33189d7300C39426a61376I8701m2347a3929
11453A26064a0004C28355c15843D86731b38245C42841a25111B9487K84231d9386
11442D03239c9512D2590B154K19194f0990I3759O6586F0563j20p60h0474C9033
11429D6371K8374K5841J3628b05738D9738K3920L988A8180a53712j35553a27442
11417G26a01962l0034n7420I2496l2067e1349m1300H4411h1210C229Q8574k810
11405H8993K13998j02964o4928M2898a66768A97376i3488r5508B52192m2820A02263
11393D4010K70535b2953A36379d77k57005D6447N2069Q8078b18124H5609g1446
11381B90061C3283a53694O3126a4579k31076C2897d8166A7007b26701A51267a44241
$$ y = [417343, 326066, -36708, 80785, 4740, 137929, -47300, 339426, -161376, 98701, 56354, -13929, 126064, -10004, 328355, -315843, 486731, -238245, 342841, -125111, 29487, 313718, -49386, 403239, -39512, 42590, 2154, 221348, -60990, 93759, 160345, 60563, 60443, 59683, -80474, 39033, 46371, 74745, 100586, 114214, -205738, 49738, 73658, 77646, 18180, -153712, -289265, -127442, 726, -101962, -131996, -189416, 92496, 60429, -51349, -92649, 84411, -81210, 3229, 91803, 88993, 302991, 200027, 135099, 177997, -166768, 197376, -93488, -188996, 252192, 209372, 102263, 44010, 314545, -22953, 136379, -477, -257482, 46447, 98516, 186594, -218124, 85609, -71446, 290061, 33283, -153694, -90568, -14579, -245655, 32897, -48166, 17007, -226701, 151267, -144241]
11369a28192o2023A62332k0572K4522a18708H0010d21097a57859F9039h3839j9960
11358a03799j91423J45258M1798D39714a15721j25407Q3510G703g7922j99912
11348b77834b2342j25031j7834C18994k6177b13808A40718J32427a32373f5112
11337B9642P1966a96163G8899P7587B1748J3148J46434G7528C6308a20874D56635
11325H9643g6555J0771K1429o6831k7449H4340M6670b49937Q8827d8401l1129
11314g9530F7446b13666A53539k5300C8793r274b1360j84472a01117J9861c0571
11302B59922a03573A30271a5792C4106h7294H2159J81633B8487F648a30287H0911
11290e9259k1336j14373f6544j62319k56804A6159a01922j44407j26730F5160
$$ y = [-128192, -190215, 162332, 141760, 166282, -118708, 80010, -421097, -157859, 69039, -83839, -103799, -295222, -149964, -108166, 439714, -115721, -241128, -157618, 7703, -77922, -277834, -22342, -147373, -165207, 318994, 292817, -213808, 140718, 273145, -132373, -65112, 29642, 101608, -196163, 78899, 156486, 21748, 34896, 181330, 77528, 36308, -120874, 456635, 89643, -76555, -65784, -44355, -111186, -138635, 84340, 131010, -249937, -161110, -48401, -79530, 67446, -213666, 153539, 128239, 38793, 29519, -21360, -205832, -101117, -81256, -30571, 259922, -103573, 130271, -15792, 34106, -87294, 82159, 263792, 28487, 6648, -130287, 80911, -59259, -80595, -194968, -66544, -228863, -485667, 16159, -101922, -246329, -373059, 65160]
11279A21751F385e7830p638n1806D65182C5583J66456p3580E5184J72042r2979
11268A34247N826J88797A37442b55385f8678A63514a16350A4402a34760B2049
11257i7164j74506A33088b7551j51023h2399A70566o2887b50171i1014D414N3839
11246E8253i9913B8817c0495l60783Q1317E1456K3627b24421E6546J44923o5827
11235A35642b58432b984j35898j25650k7834e8108m9765N1869j00097O982A0957
11223A57917a61095J3908I0001a01726F3822B8619K85658a87575d5781o1054M7409
11212e9426k99725i3139A8361b34011B44129E5291f2476n6277C0369a23598k29412
11201c53010a666j82292j02709h7691j6856j4918K0502j26324a2565p4445A9370
$$ y = [121751, 6385, -57830, -65468, -117274, 465182, 35583, 202039, 128459, 55184, 227226, 134247, 140073, 328870, 137442, -255385, -68678, 163514, -116350, 14402, -134760, 22049, -97164, -271670, 133088, -27551, -178574, -82399, 170566, 107679, -250171, -91014, 4414, 58253, -99913, 28817, -30495, -391278, -309961, 51456, 75083, -224421, 56546, 201469, 135642, -258432, -2984, -138882, -264532, -292366, -58108, -107873, -56004, -156101, -149119, 10957, 157917, -161095, -147187, 90001, -101726, 63822, 28619, 314277, -187575, -45781, -106835, -59426, -359151, -93139, 18361, -234011, 244129, 55291, -62476, -118753, 30369, -123598, -353010, -1666, -183958, -286667, -87691, -104547, -119465, -98963, -225287, -12565, -87010, 19370]
11189H0505a6656A3802g3159j81770A1053e1299o3969B03068L6148a59558L6336
11178a23222H459i6413n3648j10126c6686o5603G0307p623f2186m2544C3301c44479
11165a67810C5113N5169a5103j75097M3396D6809K04831F4876i0394B47682d24838
11153g8136j33634B3076a82707H3514a14200j0654o2876F0151a74461j5811A37313
11141b14076K9232C25302b2771m0863C056M3194K06b22798B9164a26434A14558
11129C27105B1268a09835A72952F696L11126b83699D98690C0534e5486a3479j2519
11118b5998B53884j18723a22834A21659c861A53205R4186A03607O3859K27196
11108C94662n9823f6768B05178L07361A16631K28924c5991F8846J04637K4979
$$ y = [80505, -16656, 13802, -73159, -254929, 11053, -51299, -115268, 203068, 239216, -159558, -123222, 8459, -96413, -150061, -260187, -36686, -102289, 70307, 62684, -62186, -104730, 33301, -344479, -167810, 35113, 90282, -15103, -190200, -146804, 46809, 251640, 64876, -90394, 247682, -424838, -78136, -211770, 23076, -182707, 83514, -114200, -124854, -187730, 60151, -174461, -190272, 137313, -214076, -184844, 325302, -22771, -63634, 3056, 46250, 46456, -222798, 29164, -126434, 114558, 327105, 21268, -109835, 172952, 6696, 317822, -283699, 498690, 30534, -55486, -13479, -25998, 253884, 135161, -122834, 121659, -3861, 153205, 247391, 103607, 167466, 394662, 334839, -66768, 205178, 512539, 116631, 345555, -35991, 68846, 173483, 198462]
11098A98462G7251A1539J8077a26899A21162J31622a1300I858N4175K02930j29431
11087A37532f8416n1461A51835K76754j84258E0366K50922l9346M1298r0186J1971
11076B25025L19070A61354K74923J20181j51239n3399j75255J89328A70866J63316
11066C34182L9536J53286k01122A48316L03403k06593R9568Q1432O6260J67996
11056F60382j74360j0179m8915L11334J07477l98420K37691j70332K5366K1138
11046E61182m5777r0172K00569R6391o9877l3860q2199q8052K90940k22424p8505
11035D38216N08634m57835L90054j57909l9138l6471J41755J07136C94509K74924
11025F69433k27900M24859j76353j74736K73905j14538n0002j90143L42721k72481
$$ y = [198462, 77251, 11539, 29616, -126899, 121162, 252784, -11300, 9858, 64033, 266963, 137532, -68416, -119877, 151835, 428589, 244331, 50366, 301288, 261942, 303240, 213054, 225025, 544095, 161354, 436277, 556458, 405219, 351820, 176565, 365893, 170866, 334182, 373718, 527004, 325882, 148316, 451719, 245126, 344694, 426126, 492386, 660382, 486022, 475843, 426928, 738262, 845739, 447319, 685010, 514678, 540044, 561182, 515405, 425233, 625802, 722193, 652316, 618456, 536257, 448205, 739145, 516721, 438216, 946850, 489015, 879069, 721160, 682022, 645551, 787306, 894442, 394509, 669433, 441533, 866392, 690039, 515303, 789208, 674670, 624668, 434525, 777246, 504765]
11015E04765M3327j61783K98231j91073O4437J51723j04192n1654j659o0134J96463
11004F88451j0176k1950B46048L29521K45067k49446J25965R4740l46148K59889
10994G05636l14282K56025J03381k56056P0460M05112j70649k41317M7158K57004
10984H62472L9322j41831r021M71782j71698J6719M19463r2229L19483L50493
10974B064955K58215j99042M24130K73434j91216J8208j41632j88962l94435l28697
10964A594958l00719l5661M3948m52895L85954p4713K02766j37182J72874l06619
10954A092711K35930n25006M31565l38288k61699k25926n4074P4474J00631r7231
10944D33087j48809R9125B1687C831a79058C63559A04186a98680A70129H3455
$$ y = [504765, 548092, 386309, 684540, 493467, 557904, 709627, 605435, 553781, 552122, 491988, 688451, 678275, 656325, 246048, 575569, 820636, 571190, 697155, 791895, 445747, 705636, 391354, 647379, 750760, 494704, 565164, 970276, 799627, 558310, 605468, 862472, 901794, 759963, 750942, 1222724, 1051026, 1067745, 1487208, 1394979, 1714462, 2064955, 2323170, 2124128, 2548258, 2821692, 2630476, 2648684, 2507052, 2318090, 1923655, 1594958, 1294239, 1258578, 1302526, 849631, 1235585, 1160872, 1363638, 1226456, 1399330, 1092711, 1328641, 803635, 1235200, 896912, 635213, 409287, 355213, 429687, 530318, 433087, 284278, 383403, 21687, 3831, -179058, 363559, 104186, -198680, 170129, 83455]
10933G1585K25433A0670O156a887p0050A76000g972C5984L4844J35699h8768B25347
10920f6210a5659A76833a66288G1867g3277c6311B52726c30410A98989c9762I7152
10908F7044a25697A6213b7036A91166K3809e3233A89308R2646r1028a09663E9860
10896a42242B79312o6790a5019B72667A07646b35968E8281D565M43820D8217a04749
10884A70760O1854a15623q2302Q2118C34564a33892a7296A46938j115D0484r47
10873C9537L1842K7972a86238A96353a42427k1142k6A64275d9394H7407f8155
10861d3545B09437E3850f7815C80236c00867A81855p8459i2691j72165J6997A36902
10849A28088L3264b24661A41375D9743h7279I1414c1753m8918j93668A74946k5719
$$ y = [71585, 297018, 10670, 16826, -1887, -71937, 176000, -7972, 35984, 70828, 206527, -88768, 225347, -66210, -15659, 176833, -166288, 71867, -73277, -36311, 252726, -330410, 198989, -39762, 97152, 67044, -125697, 16213, -27036, 191166, 214975, -53233, 189308, 281954, 190926, -109663, 59860, -142242, 279312, 212522, -15019, 272667, 107646, -235968, 58281, 4565, 448385, 48217, -104749, 170760, 232614, -115623, -197925, -115807, 334564, -133892, -17296, 146938, 145823, 40484, 39537, 71379, 99351, -186238, 196353, -142427, -163569, -163595, 164275, -49394, 87407, -68155, -43545, 209437, 53850, -67815, 380236, -300867, 181855, 103396, -92691, -264856, -247859, 136902, 128088, 161352, -224661, 141375, 49743, -87279, 91414, -31753, -80671, -274339, 174946, 149227]
10838A49227b09284a00229D06306j28768O5135D8817Q4344a48805l3607m8394
10828b30806B62795b55356G5472B9830K17937C4371K86848b8957C8063L04722
10818C42785h4271l4070F9377c70130C25640j10968a08923B110a97172e5334E5058
10806b03151B13676L863G7111b93443J13607b896l36293a2759B26180c06020H7414
10794E240d6864n5624B38693f6444l64119C4076b22121H8395c8697O740k92177
10783c24134a19628G0326K43771a88991k12559e5507j78323B59977i5714H184
10772a92067l7165G4374e9082j64957B7801a26197f2498j68512D3563b82788E4756
10760B69451b26730C8373c16065Q2796F9103J14189m7091e7241k48770A38922
$$ y = [149227, -209284, -100229, 406306, 277538, 342673, 48817, 133161, -148805, -182412, -230806, 262795, -255356, 75472, 29830, 247767, 34371, 321219, -28957, 38063, 342785, -84271, -118341, 69377, -370130, 325640, 214672, -108923, 2110, -197172, -55334, 55058, -203151, 213676, 217539, 77111, -293443, -179836, -2896, -339189, -12759, 226180, -306020, 87414, 5240, -46864, -102488, 238693, -66444, -430563, 34076, -222121, 88395, -38697, -31957, -324134, -119628, 70326, 314097, -188991, -401550, -55507, -233830, 259977, -95714, 8184, -192067, -229232, 74374, -59082, -224039, 27801, -126197, -62498, -231010, 43563, -282788, 54756, 269451, -226730, 38373, -316065, -233269, 69103, 183292, 136201, -57241, -306011, 138922]
10749B598a36086K7051c3568k55053A53168h9134H1696l4575M2292a82915Q1512
10738a01403K2575H0645b3443F6832J2171a95470f3681j07928l6071p2160D0487
10726C74711b04005i180k85724i3721E9054a3061C61963c46151a58853c5929B44662
10714f6195C9629c56449H384J74876D3288J43189b02593M3423a2080D6628J49258
10703A95886E2729A583a44775j4016k17482a57769c5205r4790J6560I1814b99430
10691I7505j5087a54586F9538c09476A33994k2529a34395j91941g8554A38819
10680A14388e7530j73253P678I4450a68993J8248A09319K47029b67046B2817f5949
10668A14838J55615c16936Q3195J15400M9059n843r61H6306a93768J7211C59251
$$ y = [2598, -136086, -109035, -33568, -288621, 153168, -89134, 81696, 47121, 89413, -182915, -101403, -78828, 80645, -23443, 66832, 79003, -195470, -63681, -171609, -207680, -279840, 40487, 374711, -204005, -9180, -294904, -93721, 59054, -13061, 361963, -346151, -158853, -35929, 244662, -66195, 39629, -356449, 8384, 183260, 43288, 186477, -202593, -159170, -12080, 46628, 195886, 52729, 1583, -144775, -158791, -376273, -157769, -35205, -129995, -113435, 91814, -299430, 97505, 82418, -154586, 69538, -309476, 133994, 111465, -134395, -326336, -78554, 138819, 114388, -57530, -230783, -223105, 94450, -168993, -150745, 109319, 356348, -267046, 22817, -65949, 114838, 270453, -316936, -233741, -118341, -69282, -75125, -76086, 86306, -193768, -176557, 359251]
10656b46355a10311A91693d4957F6813R5265a92041j28013b1230a720F8005J43604
10645B11609A1065b19959H6923b1290q6815B28686D7371a55291b3533A12059f6889
10633b38395o34L6122M0815e8066j32468Q7757G6838L47138G8276O9121f9284
10621d06585J60201J4445g4521j08789M8965p1396n5114I2488a15430n1881M9188
10610a18123A68582c46555a16070j54317J10898l4400m4834A43543F2145l0660
10600C1485b8578l09091H7920a58806n5072d0423A17787D9170h2733E8976b2481
10588B9648K3260b33002f5313C4132a33709C6823a38522B008J75662g8369C9180
10576E5824L92104a30726A87300K3602h1752l0774B4181K20354c5661m6095A93760
$$ y = [-246355, -110311, 191693, -44957, 66813, 162078, -192041, -320054, -21230, -1720, 68005, 211609, 11065, -219959, 86923, -21290, -108105, 228686, 47371, -155291, -23533, 112059, -66889, -238395, -239029, -202907, -162092, -58066, -190534, -102777, 76838, 423976, 78276, 147397, -69284, -406585, -246384, -231939, -74521, -183310, -134345, -205741, -260855, 92488, -115430, -167311, -118123, 168582, -346555, -116070, -270387, -159489, -193889, -238723, 143543, 62145, 31485, -28578, -337669, 87920, -158806, -213878, -40423, 117787, 49170, -82733, 58976, -22481, 29648, 52908, -233002, -65313, 34132, -133709, 36823, -138522, 2008, 177670, -78369, 39180, 55824, 447928, -130726, 187300, 210902, -81752, -112526, 24181, 244535, -35661, -81756, 193760]
10564c22352N3075a5318p0193D2566K1042B0790c24750J58565A71860a00367N181
10553i5186A44934j2006n5451A7371c8339j52560B5155J87794c70210a33111f0134
10541b11592A68798b42007E1782a14168k0385q1900C64696b7479B82742c58199
10530a7261D7427L37128a25698d5940j54362c330l15374a06237a6389A90228c44154
10518E8877J93670P5097a51655P4974D18271l388E8470H218g6851A04630j9856
10507H4774a03884A3112K41969a49744c5930j27850O2619q2776A46383a31754
10496d79209A11921a02150A64784Q2262I3787a8682k64036B9245R751a26900A87465
10484B18590o1687L7067o7166M60521k68684K1846e2524A93320J09308a36396
$$ y = [-322352, -269277, -15318, -85511, 42566, 63608, 20790, -324750, -166185, 171860, -100367, -95186, 144934, 132928, 77477, 17371, -38339, -190899, 25155, 212949, -370210, -133111, -60134, -211592, 168798, -242007, 51782, -114168, -134553, -216453, 364696, -27479, 282742, -358199, -17261, 47427, 384555, -125698, -45940, -200302, -3330, -318704, -106237, -16389, 190228, -344154, 58877, 252547, 327644, -151655, -76681, 418271, 414883, 58470, 8218, -76851, 104630, 84774, -103884, 13112, 255081, -149744, -35930, -163780, -101161, -183937, 146383, -131754, -479209, 111921, -102150, 164784, 247046, 93787, -18682, -282718, 29245, 38996, -126900, 187465, 218590, 156903, 193970, 126804, 587325, 318641, 340487, -52524, 193320, 302628, -136396]
10473A13034c0795A16129l6576b78659i238B28303a69696M4227o9264A08124J0427
10462A18551a8357H3578a02886j6618q7629B6910a78556d7016A52114G3251c05966
10450A17643m4444P4848b39573R7338e3057b5284A23835L7354C6541b82282h6822
10438b21878e7547q0609k55528f8161j23154g6872c1744k8692E3788J9319K2055
10427I5162i39B30337i7588j02151r0181B01160a50265D91094B28112d7982j60655
10416b08637n5561F8966a2113l14250a36896A84064F954h5636G5152b10272a4823
10404i5713A33457b9008C03811A12392h3588L193A61000n6206b06731D8813d2625
10392C15998F2880K53298A17407J58975J16670j8732I9999b71597e936j23253
$$ y = [113034, -30795, 116129, 79553, -278659, -9238, 228303, -169696, -125469, -194733, 108124, 118551, -18357, 83578, -102886, -119504, -207133, 26910, -178556, -47016, 152114, 73251, -305966, 117643, 73199, 148047, -239573, -142235, -53057, -25284, 123835, 161189, 36541, -282282, -86822, -221878, -57547, -138156, -393684, -68161, -191315, -76872, -31744, -60436, 53788, 73107, 95162, -939, 230337, -97588, -199739, -289920, 201160, -150265, 491094, 228112, -47982, -208637, -264198, 68966, -12113, -326363, -136896, 184064, 6954, -85636, 75152, -210272, -14823, -95713, 133457, -29008, 303811, 112392, -83588, -80395, 161000, 104794, -206731, 48813, -42625, 315998, 62880, 316178, 117407, 276382, 393052, 374320, 99999, -271597, -5936, -129189]
10382a29189A75538l8821d2281j40101e9739B55242r2213K10016A14357c0996
10371D28396A65743M01780k55106K04378N7898B83601r5291J62159D0250Q1802
10361A22052k8332K60069j12106j00040L6649R0581Q0258A44046J09003P2476
10351C25525J92585J07836q8327B56326N5204O7876j29646O6242k0924q2727J71091
10340C83442j22810A07343J43094r649A8392J84573J77047E2467K39782j08140
10330A84109a13424C500a8812E8860C959J70046a60535C7410I783L91739F9876
10318b37698P1328A63278h1226A52853F0634k9556a69440A37243r425J6954b28312
10306e43043A94707a56841A27285p324e5176j00539p4192A69190E8194i0664K1704
$$ y = [-129189, 175538, 136717, -42281, -182382, -59739, 255242, 163029, 373045, 114357, -30996, 428396, 165743, 567523, 312417, 516795, 574693, 283601, 188310, 350469, 40250, 122052, 93720, 353789, 241683, 141643, 178292, 268873, 349131, 144046, 253049, 325525, 518110, 625946, 537619, 256326, 311530, 379406, 249760, 316002, 295078, 212351, 383442, 260632, 107343, 250437, 240788, 18392, 202965, 380012, 52467, 292249, 184109, -113424, 3500, -18812, 58860, 3959, 174005, -160535, 37410, 9783, 401522, 69876, -237698, -166370, 163278, -81226, 152853, 60634, 31078, -169440, 137243, 127818, 144772, -228312, -543043, 194707, -156841, 127285, 119961, -55176, -155715, -229907, 169190, 58194, -90664, -68960]
10295f8960q4786B4368a54720A05238k911b04293B33306e2278F5585K04716a80533
10283b97547F9617j8714c50578J54609h2706F5583b45732g5162K0918k54539R8591
10272b10192A72484F1029K06615F310e5764K1517C03222A42462C4665a05847D09778
10260a8603D37632g843j31802D5372J27143n8441P1738e8548l0213A81683D3796
10248B22917h645k50921A11105a08608j8020N5887r4955o4744I2439J6852d5603
10236A81945I310N14815c489j6850E3254K00166G6520A196Q6560a25246j38597
10225b63843e9000l1287H9815a26295I7706d4814m970r1473A05786a56603k03754
10214c60357e1656l27895D9714c46203A85176a61962B62325a62522f8121J4251
$$ y = [-68960, -153746, 24368, -154720, 105238, 102327, -204293, 233306, -52278, 65585, 270301, -180533, -297547, 69617, 50903, -350578, -195969, -82706, 65583, -245732, -75162, -54244, -308783, -210192, 172484, 61029, 267644, 6310, -55764, -34247, 303222, 142462, 34665, -105847, 409778, -18603, 437632, -7843, -139645, 45372, 172515, 114074, 185812, -58548, -88761, 181683, 43796, 222917, -8645, -259566, 111105, -108608, -126628, -70741, -165696, -230440, 92439, 109291, -45603, 181945, 9310, 524125, -3489, -20339, 53254, 253420, 76520, 1196, 87756, -125246, -263843, -59000, -90287, 89815, -126295, 97706, -44814, -49784, -141257, 105786, -156603, -360357, -51656, -379551, 49714, -346203, 185176, -161962, 262325, -162522, -68121, -53870]
10204e3870a905l17879e1240G5214b37557J9583h1921J6189A73035R450E1132
10192H3000b46276A74057H1966a23334A4534b2197A90440J22952g2715b7914C2026
10180A2744g5370b5975l44435E2832J46525l616b1706o8837A29115d9905A30674
10168a23244j06727G483N2393k2345b6119l2600L972j86686E5517d83586a80257
10156D0619J38757o7006D8005b20807D664a21296G1609J6718j5923f7312C7350
10144a67001l881a40q6222A99706a11356a2170j60369K2156G8933K4187J21122
10133B24242b58778C420b44988L6510j1454j28425a40444C0791e26744b53923
10122a33384B04669g5029m8345I521N3893B1940c44917E4522N2489b35346l7560
$$ y = [-53870, -1905, -319784, -51240, 75214, -237557, -217974, -81921, -65732, 173035, 182485, 51132, 83000, -246276, 174057, 81966, -123334, 14534, -22197, 190440, 313392, -72715, -27914, 32026, 12744, -75370, -25975, -370410, 52832, 199357, 195741, -21706, -90543, 129115, -49905, 130674, -123244, -229971, 7483, 59876, 37531, -26119, -58719, -54747, -241433, 55517, -483586, -180257, 40619, 179376, 112370, 48005, -220807, 4664, -121296, 71609, 88327, 72404, -67312, 37350, -167001, -170882, -140, -86362, 199706, -111356, -12170, -172539, -150383, 78933, 103120, 224242, -258778, 3420, -244988, -208478, -219932, -348357, -140444, 30791, -526744, -253923, -133384, 204669, -75029, -123374, 9521, 63414, 21940, -344917, 54522, 107011, -235346, -272906]
10111b72906D709b5002k94662C3933a58029r0449J16736A67226J74015c01525
10100A80855D4558a4471D848b29372b4989j73096A18512a42037j22529P9424A3530
10088e0511I8619J14955k5632a0652m1957B31514O6123j05891f4572N768B66147
10076b03753e5094n9061A72934b40493c3616j44209g5469j43964B4688b61688
10065d644A05386H998a95093A37331a24247B12253F0338J32589D0607a86953m6624
10054b33577J02417l63972B37726h9229m3978r1420l9322d6540C36851A60859
10043a59907m6101A2531J43807b30454C2066L1610a00061b2076A81701h7369A25258
10031b29949N1995I742a47671E1154Q6724i4492j17785K2408f5860j36118A31741
$$ y = [-272906, 4709, -25002, -319664, 33933, -158029, -248478, -131742, 167226, 341241, -301525, 180855, 44558, -14471, 4848, -229372, -24989, -198085, 118512, -142037, -264566, -185142, 13530, -50511, 98619, 213574, 187942, -10652, -52609, 231514, 297637, 191746, -64572, -58804, 266147, -203753, -55094, -114155, 172934, -240493, -33616, -177825, -75469, -219433, 24688, -261688, -4644, 105386, 8998, -195093, 137331, -124247, 212253, 60338, 192927, 40607, -186953, -233577, -131160, -495132, 237726, -89229, -133207, -224627, -263949, -46540, 336851, 160859, -159907, -206008, 12531, 156338, -230454, 32066, 63676, -100061, -22076, 181701, -87369, 125258, -229949, -177954, 9742, -147671, 51154, 137878, -94492, -212277, -189869, -65860, -201978, 131741]
10019b40068D3553a18982k7346b5775m85612a09358r9296A12154K4572b74284
10008D3926f1354K5813C0225a66543A22339m3524i7514d4403A67387a03805B82787
9996A14389e1772m5339A4844J44656J33466I5847c27468a26049B00688b49850
9985A58459b33422J10815M0756C2836b83650a07582N277A13524b22431J00750
9975a21681k1894B26614d242E7537h8017k57382B64925a34505B15824D8158B2941
9963b27076A71044e548E6843a72965P1913j70344K4175G4668e9064l10421C71854
9951b285p2804A35389c5861A2827c1413I6522f1008B7780b66522h0326n6377f6021
9938d86032I4842b8131p7112E653a06784p434L6113G7854b31777J456B38978l0256
$$ y = [-240068, 43553, -118982, -146328, -25775, -511387, -109358, -208654, 112154, 136726, -274284, 43926, -61354, -35541, 30225, -166543, 122339, 78815, -97514, -44403, 167387, -103805, 282787, 114389, -51772, -97111, 14844, 159500, 292966, 95847, -327468, -126049, 200688, -249850, 158459, -233422, -122607, -81851, 32836, -283650, -107582, -102305, 113524, -222431, -121681, -143575, 226614, -4242, 57537, -88017, -345399, 264925, -134505, 215824, 48158, 22941, -227076, 171044, -5548, 56843, -172965, -101052, -271396, -247221, 74668, -59064, -369485, 371854, -2285, -75089, 135389, -35861, 12827, -31413, 96522, -61008, 27780, -266522, -80326, -136703, -66021, -486032, 94842, -28131, -105243, 5653, -106784, -114218, -78105, 77854, -231777, -230321, 238978, 208722]
9926B08722A0406b31290B27608a85400I3719H439J68660c57831a35282A23109
9915g2254k00666A32582a1462B352a90146b3078j25551j61591e5540A6740d03682
9903b40149C02255A15131a71336j65542c7512C1381d665I2988a71254g1017c3113
9891b7021A70816a37800c5618p5476r8434c8230o2023r6395B28826a64979l3218
9880a98197A97413b8920D8261O6961a85031k7578A36334c01257P2033m949P6720
9869a57453I0830b49228M3526K2579B59790b72367H939O342J0203a59586c4454
9857A02805C347c02504B06983F6992h5505A5976b54506F3495f5821A2259K19511
9846B31770l6304C3863a45058r6921P0657j5345Q6430E9787c06303i5893j04619
$$ y = [208722, 10406, -231290, 227608, -185400, 93719, 8439, 177099, -357831, -135282, 123109, -72254, -272920, 132582, -11462, 2352, -190146, -23078, -148629, -310220, -55540, 16740, -403682, -240149, 302255, 115131, -171336, -336878, -37512, 31381, -4665, 92988, -171254, -71017, -33113, -27021, 170816, -137800, -35618, -111094, -209528, -38230, -100253, -196648, 228826, -164979, -198197, 197413, -28920, 48261, 115222, -185031, -212609, 136334, -301257, -229224, -234173, -157453, 90830, -249228, -205702, -183123, 259790, -272367, 8939, 15281, 25484, -159586, -34454, 102805, 3347, -302504, 206983, 66992, -85505, 15976, -254506, 63495, -65821, 12259, 231770, 195466, 33863, -145058, -241979, -171322, -186667, -100237, 59787, -306303, -95893, -200512]
9835b00512E7851e1350p5292A25287c3525k67452H6131d2283p990k2251R687B8999
9822G5789A6154b3334j55259l0034J1022f7858k22821c4310C42281c92327J40872
9811b51455a10101H1281a83545A8606c6799j02700b3835G2363g0206m93150g5635
9799A24244b94886J44128H3584E614c19405A43731a67575J6740I7447J48095b58086
9787a79477O5717a2073k89590A01379e01474C51867H5141b4991A17448C6057a00871
9775C26255a29985A15187c52352J57440B5745h7761D0026K28331p8026a86631
9764i7497A19201c76300J26824B37094e2391m6172J1749a6310I0726A9238J99927
9753B19165E2271a82678r6510B0357a3898j7850o4462k3091j51626A7168c93101
$$ y = [-200512, 57851, -51350, -126642, 125287, -33525, -300977, 86131, -42283, -50273, -72524, -62837, 28999, 75789, 16154, -23334, -178593, -208627, -197605, -67858, -290679, -34310, 342281, -392327, -251455, -110101, 81281, -183545, 18606, -36799, -139499, -23835, 72363, -70206, -563356, -75635, 124244, -294886, -150758, 83584, 5614, -319405, 143731, -167575, -150835, 97447, 245542, -258086, -179477, -113760, -12073, -301663, 101379, -501474, 351867, 85141, -24991, 117448, 36057, -100871, 326255, -129985, 115187, -352352, -194912, 25745, -87761, 40026, 268357, 190331, -186631, -97497, 119201, -376300, -249476, 237094, -52391, -98563, -86814, -16310, 90726, 19238, 219165, 52271, -182678, -279188, 20357, -13898, -31748, -96210, -119301, -270927, 17168, -393101]
9741a62445k56938a30140k91706A06835b39801E347a46764k06234f4967A52311
9730f0648k046c893A13966b0593A89546A9365a24422A457a33296l4844A85402
9718A2731h4700K7986b3391l62762H0798c40969C6911f2602K080o8657D2612c12260
9705A66261j4707K0185A4400O492J26268n2606c16890a21756C84723a7098A81784
9693c2467j87203j00802a00488d9050j60515f7002B2001a61502j84839f7651m7544
9682a15195r3729e1161B1082b20893c9356j8281j62051c5512B99410g1389k12128
9671b83517Q4975j62907H9318P5095G358Q807b04417h2533A07765D9070c7159
9659A62696a0847k23321f8191K4486k5005e386r1466k8236A59459d0852j68419
$$ y = [-162445, -419383, -130140, -421846, 106835, -239801, 5347, -146764, -352998, -64967, 152311, -60648, -62694, -3893, 113966, -20593, 189546, 19365, -124422, 1457, -133296, -168140, 185402, 12731, -84700, -56714, -23391, -386153, 80798, -340969, 36911, -62602, -60522, -129179, 42612, -312260, 166261, 151554, 171739, 14400, 20892, 147160, 94554, -316890, -121756, 384723, -17098, 181784, -32467, -219670, -320472, -100488, -49050, -209565, -67002, 22001, -161502, -346341, -67651, -115195, -208924, -51161, 21082, -220893, -39356, -57637, -219688, -35512, 299410, -71389, -283517, -198542, -361449, 89318, 164413, 7358, 16165, -204417, -82533, 107765, 49070, -37159, 162696, -10847, -234168, -68191, -43705, -68710, -5386, -96852, -125088, 159459, -40852, -209271]
9648b09271B95268b17258J07879D7795a87685A81196E3124h3228E7304h5974j81465
9637b67439C0005a37145H9888D1575A8714N1309a40963A0801a70608A23378h1109
9625E2497h4639l56015a01906m3068c2102k7011j98883h3241A10415a45385L3145
9614a12240D4329A6984a02952J1537n7982o8227A57572a24376r8399d0061j55133
9603a95194d2749B33353F8305N5761l3742L35548b70568h1003A73183L6721G4785
9591i2304j47125d526A31137a05088j51055O1259n3222h6703r3399G2954a18325
9579F1710h0034j18603b5497B13436E3779a60199b2486j90673k72161a81051p780
9568a88831n6749A65579e0956E9512J49498h4434A68443o3549J4417c42373Q6676
$$ y = [-209271, 295268, -217258, -109379, 47795, -187685, 181196, 53124, -83228, 57304, -85974, -267439, 30005, -137145, 89888, 41575, 18714, 70023, -140963, 10801, -170608, 123378, -81109, 52497, -84639, -440654, -101906, -144974, -32102, -59113, -257996, -83241, 110415, -145385, -112240, 44329, 16984, -102952, -91415, -149397, -217624, 157572, -124376, -222775, -40061, -195194, -42749, 233353, 68305, 124066, 90324, 425872, -270568, -81003, 173183, 209904, 74785, -92304, -239429, -4526, 131137, -105088, -256143, -194884, -248106, -86703, -180102, 72954, -118325, 61710, -80034, -198637, -25497, 213436, 53779, -160199, -22486, -213159, -485320, -181051, -188831, -245580, 165579, -50956, 59512, 209010, -84434, 168443, 104894, 119311, -342373, -255697]
9557b55697F6983b3035k32719O629A32032M9609H5249j5412b55224e7332A9523
9545b9796j91080B68172j04890p3012a19634A32153l1007a02203n951B38256f1505
9533f8238K5286j870C0731K24497b69128D3413J35123A0358A602J10011b97567
9521A78604E9521b00463B0785a2954A23214A5352g7667B39051q0187H706N5780
9510F4486b94170C5622e9299k09735a29171l28831d844j28160C04483b40346j5724
9499b56070b5763B01708a93588A0634c55422B937d76340a25556l10438a42576
9488H812J823K0734J43626a45707C8394k519a06442C5950J7838J9631b37373I6202
9475B40494B2203K278K17533b87057h1816k86051c02j28860j23368A05936Q2754
$$ y = [-255697, 66983, -23035, -255754, -249125, 132032, 181641, 85249, 69837, -255224, -57332, 19523, -29796, -220876, 268172, 163282, 90270, -119634, 132153, 101146, -102203, -108154, 238256, -61505, -68238, -42952, -44822, 30731, 255228, -269128, 43413, 178536, 10358, 1602, 111613, -297567, 178604, 59521, -200463, 20785, -12954, 123214, 15352, -77667, 239051, 158864, 8706, 64486, -294170, 35622, -59299, -269034, -129171, -458002, -4844, -133004, 304483, -240346, -256070, -25763, 201708, -193588, 10634, -355422, 2937, -476340, -125556, -435994, -142576, 8812, 10635, 31369, 174995, -145707, 38394, 35875, -106442, 35950, 53788, 73419, -237373, 96202, 240494, 22203, 24481, 242014, -287057, -81816, -367867, -302, -129162, -252530, 105936, 188690]
9464A88690L3366j0333b12311k8218g9184Q272o8259B33937j04419l5111k7255
9453F7152M0169J95609c63066g2498R504k7797A59878n021b47511i7676b6591
9441A44208a47996j37617o307h2298l7380H6470P0556o6293a12304G2086b31712
9429G1457a03709K2494l8040R390a8121A06457D0929J82980D8655a61388j55091
9418c16479A39947K14063h9374n8088o4631k0697k18087A29361l3797j4928b99533
9406A60744M223a76598b2845k52158B62790a79862l3176A5014a08605A40808J10541
9395B51349j08768b41799D0136a21597F6226a51295C17566h7231A07649h7684
9384a77921k8306E8951d9299g564I4659a24773B0523a83075k20725a92510g5817
$$ y = [188690, 222056, 211723, -212311, -240529, -79184, -70912, -139171, 233937, 129518, 94407, 67152, 107321, 302930, -363066, -72498, -62994, -90791, 159878, 154857, -247511, -97676, -26591, 144208, -147996, -285613, -291920, -82298, -119678, 86470, 157026, 90733, -112304, 72086, -231712, 71457, -103709, -81215, -119255, -109865, -18121, 106457, 40929, 223909, 48655, -161388, -316479, 139947, 354010, -89374, -147462, -212093, -232790, -450877, 129361, 95564, 80636, -299533, 160744, 164967, -176598, -22845, -275003, 262790, -179862, -213038, 15014, -108605, 140808, 251349, 142581, -241799, 40136, -121597, 66226, -151295, 317566, -87231, 107649, -87684, -177921, -206227, 58951, -49299, -7564, 94659, -124773, 20523, -183075, -403800, -192510, -75817]
9372a33018e8051j0247F6428J01784g4200B12995a97817e2228A33716L2630a80062
9360b94724R7051A71449a16297j22289A01171c29591e1880l1638l330j88269A55185
9348E6760b74650A3711a50069n5213A0442d6027m2401l7260b8622k17581G2279
9336a61047j2144H2942b92991M6770A29372c93428B35554n4187a33335J1005G4525
9324a97182f1943j53835i7361l94642i9043k49272J59244A0280c58629G8056a30153
9312d0630k3156B98247a17795l228B1674a96037f8579j61268L1839D4612J6452
9301F1064a67405o4657g4517K969j53314A30591j8536H437b4937j69763R4052
9290a00648B29392J66788A68185h7540E9919a44011F710i8262l1762q2644O1676
$$ y = [-133018, -58051, -68298, 66428, 168212, -74200, 212995, -197817, -52228, 133716, 166346, -180062, -294724, -197673, 171449, -116297, -238586, 101171, -329591, -51880, -83518, -86848, -275117, 155185, 56760, -274650, 13711, -150069, -205282, 10442, -46027, -88428, -125688, -28622, -246203, 72279, -161047, -173191, 82942, -292991, -246221, 129372, -393428, 235554, 181367, -133335, -122330, 74525, -197182, -61943, -215778, -97361, -492003, -99043, -348315, -189071, 10280, -358629, 78056, -130153, -40630, -63786, 298247, -117795, -121023, 21674, -196037, -68579, -229847, -198008, 44612, 61064, -167405, -232062, -74517, -71548, -224862, 130591, 112055, 8437, -24937, -194700, -100648, 229392, 396180, 168185, -87540, 59919, -144011, 6710, -98262, -130024, -212668, -150992]
9279a50992D4428b9501r8202A66612g6599j85497j4429G4752M2567H85f4631b8622
9266d67491E7734h130k96089J07615h2127E9622a75591G0469f102m17517g3959
9254c60349f2814I6242B9872a87923A11361a83617q554I639K1385b56973a7086
9242b80688c4007D4031N973K59085a0642k44544A7515a34208D35149a62750E3732
9230a51175j9603e4805l34568I4614b43930r6191g2693j3478A86484a02591j7490
9219a20081K2452O230j40525m6740M1781H819a20524A64961C1222a21002I1083
9207A53568E3345i8817B20293I2640c0058l99742B19015C0540M928a47689N7353
9196i0336j43971C14153I5365a76781H6188a00050H0959b22613e4696b822k35467
$$ y = [-150992, 44428, -29501, -127703, 166612, -76599, -262096, -276525, 74752, 117319, 885, -64631, -28622, -467491, 57734, -8130, -304219, -196604, -82127, 59622, -175591, 70469, -6102, -423619, -73959, -360349, -62814, 96242, 29872, -187923, 111361, -183617, -192171, 9639, 31024, -256973, -17086, -280688, -34007, 44031, 50004, 309089, -10642, -255186, 17515, -134208, 435149, -162750, 53732, -151175, -170778, -54805, -389373, 94614, -243930, -340121, -72693, -86171, 186484, -102591, -120081, -97629, -91399, -231924, -278664, -236883, 8819, -120524, 164961, 31222, -121002, 91083, 153568, 53345, -98817, 220293, 92640, -30058, -429800, 219015, 30540, 35468, -147689, -90336, -234307, 314153, 95365, -176781, 86188, -100050, 80959, -222613, -54696, -2822, -238289]
9185b38289a15612f566I6279m6555O6437k6206m691N9879a26346J6673D3254a73589
9172E9256b73408b9598j5762A36582a14240A19102J02011j6047m3703M1065F2584
9160f7922k35914B6402b69907D7237i012j74030h6575B4627a49744F5763j1228
9149E4535e7570Q439k4234A08421K3932m1850l2410e1545B00401L2706b59644
9137E7253a94923B88270a81505Q6903F8113b43843M2096k8493A6071d6062B84991
9125D0561p069J5045A7870b07769k9698G7796B4810b85026j4554J2574A2904i7628
9112A73235F3109b10458g0148l4702r0297B4211J08071a60338a4493C4846b4721
9100f5648j96454D7595h6949o2985A15916C9127j5434L9995D270P4798R8875f3078
$$ y = [-238289, -115612, -6566, 96279, 49724, 116161, 89955, 85264, 145143, -126346, -109673, 43254, -173589, 59256, -273408, -29598, -45360, 136582, -114240, 119102, 221113, 205066, 161363, 202428, 62584, -67922, -303836, 26402, -269907, 47237, -9012, -183042, -86575, 24627, -149744, 65763, 54535, -57570, -49131, -73365, 108421, 132353, 90503, 58093, -51545, 200401, 233107, -259644, 57253, -194923, 288270, -181505, -94602, 68113, -243843, -201747, -230240, 16071, -46062, 284991, 40561, 33492, 48537, 17870, -207769, -237467, 77796, 24810, -285026, -299580, -287006, 12904, -97628, 173235, 63109, -210458, -70148, -104850, -195147, 24211, 132282, -160338, -14493, 34846, -24721, -65648, -262102, 47595, -86949, -149934, 115916, 39127, 23693, 63688, 4270, 79068, 177943, -63078]
9087c22568f8608H1544b90378D1805K33809C0545b46477A67546m7578b45775J22236
9076a23539k39204C69583F1870b22100F9339R0524a44172J9203n0487q9139J22717
9065a41878I6384j5266c13486o1524p0180D0755a506A82455a51088r7274j92656
9054d41018g4311G4369a56503n2645B4401c18809A19525l0873a51225M6835C86498
9042b37399O7552J5162d3695A4184a73734l9026c2737j35353m5620B86917i6026
9030c1889k51831D8867J50063b921A92865a10267B44480b54773G104J16200m5886
9019G7418e8626k2965o0312L3065l5133A42578J54503a29700K2554H8352b46621
9007i73A58239a86120G1631b7326A98750c35692C26907b06165i7041j11442e6301
$$ y = [-322568, -68608, 81544, -290378, 41805, 275614, 30545, -246477, 167546, 119968, -245775, -123539, -362743, 369583, 61870, -222100, 69339, 159863, -144172, -124969, -175456, -264595, -141878, 96384, 81118, -313486, -375010, -445190, 40755, -1506, 182455, -151088, -248362, -441018, -74311, 74369, -156503, -209148, 24401, -318809, 119525, 88652, -151225, -104390, 386498, -237399, -169847, -154685, -43695, 14184, -173734, -212760, -32737, -168090, -213710, 286917, -96026, -31889, -283720, 48867, 198930, -2921, 192865, -110267, 244480, -254773, 7104, 123304, 77418, -58626, -81591, -141903, -108838, -143971, 142578, 297081, -129700, -107146, 88352, -246621, -973, 158239, -186120, 71631, -27326, 198750, -335692, 326907, -206165, -97041, -208483, -56301]
8995d0751C0529N3907b61510C2492O3153e8937F7195b16490b2416C7376e5610
8983d9274A96876b2802C25715G6246l3506P4062b3406G5716a14176C1090a94481
8971f8178b0459D8745c04736a45716j04644A42081H789L4243a64868B4311A1605
8959c27161A59213a96804N1624a1805H8567d32310c0274B7710a0077q5250B3866
8947h5794o3337C50267H4745g1701E6433a90024D0128J0841h4047j70256a07959
8935I5836J15266a95311I6849e7178A06706L0618J13372i0117j63634L5854H8371
8923d6559F36612K21908L27610C93374j92974C8383J31897d1259l2966A4421O1852
8912G6273h3222J4593J0780j17175B1865i5560k056A91315c33729K4626E6904
$$ y = [-40751, 30529, 84436, -261510, 32492, 95645, -58937, 67195, -216490, -22416, 37376, -55610, -49274, 196876, -22802, 325715, 76246, 42740, 116802, -23406, 75716, -114176, 31090, -194481, -68178, -20459, 48745, -304736, -145716, -250360, 142081, 8789, 43032, -164868, 24311, 11605, -327161, 159213, -196804, -145180, -11805, 88567, -432310, -30274, 27710, -10077, -95327, 23866, -85794, -149131, 350267, 84745, -71701, 56433, -190024, 40128, 50969, -84047, -254303, -107959, 95836, 211102, -195311, 96849, -57178, 106706, 137324, 250696, -90117, -253751, -217897, 88371, -46559, 636612, 858520, 1186130, 393374, 200400, 38383, 170280, -41259, -74225, 14421, 76273, -83222, -68629, -57849, -175024, 21865, -95560, -97616, 191315, -333729, -309103, 56904]
8900a44571B05843G3707B8903a97550M5552B29204a30129A65363a36116H7540
8889g2419E8655b13620D5142J15163b38105A57008b40946D7318a48831j78384
8879c27215p5998H2635b46580H7367b02848i3015i612k32315h9309A04328a61620
8867A06400m8637b21422C01719i0512a5629n1839K3141j39059k3408i4324B93056
8855a98600j79948B9154K32566g080C2022a50338q2173d4952j07052K5848E7472
8843a71004C21223e9317A0884K12755k3057G0832a04926q9029j7064G0364f3151
$$ y = [-144571, 205843, 73707, 28903, -197550, -151998, 229204, -130129, 165363, -136116, 87540, -72419, 58655, -213620, 45142, 160305, -238105, 157008, -240946, 47318, -148831, -327215, -403213, 82635, -246580, 87367, -202848, -93015, -9612, -241927, -89309, 104328, -161620, 106400, 57763, -221422, 301719, -90512, -15629, -67468, -44327, -183386, -206794, -94324, 293056, -198600, -378548, 29154, 261720, -7080, 32022, -150338, -232511, -44952, -152004, -126156, 57472, -171004, 321223, -59317, 10884, 223639, 200582, 70832, -104926, -193955, -211019, 70364, -63151]
$$ [...]
##END NTUPLES=NMR SPECTRUM
##END=
