##TITLE=AC1465_CTIAH13296_8011935_zdZF67pWNe
##JCAMPDX= 6.0         $$ Bruker NMR JCAMP-DX V2.0
##DATA TYPE= NMR SPECTRUM
##DATA CLASS= NTUPLES
##ORIGIN= BRUKER
##OWNER= Administrator
$$ 1.72 TOPSPIN		Version 2.1
$$ 2013-07-05 18:03:06.611 -0700  Administrator@X
$$ Compression mode = diff/dup
##.OBSERVE FREQUENCY= 400.02188249412
##.OBSERVE NUCLEUS= ^1H
##.ACQUISITION MODE= SIMULTANEOUS (DQD)
##.ACQUISITION SCHEME= undefined
##.AVERAGES= 64
##.DIGITISER RES= 22
##SPECTROMETER/DATA SYSTEM= spect
##.PULSE SEQUENCE= noesygpps1d.comp
##.SOLVENT NAME= COFFEE_meoh
##.SHIFT REFERENCE= INTERNAL, COFFEE_meoh, 1, 14.96089
##AUDIT TRAIL= $$ (NUMBER, WHEN, WHO, WHERE, PROCESS, VERSION, WHAT)
$$ ##TITLE= Audit trail, TOPSPIN		Version 2.1
$$ ##JCAMPDX= 5.01
$$ ##ORIGIN= Bruker BioSpin GmbH
$$ ##OWNER= Administrator
$$ $$ E:\/data/COFFEE/nmr/AC1465_CTIAH13296_8011935_zdZF67pWNe/12/pdata/1/auditp.txt
$$ ##AUDIT TRAIL=  $$ (NUMBER, WHEN, WHO, WHERE, PROCESS, VERSION, WHAT)
(   1,<2013-07-05 18:03:01.033 -0700>,<Administrator>,<X>,<go>,<TOPSPIN 2.1>,
      <created by zg
	started at 2013-07-05 17:51:31.673 -0700,
	POWCHK enabled, PULCHK disabled,
       configuration hash MD5:
       C8 4E 4E 5D D3 5C D8 9E 9F 52 82 E0 59 8A DE 15
       data hash MD5: 64K
       5E D3 BD 48 86 20 BD EB 0A 91 EE 15 A5 36 BC 3E>)
(   2,<2013-07-05 18:03:04.189 -0700>,<Administrator>,<X>,<proc1d>,<TOPSPIN 2.1>,
      <Start of raw data processing
       efp LB = 0.3 FT_mod = 6 PKNL = 1 PHC0 = 0 PHC1 = 0 SI = 128K 
       data hash MD5: 128K
       75 E3 71 3D 7A FC EF 29 78 D3 25 76 B1 C8 8A EA>)
(   3,<2013-07-05 18:03:05.283 -0700>,<Administrator>,<X>,<proc1d>,<TOPSPIN 2.1>,
      <pk PHC0 = -81.39771 PHC1 = 0 
       data hash MD5: 128K
       A6 BF 8D 35 3E 4A 60 DE B5 A4 71 C4 77 A6 B8 80>)
(   4,<2013-07-05 18:03:05.752 -0700>,<Administrator>,<X>,<proc1d>,<TOPSPIN 2.1>,
      <abs ABSG = 1 
       data hash MD5: 128K
       26 56 FC 36 3D 19 F5 18 23 1E 4A 3A 5E AD 5B 6D>)
(   5,<2013-07-05 18:03:05.845 -0700>,<Administrator>,<X>,<proc1d>,<TOPSPIN 2.1>,
      <abs ABSG = 2 
       data hash MD5: 128K
       F7 31 B3 C7 AA A5 57 20 4C 17 CE CE B8 6E BC 43>)
(   6,<2013-07-05 18:03:05.986 -0700>,<Administrator>,<X>,<proc1d>,<TOPSPIN 2.1>,
      <abs ABSG = 3 
       data hash MD5: 128K
       7D B6 4C 0F 4E A2 71 D3 86 D9 70 89 DB C8 F1 EA>)
(   7,<2013-07-05 18:03:06.252 -0700>,<Administrator>,<X>,<proc1d>,<TOPSPIN 2.1>,
      <abs ABSG = 4 
       data hash MD5: 128K
       6B 78 DB 59 33 0C C1 00 40 A9 C8 79 15 AB 87 7D>)
(   8,<2013-07-05 18:03:06.392 -0700>,<Administrator>,<X>,<proc1d>,<TOPSPIN 2.1>,
      <abs ABSG = 5 
       data hash MD5: 128K
       1B 4F 43 52 7B 47 F0 21 76 6C FC 5F B0 77 D3 2F>)
$$ ##END=
$$ 
$$ $$ hash MD5
$$ $$ B8 04 97 7A 66 EF A7 1B E2 42 96 BC 84 86 F4 C3
##$RELAX= 
##$RELAX= 
##$RELAX= 
##$RELAX= 
##$RELAX= 
##$RELAX= 
##$RELAX= 
##$RELAX= 
$$ Bruker specific parameters
$$ --------------------------
##$DU= <E:\>
##$EXPNO= 12
$$ [...]
150 150 150 150 150 150 150 150
##$TP07= 0
##$TPNAME0= <>
##$TPNAME1= <>
##$TPNAME2= <>
##$TPNAME3= <>
##$TPNAME4= <>
##$TPNAME5= <>
##$TPNAME6= <>
##$TPNAME7= <>
##$TPOAL= (0..7)
0.5 0.5 0.5 0.5 0.5 0.5 0.5 0.5
##$TPOFFS= (0..7)
0 0 0 0 0 0 0 0
##$TUNHIN= 0
##$TUNHOUT= 0
##$TUNXOUT= 0
##$USERA1= <user>
##$USERA2= <user>
##$USERA3= <user>
##$USERA4= <user>
##$USERA5= <user>
##$V9= 5
##$VALIST= <valist>
##$VCLIST= <CCCCCCCCCCCCCCC>
##$VD= 0
##$VDLIST= <DDDDDDDDDDDDDDD>
##$VPLIST= <PPPPPPPPPPPPPPP>
##$VTLIST= <TTTTTTTTTTTTTTT>
##$WBST= 1024
##$WBSW= 4
##$XGAIN= (0..3)
0 0 0 0
##$XL= 0
##$YL= 0
##$YMAX_a= 5956983
##$YMIN_a= -11976938
##$ZGOPTNS= <>
##$ZL1= 120
##$ZL2= 120
##$ZL3= 120
##$ZL4= 120
##$ABSF1= 14.96089
##$ABSF2= -5.597292
##$ABSG= 5
##$ABSL= 3
##$ALPHA= 0
##$AQORDER= 0
##$ASSFAC= 0
##$ASSFACI= 0
##$ASSFACX= 0
##$ASSWID= 0
##$AUNMP= <proc_prof1d_extract.lims>
##$AXLEFT= 0
##$AXNAME= <>
##$AXNUC= <1H>
##$AXRIGHT= 0
##$AXTYPE= 0
##$AXUNIT= <>
##$AZFE= 0.1
##$AZFW= 0.1
##$BCFW= 0
##$BC_mod= 0
##$BYTORDP= 0
##$COROFFS= 0
##$CY= 15
##$DATMOD= 1
##$DC= 0
##$DFILT= <>
##$DTYPP= 0
##$F1P= 0
##$F2P= 0
##$FCOR= 0.5
##$FTSIZE= 131072
##$FT_mod= 6
##$GAMMA= 0
##$GB= 0
##$INTBC= 1
##$INTSCL= 1
##$ISEN= 128
##$LB= 0.3
##$LEV0= 0
##$LPBIN= 0
##$MAXI= 10000
##$MC2= 0
##$MEAN= 0
##$ME_mod= 0
##$MI= 0
##$NCOEF= 0
##$NC_proc= -2
##$NLEV= 6
##$NOISF1= 0
##$NOISF2= 0
##$NSP= 0
##$NTH_PI= 0
##$NZP= 0
##$OFFSET= 14.96089
##$PC= 1
##$PHC0= -81.39771
##$PHC1= 0
##$PH_mod= 1
##$PKNL= yes
##$PPARMOD= 0
##$PPDIAG= 0
##$PPIPTYP= 0
##$PPMPNUM= 2147483647
##$PPRESOL= 1
##$PSCAL= 4
##$PSIGN= 0
##$PYNMP= <proc.py>
##$REVERSE= no
##$SF= 400.02000968183
##$SI= 131072
##$SIGF1= 0
##$SIGF2= 0
##$SINO= 400
##$SIOLD= 131072
##$SPECTYP= <>
##$SREGLST= <1H.CDCl3>
##$SSB= 0
##$STSI= 131072
##$STSR= 0
##$SW_p= 8223.68421052631
##$SYMM= 0
##$S_DEV= 0
##$TDeff= 65536
##$TDoff= 0
##$TI= <>
##$TILT= no
##$TM1= 0
##$TM2= 0
##$TOPLEV= 0
##$USERP1= <user>
##$USERP2= <user>
##$USERP3= <user>
##$USERP4= <user>
##$USERP5= <user>
##$WDW= 1
##$XDIM= 131072
##$YMAX_p= 397199573
##$YMIN_p= -11314
##$CURPLOT= <Network HP LaserJet P1505>
##$CURPRIN= <$Network HP LaserJet P1505>
##$DFORMAT= <normdp>
##$LAYOUT= <+/1D_H.xwp>
##$LFORMAT= <normlp>
##$PFORMAT= <normpl>
##$SURQMSG= 1
$$ End of Bruker specific parameters
$$ ---------------------------------
##NTUPLES= NMR SPECTRUM
##VAR_NAME=  FREQUENCY,     SPECTRUM/REAL,   SPECTRUM/IMAG
##SYMBOL=    X,             R,               I
##VAR_TYPE=  INDEPENDENT,   DEPENDENT,       DEPENDENT
##VAR_FORM=  AFFN,          ASDF,            ASDF
##VAR_DIM=   131072,        131072,          131072
##UNITS=     HZ,            ARBITRARY UNITS, ARBITRARY UNITS
##FACTOR=    0.0627417313425164, 1,          1
##FIRST=     8223.62146879497, 1861,         -51013
##LAST=      0,             3688,            -51016
##MIN=       0,             -11314,          0
##MAX=       8223.62146879497, 397199573,    0
$$ Real data points
##PAGE= N=1
##DATA TABLE= (X++(R..R)), XYDATA
$$ [...]
63944A797034J68214J78809J87275J93377J97466J99262J97613J91690J81669
63935C492409J67882J50055J27992J02552P5270M7281J8943r649l8305o6685r4179
63924C973566j19747j42137j60386j74122j83547j89163j91426j90533j86648
63915B435857j80213j71815j61760j50173j37597j25009j13009j01322q9430p7503
63905A128026o6308n6365m7565l9671l2819k7389k3455k0547j7967j5331j2883
63894G67726j1284j0993j1798j2915j3623j3800j3791j3714j3096j1392q767n972
63882F26581l380o14K702O160Q999J1053J2854J4923J7391K0180K3130K5885K8133
63869G93997L0047L2077L4213L5814L6365L6028L5275L4212L2582L0259K7435
$$ plain form
63944 1797034 1965248 2144057 2331332 2524709 2722175 2921437 3119050 3310740 3492409
63935 3492409 3660291 3810346 3938338 4040890 4116160 4163441 4182384 4172735 4134430 4067745 3973566
63924 3973566 3853819 3711682 3551296 3377174 3193627 3004464 2813038 2622505 2435857
63915 2435857 2255644 2083829 1922069 1771896 1634299 1509290 1396281 1294959 1205529 1128026
63905 1128026 1061718 1005353 957788 918117 885298 857909 834454 813907 795940 780609 767726
63894 767726 756442 745449 733651 720736 707113 693313 679522 665808 652712 641320 632553 626581
63882 626581 623201 622587 625289 631449 640448 651501 664355 679278 696669 716849 739979 765864 793997
63869 793997 824044 856121 890334 926148 962513 998541 1033816 1068028 1100610 1130869 1158304
63858A158304K4349K1013J7254J2987Q361L558j447o682j1769j6086j9594k2993
63846A167255k6744l0292l2856l4631l6471l8518l9986m0392m0213m0049l9826
63835G67277l9189l8039l6320l3857l0847k8000k5755k3786k1751j9960j8783
63824D50990j7926j6903j5864j5091j4144j2347j0067q558q356q632q366p451
63812C07285o332n204m064l040k273j697j353j513k128k526k205j694j996l201
63798B68059m283m370l682k969k531k191j904j832j942j984j893j816j698j286
63784B33678o53l63p56j372j478j014o06o88j040j235j218j169j035n86J45P57
63768B21367R25Q17Q35J013Q83J12r18j478j354r65o40j73O13J303J326P71K59
$$ plain form
63858 1158304 1182653 1203666 1220920 1233907 1242268 1245826 1244379 1237697 1225928 1209842 1190248 1167255
63846 1167255 1140511 1110219 1077363 1042732 1006261 967743 927757 887365 847152 807103 767277
63835 767277 728088 690049 653729 619872 589025 561025 535270 511484 489733 469773 450990
63824 450990 433064 416161 400297 385206 371062 358715 348648 340090 331734 323102 314736 307285
63812 307285 300953 295749 291685 288645 286372 284675 283322 281809 279681 277155 274950 273256 271260 268059
63798 268059 263776 259406 255724 252755 250224 248033 246129 244297 242355 240371 238478 236662 234964 233678
63784 233678 233025 232662 231906 230534 229056 228042 227436 226748 225708 224473 223255 222086 221051 220465 220610 221367
63768 221367 222292 223109 223944 224957 225840 225952 225034 223556 222202 221237 220597 220424 221037 222340 223666 224437 224696
63751B24696J30J45kk38k53K07J127K109K499K020J234R75J347J704J641J490
63735B40831J642J925J975J883K038K530L051L323L334L214L108L132L308L495
63721B78789L483L156K555J841J168N90J02k11k67l06p96j708k240j703n15J92
63705B84130j00q77j421j518j243p23k16M9L06J031K146L014L328L440L562L380
63689B98288K794K346K392K458J975J179O79M99K66J6Q4M06N37L50J33O1N1J07
63671C14621L91Q76J280J312Q74J62k61J20R74J110k08k245l581l681l177k825
63655C05742k860l234l746l918l324k247j520j541j801j542o17N32J402J880K168
63640B85374K390K408K153K079K774M061M996N112N066N602O461O945P095P491
$$ plain form
63751 224696 224826 224971 224969 224731 224478 224685 225812 227921 230420 232440 233674 234649 235996 237700 239341 240831
63735 240831 242473 244398 246373 248256 250294 252824 255875 259198 262532 265746 268854 271986 275294 278789
63721 278789 282272 285428 287983 289824 290992 291582 291684 291473 291206 290900 290104 288396 286156 284453 283938 284130
63705 284130 284030 283153 281732 280214 278971 278248 278032 278081 278387 279418 281564 284578 287906 291346 294908 298288
63689 298288 301082 303428 305820 308278 310253 311432 312111 312610 312876 312892 312976 313382 313919 314269 314402 314463 314514 314621
63671 314621 315012 315888 317168 318480 319354 319516 319255 319375 320349 321459 321251 319006 315425 311744 308567 305742
63655 305742 302882 299648 295902 291984 288660 286413 284893 283352 281551 280009 279392 279924 281326 283206 285374
63640 285374 287764 290172 292325 294404 297178 301239 306235 311347 316413 322015 328476 335421 342516 350007
63626C50007Q287R233J0394J1984J3644J4765J5512J6638J8355K0162K1784K3439
63614E34204K5082K6295K7065K7861K8706K8988K8401K7295K5771K3260J9368
63603H22296J4487R282M230l6k838m296n420o868q284r294j0317j1845j3656j5420
63589G62021j7380j9652k1464k2042k1793k1758k2099k1973k0770j8777j6595
63578E37718j4563j2718j0864q706o245l934k130o87O31J703K433L146M109N091
63564D94984N946P161R127J1278J2822J3989J5619J7741J9590K0993K2731K5353
63552F77334K8527L1745L4782L7209L8358L8080L6700L3871K8376J9766R548P4
63540A014370p183j1838j3842j3606j2423j1721j1789j1899j1653j1573j2340
$$ plain form
63626 350007 358294 367527 377921 389905 403549 418314 433826 450464 468819 488981 510765 534204
63614 534204 559286 585581 612646 640507 669213 698201 726602 753897 779668 802928 822296
63603 822296 836783 846065 850295 850259 847421 843125 837705 830837 822553 813259 802942 791097 777441 762021
63589 762021 744641 724989 703525 681483 659690 637932 615833 593860 573090 554313 537718
63578 537718 523155 510437 499573 490867 484622 480688 478558 477871 478502 480205 482638 485784 489893 494984
63564 494984 500930 508091 517218 528496 541318 555307 570926 588667 608257 629250 651981 677334
63552 677334 705861 737606 772388 809597 847955 886035 922735 956606 984982 1004748 1014296 1014370
63540 1014370 1007187 995349 981507 967901 955478 943757 931968 920069 908416 896843 884503
63529H84503j4165j6921k0304k3630k6095k7566k8635k9635l0030k9209k7504
63518F10809k5899k4817k3734k2042j9862j7835j6332j5159j3902j2430j0965
63507D07832r779q869p990p008o074n411m982m552l994l371k755k172j742j611
63493C37522j601j210j88R90J565J326Q10O45R59J535K216K912L376L321K890
63478C57068K742L401M509N009M256K739J469P89K09o66j594k259k810l407l684
63463C67771l262k530k235k429k423j847j059l78M33J585K704L363L803M693O289
63448C74478Q189R811J0951J1931J3356J5556J8195K0575K2463K4248K6279K8378
63436E84410L0117L1085L0650K8000K3049J6978J1409P209M460L261L819N879
$$ plain form
63529 884503 870338 853417 833113 809483 783388 755822 727187 697552 667522 638313 610809
63518 610809 584910 560093 536359 514317 494455 476620 460288 445129 431227 418797 407832
63507 407832 398053 389184 381194 374186 368112 362701 357719 353167 349173 345802 343047 340875 339133 337522
63493 337522 335921 334711 334523 335513 337078 338404 339214 339859 340818 342353 344569 347481 350857 354178 357068
63478 357068 359810 363211 367720 372729 376985 379724 381193 381982 382191 381525 379931 377672 374862 371455 367771
63463 367771 364509 361979 359744 357315 354892 353045 351986 351608 352041 353626 356330 359693 363496 368189 374478
63448 374478 382667 392478 403429 415360 428716 444272 462467 483042 505505 529753 556032 584410
63436 584410 614527 645612 676262 704262 727311 744289 755698 762907 767367 770628 774447 780326
63424G80326Q699J1829J5383J9420K3476K6889K9280L0497L0388K8835K5906K1803
63412A052731J6748J1058N242p2m362p404r332j0480j1132j1557j2221j3736j6367
63399I89116j9715k3083k6083k8734l1071l2878l3721l3254l1638k9695k8279
63388F70965k7313k5829k3223k0059j7225j4772j2206r572p402n698l828j552
63376E02286O43K452M291O491Q658J0376J1997J4112J6519J8462J9799K1280K3585
63363F60951K6513K9313L1475L2979L4023L4709L4998L4749L3756L1711K8288
63352A013465K3413J7530J1457N888J126k786n882q322j0337j2003j3238j4235
63340A006076j5579j7658k0176k2557k4721k6961k9042l0071k9474k7798k6047
$$ plain form
63424 780326 789025 800854 816237 835657 859133 886022 915302 945799 976187 1005022 1030928 1052731
63412 1052731 1069479 1080537 1085779 1085707 1081345 1073941 1064609 1054129 1042997 1031440 1019219 1005483 989116
63399 989116 969401 946318 920235 891501 860430 827552 793831 760577 728939 699244 670965
63388 670965 643652 617823 594600 574541 557316 542544 530338 520766 513364 507666 503838 502286
63376 502286 502929 505381 509672 516163 524821 535197 547194 561306 577825 596287 616086 637366 660951
63363 660951 687464 716777 748252 781231 815254 849963 884961 919710 953466 985177 1013465
63352 1013465 1036878 1054408 1065865 1071753 1072879 1070093 1064211 1055889 1045552 1033549 1020311 1006076
63340 1006076 990497 972839 952663 930106 905385 878424 849382 819311 789837 762039 735992
63329G35992k4444k2289j9110j5504j2517j0385q385n999l917l518n445q979j2863
63316E82637j6340j9196k1108k1535k0328j8091j5731j3795j2375j1305j0312
63305D02521r108p689o433n630n067m334l490l016l048l113k748k107j685j738
63291C43315k158k668k906k613k001j680j884k066j654r27n88o51m59J60N00j6
63275C21704r44j400j143p03o24q73r76n66Q8K27m77j201o96J130K889L348K835
63258C22618K559K894L117K666J963J777K253K943L498L984M524M954N058N038
63244C69846N444O494P711Q551R197J0254J1799J3240J4164J4778J5333J5741
63232E02552J6027J6650J7862J9140J9708J9381J8528J7559J6788J6517J6824
$$ plain form
63329 735992 711548 689259 670149 654645 642128 631743 623358 617359 613442 609924 604479 595500 582637
63316 582637 566297 547101 525993 504458 484130 466039 450308 436513 424138 412833 402521
63305 402521 393413 385724 379291 373661 368594 364260 360770 357754 354706 351593 348845 346738 345053 343315
63291 343315 341157 338489 335583 332970 330969 329289 327405 325339 323685 322758 322170 321519 321060 321220 321720 321704
63275 321704 320760 319360 318217 317514 316890 316017 315041 314475 314563 314790 314313 313112 312416 313546 316435 319783 322618
63258 322618 325177 328071 331188 333854 335817 337594 339847 342790 346288 350272 354796 359750 364808 369846
63244 369846 375290 381784 389495 398046 407243 417497 429296 442536 456700 471478 486811 502552
63232 502552 518579 535229 553091 572231 591939 611320 629848 647407 664195 680712 697536
63221F97536J7406J7911J8227J8223J7693J6820J6166J5713J4552J2047Q782N577
63209H76653K148k267p334j1848j5333j8341k1084k2935k3582k3651k3678k3306
63197F85442k1973j9796j7305j4850j2626j0688q599n730k321M01J752K627M308
63184E80642O719Q624R341R429R762J0552J1428J2005J2161J2070J2068J2350
63172G07151J2786J3108J3164J2781J1606R350O209K783m58l446o311r054j1571
63159G58098j3856j6073j8204j9792k0303j9853j9260j9066j8878j8098j6938
63148E57777j6074j5448j4303j2456j0764r947r612q887p542o042m873m232m011
63135D33586l752k924j597m74M3L99J097J823J888J272O93Q31J841L387M700M974
$$ plain form
63221 697536 714942 732853 751080 769303 786996 803816 819982 835695 850247 862294 871076 876653
63209 876653 878801 876534 869200 857352 842019 823678 802594 779659 756077 732426 708748 685442
63197 685442 663469 643673 626368 611518 598892 588204 579605 573875 571554 571955 573707 576334 580642
63184 580642 587361 595985 605326 614755 624517 635069 646497 658502 670663 682733 694801 707151
63172 707151 719937 733045 746209 758990 770596 779946 786155 788938 788480 785034 778723 769669 758098
63159 758098 744242 728169 709965 690173 669870 650017 630757 611691 592813 574715 557777
63148 557777 541703 526255 511952 499496 488732 478785 469173 460286 452744 446702 441829 437597 433586
63135 433586 429834 426910 425313 424839 424882 425281 426378 428201 430089 431361 432054 432885 434726 438113 442813 447787
63119D47787M185L311L219L595L536K907K375K308K370K273K161K100J876J454
63105D85457J121R20N75J67K83J104J836J660Q22K37K09J48l97j056j181p38k54
63088D90913n3R7N29J132J548J781K268L220M175M515M298M221M697N303N398
63073E34042N080N207O359P998Q919Q571P747P856R479J1869J3845J5040J6119
63060F58131J7900K0419K2921K4678K5766K7024K9192L2172L5222L7811M0091
63049I71327M2420M4625M5979M5947M4888M3922M4040M5240M6573M7046M6459
63038A468466M5320M4157M3123M2189M1296M0176L8212L4733K9540K3066J6027
63027A866305Q801J096p556j6932k5992l3896m0826m7310n2975n6688n7941n7422
$$ plain form
63119 447787 451972 455283 458502 462097 465633 468540 470915 473223 475593 477866 480027 482127 484003 485457
63105 485457 486578 487498 488073 488240 488523 489627 491463 493123 493945 494182 494391 494539 494142 493086 491905 491167 490913
63088 490913 490860 490957 491486 492618 494166 495947 498215 501435 505610 510125 514423 518644 523341 528644 534042
63073 534042 539122 544329 550688 558686 567605 576176 583923 591779 601258 613127 626972 642012 658131
63060 658131 676031 696450 719371 744049 769815 796839 826031 858203 893425 931236 971327
63049 971327 1013747 1058372 1104351 1150298 1195186 1239108 1283148 1328388 1374961 1422007 1468466
63038 1468466 1513786 1557943 1601066 1643255 1684551 1724727 1762939 1797672 1827212 1850278 1866305
63027 1866305 1875106 1876202 1868646 1851714 1825722 1791826 1751000 1703690 1650715 1594027 1536086 1478664
63015A478664n5982n3665n0146m5577m0545l5503l0654k6108k1710j6989j1739
63004A090046o468j855K098N932R828J3327J5939J7688J8957K0084K1160K2036
62992A228772K2458K2306K1713K0901K0024J9189J8385J7214J4948J1222O468
62981A423600J424l672r065j4756k0203k4850k8688l2096l5218l7747l9290l9871
62969A139568l9849l9371l8105l5807l2930l0284k8172k6286k4470k3039k2115
62958G99140k1160j9598j7630j6019j5239j5066j4972j4644j4207j3950j3846
62947F22809j3445j2541j1685j1547j1804j1335r655p558o126n674n868o158n929
62934E03484m884l669l327l752l636k385j100q78j182r01j98Rk72l52l82j095
$$ plain form
63015 1478664 1422682 1369017 1318871 1273294 1232749 1197246 1166592 1140484 1118774 1101785 1090046
63004 1090046 1083578 1081723 1083821 1089753 1099581 1112908 1128847 1146535 1165492 1185576 1206736 1228772
62992 1228772 1251230 1273536 1295249 1316150 1336174 1355363 1373748 1390962 1405910 1417132 1423600
62981 1423600 1425024 1421352 1412287 1397531 1377328 1352478 1323790 1291694 1256476 1218729 1179439 1139568
62969 1139568 1099719 1060348 1022243 986436 953506 923222 895050 868764 844294 821255 799140
62958 799140 777980 758382 740752 724733 709494 694428 679456 664812 650605 636655 622809
62947 622809 609364 596823 585138 573591 561787 550452 540797 533239 527113 521439 515571 509413 503484
62934 503484 498600 494931 491604 487852 484216 481831 480731 479853 478671 477770 477572 477581 477309 476957 476575 475480
62918D75480k259k776k380j891j705j350p85p82j535k154k061j845k082k319j986
62903D47570j433j278j369j147n63N1N47P96M42n16j286j081r1Q49J232J067N14
62886D44304j13l04J38P45J015J104J397J698J537J050Q63J123J251P83q7r42
62870D55562j652k243k565k446k026j665j466j084k18Q20J238O48l64q48m86K35
62854D41440P49R20Q89Q37Q85J000R89Q37Q90J220J134k6j669k454k060j600j907
62837D42074k348j946q80r5O5mq8l62p80r40o38n9O10J312J939K310K448K533
62819D45151K661K826L083L437L748L938M156M432M437L909L225L133L876M904
62805D96916N447N222M587M209M598N793P370Q722R394R357R195R846J1765J4371
$$ plain form
62918 475480 473221 470445 468065 466174 464469 463119 462334 461552 460017 457863 455802 453957 451875 449556 447570
62903 447570 446137 444859 443490 442343 441780 441831 442378 443174 443616 443100 441814 440733 440642 441491 442723 443790 444304
62886 444304 444191 443887 444025 444770 445785 446889 448286 449984 451521 452571 453434 454557 455808 456591 456504 455562
62870 455562 453910 451667 449102 446656 444630 442965 441499 440415 440197 441017 442255 442903 442539 441691 441205 441440
62854 441440 442189 443109 443998 444835 445720 446720 447709 448546 449436 450656 451790 451764 450095 447641 445581 443981 442074
62837 442074 439726 437780 436900 436805 436870 436866 436778 436416 435636 434696 434058 433999 434609 435921 437860 440170 442618 445151
62819 445151 447812 450638 453721 457158 460906 464844 469000 473432 477869 481778 485003 488136 492012 496916
62805 496916 502363 507585 512172 516381 520979 526772 534142 542864 552258 561615 570810 580656 592421 606792
62791F06792J6755J8879K1534K5028K8654L1825L5041L9153M4104M9005N3299
62780I70069N7236O1246O5245O8611P0685P1233P0507O8714O5592O0811N4605
62769A684554M7453L9117K8915J7101N121n977j6543k7124l7140m5605n2512n8438
62757A578922o3259o6282o7445o7385o6508o4795o2425n9729n6629n2950m9140
62746I02375m5807m2635l8785l4340l0362k7404k4956k2583k0521j8805j6825
62735E79352j4362j2217j1089j0500r443p706n912m620l879l395k709j549k85
62722D91686L12J14mP96K330L894N269O637P855Q529Q738R086J0050J1672J3895
62707E80859J6786K0303K4071K7527L0270L2330L4107L5948L7803L9585M1682
$$ plain form
62791 606792 623547 642426 663960 688988 717642 749467 784508 823661 867765 916770 970069
62780 970069 1027305 1088551 1153796 1222407 1293092 1364325 1434832 1503546 1569138 1629949 1684554
62769 1684554 1732007 1771124 1800039 1817140 1822261 1816284 1799741 1772617 1735477 1689872 1637360 1578922
62757 1578922 1515663 1449381 1381936 1314551 1248043 1183248 1120823 1061094 1004465 951515 902375
62746 902375 856568 813933 775148 740808 710446 683042 658086 635503 614982 596177 579352
62735 579352 564990 552773 541684 531184 521741 514035 508123 503503 499624 496229 493520 491971 491686
62722 491686 491998 492112 492108 492904 495234 499128 504397 511034 518889 527418 536156 545242 555292 566964 580859
62707 580859 597645 617948 642019 669546 699816 732146 766253 802201 840004 879589 921271
62696I21271M4571M7723M9623M9267M7163M4394M1162L6911L1440K5160J8378
62685A357063J1059L260m789j3021k1312k8942l4981l9300m2611m5303m6940m7192
62673A046991m6577m5793m4727m2807m0059l7208l4822l2753l0523k7930k5246
62662F38546k2960k1286j9812j7829j5134j2342j0208q889q128p762p643p301
62650D79252o428n547n486o079o178n189l902l353l422l236k452j467n97J68O77
62635D26761N87m3o97j092j440j925k356k497k380k082j540q01o8N42J054J346
62619D13369J323J391K210L642M543M105K948K404K990M130N125N753O111O462
62605D66506P312R072J1512J3885J5778J7479J9406K1535K3571K5464K7463K9708
$$ plain form
62696 921271 965842 1013565 1063188 1112455 1159618 1204012 1245174 1282085 1313525 1338685 1357063
62685 1357063 1368122 1371382 1366593 1353572 1332260 1303318 1268337 1229037 1186426 1141123 1094183 1046991
62673 1046991 1000414 954621 909894 867087 827028 789820 754998 722245 691722 663792 638546
62662 638546 615586 594300 574488 556659 541525 529183 518975 510086 501958 494196 486553 479252
62650 479252 472824 467277 461791 455712 449534 444345 440443 437090 433668 430432 427980 426513 425916 426084 426761
62635 426761 427348 427305 426608 425516 424076 422151 419795 417298 414918 412836 411296 410495 410427 410969 412023 413369
62619 413369 414692 416083 418293 421935 426478 430583 433531 435935 438925 443055 448180 453933 460044 466506
62605 466506 473818 482890 494402 508287 524065 541544 560950 582485 606056 631520 658983 688691
62593F88691L1898L3437L3907L3448L2532L1269K9090K5355K0251J4776R733M954
62581I89341l16o324j2344j7345k1061k4069k6844k9092l0273l0507l0396l0129
62569G30641k9322k7820k6054k4396k2673k0681j8661j6943j5464j4031j2678
62558E01918j1404r936q199o661n748n237m672m074l703l435k930k245j696j293
62544D30685q45m75m41o14o90p34r41j045o76j79l02j019j380o49R78K822M282
62527D28777M931M807M716N613P468R354J0786J2219J4086J6024J7537J8787K0317
62514E75422K2388K4875K7331K9015K9428K9077K8996K9185K8291K5355K1195
62503H70558J7321J4082J0710O801K861n17l229n324o729p400p332o368m301j306
$$ plain form
62593 688691 720589 754026 787933 821381 853913 885182 914272 939627 959878 974654 984387 989341
62581 989341 989025 982701 970357 953012 931951 907882 881038 851946 821673 791166 760770 730641
62569 730641 701319 673499 647445 623049 600376 579695 561034 544091 528627 514596 501918
62558 501918 490514 480578 472379 465718 459970 454733 450061 445987 442284 438849 435919 433674 431978 430685
62544 430685 429840 429365 428924 428310 427620 426886 425945 424900 424224 424045 423743 422724 421344 420695 421673 424495 428777
62527 428777 433708 438515 443231 448844 456312 465666 476452 488671 502757 518781 536318 555105 575422
62514 575422 597810 622685 650016 679031 708459 737536 766532 795717 824008 849363 870558
62503 870558 887879 901961 912671 919472 922333 921816 918587 913263 906534 899134 891802 885434 881133 879827
62489H79827K038N182P924J0369J2773J5326J7848J9788K0717K0640J9678J7617
62477A049727J4127R317L847j525o405j0910j5494k0476k5598l0164l3708l6226
62465H96512l7810l8416l8219l7661l6783l5007l1974k8317k4987k2219j9682
62454E45437j7336j5352j3353j0627p357m750l516k863j609J71J353J470J388
62441D73056K155L698N100N757N824N651N286M584L448J831k06k271l838m799
62427E05276n592o514p275p522p440p382p260o819o336o271o433o158n392m799
62413D14083m619m244l264k237j903k150k271j888j161l82J73K44j18m63m10l3
62397C89357M51J041J685K080K140K258K731L234L346L279L509L881L767L132
$$ plain form
62489 879827 881865 887047 894971 905340 918113 933439 951287 971075 991792 1012432 1032110 1049727
62477 1049727 1063854 1073171 1077018 1075493 1069088 1058178 1042684 1022208 996610 966446 932738 896512
62465 896512 858702 820286 782067 744406 707623 672616 640642 612325 587338 565119 545437
62454 545437 528101 512749 499396 488769 481412 476662 473146 470283 468674 468845 470198 471668 473056
62441 473056 475211 478909 484009 489766 495590 501241 506527 511111 514559 516390 516184 513913 510075 505276
62427 505276 499684 493170 485895 478373 470933 463551 456291 449472 443136 436865 430432 424274 418882 414083
62413 414083 409464 405220 401956 399719 397816 395666 393395 391507 390346 389964 390137 390381 390263 389800 389390 389357
62397 389357 389808 390849 392534 394614 396754 399012 401743 404977 408323 411602 415111 418992 422759 425891
62383D25891K848L756N689P657Q834R231R437R810J0125J0160J0264J0899J1843
62370E36444J2535J3229J4900J7761K0747K3052K5382K8910L3563L8178M1979
62359H06680M5066M7689M9873N1658N3004N3474N2510M9940M5787L9891L2345
62348A327917K3998J5867Q246R78n765j1744j7404k3322k9083l3651l6827l9256
62336A179954m0980m1170l9645l7527l5791l4078l1587k8476k5625k3501k1946
62325H19628k0715j9679j8735j8005j7821j8182j8480j8206j7623j7305j7265
62314F17612j6980j6163j5045j3985j3086j2252j1341j0268r120q090p258o443
62302D77581n405m100k736j628r24l98L79J400J989J619P82N64J386K641L611
$$ plain form
62383 425891 428739 432495 438184 445841 454675 463906 473343 483153 493278 503438 513702 524601 536444
62370 536444 548979 562208 577108 594869 615616 638668 664050 692960 726523 764701 806680
62359 806680 851746 899435 949308 1000966 1053970 1107444 1159954 1209894 1255681 1295572 1327917
62348 1327917 1351915 1367782 1376028 1377006 1371241 1359497 1342093 1318771 1289688 1256037 1219210 1179954
62336 1179954 1138974 1097804 1058159 1020632 984841 950763 919176 890700 865075 841574 819628
62325 819628 798913 779234 760499 742494 724673 706491 688011 669805 652182 634877 617612
62314 617612 600632 584469 569424 555439 542353 530101 518760 508492 499372 491282 484024 477581
62302 477581 472176 468076 465340 463712 462788 462390 462769 464169 466158 467777 468559 469123 470509 473150 476761
62287D76761M143M378M381M303M385M555M361L630K787K413K768L803N222O442
62273E34332P013P238P904R305J1083J3061J5447J8065K0340K2456K5569L0142
62261G21955L4989L8788M1861M5409M9542N3211N5731N7202N7523N6118N2786
62250A265115M7840M1355L3143K3738J4387N789k392j0384j7545k3339k8373l3691
62238A315643l9386m4557m8349n0553n1267n0562m8543m5445m1635l7547l3556
62227H24243k9692k5705k1506j7402j3775j0730q214o259m883l966l418l252l360
62214F72081l467l549l979m978o123o843p188p679q463r098r208q886q323p470
62200E76827o326n209m387l649k609j291o5R47K041L435M891O009O665O990P089
$$ plain form
62287 476761 480904 485282 489663 493966 498351 502906 507267 510897 513684 516097 518865 522668 527890 534332
62273 534332 541345 548583 556487 565792 576875 589936 605383 623448 643788 666244 691813 721955
62261 721955 756944 795732 837593 883002 932544 985755 1041486 1098688 1156211 1212329 1265115
62250 1265115 1312955 1354310 1387453 1411191 1425578 1431367 1428975 1418591 1401046 1377707 1349334 1315643
62238 1315643 1276257 1231700 1183351 1132798 1081531 1030969 982426 936981 895346 857799 824243
62227 824243 794551 768846 747340 729938 716163 705433 697219 690960 686077 682111 678693 675441 672081
62214 672081 668614 665065 661086 656108 649985 643142 635954 628275 619812 610714 601506 592620 584297 576827
62200 576827 570501 565292 560905 557256 554647 553356 553291 554238 556279 559714 564605 570614 577279 584269 591358
62185E91358P057P158P675Q532R320R700R669R322Q741Q281Q626J0161J2423J4621
62171G22644J6683J9364K3148K7484L1375L4399L6779L8683L9896M0044L8773
62160A069272L5747L0928K4914J8545J2180N711o26o104j0403j4116j7978k1943
62148A126127k5539k8664l1378l3230l3622l2813l1735l0695k9014k6197k2767
62137H00473j9499j6512j3653j1240r642q414o673m337k325j390j217q86J63J796
62123G06644L600N324O964Q498R583R696Q684O969N085L216J410q4j046j658k249
62108G70636k864l547m782o916r245j0404r895q599p493o497m992k905p22J254
62094F93029L073M750O174P334Q290Q968R247R198R041R053R623J1046J2948J4342
$$ plain form
62185 591358 598415 605573 613248 621780 631100 640800 650469 659791 668532 676813 685439 695600 708023 722644
62171 722644 739327 758691 781839 809323 840698 875097 911876 950559 990455 1030499 1069272
62160 1069272 1105019 1135947 1160861 1179406 1191586 1197297 1196671 1190567 1180164 1166048 1148070 1126127
62148 1126127 1100588 1071924 1040546 1007316 973694 940881 909146 878451 849437 823240 800473
62137 800473 780974 764462 750809 739569 729927 721513 714840 710503 708178 706788 705571 704685 704848 706644
62123 706644 710244 715568 722532 731030 740613 750309 758993 765962 771047 774263 775673 775589 774543 772885 770636
62108 770636 767772 764225 759443 752527 743282 732878 722983 714384 706891 700394 695402 692497 691775 693029
62094 693029 696102 700852 707026 714360 722650 731618 740865 750063 759104 768157 777780 788826 801774 816116
62080H16116J4719J4844J5896J7991K0236K2090K3844K5631K6888K7289K7554
62069A053098K8564L0062L0932L0677K9899K9315K8865K7987K6261K3498J9584
62058A358742J4612R013L302k247p464j2073j5867j8995k1808k4527k7257l0209
62046A225222l3519l6735l8914l9481l8891l8208l7984l7776l6795l4994l3158
62035H18767l1840l0541k8366k5433k2928k1550k0580j8956j6714j4611j2854
62024E74394j1198j0005r993j0783j0902r705q266p745p813p468o599n742m925
62011D63250l838k709j950j125N61K790M179M073L382L322M034M812N089M820
61997D90690M295L893L711L373K510J431Q05P19N03l38j563k658l350l609l611
$$ plain form
62080 816116 830835 845679 861575 879566 899802 921892 945736 971367 998255 1025544 1053098
62069 1053098 1081662 1111724 1142656 1173333 1203232 1232547 1261412 1289399 1315660 1339158 1358742
62058 1358742 1373354 1382367 1385669 1383422 1375958 1363885 1348018 1329023 1307215 1282688 1255431 1225222
62046 1225222 1191703 1154968 1116054 1076573 1037682 999474 961490 923714 886919 851925 818767
62035 818767 786927 756386 728020 702587 679659 658109 637529 618573 601859 587248 574394
62024 574394 563196 553191 543198 532415 521513 511808 503542 495797 487984 480516 473917 468175 463250
62011 463250 459412 456703 454753 453628 454189 456979 461158 465231 468613 471935 475969 480781 485870 490690
61997 490690 494985 498878 502589 505962 508472 509903 510708 511427 511930 511592 510029 507371 504021 500412 496801
61982D96801l767m296m766m592l987l671l655l182k144j609k383l746m292l517
61968D47194k091q92l58m20o34o41o51j153j975k261j639p21o0O49J757K789L172
61951D42065L229L698M658N726O865Q209R423J0177J0964J2531J4671J6450J7606
61938E66272J8738K0071K0953K0825J9894J8636J7243J5883J4833J3995J2780
61927G60123J0806Q331N754L109L22k341m432n760o523p090p678q028p489n731
61913G33373l276r27J270L858O798R222J0566J1253J1810J1836J0587Q188N567
61900H20125L202O08k736o514r953j2695j4839j6333j6889j6653j6396j6625j6841
61887F77461j6225j4890j3774j3283j2754j1574j0192r450r380r306q811q012
$$ plain form
61982 496801 493034 488738 483972 479380 475393 471722 468067 464885 462741 461132 458749 455003 450711 447194
61968 447194 445103 444211 443853 443433 442799 442158 441507 440354 438379 436118 434479 433758 433698 434347 436104 438893 442065
61951 442065 445294 448992 453650 459376 466241 474450 483873 494050 505014 517545 532216 548666 566272
61938 566272 585010 605081 626034 646859 666753 685389 702632 718515 733348 747343 760123
61927 760123 770929 779260 785014 788123 788445 786104 781672 775912 769389 762299 754621 746593 739104 733373
61913 733373 730097 729170 730440 734298 741096 750318 760884 772137 783947 795783 806370 814558 820125
61900 820125 823327 823935 821199 814685 804732 792037 777198 760865 743976 727323 710927 694302 677461
61887 677461 661236 646346 632572 619289 606535 594961 584769 575319 565939 556633 547822 539810
61875E39810p052n936m869m164l761l203k176p48Q46K341L481M245N039O270P931
61860E38054R836J2080J4691J7158J8903K0161K1738K3869K5968K7607K9045L0517
61848G89627L1646L1918L1325L0195K8631K6380K3142J8881J4021R258M948Q31
61836A040803l280o767q760r253q919p982o114l560j262N07K635N649Q463R498
61822A011658Q504O433L898P04l226p352j1146j4679j8367k2405k6395k9417l0603
61809H67607l0028k8858k8238k8129k7587k6011k3702k1275j9013j6918j5018
61798F02830j3472j2421j1772j1115j0015q590p512p140o925o034m492l183k807
61785D97352l121l309k778j540j50P11P41K49k50n67p87q91p65n64o48j076j390
$$ plain form
61875 539810 532758 526822 521953 517789 514028 510825 508649 507901 508747 511088 514569 518814 523853 530123 538054
61860 538054 547890 559970 574661 591819 610722 630883 652621 676490 702458 730065 759110 789627
61848 789627 821273 853191 884516 914711 943342 969722 992864 1011745 1025766 1035024 1039972 1040803
61836 1040803 1037523 1030756 1021996 1012743 1003824 995842 989728 986168 984906 985413 988048 993697 1002160 1011658
61822 1011658 1020162 1026595 1030493 1031197 1027971 1020619 1009473 994794 976427 954022 927627 898210 867607
61809 867607 837579 808721 780483 752354 724767 698756 675054 653779 634766 617848 602830
61798 602830 589358 576937 565165 554050 544035 535445 527933 520793 513868 507834 503342 500159 497352
61785 497352 494231 490922 488144 486604 486454 487165 487906 488155 487905 487338 486551 485660 484895 484331 483683 482607 481217
61768D81217j093j61R17J480J126P5q66r43j64P80J332J515J600J692J779J886
61752D92172J901J520O77j61m52l16m36j187k129k506k032j045r5M64O00N71P65
61735D88311J298J767J629Q88J84N4L31M57K76K12O88J607K490K964L004K798
61719E08958K488K052J490J080J224J895K405K037R00j92o74q21j288k308l498
61704E15748m309m462m065l476k995k639k248j824j629j825k190k334k174k042
61690D77536k314k901l238k840j843q96m82n42q27j233j622j645j247j102j873
61675D52931l122l593k854j965k047k765k876k041j250j438k267k637j994q01
61661D21281P2J45m31j097j328j019n59l31k29J64Q68J367J410J529K299L257
$$ plain form
61768 481217 480124 479963 480880 482360 483486 483561 482695 481752 481588 482368 483700 485215 486815 488507 490286 492172
61752 492172 494073 495593 496270 496109 495657 495341 494905 493718 491589 489083 487051 486006 485911 486375 486975 487546 488311
61735 488311 489609 491376 493005 493893 494077 494131 494462 494919 495195 495407 496095 497702 500192 503156 506160 508958
61719 508958 511446 513498 514988 516068 517292 519187 521592 523629 524529 524337 523663 522842 521554 519246 515748
61704 515748 511439 506977 502912 499436 496441 493802 491554 489730 488101 486276 484086 481752 479578 477536
61690 477536 475222 472321 469083 466243 464400 463504 463022 462480 461653 460420 458798 457153 455906 454804 452931
61675 452931 449809 446216 443362 441397 439350 436585 433709 431668 430418 428980 426713 424076 422082 421281
61661 421281 421353 421498 421067 419970 418642 417623 417064 416733 416504 416668 417536 418903 420313 421842 424141 427398
61645D27398L328K339J411J499K178K398J889J147M52l04j035j478j756k233k815
61630D34418l116l262l763m424m321l216k203k349l261l631k845j513o03n18r64
61615C94429j331j285j096j295j978k770l452m112m606m511l883l441l601l880
61601C53188l790l694m177m990n381n232n043n001m735m033l200k621k386k418
61587B96487k546k467j981j290p77n39l51QO00J314J713J234j21j499k060j893
61571B85832j626j482j203p48l85k12j29j91m74p04o00m16n69q34o81k51j35k17
61553B74975K84J441K265K147J724J773K010J740J079O55N34K93m8RN15Q80P61
61536B93037N88R19J643K159K075J530Q66K53l17p82r49p42m50m74q71j329j601
$$ plain form
61645 427398 430726 433065 434476 435975 438153 440551 442440 443587 444039 443735 442700 441222 439466 437233 434418
61630 434418 431302 428040 424277 419853 415532 412316 410113 407764 404503 400872 398027 396514 395911 395393 394429
61615 394429 393098 391813 390717 389422 387444 384674 381222 377110 372504 367993 364110 360669 357068 353188
61601 353188 349398 345704 341527 336537 331156 325924 320881 315880 311145 307112 303912 301291 298905 296487
61587 296487 293941 291474 289493 288203 287426 286887 286536 286544 287144 288458 290171 291405 291284 289785 287725 285832
61571 285832 284206 282724 281521 280773 280388 280176 280047 279856 279382 278678 278078 277662 277093 276259 275578 275327 275192 274975
61553 274975 275259 276700 278965 281112 282836 284609 286619 288359 289438 290093 290627 290920 290872 290881 291396 292276 293037
61536 293037 293625 294544 296187 298346 300421 301951 302817 303070 302753 301971 301022 300280 299830 299356 298485 297156 295555
61519B95555j675j532j064m16r6m19j015j213q08k37J5q8k21j19J10P5m86j305
61501B85061j794j681j313j107r29l10P45J577J626J126P67P85P23J82m97n60
61485B84401J83J097J471J316J189J427J825K046K059K043J983J577O29m43q06
61470C01997j07R40J233N21m52j022j265j358j030k09M03K00k05K99J627K495
61454C04067K200J417R39N84q4p17o28J61R97J458J544J306Q21M51O29J387K353
61437C18885L118L341K924K348K471L427M162L706K554K025K405K696K230J547
61423C57839J411J789K299K895L497L588K828J693Q33K20m06o80o2R46J105O9
61407C79864j130j537j466j757k555l358l775l570k479p63M04L2j290j922j259
$$ plain form
61519 295555 293880 292348 291284 290868 290772 290353 289338 288125 287317 287080 287095 287007 286786 286667 286777 286852 286366 285061
61501 285061 283267 281586 280273 279166 278237 277927 278672 280249 281875 283001 283768 284553 285276 285458 284961 284401
61485 284401 284584 285681 287152 288468 289657 291084 292909 294955 297014 299057 301040 302617 303246 302803 301997
61470 301997 301890 302830 304063 304584 304132 303110 301845 300487 299457 299248 299651 299851 299646 299945 301572 304067
61454 304067 306267 307684 308623 309207 309123 308406 307778 307939 308936 310394 311938 313244 314065 314516 315145 316532 318885
61437 318885 322003 325344 328268 330616 333087 336514 340676 344382 346936 348961 351366 354062 356292 357839
61423 357839 359250 361039 363338 366233 369730 373318 376146 377839 378672 378892 378486 377806 377744 378690 379795 379864
61407 379864 378734 377197 375731 373974 371419 368061 364286 360716 358237 357474 357878 357910 356620 354698 353439
61392C53439l35j38k72O8N75K34j085k342k613j934q36K69J035J140O35N5q1L26
61374C48140J087J901K322K003J253Q68J131J422J168P67R59J675K277K730L629
61359C73332M934N678N337M689M704N230N561N755O382P264P581P260P153P595
61345D58455P766P028N962N360N015M349L588L346L414L087K322J633R42l53k113
61330E09801l419l887m015m008l400k226j455j568j764j283o55p09j132r40J08
61315D79448J579L228M869N848N801N659O713Q832J0654J1527J2101J2862J3191
61302E82312J2350J0530Q424O377M369K370L86j511k992l773m144m751n712o550
61288E97685p064p601q308q754q650q341q146p750o670n055l507k364j473n42
$$ plain form
61392 353439 353104 352966 352694 352762 353337 353571 352486 350144 347531 345597 344761 345030 346065 347205 347840 347895 347814 348140
61374 348140 349227 351128 353450 355453 356706 357574 358705 360127 361295 362062 363021 364696 366973 369703 373332
61359 373332 378266 383944 389281 393970 398674 403904 409465 415220 421602 428866 436447 443707 450860 458455
61345 458455 466221 473249 479211 484571 489586 493935 497523 500869 504283 507370 509692 511325 512267 511914 509801
61330 509801 506382 502495 498480 494472 491072 488846 487391 485823 484059 482776 482121 481412 480280 479340 479448
61315 479448 481027 484255 489124 494972 500773 506432 513145 521977 532631 544158 556259 569121 582312
61302 582312 594662 605192 613616 619993 624362 626732 627118 625607 622615 618842 614698 609947 604235 597685
61288 597685 590621 583020 574712 565958 557308 548967 540821 533071 526401 521346 517839 515475 514002 513460
61274E13460M81J349J757J742J788K261K909L303L624M397N553O402O629O703
61260E62358P174Q127R348J0466J0811R865Q072O465N382M185K519R45o6r08k056
61245F42687l226l891m050l925l520l020l038l773m390l999k869k054k069k489
61231E96374k544j672J36K052K916K525J956K165K881L453M030N065O185O671
61217F32193O678O961P542P702P205O604O238N781M900L729K591J864J971K969
61203G04928M240N210O219P918J0075J1854J3110J4408J5783J6618J6849J7181
61191H44393J7676J7262J5274J2567J0383Q742O804M404K358J305Q71J00j575
61178I40564l818n771o984p858r006j0336j1241j1595j1990j2882j4053j5070
$$ plain form
61274 513460 513941 515290 517047 518789 520577 522838 525747 529050 532674 537071 542624 549026 555655 562358
61260 562358 569532 577659 587007 597473 608284 618149 626221 632686 638068 642253 644772 645717 645651 644743 642687
61245 642687 639461 635570 631520 627595 624075 621055 618017 614244 609854 605855 602986 600932 598863 596374
61231 596374 593830 592158 592294 594346 597262 599787 601743 603908 606789 610242 614272 619337 625522 632193
61217 632193 638871 645832 653374 661076 668281 674885 681123 686904 691804 695533 698124 699988 701959 704928
61203 704928 709168 714378 720597 728515 738590 750444 763554 777962 793745 810363 827212 844393
61191 844393 862069 879331 894605 907172 917555 926297 933101 937505 939863 941168 942039 942139 940564
61178 940564 936746 930975 923991 916133 907127 896791 885550 873955 861965 849083 835030 819960
61166H19960j5752j5977j5668j5204j5332j6209j6964j6556j4863j2597j0490
61155F54348q868p687o633n315l714k237j213n34%K36k22j556l475n316o346o310
61139E95158n672n077m570l719k404r95K66J489K677L671M753O579R188J1705
61125F13049J3466J4830J6420J8157J9666K1142K2983K4867K6032K6412K6738
61114H43762K7412K7962K7868K7341K6928K6594K5663K3687K1034J8479J6259
61103A112989J3859J0825P434M196R45k998p656j2130j5630j8348k0882k3349
61091A049255k5465k7091k8209k8582k8010k6777k5472k4391k3459k2609k1867
61080G67323k1122k0088j8558j6535j4196j1861r854q250o865n581m528l885l645
$$ plain form
61166 819960 804208 788231 772563 757359 742027 725818 708854 692298 677435 664838 654348
61155 654348 645480 637793 631160 625845 622131 619894 618681 618147 618147 618383 618161 616605 613130 607814 601468 595158
61139 595158 589486 584409 579839 576120 573716 572721 572987 574476 577153 580824 585577 592156 601344 613049
61125 613049 626515 641345 657765 675922 695588 716730 739713 764580 790612 817024 843762
61114 843762 871174 899136 927004 954345 981273 1007867 1033530 1057217 1078251 1096730 1112989
61103 1112989 1126848 1137673 1145107 1149303 1150248 1147250 1139594 1127464 1111834 1093486 1072604 1049255
61091 1049255 1023790 996699 968490 939908 911898 885121 859649 835258 811799 789190 767323
61080 767323 746201 726113 707555 691020 676824 664963 655109 646859 639994 634413 629885 626000 622355
61067F22355l581l208j878N43L108M478M393L936M146M974N919O911Q144R583
61053F69823J1193J3087J5000J6276J6955J8130K0431K2893K4289K4943K6058
61042H79078K7713K8953K9701L1082L3598L6207L7728L8246L8653L9558M1081
61031A261598M3072M5174M7024M8591M9939N0835N1330N2563N5975O1657O8516
61020A836274P6139Q5350R6747J10032J25413J44523J69452K02106K45104L01636
61010C392776L73142M58243N55439O65783P91119R29635J074125J214416J342026
61001A0796704J454546J554830J638821J677409J615577J406135J057613O48180
60993B1849815K83524L4986q6015j06425o4239r395j4489j54728m57008q67013
$$ plain form
61067 622355 618774 615566 613688 614231 617339 621817 626210 630146 634292 639266 645185 652096 660240 669823
61053 669823 681016 694103 709103 725379 742334 760464 780895 803788 828077 853020 879078
61042 879078 906791 935744 965445 996527 1030125 1066332 1104060 1142306 1180959 1220517 1261598
61031 1261598 1304670 1349844 1396868 1445459 1495398 1546233 1597563 1650126 1706101 1767758 1836274
61020 1836274 1912413 1997763 2094510 2204542 2329955 2474478 2643930 2846036 3091140 3392776
61010 3392776 3765918 4224161 4779600 5445383 6236502 7166137 8240262 9454678 10796704
61001 10796704 12251250 13806080 15444901 17122310 18737887 20144022 21201635 21849815
60993 21849815 22133339 22168325 22082310 21975885 21911646 21902251 21887762 21733034 21276026 20409013
60983B0409013j274131j575966j727122j740163j655532j514792j350895j186892
60975H383520j035105q98591p76407o67891n72418m88060m12944l47209k91982
60966B892913k46829k09620j78576j53130j32735j16119j01987q9552p8152o7198
60956A519015n6782m7667m0245l4197k9387k6330k5125k4639k3461k1388j9229
60945A170565j7380j5435j3171j1135r859r120q330p352o458n808n331m981m719
60932A051486m334l655k855k183j509n66L65O47K88J39P25J466J582J292J373
60917A044261J830J840J017j16j036j858k755l511l996m509n193n706n949o491
60903A007828p657q755r019q914r528j0840j1694j1476j0879j0700j0850j1007
$$ plain form
60983 20409013 19134882 17558916 15831794 14091631 12436099 10921307 9570412 8383520
60975 8383520 7348415 6449824 5673417 5005526 4433108 3945048 3532104 3184895 2892913
60966 2892913 2646084 2436464 2257888 2104758 1972023 1855904 1753917 1664365 1586213 1519015
60956 1519015 1462233 1414566 1374321 1340124 1310737 1284407 1259282 1234643 1211182 1189794 1170565
60945 1170565 1153185 1137750 1124579 1113444 1103585 1094465 1086135 1078783 1072325 1066517 1061186 1056205 1051486
60932 1051486 1047152 1043497 1040642 1038459 1036950 1036384 1036749 1037396 1037684 1037823 1038548 1040014 1041596 1042888 1044261
60917 1044261 1046091 1047931 1048948 1048832 1047796 1045938 1043183 1039672 1035676 1031167 1025974 1020268 1014319 1007828
60903 1007828 1000171 991416 982397 973483 963955 953115 941421 929945 919066 908366 897516 886509
60891H86509j1377j2187j3007j3299j3239j3318j3401j2898j1719j0494r804r691
60879G42075r860r950r640q938q399q540r003q778p431n647m345l688l300l031
60865F41525l003l122l054k754k559k746l216l774m375n005n548n897o021n792
60851E84659n021l904l194l573m907o357p169p169o602n957n817o397p133p160
60837E04299o389n639n517n681n488m889m178l369k440j800j778j848j244k23
60823D53816J37m83j135r77l39J5M1J40K80N7n62j111j206q52l24M9J09J50O35
60804D48440J459J830J242J73n96r98j395j658j279l13M31K86o92k026l169l617
60788D38118l229k555k380k766l040k821k567k831l449l860l892l779l615l188
$$ plain form
60891 886509 875132 862945 849938 836639 823400 810082 796681 783783 772064 761570 751766 742075
60879 742075 732215 722265 712625 703687 695288 686748 677745 668967 661536 655889 651544 647856 644556 641525
60865 641525 638522 635400 632346 629592 627033 624287 621071 617297 612922 607917 602369 596472 590451 584659
60851 584659 579638 575734 572540 568967 564060 557703 550534 543365 536763 530806 524989 518592 511459 504299
60837 504299 497910 492271 486754 481073 475585 470696 466518 463149 460709 458909 457131 455283 454039 453816
60823 453816 453953 453470 452335 451358 451019 451034 451075 451215 451495 451552 450990 449879 448673 447821 447497 447546 447655 447805 448440
60804 448440 449899 451729 452971 453144 452548 451550 450155 448497 447218 446905 447336 447622 446930 444904 441735 438118
60788 438118 434889 432334 429954 427188 424148 421327 418760 415929 412480 408620 404728 400949 397334 394146
60774C94146k394j496r39q90j079j038o26j81k7N2N18J261J539R15m1l15M49J635
60756C91489K355K211J493Q79R91J918L040L490K972K070J569J597J676J597J707
60741D21054K124K155J127n49j805k367k927l809m377m214l970m375n088n375
60727C87604n324n460n537m837l510k488k100j774j309j340k163l005l018k300
60713C43439j478r09q02j385k328k589j513K11J314J293M73p87k194l071k702
60698C26972j258K80J188J559J737J727J441J159J355K087K806K874K304J875
60684C48106K385L747N042N450M944M096L524L579M201M894N103M829M537M365
60670D08802L882K831J644Q78N05J90j08k90n64j205k020k485k310j593o61m4
$$ plain form
60774 394146 391752 390256 389317 388427 387348 386310 385684 385503 385476 385528 386046 387307 388846 389761 389720 389405 389854 391489
60756 391489 393844 396055 397548 398427 399418 401336 404376 407866 410838 412908 414477 416074 417750 419347 421054
60741 421054 423178 425333 426460 425911 424106 421739 418812 415003 410626 406412 402442 398067 392979 387604
60727 387604 382280 376820 371283 366446 362936 360448 358348 356574 355265 353925 351762 348757 345739 343439
60713 343439 341961 341052 340250 338865 336537 333948 332435 332646 333960 335253 335726 334939 332745 329674 326972
60698 326972 325714 325994 327182 328741 330478 332205 333646 334805 336160 338247 341053 343927 346231 348106
60684 348106 350491 354238 359280 364730 369674 373770 377294 380873 385074 389968 395071 399900 404437 408802
60670 408802 412684 415515 417159 418037 418542 418732 418624 418334 417770 416565 414545 412060 409750 408157 407496 407452
60654D07452k59j131j664j212m10l28r18j224r50q38j352j918j991k048k830m152
60638C84227n072n016m129k800j425n29m75r82j302j091p11n81o25n06j94M4N1
60621C58884j18m34r09j303j127k06R29J455J087L44m9J47N44N95J65l18l54k9
60603C59303O2l07n24J2Q52R76K33m17k93Q4q8o34p44j94L77M04J4k77j73K24
60583C58890O13Q13R83J369J822J899J526J214J405J997K799L979N575P041P826
60568C99751Q101Q286Q206P442O291N485N080M409L238K087J187L3j631l114l623
60553D51228l317k847k268j089P05K342L175L504M173N517O953P769Q018Q357
60539D92220R023R535R572R501R549R058P354N039L337K248N60k088m312m843
$$ plain form
60654 407452 407193 406062 404398 403186 402776 402448 401530 400306 399356 398518 397166 395248 393257 391209 388379 384227
60638 384227 379155 374139 370010 367210 365785 365256 364781 363799 362497 361406 360695 360114 359489 358983 358789 358833 358884
60621 358884 358766 358332 357423 356120 354993 354787 355716 357171 358258 358602 358553 358700 359244 359839 360004 359686 359332 359303
60603 359303 359365 359058 358534 358546 359398 360374 360607 360190 359897 359981 359893 359259 358515 358321 358698 359102 359116 358839 358666 358890
60583 358890 359503 360316 361299 362668 364490 366389 367915 369129 370534 372531 375330 379309 384884 391925 399751
60568 399751 407852 416138 424344 431786 438077 443562 448642 453051 456289 458376 459563 459596 457965 454851 451228
60553 451228 447911 445064 442796 441707 442412 444754 447929 451433 455606 461123 468076 475845 483863 492220
60539 492220 501243 510778 520350 529851 539400 548458 555812 560851 564188 566436 566996 564908 560596 555753
60525E55753m277m078m477m461l520k334j704j591j492j143o08l3M68R08J439
60510E28850K085K576K816L410N230Q360J1891J4924J7370J9656K2048K4591K7397
60497F91204L0474L3429L5633L6743L6700L5293L2055K6831K0163J2846N214k957
60485I93628j1764k0671k8641l4703l8404l9936l9965l9102l7467l4841l1342
60474F36792k7713k4724k2465k0447j8296j6059j3950j2107j0685r802r302q757
60462D42485p854o664n514m669m180l898l632l383l379l692l962l767l213k829
60448C81849k831k898k745k525k429k235j602o61N3K27J0l41p66j206j388j029
60432C59483k92K55K42j4P9N43P14J60o34p91j32O22O97L5p59r91m53L90Q18O94
$$ plain form
60525 555753 551476 547398 542921 538460 534940 532606 530902 529311 527819 526676 526068 526035 526503 527411 528850
60510 528850 530935 533511 536327 539737 544967 553327 565218 580142 597512 617168 639216 663807 691204
60497 691204 721678 755107 790740 827483 864183 899476 931531 958362 978525 991371 996585 993628
60485 993628 981864 961193 932552 897849 859445 819509 779544 740442 702975 668134 636792
60474 636792 609079 584355 561890 541443 523147 507088 493138 481031 470346 460544 451242 442485
60462 442485 434631 427967 422453 417784 413604 409706 406074 402691 399312 395620 391658 387891 384678 381849
60448 381849 379018 376120 373375 370850 368421 366186 364584 363923 363976 364203 364213 363872 363106 361900 360512 359483
60432 359483 359191 359446 359688 359674 359753 360296 361010 361170 360536 359745 359613 360235 360932 360967 360208 359217 358764 359154 359972 360666
60412C60666O73J273K001J937J149P08J236K056K206J650J011N50Q6l57m49j07
60396C76289L51O74Q90J018R63Q46J107J910K689K649J753Q97Q86J477J698J112
60380C97209L09N4L68P47R84J266J663J988K110K002J546P29Pp7L66P62R69J388
60362D14390K048K352K041J708J901K294K353K257K531L121L555L767M079M503
60348D52900M639M258L452K301Q84l83r91j005j051j576k394k947k772j771m78
60333D53066J34n07j905l047l519l598l442k839j906j290j447k067k503k352j521
60318D21257j59J199J915J971K084K788L764M478N058O021P361Q494R075R361
60304D84667R649R834R707R382R076Q583P269M668R81l060o689r390j0809j0756
$$ plain form
60412 360666 361339 362612 364613 366550 367699 368407 369643 371699 373905 375555 376566 377116 377202 376845 376396 376289
60396 376289 376640 377314 378204 379222 380185 381031 382138 384048 386737 389386 391139 392036 392922 394399 396097 397209
60380 397209 397518 397572 397940 398687 399671 400937 402600 404588 406698 408700 410246 410975 410982 410905 411271 412033 413002 414390
60362 414390 416438 418790 420831 422539 424440 426734 429087 431344 433875 436996 440551 444318 448397 452900
60348 452900 457539 461797 465249 467550 468434 468051 467060 466055 465004 463428 461034 458087 455315 453544 453066
60333 453066 453200 452693 450788 447741 444222 440624 437182 434343 432437 431147 429700 427633 425130 422778 421257
60318 421257 421098 422297 424212 426183 428267 431055 434819 439297 444355 450376 457737 466231 475306 484667
60304 484667 494316 504150 513857 523239 532315 540898 548167 552835 553816 550756 544067 534677 523868 513112
60290E13112r477p724o259n318m732m368m196l963l334k473k016k293k844l055
60276D51060k902k830l067l470l818l957l705l051k316j886j755j645j428j152
60262D14078p58j65M03O15N09L62J63k23m72j8R65J579J451J255J490J614J048
60245D23896L35L14O49L68m21o58j32J31l78p85k79O53J235J653K324K730K104
60228D33739R05L91R42J798K355K745L114L291L359L725M410M944N150N379N727
60213D81974N789N492N459O108O981P408P383P321P394P464P351O823N719M379
60199E73045L518L292L012K160J154N28p9j364l121m445n021n334n602n374m464
60184E51905l590l597m423n256n445n020m483m322m603m846m512l694l025k824
$$ plain form
60290 513112 503635 495911 489652 484334 479602 475234 471038 467075 463741 461268 459252 456959 454115 451060
60276 451060 448158 445328 442261 438791 434973 431016 427311 424260 421944 420058 418303 416658 415230 414078
60262 414078 413320 413155 413558 414173 414682 415044 415207 414984 414512 414494 415459 417038 418489 419744 421234 422848 423896
60245 423896 424231 424545 425194 425562 425141 424483 424351 424482 424104 423319 423040 423693 424928 426581 428905 431635 433739
60228 433739 434644 435035 435977 437775 440130 442875 445989 449280 452639 456364 460774 465718 470868 476247 481974
60213 481974 487763 493255 498714 504822 511803 519211 526594 533915 541309 548773 556124 562947 568666 573045
60199 573045 576563 579855 582867 585027 586181 586709 586630 585266 582145 577700 572679 567345 561743 556369 551905
60184 551905 548315 544718 540295 535039 529594 524574 520091 515769 511166 506320 501808 498114 495089 492265
60170D92265k649k006j174q03r01q21l10J20J01J36P98J722K067J817J714J962
60154D94038J914J351J058J563K160K022J617J929K792L203L136L686N216O590
60140E32275O773O180N843N982O152O106N910N609N354N430N730N592M723L728
60126F11387L195K804J973R36L94M11M44L07L00M93N52L45J07k4j44j91J9L51
60108F23659L41j94r62j667k343l099l803m199m186l928l708l612l378k695j687
60093E84539q27l49n2K92P50J510K711L857M099L395K686K489K174J214K50k4
60077F08714k49j486l413m717n095n591o870q304q979q717p885o971o481o591
60063E27365o790o488n881n545n368m856m270m269m396l291p33J795L041L313
$$ plain form
60170 492265 489616 487610 486436 485633 484732 483911 483601 483721 483822 483958 484756 486478 488545 490362 492076 494038
60154 494038 495952 497303 498361 499924 502084 504106 505723 507652 510444 513647 516783 520469 525685 532275
60140 532275 539048 545228 551071 557053 563205 569311 575221 580830 586184 591614 597344 602936 607659 611387
60126 611387 614582 617386 619359 620295 620689 621100 621544 621851 622151 622644 623196 623541 623648 623624 623480 623289 623308 623659
60108 623659 624000 623806 622844 621177 618834 615735 611932 607733 603547 599619 595911 592299 588921 586226 584539
60093 584539 583712 583363 583311 583603 584353 585863 588574 592431 596530 599925 602611 605100 607274 608488 608738 608714
60077 608714 608465 606979 603566 598849 593754 588163 581293 572989 564010 555293 547408 540437 533956 527365
60063 527365 520575 514087 508206 502661 497293 492437 488167 483898 479502 476211 475478 477273 480314 483627
60049D83627L370L231K951L297M596N731N609M894N014N858N857M366K660K178
60035E43239K736K989K087L18j595l239m581n559n980n866n716o129p085p968
60021D97651q308q228q056p833p363o473n140l636k599k528l104l414l007k269
60007D25693j658j196q63q69j115r81j97O10P06K53o4o3p4j55O1P76J680K264
59989D24808K279J951J889K518L462L802L119J889O99l63j269j653j384j062j273
59974D39412j836k259k587l040l253k644j364j52O33J180J611J845J981K156K155
59959D33838J750J291J286J515J387J029J107J478J186O5o85j77Q11R04K3p84
59943D46024r94j137j670k196k142j642j295j307j375j294j226j250r83n0J230
$$ plain form
60049 483627 486997 490228 493179 496476 501072 506803 512412 517306 522320 528178 534035 538401 541061 543239
60035 543239 545975 548964 551051 551369 549774 546535 541954 536395 530415 524549 518833 512704 505619 497651
60021 497651 489343 481115 473059 465226 457863 451390 446250 442614 440015 437487 434383 430969 427962 425693
60007 425693 424035 422839 421976 421107 419992 419011 418814 419424 420130 420383 420319 420256 420182 420027 420088 420864 422544 424808
59989 424808 427087 429038 430927 433445 436907 440709 443828 445717 446416 446053 444784 443131 441747 440685 439412
59974 439412 437576 435317 432730 429690 426437 423793 422429 422277 422910 424090 425701 427546 429527 431683 433838
59959 433838 435588 436879 438165 439680 441067 442096 443203 444681 445867 445932 445247 445070 445881 446785 446808 446024
59943 446024 445030 443893 442223 440027 437885 436243 434948 433641 432266 430972 429746 428496 427513 427463 428693
59928D28693K062K173K161K688L666M482M782M691M477M373M595N155N707N894
59914D85599N766N615N512N293M805L934K530P52p70j478j527j399j158o30j91
59899E12653n24j493k052j549n14J95M87Q19J380J976K454K785K986L220L774
59884E26597M572N094N086N068N602O341O371N381L948K722J865J307R88N78n12
59869E81008k394m310n315n206m530l873l463l340l447l474k971j861n76M52J290
59854E37990K206L105L644L893M477N753P119P415O036L458P33j314k357k381
59840E79777j508j08J100J268L9k086m096n324n827n900n551m681l627k966k773
59825E37737k517j893j382j573k284k768k756k734l066l367l129k526k156k122
$$ plain form
59928 428693 430755 432928 435089 437777 441443 445925 450707 455398 459875 464248 468843 473998 479705 485599
59914 485599 491365 496980 502492 507785 512590 516524 519054 519806 519036 517558 516031 514632 513474 512844 512653
59899 512653 512129 510636 508584 507035 506521 506716 507203 508022 509402 511378 513832 516617 519603 522823 526597
59884 526597 531169 536263 541349 546417 552019 558360 564731 570112 574060 576782 578647 579954 580942 581520 581008
59869 581008 578614 574304 568989 563783 559253 555380 551917 548577 545130 541656 538685 536824 536248 536700 537990
59854 537990 540196 543301 546945 550838 555315 561068 568187 575602 581638 585096 585829 584515 582158 579777
59840 579777 578269 578161 579261 580529 580568 578482 574386 569062 563235 557335 551784 547103 543476 540510 537737
59825 537737 535220 533327 531945 530372 528088 525320 522564 519830 516764 513397 510268 507742 505586 503464
59811E03464j985j653j730k659l901m372l587k115r57p59j462k387k756k369j835
59796D68937j881k465k861k551j755j010n67l51k76l52o22j036j386j348q43k82
59780D49351j49l54l10K06O93O14J35r7K70J052J879K485K748K666K307J704R23
59763D66123K95L26J106K085K659K841L044L331L349K943K508K502K884L191L057
59748E02244K544K052J997K559L597M682N279N042M064K801J681Q53L39K33N14
59733E40481Q09O78J44m30q96j378j729j469n71K11J76l80n63n4N17M18l35j050
59715E34579j126o30j46j21l94n02l37k41m06n10j18P38J623K187K388K340K170
59698E41494J953J700J367R34M16j29m95l89J98P45O99J48l10l80k71j38J21L80
$$ plain form
59811 503464 501479 499826 498096 495437 491536 487164 483577 481462 480505 479746 478284 475897 473141 470772 468937
59796 468937 467056 464591 461730 459179 457424 456414 455847 455496 455220 454868 454246 453210 451824 450476 449633 449351
59780 449351 449202 448848 448538 448744 449437 450051 450186 450089 450359 451411 453290 455775 458523 461189 463496 465200 466123
59763 466123 466418 466744 467850 469935 472594 475435 478479 481810 485159 488102 490610 493112 495996 499187 502244
59748 502244 504788 506840 508837 511396 514993 519675 524954 529996 534060 536861 538542 539395 539734 539967 540481
59733 540481 541290 541968 542112 541682 540786 539408 537679 536210 535639 535850 536026 535646 535083 535029 535546 535964 535629 534579
59715 534579 533453 532823 532677 532556 532162 531660 531323 531082 530676 530166 530048 530786 532409 534596 536984 539324 541494
59698 541494 543447 545147 546514 547448 547864 547735 547240 546851 547049 547794 548493 548641 548331 547951 547680 547542 547663 548043
59680E48043J25q63k129l115l712m007l947l608l355l380l413l284l321l755m126
59665E02153l804k824j764j025o93p42q94n52N68J864K438K123J518J199J330
59650E00895J858K536K864K505J711R65K80o95k008l239l970m080l618k752j761
59635D91491p97J92J123J585J360Q24M58K18k50r85j724k227k310j900j477j864
59619D83717l067l887l424k448k331l003l109k058p58j37K7M40J221J972K409
59604D65564K576K695K928L099K782J949J209Q76L77p23j573j082K50Q24K21l88
59588D81584k99l02j070j898j858j268r77r92p71l76l82r08j517j925k134k078
59572D62829j664j092o95n30m08k56j37p3n8j48l43n27n56k70M70J479K132J987
$$ plain form
59680 548043 548168 547305 545176 542061 538349 534342 530395 526787 523432 520052 516639 513355 510034 506279 502153
59665 502153 498349 495525 493761 492736 492043 491301 490407 489855 490423 492287 494725 496848 498366 499565 500895
59650 500895 502753 505289 508153 510658 512369 513334 513614 512919 510911 507672 503702 499622 496004 493252 491491
59635 491491 490694 490886 492009 493594 494954 495778 496236 496454 496204 495219 493495 491268 488958 487058 485581 483717
59619 483717 480650 476763 473339 470891 468560 465557 462448 460390 459632 459495 459522 459962 461183 463155 465564
59604 465564 468140 470835 473763 476862 479644 481593 482802 483678 484055 483332 481759 480677 480927 481751 481972 481584
59588 481584 481285 480983 479913 478015 476157 474889 473912 472920 472149 471773 471391 470483 468966 467041 464907 462829
59572 462829 461165 460073 459378 458848 458440 458184 458047 457974 457916 457768 457425 456898 456342 456072 456542 458021 460153 462140
59554D62140J441J224J384J408J293J619K498L339L932M897O670Q745J0399J1457
59540E22446J2062J2341J2637J3265J3582J2218Q749M384M86k667m982n594l992
59527E94935j383L75Q81J132J760K405K671K559K029J031l2p27j425k859m900
59512E98452o656p739q475q829q322p225o753p484q412q301p252o276n719n046
59498D95963l932k782k054j634j088k75N67J142J338J194P84K58q8Q4Q87K110
59482D92474L364M264M580M436M351M818N738O447O456N920N278M670L867K667
59468E59330J197j1l03M81J687K444K584K588K736K920L352M594O530Q068Q502
59453F06699Q437Q756R241R114Q418P825P255N811L222L87j830l618n558p568
$$ plain form
59554 462140 463581 464805 466189 467597 468890 470509 473007 476346 480278 485175 491845 500590 510989 522446
59540 522446 534508 546849 559486 572751 586333 598551 607300 611684 612170 609503 604521 598927 594935
59527 594935 593552 593927 594808 595940 597700 600105 602776 605335 607364 608395 608363 607636 606211 603352 598452
59512 598452 591796 584057 575582 566753 558431 551206 544453 536969 528557 520256 513004 506728 501009 495963
59498 495963 492031 489249 487195 485561 484473 484198 484765 485907 487245 488439 489223 489481 489393 489477 490364 492474
59482 492474 495838 500102 504682 509118 513469 518287 524025 530472 536928 542848 548126 552796 556663 559330
59468 559330 560527 560516 560213 560694 562381 564825 567409 569997 572733 575653 579005 583599 590129 598197 606699
59453 606699 615136 623892 633133 642247 650665 658490 665745 671556 674778 675165 673335 669717 664159 656591
59439F56591q979r407r111q603q192p844p409o874o341n696m554k769p49J020
59425E71083K654M662P238J0087J2937J5696J8193K0141K1471K2322K2678K2405
59413G51567K1735K1136K0357J8014J2711M724l734j0085j3188j3684j2813j1260
59401G85480r166o720m349k534j994l857q760j5482k1155k3493k2534j9960j7224
59388F28252j4902j3190j2079j1090r633p774o057m609l024j286j06J5m03l44
59374E43770N94J915K876L158L029L015L475M383N430O247O583O424O164O365
59360F03428P165Q027Q396Q466Q957J0107J1317J1922J2012J2236J2995J4097
59348G29125J5155J5969J6448J6388J5628J4349J2898J1295R281O942M800K957
$$ plain form
59439 656591 647612 638205 629094 620491 612299 604455 597046 590172 583831 578135 573581 570812 570063 571083
59425 571083 573737 578399 585637 595724 608661 624357 642550 662691 684162 706484 729162 751567
59413 751567 773302 794438 814795 832809 845520 850244 846510 836425 823237 809553 796740 785480
59401 785480 776314 769594 765245 762711 760717 756860 748100 732618 711463 687970 665436 645476 628252
59388 628252 613350 600160 588081 576991 567358 559584 553527 548918 545894 544608 544502 544517 544114 543770
59374 543770 544364 546279 549155 552313 555342 558357 561832 566215 571645 577892 584475 590899 597063 603428
59360 603428 610593 618620 627016 635482 644439 654546 665863 677785 689797 702033 715028 729125
59348 729125 744280 760249 776697 793085 808713 823062 835960 847255 856536 863478 868278 871235
59336H71235P00k515o013q660j0389j2152j4309j6054j6685j6635j6751j7131
59324G34641j7136j6144j3997j1196q817p736p610p214n981m543l485k497j208
59311F27077l5N87J091K217L984N876P578Q892R543R607R533R113P175L133j911
59296G03460o465j0268j3590j5759j5900j4591j3275j2266j0776q855p602p280
59284E66833o729n141l140j514n4J678L378M587N530O636P761Q554R139R931J0980
59269F18429J1919J2363J2128J1296J0152Q816O995M430J513j052l055m719n989
59256F83226o659p073p840q785r055q473p872p737p433o243m473k937j879r79
59242E95788j3J040K169L245L976M276M435M694M948N024M961M776M255L198J702
$$ plain form
59336 871235 871935 869420 863407 854747 844358 832206 817897 801843 785158 768523 751772 734641
59324 734641 717505 701361 687364 676168 667351 659615 652005 644791 638810 634267 630782 628285 627077
59311 627077 627042 627629 628720 630937 634921 640797 648375 657267 666810 676417 685950 695063 702238 705371 703460
59296 703460 696995 686727 673137 657378 641478 626887 613612 601346 590570 581715 574113 566833
59284 566833 560104 554963 551823 550309 550255 551933 555311 559898 565428 572064 579825 588379 597518 607449 618429
59269 618429 630348 642711 654839 666135 676287 685103 692098 696528 698041 696989 693934 689215 683226
59256 683226 676567 669494 661654 652869 643814 635341 627469 619732 612299 606056 601583 598646 596767 595788
59242 595788 595775 596815 598984 602229 606205 610481 614916 619610 624558 629582 634543 639319 643574 646772 648474
59227F48474R7j230k081k677l522m719n739o178o354o562o285n048l635l345m124
59212E87072m674m403m009l942l615k687j894j863k112j975j681j720j839j547
59198E49111j024p72p95q17q90j106j123o98k48k69m99l41J53M32L59L80Q22J530
59180E44205K180K609K842L060L435L949M533N373O632P834Q212P857P841Q783
59166F19345R955J0284R708Q937Q319P585O448M871K935Q36j143k948m808o704
59152F73620q196r032r559j0181j0789j1093j1059j0684r775q426p285o906p108
59139E53527p355p422p340p024o433n733n030m202l289k590k131j559q35m14k83
59124D91887M09K152M079M977M862M823N608P021Q497R603J0118J0202J0331J0733
$$ plain form
59227 648474 648571 647341 645260 642583 639061 634342 628603 622425 616071 609509 603224 598176 594541 591196 587072
59212 587072 582398 577995 573986 570044 566429 563742 561848 559985 557873 555898 554217 552497 550658 549111
59198 549111 548087 547315 546520 545703 544813 543707 542584 541886 541638 541369 540870 540529 540682 541114 541473 541853 542675 544205
59180 544205 546385 548994 551836 554896 558331 562280 566813 572186 578818 586652 594864 602721 610562 619345
59166 619345 629300 639584 649292 658229 666548 674133 680581 685452 688387 689223 688080 685132 680324 673620
59152 673620 665424 656392 646833 636652 625863 614770 603711 593027 583252 574826 567541 560635 553527
59139 553527 546172 538750 531410 524386 517953 512220 507190 502988 499699 497109 494978 493419 492584 492170 491887
59124 491887 492296 494448 498527 503504 508366 513189 518797 525818 534315 543918 554036 564238 574569 585302
59110E85302J1062J0964J0557R960Q912P381O028N356M829L645J975O70qn15j075
59095F65043j474j680j921k127k004j737j908k628l353l673l711l688l658l783
59081F27698m426n702p218q424q963q735p865o685n542m646m107l948l935l698
59067E43804l200k797k698k677k599k639k748k440j635j082j323j741j444o59
59053E14122l83q17j121o75J96Q22Q45J99r14j860j933j137j85L00L12J52Q9L19
59035E08331Q87J516J841J911K156K827L703M454N069N918P381R343J1104J1980
59021E78421J2022J1782J1377J0361Q666O958N728M583K996J143m84j816k904
59008F48833l424l135k428j724q23N26J847K590L115M095N256N697N254M607M108
$$ plain form
59110 585302 596364 607328 617885 627845 636757 644138 650166 655522 660351 663996 665971 666641 666633 666118 665043
59095 665043 663569 661889 659968 657841 655837 654100 652192 649564 646211 642538 638827 635139 631481 627698
59081 627698 623272 617570 610352 601928 592965 584230 576365 569680 564138 559492 555385 551437 547502 543804
59067 543804 540604 537807 535109 532432 529833 527194 524446 522006 520371 519289 517966 516225 514781 514122
59053 514122 513739 512922 511801 511126 511322 512144 512989 513188 512274 510414 508481 507344 507159 507459 507771 507923 508012 508331
59035 508331 509218 510734 512575 514486 516642 519469 523172 527626 532695 538613 545994 555337 566441 578421
59021 578421 590443 602225 613602 623963 632629 639587 645315 649898 652894 654037 653553 651737 648833
59008 648833 645409 642274 639846 638122 637299 637825 639672 642262 645377 649472 654728 660425 665679 670286 674394
58993F74394L526K897K658K812K784K317J711J058N7j232k164k330j973j403o18
58978F84494L29J184K001L213M978O811Q166Q952R351R555R796J0269J0810J1022
58964G80931J0759J0254R741R315R031Q723P776N664K668l61k978n371p699r817
58950H28636j1735j3688j5493j6375j5820j4312j2860j1928j1036r487p348n575
58938F82979m973n219n300m854m414m286m066l621l547l993l979k919j895k175
58924F27738l085k942j726j193k201l513l705k871j849r14k8N29O17Q00J731L294
58908F10682M897O264P523Q750R742J0212J0119R981J0577J2030J3354J3550J2879
58895G40560J2434J2680J3293J4185J5675J7549J9003J9819K0574K1441K1693
$$ plain form
58993 674394 677920 680817 683475 686287 689071 691388 693099 694157 694214 692982 690818 688488 686515 685112 684494
58978 684494 684823 686007 688008 691221 696199 703010 711176 720128 729479 739034 748830 759099 769909 780931
58964 780931 791690 801944 811685 821000 830031 838754 846530 852194 854862 854501 851523 846152 838453 828636
58950 828636 816901 803213 787720 771345 755525 741213 728353 716425 705389 695902 688554 682979
58938 682979 678006 672787 667487 662633 658219 653933 649867 646246 642699 638706 634727 631808 629913 627738
58924 627738 624653 621711 619985 618792 616591 613078 609373 606502 604653 603739 603711 604240 604857 605657 607388 610682
58908 610682 615579 621843 629366 638116 647858 658070 668189 678170 688747 700777 714131 727681 740560
58895 740560 752994 765674 778967 793152 808827 826376 845379 865198 885772 907213 928906
58884I28906K0832J9287J7491J5089J1682P653L611m00m523q441j1703j4300j6401
58871I68783j7933j8825j9334j9561j9053j7360j4758j2084j0052r010q935r300
58859G92578r330q819q441q801r516r639q882p890p340p225p136o899o682o540
58845F79438o276n914o040p112q488q855p902o865o889p514p493o577n530m770
58831E83213m029l213k616k188j541p16j59J49P05J623K490L152L807M298M248
58816E89223L905L894M014L402K084J246J483J863J319P4r94j622k146k742l329
58801F01674l818m046l883l675m048n052o007o388o260n666m458k970k034j887
58787E41482j825j322o89k40L89J515K715L450L705L571K868J801J282J856K816
$$ plain form
58884 928906 949738 969025 986516 1001605 1013287 1020940 1024551 1024151 1019628 1011187 999484 985184 968783
58871 968783 950850 932025 912691 893130 874077 856717 841959 829875 819823 810813 801878 792578
58859 792578 783248 774429 765988 757187 747671 738032 729150 721260 713920 706695 699559 692660 685978 679438
58845 679438 673162 667248 661208 654096 645608 636753 628851 621986 615097 607583 600090 593513 587983 583213
58831 583213 579184 575971 573355 571167 569626 568910 568751 568900 569605 571228 573718 576870 580677 584975 589223
58816 589223 593128 597022 601036 604438 606522 607768 609251 611114 612433 612507 611513 609891 607745 605003 601674
58801 601674 597856 593810 589927 586252 582204 577152 571145 564757 558497 552831 548373 545403 543369 541482
58787 541482 539657 538335 537646 537406 537795 539310 542025 545475 549180 552751 555619 557420 558702 560558 563374
58772E63374K981J964J32k024l998n148n194m620m071l633l027k171j250m81l1
58757E32803J51M90J319K226K452J965J447J191Q89N52O58J139J374J412K073
58742E52141L388M226M088M038M987O233O738O797P241P827P709O917O223N919
58728F34472N817O000O483O529N447L850L030L179L278K721K104K241L218M594
58714F92963N901O668O539N569M202K786J318l30k121l818n283o780q685j0722
58700F88207j1946j2044j2139j3343j4903j5073j3708j2480j2319j2244j1341
58689E46667j0309r944r552q158o319n300n140m852m056l261k873k831k944k818
58675D68310j877j45J543K685L809N341O705P415Q126R429J0587J0711J0459J0977
$$ plain form
58772 563374 566355 568319 568451 566427 562429 557281 552087 547467 543396 539763 536736 534565 533315 532834 532803
58757 532803 532954 533444 534763 536989 539441 541406 542853 544044 544933 545485 546143 547282 548656 550068 552141
58742 552141 555529 559755 563843 567881 572868 579101 585839 592636 599877 607704 615413 622330 628553 634472
58728 634472 640289 646289 652772 659301 664748 668598 671628 674807 678085 680806 682910 685151 688369 692963
58714 692963 698864 705532 712071 717640 721842 724628 725946 725616 723495 719677 714394 707614 698929 688207
58700 688207 676261 664217 652078 638735 623832 608759 595051 582571 570252 558008 546667
58689 546667 536358 526414 516862 508704 502385 497085 491945 487093 483037 479776 476903 474072 471128 468310
58675 468310 466433 466288 467831 470516 474325 479666 486371 493786 501912 511341 521928 532639 543098 554075
58661E54075J1740J1032Q420N172K348j20k354l991n043o068p135p541o970o102
58647E47463n630n363m693l523k339j616j406j368j177q84p02m24M28J757K761
58632E23284K900K437J787J038M71O40J421J827J404J004J462K385L045L592M452
58617E53149N319N788O178O765O915O147N259N162N262M314K370N61o06j441j989
58602F09153k137k483l674n074n359m366l147k324j666j175j249j644j469l78
58588E73008J178K915M950O971Q194Q392Q228Q411R038R746J0013R472Q409P657
58574F76582P490P252O639O544P748R576J0969J2163J4017J6305J8136J9656K1844
58561H34921K4683K6957K7745K7012K4884K1522J7691J4254J1113P568L663K34
$$ plain form
58661 554075 565815 576847 585267 590439 592787 592667 590313 586322 581279 575211 568076 560535 553565 547463
58647 547463 541833 536470 531777 528254 525915 524299 522893 521525 520348 519464 518762 518338 518766 520523 523284
58632 523284 526184 528621 530408 531446 531917 532557 533978 535805 537209 538213 539675 542060 545105 548697 553149
58617 553149 558468 564256 570434 577199 584114 590261 595520 600682 605944 610258 612628 613189 612583 611142 609153
58602 609153 607016 604533 600859 595785 590426 586060 582913 580589 578923 577748 576499 574855 573386 573008
58588 573008 574186 577101 582051 589022 597216 605608 613836 622247 631285 641031 651044 660516 668925 676582
58574 676582 684072 691324 697963 704507 712255 721831 732800 744963 758980 775285 793421 813077 834921
58561 834921 859604 886561 914306 941318 966202 987724 1005415 1019669 1030782 1038350 1042013 1042247
58549A042247k178l615m248m547n398p135q936j0169j1556j3904j6496j8223j9421
58536I16421k0905k1938k1135j8930j7080j5946j4303j1812r617q299p172n862
58524G43422m756l626j617R33K408K194J469J254J180P14J29l72j197k379l248
58509G36508l561l859m345m538m353m406m889n221n111m892m691m262l785l703
58495F74892l754l322k598k214j851o63J089K319L006M172O028P761R203J0936
58481G05004J2706J3565J3708J4322J5331J5262J3692J1876J0406Q226M671O73
58469H39442k844o021q785j0227j0130r529q973p713n396k998j245M12K439M261
58455G72693N459O580P928Q831Q855Q376P411N193J729j686m156o143q075r384
$$ plain form
58549 1042247 1040069 1036454 1032206 1027659 1022261 1015126 1006190 996021 984465 970561 954065 935842 916421
58536 916421 895516 873578 852443 833513 816433 800487 786184 774372 764755 756456 749284 743422
58524 743422 738666 735040 733423 734356 736764 738958 740427 741681 742861 743575 743704 743332 742135 739756 736508
58509 736508 732947 729088 724743 720205 715852 711446 706557 701336 696225 691333 686642 682380 678595 674892
58495 674892 671138 667816 665218 663004 661153 660490 661579 663898 666904 671076 677104 684865 694068 705004
58481 705004 717710 731275 744983 759305 774636 789898 803590 815466 825872 834098 838769 839442
58469 839442 836598 830577 821792 811565 801435 791906 782933 775220 769824 766826 765581 765993 768432 772693
58455 772693 778152 784732 792660 801491 810346 818722 826133 831326 833055 831369 827213 821070 812995 803611
58441H03611r596r072q113o557m731l407k406p42J453K820L062L570N182P065
58427G82139Q447R652J0675J0600R315Q024P175N696L134P33p11k134m267o136
58413H42342o765o789p154p673q016q592r397r476q517p499o820n558l551k333
58399G44202k742l390k861j716r34p3J451K792K948K384J956J506P93M95J065
58384G47876J711J767J815K473L325M022N024O296O813O340O125O843P552P609
58370H15591P817Q592Q884Q170P606Q017Q627Q966R998J1952J3129J2494J1400
58357I41243J1114J0625Q744O416M994L946K240M42l98n31m78K76J929L220L247
58342I97029L030L831N414P249R645J2387J4086J4328J4545J5437J5644J4352
$$ plain form
58441 803611 794015 784943 776830 770273 765542 762135 759729 758987 760440 763260 766322 769892 775074 782139
58427 782139 790586 800238 810913 821513 830828 838852 846027 851723 854857 855590 854879 852745 848478 842342
58413 842342 835577 828788 821634 813961 805945 797353 787956 778480 769963 762464 755644 750086 746535 744202
58399 744202 741460 738070 735209 733493 732559 732486 733937 736729 739677 742061 744017 745523 746316 746811 747876
58384 747876 749587 751354 753169 755642 758967 762989 768013 774309 781122 787462 793587 800430 807982 815591
58370 815591 823408 832000 840884 849054 856660 864677 873304 882270 892268 904220 917349 929843 941243
58357 941243 952357 962982 971726 978142 983136 987082 989322 989764 989366 988835 988357 988633 990562 993782 997029
58342 997029 1000059 1003890 1009304 1016553 1026198 1038585 1052671 1066999 1081544 1096981 1112625 1126977
58330A126977J2907J2337J1617J0024Q746Q318P095M258J831J528K077J843J587
58317A211145K370L206L266L975O335Q641R331R720J1339J3040J3391J3402J4221
58304A323382J4638J3708J3255J4786J6499J6410J5769J6291J6740J5668J4837
58293A491983J6306J8551J9180J9090K0264K1815K2094K2407K4661K7411K8128
58282A731890K7472K7588K8228K8266K8848L1299L4010L5114L5929L8156M0321
58271B087121M0855M1824M5384M9335N0646N0624N2056N4035N4394N4508N6692
58260B637474N9435O0158O0049O1326O2642O2161O2038O4554O7182O7165O7395
58249C331579P1647P7477Q0529Q2410Q7347R4257R9487J04355J12348J21668J28272
$$ plain form
58330 1126977 1139884 1152221 1163838 1173862 1182608 1190926 1198021 1202279 1204110 1205638 1207715 1209558 1211145
58317 1211145 1213515 1216721 1219987 1223962 1230297 1238938 1248269 1257989 1269328 1282368 1295759 1309161 1323382
58304 1323382 1338020 1351728 1364983 1379769 1396268 1412678 1428447 1444738 1461478 1477146 1491983
58293 1491983 1508289 1526840 1546020 1565110 1585374 1607189 1629283 1651690 1676351 1703762 1731890
58282 1731890 1759362 1786950 1815178 1843444 1872292 1903591 1937601 1972715 2008644 2046800 2087121
58271 2087121 2127976 2169800 2215184 2264519 2315165 2365789 2417845 2471880 2526274 2580782 2637474
58260 2637474 2696909 2757067 2817116 2878442 2941084 3003245 3065283 3129837 3197019 3264184 3331579
58249 3331579 3403226 3480703 3561232 3643642 3730989 3825246 3924733 4029088 4141436 4263104 4391376
58238D391376J33699J42100J52296J60662J68969J81112J95031K06463K17706
58229E949414K33754K52738K69597K86101L07561L32738L57142L83099M15958
58220H788102M53643M91196N32076N83172O42372P03766P71328Q54014R51313
58211A4770982J058165J180147J328278J503388J702785J938459K231213K592739
58203B8306156L034574L590239M306582N218855O356906P762748R464334J1436521
58195G9476915J3629533J6034221J8663290K1443526K4163768K6555192K8409164
58188B28375609K9625941L0175157K9941415K8458724K4793230J7968503P860994
58181C97199573m207411j5897790k5054475l0664142l2914924l2633409l0749259
$$ plain form
58238 4391376 4525075 4667175 4819471 4980133 5149102 5330214 5525245 5731708 5949414
58229 5949414 6183168 6435906 6705503 6991604 7299165 7631903 7989045 8372144 8788102
58220 8788102 9241745 9732941 10265017 10848189 11490561 12194327 12965655 13819669 14770982
58211 14770982 15829147 17009294 18337572 19840960 21543745 23482204 25713417 28306156
58203 28306156 31340730 34930969 39237551 44456406 50813312 58576060 68040394 79476915
58195 79476915 93106448 109140669 127803959 149247485 173411253 199966445 228375609
58188 228375609 258001550 288176707 318118122 346576846 371370076 389338579 397199573
58181 397199573 392992162 377094372 352039897 321375755 288460831 255827422 225078163
58174B25078163k8051866k5108035k2234991j9555288j7105550j4898634j2923040
58167H5200759j1150094r564467q168295o955866n908151n011711m260178l636380
58159C0545617l113152k672904k309501k011571j760857j547027j368516j218795
58151A4543294j086178r67108q65812p80620p03259o31484n70037n18831m71811
58142G948154m27888l91909l64207l39416l15996k97085k81641k64360k45009
58133E020643k28699k16273k03078j87839j74399j63960j53483j42491j33849
58124C416572j27288j19392j10448j04204j00529r5381q8374q3245q0328p5746
58114B431637o8907o3906o2287o0882n8079n6052n5540n4269n1881n0864n1353
$$ plain form
58174 225078163 197026297 171918262 149683271 130127983 113022433 98123799 85200759
58167 85200759 74050665 64486198 56317903 49362037 43453886 38442175 34181997 30545617
58159 30545617 27432465 24759561 22450060 20438489 18677632 17130605 15762089 14543294
58151 14543294 13457116 12490008 11624196 10843576 10140317 9508833 8938796 8419965 7948154
58142 7948154 7520266 7128357 6764150 6424734 6108738 5811653 5530012 5265652 5020643
58133 5020643 4791944 4575671 4372593 4184754 4010355 3846395 3692912 3550421 3416572
58124 3416572 3289284 3169892 3059444 2955240 2854711 2759330 2670956 2587711 2507383 2431637
58114 2431637 2362730 2298824 2236537 2175655 2117576 2061524 2005984 1951715 1899834 1848970 1797617
58103A797617n0303m6977m4215m3163m1708l8996l6693l4906l1722k7645k5627
58092A375662k5850k5188k2754k1182k1468k1277j9548j8179j7979j7240j5623
58081A149374j5154j6178j6429j5320j5128j6673j7765j7237j6709j7063j6887
58070I68831j5690j5057j5349j4731j2746j1392j1391j0846q928p581q053q880
58058H28187q774q655r322r789r341q845q851q707q395q911j0039j0194r036p938
58044G01390p476o895o329o775p645p180n660n243o288o888o449o508p496p863
58030F06695p217p109p939q166p504p672r052r705q745p688p349o531m880m023
58016E03115m531m683l597k733k979l067k259j760k095j895p68n30j921k903j999
$$ plain form
58103 1797617 1747314 1700337 1656122 1612959 1571251 1532255 1495562 1460656 1428934 1401289 1375662
58092 1375662 1349812 1324624 1301870 1280688 1259220 1237943 1218395 1200216 1182237 1164997 1149374
58081 1149374 1134220 1118042 1101613 1086293 1071165 1054492 1036727 1019490 1002781 985718 968831
58070 968831 953141 938084 922735 908004 895258 883866 872475 861629 852701 845120 837067 828187
58058 828187 819413 810758 801436 791647 782306 773461 764610 755903 747508 738597 728558 718364 709328 701390
58044 701390 693914 687019 680690 673915 666270 659090 653430 648187 641899 635011 628562 622054 614558 606695
58030 606695 599478 592369 584430 576264 568760 561088 552036 542331 533586 525898 518549 512018 507138 503115
58016 503115 498584 493901 490304 487571 484592 481525 479266 477506 475411 473516 472748 472218 470297 467394 465395
58001D65395p73j049k056k304k121k375k607k239j902j973j565k89P25Q18R13
57986D46598J428J229p3r71o19m17j517k808l040k888l248l449k835k327k677
57971D22386k940k240j376j091n83O56J355M95q35j313j404j809j639j31J408
57956D10939J366K43m94p54j230j674j534j308j640j991j590p21J47J347K952
57941D04058M048M377N198P178Q919R144Q822R459J0638J1038J0581R791Q251
57928E11502N519K586O02q46k620m190m630m417m651n249n582n835o281o166n019
57913D64723m026m388n238m970l684k606j946j251j047k075l514l896l409l433
57899D19240m220m815m933n064m948l780j924p01m00oR59J739J742J369J206J277
$$ plain form
58001 465395 464622 463573 461517 459213 457092 454717 452110 449871 447969 445996 444431 444142 444867 445685 446598
57986 446598 448026 449255 449182 448211 447592 447175 445658 442850 439810 436922 433674 430225 427390 425063 422386
57971 422386 419446 417206 415830 414739 414156 414812 416167 416662 415827 414514 413110 411301 409662 409531 410939
57956 410939 412305 412548 412054 411300 410070 408396 406862 405554 403914 401923 400333 399612 399759 401106 404058
57941 404058 408106 412483 417681 424859 433778 442922 451744 461203 471841 482879 493460 503251 511502
57928 511502 517021 519607 520209 519363 516743 512553 507923 503506 498855 493606 488024 482189 475908 469742 464723
57913 464723 460697 456309 451071 446101 442417 439811 437865 436614 435567 433492 429978 426082 422673 419240
57899 419240 415020 410205 405272 400208 395260 391480 389556 388855 388455 388449 389408 391147 392889 394258 395464 396741
57883C96741J326J106M24n19j042q11l19r3K2R4m76j898l147l205k405j533n12
57866C83753R13K010K002J492J530J904J758J364J663K402K408J603J158J519
57852D07479J663O45j125k576l131l007k837l103l601l648l108k691k898l369
57838C74693l758m355n151n286m282l034k492k226j395l24J65K42O22J223J510
57823C46152J710K314K918K817K348K339K587K168R61m00j761l401m941n509m985
57808C45317m090l372l018l271m034m444l832k754k086j623o98L77Q03P63J032
57793C15070J488J392R40J097K016K886L275L397L215K548J917K038K581K701
57779C46561K586L112M018M061L010K002J556Q09q08k452l126l042l045l490m223
$$ plain form
57883 396741 398067 399173 399597 399078 398036 397225 396906 396813 396835 396929 396453 394555 391408 388203 385798 384265 383753
57866 383753 384666 386676 388678 390170 391700 393604 395362 396726 398389 400791 403199 404802 405960 407479
57852 407479 409142 409787 408662 406086 402955 399948 397111 394008 390407 386759 383651 380960 378062 374693
57838 374693 370935 366580 361429 356143 351861 348827 346335 344109 342714 342390 342555 342797 343419 344642 346152
57823 346152 347862 350176 353094 355911 358259 360598 363185 365353 366314 365914 364153 360752 355811 350302 345317
57808 345317 341227 337855 334837 331566 327532 323088 319256 316502 314416 312793 312095 312472 313275 314038 315070
57793 315070 316558 317950 318890 319987 322003 324889 328164 331561 334776 337324 339241 341279 343860 346561
57779 346561 349147 352259 356277 360338 363348 365350 366906 367715 366907 364455 361329 358287 355242 351752 347529
57764C47529n040n652n746n394m949m451l668k753k194j991j548n30O83J526J801
57749C07623J667J428J324J285J090R45J354K107K150J074j40n75p08j276j755
57734C17593j280l90l28j022j331j060j171j983k701k888l033l370l404k899k322
57719B88411j958j613j355j579k124k301k023k025k705l559l975l906l518k919
57705B52851k310j882j555j366j746k666l046j963j65P32L09m78r26j181j345
57690B33263j301j366j883k178j218O42J918K088K145K919M211N904Q460J1827
57676B65431J5048J7612K0239K3752K8010L2411L6552M0042M2430M3607M3509
57665F08643M1137L4762K3529Q369q589k4703l7152m4022m5623m4036m1091l7463
$$ plain form
57764 347529 342489 336837 331091 325697 320748 316297 312629 309876 307682 305691 304143 303613 304296 305822 307623
57749 307623 309290 310718 312042 313327 314417 315362 316716 318823 320973 322047 321907 321332 320624 319348 317593
57734 317593 316313 315923 315595 314573 313242 312182 311011 309028 306327 303439 300406 297036 293632 290733 288411
57719 288411 286453 284840 283485 281906 279782 277481 275458 273433 270728 267169 263194 259288 255770 252851
57705 252851 250541 248659 247104 245738 243992 241326 238280 236317 236152 236884 237193 236715 235789 234608 233263
57690 233263 231962 230596 228713 226535 225317 225959 227877 229965 232110 235029 239240 245144 253604 265431
57676 265431 280479 298091 318330 342082 370092 402503 439055 479097 521527 565134 608643
57665 608643 649780 684542 708071 716440 707851 683148 645996 601974 556351 512315 471224 433761
57653D33761l3536k9878k6611k3349k0044j7043j4309j1614r452q500q119o841
57641B24465m551k737k233k228j920j671j737j374j95Q33P60N3l31l64n03o34
57625B05633m65l78r47k027k984l510l612l325k831k469k250j852j329j166j397
57610A75091j406q46o0O20J214J604J552J375J622J958J448J56p34p28o64j122
57594A81080j517j333j040j062j002o48n56r09r69m55k57q89j448j147o72q64
57578A66312j191q39l30n69j154j132p93j165k119k446j736q36m91o02q46j077
57562A48986j094p95n22o06p36m49L5J34j27k41q2J6p5j44l6L11R96J942K700
57543A50213K943K823K515J913J087N40N62P82Q48Q81Q62L24p16j261o70K28K00
$$ plain form
57653 433761 400225 370347 343736 320387 300343 283300 268991 257377 247925 239425 231306 224465
57641 224465 219914 217177 214944 212716 210796 209125 207388 206014 205819 206652 207412 207465 207134 206770 206267 205633
57625 205633 205168 204790 203843 201816 198832 195322 191710 188385 185554 183085 180835 178983 177654 176488 175091
57610 175091 173685 172839 172779 173399 174613 176217 177769 179144 180766 182724 184172 184328 183594 182866 182202 181080
57594 181080 179563 178230 177190 176128 175126 174478 173922 173013 172044 171589 171332 170443 168995 167848 167176 166312
57578 166312 165121 164282 163952 163383 162229 161097 160304 159139 157020 154574 152838 152002 151511 150909 150063 148986
57562 148986 147892 147097 146575 145969 145233 144784 144819 144953 144826 144585 144503 144519 144444 144300 144264 144575 145571 147513 150213
57543 150213 153156 155979 158494 160407 161494 162034 162596 163378 164226 165107 165969 166293 165577 164316 163646 163874 164074
57526A64074o33j154q97m32l18n29q10q85m32N13J317J407R46M40J3m09o56o09
57508A60946n31n56l23L31Q02N44o6l31k36j45n4J07j46j216k562l223l056k625
57490A47660k188j575q76m85n06o24n56k23K59M74J3q32j128n35K05L96K61J19
57472A39859m23j630k748k900k286j613r53j39L63Q6l87j07Q30J584J824J708
57456A33068J051k78j460j432m23L05J65l36o50p09m49J26N22L27L0L79J135J465
57438A32836J333J359J508J183N07L26Q18J231J184J057R92O25N8rN61J007Q32
57421A47408L36j75p83j279j155n93n01j064j308o16K74M16L2m1L44O94P52N95
57403A43336K18l40o65m14N7L7n24q54l16P42J390J221P57O51Q16P16L08J03L08
$$ plain form
57526 164074 163441 162287 161390 160958 160640 160111 159301 158416 157984 158497 159814 161221 162167 162607 162620 162211 161555 160946
57508 160946 160415 159859 159536 159867 160669 161213 161147 160816 160580 160435 160381 160488 160342 159126 156564 153341 150285 147660
57490 147660 145472 143897 143021 142536 142030 141406 140850 140627 140886 141360 141373 140541 139413 138878 139083 139479 139740 139859
57472 139859 139436 137806 135058 132158 129872 128259 127306 127167 127530 127616 127229 127122 127952 129536 131360 133068
57456 133068 134119 133841 132381 130949 130526 130831 130996 130660 130010 129301 128852 128978 129500 129827 129857 130236 131371 132836
57438 132836 134169 135528 137036 138219 138726 139052 139870 141101 142285 143342 144334 144959 145017 145008 145569 146576 147408
57421 147408 147744 147569 146786 145507 144352 143759 143258 142194 140886 140270 140544 140960 140992 140951 141295 141989 142741 143336
57403 143336 143554 143214 142549 142135 142192 142229 141705 140851 140535 141277 142667 143888 144645 145296 146112 146828 147136 147239 147547
57384A47547N65O95J013J546J672J031J85k40l71n37n80l69k85m33j34Q78J600
57367A53783J160L26L11P77N00m17p14j13L24P8j94q7l5r9L65J363J855J284M57
57348A60924K66N47O79M95J06l88n80LJ022J482J088O46P42R75P97K91l08j003
57330A67784j530j283k19Q77J417J584J632J439J039P80N86l3q92r74J40J550
57314A73897K256K273K077J734J213P54M84K39J61O53J378J330L65l20N6O74N13
57297A89737m7qO13J021R87R00Q57O72N25P51J211J545J758J933J742J050O30
57280B05877J388L008M139L992L142K691L171M311N489O320O965P861R068J0114
57266B77536J0561J0381R672Q504P265O687P113Q045Q652Q419P254N464L839L209
$$ plain form
57384 147547 148112 148807 149820 151366 153038 154069 154254 154014 153643 153106 152526 152157 151872 151439 151305 152183 153783
57367 153783 154943 155269 155580 156357 156857 156440 155726 155613 155937 156015 155821 155734 155699 155600 155965 157328 159183 160467 160924
57348 160924 161190 161737 162416 162911 163017 162629 162049 162052 163074 164556 165644 166290 167032 168007 168804 169095 168787 167784
57330 167784 166254 164971 164752 165629 167046 168630 170262 171701 172740 173520 174106 174073 173181 172207 172347 173897
57314 173897 176153 178426 180503 182237 183450 184204 184688 184927 185088 185741 187119 188449 188814 188494 188550 189224 189737
57297 189737 189690 189682 190295 191316 192303 193203 194060 194732 195257 196008 197219 198764 200522 202455 204197 205247 205877
57280 205877 207265 210273 214412 218404 221546 224237 227408 231719 237208 243528 250493 258354 267422 277536
57266 277536 288097 298478 308150 316654 323919 330606 337719 345764 354416 362835 370089 375553 379392 382601
57252C82601L602M283M707M878M739M043L069K589K748K842K626K804L632M165
57238D33328L766L379M137N547O306O343O617P327P710P566P552P878P895P362
57224E22713P005P384Q136Q830R667J0787J1552J1362J0715J0692J1535J2448
57212F42826J2702J2363J1794J1091J0334R972J0390J1275J1946J2356J3171J4685
57200G84905J6251J7180J7669J8250J8796J8793J8374J8259J8728J9380J9928
57189I86513K0515K1199K1819K2466K3443K4612K5453K5909K6514K7531K8696
57178A254670K9818L0973L1969L2383L2304L2185L1919L0955K9559K8833K9121
57167A594689K9507K9334K9149K9511K9926K9813K9588K9865L0373L0569L0639
$$ plain form
57252 382601 386203 390486 395193 400071 404810 408853 411922 414511 417259 420101 422727 425531 429163 433328
57238 433328 437094 440473 444610 450157 456463 462806 469423 476750 484460 492026 499578 507456 515351 522713
57224 522713 529718 537102 545238 554068 563735 574522 586074 597436 608151 618843 630378 642826
57212 642826 655528 667891 679685 690776 701110 711082 721472 732747 744693 757049 770220 784905
57200 784905 801156 818336 836005 854255 873051 891844 910218 928477 947205 966585 986513
57189 986513 1007028 1028227 1050046 1072512 1095955 1120567 1146020 1171929 1198443 1225974 1254670
57178 1254670 1284488 1315461 1347430 1379813 1412117 1444302 1476221 1507176 1536735 1565568 1594689
57167 1594689 1624196 1653530 1682679 1712190 1742116 1771929 1801517 1831382 1861755 1892324 1922963
57156A922963L1007L1483L1754L2100L2771L3300L3325L3441L4233L5083L5046
57145B286506L4399L4213L4685L5131L5398L6069L7252L8252L8601L8603L8702
57134B687811L9019L9625M0601M1753M2811M3850M5062M6262M7125M7747M8387
57123C170053M9006M9707N1357N4954O0490O7116P4311Q2104R0402R8939J07979
57112C956418J18119J29403J41485J54888J71252J92079K17993K49742K89291
57103E620670L39441M02980M82904N83073P07832Q60972J045451J263686J516455
57094A2823464J800215K105483K418741K726645L019441L292445L546021L782239
57086C5514694L995653M161666M232892M150353L864306L353245K634381J764074
$$ plain form
57156 1922963 1953970 1985453 2017207 2049307 2082078 2115378 2148703 2182144 2216377 2251460 2286506
57145 2286506 2320905 2355118 2389803 2424934 2460332 2496401 2533653 2571905 2610506 2649109 2687811
57134 2687811 2726830 2766455 2807056 2848809 2891620 2935470 2980532 3026794 3073919 3121666 3170053
57123 3170053 3219059 3268766 3320123 3375077 3435567 3502683 3576994 3659098 3749500 3848439 3956418
57112 3956418 4074537 4203940 4345425 4500313 4671565 4863644 5081637 5331379 5620670
57103 5620670 5960111 6363091 6845995 7429068 8136900 8997872 10043323 11307009 12823464
57094 12823464 14623679 16729162 19147903 21874548 24893989 28186434 31732455 35514694
57086 35514694 39510347 43672013 47904905 52055258 55919564 59272809 61907190 63671264
57078F3671264Q26063r2023r23227j631896k207684k654337k982694l206309l337054
57069D7462103l385219l366004l303164l221155l132273l032736k910600k755877
57061B2355075k565519k344497k104920j862121j629010j413272j218838j047762
57053H169136r00188p74348o67804n78212n02912m39045l84592l38416k99110
57044C284509k64812k34320k07319j83399j61826j42407j25381j10336r6286q3030
57034A675393p1265o1098n1639m2267l3179k4445j5956q980o512j0977k1895l6187
57022A290993n0163o1028o7436o9495o8144o4336n9037n3482m8556m3981l9029
57011F66306l4002l0016k7325k5037k2612k0488j8947j7506j5852j4392j3456
$$ plain form
57078 63671264 64497327 64405304 63482077 61850181 59642497 56988160 54005466 50799157 47462103
57069 47462103 44076884 40710880 37407716 34186561 31054288 28021552 25110952 22355075
57061 22355075 19789556 17445059 15340139 13478018 11849008 10435736 9216898 8169136
57053 8169136 7268948 6494600 5826796 5248584 4745672 4306627 3922035 3583619 3284509
57044 3284509 3019697 2785377 2578058 2394659 2232833 2090426 1965045 1854709 1758423 1675393
57034 1675393 1604128 1543030 1491391 1449124 1415945 1391500 1375544 1366564 1360052 1349075 1327180 1290993
57022 1290993 1240830 1179802 1112366 1042871 974727 910391 851354 797872 749316 705335 666306
57011 666306 632304 602288 574963 549926 527314 506826 487879 470373 454521 440129 426673
57000D26673j2764j2077j1459j0703r363p684o506n938n161l837k591j724m99
56987C36367J583L883N673P148Q553R235Q383O220L551O32k822o702j0172j2170
56973C59362j2096j0338q136o556n498m150k217M7K651N713Q521J0027J0451J1185
56959C58966J2830J4481J5291J5426J4888J2701Q140J909m599j0416j4886j7443
56947D07288j8189j7848j6592j3839r821o129l917k498n75K116N233Q807J2747
56934C46783J6150J8300J9703K1134K2255K1975J9540J4461O329m026j3957k0876
56922D67771k4475k6132k6672k5951k4129k1940j9704j7261j4876j3188j2158
56911B41285j0971r125o934m964l537k790k589k426j859r78p4R35K244L673M913
$$ plain form
57000 426673 413909 401832 390373 379670 370307 362623 356117 350179 345018 341181 338590 336866 336367
56987 336367 337950 341833 347506 354654 363207 372442 380825 387045 390596 391228 388406 381704 371532 359362
56973 359362 347266 336928 328792 322236 316738 312588 310371 310418 313069 318782 327303 337330 347781 358966
56959 358966 371796 386277 401568 416994 431882 444583 452723 454632 450033 439617 424731 407288
56947 407288 389099 371251 354659 340820 330999 324870 320953 318455 317880 319996 325229 334036 346783
56934 346783 362933 381233 400936 422070 444325 466300 485840 500301 506630 502604 488647 467771
56922 467771 443296 417164 390492 364541 340412 318472 298768 281507 266631 253443 241285
56911 241285 230314 221189 214255 209291 205754 202964 200375 197949 196090 195112 195038 195973 198217 201890 206803
56896B06803N978O970P826Q777J0514J3245J6060J7972J9122K0204K1132K1198
56884C75801K0102J7849J3892P630j65p396j2367j4840j5384j4528j2759j0554
56872C47281p931m495j39M610R226J3813J8854K4418K9843L4237L7320L9724M2221
56859E88982M4549M5201M2354L4873K2708P186q892k2251l0917l4910l5187l2590
56847F21106k7938k2194j5804q446pQ801J7346K5938L5016M4020N1895N8317O3642
56834H51692O7887P0369P0007O5249N4165L5622J0804j6587m1667o0181p0153
56823A037207p2624p0395o5523n8348m9019l8777k8955j9568j0009l89Q763J7543
56811F49906K6200L4028L9964M3955M6614M7610M5437L8666K6601R265j1794l2692
$$ plain form
56896 206803 212781 219751 227577 236354 246868 260113 276173 294145 313267 333471 354603 375801
56884 375801 395903 413752 427644 435274 435109 427713 415346 400506 385122 370594 357835 347281
56872 347281 339350 334855 334716 339326 348552 362365 381219 405637 435480 469717 507037 546761 588982
56859 588982 633531 678732 721086 755959 778667 785853 776961 754710 723793 688883 653696 621106
56847 621106 593168 570974 555170 546724 546717 555518 572864 598802 633818 677838 729733 788050 851692
56834 851692 919579 989948 1059955 1125204 1179369 1214991 1225795 1209208 1167541 1107360 1037207
56823 1037207 964583 894188 828665 770317 721298 682521 653566 633998 623989 623600 632363 649906
56811 649906 676106 710134 750098 794053 840667 888277 933714 972380 998981 1008246 996452 963760
56799I63760m8831n7946o0968n9914n5936m9718m2440l5396k9060k3110j7091
56788D83350j0794m275K190Q213J3424J7470K0147K1691K2509K2281J9724J3778
56776F29708M745o051j7186k7195l4445l8023l8605l7636l5812l3025k9490k5961
56764C11024k2912k0309j8087j6194j4254j1939r650q111p369o817o121n424m841
56751A58996m334m029l944l675k914k060j658j556j350j180j284j152k44P74O89
56736A31079m54j382j380r47o11k23L22P16Q94J205J637J669J128M40m4l79n51
56719A33119m55l62n74p05j36Q12J216J011J025J370J149P6p92o34r1j34n58m68
56701A34869K66R18R52N17Q2l2J76L81K81J0m1J93L86L30J15r4o8M70J359J720
$$ plain form
56799 963760 914929 856983 796015 736101 680165 630447 588007 552611 523551 500441 483350
56788 483350 472556 468281 470471 478684 492108 509578 529725 551416 573925 596206 615930 629708
56776 629708 634453 628402 611216 584021 549576 511553 472948 435312 399500 366475 336985 311024
56764 311024 288112 267803 249716 233522 219268 207329 197679 189568 182199 175382 169261 163837 158996
56751 158996 154662 150633 146689 143014 140100 138040 136382 134826 133476 132296 131012 129860 129616 130390 131079
56736 131079 130625 129243 127863 126916 126305 126082 126404 127120 128014 129219 130856 132525 133653 134093 134049 133670 133119
56719 133119 132664 132302 131728 131023 130887 131699 132915 133926 134951 136321 137470 137546 136754 136120 136029 135895 135337 134869
56701 134869 135135 136053 137005 137522 137604 137572 137748 138129 138410 138420 138379 138572 138958 139288 139403 139309 139241 139711 141070 142790
56681A42790R15l97r28m55Q2J07M4K51L11j66q43j197j186r85n81j9M28N85N85
56662A39341N78O36R05J437J826J617J001O33P32R76J140J266J296J175J198J587
56646A57344J946J839J612J827K149J864J217J090J470J518J168J275J957K179
56632A80455J390L59j38l40p25j236j739k267k435j603r4Q26O29J15j04n31j501
56615A71061k180j718m94N98J268J514J080O7p22q12p74j134j375q15J91Q26R85
56598A67566J054J075R29Q29R42R00L79k83o52q35j013q87k76L72O44Q16J232
56581A72792J574J485J275J297J204O44J31L91J213J849K204K745L441L708L393
56566A99346L043L167L780M716N855O957P682P888P748P507P230O752N861M657
$$ plain form
56681 142790 143705 143308 142380 141925 142007 142114 142158 142409 142720 142554 141711 140514 139328 138343 137762 137743 138171 138756 139341
56662 139341 139919 140555 141460 142897 144723 146340 147341 147974 148706 149682 150822 152088 153384 154559 155757 157344
56646 157344 159290 161129 162741 164568 166717 168581 169798 170888 172358 173876 175044 176319 178276 180455
56632 180455 181845 182204 182066 181726 181001 179765 178026 175759 173324 171721 171627 172453 173082 173197 173093 172562 171061
56615 171061 168881 167163 166669 167267 168535 170049 171129 171196 170474 169662 168888 167754 166379 165564 165755 166581 167566
56598 167566 168620 169695 170624 171453 172395 173295 173674 173391 172739 171904 170891 170004 169728 170100 170744 171560 172792
56581 172792 174366 175851 177126 178423 179627 180271 180402 180793 182006 183855 186059 188804 192245 195953 199346
56566 199346 202389 205556 209336 214052 219907 226864 234546 242434 250182 257689 264919 271671 277532 282189
56552B82189L617K985K365J337K55k40k95o27j315j798k095k896m196m977m695
56537B69614m070l857l753l231k564k295k368k488k683k954k879k194j295p07
56523B32276n01n18o28n57j41J18m57j512j938j518j259j730k329k589k939l547
56507B10231l725l241k931l181l105k180j348j390j504q16j14n44j499j456l12
56492A82885O74Q22N33J94j29r9N73J400J613J197O29N1m61l90M85J315J196M63
56474A92951J36M79J055J650K148K077J319P50J120J751J389n6j598k490k499
56459B00182j431M38J939K100J328N74n2q06j191o48J55J58m02m30J74N60M95
56442B03143O16J076J241P77L7n87q94o65p4J18l03k98R30K366K437J265K98J12
$$ plain form
56552 282189 285806 288791 291156 292493 292748 292508 292213 291586 290271 288473 286378 283482 279286 274309 269614
56537 269614 265544 261687 257934 254703 252139 249844 247476 244988 242305 239351 236472 234278 232983 232276
56523 232276 231775 231257 230629 230072 229931 230049 229592 228080 226142 224624 223365 221635 219306 216717 213778 210231
56507 210231 206506 203265 200334 197153 194048 191868 190520 189130 187626 186810 186696 186152 184653 183197 182885
56492 182885 183559 184381 184914 185108 184979 184880 185453 186853 188466 189663 190292 190343 189882 189492 189977 191292 192488 192951
56474 192951 193087 193566 194621 196271 198419 200496 201815 202565 203685 205436 206825 206769 205171 202681 200182
56459 200182 198751 199189 201128 203228 204556 205130 205078 204272 203081 202433 202588 202746 202344 201914 202088 202648 203143
56442 203143 203759 204835 206076 206853 206890 206303 205409 204744 204670 204788 204485 204187 205117 207483 209920 211185 211483 211595
56424B11595J52K37P68J512J737J516J522J608J052Q2k94o9k64j094j545j086
56408B17429m22j64nL88P75R50J030R63O04L35O45J201J312J143J285J460J026
56391B29955M97R50J914J687K0j293j026r1K85L59Q65J471J388P47L26M38Q01
56374B39293J088J094P49L42L56Q46J399J726J842J739J459J313J381J040j28
56359B55539j267j103K66J538K013K026J744Q78k09m54L90J286J343Q53N41P19
56343B66103J357K218K694K369J797J870K434K506J899J508J803K137J858J177
56329B93730O76P05J379K471L256L291L119L353L487K708J512J057J190P33k54
56314C22413l22J009K360K560K173K260K829L203L022K413J856K079L265M383
$$ plain form
56424 211595 211747 211984 212752 214264 216001 217517 219039 220647 221699 221781 221487 221418 221154 220060 218515 217429
56408 217429 217007 216843 216838 217226 218001 218951 219981 220944 221548 221883 222528 223729 225041 226184 227469 228929 229955
56391 229955 230452 231402 233316 235003 235023 233730 232704 232613 232898 233257 234122 235593 236981 237728 238054 238492 239293
56374 239293 240381 241475 242224 242566 242922 243768 245167 246893 248735 250474 251933 253246 254627 255667 255539
56359 255539 254272 253169 253435 254973 256986 259012 260756 261634 261425 260971 261361 262647 263990 264843 265384 266103
56343 266103 267460 269678 272372 274741 276538 278408 280842 283348 285247 286755 288558 290695 292553 293730
56329 293730 294406 295111 296490 298961 302217 305508 308627 311980 315467 318175 319687 320744 321934 322667 322413
56314 322413 322091 323100 325460 328020 330193 332453 335282 338485 341507 343920 345776 347855 351120 355503
56300C55503M333L554L375L911M091L705L696M273M408L721L213L664M642N642
56286D11731O753P726P810P138O874P443Q013Q158Q602R648J0434J0511J0747
56273E21588J1834J3193J4212J5342J7077J8978K0566K2128K3861K5346K6667
56262G30792K8913L2731L7340M1846M6561N2195N8669O5559P2971Q1136Q9790
56251A338503R8481J07027J15261J22927J29993J36346J41063J42914J41624J37728
56241B611867J31239J21654J09157R4463P7518N7822L6158J4321p014k8386m9362
56230C169437o8102q3646r6762j07934j16266j21225j23743j24738j24030j21493
56220B081498j17766j13151j07280j00569r4409q9168q3608p7026p0366o4487
$$ plain form
56300 355503 359836 363390 366765 370676 374767 378472 382168 386441 390849 394570 397783 401447 406089 411731
56286 411731 418484 426210 434020 441158 448032 455475 463488 471646 480248 489896 500330 510841 521588
56273 521588 533422 546615 560827 576169 593246 612224 632790 654918 678779 704125 730792
56262 730792 759705 792436 829776 871622 918183 970378 1029047 1094606 1167577 1248713 1338503
56251 1338503 1436984 1544011 1659272 1782199 1912192 2048538 2189601 2332515 2474139 2611867
56241 2611867 2743106 2864760 2973917 3068380 3145898 3203720 3239878 3254199 3247185 3218799 3169437
56230 3169437 3101335 3017689 2920927 2812993 2696727 2575502 2451759 2327021 2202991 2081498
56220 2081498 1963732 1850581 1743301 1642732 1548323 1459155 1375547 1298521 1228155 1163668
56210A163668n8986n3577m8949m5266m1489l7081l2971k9935k7526k5299k3497
56199G39092k1799j9202j5909j3475j2286j0852q527o764o545o675n978n140m971
56186F00969m765l878l177l300l331k560j873j873j526k08Q04N53K67J144K107
56171E79353J761R60J280K393K971L008L339L908M329N086O543P863Q395Q913
56157F40102J0114J1282J1819J2629J4493J6658J8500K0981K4793K8851L2339
56146H42561L6473M2375M9025N5242O1901P0052P8535Q5735R1941R7592J00757
56135A612189R9020R2792Q4381P5010O4979N5532M8042M2151L6840L2238K8320
56124B271494K3118J4619L678p025j6028k3346k9086l3962m0089m8936n9386o9422
$$ plain form
56210 1163668 1104682 1051105 1002156 956890 915401 878320 845349 815414 787888 762589 739092
56199 739092 717293 698091 682182 668707 656421 645569 637042 630278 623733 617058 611080 605940 600969
56186 600969 596204 592326 589149 585849 582518 579958 578085 576212 574686 574478 575282 575835 576102 577246 579353
56171 579353 581114 582074 583354 585747 588718 591726 595065 598973 603302 608388 614931 622794 631189 640102
56157 640102 650216 661498 673317 685946 700439 717097 735597 756578 781371 810222 842561
56146 842561 879034 921409 970434 1025676 1087577 1157629 1236164 1321899 1413840 1511432 1612189
56135 1612189 1711209 1804001 1888382 1963392 2028371 2083903 2131945 2174096 2210936 2243174 2271494
56124 2271494 2294612 2309231 2312909 2305884 2289856 2266510 2237424 2203462 2163373 2114437 2055051 1985629
56112A985629p8556q6722r2413r4025r1897q7090p9628o9913o0131n2085m5077
56101A148092l8009l1712k7022k2532j6939j1765q978p570n349k555p77K11J635
56088I76730L077L517L711M882O342O938P330Q296Q653P563O872Q161R561Q807
56074A070440P370P918R708J0320J0154J1192J2814J3040J2640J3883J6283J7474
56062A213236J7319J7323J7140J5576J3895J4160J5369J5124J4095J4689J6481
56051A384407J7136J6847J7697J9469K0251K0320K1328K2659K2662K2429K4121
56040A609326K6646K7375K7037K8501L1664L4063L5427L7255L8938L8864L8288
56029A973384L9546M1707M2394M2350M3524M4528M3165M1576M3305M7028M8974
$$ plain form
56112 1985629 1907073 1820351 1727938 1633913 1542016 1454926 1375298 1305385 1245254 1193169 1148092
56101 1148092 1110083 1078371 1051349 1028817 1011878 1000113 991135 983565 978216 975661 974884 975095 976730
56088 976730 979807 983324 987035 991917 998259 1005197 1012527 1020823 1029476 1037039 1043911 1052072 1061633 1070440
56074 1070440 1077810 1085728 1095436 1105756 1115910 1127102 1139916 1152956 1165596 1179479 1195762 1213236
56062 1213236 1230555 1247878 1265018 1280594 1294489 1308649 1324018 1339142 1353237 1367926 1384407
56051 1384407 1401543 1418390 1436087 1455556 1475807 1496127 1517455 1540114 1562776 1585205 1609326
56040 1609326 1635972 1663347 1690384 1718885 1750549 1784612 1820039 1857294 1896232 1935096 1973384
56029 1973384 2012930 2054637 2097031 2139381 2182905 2227433 2270598 2312174 2355479 2402507 2451481
56018B451481M9823N3045N8094O1599O3903O7849P2515P4805P6018P9935Q5598
56007C194665Q8977R0618R4447J00249J04729J08670J15466J23802J29681J34411
55997D285715J42334J52127J59015J64209J73050J85077J95475K05103K19083
55988E881188K36583K52373K67527K87772L12291L35451L58498L87668M21905
55979H741256M55205M89968N34416N87863O42997P01978P74698Q61966R57207
55970A4747554J064386J196260J355348J536469J748724K014354K346127K749749
55962B8758971L250237L890954M705575N718374O969015Q496006J0287791J2292823
55954H4369746J4490489J6899255J9477829K2051036K4367728K6217157K7486239
$$ plain form
56018 2451481 2501304 2554349 2612443 2674042 2737945 2805794 2878309 2953114 3029132 3109067 3194665
56007 3194665 3283642 3374260 3468707 3568956 3673685 3782355 3897821 4021623 4151304 4285715
55997 4285715 4428049 4580176 4739191 4903400 5076450 5261527 5457002 5662105 5881188
55988 5881188 6117771 6370144 6637671 6925443 7237734 7573185 7931683 8319351 8741256
55979 8741256 9196461 9686429 10220845 10808708 11451705 12153683 12928381 13790347 14747554
55970 14747554 15811940 17008200 18363548 19900017 21648741 23663095 26009222 28758971
55962 28758971 32009208 35900162 40605737 46324111 53293126 61789132 72076923 84369746
55954 84369746 98860235 115759490 135237319 157288355 181656083 207873240 235359479
55947B35359479K8138044K8097281K7010795K4067866J8285116R325791j804569
55940C68479803j2983732k2064297k7894543l0504168l0608491k9073266k6660398
55933A88690908k3940294k1248829j8722220j6402546j4308068j2432733j0747637
55926G0888581r234540p897386o735303n730276m867063m140485l536517l028019
55918B5718992k595768k235410j939341j689913j475269j295195j146563j018188
55910A2323345r04123q07774p28636o58175n92471n36229m90578m48929m08392
55901F748038l73783l46646l21140k94491k71272k53639k36772k17712j99926
55892D232657j85736j72391j58657j47535j39623j31161j21075j12834j07346
$$ plain form
55947 235359479 263497523 291594804 318605599 342673465 360958581 370284372 368479803
55940 368479803 355496071 333431774 305537231 275033063 244424572 215351306 188690908
55933 188690908 164750614 143501785 124779565 108377019 94068951 81636218 70888581
55926 70888581 61654041 53756655 47021352 41291076 36424013 32283528 28747011 25718992
55918 25718992 23123224 20887814 18948473 17258560 15783291 14488096 13341533 12323345
55910 12323345 11419222 10611448 9882812 9224637 8632166 8095937 7605359 7156430 6748038
55901 6748038 6374255 6027609 5706469 5411978 5140706 4887067 4650295 4432583 4232657
55892 4232657 4046921 3874530 3715873 3568338 3428715 3297554 3176479 3063645 2956299
55883B956299j01361r4684r1489r2355r2340q9138q5978q4275q0631p3815o7857
55872B002376o5308o3571o0568n8131n7195n5394n1892m9228m8179m5987m1804
55861A405119l8533l7361l5730l2653l0669l0515k9261k5923k3699k4248k4823
55850A071704k3466k2182k2515k2632k1303k0427k1134k1546k0594j9978k0315
55839H35612j9434j6622j4416j4119j3614j1751j0718j1790j2736j1821j0624
55828F87967j0525j0086q367p242p997q934q653q503r560j0339r763r367j0333
55815E68298j1176j0473r169q323p275n718m802m612l446j005O98J017J912M044
55801E09970N181M300L730N040O219N234L242J840K25k403m516m875m935o143
$$ plain form
55883 2956299 2854938 2760254 2668765 2576410 2484070 2394932 2308954 2224679 2144048 2070233 2002376
55872 2002376 1937068 1873497 1812929 1754798 1697603 1642209 1590317 1541089 1492910 1446923 1405119
55861 1405119 1366586 1329225 1293495 1260842 1230173 1199658 1170397 1144474 1120775 1096527 1071704
55850 1071704 1048238 1026056 1003541 980909 959606 939179 918045 896499 875905 855927 835612
55839 835612 816178 799556 785140 771021 757407 745656 734938 723148 710412 698591 687967
55828 687967 677442 667356 658989 651747 643750 634816 626163 617660 608100 597761 587998 578631 568298
55815 568298 557122 546649 537480 529157 521882 516164 511362 506750 503304 502299 502997 504014 505926 509970
55801 509970 515151 519451 523181 528221 534440 539674 542916 544756 544981 542578 538062 533187 528252 522109
55787E22109p411p455p231p763q087p522p476q665r105p278m849l706k734k23
55773D32604K712L962L837L897L913K483n97m526q684j1912j2491j0673r297j0024
55759C85204j0970j0088q524q274q639p897o660o599p205o690n169m277m263l923
55745B86026k891j954j503j354j576k098k210j655j274j500j532j091j380k907
55731B61101m028l401k199k145k823k922k695l148l886l883l350k994k353p05
55717B20569J193K038J934J882K143K449K923L419L047J603L97L16L16p15j933
55702B41581k054j569j790k712l557m411n654o669o720o231n821n056l549k160
55688A83628j650j307l10P02R11Q82J327J557Q67J83O48J678K127K189K425K234
$$ plain form
55787 522109 514698 507243 500012 492249 484162 476640 469164 460499 451394 444116 439267 435561 432827 432604
55773 432604 435316 439278 443115 447012 450925 453408 452811 448285 439601 427689 415198 404525 395228 385204
55759 385204 374234 364146 355622 347348 338709 330812 324152 317553 310348 303658 298489 294212 289949 286026
55745 286026 283135 281181 279678 278324 276748 274650 272440 270785 269511 268011 266479 265388 264008 261101
55731 261101 257073 253672 251473 249328 246505 243583 240888 237740 233854 229971 226621 223627 221274 220569
55717 220569 221762 223800 225734 227616 229759 232208 235131 238550 241597 243200 243597 243913 244229 243514 241581
55702 241581 239527 237958 236168 233456 229899 225488 219834 213165 206445 200214 194393 189337 185788 183628
55688 183628 181978 180671 180361 181063 181974 182856 184183 185740 186607 186790 187438 189116 191243 193432 195857 198091
55672A98091J046j52l76m80j529k596k272j144o76p24l68r0p25j249j43J794K480
55655A90887J837J533J948J960J428J393J838J577M83l54p58j649k989l599l259
55640A92276l105l640m135m220m392m675m428l707l297l158k442j249q27j615
55626A47386k526k578j968j237n16P6K67J94J98Q8n45j421j762j372o18K30Q44
55609A34740N17r03k292k561k149k062k079j409m90m46j130j358q96n59n43l12
55593A16068k6m26j250j346n23K31M58P37J254J372R30O48R00J199J213J222J404
55576A24065J569J833K549L514M089M126L939L494K545J379N28o1p28j321j646
55561A49874k157l120l702l126k173k102k649k665k249k482l271l367k502j766
$$ plain form
55672 198091 199137 198985 198609 198129 196600 194004 191732 190588 189912 189188 188820 188730 188005 186756 186613 188407 190887
55655 190887 192724 194257 196205 198165 199593 200986 202824 204401 204884 204530 203772 202123 199134 195535 192276
55640 192276 189171 185531 181396 177176 172784 168109 163681 159974 156677 153519 151077 149828 149001 147386
55626 147386 144860 142282 140314 139077 138561 138637 138904 139098 139296 139384 138839 137418 135656 134284 133666 133896 134740
55609 134740 135257 134354 132062 129501 127352 125290 123211 121802 121312 120866 119736 118378 117482 116923 116380 116068
55593 116068 116042 115616 114366 113020 112497 112728 113186 113923 115177 116549 117479 118127 119027 120226 121439 122661 124065
55576 124065 125634 127467 130016 133530 137619 141745 145684 149178 151723 153102 153630 153569 152841 151520 149874
55561 149874 147717 144597 140895 137769 135596 133494 130845 128180 125931 123449 120178 116811 114309 112543
55547A12543j691j608j112o55m42j06L14L69L22Q76J765J914J122K51k58o68q03
55530A12133k25M83K38o69q92l37m11j629k791k974k670k405j885j155r84j437
55514I2390j542r72o67j064j277p37j81j44NO10P36k38j211q24N86J579J458O45
55496H9152j75m63l0N93O17J74J77O56M50q35j801j162L93J277J077N19Pn92j142
55477H8892j231q17k37K74O88J028J450K034K327J650K00q54q08k50q8l38m01
55460I3519k7M90P51N14q9m70j36N79Q53M65o8l79n50n47k11J40pm58n83n16r33
55439I2337j665j712r33l73n43o88k93Qk36l20M14J377J689J438J161Q69M83M59
55421I3472J070J641J406O09K5r9M1M15R52J195Q51L37J55J80M2k63o11j186k059
$$ plain form
55547 112543 110852 109244 108132 107477 107035 106929 107243 107612 107934 108810 110575 112489 113611 113862 113604 112936 112133
55530 112133 111908 112391 112629 111960 111068 110731 110320 108691 105900 102926 100256 97851 95966 94811 93827 92390
55514 92390 90848 89876 89209 88145 86868 86131 85950 85806 85811 86421 87157 86919 85708 84884 85470 87049 88507 89152
55496 89152 88977 88514 88484 89077 89694 89868 90045 90701 91151 90316 88515 87353 87746 89023 90100 90619 90626 90034 88892
55477 88892 87661 86844 86607 86881 87569 88597 90047 92081 94408 96058 96258 95404 94596 94346 94258 93920 93519
55460 93519 93492 93982 94733 95247 95158 94688 94552 95131 95984 96449 96381 96002 95452 94905 94694 94834 94827 94369 93786 93270 92337
55439 92337 90672 88960 88027 87654 87111 86423 86130 86138 85902 85582 85996 87373 89062 90500 91661 92530 93013 93472
55421 93472 94542 96183 97589 98198 98223 98124 98165 98580 99532 100727 101578 101915 102070 102250 102292 102029 101418 100232 98173
55402I8173k751k739k072j154l00K00J35k00j53L51N39j06j021j250n54M76J045
55385H8619O47n63j718j994j519j051q64o68m97o10n82K82J461J452p1j551j683
55368G9090r85n26k15O03J776K581K770K563K071J438J061J103J255J349J522
55353I7456J510P18n47r96j83N82Jj413k227j965j194m50Lj00o32r53p99p24r37
55334H7150o41O25J864J896J078O13P59Q38O38N27M54k0p82j165r33m81j53M9
55316I2316J44Q9p9l90r29j406j227m25J11j46n42k58M81R00P76L62j86n58r1
55297H8942J269K356K074Q29j14k75o4K54O98R45N66k27q20j018r85o51O5P00
55279I4544O76J11l75m47j18N19J082Q57l06j493j774j340r43o93k36L71P69R77
$$ plain form
55402 98173 95422 92683 90611 89457 89157 89357 89492 89292 89139 89490 90029 89923 88902 87652 87098 87574 88619
55385 88619 89266 88703 86985 84991 83472 82421 81557 80889 80392 79782 79200 79482 80943 82395 82324 80773 79090
55368 79090 78105 77579 77364 77967 79743 82324 85094 87657 89728 91166 92227 93330 94585 95934 97456
55353 97456 98966 99684 99137 98141 97958 98540 98541 97128 94901 92936 91742 91292 91295 91195 90563 89610 88811 88087 87150
55334 87150 86509 87134 88998 90894 91972 92585 93344 94182 94820 95347 95801 95781 94999 93834 92901 92420 92267 92316
55316 92316 92460 92549 92470 92080 91151 89745 88518 88093 88204 88058 87516 87258 87739 88639 89415 89777 89591 89033 88942
55297 88942 90211 92567 94641 95470 95356 95081 95017 95271 95969 96914 97480 97253 96433 95415 94430 93779 93844 94544
55279 94544 95220 95331 94956 94509 94391 94910 95992 96849 96543 95050 93276 91936 90993 90300 90064 90435 91204 92181
55261I2181J153J056N31J42N25J338J654J143K46n44r22p01j06K11K7j43p2l74
55243I7345j300j840j067L43J019P12J36l87r07j028m01L25L40M5L32Q83O35l12
55225I4873p48k46L48M23L12L50L60L01L33K54k10n94k72L49L58n1J54R46J090
55206I8330J42q01p56j08L06L02N8l52o51m23K29P85J170J635J807R77m49j085
55188A01116n02K03J59j15N6K97N1l35k69K6n6n55j070j366j312p07K51Q62P54
55169I7488L85K90L76L35K45K57K26J16K69Q66J520J806J784J606J149M53L7K39
55151A09447N83L21o34j658k139j922j290p05m60m27l40j80l4K43O88P38j53j375
55133A00703j558l32J091J475J024O83O64M13l07r55r33l24K20K34k7k6J77j10
$$ plain form
55261 92181 93334 94390 94921 95063 95588 96926 98580 99723 99969 99425 98503 97802 97696 97907 97934 97791 97719 97345
55243 97345 96045 94205 93138 93481 94500 95212 95348 94961 94054 93026 92625 92950 93290 93335 93667 94550 95185 94873
55225 94873 94125 93879 94227 94650 94962 95312 95672 95973 96306 96560 96350 95756 95484 95833 96191 96140 96294 97240 98330
55206 98330 98472 97671 96915 96807 97113 97415 97473 97121 96470 96047 96276 97061 98231 99866 101673 102650 102201 101116
55188 101116 100614 100817 100976 100861 100917 101214 101265 100930 100661 100687 100631 100076 99006 97640 96328 95621 95872 96734 97488
55169 97488 97873 98163 98539 98874 99119 99376 99602 99718 99987 100853 102373 104179 105963 107569 108718 109171 109208 109447
55151 109447 110030 110351 109717 108059 105920 103998 102708 102003 101543 101116 100776 100596 100562 100805 101493 102231 102078 100703
55133 100703 99145 98813 99904 101379 102403 103086 103750 104163 103856 102901 101968 101644 101864 102098 102071 102045 102222 102112
55115A02112j035j613r77K52P27K75%N19J218J441J354J295J119O95K96Q4j24
55098A07638k75JN91P57K72j17K14Q63J174J196J291J394J217P99L02k47o38m67
55080A15965J15K85k40n21K96J557J840Q45l20p14o15q94j805k718k736j518L07
55063A09129J587J606O90j65j90M81R58M45q32j772j674j021o38n12j21M49O26
55046A09046M25L48K79l89j413j642p24K70M36K08K41K40k41o03N8J489K497K380
55028A12905J434L01n43q29o93o44r22j116p95j38M37Q38J088R76M68M4O4J90
55010A13065j8l33k42K00M55K73j28l78j54O15J369J259K49n87l67N20J201J542
54992A18541J858J959J468P46N18O91M31m60j189j109m93J35P10J269J374N09
$$ plain form
55115 102112 101077 99464 98487 98739 99466 99741 99741 100260 101478 102919 104273 105568 106687 107382 107678 107762 107638
55098 107638 107363 107364 107955 108712 108984 108867 109081 109944 111118 112314 113605 114999 116216 117015 117317 117070 116432 115965
55080 115965 116080 116365 116125 115604 115900 117457 119297 120142 119822 119108 118493 117599 115794 113076 110340 108822 109129
55063 109129 110716 112322 113012 112847 112657 113138 114096 114541 113709 111937 110263 109242 108604 108092 107971 108420 109046
55046 109046 109471 109819 110098 109709 108296 106654 105930 106200 106636 106844 107085 107325 107084 106481 106539 108028 110525 112905
55028 112905 114339 114640 114097 113268 112575 111931 111009 109893 109098 108960 109397 110235 111323 112299 112767 112811 112875 113065
55010 113065 113047 112714 112472 112672 113127 113400 113272 112894 112740 113355 114724 115983 116232 115645 115278 115798 116999 118541
54992 118541 120399 122358 123826 124572 125090 125781 126212 125752 124563 123454 122961 123096 123806 125075 126449 126958
54976A26958r83j887j306K15J173Q07o1k32K20K57m26j033j030p71m44M33J826
54959A23716K535J784N67L61J063J378P89o8p14j321j882j954j448p81j80M13
54943A24258P24L12n61j109j134j162j267p36O89K063K387J899J647K134K887
54928A33031L178K765K091J971K866M269N096M877M290M244M731M871M000K317
54914A84597N42q44j869k794l679m331m641m777m909m859m268l150k037j489j521
54899A39971j628j378r43r36j573k205j931p06N33J002R50J135J725K168K082
54884A38266J820K020K794L619M012M144M515N107N241M533L538K909K271P60
54870A85549j434k973l107k675k919l901m690m645l949l162k715k682k668k216
$$ plain form
54976 126958 125975 124088 122782 122997 124170 124977 124916 124684 124904 125161 124735 123702 122672 121901 121457 121890 123716
54959 123716 126251 128035 128602 128963 130026 131404 132193 132125 131411 130090 128208 126254 124806 124025 123845 124258
54943 124258 124982 125294 124733 123624 122490 121328 120061 119325 120014 122077 124464 126363 128010 130144 133031
54928 133031 136209 138974 141065 143036 145902 150171 155267 160144 164434 168678 173409 178280 182280 184597
54914 184597 185139 184295 182426 179632 175953 171622 166981 162204 157295 152436 148168 145018 142981 141492 139971
54899 139971 138343 136965 136022 135086 133513 131308 129377 128671 129204 130206 131156 132291 134016 136184 138266
54884 138266 140086 142106 144900 148519 152531 156675 161190 166297 171538 176071 179609 182518 184789 185549
54870 185549 184115 181142 178035 175360 172441 168540 163850 159205 155256 152094 149379 146697 144029 141813
54856A41813j503j242j624j919j557j066j343k349l151l034k080q97j50j04l02
54841A19492kP42R53J26q70r01j11M44L43J22K11L76K69j01m76n10Q7J076J611
54822A22881J116R9n03n02m45n79o00l44m5J71M54P59P39J74p10j383j274k30
54804A19778J039J404N95l17k92L47O36M78N04Q14Q36L64k24o65r44p66Q4R88
54786A24659J080N91N47J086J242O70K82O86J176J036Q32J400K360K726K564K950
54770A45887M349N977O900P055O919O696O127M966L386J868P67k2r07k139l566
54755A94263m743n269n115m755m761n127n201m482l210j955r11p9K80j06r40j561
54739A46328j632j210l79N99J071O34q3l9Q77J772J998J774J590J697K283L336
$$ plain form
54856 141813 140310 139068 137444 135525 133968 132902 131559 129210 126059 123025 120945 120048 119898 119794 119492
54841 119492 119490 120232 121185 121311 120441 119540 119429 119873 120216 120338 120549 120925 121194 121093 120617 120107 120194 121270 122881
54822 122881 123997 124096 123593 123091 122646 122067 121467 121123 121078 121249 121703 122462 123201 123375 122665 121282 120008 119778
54804 119778 120817 122221 122816 122499 122207 122554 123190 123668 124172 124986 125822 126186 125962 125297 124353 123587 123671 124659
54786 124659 125739 126330 126877 127963 129205 129875 130157 130843 132019 133055 133887 135287 137647 140373 142937 145887
54770 145887 150236 156213 163113 170168 177087 183783 189910 194876 198262 200130 200897 200875 199968 197829 194263
54755 194263 189520 184251 179136 174381 169620 164493 159292 154810 151600 149645 148734 148655 148935 148829 147889 146328
54739 146328 144696 143486 143107 143706 144777 145411 145328 145289 146166 147938 149936 151710 153300 154997 157280 160616
54723A60616M304M558M288M202M228L454J616l09j427k019k807l819m568m818
54709A67499m553l716k547j744j709j991j949j705j809k297k578k201j346n86
54695A36768m02q08j331j512j417j383j290o65L99J074Q60K28k06n48j089j408
54679A27270p46Q05K123K096O99r90j619o67R99J864J228k22j353j699j468r14
54663A27406j92M84Q91J010Q83N00k4l74l92k95l08l18j16K02L41J73j82m89n09
54644A28691j73K61M26K84O5k27p74j385j456p95QL13J99J66M55R40J456J796
54626A30250J693J066J94n68j062j243j104q33p17p14m30K69J003J378J453J473
54610A32108J509J493J291O38n23j575j636p12J42Q5n43q83o08M5P70J253J156
$$ plain form
54723 160616 164920 169478 173766 177968 182196 185650 187266 186957 185530 183511 180704 176885 172317 167499
54709 167499 162946 159230 156683 154939 153230 151239 149290 147585 145776 143479 140901 138700 137354 136768
54695 136768 136366 135558 134227 132715 131298 129915 128625 127960 128359 129433 130293 130521 130315 129767 128678 127270
54679 127270 126524 127329 129452 131548 132247 131257 129638 128971 129970 131834 133062 132840 131487 129788 128320 127406
54663 127406 127214 127698 128589 129599 130482 130982 130958 130584 130192 129897 129589 129271 129155 129357 129698 129871 129689 129200 128691
54644 128691 128518 128779 129205 129489 129554 129327 128553 127168 125712 124917 124925 125238 125437 125603 126058 126998 128454 130250
54626 130250 131943 133009 133203 132635 131573 130330 129226 128393 127676 126962 126532 126801 127804 129182 130635 132108
54610 132108 133617 135110 136401 137039 136516 134941 133305 132593 132735 132820 132277 131394 130786 130831 131601 132854 134010
54593A34010N35r5m53q32j318j371o94M5P3l14k63L43Q42R55J034J236J188O58
54575A35579j7m04m02j49J66L24K01o8l04n49q06p47j14O84Q80K78m82p17m19
54556A32934o0rk04l17q7L87O95N81K54J95O84J533K211K242J675J090R11Q53
54538A45568M54j6J15P27Q66J86n08o22p42j460k056j460o1O53J36o35p21l74
54520A40050k93n15m91J13J070J804J823J161L80m6k88p41j278j388j007o57o65
54503A39032o93k65O35J591K153K055J355M57j75m04m51n96r62j413j525q28O15
54486A40581J977K337J513J29r38j098l08P93J274Q22Q0j67J10M26N51N85N21
54469A49188K91O1K7O9lK9M42R97J164Q61M00l8l99m34J6M86L55k34n31k84l0
$$ plain form
54593 134010 134545 134450 133997 133165 131847 130476 129782 129827 129900 129586 129323 129666 130508 131463 132497 133733 134921 135579
54575 135579 135562 135158 134756 134607 134773 135097 135298 135230 134926 134377 133571 132824 132710 133394 134274 134552 134070 133353 132934
54556 132934 132874 132865 132661 132344 132257 132644 133339 133920 134174 134369 135053 136586 138797 141039 142714 143804 144715 145568
54538 145568 146022 146006 146121 146848 147714 147900 147392 146770 146028 144568 142512 141052 140991 141644 141780 141145 140424 140050
54520 140050 139757 139242 138751 138864 139934 141738 143561 144722 145102 145056 144768 144027 142749 141361 140354 139697 139032
54503 139032 138339 138074 138709 140300 142453 144508 145863 146320 146145 145741 145290 144694 143732 142319 140794 139966 140581
54486 140581 142558 144895 146408 146537 145599 144501 144193 144986 146260 147082 147162 146995 147105 147531 148082 148667 149188
54469 149188 149479 149540 149567 149636 149633 149662 150104 151101 152265 153126 153526 153488 153089 152655 152671 153157 153512 153278 152747 152463 152433
54448A52433j92n19o20m96l19j10J32L32M47M24Q2n76j033p29R6N94L50k12n39
54429A49545n61m76l69k36l9K99O99P97L82j32j84J78M83N76N93L28n01j424j509
54410A48449o43L52R81J544K078J864O16p11j035m69J74N89R61J186R70M91K34
54393A57631K58K71K71N51J098J538J679J584J161K26r44j639j499r16m57j68
54377A60645K39P67J021P71K89O4J87L12J68n5J9M13Q27J063J212J367J428J314
54359A72051J167J254J679K226K484K241J789J654J910K086J901J725J911K022
54345A98100J304k19j759k747l225l265k737j858j259j236j456j623j916k420
54331A73684k705k456k042j923j859j274k41M91M59N0r7J07K14m0l52k82R7K96
$$ plain form
54448 152433 152241 151722 151102 150606 150287 150177 150309 150641 151088 151512 151594 151018 149985 149256 149352 149946 150296 150084 149545
54429 149545 148984 148508 148139 147903 147864 148163 148862 149659 150041 149909 149725 149903 150386 150962 151555 151883 151382 149958 148449
54410 148449 147806 148158 149139 150683 152761 154625 155241 154530 153495 153026 153200 153789 154750 155936 156906 157397 157631
54393 157631 157889 158160 158431 158982 160080 161618 163297 164881 166042 166268 165324 163685 162186 161270 160813 160645
54377 160645 160884 161651 162672 163443 163732 163796 163983 164295 164463 164408 164427 164840 165667 166730 167942 169309 170737 172051
54359 172051 173218 174472 176151 178377 180861 183102 184891 186545 188455 190541 192442 194167 196078 198100
54345 198100 199404 199185 197426 194679 191454 188189 185452 183594 182335 181099 179643 178020 176104 173684
54331 173684 170979 168523 166481 164558 162699 161425 161184 161675 162134 162184 162087 162194 162408 162368 162016 161734 161831 162127
54313A62127J09j27j32r7j83j07K66L52l63j281j292l75L58K63r1o9R5j3j69j4
54293A59257K55L17L75P26J040P61n8p83r93q22o40o80q49p29m1Q72J326J201
54275A60535R99R20N70j61o12l05L23O73Q82J244J359P30j92m50J01P15Q79P09
54257A68919L84m8l22r8M34P07N65L67L45L51K49M6l35q89j207q85k76j11m27
54238A67769n46k02O5j24l89l02q7r3j15K34P48P85J16p74j203q80q0N11K97o68
54218A65062j651j937j457o85n2L22M89N58O98J035J417J420P96p4l74L35J451
54201A67353J810R07m87j195r14m38n88j310j873j736j039l07N4ml04n60m30K47
54183A59186J104J397Q41M2k00R1L47N38J148K009K096R59m12q61o03o39j155
$$ plain form
54313 162127 162236 162109 161977 161880 161697 161590 161856 162208 161845 160564 159272 158897 159255 159518 159427 159358 159453 159440 159271 159257
54293 159257 159512 159829 160204 160930 161970 162731 162673 161890 160897 160075 159435 158755 157906 157177 157136 158008 159334 160535
54275 160535 161534 162454 163024 162863 162251 161946 162269 162942 163824 165068 166427 167157 166965 166515 166616 167331 168210 168919
54257 168919 169303 169255 168933 168835 169269 169976 170541 170908 171253 171604 171853 171899 171564 170675 169468 168583 168307 168196 167769
54238 167769 167223 167021 167086 166962 166573 166271 166184 166091 165976 166210 166958 167743 167859 167085 165882 165002 164922 165433 165730 165062
54218 165062 163411 161474 160017 159332 159280 159602 160091 160649 161347 162382 163799 165219 166015 165941 165567 165902 167353
54201 167353 169163 170070 169583 168388 167474 167036 166448 165138 163265 161529 160490 160183 160237 160233 159929 159369 158939 159186
54183 159186 160290 161687 162528 162570 162370 162461 162808 163346 164494 166503 168599 169558 169146 168285 167682 167043 165888
54166A65888j441j178q09o28m44k24k81n90o46k82J5n4n2M80J181J259M81o21
54148A62054j299j181m32L92P86O88L77L1k64k78K27R88J388J232R14O74K55m55
54130A66097r84r20n58m27n21n00l14n0N59J817L228L706K791J255K22O7L10L42
54112A76120j5m83o65m05kJ12j06k08J24O18P26L58j8l9Q7m4l96n33k47J56L17
54091A75457K78L33N89R29J239J421J316Q69L42J28L39Q39J546K442L304L817
54075A95188M095M653N666O620P001P050P377P990Q132P117M983K254n64l071
54061B64491m919o018o644p093p245o709n416l843k585j930j792j886j799j220
54047B05392k94M19N50L70M35R70J793K651L317L525L238K914L056L503L668L501
$$ plain form
54166 165888 164447 163269 162460 161832 161388 161164 160883 160293 159647 159365 159380 159326 159274 159754 160935 162194 162675 162054
54148 162054 160755 159574 159142 159534 160320 161008 161385 161416 161152 160874 161101 162089 163477 164709 165623 166297 166552 166097
54130 166097 165113 164193 163635 163208 162687 162187 161873 161823 162382 164199 167427 171133 173924 175179 175401 175468 175778 176120
54112 176120 176105 175622 174957 174552 174550 174662 174556 174348 174472 175090 175816 176174 176156 176117 176204 176160 175764 175231 174984 175140 175457
54091 175457 175735 176068 176657 177586 178825 180246 181562 182431 182773 182901 183240 184079 185625 188067 191371 195188
54075 195188 199283 203936 209602 216222 223223 230273 237650 245640 253772 260889 265872 268126 267562 264491
54061 264491 259572 253554 246910 239817 232572 225863 220447 216604 214019 212089 210297 208411 206612 205392
54047 205392 205098 205517 206067 206437 206872 207842 209635 212286 215603 219128 222366 225280 228336 231839 235507 239008
54031B39008L642M403N157N089M162K995K117J680J551J300M05j036k122k084
54017B66267j286q04j203k084k747k844k454j957j753j904k083k099k204k532
54003B38313k691k317j695j260p92J66J322J888J783J740K117K334J742M14j172
53988B41892k607l508l598l108k708k772l103l400l512l194k299j288q65r14o20
53973B04396Q4J66q89j996j811m77P99J400J608J627J290O63J22k07m69n32q6
53956B05688P33J312J276Q17L35J36M79J413K546L288L426L162K759K425K354
53941B32149K487K418K038K002K906M120M275L077J910K226L867N418N896N602
53927B80391N503O159P343Q473R316J0125J1149J2217J3011J3536J3895J3729
$$ plain form
54031 239008 242650 247053 252210 257299 261461 264456 266573 268253 269804 271104 271509 270473 268351 266267
54017 266267 264981 264177 262974 260890 258143 255299 252845 250888 249135 247231 245148 243049 240845 238313
54003 238313 235622 233305 231610 230350 229558 229724 231046 232934 234717 236457 238574 240908 242650 243064 241892
53988 241892 239285 235777 232179 229071 226363 223591 220488 217088 213576 210382 208083 206795 205930 205016 204396
53973 204396 204480 204646 203757 201761 199950 199473 200272 201672 203280 204907 206197 206860 206982 206775 206306 205774 205688
53956 205688 206421 207733 209009 209826 210161 210297 210776 212189 214735 218023 221449 224611 227370 229795 232149
53941 232149 234636 237054 239092 241094 244000 248120 252395 255472 257382 259608 263475 268893 274789 280391
53927 280391 285894 292053 299396 307869 317185 327310 338459 350676 363687 377223 391118 404847
53915D04847J2337R436N497J340k318m911o165o358o202o283o704p279p696p584
53901C71957o787n706n022m987n223n264n010m630m411m671n407o024n864n078
53887B97873m437m226l983l514l445m248n276n427m471l237k674l110m125m776
53873B40924m239k712j382j119j532j775j794k027k285j880r00m05j063k270k943
53858B12598k621j533j60Q61Q77j80j490k015j474m83J24J7m37n39j6O14O46Q3
53840B04872m27n30m65l46J02Q04R93K00q54j140o85k91j46L53J313J817J100
53823B06670l23j288j329q96m49L5P27J507K069K264K184K053K070K284K544K649
53807B22771K576K557K769L043K992K642K642L623N221O224N883M769L941L547
$$ plain form
53915 404847 417184 426620 432117 433457 431139 426228 420063 413705 407503 401220 394516 387237 379541 371957
53901 371957 365170 359464 354442 349455 344232 338968 333958 329328 324917 320246 314839 308815 302951 297873
53887 297873 293436 289210 285227 281713 278268 274020 268744 263317 258846 255609 252935 249825 245700 240924
53873 240924 236685 233973 232591 231472 229940 228165 226371 224344 222059 220179 219279 218874 217811 215541 212598
53858 212598 209977 208444 208284 209145 210022 209842 208352 206337 204863 204380 204504 204521 204084 203545 203529 204143 204789 204872
53840 204872 204445 203915 203450 203104 203206 204010 205003 205203 204349 203209 202524 202233 202087 202440 203753 205570 206670
53823 206670 206347 205059 203730 202834 202385 202420 203147 204654 206723 208987 211171 213224 215294 217578 220122 222771
53807 222771 225347 227904 230673 233716 236708 239350 241992 245615 250836 257060 262943 267712 271653 275200
53793B75200K819J423J16k64P7K56q2m55m67m24q51j705k456k788k878k912k724
53776B61885k166j650j797k583l209l108k718k880l671m337m288l683k932k135
53762B20728j289o55n25p61r42q88q11r08j032q75l80M5j53j066k044k265j576
53745B04603n90Q3M55Q81J438J873J961J763J516J454J620J782J637J161O50L45
53729B22632K31K59M93R16J333J636J857J871J411O35K26N88J277J664J784K023
53713B40836K323K381K379K701L058K748J919J667K564L781M179L700L155L039
53699B80430L142L064K637J989J542J743K442K797K154R27J17J85O85R62P05o0
53683C05461j092j894k005j453p67m30m82o94q59q82p48n28l21j76j56l21n53
$$ plain form
53793 275200 278019 279442 279558 279294 279371 279627 279545 279090 278623 278199 277348 275643 273187 270399 267521 264609 261885
53776 261885 259719 258069 256272 253689 250480 247372 244654 241774 238103 233766 229478 225795 222863 220728
53762 220728 219439 218784 218259 217498 216556 215668 214857 213949 212917 212042 211662 211707 211554 210488 208444 206179 204603
53745 204603 204013 204096 204551 205432 206870 208743 210704 212467 213983 215437 217057 218839 220476 221637 222287 222632
53729 222632 222863 223122 223615 224531 225864 227500 229357 231228 232639 233274 233500 234088 235365 237029 238813 240836
53713 240836 243159 245540 247919 250620 253678 256426 258345 260012 262576 266357 270536 274236 277391 280430
53699 280430 283572 286636 289273 291262 292804 294547 296989 299786 301940 302867 302984 303169 303854 304816 305521 305461
53683 305461 304369 302475 300470 299017 298250 297820 297338 296644 295785 294903 294155 293627 293306 293130 292974 292653 292100
53666B92100n01n6L22Lr31j664j628j176j059j429j712j399o44nK16J71J16Q0
53648B80804L9J83P06J305J313N99MM11J565K355K274K007K274K742K550J591
53632C02722O24L05O03J199J871K388K490K264K209K589K977K772K045J518J690
53617C30266K330K905L306L846M654N370N581N406N342N573N776N778N990O730
53603C98853P383O938N379L905L516L930M302M376M270L685K200K37j187j826
53589D45961k454l570m559m690m257m084m291m260l671k947k654k938l587m230
53575C93769m345l579k256j271j202j676j877j504r14m16J30P72R85K81q07j092
53559C74998k63N85M62j62j85L76N46J17j2O34J376J672J994K713L080K406J455
$$ plain form
53666 292100 291599 291543 291865 291868 290937 289273 287645 286469 285410 283981 282269 280870 280226 280221 280437 280608 280724 280804
53648 280804 280843 281026 281732 283037 284350 284949 284953 285364 286929 289284 291558 293565 295839 298581 301131 302722
53632 302722 303346 303651 304254 305453 307324 309712 312202 314466 316675 319264 322241 325013 327058 328576 330266
53617 330266 332596 335501 338807 342653 347307 352677 358258 363664 369006 374579 380355 386133 392123 398853
53603 398853 406236 413174 418553 422458 425974 429904 434206 438582 442852 446537 448737 448974 447787 445961
53589 445961 443507 439937 435378 430688 426431 422347 418056 413796 410125 407178 404524 401586 397999 393769
53575 393769 389424 385845 383589 382318 381116 379440 377563 376059 375145 374729 374859 375631 376616 376897 376090 374998
53559 374998 374735 375320 375782 375620 375435 375811 376357 376474 376462 377096 378472 380144 382138 384851 387931 390337 391792
53542C91792J511K465L109L047L092L751M500M868N215O049P296Q625R811J0483
53528D65614J0241R370Q870R381J0573J1867J3075J4058J4473J4367J4476J5315
53516F11680J6511J7487J8344J9439K0619K1533K2318K3255K3981K3846K2976
53505H41989K2300K2458K3147K3555K3082K1723K0140J9255J9308J9530J9154
53494A075641J8528J8553J9238J9608J9116J8326J7953J7962J7983J7974J7966
53483A278848J7675J6920J6111J5725J5530J4860J3505J1786R866P645N308L410
53471A427189K138R36p71k874m899o763q801j1188j3643j5729j7115j7685j7628
53458A313167j7423j7491j7873j8448j9270k0370k1394k1926k2038k2070k1855
$$ plain form
53542 391792 393303 395768 398877 401924 405016 408767 413267 418135 423350 429399 436695 445320 455131 465614
53528 465614 475855 485225 494095 503476 514049 525916 538991 553049 567522 581889 596365 611680
53516 611680 628191 645678 664022 683461 704080 725613 747931 771186 795167 819013 841989
53505 841989 864289 886747 909894 933449 956531 978254 998394 1017649 1036957 1056487 1075641
53494 1075641 1094169 1112722 1131960 1151568 1170684 1189010 1206963 1224925 1242908 1260882 1278848
53483 1278848 1296523 1313443 1329554 1345279 1360809 1375669 1389174 1400960 1410826 1418471 1423779 1427189
53471 1427189 1429327 1430263 1429492 1426618 1421719 1414956 1406155 1394967 1381324 1365595 1348480 1330795 1313167
53458 1313167 1295744 1278253 1260380 1241932 1222662 1202292 1180898 1158972 1136934 1114864 1093009
53447A093009k0900j9421j8369j8076j7625j6126j4019j2344j1237r973q194o246
53435I20479m448k817j523p87k96O08K074L638N023O386P791R065J0317J1864
53421I67374J3599J5038J6114J7246J8541J9740K1018K2861K4989K6330K6545
53410A189395K6627K7492K8890L0278L1864L3984L6250L8176M0039M2286M4657
53399A569938M6724M8765N1120N3273N4514N5087N5670N6091N5773N5023N4701
53388B156679N4627N3678N1551M9276M7612M6058M3924M1434L9091L6698L3641
53377B654269K9764K5405K0901J6448J2144P853L235j872p287j2865j8740k5060
53365B704195l1644l8051m3730m8187n1297n3458n5187n6566n7376n7631n7482
$$ plain form
53447 1093009 1072109 1052688 1034319 1016243 998618 982492 968473 956129 944892 934919 926725 920479
53435 920479 916031 913214 911691 910904 910608 911216 913290 916928 921951 928337 936128 945193 955510 967374
53421 967374 980973 996011 1012125 1029371 1047912 1067652 1088670 1111531 1136520 1162850 1189395
53410 1189395 1216022 1243514 1272404 1302682 1334546 1368530 1404780 1442956 1482995 1525281 1569938
53399 1569938 1616662 1665427 1716547 1769820 1824334 1879421 1935091 1991182 2046955 2101978 2156679
53388 2156679 2211306 2264984 2316535 2365811 2413423 2459481 2503405 2544839 2583930 2620628 2654269
53377 2654269 2684033 2709438 2730339 2746787 2758931 2766784 2770019 2768147 2760860 2747995 2729255 2704195
53365 2704195 2672551 2634500 2590770 2542583 2491286 2437828 2382641 2326075 2268699 2211068 2153586
53354B153586n6766n5197n3042n1110m9886m9119m8315m7238m5868m4423m3399
53343A609223m3079m2843m1551l8825l5498l2595l0327k8271k6134k3970k1967
53332A244163k0216j8566j6686j4515j2563j1372j0745j0069r263q810q836q859
53320A093663q593q315q111p482o054m130k241n66P83J530J650J681K223L458
53306A059496N289P524R728J1452J2850J4451J6170J7245J7570J8196J9912K2085
53294A231968K3660K4607K5536K6461K6938K7078K7274K7232K6266K4521K2865
53283A514406K1504J9704J7108J4358J2016R724O934L862J042j635m720q219j1432
53270A594652j3806j5608j7559j9968k2370k4015k4689k4947k5462k6366k7454
$$ plain form
53354 2153586 2096820 2041623 1988581 1937471 1887585 1838466 1790151 1742913 1697045 1652622 1609223
53343 1609223 1566144 1523301 1481750 1442925 1407427 1374832 1344505 1316234 1290100 1266130 1244163
53332 1244163 1223947 1205381 1188695 1174180 1161617 1150245 1139500 1129431 1120168 1111358 1102522 1093663
53320 1093663 1085070 1076755 1068644 1061162 1055108 1050978 1048737 1048171 1048954 1050484 1052134 1053815 1056038 1059496
53306 1059496 1064785 1072309 1082037 1093489 1106339 1120790 1136960 1154205 1171775 1189971 1209883 1231968
53294 1231968 1255628 1280235 1305771 1332232 1359170 1386248 1413522 1440754 1467020 1491541 1514406
53283 1514406 1535910 1555614 1572722 1587080 1599096 1608820 1615754 1619616 1620658 1619023 1614303 1606084 1594652
53270 1594652 1580846 1565238 1547679 1527711 1505341 1481326 1456637 1431690 1406228 1379862 1352408
53259A352408k8774l0506l2260l3081l2494l1241l0577l0912l1468l1204k9915
53248A009976k8371k7528k7616k7873k7257k5519k3526k2356k2115k1914k1074
53237G34827j9869j8877j7848j5977j3221j0737r643r760r986r598q755p924p434
53224E75198p564q455r754j0658j0575r638q589q280r023j0166j0515r577q240
53211D54164p714q018q145p563o771o345o243o214o164n830m923l898l802m847
53197C67687n876n877n288n149n554n776n491m965m360l635k994k666k385j801
53183C05870j225j226j632j669j173q70j346k298l023l156k784k259j962j963
53169B79284j920j584j285j417j682j451p59k92l92o73p35o21m87m16o18j242
$$ plain form
53259 1352408 1323634 1293128 1260868 1227787 1195293 1164052 1133475 1102563 1071095 1039891 1009976
53248 1009976 981605 954077 926461 898588 871331 845812 822286 799930 777815 755901 734827
53237 734827 714958 696081 678233 662256 649035 638298 628655 618895 608909 599311 590556 582632 575198
53224 575198 567634 559179 549425 538767 528192 518554 509965 501685 492662 482496 471981 462404 454164
53211 454164 446450 438432 430287 422724 415953 409608 403365 397151 390987 385157 380234 376336 372534 367687
53197 367687 361811 355934 350646 345497 339943 334167 328676 323711 319351 315716 312722 310056 307671 305870
53183 305870 304645 303419 301787 300118 298945 298075 296729 294431 291408 288252 285468 283209 281247 279284
53169 279284 277364 275780 274495 273078 271396 269945 269186 268894 268502 267829 267094 266473 265986 265570 264952 263710
53153B63710j828j653p68q5j37m17l29j09k90p39r07p34o90j002j320j167m32
53136B51103O02J463J802J590J041L56k70m79L3J041J890K216K241K185J841J088
53120B69743L41R3J89O1m35q86r89r08r51j148j358j546j761j875j575p37K00
53103B56458N24O3m67k71M57P26Mj162j927k016j604q10J84Q92R59O80O37Q92
53085B54219J049R68R31J037R96O79L84L10J87k33o53o42l55l79q46j237j115
53068B55300p15n34o60q15r21j190j639j830j281o4J122J479Q00l05r02o69j52
53051B47024Nn6K31Q03Q89J42p14q59n13n60j317k184k410j759n74M42O15m8o84
53032B38473n19J72N00K25j01j32r0p3K06P06Q30L47j84l38m93r48j051l8J649
$$ plain form
53153 263710 261882 260229 259461 259376 259239 258822 258493 258384 258094 257355 256448 255714 255024 254022 252702 251535 251103
53136 251103 251705 253168 254970 256560 257601 257957 257687 257208 257241 258282 260172 262388 264629 266814 268655 269743
53120 269743 270084 270177 270366 270427 269992 269106 268117 267209 266258 265110 263752 262206 260445 258570 256995 256258 256458
53103 256458 256982 257045 256578 256307 256764 257490 257494 256332 254405 252389 250785 249975 250159 251051 252010 252690 253327 254219
53085 254219 255268 256236 257167 258204 259200 259879 260263 260573 260760 260527 259874 259232 258877 258498 257652 256415 255300
53068 255300 254585 254051 253391 252576 251655 250465 248826 246996 245715 245651 246773 248252 249052 248747 247845 247176 247024
53051 247024 247029 246973 247204 248007 248896 249038 248324 247465 246952 246392 245075 242891 240481 238722 238148 238590 239205 239157 238473
53032 238473 237954 238126 238626 238851 238750 238618 238528 238455 238661 239367 240197 240544 240360 240022 239529 238581 237530 237492 239141
53013B39141K748K722K148J635J205P85O31Q67J151J067N80q4p06j058j018q14
52997B51000q90j353j796j733j016K39J691K746K868K226J557J261J010N25J68
52982B58503L50Q21J108J274J515J367K76j113j265K51K000K465J835J380J635
52967B72402K090K269K173J685N40r58j930j961j568j364j355j358j514j911k176
52952B65064j965j523j245j031o13k35l74r02j160q78m17j22Jr9n99j312j620
52935B50970j235o23l55m06l88k00p4j56l31l80j48L19O72N03r0m12M6R21J363
52916B49996J052N11M09Q07J180R96K25o40j029q01l04O1J58O0j16j89M3M70O36
52897B53525K97j28q6K73K96q4q8P23J563J327J40p23n42j0q2n73n25K67Q52L50
$$ plain form
53013 239141 241889 244611 246759 248394 249599 250384 251015 251882 253033 254100 254680 254596 253890 252832 251814 251000
52997 251000 250110 248757 246961 245228 244212 244451 246142 248888 251756 253982 255539 256800 257810 258335 258503
52982 258503 258853 259674 260782 262056 263571 264938 265214 264101 262836 263087 265087 267552 269387 270767 272402
52967 272402 274492 276761 278934 280619 281159 280201 278271 276310 274742 273378 272023 270665 269151 267240 265064
52952 265064 263099 261576 260331 259300 258687 258452 258078 257176 256016 255138 254721 254599 254600 254501 253902 252590 250970
52935 250970 249735 249112 248757 248351 247963 247763 247689 247533 247202 246822 246674 246993 247665 248168 248078 247666 247712 248633 249996
52916 249996 251048 251559 251968 252775 253955 254951 255176 254536 253507 252706 252402 252463 252621 252681 252565 252376 252419 252889 253525
52897 253525 253822 253694 253608 253881 254177 254093 254005 254728 256291 257618 257758 257035 256493 256483 256401 255828 255303 255570 256422 256772
52877B56772r32j853j690p50J23M85O99J387K496L180K827J910J404J503J550
52862B69111J166P14M74R8o41j216j135q36j076j720j961j651j594k315l279l575
52846B50564k980k024j259p96l46L83J267J763J448N04n24j281j702j732j378
52831B41907r13o14l93j9L74M65K98J55n9o69j459j671r18L71J606K497K851K475
52813B46284J612R26P44P85P91Q42Q44L91n33j385j934k651l603l874k857j520
52797B34862j281k006k230j287j29J60l45r16j190j175q12j85L08M16M86R56J554
52780B27186J568Q51Q3r1K17M63M38L25K36J12J08N59J328J661J072J00l65k78
52762B35573l50q66j254r76k68L27O38P06M67n5m83m57m7M43Q37J066J073J020
$$ plain form
52877 256772 255840 253987 252297 251547 251670 252155 252854 254241 256737 259917 262744 264654 266058 267561 269111
52862 269111 270277 270991 271465 271563 270922 269706 268571 267735 266659 264939 262978 261327 259733 257418 254139 250564
52846 250564 247584 245560 244301 243505 243159 243542 244809 246572 248020 248524 248000 246719 245017 243285 241907
52831 241907 240994 240380 239987 239968 240342 240807 241105 241260 241201 240532 239073 237402 236484 236855 238461 240958 243809 246284
52813 246284 247896 248822 249566 250351 251142 251984 252828 253219 252686 251301 249367 246716 243113 239239 236382 234862
52797 234862 233581 231575 229345 228058 227929 228089 227744 226828 225638 224463 223651 223466 223774 224190 224676 225632 227186
52780 227186 228754 229605 229688 229597 229814 230277 230715 231040 231276 231388 231496 232055 233383 235044 236116 236216 235851 235573
52762 235573 235223 234357 233103 232127 231859 232186 232824 233530 233997 233942 233459 233002 232955 233398 234235 235301 236374 237394
52744B37394J186J453J309O78L15Q48J829K304J951J165L30l63o16k77K52M50
52728B50208M50P18J109R95L00l50o64j080j895k650k787k413j971j640j382j163
52712B35785q00O3J306K048J529J77p89p40j36L39N77P81Q43M96n8k07K69Q11
52694B42294Q15M45L57P27J061J009Q18P79P31M67K35L35N26L61r1l49k22R0M46
52675B50834P32N56l58j361j292K3J357J562R44O42J058J553J512J078P44P29
52659B60313Q96J029J026R21Q65R60J081R91O05J05k87n43p66j021j277j501j662
52642B61735j668j398q94m14j49oK00M42O03Q43J442K244K610K145J179K75l82
52625B68807q47j006p63m62n94j097j385j103n33j27K3P2P3m7j87n7M97J129J246
$$ plain form
52744 237394 238580 240033 241342 242020 242335 243183 245012 247316 249267 250432 250762 250399 249783 249506 249758 250208
52728 250208 250658 251376 252485 253480 253780 253430 252766 251686 249791 247141 244354 241941 239970 238330 236948 235785
52712 235785 234985 235048 236354 238402 239931 240108 239319 238579 238443 238782 239359 240140 240983 241479 241421 241214 241483 242294
52694 242294 243109 243554 243911 244638 245699 246708 247526 248305 249036 249503 249738 250073 250599 250960 250869 250520 250298 250388 250834
52675 250834 251566 252122 251764 250403 249111 249134 250491 252053 252997 253639 254697 256250 257762 258840 259584 260313
52659 260313 261209 262238 263264 264185 265050 266010 267091 268082 268687 268792 268505 267962 267196 266175 264898 263397 261735
52642 261735 260067 258669 257775 257361 257212 257206 257406 257848 258451 259294 260736 262980 265590 267735 268914 269189 268807
52625 268807 267960 266954 266191 265729 265135 264038 262653 261550 261017 260890 260913 260985 261058 261011 260824 260767 261264 262393 263639
52606B63639P32K24L22O63L59o03j135n48L74M31m08j215j478j420j132l79O56
52589B59082J266J178R84J239J749K012J967J867J706J224L69n10r36p58k91M2
52573B72190K15M98P83N06l92j020o74l5k64j197j478n06Q04J405J260P28j02
52556B72721r92j309r54p67j292j848j543o76k15l34l86j53j10m90q22o71k26
52539B59933Lk37p44r78m12R36K335K992K760K060J252M57k05n54m92k3O71J088
52521B70842P09k28p00p4J120K032K589L114L343K797J897J648K183K561K207
52506B96040J628J402J265O98l04j511k864m034m200k982j282m16o31j072j064
52491B80673p39m32j92n2j90n32n98o0Q34J550J768J442O91o9k34L83J176J365
$$ plain form
52606 263639 264371 264595 264917 265580 265939 265336 264201 263653 264027 264458 264050 262835 261357 259937 258805 258426 259082
52589 259082 260348 261526 262510 263749 265498 267510 269477 271344 273050 274274 274643 274133 273197 272439 272148 272190
52573 272190 272405 272903 273686 274192 273800 272780 272106 272071 271807 270610 269132 268626 269430 270835 272095 272823 272721
52556 272721 271729 270420 269466 268699 267407 265559 264016 263340 263125 262791 262405 262252 262142 261652 260830 260159 259933
52539 259933 259936 259699 258955 257977 257565 258501 260836 263828 266588 268648 269900 270357 270152 269598 269106 269083 269754 270842
52521 270842 271551 271323 270623 270549 271669 273701 276290 279404 282747 285544 287441 289089 291272 293833 296040
52506 296040 297668 299070 300335 301033 300729 299218 296354 292320 288120 285138 283856 283440 282809 281737 280673
52491 280673 279934 279502 279310 279258 279068 278536 277938 277878 278712 280262 282030 283472 284163 284094 283860 284243 285419 286784
52473B86784Q90L73K81M82O47P07Q36J190J819K479K670K136J396J231J512J145
52457C06578m56k368l184k672j819j430j443j539j732k133k588k783k516j838
52443B78077j124q26r00p34m9M85J92m83n92k43l73j068j301o62n0p7J8J028K290
52424B73608K609J958J175N84Jl09J65J194K056K636L376M240M699M769N103N971
52408C13835O950P721Q322Q484P604N629L226Q61j576m003n848o768p003o751
52394C30683n884m652l803l623l519l003k395k060j719j115o09m00J55J517K850
52379C02423K999K231J890K496L211L295K968K684K463K352K667L285L401K553
52365C40918J350O13K28m51j425j994j767j122o29m82n32m75MQ76J508J272M52
$$ plain form
52473 286784 287674 288047 288328 288810 289457 290164 291000 292190 294009 296488 299158 301294 302690 303921 305433 306578
52457 306578 306122 303754 300570 297898 296079 294649 293206 291667 289935 287802 285214 282431 279915 278077
52443 278077 276953 276127 275227 274493 274444 274929 275121 274638 274046 273803 273430 272362 271061 270399 270349 270272 270290 271318 273608
52424 273608 276217 278175 279350 279934 279935 279626 279791 280985 283041 285677 289053 293293 297992 302761 307864 313835
52408 313835 320785 328506 336828 345312 352916 358545 361771 362632 361056 357053 351205 344437 337434 330683
52394 330683 324799 320147 316344 312721 309202 306199 303804 301744 300025 298910 298301 297901 298056 299573 302423
52379 302423 305422 307653 309543 312039 315250 318545 321513 324197 326660 329012 331679 334964 338365 340918
52365 340918 342268 342881 343109 342658 341233 339239 337472 336350 335721 335239 334707 334232 334236 335112 336620 337892 338344
52348C38344R1P38J780K308K222K062K125K267K383K587K967L575M616O141P592
52333C81798Q211Q008P876Q505R570J0318J0548J0718J1314J2380J3543J4284
52321E07073J4380J4142J4060J4088J3706J2813J2097J2121J2552J2761J2838
52310F52631J3384J4459J5425J5735J5394J4633J3681J2836J2265J1665J0576
52299H02684R104P839P023O248N121L700K160M67j359l087m583n892o851p094
52285H15480o700o352o461o518n777m270k668j412m51L44J061J976L302M668N350
52270G91572N234N125N819P145Q302Q899R214R486R484R040Q680R214J0736J2348
52256I10298J3061J2679J1728J0790J0078R429Q452O821M653K457N37j338l402
$$ plain form
52348 338344 338435 339173 340953 343261 345483 347545 349670 351937 354320 356907 359874 363449 368065 374206 381798
52333 381798 390009 398017 405893 414398 423968 434286 444834 455552 466866 479246 492789 507073
52321 507073 521453 535595 549655 563743 577449 590262 602359 614480 627032 639793 652631
52310 652631 666015 680474 695899 711634 727028 741661 755342 768178 780443 792108 802684
52299 802684 811788 819627 826650 832898 838019 841719 843879 844346 842987 839900 835317 829425 822574 815480
52285 815480 808780 802428 795967 789449 783672 779402 776734 775322 774871 775215 776276 778252 781554 786222 791572
52270 791572 796806 801931 807750 814895 823197 832096 841310 850796 860280 869320 878000 887214 897950 910298
52256 910298 923359 936038 947766 958556 968634 978063 986515 993336 997989 1000446 1000983 999645 996243
52243I96243n280o406o846p212p759q154q200q260q721r458j0107j0546j0780
52230H88514j0669j0076r140q156p322o691o258n856n169m059k817j912j565j660
52216H07164j900j904j239L51K586M577N310M537L193K592L044L589L346K682
52202H37928K568L168L861M327M759N039M695L937L772M633N655N759M829L354
52188H98284J665J20o87p12r32k245m262n962p089q016q582q189o932n687m875
52173H35899m115l197k525k290j974j148j03P26J443K268K894K836K195J644J677
52158H36230K151K493K252J500P95N86P08O71M20L31M80M64J58J15P69J681K046
52141H53850J648R02J88l54n44k42L20Q27J507K997N375P859R701J1020J2395
$$ plain form
52243 996243 990963 984557 977711 970499 962740 954586 946386 938126 929405 919947 909840 899294 888514
52230 888514 877845 867769 858629 850473 843151 836460 830202 824346 819177 815118 812301 810389 808824 807164
52216 807164 805264 803360 802121 802472 805058 809635 814945 819482 822675 825267 828311 831900 835246 837928
52202 837928 840496 843664 847525 851852 856611 861650 866345 870282 874054 878687 884342 890101 894930 898284
52188 898284 899949 900069 899382 898670 897738 895493 891231 885269 878180 870164 861582 853393 846461 840774 835899
52173 835899 831784 828587 826062 823772 821798 820650 820547 821273 822716 824984 827878 830714 832909 834553 836230
52158 836230 838381 840874 843126 844626 845421 846007 846715 847386 847806 848137 848617 849081 849239 849354 850123 851804 853850
52141 853850 855498 856400 856588 856234 855690 855448 855768 856595 858102 861099 866474 874333 884034 895054 907449
52126I07449J3928J5244J6328J7713J9625K1498K2667K3258K3852K4395K4106
52115A130063K2592K0551J8972J8017J7128J5952J4662J3456J2257J1041J0023
52104A304714R311Q649P716O499N184L788K113k1k586n365q063j0418j2258j3542
52090A295721j4364j4944j5447j5778j5703j5167j4316j3088j1186q727o555n427
52078A145019m959m013k070K22J944K870L420M158N526P585R768J1175J1477J1213
52064A203335J1047J1061J1072J1165J1460J1645J1263J0381R508Q890Q247P211
52052A326285N677L750J605n74k696m827o937q755j0052j0966j1750j2316j2431
52039A256013j2275j2374j2870j3220j2839j1814j0780j0267j0347j0823j1523
$$ plain form
52126 907449 921377 936621 952949 970662 990287 1011785 1034452 1057710 1081562 1105957 1130063
52115 1130063 1152655 1173206 1192178 1210195 1227323 1243275 1257937 1271393 1283650 1294691 1304714
52104 1304714 1314025 1322674 1330390 1336889 1342073 1345861 1347974 1347953 1345367 1340002 1331939 1321521 1309263 1295721
52090 1295721 1281357 1266413 1250966 1235188 1219485 1204318 1190002 1176914 1165728 1157001 1150446 1145019
52078 1145019 1140060 1136047 1133977 1134199 1136143 1139013 1142433 1146591 1152117 1159702 1169470 1180645 1192122 1203335
52064 1203335 1214382 1225443 1236515 1247680 1259140 1270785 1282048 1292429 1301937 1310827 1319074 1326285
52052 1326285 1331962 1335712 1337317 1336743 1334047 1329220 1322283 1313528 1303476 1292510 1280760 1268444 1256013
52039 1256013 1243738 1231364 1218494 1205274 1192435 1180621 1169841 1159574 1149227 1138404 1126881
$$ [...]
##END NTUPLES=NMR SPECTRUM
##END=
