##TITLE=AC1466_CTIAA13297_8011847_UUfE9WZPqj
##JCAMPDX= 6.0         $$ Bruker NMR JCAMP-DX V2.0
##DATA TYPE= NMR SPECTRUM
##DATA CLASS= NTUPLES
##ORIGIN= BRUKER
##OWNER= Administrator
$$ 1.72 TOPSPIN		Version 2.1
$$ 2013-07-05 23:12:17.053 -0700  Administrator@X
$$ Compression mode = diff/dup
##.OBSERVE FREQUENCY= 400.02188249412
##.OBSERVE NUCLEUS= ^1H
##.ACQUISITION MODE= SIMULTANEOUS (DQD)
##.ACQUISITION SCHEME= undefined
##.AVERAGES= 8
##.DIGITISER RES= 22
##SPECTROMETER/DATA SYSTEM= spect
##.PULSE SEQUENCE= zg30
##.SOLVENT NAME= COFFEE_meoh
##.SHIFT REFERENCE= INTERNAL, COFFEE_meoh, 1, 14.98509
##AUDIT TRAIL= $$ (NUMBER, WHEN, WHO, WHERE, PROCESS, VERSION, WHAT)
$$ ##TITLE= Audit trail, TOPSPIN		Version 2.1
$$ ##JCAMPDX= 5.01
$$ ##ORIGIN= Bruker BioSpin GmbH
$$ ##OWNER= Administrator
$$ $$ E:\/data/COFFEE/nmr/AC1466_CTIAA13297_8011847_UUfE9WZPqj/10/pdata/1/auditp.txt
$$ ##AUDIT TRAIL=  $$ (NUMBER, WHEN, WHO, WHERE, PROCESS, VERSION, WHAT)
(   1,<2013-07-05 23:12:09.576 -0700>,<Administrator>,<X>,<go>,<TOPSPIN 2.1>,
      <created by zg
	started at 2013-07-05 23:11:03.029 -0700,
	POWCHK enabled, PULCHK disabled,
       configuration hash MD5:
       C8 4E 4E 5D D3 5C D8 9E 9F 52 82 E0 59 8A DE 15
       data hash MD5: 64K
       7B 43 81 E2 27 84 41 FA D5 6F 29 CC EB 16 80 A3>)
(   2,<2013-07-05 23:12:12.623 -0700>,<Administrator>,<X>,<proc1d>,<TOPSPIN 2.1>,
      <Start of raw data processing
       efp LB = 0 FT_mod = 6 PKNL = 1 PHC0 = 0 PHC1 = 0 SI = 32K 
       data hash MD5: 32K
       96 AD FC 92 25 3B 4C 0F C6 CB 73 40 4D B7 A6 9A>)
(   3,<2013-07-05 23:12:13.092 -0700>,<Administrator>,<X>,<proc1d>,<TOPSPIN 2.1>,
      <pk PHC0 = 94.95483 PHC1 = 0 
       data hash MD5: 32K
       CD A2 34 71 2B BA 1A 82 BC 54 FB 74 F6 87 D3 59>)
(   4,<2013-07-05 23:12:13.326 -0700>,<Administrator>,<X>,<proc1d>,<TOPSPIN 2.1>,
      <abs ABSG = 1 
       data hash MD5: 32K
       0F F8 E7 35 CB EC 0E 6D E5 3C 35 E3 55 E8 44 1C>)
(   5,<2013-07-05 23:12:13.498 -0700>,<Administrator>,<X>,<proc1d>,<TOPSPIN 2.1>,
      <abs ABSG = 2 
       data hash MD5: 32K
       B9 5D 5E EF B3 05 1C 62 80 41 BE 86 02 7C F3 77>)
(   6,<2013-07-05 23:12:13.561 -0700>,<Administrator>,<X>,<proc1d>,<TOPSPIN 2.1>,
      <abs ABSG = 3 
       data hash MD5: 32K
       75 75 29 88 8D FA 30 A9 E0 23 BA C0 37 98 38 15>)
(   7,<2013-07-05 23:12:13.607 -0700>,<Administrator>,<X>,<proc1d>,<TOPSPIN 2.1>,
      <abs ABSG = 4 
       data hash MD5: 32K
       C4 FD D9 70 25 FC 1F 6E 13 D1 83 9A BD B7 16 DC>)
(   8,<2013-07-05 23:12:13.654 -0700>,<Administrator>,<X>,<proc1d>,<TOPSPIN 2.1>,
      <abs ABSG = 5 
       data hash MD5: 32K
       18 A8 2E F3 E4 72 8F D5 EC 58 31 06 61 32 E9 32>)
$$ ##END=
$$ 
$$ $$ hash MD5
$$ $$ 61 FD EE EB 23 21 BE A8 4B 5F 19 37 9C 1E 31 B6
##$RELAX= 
##$RELAX= 
##$RELAX= 
##$RELAX= 
##$RELAX= 
##$RELAX= 
##$RELAX= 
$$ Bruker specific parameters
$$ --------------------------
##$DU= <E:\>
##$EXPNO= 10
##$NAME= <AC1466_CTIAA13297_8011847_UUfE9WZPqj>
$$ [...]
150 150 150 150 150 150 150 150
##$TP07= 0
##$TPNAME0= <>
##$TPNAME1= <>
##$TPNAME2= <>
##$TPNAME3= <>
##$TPNAME4= <>
##$TPNAME5= <>
##$TPNAME6= <>
##$TPNAME7= <>
##$TPOAL= (0..7)
0.5 0.5 0.5 0.5 0.5 0.5 0.5 0.5
##$TPOFFS= (0..7)
0 0 0 0 0 0 0 0
##$TUNHIN= 0
##$TUNHOUT= 0
##$TUNXOUT= 0
##$USERA1= <user>
##$USERA2= <user>
##$USERA3= <user>
##$USERA4= <user>
##$USERA5= <user>
##$V9= 5
##$VALIST= <valist>
##$VCLIST= <CCCCCCCCCCCCCCC>
##$VD= 0
##$VDLIST= <DDDDDDDDDDDDDDD>
##$VPLIST= <PPPPPPPPPPPPPPP>
##$VTLIST= <TTTTTTTTTTTTTTT>
##$WBST= 1024
##$WBSW= 4
##$XGAIN= (0..3)
0 0 0 0
##$XL= 0
##$YL= 0
##$YMAX_a= 622257
##$YMIN_a= -528550
##$ZGOPTNS= <>
##$ZL1= 120
##$ZL2= 120
##$ZL3= 120
##$ZL4= 120
##$ABSF1= 14.98509
##$ABSF2= -5.573092
##$ABSG= 5
##$ABSL= 3
##$ALPHA= 0
##$AQORDER= 0
##$ASSFAC= 0
##$ASSFACI= 0
##$ASSFACX= 0
##$ASSWID= 0
##$AUNMP= <proc_prof1d_extract_pilot.lims>
##$AXLEFT= 0
##$AXNAME= <>
##$AXNUC= <1H>
##$AXRIGHT= 0
##$AXTYPE= 0
##$AXUNIT= <>
##$AZFE= 0.1
##$AZFW= 0.1
##$BCFW= 0
##$BC_mod= 0
##$BYTORDP= 0
##$COROFFS= 0
##$CY= 15
##$DATMOD= 1
##$DC= 0
##$DFILT= <>
##$DTYPP= 0
##$F1P= 0
##$F2P= 0
##$FCOR= 0.5
##$FTSIZE= 32768
##$FT_mod= 6
##$GAMMA= 0
##$GB= 0
##$INTBC= 1
##$INTSCL= 1
##$ISEN= 128
##$LB= 0
##$LEV0= 0
##$LPBIN= 0
##$MAXI= 10000
##$MC2= 0
##$MEAN= 0
##$ME_mod= 0
##$MI= 0
##$NCOEF= 0
##$NC_proc= -8
##$NLEV= 6
##$NOISF1= 0
##$NOISF2= 0
##$NSP= 0
##$NTH_PI= 0
##$NZP= 0
##$OFFSET= 14.98509
##$PC= 1
##$PHC0= 94.95483
##$PHC1= 0
##$PH_mod= 1
##$PKNL= yes
##$PPARMOD= 0
##$PPDIAG= 0
##$PPIPTYP= 0
##$PPMPNUM= 2147483647
##$PPRESOL= 1
##$PSCAL= 4
##$PSIGN= 0
##$PYNMP= <proc.py>
##$REVERSE= no
##$SF= 400.02
##$SI= 32768
##$SIGF1= 0
##$SIGF2= 0
##$SINO= 400
##$SIOLD= 32768
##$SPECTYP= <>
##$SREGLST= <1H.CDCl3>
##$SSB= 0
##$STSI= 32768
##$STSR= 0
##$SW_p= 8223.68421052631
##$SYMM= 0
##$S_DEV= 0
##$TDeff= 65536
##$TDoff= 0
##$TI= <>
##$TILT= no
##$TM1= 0
##$TM2= 0
##$TOPLEV= 0
##$USERP1= <user>
##$USERP2= <user>
##$USERP3= <user>
##$USERP4= <user>
##$USERP5= <user>
##$WDW= 1
##$XDIM= 32768
##$YMAX_p= 457265170
##$YMIN_p= -721110
##$CURPLOT= <Network HP LaserJet P1505>
##$CURPRIN= <$Network HP LaserJet P1505>
##$DFORMAT= <normdp>
##$LAYOUT= <+/1D_H.xwp>
##$LFORMAT= <normlp>
##$PFORMAT= <normpl>
##$SURQMSG= 1
$$ End of Bruker specific parameters
$$ ---------------------------------
##NTUPLES= NMR SPECTRUM
##VAR_NAME=  FREQUENCY,     SPECTRUM/REAL,   SPECTRUM/IMAG
##SYMBOL=    X,             R,               I
##VAR_TYPE=  INDEPENDENT,   DEPENDENT,       DEPENDENT
##VAR_FORM=  AFFN,          ASDF,            ASDF
##VAR_DIM=   32768,         32768,           32768
##UNITS=     HZ,            ARBITRARY UNITS, ARBITRARY UNITS
##FACTOR=    0.250966925370066, 1,           1
##FIRST=     8223.43324360094, -261317,      -187039
##LAST=      0,             127517,          -61087
##MIN=       0,             -721110,         0
##MAX=       8223.43324360094, 457265170,    0
$$ Real data points
##PAGE= N=1
##DATA TABLE= (X++(R..R)), XYDATA
$$ [...]
$$ plain form
19594 112837 242372 203323 293766 -73379 199143 -84415 2317 -193803 -32548 -39919 -25545
19583 -25545 -132665 -15792 144344 20324 -134955 -54049 -94418 -7761 -395362 72230 -176743
19571 -322242 63276 -1081 69557 -69059 50002 -45858 -1721 -243832 -259772 -284642 304130
19559 272693 -218558 -106236 -258106 18129 -139567 47862 32091 -94815 219588 -251283
19548 -163386 -65564 128957 7738 -75995 -284300 170653 -232021 -79851 188423 50613 -135762
19536 9620 139153 144854 -488711 -155911 -263780 3161 208020 303628 374233 68362 116372
19525 116372 70913 -76938 103708 -13116 -316872 84577 124012 4569 272330 152380 -94591
19513 -257924 56476 -105658 19935 -180511 135142 -93878 14761 -179566 -143586 -61027 -47680
$$ packed form
19594A12837J29535l9049R0443g3379A99143h4415B317a93803c2548p371J4374
19583b5545j07120a5792A44344B0324a34955e4049m0369g761l87601G2230a76743
19571c22242F3276a081F9557f9059E0002d5858a721k42111j5940k4870C04130
19559B72693b18558a06236j51870A8129a39567D7862j5771i4815B19588b51283
19548a63386f5564A28957G738g5995k08305A70653b32021g9851A88423E0613a35762
19536I620J29533N701d88711a55911j07869C161K04859R5608P0605F8362M8010
19525A16372m5459g6938A03708a3116l03756H4577L9435D569K67761j19950i4591
19513b57924E6476a05658A9935a80511A35142i3878A4761a79566L5980f1027J3347
$$ plain form
19502 -47680 -78224 -190606 -118987 -55851 93251 -132323 -288041 3665 201866 -50639 75804
19490 -117060 346974 -239578 -105493 268874 73768 22762 -245068 -243237 72540 -158935
19479 79445 392771 8321 -278395 -371349 117813 -220438 -254882 -161904 -104642 -219583 42207
19467 107154 68869 -354207 37732 -21084 5615 136486 -19856 16374 53201 117741 -46887
19455 141177 -324918 -194959 -230565 -39201 8657 -322563 -323461 34041 -35899 -260319 106268
19443 -75989 93046 -259332 -1776 -121684 85959 -272305 102481 -45838 -292455 -3443 -68527
19432 -68527 -232618 -237803 61341 -186268 39781 -345299 132148 24050 140171 3412 189393
19421 189393 72096 -202120 246619 208027 100292 -1083 17058 -339995 -28007 110799 7840
$$ packed form
19502d7680l0544j12382P1619e5851I3251a32323j55718C665J98201e0639G5804
19490a17060C46974b39578a05493B68874G3768B2762b45068J831G2540a58935
19479G9445L13326H321b78395r2954A17813b20438l4444R2978N7262j14941D2207
19467A07154l8285c54207C7732b1084E615J30871a9856A6374L6827O4540d6887
19455A41177c24918J29959l5606c9201H657c22563q98C4041c5899k24420A06268
19443g5989I3046b59332a776j19908H5959b72305A02481d5838k46617c443o5084
19432f8527j64091n185F1341a86268C9781c45299A32148B4050J16121C412J85981
19421A89393G2096b02120B46619l8592A00292a083A7058c39995b8007A10799G840
$$ plain form
19409 -584792 -371735 176231 -77570 -167923 -139390 -486320 28876 -224911 -73678 28471 183348
19398 183348 -400634 97091 -114704 -101462 -120983 -45307 -296815 -10556 -394820 34233 -586
19386 -230717 49992 -184565 -99554 -153101 75503 124708 -268598 -50170 -240816 238106 -277810
19374 55357 -142061 -231047 -112182 -202235 -71405 61116 -173766 -80337 -126961 70639 -248802
19362 200420 12205 -164713 244759 67168 -409258 -190628 -159181 17971 -254837 313316
19351 -28396 -93587 -85156 47889 -432261 -249395 38386 -30086 104845 -156796 -257915 331611
19339 109619 -233595 -175896 -82648 -21786 208013 -166754 -136942 -122885 -222664 -35825 63865
19327 -77471 -232297 -252544 95327 -153571 60967 -195314 -200223 2036 -442517 11045 -244555
$$ packed form
19409e84792K13057A76231g7570r0353K8533l46930B8876b24911g3678B8471J54877
19398A83348d00634I7091a14704J3242j9521d5307k51508a0556l84264C4233e86
19386b30717D9992a84565Q5011n3547G5503M9205b68598e0170j90646B38106b77810
19374E5357a42061q8986a12182r0053g1405F1116a73766h0337m6624G0639b48802
19362B00420A2205a64713B44759F7168d09258a90628L1447A7971b54837C13316
19351b8396o5191Q431D7889d32261J82866C8386c0086A04845a56796j01119C31611
19339A09619b33595N7699h2648b1786B08013a66754K9812J4057r9779c5825F3865
19327g7471j54826k0247I5327a53571F0967a95314m909B036d42517A1045b44555
$$ plain form
19315 -154261 4618 -119980 -61823 146629 -363006 142213 -166650 -136240 30465 6193 -72463
19303 -347936 -245081 1908 54890 149332 -165196 284749 90133 291844 189458 131439 88648
19292 88648 -32555 -123432 -92519 -42728 -116436 -255129 53587 -440623 -175538 78000 20703
19280 43248 -300223 81353 -137514 109007 -270043 -27386 -339488 61368 -34622 47539 -565494
19268 -45428 -264637 -174791 -51059 -54714 6128 96211 3476 -94733 -272078 -98553 82863 -145406
19255 597616 330026 125003 241093 -148254 55460 -106402 -174641 -238320 -115897 -275226
19245 -275226 208300 55798 182243 -158870 316331 -198143 -70740 125615 292026 46222
19234 159118 -334764 407761 -143483 -130458 349914 -16392 -180146 -228463 -201712 -280792
$$ packed form
19315a54261D618a19980N8157A46629c63006A42213a66650L0410C0465F193g2463
19303c47936J02855A908N2982R4442a65196B84749I0133K01711j02386n8019m2791
19292H8648c2555r0877L0913d2728p3708j38693E3587d40623a75538G8000B0703
19280D3248c00223H1353a37514A09007b70043b7386l12102F1368c4622D7539e65494
19268d5428k19209Q9846e1059l655F128R0083C476i4733j77345i8553H2863a45406
19255E97616k67590A25003J16090a48254E5460a06402o8239o3679a15897j59329
19245b75226B08300E5798J26445a58870C16331a98143g0740A25615J66411D6222
19234A59118c34764D07761a43483J3025C49914a6392j63754m8317K6751p9080
$$ plain form
19224 -280792 -30154 -71904 -99433 -200532 2885 26764 -93882 233100 -135174 -15662 245582
19212 -138799 140547 -31019 48019 -55127 17468 -117225 257438 263459 -180990 278434 -265314
19200 368075 -334461 -80254 -83641 -58638 -4659 -9003 -346411 102530 -19330 -28425 -83666 -44862
19188 -44862 -46457 64737 24358 -40017 -208253 -235746 71773 268189 -111407 -334568 -167606
19177 -167606 -170699 -31129 -166474 31101 -192906 -34167 74978 159532 -45053 -87393 -360503
19166 -360503 -223452 134184 553341 -169094 48157 -102888 155453 199269 -212765 -215639
19156 -215639 114953 -96516 204335 -335526 15413 -105531 -377107 -200821 87743 -173918
19145 -73003 176872 -9204 -58149 -171650 -179990 -185089 5864 -370777 -144154 -281130 -67691
$$ packed form
19224b80792c0154m1750k7529j01099B885K3879i3882B33100a35174a5662B45582
19212a38799A40547c1019D8019e5127A7468a17225B57438O021a80990B78434b65314
19200C68075c34461h0254l387K5003d659m344l37408A02530a9330r095n5241L8804
19188d4862j595F4737B4358d0017j68236k7493G1773J96416a11407k23161J66962
19177a67606l093c1129j35345C1101a92906c4167G4978Q4554d5053m2340k73110
19166c60503J37051A34184M19157a69094D8157a02888A55453M3816b12765k874
19156b15639A14953i6516B04335c35526A5413a05531k71576J76286H7743a73918
19145g3003A76872i204m8945j13501q340n099E864c70777a44154j36976f7691
$$ plain form
19133 -254327 170288 -272493 76652 155246 -153829 138464 21975 209607 51087 -71881
19122 -17950 -475467 -43397 -121300 -309002 56014 -22462 174624 -101287 -58246 -213469 -32725
19110 -205833 72719 383546 -44505 41514 84915 -287181 -110367 -21955 231640 -194069
19099 -59229 -207519 30796 -169577 167519 15869 -66736 51129 -51759 -176496 361279 -15731
19087 -295523 181779 271798 49830 -47442 -94276 -66074 -133763 337263 153677 -137869 91149
19075 -92664 -149053 27907 80812 336871 318826 -324793 -55208 302767 -84973 -80277 -33417
19063 -121461 -133001 217469 30338 159595 -241764 -92663 -210745 155535 -2143 63501 -476375
19051 -292246 -173144 260614 -306159 -287210 87208 268898 119905 -135336 315054 -32383
$$ packed form
19133b54327A70288b72493G6652P8594a53829A38464B1975J87632E1087g1881
19122a7950m57517d3397p7903j87702E6014b2462A74624a01287M3041j55223c2725
19110b05833G2719L10827d4505D1514M3401b87181a10367b1955B31640a94069
19099e9229j48290C0796a69577A67519A5869f6736E1129e1759j24737C61279a5731
19087b95523A81779R0019D9830d7442m6834K8202o7689C37263A53677a37869I1149
19075i2664n6389B7907N2905K56059j8045c24793e5208C02767h4973M696c3417
19063a21461j1540B17469C0338J29257b41764i2663j18082A55535b143F3501d76375
19051b92246J19102B60614c06159J8949H7208J81690A19905a35336C15054c2383
$$ plain form
19040 104468 -194172 49096 -233713 30518 -98206 105842 83278 78530 101615 57160 -200216
19028 59250 139967 260613 72404 168342 23623 -58826 -202648 269405 -30426 -337926 -73203
19016 -126604 103719 29092 112982 -20948 -164703 -129427 156712 -39610 -28253 29278 -12630
19004 -20981 -55440 172312 317170 221436 -323975 -52162 -45931 101487 -77395 162942 2246
18992 -264278 -37445 129918 -143552 -364023 88655 -202576 -96634 -168314 -124631 -44166 37092
18980 10607 86741 -166759 -151563 -72628 -44820 -39450 -9065 317391 -86340 8881 -216958 139444
18967 -84561 -122504 122639 27509 -591239 -145771 -166579 17468 184014 -44007 -178540 186510
18955 7655 110248 -90831 -215882 251743 97918 -155946 31835 268284 -68963 -142722 -111918
$$ packed form
19040A04468a94172D9096b33713C0518i8206A05842k2564m748K3085m4455b00216
19028E9250Q0717J20646G2404R5938B3623e8826j43822B69405c0426l07500g3203
19016a26604A03719B9092Q3890b0948j43755L5276A56712c9610J1357B9278a2630
19004b0981l4459A72312J44858r5734c23975e2162O231A01487g7395A62942B246
18992b64278c7445A29918a43552k20471H8655b02576i6634p1680M3683d4166C7092
18980A0607P6134a66759J5196g2628K7808N370i065C17391h6340H881b16958A39444
18967h4561l7943A22639B7509e91239a45771k0808A7468J66546d4007j34533A86510
18955G655J02593i0831j25051B51743I7918a55946C1835K36449f8963p3759L0804
$$ plain form
18944 -111918 215222 -163155 -128671 95376 -214817 46553 -99166 -133381 -226881 -109276 106469
18932 111118 -60399 -165970 -438227 -38784 -237976 -359345 -38709 190418 120862 119294 -197787
18920 245600 64526 -287217 -165994 -260451 100943 -168159 -290500 152943 103504 -393447
18909 67986 97208 -123099 -17850 -277461 -147185 -191227 -278989 -96628 -19925 180021 -228155
18897 122660 -252978 -89382 -52147 59780 -80694 198842 25130 148379 -317532 -76676 -49451
18886 -49451 -7560 69790 -4023 -21478 109150 -50882 165007 245614 153005 -22644 106722
18874 101146 205859 76383 66126 -86376 21465 -233334 8670 49589 -215207 105985 -116812
18862 -294578 -110441 17736 35971 184596 159061 -360622 50812 156243 112415 32127 -240152
$$ packed form
18944a11918B15222a63155L4484I5376b14817D6553i9166l4215r3500a09276A06469
18932A11118f0399j05571k72257c8784j99192j21369c8709A90418o9556j568a97787
18920B45600F4526b87217J21223r4457A00943a68159j22341A52943m9439c93447
18909F7986K9222a23099a7850k59611J30276m4042q7762i6628a9925A80021b28155
18897A22660b52978h9382L7235E9780h0694A98842B5130J23249c17532g6676K7225
18886d9451g560F9790d023j7455A09150e0882A65007Q0607r2609b2644A06722
18874A01146J04713G6383j0257h6376B1465b33334H670M0919b15207A05985a16812
18862b94578a10441A7736J8235J48625k5535c60622E0812J05431m3828C2127b40152
$$ plain form
18850 213274 -338864 -150999 -71974 -24615 -57155 -111320 -141164 18738 -254459 -39808 -122220
18839 -122220 -314020 -209917 257073 -178869 -429879 -134910 214725 -197553 -87080 -1194
18828 62056 -310255 -242591 -101130 -156263 -180547 -181329 281683 18051 -321282 -149173 -131284
18817 -131284 -4548 118988 129091 -123504 220485 58494 161528 334568 -51617 230975
18806 -6344 49567 358247 373664 -236101 40734 -415416 -106389 -83247 -86776 109921 -74051
18794 -98496 26304 4253 153268 265422 6531 -183394 89043 233233 -239084 -184786 -179073
18783 -179073 -171333 -375965 -119442 -39925 -66125 -280772 98513 190539 -165632 -53954 100833
18771 -312111 -41739 -144132 255755 -69414 -426196 107266 75682 239987 74861 -44164
$$ packed form
18850B13274c38864a50999g1974b4615l2540n4165k9844A8738b54459c9808q2412
18839a22220j91800J04103B57073a78869k51010a34910B14725a97553h7080a194
18828F2056c10255O7664a01130n5133k4284p82B81683A8051c21282a49173J7889
18817a31284d548A18988J0103a23504B20485E8494J03034J73040e1617B30975
18806f344D9567L08680J5417b36101D0734d15416a06389K3142l529A09921g4051
18794i8496B6304D253J49015J12154F531a83394H9043J44190b39084N4298N713
18783a79073P740k04632a19442c9925k6200k14647I8513R2026a65632e3954A00833
18771c12111d1739j02393B55755f9414l56782A07266l1584J64305G4861d4164
$$ plain form
18760 31401 -79811 1917 -70024 -231391 -223317 -72129 -298578 278715 -210458 434624 -203092
18748 164335 -69264 -160655 129131 -134071 -9290 57319 -51816 -232877 214393 -63810 -16248
18736 -155654 -71330 -96680 36038 309244 100909 -54318 170806 68084 -193871 -142543 -52564
18724 114630 92127 -227973 46296 26244 -158450 -121083 -374379 177158 -149609 -29577
18713 -105868 -120699 42630 -20606 66288 18072 112421 56434 -37430 -141577 -316957 135875
18701 24405 85085 131790 -13732 193606 -169549 -100012 98379 368733 -261445 38107 163103
18690 163103 -49853 23833 162227 -236939 38008 135211 110296 -65225 -164063 114661 3905
18678 -272588 -203296 22200 -15784 -134941 -71579 10438 86885 211 -219645 -55032 -356221
$$ packed form
18760C1401g9811A917g0024j61367Q074g2129k26449B78715b10458D34624b03092
18748A64335f9264r1391A29131a34071i290E7319e1816j81061B14393f3810a6248
18736a55654g1330k5350C6038K73206A00909e4318A70806F8084a93871N1328e2564
18724A14630k2503b27973D6296k0052a58450L7367k53296A77158a49609b9577
18713a05868j4831D2630b0606F6288A8072R4349n5987c7430j04147j75380A35875
18701B4405O0680M6705a3732A93606a69549O9537I8379K70354b61445C8107J24996
18690A63103d9853B3833J38394b36939C8008R7203k4915f5225r8838A14661C905
18678b72588O9292B2200a5784j19157O3362A0438P6447B11b19645e5032l01189
$$ plain form
18667 -356221 84407 -230953 104242 -95261 -68098 151446 -166302 -313919 -81862 -158114
18657 -158114 -85463 -27462 -177162 253483 -236166 -123491 -13708 -64316 -55434 -151993 -269548
18646 -269548 157879 -245227 -189704 -51023 -207283 -67809 -224570 10745 109861 186431 -335617
18634 -91485 -64872 124279 -81863 -51048 -41329 -94917 102920 172788 -166661 -193720 -238185
18623 -238185 97500 -145209 -137156 8034 36153 -7665 -80722 -280942 -283854 158169 317221
18612 317221 141825 20065 -273980 -174136 -281590 35318 -163276 157774 -390437 248226
18601 4182 -152455 -111239 -140158 -31034 -162172 -374499 14952 -184983 62667 188401 38343
18589 505478 154184 8543 -14965 -20486 -9615 115876 119082 -159460 7335 4785 -266594 -306778
$$ packed form
18667c56221H4407b30953A04242i5261K7163A51446a66302j47617h1862p6252
18657a58114P2651b7462j49700B53483b36166J12675a3708n0608Q882r6559j17555
18646b69548A57879b45227N5523e1023j56260f7809j56761A0745R9116P6570c35617
18634i1485K6613A24279h1863L0815R719n3588A02920O9868a66661k7059m4465
18623b38185I7500a45209Q053H034K8119g665p3057k00220k912A58169J59052
18612C17221A41825B0065b73980R9844j07454C5318a63276A57774c90437B48226
18601D182a52455M1216k8919c1034j31138k12327A4952a84983F2667J25734C8343
18589E05478A54184H543a4965n521i615A15876L206a59460G335k550b66594m0184
$$ plain form
18577 -306778 -213322 69135 -165870 166398 27393 -246157 -58535 -530014 -179348 -171031 66164
18565 -227194 -137764 -247546 -198311 -111700 -3007 -130612 -112286 21613 16445 -138010 66103
18553 77447 128158 -49885 -193281 -36491 -160235 -181128 -41775 -269461 -203471 -425383 9390
18541 -281551 -241391 -63262 189512 35910 19006 162817 90849 -191331 382101 -97419 -146944
18530 -146944 81002 206117 350333 171429 -130917 -76602 -399381 -390962 143220 3826 144401
18519 144401 204575 -40811 -40280 -269378 -27466 -171601 5491 -224828 -32254 92423 -85303
18507 -277783 123310 169703 -42148 73057 171554 -75255 -145961 -17196 -8119 -152157 223858
18495 -12899 -295297 -381471 295326 -185265 -109779 6218 -151685 -103940 54595 -77850 43839
$$ packed form
18577c06778R3456F9135a65870A66398B7393b46157e8535m71479a79348Q317F6164
18565b27194Q9430j09782M9235Q6611c007j27605J8326B1613n168a38010F6103
18553G7447N0711d9885j43396c6491j23744k0893d1775k27686O5990k21912I390
18541b81551M0160f3262A89512C5910j6904J43811p1968a91331C82101i7419m9525
18530a46944H1002J25115J44216A71429a30917N4315l22779Q419A43220C826J40575
18519A44401O0174d0811N31k29098b7466j44135E491b24828c2254I2423h5303
18507b77783A23310M6393d2148G3057R8497g5255p0706a7196h119j44038B23858
18495a2899k82398q6174B95326a85265P5486F218a51685M7745E4595g7850D3839
$$ plain form
18483 135131 -145029 80613 271934 -123950 30482 98877 168927 -226287 70390 -128653
18472 -307874 -78897 -211314 -279478 15240 -35609 -69131 -172525 -90853 -132104 -41510 -148280
18461 -148280 -151702 -95835 158211 165210 2382 -90755 164696 -99485 -106240 -11795 -226344 99150
18448 -35442 131876 154706 -311979 126659 205297 -108035 -1682 116366 130390 -4659 28773
18436 -126818 -167584 -258517 -549378 -54738 -130711 147733 -75965 -236737 125479 -25553 -26910
18425 -26910 -513803 -98289 -60278 76440 221755 70342 -53272 120391 423408 62408 -78946
18413 60869 8395 45843 -339455 101571 -220847 176364 -61147 -150011 226683 -47115 67044
18401 -255097 38533 -161315 -168559 -81137 -33101 -224813 -239645 58681 107257 -119807 -80118
$$ packed form
18483A35131a45029H0613J91321a23950C0482O8395P0050b26287G0390a28653
18472c07874g8897j32417o8164A5240c5609l3522j03394Q1672m1251d1510j06770
18461a48280l422N5867A58211O999B382i0755A64696i9485o755a1795k14549I9150
18448c5442A31876K2830c11979A26659P8638a08035a682A16366J4024d659B8773
18436a26818m0766r0933k90861e4738p5973A47733g5965j60772A25479b5553j357
18425b6910m86893i8289L8011G6440J45315G0342e3272A20391L03017F2408g8946
18413F0869H395L7448c39455A01571b20847A76364f1147q8864B26683d7115F7044
18401b55097C8533a61315p244h1137c3101j91712j4832E8681M8576a19807L9689
$$ plain form
18390 -80118 -51819 -39800 -368595 336580 -94267 89811 15360 240328 -85608 225438 15363
18378 392665 49750 20290 139294 -104768 -24145 42963 -84097 -283916 -403467 -147900
18367 -95505 124896 285493 -183414 -2940 43815 -156254 23923 -164048 -167066 -34599 -35502
18356 -35502 -130948 -140682 -59198 -79922 202353 -200082 19165 219372 22298 -50983 -119595
18345 -119595 10686 -147301 -94617 -97635 -107714 54061 25768 112121 -149681 -226970 -155899
18334 -155899 99863 -4814 50608 -135976 -189464 253811 -248990 -184686 -252726 245460 53642
18322 -1191 -25454 -247850 5018 -274342 -141130 59605 -175014 67331 246995 -82711 -134202
18311 -134202 100055 195365 -224226 -59684 277408 -83782 172398 74023 -151397 249678
$$ packed form
18390h0118K8299J2019l28795C36580i4267H9811A5360K24968h5608B25438A5363
18378C92665D9750B0290J19004a04768b4145D2963h4097j99819j19551a47900
18367i5505A24896J60597a83414b940D3815a56254B3923a64048l018c4599r03
18356c5502r5446r734e9198k0724B02353b00082A9165K00207B2298e0983o8612
18345a19595A0686a47301N2684l018j0079E4061B5768Q6353a49681p7289P1071
18334a55899I9863d814E0608a35976n3488B53811b48990O4304o8040B45460E3642
18322a191k4263k22396E018b74342J33212E9605a75014F7331J79664h2711n1491
18311a34202A00055R5310b24226e9684B77408h3782A72398G4023a51397B49678
$$ plain form
18300 -45450 182639 -19989 -85932 -350509 127818 -259760 31903 -50642 -356198 62509 -170813
18288 108193 -221632 106663 -368564 -216850 61689 -30178 65241 -252214 106364 41515
18277 -28154 28888 -182778 -272919 -115195 -23858 265830 -88768 -204836 3680 -293822 106691
18265 18231 -52534 81607 -244129 140463 -107053 6443 -132409 115549 -139177 154024
18254 215287 -60258 -73274 -126148 -21221 191218 -104390 13462 -390695 187794 8228 -361811
18242 -322 -182298 -75457 -253103 -214951 -212977 -25124 4051 57924 -310619 96367 130631 145630
18230 145630 -172384 -405325 77153 -202467 -175060 143720 71174 -172441 -230891 3036 -86290
18218 -119178 151000 414667 34384 123333 -62466 171349 -63356 331638 -33877 177270
$$ packed form
18300d5450A82639a9989o5943k64577A27818b59760C1903e0642l05556F2509a70813
18288A08193b21632A06663c68564J51714F1689c0178F5241b52214A06364D1515
18277b8154B8888a82778r0141a15195b3858B65830h8768j16068C680b93822A06691
18265A8231e2534H1607b44129A40463a07053F443a32409A15549a39177A54024
18254B15287f0258j3016n2874b1221A91218a04390A3462c90695A87794H228c61811
18242c22j81976g5457j77646L8152J974b5124D051N3873c10619I6367L4264J4999
18230A45630a72384k32941G7153b02467K7407A43720G1174a72441n8450C036h6290
18218a19178A51000K63667C4384Q8949f2466A71349f3356C31638c3877A77270
$$ plain form
18207 -169367 438924 -81320 -206302 -226072 -124165 21573 -263958 -125738 -118656 -188155 -119142
18196 -119142 -131005 98834 96101 23834 198349 15741 267238 -130097 31653 -73338 40050
18184 89790 -128038 78936 -112912 -222236 -194969 75140 -89867 -239411 -76462 -62098 -80659
18173 -80659 -55715 -95753 -214538 47367 -339445 175885 -130318 -124338 -218221 -224525 -161921
18162 -161921 -6508 -184178 -201945 -191641 -218941 57977 67227 55914 -198909 -261271 63428
18150 -57162 -207894 217489 -173301 56885 -30690 -204331 -265614 136977 81805 -249279
18139 69108 115724 196893 55211 -78898 -298224 -179786 -98669 137156 247471 -115105 -204842
18128 -204842 -133081 153360 -309533 191585 -559881 -86235 34487 -102814 339935 189188
$$ packed form
18207a69367D38924h1320j24982j9770J01907B1573b63958a25738P082o9499O9013
18196a19142j1863I8834k733B3834J74515A5741K51497a30097C1653g3338D0050
18184H9790a28038G8936a12912j09324K7267G5140h9867j49544g6462J4364j8561
18173h0659K4944m0038j18785D7367c39445A75885a30318N980r3883o304O2604
18162a61921f508j77670j7767J0304k7300E7977R250j1313a98909o2362F3428
18150e7162j50732B17489a73301E6885c0690j73641o1283A36977n5172b49279
18139F9108M6616Q1169E5211g8898k19326J18438Q1117A37156J10315a15105q9737
18128b04842P1761A53360c09533A91585e59881h6235C4487a02814C39935j50747
$$ plain form
18118 189188 -33932 -96286 -52410 99213 -310265 108238 218207 -457204 1028 176058 -339538
18106 129845 -38425 -6562 -87598 -191526 -221139 -106958 -100163 -121098 -21597 -57321 -89035
18095 -89035 -9594 -25384 55080 -87686 -155111 -21504 -104467 -105142 60007 131565 -251922 43 -253149
18081 77013 230487 -230390 102203 -26704 200230 234607 188823 -160883 57551 -119730
18070 53661 -66019 -99485 122636 -12915 64835 47798 128211 -202118 -95510 -171930 -368838
18059 -368838 -64304 -41763 27115 -78848 109470 -31419 -179022 -192191 -516769 -204603 155146
18047 -70403 38948 -278716 -61953 -417268 -256715 170690 103980 -133439 156608 77163
18036 -25617 -77338 47233 -53523 68241 -34173 -288594 -34052 239358 80888 93648 65392
$$ packed form
18118A89188c3932o2354M3876I9213c10265A08238J09969d57204A028J75030c39538
18106A29845c8425f562q1036j03928k9613a06958O795k0935b1597l5724l1714
18095h9035i594j5790E5080h7686o7425b1504q2963o75F0007P1558b51922D3b53149
18081G7013J53474b30390A02203b6704B00230L4377m5784a60883E7551a19730
18070E3661f6019l3466A22636a2915F4835j7037Q0413b02118i5510p6420j96908
18059c68838f4304K2541B7115g8848A09470c1419j47603j3169l24578b04603A55146
18047g0403C8948b78716f1953l55315J60553A70690o6710a33439A56608G7163
18036b5617n1721D7233e3523F8241c4173k54421c4052B39358H0888J2760k8256
$$ plain form
18025 65392 137023 75739 -334584 -81887 48307 -16183 -213556 -124738 -39745 252556 223161
18014 223161 66633 154719 -204589 255534 -205668 -125095 76767 32288 35209 65486 138917
18003 138917 264084 -139445 -2357 1824 -290662 -20152 -454282 4576 73443 -2282 160267
17991 -194119 -5612 -265660 -16218 157654 76475 -18801 -58473 -24154 173012 -2675 177408
17979 -42149 136724 37304 -85660 -46502 83266 78587 -18043 -247003 -56331 255492 147825
17968 147825 -239230 -122179 78468 142815 -15501 -169085 46757 -10539 18585 -197217 -91877
17956 230899 -110417 238640 -327185 -20953 -995 119233 14727 113644 -255898 -396613 62339
17944 434263 221564 -107492 57519 297537 45928 -150973 -86762 180142 52178 -107182
$$ packed form
18025F5392P1631o1284c34584h1887D8307a6183j97373Q8818c9745B52556k9395
18014B23161F6633Q8086b04589B55534b05668Q0573G6767C2288K921L0277P3431
18003A38917J25167a39445b357A824b90662b0152m34130D576O8867b282A60267
17991a94119e612k60048a6218A57654G6475a8801l9672b4154A73012b675A77408
17979d2149A36724C7304h5660L9158H3266m679a8043k28960e6331B55492j07667
17968A47825b39230J17051G8468O4347a5501j53584D6757a0539A8585a97217i1877
17956B30899a10417B38640c27185b0953i95A19233A4727R8917b55898j40715F2339
17944D34263k12699a07492E7519K40018D5928a50973O4211A80142E2178a07182
$$ plain form
17933 55107 -168855 -222933 57867 -63429 29070 186989 -18137 -115022 -71021 81368 -50270
17921 200732 -120304 403844 -107014 -199074 -344562 184754 178962 -342019 65598 -376052
17910 -80690 244445 388153 28679 -122785 -53630 -29332 -106178 238776 -339109 150324
17899 22297 134381 -48615 -245507 -210674 -202613 -73866 20493 -235537 -49092 39375 -16987
17887 -59238 -66431 20550 175444 -224966 -209836 53008 198542 -51343 24598 19221 74661
17876 74661 -206734 280670 -260989 -92552 -226582 383559 76773 -66568 111626 28506
17865 -194529 116562 242636 -21837 57051 217863 23426 39004 -344199 186262 -228727
17854 -98533 -124173 64868 89679 -26592 164240 24502 56025 50021 22000 -332719 139991
$$ packed form
17933E5107a68855n4078E7867f3429B9070J57919a8137r6885M4001H1368e0270
17921B00732a20304D03844a07014r2060j45488A84754n792c42019F5598c76052
17910h0690B44445J43708B8679a22785e3630K4298p6846B38776c39109A50324
17899B2297J12084d8615j96892L4833Q061g3866B0493b35537d9092C9375a6987
17887e9238p193B0550J54894b24966J5130E3008J45534e1343B4598n377N5440
17876G4661b06734B80670b60989i2552j34030C83559G6773f6568A11626B8506
17865a94529A16562J26074b1837E7051J60812B3426J5578c44199A86262b28727
17854i8533k5640F4868K4811b6592A64240B4502L1523o004B2000c32719A39991
$$ plain form
17842 40743 -328032 49568 -170646 244069 117240 68480 -17765 140374 79757 10020 -46322
17830 117947 -24763 -150116 21836 230304 2004 -185359 221216 -18597 292427 -8880 153194
17818 -66150 82442 31494 59921 88239 162085 -369267 65542 43457 -22559 154399 111979
17807 111979 -94134 -190204 -40692 -253190 140774 15119 66020 -267944 56808 62268 35715
17796 35715 -121114 -76808 -281966 66115 -110682 -61391 -180612 -49830 59505 183129 40553
17784 -65549 -192077 53411 -129458 427713 39712 -187062 463287 -151234 -248078 -66928
17773 -128417 -255285 -426173 285537 265850 9171 -69600 173515 242992 6293 -404055 -128603
17761 -46144 -64664 -42865 31922 -261214 132071 -120436 -116474 71385 60290 -23151 118146
$$ packed form
17842D0743c28032D9568a70646B44069A17240m8760a7765A40374o0617A0020d6322
17830A17947b4763j25353B1836K08468B004a85359B21216a8597B92427h880A53194
17818f6150H2442C1494K8427K8318P3846c69267F5542k2085b2559A54399m2420
17807A11979i4134r6070d0692k12498A40774A5119N0901b67944E6808N460k6553
17796C5715a21114M4306k05158F6115a10682M9291j19221d9830E9505J23624D0553
17784f5549j26528E3411a29458D27713C9712a87062D63287a51234r6844f6928
17773a28417j26868j70888B85537j9687I171f9600A73515O9477F293d04055a28603
17761d6144j8520K1799C1922b61214A32071a20436L962G1385j1095b3151A18146
$$ plain form
17749 455434 -49343 44578 -36241 -123878 170089 -258647 -27810 -55213 -10899 -336267 150828
17737 197120 82704 35608 10016 -246730 18884 40349 -50063 -174346 -65638 104377 13938
17725 -98500 40250 119409 242474 118074 -114433 54067 -42035 42505 58220 -222714 219599
17713 78463 190770 -167633 164140 343427 -110431 -74860 -148039 21854 -17414 -17851 143222
17701 -28096 28509 64419 -48212 -186954 261031 79472 260384 -207966 99166 -17969 -173728
17690 -173728 -107840 197423 -145055 37324 -279020 -48231 187923 202230 143852 73942 -523
17678 -19331 -133767 203626 92259 173462 -235051 -36336 -82066 -293612 -161236 -101826 8501
17666 69112 -39599 -164270 97096 81845 134768 93198 58243 257531 45433 -238540 -46635
$$ packed form
17749D55434d9343D4578c6241q7637A70089b58647b7810k7403a0899l25368A50828
17737A97120H2704C5608A0016b46730A8884K1465e0063j24283f5638A04377A3938
17725i8500D0250P9159J23065A18074a14433E4067d2035D2505J5715b22714B19599
17713G8463J12307a67633A64140J79287a10431L5571p3179B1854a7414m37A43222
17701b8096B8509L5910d8212j38742B61031G9472J80912b07966I9166a7969j55759
17690a73728O5888A97423a45055C7324b79020d8231A87923J4307n8378o9910e23
17678a9331j14436B03626I2259Q1203b35051c6336m5730k11546J32376N9410H501
17666F9112c9599j24671I7096j5251N2923m1570l4955J99288D5433b38540d6635
$$ plain form
17654 47400 -179361 -144820 138785 17727 230135 35706 32598 -33882 228115 -266324 -60605
17642 91613 -141652 -33261 -190419 -13732 84652 -165008 71996 303346 159976 94421 76402
17631 76402 -46587 63990 -119639 -13073 74862 -321014 10980 392997 349197 151755 -93353
17619 -65027 -13241 -129953 -29986 148617 -118255 56744 -346210 -93333 -23672 129606 83123
17608 83123 132647 -63891 -315262 20939 -26742 -34120 -135984 -84106 150639 297768 71147
17596 -143781 132241 63278 548825 316626 73115 -96897 -48991 411368 -1253 -47231 83388
17584 345007 -193211 -172068 48270 123652 169648 398142 129082 -140252 -104071 174416
17573 162702 339943 -174583 125367 -90892 -13263 70819 33759 122012 207543 -143202 297958
$$ packed form
17654D7400a79361L4541A38785A7727K12408C5706l108c3882B28115b66324f0605
17642I1613a41652c3261j57158a3732H4652a65008G1996K31350j43370o5555j8019
17631G6402d6587F3990a19639a3073G4862c21014A0980L82017m3800A51755i3353
17619f5027a3241j16712b9986A48617a18255E6744c46210i3333b3672A29606m6483
17608H3123M9524f3891k51371B0939b6742p378j01864N1878A50639J47129G1147
17596a43781A32241F3278M85547k32199G3115i6897M7906D11368a253m5978H3388
17584C45007a93211K1143D8270P5382M5996K28494A29082a40252L6181A74416
17573A62702J77241a74583A25367i0892a3263G0819C3759Q8253Q5531a43202B97958
$$ plain form
17561 -75969 -87318 -90715 -20221 -81484 -3964 225214 64937 125343 229509 -58551 240062
17549 170717 -48229 -6243 52753 190275 99521 -225165 -169161 129387 -44386 -79651 -47965
17538 -47965 310728 72029 -14110 64543 -29799 84899 -126086 362432 187747 -207940 11084
17526 362332 146241 50509 28012 221306 -146661 112208 280722 423409 -132434 95924
17515 -13607 466480 56879 139453 136206 -23089 -142572 -100864 245527 193729 -152402 113456
17503 299017 -141342 354993 -23727 148800 13931 20448 -222932 175757 302681 -88651
17492 -99707 -328245 -99695 160130 579668 308002 19840 352226 -61064 218924 -12656
17481 150311 -19124 572808 78243 46683 228596 250242 -114445 187087 104731 121382 -134007
$$ packed form
17561g5969j1349l397b0221o1263c964B25214F4937O0406J04166e8551B40062
17549A70717d8229f243E2753J37522r0754b25165N6004A29387d4386l5265L1686
17538d7965C10728G2029a4110F4543b9799H4899a26086C62432j74685b07940A1084
17526C62332A46241E0509k2497J93294a46661A12208J68514J42687a32434I5924
17515a3607D66480E6879Q2574l247b3089j19483M1708B45527n1798a52402A13456
17503B99017a41342C54993b3727A48800A3931O517b22932A75757J26924h8651
17492i9707k28538i9695A60130M19538k71666A9840L32386f1064B18924a2656
17481A50311a9124E72808G8243l1560J81913K1646a14445A87087q2356J6651a34007
$$ plain form
17469 239739 4013 -9117 379223 24381 230656 231598 -25327 -104465 333634 -157267 69218
17457 103598 -56482 -163918 449936 -190052 -52393 80164 427376 181732 93392 193335
17447 193335 304560 308845 420590 294129 208247 353064 -26100 236138 145447 300006
17437 300006 16691 194549 -96292 202220 252434 426328 -14981 163679 274733 296076
17427 296076 -226036 95726 86923 86608 159591 250512 -227119 71042 166489 514398 446648
17416 446648 403695 585780 294044 255159 398370 218976 -25243 133721 -54893 -74523
17406 -74523 391776 167340 -169184 228447 100336 208981 138024 355004 121572 345467
17396 345467 96094 363603 98635 167220 393726 -166 -21200 302296 249825 274325 381189
$$ packed form
17469B39739D013i117C79223B4381K06275R42b5327p9138C33634a57267F9218
17457A03598e6482j07436D49936a90052e2393H0164L47212A81732q8340R9943
17447A93335J11225M285J11745j26461q5882J44817b6100B36138r0691J54559
17437C00006A6691J77858i6292B02220N0214J73894a4981A63679J11054K1343
17427B96076b26036I5726q803l15P2983R0921b27119G1042R5447L47909o7750
17416D46648m2953J82085k91736l8885J43211j79394b5243A33721e4893j9630
17406g4523C91776A67340a69184B28447A00336J08645p0957K16980A21572K23895
17396C45467I6094K67509I8635O8585K26506a66k1034C02296n2471K4500J06864
$$ plain form
17385 381189 121088 158245 201883 -36238 220036 215964 -2993 -24 166437 592868 276431
17373 51169 245976 -102374 161831 -104128 145626 -265886 197074 37609 480497 14233
17362 277364 15331 324670 -1388 266262 224367 112197 -29509 351538 4254 119499 39740
17350 222465 275271 382831 319848 13471 483113 -84506 152275 84282 -22823 -38002 124726
17338 95097 237244 -204588 186 68927 307954 -147577 298578 388823 103987 110259 280873
17327 280873 158366 -44837 392201 205603 -18546 240801 101337 148628 485095 19462
17316 -189824 -15304 324051 67941 149636 227252 201746 205324 -12353 -10353 145728 246744
17305 246744 335710 73350 12437 169927 3193 331971 -120214 538016 167427 89247 307076
$$ packed form
17385C81189A21088L7157M3638c6238B20036m072b993b4A66437M26431B76431
17373E1169J94807a02374A61831a04128A45626b65886A97074C7609M42888A4233
17362B77364A5331L09339a388B66262m1895j12170b9509C51538D254J15245C9740
17350B22465N2806J07560o2983A3471M69642h4506A52275o7993b2823j5179A24726
17338I5097J42147b04588A86O8741K39027a47577B98578R0245A03987O272J70614
17327B80873j22507d4837C92201j86598a8546B40801A01337M7291L36467A9462
17316a89824a5304C24051F7941Q1695P7616k5506L578a2353K000A45728J01016
17305B46744Q8966G3350A2437J57490C193L28778a20214E38016A67427p8180K17829
$$ plain form
17294 307076 30618 471731 184604 289294 336958 429939 539290 112264 335076 -76399
17283 108472 69822 292677 245262 138426 296037 -101831 302163 289518 140177 -29076
17272 -22846 -141449 60837 156190 115971 51472 178852 247752 -251587 69760 -36781 10643
17260 225173 -146099 -1955 225282 303944 172226 53812 244519 82729 83351 93395 118238
17249 118238 70681 247280 94327 158743 -170952 254070 436641 532974 225386 1783 32991
17238 32991 235230 152474 149000 64210 -240537 37498 -43218 148750 143869 526186 70755
17226 160166 206559 206359 33888 -165255 279297 500246 108216 243113 -84065 319829 499167
17215 499167 48976 362456 301269 74925 245330 -89756 -90241 358214 -96050 381559 8371
$$ packed form
17294C07076C0618M41113A84604J04690M7664R2981J09351A12264K22812g6399
17283A08472l8650K22855m7415j06836J57611a01831C02163j2645A40177b9076
17272b2846j18603F0837R5353m0219E1472J27380O8900b51587F9760c6781A0643
17260B25173a46099a955B25282P8662j31718E3812J90707H2729O22J0044K4843
17249A18238m7557J76599I4327O4416a70952B54070J82571R6333B25386A783L1208
17238C2991K02239q2756l474F4210b40537C7498d3218A48750m881L82317G0755
17226A60166M6393k00C3888a65255B79297K20949A08216J34897h4065C19829J79338
17215D99167D8976L13480o1187G4925J70405h9756m85C58214i6050C81559H371
$$ plain form
17203 147026 87365 77785 54387 255680 2877 20030 330289 87125 219051 89544 573530
17192 573530 355079 256123 382785 455784 278866 450943 103790 225321 339256 163251
17181 209565 120525 322951 170037 304522 136355 235657 387738 257500 196136 347312
17171 347312 -146895 46794 -3466 410774 234972 163587 67285 303633 632027 304046
17160 149158 430284 410665 211637 270776 45340 398598 479459 185345 663333 263857
17149 150625 121540 150173 478087 102418 694127 318495 -23254 166476 32140 290449
17139 290449 278559 291489 306681 713874 410678 591590 508279 207382 218400 400886
17129 400886 416219 251681 627303 659689 623418 131374 347802 482361 237437 236918 409759
$$ packed form
17203A47026n9661r580k3398K01293B877J7153L10259H7125J31926H9544M83986
17192E73530k18451r8956J26662P2999j76918J72077A03790J21531J13935A63251
17181B09565q9040K02426j52914J34485A36355R9302J52081j30238o1364J51176
17171C47312a46895D6794c466D10774j75802p1385F7285K36348L28394C04046
17160A49158K81126j9619j99028N9139D5340L53258Q0861A85345M77988B63857
17149A50625k9085K8633L27914A02418N91709C18495b3254A66476C2140K58309
17139B90449j1890J2930J5192M07193l03196J80912q3311B07382J1018J82486
17129D00886J5333j64538L75622L2386l6271A31374K16428J34559B37437n19J72841
$$ plain form
17118 409759 340598 338156 220450 531451 233227 97462 454889 377586 221823 340610
17108 340610 266621 616677 385179 416754 357856 684028 427016 135466 206713 449515
17098 449515 454678 28997 574469 484598 283315 539259 254297 243384 629807 487666
17088 487666 564406 452155 374911 410522 470304 356685 469993 523232 502512 480736 475147
17077 475147 513367 636186 135970 386617 651115 497049 391540 369583 577044 594668
17067 594668 224287 633129 469361 138097 384421 567525 559414 682927 407369 314027
17057 314027 685997 201664 421536 589973 317974 467099 68992 407658 595981 399833
17047 399833 660893 532249 607397 684028 360578 532369 582812 505409 676526 666241
$$ packed form
17118D09759o9161k442j17706L11001B33227I7462L57427p7303j55763J18787
17108C40610p3989L50056k31498L1575n8898L26172k57012A35466P1247K42802
17098D49515N163B8997N45472q9871k01283K55944B54297j0913L86423j42141
17088D87666P6740j12251p7244L5611N9782j13619J13308N3239k0720k1776n589
17077D75147L8220J22819A35970K50647K64498j54066j05509k1957K07461J7624
17067E94668B24287M08842j63768A38097K46324J83104q111J23513k75558r3342
17057C14027L71970B01664K19872J68437k71999J49125F8992L38666J88323j96148
17047C99833K61060j28644P5148P6631l23450J71791N0443p7403J71117j0285
$$ plain form
17037 666241 750534 159444 645831 404934 773804 489036 606894 636937 449887 461706
17027 461706 663137 644804 213642 531720 288850 589398 549299 490217 706661 422293
17017 422293 714217 793440 567007 908899 819566 759024 644758 731487 389020 612547
17007 612547 895755 515747 679700 582086 602939 694693 948322 644137 583337 990129
16997 990129 752676 584247 1041964 816120 840448 763852 742506 854510 825483 1033943
16987 1033943 769401 767089 839089 682945 970570 726970 683832 802831 778480 708177
16977 708177 1009547 930499 498276 773778 743079 943515 784597 907431 1171503 808112
16967 808112 954063 815343 998249 1084964 765473 560314 1107564 1067657 1001765 1143583
$$ packed form
17037F66241Q4293A59444M86387k40897L68870k84768J17858L0043j87050J1819
17027D61706K01431j8333B13642L18078k42870L00548m0099n9082K16444k84368
17017D22293K91924P9223k26433L41892q9333o0542j14266Q6729l42467K23527
17007F12547K83208l80008J63953r7614K0853R1754K53629l04185o0800M06792
16997I90129k37453j68429M57717k25844K4328p6596k1346J12004k9027K08460
16987A033943k64542k312P2000j56144K87625k43600m3138J18999k4351p0303
16977G08177L01370p9048m32223K75502l0699K00436j58918J22834K64072l63391
16967H08112J45951j38720J82906Q6715l19491k05159N47250l9907o5892J41818
$$ plain form
16957 1143583 864428 1201577 1103351 1096036 1121585 984488 787590 1032646 955635 1078899
16947 1078899 1065636 1045229 1216054 1034867 1327452 1282114 1306749 998151 1291416 1082960
16937 1082960 1031294 1071659 1655476 1241182 1389157 1198866 1278897 969453 1349522 1153399
16927 1153399 1437380 1731224 1556847 1447571 1285457 1385748 1603164 1294464 1357299 1492606
16917 1492606 1391650 1324689 1457747 1341152 1653116 1469845 1788794 1153442 1619491 1437101
16907 1437101 1644673 1722350 1757881 1560548 1514833 1746228 1926323 1792388 1583211 1649029
16897 1649029 1759888 1769386 1853126 1908489 2016111 1770036 2266541 1972951 2013612 2161866
16887 2161866 1791658 2013664 1792625 2055991 2453143 2197805 2240446 2356235 2408806 2227904
$$ packed form
16957A143583k79155L37149r8226p315K5549j37097j96898K45056p7011J23264
16947A078899j3263k0407J70825j81187K92585m5338K4635l08598K93265k08456
16937A082960n1666M0365N83817m14294J47975j90291Q0031l09444L80069j96123
16927A153399K83981K93844j74377j09276j62114J00291K17416l08700O2835J35307
16917A492606j00956o6961J33058j16595L11964j83271L18949o35352M66049j82390
16907A437101K07572P7677L5531j97333m5715K31395J80095j33935k09177O5818
16897A649029J10859R498Q3740N5363J07622k46075M96505k93590M0661J48254
16887B161866l70208K22006k21039K63366L97152k55338M2641J15789N2571j80902
$$ plain form
16877 2227904 2301933 2295967 2303969 2307238 2422020 2607472 2806246 2588396 2657400 2641422 2841850
16866 2841850 2572825 2917313 3058531 2667911 2690179 3107988 3011031 2834534 2977444 2980513
16856 2980513 3102997 3010816 3214764 3432526 3330615 2907291 3395988 3352517 3216893 3318251
16846 3318251 3420387 3608268 3739841 3666990 3658342 3866002 3818621 3752522 3836771 4157951
16836 4157951 3890848 4178448 4231480 4179215 4422456 4210419 4727477 4869586 4619455 4810809
16826 4810809 4805006 4911649 4969817 5235710 5188713 5411561 5680571 5580956 5911875 5799801
16816 5799801 6040050 6027337 6051403 6027316 6623128 6636378 6638148 6675688 6991329 7278380 7048880
16805 7048880 7430712 7579815 7891139 7849623 8287689 7984499 8281842 8662096 8819117 9333050
$$ packed form
16877B227904P4029n966Q002L269J14782J85452J98774k17850O9004j5978K00428
16866B841850k69025L44488J41218l90620K2268M17809r6957j76497J42910L069
16856B980513J22484r2181K03948K17762j01911m23324M88697m3471j35624J01358
16846C318251J02136J87881J31573p2851q648K07660m7381o6099Q4249L21180
16836D157951k67103K87600N3032n2265K43241k12037N17058J42109k50131J91354
16826D810809n803J06643N8168K65893m6997K22848K69010r9615L30919j12074
16816E799801K40249j2713K4066k4087N95812J3250J770L7540L15641K87051k29500
16805G048880L81832J49103L11324m1516M38066l03190K97343L80254J57021N13933
$$ plain form
16795 9333050 9242279 9270142 9964528 9829755 10355376 10689577 11086767 11105923 11696152 11605199
16785 11605199 12013654 12396318 12688113 12936912 13370419 13900255 14285971 14736403 15245064
16776 15245064 15592048 15910382 16463507 17656857 17933843 18464787 18964937 19901817 20603063
16767 20603063 20949358 22040416 22411605 23574362 24035973 25226634 26046315 27499333 28607012
16758 28607012 29814013 30772391 32206125 33735710 35132665 36565434 38122165 39906352
16750 39906352 42075963 43669498 46007792 48154452 50652368 53433817 56018483 58745432
16742 58745432 62377972 64793506 68928785 72623115 76614804 80771872 85507315 90345100
16734 90345100 94805240 100280291 105706092 111229381 117365840 123217919 129642087 135860343
$$ packed form
16795I333050r0771K7863O94386j34773N25621L34201L97190J9156N90229r0953
16785A1605199M08455L82664K91795K48799M33507N29836L85716M50432N08661
16776A5245064L46984L18334N53125J193350K76986N30944N00150R36880P01246
16767B0603063L46295J091058L71189J162757M61611J190661Q19681J453018J107679
16758B8607012J207001R58378J433734J529585J396955J432769J556731J784187
16750C9906352K169611J593535K338294K146660K497916K781449K584666K726949
16742E8745432L632540K415534M135279L694330L991689M157068M735443M837785
16734I0345100M460140N475051N425801N523289O136459N852079O424168O218256
$$ plain form
16726 135860343 141604709 147606035 153376130 158682778 163048082 167030829 170372192 172939063
16718 172939063 174270656 174467056 173885029 172192549 170332253 166595331 162306417 157638146
16710 157638146 152288066 146475969 140565422 134481767 127916955 121556550 115656497 109792237
16702 109792237 103881103 98092163 92891135 87941166 83174517 78800570 74327973 70304391
16694 70304391 66551180 63200993 59735426 56656522 53866977 51225714 48727267 46310010
16686 46310010 44252504 41972791 39659526 38255625 36594834 34624942 33008403 31751541
16678 31751541 30554512 29258370 27435752 26808708 25705535 24813464 23531544 23045805
16670 23045805 22048757 21590406 20399235 19703458 18962451 18322856 17654090 17286070 16359423
$$ packed form
16726A35860343N744366O001326N770095N306648M365304L982747L341363K566871
16718A72939063J331593J96400n82027j692480j860296l736922m288914m668271
16710A57638146n350080n812097n910547o083655o564812o360405n900053n864260
16702A09792237n911134n788940n201028m949969m766649m373947m472597m023582
16694G0304391l753211l350187l465567l078904k789545k641263k498447k417257
16686D6310010k057506k279713k313265j403901j660791j969892j616539j256862
16678C1751541j197029j296142j822618o27044j103173q92071j281920m85739
16670B3045805r97048m58351j191171o95777p41007o39595o68766l68020r26647
$$ plain form
16661 16359423 15966557 15341768 14965352 14392144 14258829 13488185 13228607 12568106 12548601
16652 12548601 11967879 11715651 11332660 11305241 11036898 10613188 10088663 9870389 9642585
16643 9642585 9202752 9448172 9089315 8647195 8792544 8347334 8171876 7698365 7668204 7681237
16633 7681237 7321117 7062420 7198464 6945003 6891395 6137051 6808751 6127651 6150188 6179326
16623 6179326 5554305 5505096 5541754 5375290 5170865 4983611 5201773 5540057 4930992 4914474
16613 4914474 4829630 4585667 4524089 4488808 4407334 4458057 4223111 4014896 4203689 4049931
16603 4049931 4132924 3760986 3856968 3476124 3900871 3361591 3466158 3563631 3558208 3344936
16593 3344936 3517712 3317951 3334118 3255840 3071435 3333673 3136728 2783110 3159135 2932637
$$ packed form
16661A6359423l92866o24789l76416n73208j33315p70644k59578o60501j9505
16652A2548601n80722k52228l82991k7419k68343m23710n24525k18274k27804
16643I642585m39833K45420l58857m42120J45349m45210j75458m73511l0161J3033
16633G681237l60120k58697J36044k53461n3608p54344O71700o81100K2537K9138
16623F179326o25021m9209L6658j66464k04425j87254K18162L38284o09065j6518
16613D914474q4844k43963o1578l5281q1474N0723k34946k08215J88793j53758
16603D049931Q2993l71938R5982l80844M24747n39280J04567R7473n423k13272
16593C344936J72776j99761J6167p8278j84405K62238j96945l53618L76025k26498
$$ plain form
16583 2932637 2982130 2710111 2751785 2570455 2687338 2909479 2579141 2726379 2470765 2608052
16573 2608052 2371969 2587159 2581933 2717893 2288241 2271120 2201268 1971941 2062428 1688647
16563 1688647 2256432 2092097 1805971 1992560 1704951 1616470 1936910 1934071 1861223 2070192
16553 2070192 1628906 2085969 2106890 2146286 1909571 1831636 1536067 1633862 1541687 1329175
16543 1329175 1703795 1956760 1905881 1487840 1486180 1693263 1316710 1275762 1463367 1478884
16533 1478884 1632602 1504737 1357592 1477514 1305866 1279691 1261956 1065346 1217109 1573891
16523 1573891 1368640 1551404 1113380 1428331 1371679 1493759 1198938 1226451 1258993 1405802
16513 1405802 1385899 1053838 1317852 967377 1006630 1010248 1250548 1183151 1260678 1107203
$$ packed form
16583B932637M9493k72019M1674j81330J16883K22141l30338J47238k55614J37287
16573B608052k36083K15190n226J35960m29652j7121o9852k29327R0487l73781
16563A688647N67785j64335k86126J86589k87609q8481L20440k839p2848K08969
16553B070192m41286M57063K0921L9396k36715p7935k95569R7795r2175k12512
16543A329175L74620K52965n0879m18041j660K07083l76553m0948J87605J5517
16533A478884J53718j27865j47145J19922j71648k6175j7735j96610J51763L56782
16523A573891k05251J82764m38024L14951n6652J22080k94821K7513L2542J46809
16513A405802j9903l32061K64014l50475L9253L618K40300o7397P7527j53475
$$ plain form
16503 1107203 1102724 1061517 878970 836215 1261534 994154 848771 942976 551617 883848
16493 883848 1041756 737325 981949 608132 770196 1135455 809151 1128823 1142319 827262
16483 827262 876106 1062645 1084543 616107 735704 458682 899946 533981 1146376 992896
16473 992896 482241 928134 674771 810890 799338 713092 469139 481297 748497 664957
16463 664957 317315 554311 793337 784367 881627 702826 881024 713446 499854 1117307
16453 1117307 693710 905162 494679 285734 411803 585239 397359 387795 518670 319795
16443 319795 404986 484692 504125 514492 360926 685150 396145 791710 684510 225807
16432 654132 516745 460622 614392 491488 850449 553934 513971 599155 602613 277424
$$ packed form
16503A107203m479m1207j82547m2755M25319k67380j45383R4205l91359L32231
16493H83848J57908l04431K44624l73817J62064L65259l26304L19672J3496l15057
16483H27262M8844J86539K1898m68436J19597k77022M41264l65965O12395j53480
16473I92896D82241M45893k53363J36119j1552q6246k43953J2158K67200q3540
16463F64957C17315K36996K39026q970R7260j78801J78198j67578k13592O17453
16453A117307m23597K11452m10483k08945J26069J73436j87880r564J30875j98875
16443C19795Q5191P9706J9433J0367j53566L24224k89005L95565j07200B25807
16432F54132j37387n6123J53770j22904L58961k96515l9963Q5184L458B77424
$$ plain form
16421 356948 693431 403949 321681 616498 773008 848970 355984 570597 388141 420451
16411 420451 615892 637418 570617 571929 373906 299456 423191 691959 514651 422570 354516
16400 354516 420772 202023 393975 791957 245928 178592 324296 623757 147497 500265
16390 500265 604089 -6261 145121 457040 613563 483963 691864 197039 546364 212064
16379 490425 363452 275369 422190 232026 73705 407252 392506 385976 565997 245936
16368 250160 414190 276769 346061 341126 222348 486655 272932 423508 364948 189854
16358 189854 420997 -27725 -890 565489 651058 224692 676487 430726 146641 225666 138064
16347 138064 308853 283245 304865 237866 202358 285934 183126 40978 308927 514122 322563
$$ packed form
16421C56948L36483k89482q2268K94817J56510P5962C55984K14613j82456L2310
16411D20451J95441K1526o6801J312j98023p4450J23735K68768j77308r2081o8054
16400C54516O6256B02023J91952L97982B45928o7336J45704K99461A47497L52768
16390E00265J03824f261A45121L11919J56523j29600K07901A97039L49325B12064
16379D90425j26973q8083J46821j90164G3705L33547j4746o530J80021B45936
16368B50160J64030j37421O9292m935j18778K64307k13723J50576n8560j75094
16358A89854K31143b7725h90E65489Q5569B24692M51795k45761A46641P9025q7602
16347A38064J70789k5608K1620o6999l5508Q3576j02808D0978K67949K05195j91559
$$ plain form
16336 322563 333471 -36558 306534 404508 347548 177755 392195 198217 156958 283280
16326 283280 238349 516531 -13524 458310 319482 206094 294896 -29927 342520 335330 -32284
16314 234556 272361 188185 165423 91010 452962 137320 617548 244819 453744 304122
16304 304122 337781 193806 463320 331756 7683 56924 -163086 559630 389206 82668
16293 433176 56295 227940 111511 -12630 56184 175406 229684 90003 155307 55044 254409
16282 254409 136140 226578 162366 304083 -14284 -8486 293775 394357 138020 181452 -27300
16270 366553 233834 230406 60766 331436 257811 227423 -19082 -189821 40105 190687 8562
16258 280675 47085 198201 406225 -163667 207138 197419 57160 -51311 160624 -187054
$$ packed form
16336C22563J0908c6558C06534R7974n6960j69793K14440j93978m1259J26322
16326B83280m4931K78182a3524D58310j38828j13388Q8802b9927C42520p190c2284
16314B34556L7805q4176k2762p4413L61952A37320M80228B44819K08925j49622
16304C04122L3659j43975K69514j31564G683M9241a63086E59630j70424H2668
16293D33176E6295J71645A11511a2630E6184J19222N4278I0003O5304E5044J99365
16282B54409j18269R0438o4212J41717a4284N798B93775J00582A38020M3432b7300
16270C66553j32719l428F0766K70670p3625l0388a9082j70739D0105J50582H562
16258B80675D7085J51116K08024a63667B07138r719E7160e1311A60624a87054
$$ plain form
16247 164276 100757 61286 151644 22980 -128188 451 358268 318335 42988 -22109 258369
16235 -95845 144675 1277 25902 199151 -318548 233295 -144942 157210 32729 135359
16225 135359 208114 66828 -5304 305219 165672 341532 202904 148579 89711 200871 -159749
16213 347831 33714 86960 209726 -21981 90452 249295 114111 45718 55787 268042 123330
16201 46399 21601 -37827 119891 66348 -141064 195085 43171 -68531 103851 101353 -16646
16189 -78506 -31972 27506 -14703 191581 -111979 -60411 133920 -17696 336778 -129715 -281188
16178 -281188 10425 -5001 59972 18012 -199895 -221487 129664 75428 -28453 -76930 -237325
16167 -237325 215426 17732 -122160 296858 183348 -100107 -81104 -22759 121155 296191
$$ packed form
16247A64276o3519l9471R0358B2980a28188D51L57817l9933D2988b2109B58369
16235i5845A44675A277K4625J73249c18548B33295a44942A57210C2729J02630
16225A35359P2755F6828e304C05219j39547J75860j38628n4325n8868J11160a59749
16213C47831C3714N3246J22766b1981I0452J58843A14111D5718J0069K12255A23330
16201D6399B1601c7827A19891n3543a41064A95085D3171f8531A03851k498a6646
16189g8506c1972B7506a4703A91581a11979N1568A33920a7696C36778a29715j51473
16178b81188A0425e001E9972A8012a99895k1592A29664n4236b8453m8477j60395
16167b37325B15426A7732a22160B96858j13510a00107J9003b2759A21155J75036
$$ plain form
16157 296191 -37921 105678 -196397 -157274 -4905 32379 308799 97068 -210179 15165 100545
16146 100545 181887 1162 28453 11362 -129269 -278217 208449 -25384 115538 133545 -57379
16134 -97771 70470 -45050 -398233 -96631 137929 77353 16514 129699 77383 8466 -282479
16122 -85838 -36052 -17192 -189542 337055 -75537 289373 -157873 75876 242298 -29398 -240170
16111 -240170 54870 293685 -177005 -157818 63191 -110768 33563 259743 402957 165080
16100 154683 58207 -12409 -86161 -163818 275244 91007 -132548 159323 161934 -93087 142931
16088 129571 231433 309920 -53606 87898 153903 354630 7289 132945 -178488 199126 -182306
16076 11096 208712 -250385 -28554 119392 409518 -316335 -74033 -278955 -243513 -177942
$$ packed form
16157B96191c7921A05678a96397L9123d905C2379K76420I7068b10179A5165Q5380
16146A00545Q1342A162K7291A1362a29269j48948B08449b5384A15538J8007e7379
16134i7771G0470d5050l53183i6631A37929o0576A6514J13185n2316H466b82479
16122h5838c6052a7192j72350C37055g5537B89373a57873G5876J66422b9398k10772
16111b40170E4870K38815a77005J9187F3191a10768C3563K26180J43214A65080
16100A54683E8207a2409p3752p7657B75244I1007a32548A59323K611i3087A42931
16088A29571J01862P8487e3606H7898O6005K00727G289J25656a78488A99126a82306
16076A1096J97616b50385b8554A19392K90126c16335g4033k04922L5442O5571
$$ plain form
16066 -177942 124953 -128894 30657 8953 -24146 229785 239117 -126828 57280 86569 23409
16054 -178712 183944 59924 261918 86569 -43060 115056 26765 217150 -239652 28133
16043 -193976 -92976 402594 109599 157675 99146 -311359 -190858 211406 -157799 131050
16032 -26894 86634 27552 -281582 3981 58007 -152552 -18233 14328 -18699 -155247 -308211
16021 -308211 427639 267741 -321823 -169244 21347 -182326 -125897 -120205 -242024 -207271
16011 -207271 -62231 -89571 167721 287065 140384 -138279 -60594 -45335 149563 -186576
16000 -471278 -13178 -230670 167650 97660 -54420 263192 -301415 -83815 9904 -113109 211488
15988 105994 -29251 -108529 -127146 -53465 47840 325192 334239 301165 58445 137003 53553
$$ packed form
16066a77942A24953a28894C0657H953b4146B29785R332a26828E7280K9289B3409
16054a78712A83944E9924K01994H6569d3060A15056B6765J90385b39652B8133
16043a93976i2976D02594A09599M8076n8529c11359J20501B11406a57799A31050
16032b6894H6634B7552b81582C981N4026a52552a8233A4328a8699j36548j52964
16021c08211D27639j59898c21823J52579B1347a82326N6429N692j21819L4753
16011b07271f2231k7340A67721J19344A40384a38279f0594J5259A49563a86576
16000d71278a3178k17492A67650o9990e4420B63192c01415h3815I904a13109B11488
15988A05994b9251p9278j8617e3465D7840K77352R047l3074E8445P8558E3553
$$ plain form
15976 -36925 -129488 35080 4960 120085 81504 269408 74777 -69851 -65148 181812 207633
15965 207633 -267545 -100896 220764 237644 250205 369058 -32524 16313 148234 -277346
15954 -320529 163807 16508 70454 53717 1831 -35623 173170 -150695 -128805 -39088 -104966
15943 -104966 -155186 521513 -232864 64663 -32434 -98339 -80112 -45881 -197341 142974 -378490
15931 -31832 -250230 -57264 -66473 -89142 118951 246067 1237 233612 263099 -191691 -37710
15919 -263003 -32957 -78296 76058 67739 -253919 212340 -242854 281512 8239 -45851 -23005
15908 -23005 -137191 -123187 -7028 -84166 -138676 7428 14262 -400159 -79562 45759 118192 147714
15896 147714 204603 27185 -34136 -93618 114804 -189226 -91251 -52771 200437 -258188 -198633
$$ packed form
15976c6925r2563C5080D960J15125l8581J87904G4777f9851M703A81812K5821
15965B07633b67545a00896B20764J6880J2561J18853c2524A6313J31921b77346
15954c20529A63807A6508N3946j6737A831c5623A73170a50695K1890c9088o5878
15943a04966n0220E21513b32864F4663c2434o5905J8227L4231j51460A42974c78490
15931c1832k18398e7264r209k2669A18951J27116A237K32375K9487a91691c7710
15919b63003c2957m5339G6058q319b53919B12340b42854B81512H239d5851K2846
15908b3005j14186J4004g028p7138n4510G428O834d00159g9562D5759P2433K9522
15896A47714N6889B7185c4136n9482A14804a89226i1251L8480B00437b58188N9555
$$ plain form
15885 -198633 -68326 26195 184565 16412 -87860 -112851 -432204 -360637 29661 9940 -9372
15873 433426 -329662 133033 21093 132629 -258314 -196273 -32335 -34566 21277 130233 -64084
15861 -140982 217886 -102816 -70648 146699 174488 19339 118963 108913 -66783 3901 72680
15850 72680 -67804 -90025 -46049 -49399 87302 -52387 58562 -176444 82259 -22186 94619 -25497
15837 -252485 18288 -46416 8621 -196849 -335539 -105328 368187 -154526 55744 -172907
15826 -129108 197173 105093 -66719 -34178 -534252 77927 1 138040 15156 43322 -76419 150279
15813 -75871 183188 -61042 -141757 -295703 -52578 -39100 -201347 138097 377572 -170048
15802 15519 105668 190463 122672 77982 -19573 -103743 85116 -287018 -44401 -130538 -70621
$$ packed form
15885a98633f8326B6195J58370A6412h7860k4991l19353P1567B9661I940i372
15873D33426c29662A33033B1093J11536b58314O2041c2335k231B1277J08956f4084
15861a40982B17886a02816L2168A46699K7789A9339R9624j0050f6783C901O8779
15850G2680f7804k2221M3976l350H7302e2387E8562a76444H2259b2186I4619b5497
15837b52485A8288d6416H621a96849j38690a05328C68187a54526E5744a72907
15826a29108A97173r2080f6719L2541n00074G7927AJ38039A5156K8166g6419A50279
15813g5871A83188f1042q0715j53946e2578J3478j62247A38097K39475a70048
15802A5519R0149Q4795o7791m4690a9573q4170H5116b87018d4401q6137N9917
$$ plain form
15791 -70621 52620 271739 151694 38553 -511899 219888 333114 -26895 61274 -254692
15780 249503 -96013 -247794 -204607 434490 293482 53505 -158390 -100830 -236499 -47824
15769 -35151 -155010 20155 -61014 -196015 -300700 233487 -126504 -194160 80649 -40630 80124
15757 -47177 -175048 28972 93648 179877 -82262 -82571 -212408 -196551 -25345 140786 -231353
15745 222939 54270 -310028 -61015 -18393 -22521 -208219 -19032 -388773 -187392 -31656 -179174
15734 -179174 -175964 -200759 -25448 256610 168082 138061 -52462 229897 54341 101843 129406
15723 129406 20372 -93057 -46734 -44563 -6947 -24675 209638 3068 -97399 -148870 36557 74183
15711 74183 -237304 -149199 -83093 -174468 -5729 -293666 105782 268177 -18793 -275092 39559
$$ packed form
15791g0621E2620K19119j20045C8553e11899B19888J13226b6895F1274b54692
15780B49503i6013j51781M3187D34490j41008E3505a58390N7560j35669d7824
15769c5151j19859B0155f1014j35001j04685B33487a26504o7656H0649d0630H0124
15757d7177j27871B8972O4676Q6229h2262l09j29837J5857b5345A40786b31353
15745B22939E4270c10028f1015a8393m128j85698a9032l69741a87392c1656j47518
15734a79174L210k4795b5448B56610q8528l0021e2462B29897E4341M7502K7563
15723A29406B0372i3057M6323K171f947j7728B09638C068i7399n1471C6557L7626
15711G4183b37304Q8105O6106r1375e729k87937A05782J62395a8793k56299C9559
$$ plain form
15699 -90106 -242988 -56551 -205679 -92487 -64335 139216 10005 -255332 -4569 155012 -17117
15687 94792 -70121 281135 163339 373240 -202376 370263 -64043 -302814 -128239 298989
15676 -345117 -199474 -74568 -105717 -56436 98162 271448 -15931 148768 132536 40574 -260828
15664 -189124 261279 -192852 -135934 92285 182404 -108272 52214 -156123 -151397 -135467 -103940
15653 -103940 42867 83860 127946 -500623 -48293 83872 126774 134180 96984 -23438 39290
15641 -126246 -225518 59615 -227696 -150279 -150826 -129527 201957 -112052 -228897 -59669 36840
15629 -122759 144140 90517 152423 149085 -43767 35829 30729 -2918 167241 -336210 -62193
15617 -91635 -166812 136446 96599 2163 154539 37498 -55564 -143881 21060 -24410 -294769
$$ packed form
15699i0106j52882e6551j49128i2487K8152A39216A0005b55332d569A55012a7117
15687I4792g0121B81135j17796K09901b02376C70263f4043k38771a28239B98989
15676c45117J45643g4568l1149M9281I8162J73286a5931A48768j6232D0574b60828
15664a89124B61279a92852N6918I2285R0119a08272E2214a56123M726J5930L1527
15653a03940D2867M0993M4086e00623d8293H3872M2902P406l7196b3438C9290
15641a26246r9272E9615b27696P7417n47K1299B01957a12052j16845e9669C6840
15629a22759A44140n3623O1906l338d3767C5829n100b918A67241c36210f2193
15617i1635p5177A36446l9847B163J52376C7498e5564q8317B1060b4410k70359
$$ plain form
15606 -294769 -37813 15534 -38999 -187040 -83216 -44062 -10281 118480 52167 -164026 -160849
15595 -160849 -215127 171360 36859 192226 -178543 59794 -63267 -21102 64349 71845 -124308
15583 107063 205961 76531 -108316 -200284 -31546 115622 -46764 -160203 12932 75321 -69987
15571 -56359 227531 -277356 -6542 -16603 -104067 -66096 243583 42592 -100100 -91929 -114971
15560 -114971 113387 76552 52619 -33751 425060 195994 9460 202953 -480348 -937 241554
15548 50726 174865 155587 71380 -157605 -94362 -118759 -21660 236852 186424 -234357 -17123
15536 14164 -132015 -57806 -241502 -84687 -8688 91222 -256528 1650 173200 41458 129614
15525 129614 -96293 234007 173362 4213 127079 61727 -171241 -61915 -92491 -95367 51716
$$ packed form
15606b94769c7813A5534c8999j48041h3216L9154a0281A18480E2167a64026L177
15595a60849n4278A71360C6859J55367a78543E9794f3267b1102F4349P496a24308
15583A07063R8898G6531a08316r1968c1546A15622d6764j13439A2932O2389f9987
15571e6359B27531b77356f542j0061q7464L7971B43583D2592a00100Q171k3042
15560a14971A13387l6835k3933c3751D25060A95994I460J93493d80348i37B41554
15548E0726J24139j9278G1380a57605O3243k4397b1660B36852n0428b34357a7123
15536A4164a32015e7806j83696h4687h688I1222b56528A650J71550D1458Q8156
15525A29614i6293B34007o0645D213J22866F1727a71241f1915l0576k876E1716
$$ plain form
15513 192919 342352 -70813 -26884 -19625 256889 308728 218209 -360900 -99205 111326 -272942
15501 273444 -91494 -269845 -25557 24229 -227087 -41035 -362939 -125792 14123 54808 -22356
15489 -296354 -17626 135977 -316422 31247 -78227 161941 207964 57112 42645 32056 73177
15478 73177 -165685 24065 4993 23541 -149889 64988 112374 362947 -7296 278614 -255590
15466 51872 -99892 110369 -306311 -493929 -14370 -159680 -85635 4133 23418 -111364 4515
15454 155044 53642 -206538 84645 -373117 175690 -208920 53891 -118877 -101334 -89987
15444 -89987 -25201 346214 -132300 -105669 -3431 -151643 54061 150608 -292657 333076 -236286
15432 130615 79765 100048 -139311 82535 414758 79591 -39721 -167665 -27794 -1119 3162
$$ packed form
15513A92919J49433g0813b6884P259B56889N1839r0519c60900i9205A11326b72942
15501B73444i1494j78351b5557B4229b27087d1035l21904a25792A4123M0685b2356
15489b96354a7626A35977c16422C1247g8227A61941M6023E7112j4467j0589M1121
15478G3177a65685B4065D993J8548a49889F4988M7386K50573g296B78614b55590
15466E1872i9892A10369c06311j87618a4370j45310P4045D133J9285a11364D515
15454A55044E3642b06538H4645c73117A75690b08920E3891a18877J7543J1347
15444h9987b5201C46214a32300K6631c431j48212E4061R6547b92657C33076b36286
15432A30615n0850K0283a39311H2535L32223G9591c9721j27944b7794a119C162
$$ plain form
15420 -68618 109625 -67043 68665 -191362 90805 -389301 10598 -292272 -59654 220935 34569
15408 95847 103235 1572 25724 -29908 -282140 511551 279582 -177800 168770 -88716 9406
15396 -374941 317703 20864 -74524 -186680 84513 -276090 43179 -74163 -340817 -97104 -227831
15385 -227831 31621 121103 82267 -43159 -415195 138774 -228747 -157949 -126929 7326 -89345
15373 74454 -35362 54892 -85300 165117 -132106 139158 -176006 -124349 -104342 43840 -7208
15361 -191650 441883 64108 252433 -65036 185388 -92653 -217213 86261 241072 63193
15350 -512298 -63660 26826 189487 -197952 -83749 202669 -131411 7168 65559 -36058 145670
15338 -318374 325921 27696 71482 346285 -4233 226101 134698 222068 349883 89544 110814
$$ packed form
15420f8618A09625f7043F8665a91362I0805c89301A0598b92272e9654B20935C4569
15408I5847P388A572K4152b9908k52232E11551k31969a77800A68770h8716I406
15396c74941C17703B0864g4524j12156H4513b76090D3179g4163k66654i7104j30727
15385b27831C1621Q9482l8836d3159l72036A38774b28747P0798L1020G326h9345
15373G4454c5362E4892h5300A65117a32106A39158a76006N1657K0007D3840g208
15361a91650D41883F4108J88325f5036A85388i2653j24560H6261J54811F3193
15350e12298f3660B6826J62661a97952h3749B02669a31411G168N8391c6058A45670
15338c18374C25921B7696M3786K74803d233B26101r1403Q7370J27815H9544K1270
$$ plain form
15327 110814 166992 216269 248991 72269 -214045 -20351 225901 -46089 -36174 24846 -193792
15315 50937 17208 -40186 -77510 337621 171520 15017 21794 70336 -57871 -241164 116866
15303 -204655 -22070 -144081 153040 85537 102143 294251 -167685 -45067 157909 102479
15293 102479 378071 -150209 6732 69817 -43817 84027 27220 -58009 -218907 139560 -36979
15281 -7190 -97878 297404 227194 100762 270847 -90873 103033 -6698 -123683 -56961 -238003
15270 -238003 -189510 118561 -14965 44380 161840 -19851 90973 -137858 219443 74674 207829
15259 207829 53948 368458 94266 81707 9985 129002 277125 314838 40967 698478 1246691
15248 1246691 1176837 1347997 1183764 249200 225422 98460 55028 -124541 112034 -243774
$$ packed form
15327A10814N6178M9277L2722G2269b14045b0351B25901d6089R915B4846a93792
15315E0937A7208d0186l7324C37621j66101A5017O777M8542e7871j83293A16866
15303b04655b2070j22011A53040o7503J6606J92108a67685d5067A57909n5430
15293A02479K75592a50209F732O3085d3817H4027B7220e8009j60898A39560c6979
15281g190r0688B97404p0210A00762J70085i0873A03033f698j16985e6961j81042
15270b38003M8493A18561a4965D4380J17460a9851I0973a37858B19443G4674J33155
15259B07829E3948L14510I4266j2559I985J19017J48123L7713D0967O57511N48213
15248A246691o9854J71160j64233B49200k3778I8460m3432a24541A12034b43774
$$ plain form
15237 128054 205304 -104927 -40427 79862 126646 113743 224997 -276936 -38498 -136899 154094
15225 63499 99473 -21950 -409 151354 115340 121663 75940 5710 -70020 24119 -308174 289557
15212 -192480 -77096 33483 82700 -251174 220534 84312 -50228 43594 353404 106493 45795
15200 203347 46288 110124 422118 21450 10775 97831 273819 -2065 47259 329139 327112
15189 327112 -85182 374258 249205 -5480 330413 123248 154957 71691 -223395 -285384 114316
15177 -293484 31541 43935 101525 43411 111688 310772 -415027 -285761 216538 233488 306625
15166 306625 228666 -20345 265462 96799 186259 199895 89207 45760 -67915 136900 154075
15155 154075 258002 -23898 165515 222565 30792 608981 82028 270271 -116707 -19630
$$ packed form
15237A28054P7250a04927d0427G9862M6784j2903J11254b76936c8498r8401A54094
15225F3499L5974b1950d09A51354l6014O323m5723E710g0020B4119c08174B89557
15212a92480g7096C3483M9217b51174B20534H4312e0228D3594L09810A06493D5795
15200B03347D6288O3836L11994B1450j0675Q7056J75988b065D7259K81880k027
15189C27112h5182C74258j25053e480C30413A23248L1709G1691b23395o1989A14316
15177b93484C1541J2394N7590D3411O8277J99084d15027J29266B16538J6950P3137
15166C06625p7959b0345B65462I6799Q9460J3636H9207m3447f7915A36900J7175
15155A54075J03927b3898A65515N7050C0792N78189H2028J88243a16707a9630
$$ plain form
15144 51067 144385 2697 -59902 -40889 33908 63883 404644 115974 180684 381263 90340
15132 75531 291480 11721 7697 254096 139129 220449 -37070 163633 176393 -28461 -68700
15121 -68700 112272 48305 191412 -419229 63992 82894 -238040 -113351 436143 300820
15111 300820 130733 -27491 -22344 56656 303942 48960 388848 25088 114119 -127600 117268
15099 300276 -326933 50392 -44498 -101486 27947 208779 -112394 -159461 -90618 -45674 142446
15087 33606 22100 -300047 66765 372312 -126551 -10313 17978 -259352 -193228 -92172 111126
15075 413654 436814 35537 292670 317789 -66778 18154 416907 98486 345834 158880 -11571
15063 285815 315680 177009 342677 341663 203059 -133654 -3154 154088 -256478 453504
$$ packed form
15144E1067R3318B697e9902J9013C3908K9975L40761A15974O4710K00579I0340
15132G5531K15949A1721m024K46399j14967Q1320c7070A63633J2760b8461m0239
15121f8700A12272D8305J43107d19229F3992J8902b38040a13351D36143j35323
15111C00820A30733b7491N147E6656K47286D8960L39888B5088Q9031a27600A17268
15099C00276c26933E0392d4498n6988B7947J80832a12394m7067O8843M4944A42446
15087C3606j1506c00047F6765L05547a26551a0313A7978b59352O6124i2172A11126
15075D13654K3160C5537K57133K5119f6778A8154L98753I8486K47348A58880a1571
15063B85815K9865j38671J65668j014j38604a33654c154A54088b56478D53504
$$ plain form
15052 -102787 135910 362484 270397 119373 207855 168512 126653 155358 109617 488598 -103011
15040 35993 487135 146241 -76039 447876 342125 -154060 201864 206116 468504 247369
15030 247369 130170 28089 68344 276648 -1743 263320 30375 168484 330937 274146 -39849
15018 112313 44230 -22615 223071 274970 569800 12234 -173132 449993 335787 337631 195127
15007 195127 335968 193447 60753 210338 129652 337208 234647 175998 89612 35858
14996 67178 332412 97839 161296 170316 262090 338297 175661 51648 367439 356416 216265
14985 216265 76628 256543 41892 195836 233577 -36581 524717 127383 350973 384964
14975 384964 81738 -26768 165917 243759 240621 632630 152606 358261 40807 -6310 286902
$$ packed form
15052a02787A35910K26574r2087A19373Q8482l9343m1859K8705m5741L78981a03011
15040C5993M51142A46241g6039D47876j05751a54060B01864M252K62388k21135
15030B47369j17199B8089M0255K08304a743B63320C0375J38109J62453n6791c9849
15018A12313D4230b2615B23071N1899K94830A2234a73132D49993j14206J844j42504
15007A95127J40841j42521F0753J49585q0686K07556j02561n8649q6386C5858
14996F7178K65234I7839O3457R020R1774P6207j62636E1648L15791j1023j40151
14985B16265G6628J79915D1892J53944L7741c6581E24717A27383K23590L3991
14975C84964H1738b6768A65917P7842l138L92009A52606K05655D0807f310B86902
$$ plain form
14963 51537 380583 357889 249168 136957 642980 112686 65828 254889 449988 216726
14952 113337 283248 -57549 265242 139737 300696 160450 320732 291631 97643 45320
14941 211518 -6009 304889 104718 384777 446800 377275 -58972 22799 241333 218317 -69836
14929 304155 126612 229247 264793 534518 -66446 281608 237476 268174 157299 303456
14919 303456 352809 -201333 118637 52790 430409 349523 616211 30150 301023 208870
14909 208870 646214 181895 391038 453932 354804 338029 200668 -49344 144537 70792
14898 231896 28311 63687 294150 334813 327140 103695 319184 531285 161296 415638
14888 415638 346566 346316 126546 378068 428088 239020 213369 380502 189549 354174 382699
$$ packed form
14963E1537L29046k2694j08721j12211N06023A12686m6858J89061J95099B16726
14952A13337J69911e7549B65242j25505J60959j40246J60282k9101I7643D5320
14941B11518f009C04889A04718K80059O2023o9525e8972B2799K18534k3016f9836
14929C04155A26612J02635L5546K69725f6446B81608m4132L0698j10875J46157
14919C03456M9353b01333A18637E2790L77619q0886K66688C0150K70873r2153
14909B08870M37344A81895K09143O2894r9128j6775j37361d9344A44537G0792
14898B31896B8311L5376K30463M0663p673A03695K15489K12101A61296K54342
14888D15638o9072k50A26546K51522N0020j89068k5651J67133A89549J64625K8525
$$ plain form
14877 382699 325487 247777 683724 419283 188105 57530 307188 425665 148431 190696
14867 190696 431477 161493 410837 328368 311478 473624 311463 375247 399666 467749
14857 467749 469114 349922 454549 441119 581939 51534 179012 687898 744382 146159
14846 371828 205313 380659 319996 280278 391494 258122 657144 243212 282793 530648
14836 530648 294237 287788 492578 53470 155254 469204 344550 442979 295388 321254
14826 321254 357099 355685 440442 430716 710263 241940 665019 212826 287663 312364 412282
14815 412282 268188 383001 392564 161797 724749 288568 114214 665352 120240 524057
14805 524057 399129 757746 763398 394049 563531 9597 576276 397328 376555 333073 962809
$$ packed form
14877C82699n7212p7710M35947k64441A88105E7530K49658J18477A48431M2265
14867A90696K40781A61493K49344q2469j6890J62146j62161O3784K4419O8083
14857D67749J365j19192J04627j3430J40820E1534J27478N08886N6484A46159
14846C71828j66515J75346o0663l9718J11216j33372L99022B43212L9581K47855
14836E30648k36411o449K04790E3470J01784L13950j24654R8429j47591K5866
14826C21254L5845j414Q4757r726K79547B41940M23079B12826P4837K4701R9918
14815D12282j44094J14813R563A61797N62952B88568A14214N51138A20240M03817
14805E24057j24928L58617N652l69349J69482I597N66679j78948k0773m3482O29736
$$ plain form
14794 962809 298331 678438 362153 482298 601306 350418 252265 438992 796620 621147
14784 621147 469890 362247 204740 637727 600829 476168 348183 435927 626677 631532
14774 631532 325074 651456 652951 680193 707272 282336 588713 582126 489447 475944 596520
14763 596520 782027 573503 386001 811079 569629 1058041 575936 296039 356425 474952
14753 474952 571219 650517 647978 666952 954222 723881 683702 630769 733073 714580 673498
14742 673498 599766 606786 464029 644469 449711 537815 648809 837740 957594 558095
14732 558095 807076 767602 885979 799659 693900 919990 729516 563240 384410 888236
14722 888236 808035 591175 539486 845399 617278 783420 760149 1204444 837510 828679
$$ packed form
14794I62809B98331L80107l16285J20145J19008k50888r8153J86727L57628j75473
14784F21147j51257j07643j57507M32987l6898j24661j27985Q7744J90750M855
14774F31532l06458L26382J495K7242K7079B82336L06377o587r2679j3503J20576
14763E96520J85507k08524j87502M25078k41450M88412m82105k79897O0386J18527
14753D74952R6267P9298k539J8974K87270k30341m0179n2933J02304j8493m1082
14742F73498p3732P020j42757J80440j94758Q8104J10994J88931J19854l99499
14732E58095K48981l9474J18377q6320j05759K26090j90474j66276j78830N03826
14722H88236q0201k16860n1689L05913k28121J66142k3271M44295l66934q831
$$ plain form
14712 828679 929957 759896 914661 741675 894021 730544 375684 846522 722242 1076042
14702 1076042 789983 557981 623980 1216483 904869 646513 929083 665700 894649 929314
14692 929314 782770 727503 881865 893055 902699 549692 978293 992567 767519 651142
14682 651142 731361 866587 995339 821847 828532 861017 852696 1032364 989655 1264177 963162
14671 963162 974077 878930 1052768 757628 789151 932771 983050 962932 1027748 918702 845057
14660 845057 1446159 1111427 1065008 872644 743081 726173 999117 869515 954571 1122504
14650 1122504 1183241 1200476 1320493 1163522 1040441 1304366 941238 951130 1286205 1150888
14640 1150888 1111248 1324387 977475 1380670 1282813 1194605 1574671 1526065 1364892 1318031
$$ packed form
14712H28679J01278j70061J54765j72986J52346j63477l54860M70838j24280L53800
14702A076042k86059k32002O5999N92503l11614k58356K82570k63383K28949L4665
14692I29314j46544n5267J54362J1190R644l53007M28601J4274k25048j16377
14682F51142Q0219J35226J28752j73492O685L2485q321J79668m2709K74522l01015
14671I63162J0915r5147J73838k95140L1523J43620N0279k0118O4816j09046p3645
14660H45057O01102l34732m6419j92364j29563j6908K72944j29602Q5056J67933
14650A122504O0737J7235J20017j56971j23081K63925l63128R892L35075j35317
14640A150888l9640K13139l46912M03195r7857q8208L80066m8606j61173m6861
$$ plain form
14630 1318031 981486 1303971 1248373 1413564 1443975 1092994 1377298 1317658 1442536 1283090
14620 1283090 1269781 1349504 1429313 1423249 1221243 1521262 1134476 1492433 1189438 1684561
14610 1684561 1440832 1579192 1570050 1430527 1512111 1219729 1775785 1338161 1394681 1844907
14600 1844907 1350560 1237062 1538545 1731004 1299464 1291287 1698753 1361618 1983004 1740515
14590 1740515 1641920 1773715 1723749 1559341 1893756 1643155 1973666 1831078 2064174 1680140
14580 1680140 1700016 1851136 1682686 1681967 2137542 2028487 1950728 2254841 2067836 2138217
14570 2138217 2024409 2226330 2164149 1919053 2148685 2218560 2268978 2249903 2241600 2375739
14560 2375739 2784569 2576436 2426698 2708352 3099000 3131406 3181858 3444506 3978414 4550057
$$ packed form
14630A318031l36545L22485n5598J65191L0411l50981K84304n9640J24878j59446
14620A283090j3309P9723P9809o064k02006L00019l86786L57957l02995M95123
14610A684561k43729J38360r142j39523Q1584k92382N56056m37624N6520M50226
14600A844907m94347j13498L01483J92459m31540q177M07466l37135O21386k42489
14590A740515r8595J31795m9966j64408L34415k50601L30511j42588K33096l84034
14580A680140J9876J51120j68450p19M55575j09055p7759L04113j87005P0381
14570B138217j13808K01921o2181k45096K29632O9875N0418j9075q303J34139
14560B375739M08830k08133j49738K81654L90648L2406N0452K62648N33908N71643
$$ plain form
14550 4550057 5720410 7645159 12177025 22553630 38868121 44841999 20294988 7681595
14541 3907204 2906861 2375137 2241194 1761842 1530097 2211932 1766717 1631035 1997737
14532 1997737 1765668 2167579 1781377 2140624 2080166 2489876 2365892 2131441 2565445 1878957
14522 1878957 2147382 2269240 2517751 2675496 2309415 2584670 2313805 2337593 2835377 2684211
14512 2684211 2546670 2618916 2568475 2850042 3033227 2517857 2786633 2756409 2669461 3179710
14502 3179710 2639725 3221700 3036578 2851666 2790997 2806298 3162741 3060495 3203327 3235266
14492 3235266 3259107 3308062 2822014 3329271 3091420 3606514 3666244 3370966 3254235 3347423
14482 3347423 3689590 3611682 3672522 3708361 3802611 3909432 3905787 3973780 3612548 3926975 4055310
$$ packed form
14550D550057J170353J924749M531866J0376605J6314491N973878B0294988G681595
14541C907204j000343n31724j33943m79352k31745O81835m45215j35682L66702
14532A997737k32069M01911l86202L59247o0458M09710j23984k34451M34004o86488
14522A878957K68425J21858K48511J57745l66081K75255k70865K3788M97784j51166
14512B684211j37541P2246n0441K81567J83185n15370K68776l0224q6948N10249
14502C179710n39985N81975j85122j84912o0669J5301L56443j02246J42832L1939
14492C235266K3841M8955m86048N07257k37851N15094N9730k95278j16731R3188
14482C347423L42167p7908O0840L5839R4250J06821l645O7993l61232L14427J28335
$$ plain form
14471 4055310 3944250 4207911 4203827 4196909 3932135 3943119 4040514 4651061 4402276 4312046 4522066
14460 4522066 4538524 4408189 4537329 4678479 4942397 4837335 4642094 5031906 4852333 5057713
14450 5057713 5327884 5223686 5268933 5353150 5447325 5321298 5430643 5573719 5553070 5268963
14440 5268963 5980222 5911015 5980380 6135537 5927334 6073116 5755842 6339540 6439087 6586331
14430 6586331 6681156 6734492 6697931 6904238 7210832 6809485 7336734 7142913 7471445 7378509
14420 7378509 7483905 7751500 7966322 7766707 8017443 7998492 7937611 8283730 8388476 8426038
14410 8426038 8591509 8998557 8891824 8624164 9039117 9603577 9477958 9568640 9880799 9693539
14400 9693539 9934247 10311716 10367122 10294500 10372005 10766351 11127271 11275495 11189721 11565686
$$ packed form
14471D055310j11060K63661m084o918k64774J0984R7395O10547k48785r0230K10020
14460D522066J6458j30335J29140J41150K63918j05062j95241L89812j79573K05380
14450E057713K70171j04198M5247Q4217R4175j26027J09345J43076k0649k84107
14440E268963P11259o9207O9365J55157k08203J45782l17274N83698R9547J47244
14430F586331R4825N3336l6561K06307L06594m01347N27249j93821L28532r2936
14420G378509J05396K67595K14822j99615K50736j8951o0881L46119J04746L7562
14410H426038J65471M07048j06733k67660M14953N64460j25619R0682L12159j87260
14400I693539K40708L77469N5406p2622P7505L94346L60920J48224q5774L75965
$$ plain form
14390 11565686 11957497 12197702 12168873 12640497 12767574 12639699 13122848 13339229 13453576
14381 13453576 14105025 14338184 14359626 14794678 14792999 15558525 15364436 15974884 15980478 16466646
14371 16466646 16466632 16855763 17357284 17829439 18200620 18607596 18878301 19128223 19740953 19943669
14361 19943669 20444236 21172944 21667651 22191626 22587757 22861926 23387642 24061567 24605452
14352 24605452 25248257 25859571 26531829 27280049 27830058 28474159 29194853 30074328 30469486
14343 30469486 31572129 32761434 33354063 34272002 34806793 35970475 37298387 38124574 39331198
14334 39331198 40259006 41802108 42940166 44065075 45577315 47094111 48715036 50134716
14326 50134716 51831058 53742702 54848948 57268323 59334557 61209065 63680602 65829972
$$ packed form
14390A1565686L91811K40205k8829M71624J27077j27875M83149K16381J14347
14381A3453576O51449K33159K1442M35052j679P65526j94089O10448N594M86168
14371A6466646j4L89131N01521M72155L71181M06976K70705K49922O12730K02716
14361A9943669N00567P28708M94707N23975L96131K74169N25716O73925N43885
14352B4605452O42805O11314O72258P48220N50009O44101P20694Q79475L95158
14343C0469486J102643J189305N92629R17939N34791J163682J327912Q26187J206624
14334C9331198R27808J543102J138058J124909J512240J516796J620925J419680
14326E0134716J696342J911644J106246K419375K066234J874508K471537K149370
$$ plain form
14318 65829972 68253598 70713786 73624728 76249028 79215395 82215696 85795052 89624297
14310 89624297 93007337 97208678 101210854 105371854 110556654 115119680 120539712 126125416
14302 126125416 132147429 138417863 145077380 152176707 160074724 167988007 176218883 185394946
14294 185394946 195058511 205119114 215470621 227145905 238784123 251244263 263917398
14287 263917398 277717775 292002900 306445125 321288068 336689851 351972182 367181903
14280 367181903 382424052 397215078 410690387 423624116 435568670 445326562 453342457
14273 453342457 457265170 456803117 454204599 452953963 450340735 448204058 443475398 436204663
14265 436204663 425831140 413719724 400654687 386313896 371549757 356086954 340372052
$$ packed form
14318F5829972K423626K460188K910942K624300K966367L000301L579356L829245
14310H9624297L383040M201341M002176M161000N184800M563026N420032N585704
14302A26125416O022013O270434O659517P099327P898017P913283Q230876R176063
14294A85394946R663565J0060603J0351507J1675284J1638218J2460140J2673135
14287B63917398J3800377J4285125J4442225J4842943J5401783J5282331J5209721
14280C67181903J5242149J4791026J3475309J2933729J1944554R757892Q015895
14273D53342457L922713m62053k598518j250636k613228k136677m728660p270735
14265D36204663j0373523j2111416j3065037j4340791j4764139j5462803j5714902
$$ plain form
14258 340372052 324323430 308672843 294011051 279881569 265475808 252087916 239341581
14251 239341581 226896155 215461494 204805033 194281187 184561616 175298741 166760034
14244 166760034 159073689 151477584 143942753 137351284 131046971 125053264 119481886 114410335
14236 114410335 109354755 104672786 100316236 95911762 92118577 89034842 85289007 81801145
14228 81801145 78785787 75236749 72569218 69824146 67410699 64894697 63037871 60678416
14220 60678416 58406115 56538785 54633330 52819087 50839320 49734726 48169080 46936552
14212 46936552 45672915 43858823 41943464 41122391 40370501 39531911 38388129 37068326
14204 37068326 35812716 34841130 34347624 33413978 32632681 31828739 30740494 29745531 29047344
$$ packed form
14258C40372052j6048622j5650587j4661792j4129482j4405761j3387892j2746335
14251B39341581j2445426j1434661j0656461j0523846r719571r262875q538707
14244A66760034p686345p596105p534831o591469o304313n993707n571378n071551
14236A14410335n055580m681969m356550m404474l793185l083735l745835l487862
14228H1801145l015358l549038k667531k745072k413447k516002j856826k359455
14220F0678416k272301j867330j905455j814243j979767j104594j565646j232528
14212D6936552j263637j814092j915359q21073p51890q38590j143782j319803
14204C7068326j255610r71586m93506r33646p81297q03942j088245r94963o98187
$$ plain form
14195 29047344 28751723 27907094 27355552 26518143 25749662 24946934 24611242 23811221 23208776
14186 23208776 22797596 22223383 21755014 21369818 20833562 20242278 20289588 19447910 19105284
14177 19105284 19012961 18444380 18144048 17627398 17295828 17041454 16769318 16409130 15976387
14168 15976387 15943713 15486450 15008528 14746698 14377753 14259353 14141598 13614165 13427552
14159 13427552 13323502 13052235 12876987 12612258 12493741 12203968 12132266 12072894 11559315 11429700
14149 11429700 11401340 10917495 10879104 10681005 10398412 10523949 10369573 10184896 9960751 9804730
14139 9804730 9530091 9438433 9510236 9442644 8986443 8837116 8723709 8902815 8434962 8642202
14129 8642202 8584875 8301586 8140199 7971415 8096780 7745154 7889506 7579393 7237348 7322545
$$ packed form
14195B9047344k95621q44629n51542q37409p68481q02728l35692q00021o02445
14186B3208776m11180n74213m68369l85196n36256n91284M7310q41678l42626
14177A9105284r2323n68581l00332n16650l31570k54374k72136l60188m32743
14168A5976387l2674m57263m77922k61830l68945j18400j17755n27433j86613
14159A3427552j04050k71267j75248k64729j18517k89773p1702n9372n13579j29615
14149A1429700k8360m83845l8391j98099k82593J25537j54376j84677k24145j56021
14139I804730k74639r1658P1803o7592m56201j49327j13407J79106m67853K07240
14129H642202n7327k83289j61387j68784J25365l51626J44352l10113l42045Q5197
$$ plain form
14119 7322545 7538420 7276355 7082259 6854522 6993963 6606723 7044076 6687691 6449000
14110 6449000 6811980 6266055 6308384 6179335 6221920 6309177 6139445 6080223 5791709 5760508
14100 5760508 5845731 5646572 5616319 5494366 5545630 5581208 5310612 5348825 5271078 5304285 4883943
14089 4883943 5234788 5216713 4918300 4833218 4942560 4580377 4749062 4535743 4735451 4424534
14079 4424534 4638056 4677157 4546718 4655612 4271554 4495148 4221100 4429270 4235779 3919572
14069 3919572 4489223 3942668 3854511 3809989 3829658 3989894 3947205 3736127 3825203 3749981
14059 3749981 3957785 3996643 3914707 4205170 3596983 3727053 3533236 3502655 3274769 3372549
14049 3372549 3364317 3069241 3369211 3326368 3009585 3067310 3265884 3176626 3208785 2956540
$$ packed form
14119G322545K15875k62065j94096k27737J39441l87240M37353l56385k38691
14110F449000L62980n45925M2329j29049M2585Q7257j69732n9222k88514l1201
14100E760508Q5223j99159l0253j21953N1264L5578k70596L8213p7747L3207m20342
14089D883943L50845j8075k98413q5082J09342l62183J68685k13319J99708l10917
14079D424534K13522L9101j30439J08894l84058K23594k74048K08170j93491l16207
14069C919572N69651n46555q8157m4522J9669J60236m2689k11078Q9076p5222
14059C749981K07804L8858q1936K90463o08187J30070j93817l0581k27886R7780
14049C372549q232k95076K99970m2843l16783N7725J98574q9258L2159k52245
$$ plain form
14039 2956540 3042414 2881662 2851492 3008972 2913027 2830471 2887420 2869751 3012717 2672729
14029 2672729 2724974 2769801 2931637 2464163 2547174 2421832 2631234 2528200 2454663 2356158
14019 2356158 2235476 2578635 2386059 2144358 2685022 2366538 1958499 2432333 2186316
14010 2186316 2540586 2384402 1994169 1704393 2010470 2069781 1948959 2282610 2213154 2476073
14000 2476073 1857858 2066302 1922683 1630179 2187433 2041742 2219059 1881406 1989951
13991 1989951 2084978 2254021 3195380 6742533 14932573 31091326 44364189 26062125
13983 26062125 12660808 7559632 5566926 4327859 3985683 3278636 3195682 3106288 2833328
13974 2833328 2707953 2657551 2354965 2663938 2300566 2266201 2108701 1880412 2430692 2136018
$$ packed form
14039B956540Q5874j60752l0170J57480r5945q2556N6949j7669J42966l39988
14029B672729N2245M4827J61836m67474Q3011j25342K09402j03034p3537r8505
14019B356158j20682L43159j92576k41701N40664l18484m08039M73834k46017
14010B186316L54270j56184l90233k89776L06077N9311j20822L33651o9456K62919
14000B476073o18215K08444j43619k92504N57254j45691J77317l37653J08545
13991A989951R5027J69043R41359L547153Q190040J6158753J3272863j8302064
13983B6062125A2660808n101176j992706j239067l42176p07047q2954q9394k72960
13974B833328j25375n0402l02586L08973l63372l4365j57500k28289N50280k94674
$$ plain form
13964 2136018 2022430 2150408 2160497 2069467 2107837 1965341 1892744 2041166 1959080 2210121
13954 2210121 1914101 1935751 1852667 1706715 1976715 1494852 2081955 1757357 1962319 2023306
13944 2023306 1789683 1431455 1954870 1837861 1873572 1779103 1565097 1821452 1829578 1416086
13934 1416086 1807398 1764706 1553142 1682950 1783765 1621597 1621560 1435008 1451267 1277849
13924 1277849 1568829 1564260 1375265 1574556 1133723 1482628 1269569 1498892 1184032 1486601
13914 1486601 1494391 1617519 1154160 1253546 782062 1308386 1363557 1299705 1265281 1323432 1573785
13903 1573785 1303263 1347769 1364540 935136 1334806 1261665 1262816 1378813 1373934 949861 1160527
13892 1160527 1017638 1008402 1241589 1613591 1149332 1044664 1537428 1220521 925062 1313674
$$ packed form
13964B136018j13588J27978J0089r1030L8370j42496p2597J48422q2086K51041
13954B210121k96020K1650q3084j45952K70000m81863N87103l24598K04962O0987
13944B023306k33623l58228N23415j17009L5711r4469k14006K56355Q126m13492
13934A416086L91312m2692k11564J29808J00815j62168l7j86552J6259j73418
13924A277849K90980m569j88995J99291m40833L48905k13059K29323l14860L02569
13914A486601P790J23128m63359R9386m71484N26324N5171o3852l4424N8151K50353
13903A573785k70522M4506J6771m29404L99670p3141J151J15997m879m24073K10666
13892A160527j42889r236K33187L72002m64259j04668M92764l16907k95459L88612
$$ plain form
13882 1313674 1003514 1278342 1186014 1018368 1073519 1441381 1183764 1163409 896055 1267580
13872 1267580 981550 1341907 1387830 1585219 973690 859962 1225521 1118426 886396 1236466
13862 1236466 1123354 1158893 891754 810280 867837 498266 1060791 1203654 953562 838676
13852 838676 1128746 980785 824760 956338 965725 1173714 1009007 849890 920264 1125033
13842 1125033 907779 1175857 883679 707192 941268 722472 1081268 1157550 1214982 564576
13831 786034 1110560 1333665 1111312 934318 971536 1020546 1091058 851458 960959 645848
13821 645848 615460 791049 1021656 609342 844996 1049474 893231 812582 595179 1131965
13811 1131965 718161 534320 840039 879435 883974 870506 1090458 857828 665887 702776
$$ packed form
13882A313674l10160K74828r2328j67646N5151L67862k57617k0355k67354L71525
13872A267580k86030L60357M5923J97389o11529j13728L65559j07095k32030L50070
13862A236466j13112L5539k67139q1474N7557l69571N62525J42863k50092j14886
13852H38676K90070j47961j56025J31578R387K07989j64707j59117P0374K04769
13842A125033k17254K68078k92178j76487K34076k18796L58796P6282N7432E64576
13831G86034L24526K23105k22353j76994L7218M9010P0512k39600J09501l15111
13821F45848l0388J75589K30607m12314K35654K04478j56243q0649k17403N36786
13811A131965m13804j83841L05719L9396M539j3468K19952k32630j91941L6889
$$ plain form
13801 702776 923805 515078 786648 669911 855692 996327 1009466 636974 731278 699936
13791 699936 843200 764463 834984 521716 573788 801000 613486 618800 550065 447607 761728
13780 761728 671702 777670 907160 424625 677115 623504 912714 592778 714820 618391
13770 618391 636557 956766 647010 423047 661015 639978 550462 403700 603470 199202
13759 818598 378520 649107 827233 903327 655290 499806 784144 782003 511804 244751
13748 545251 816575 581298 397021 453946 625637 505935 677609 623163 697797 495818
13738 495818 568638 657806 538518 562590 882452 278921 338618 330003 633950 473197 619707
13727 619707 632702 547305 603841 447415 789002 452888 576637 427098 531262 494109
$$ packed form
13801G02776K21029m08727K71570j16737J85781J40635J3139l72492R4304l1342
13791F99936J43264p8737P0521l13268N2072K27212j87514N314o8735j02458L14121
13780G61728r0026J05968J29490D24625K52490n3611K89210l19936J22042r6429
13770F18391J8166L20209l09756k23963K37968k1037q9516j46762J99770A99202
13759H18598C78520K70587J78126P6094k48037j55484K84338k141k70199B44751
13748E45251K71324k35277j84277N6925J71691j19702J71674n4446P4634k01979
13738D95818P2820Q9168j19288K4072L19862B78921N9697q615L03947j60753J46510
13727F19707J2995q5397N6536j56426L41587l36114J23749j49539J04164l7153
$$ plain form
13717 494109 134893 517987 473918 560321 418124 195792 551418 312289 669195 767510
13707 767510 474383 486852 535372 427435 443117 220548 577827 697963 251533 747394
13697 747394 434414 630928 497141 246726 428462 479369 523502 318749 387905 464528
13687 464528 331515 473403 241897 753366 29337 398210 675799 680459 560174 545784
13677 545784 447878 247887 416391 466809 264977 576866 391217 509810 512077 463832
13667 463832 385502 455048 258210 750000 399622 171944 586833 383642 559507 213076
13656 219091 460255 761418 174586 784722 194988 463244 259870 173512 742003 571436
13646 571436 188950 277083 236210 381989 235654 436538 470302 206943 442787 227894
$$ packed form
13717D94109A34893L83094m4069Q6403j42197A95792L55626k39129L56906R8315
13707G67510k93127J2469M8520j07937J5682B20548L57279J20136B51533M95861
13697G47394l12980J96514j33787B46726J81736N0907M4133k04753O9156P6623
13687D64528j33013J41888k31506N11469B9337L68873K77589M660j20285j4390
13677E45784r7906j99991J68504N0418k01832L11889j85649J18593K267m8245
13667D63832p8330O9546j96838M91790l50378A71944M14889k03191J75865B13076
13656B19091K41164L01163A74586O10136A94988K68256k03374q6358N68491j70567
13646E71436A88950Q8133m0873J45779j46335K00884L3764B06943K35844k14893
$$ plain form
13636 227894 523319 423609 138918 465173 204117 733987 531073 196690 437172 187332
13625 447075 518187 386512 270730 243019 286326 263396 260894 235544 532266 444825 436835
13614 436835 533936 307570 718830 342003 250210 623923 219408 342822 404828 415455
13604 415455 453961 312128 348467 340528 454972 579905 344629 292718 174266 440960
13594 440960 356209 522297 171832 214726 545167 408990 111516 411274 209925 461717
13584 461717 358387 93011 542213 289751 197057 432841 166361 225947 156487 294529
13574 294529 401490 579558 188881 208614 358050 237916 256964 353066 306219 540914
13564 540914 61840 395687 327913 415326 171903 256651 533770 377126 368224 790538 405655
$$ packed form
13636B27894K95425r9710A38918L26255B04117N29870k02914A96690K40482A87332
13625D47075P1112j31675j15782k7711M3307k2930k502k5350K96722q7441p990
13614D36835R7101k26366M11260C42003r1793L73713B19408J23414O2006J0627
13604D15455L8506j41833L6339p939J14444J24933k35276n1911j18452K66694
13594D40960q4751J66088A71832M2894L30441j36177A11516K99758k01349K51792
13584D61717j03330I3011M49202k52462r2694K35784A66361N9586o9460J38042
13574B94529J06961J78068A88881J9733J49436j20134J9048R6102m6847K34695
13564E40914F1840L33847o7774Q7413A71903Q4748K77119j56644q902M22314l84883
$$ plain form
13553 405655 316598 160051 315416 16086 376590 152480 397795 451815 182450 320973
13543 320973 168704 595804 268382 448783 435763 -15805 163228 258409 236527 162461
13533 162461 373806 298089 348556 22835 331558 401985 306617 -11156 325545 50758 214670
13522 214670 292617 412330 372636 79752 1316 233122 338799 328247 123490 180597 299112
13511 299112 234913 188424 382453 128023 312995 207273 122902 325623 16083 439016
13501 439016 356613 322476 126220 381118 308300 525446 137281 461146 346473 253754
13491 253754 267970 178917 305876 28907 168801 281245 386247 231290 -56417 95868
13480 242926 114340 366729 235627 132799 -30655 321785 256604 210562 86363 230183
$$ packed form
13553D05655q9057j56547J55365A6086L60504A52480K45315N4020A82450J38523
13543C20973j52269M27100B68382J80401j3020a5805A63228R5181k1882p4066
13533A62461K11345p5717N0467B2835L08723P0427r5368a1156C25545E0758J63912
13522B14670P7947J19713l9694G9752A316K31806J05677j0552A23490N7107J18515
13511B99112o4199m6489J94029A28023J84972j05722q4371K02721A6083M22933
13501D39016q2403l4137A26220K54898p2818K17146A37281L23865j14673r2719
13491B53754J4216q9053J26959B8907J39894J12444J05002j54957e6417I5868
13480B42926A14340K52389j31102j02828c0655C21785o5181m6042H6363J43820
$$ plain form
13470 230183 -14459 169635 298274 58504 232535 285322 231872 266842 153834 206011 199282
13459 199282 289965 350714 86427 378126 272353 231467 138717 369111 269534 376945 539888
13448 539888 480376 192570 359486 81606 277629 32095 109435 89101 -211708 315410
13437 27442 220067 155583 480004 394383 430765 -65748 209399 322248 337615 22078 204640
13426 204640 416418 430472 154697 450891 156119 70935 174827 95556 -289360 190143
13415 337251 -27918 432661 216038 70691 -14348 -117639 -108784 147991 8827 340714 355633
13404 355633 316917 53254 214313 99418 369842 -21304 48242 -264036 413500 250471
13394 250471 322952 338322 459361 283425 -20052 38907 275731 650149 253947 204 85558
$$ packed form
13470B30183a4459A69635J28639E8504J74031N2787n3450L4970j13008N2177o729
13459A99282R0683O0749H6427K91699j05773m0886r2750K30394r9577J07411J62943
13448E39888n9512A92570J66916H1606J96023C2095P7340k0334b11708C15410
13437B7442J92625o4484L24421q5621L6382f5748B09399J12849J5367B2078J82562
13426B04640K11778J4054A54697K96194A56119G0935J03892p9271b89360A90143
13415C37251b7918D32661B16038G0691a4348j03291Q855A47991H827L31887J4919
13404C55633l8716E3254J61059I9418K70424b1304D8242b64036D13500j63029
13394B50471P2481J5370J21039j75936b0052C8907K36824L74418B53947B04Q5354
$$ plain form
13383 85558 215922 190416 8816 178675 248140 403684 245155 416385 199025 31968 131216
13372 131216 145295 46231 46692 -102215 340983 484651 -188173 351016 277454 263654 -59396
13360 315741 535967 524338 144533 387951 514838 212959 -31113 491761 78831 -89328
13349 189436 464766 57639 188311 316149 188763 217365 402907 148862 170006 91635
13339 91635 452667 212543 -125475 50427 16039 296753 326625 -38271 -231691 242475
13328 105209 -44749 212230 203629 -120313 70151 283039 213736 205627 -77022 257303 93911
13316 177962 -169732 -10307 456477 144106 172880 292698 159663 13274 -48575 -32721
13306 -32721 146785 -26801 9700 -16965 319612 397525 182156 397254 53660 131407 57974
$$ packed form
13383H5558J30364k5506H816J69859O9465J55544j58529J71230A99025C1968R9248
13372A31216J4079D6231M61a02215C40983J43668a88173C51016p3562j3800e9396
13360C15741K20226j1629A44533K43418J26887B12959c1113D91761G8831h9328
13349A89436K75330E7639J30672J27838j27386K8602J85542A48862K1144p8371
13339I1635L61032B12543a25475E0427A6039K80714K9872c8271j93420B42475
13328A05209d4749B12230q601a20313G0151K12888o9303q109g7022B57303I3911
13316A77962a69732a0307D56477A44106K8774J19818j33035A3274d8575J5854
13306c2721A46785b6801I700a6965C19612P7913A82156K15098E3660P7747E7974
$$ plain form
13294 33095 -88795 321793 110715 81226 150778 381571 181557 5426 18075 384532 50612
13282 47441 128850 112661 426255 -161215 349202 287916 -62756 208829 307152 73961 -52237
13270 -97377 -30178 431149 35935 -20202 271076 -81326 114042 -105363 262859 189907 -91941
13258 89701 109313 55750 375354 206582 145126 156882 234264 17236 19026 90689 14113
13246 -45704 180660 157133 -166871 368747 873 238129 174347 -174799 405942 46022 -36278
13234 -76758 212300 -146411 223336 -112829 204288 196444 204294 95196 303660 84369 379025
13223 379025 303074 72857 58455 139148 291401 -174340 -73275 -27623 280171 -191171 179840
13211 273604 132538 366897 -180190 45549 67066 270 -68941 2847 187515 -121033 9343
$$ packed form
13294C3095h8795C21793A10715k9489O9552K30793A81557E426J2649L66457E0612
13282D7441Q1409j6189L13594a61215C49202o1286f2756B08829R8323G3961e2237
13270i7377c0178D31149C5935b0202B71076h1326A14042a05363B62859p2952i1941
13258H9701J9612n3563L19604j68772o1456J1756P7382A7236J790P1663A4113
13246d5704A80660k3527a66871C68747H73K37256o3782a74799D05942D6022c6278
13234g6758B12300a46411B23336a12829B04288p844P850I5196K08464H4369K94656
13223C79025p5951G2857j4402Q0693J52253a74340g3275b7623B80171a91171A79840
13211B73604A32538K34359a80190D5549K1517B70f8941B847J84668a21033I343
$$ plain form
13199 285148 117924 299254 -139117 36473 61381 189962 -26129 330260 -18156 250412
13188 60127 71269 -189384 -118083 194121 20235 -5837 12419 132915 150990 -33150 68987
13176 -59875 -220374 39743 127339 98686 177797 158527 239978 41526 375932 -386082 -85333
13164 186217 -10522 40182 73708 50228 10901 251443 74491 -138892 93934 -152219 120733
13152 119329 23689 89398 129328 109736 459663 412370 469712 114905 46800 217486 8774
13140 32919 395670 324548 -13734 225180 221579 -344353 138968 16201 -21881 -6992 -137678
13129 -137678 -24181 140504 -79649 2994 182119 54323 -49567 194185 -405413 -14713 120354
13117 93964 -75898 -10468 218190 194220 95782 89802 -65151 24776 -4028 139314 -155834
$$ packed form
13199B85148A17924J81330a39117C6473K4908J28581b6129C30260a8156B50412
13188F0127J1142a89384P1301A94121B0235e837A2419J20496J8075c3150F8987
13176e9875j60499C9743Q7596k8653P9111j9270Q1451D1526L34406c86082h5333
13164A86217a0522D0182L3526k3480A0901K40542G4491a38892I3934a52219A20733
13152A19329B3689O5709L9930j9592L49927m7293N7342A14905D6800J70686H774
13140C2919L62751p1122a3734B25180l601c44353A38968A6201b1881f992j30686
13129a37678b4181A40504g9649B994J79125E4323d9567A94185d05413a4713A20354
13117I3964g5898a0468B18190k3970I5782n980f5151B4776d028A39314a55834
$$ plain form
13105 285170 -299626 -317353 113801 -180728 -83931 140366 192048 -22187 -439999 218620
13094 16863 146671 33914 -24353 208093 152590 -124656 230120 -89740 11169 24447 2421
13082 189946 352117 -76148 83175 194663 75502 -36861 10494 269876 290770 50064 -199538
13070 249274 230060 34489 300646 42751 -217207 -234558 52540 12479 31244 198467 121136
13059 121136 402582 251440 -61414 231920 118899 288099 22443 105656 61876 12322
13048 102499 389478 -142916 379280 104609 77027 -116840 -60186 205517 369852 98916
13037 343842 103041 -231076 100436 -43472 18102 73691 48063 -31557 -346865 293142
13026 566250 -96447 -69989 -175156 532527 -56847 154849 51034 293458 -98950 124041
$$ packed form
13105B85170b99626j7727A13801a80728h3931A40366N1682b2187m17812B18620
13094A6863J29808C3914b4353B08093n5503a24656B30120h9740A1169J3278B421
13082A89946J62171g6148H3175J11488G5502c6861A0494K59382K0894E0064a99538
13070B49274j9214C4489K66157D2751b17207j7351E2540A2479J8765J67223p7331
13059A21136K81446j51142f1414B31920j13021J69200B2443Q3213m3780A2322
13048A02499K86979a42916C79280A04609k7582a16840N6654B05517J64335I8916
13037C43842A03041b31076A00436d3472A8102N5589k5628c1557l15308B93142
13026E66250i6447K6458j05167E32527e6847A54849E1034K42424i8950A24041
$$ plain form
13015 77751 199198 205451 -78736 51416 311202 -146688 98828 65016 249339 -465034 -125015
13003 85999 427270 -8729 116465 105513 -58903 204815 40679 -38973 42637 200174 -213254
12991 353783 162092 -81982 512081 325782 237820 13524 49559 60675 -115481 -267220
12981 -267220 -19179 -17387 277252 296769 39731 289788 158404 366711 160099 4637 198502
12970 198502 263513 294579 139599 -215203 241631 100711 -66005 -100418 196134 -126642
12959 219253 -140682 67733 -53497 -560724 24983 -98237 -168353 126877 91708 230042 233011
12948 233011 194500 56745 371925 417755 13389 463360 -95413 194628 -23699 -95158 -41167
12936 26108 -153220 -525024 292 230207 72794 87473 130730 234518 120652 310 -38284
$$ packed form
13015G7751J21447O253g8736E1416K59786a46688I8828l3812J84323d65034a25015
13003H5999L41271h729A16465j0952e8903B04815D0679c8973D2637J57537b13254
12991C53783A62092h1982E12081j86299q7962A3524L6035J1116a15481j51739
12981b67220a9179J792B77252J9517C9731K50057j31384K08307A60099D637J93865
12970A98502O5011L1066A39599b15203B41631A00711f6005l4413A96134a26642
12959B19253a40682F7733e3497n07227B4983i8237p0116A26877l5169J38334K969
12948B33011l8511E6745L15180M5830A3389M49971i5413A94628b3699p1459d1167
12936B6108a53220l71804B92K29915G2794J4679M3257J03788j13866C10c8284
$$ plain form
12924 532840 143273 -98742 -148026 -110170 -379471 123764 44376 -208640 -79852 426036
12913 -27454 -124908 -6455 25175 44331 183006 -53822 -213901 -90172 46767 -2034 162932
12901 -145511 98810 -104373 -217780 207964 74294 111163 -58011 -168043 123750 -99836
12890 224945 265514 2821 231141 238090 27930 210843 -8713 -12724 -28190 -110773 212705 -80849
12877 -221574 195586 91123 35292 -324259 -463 -151755 294213 -5454 65532 169703 82358
12865 225492 124951 294087 71803 -186547 -60592 -45863 -70394 -23589 106345 -186102
12854 -2514 80143 134717 -133065 -144099 -97383 178483 65300 73072 117113 40037 112342 129267
12842 129267 275962 250421 1499 239579 150324 -191325 -106796 -108378 -155236 -88538 -124162
$$ packed form
12924E32840A43273i8742m9284L7856k69301A23764D4376b08640g9852D26036
12913b7454r7454f455B5175J9156J38675e3822j60079i0172D6767b034A62932
12901a45511I8810a04373j13407B07964G4294L6869e8011j10032A23750i9836
12890B24945M0569B821K28320O949B7930J82913h713m011j5466q2583B12705h0849
12877b21574A95586I1123C5292c24259d63j51292B94213e454F5532J04171H2358
12865B25492j00541J69136G1803a86547f0592J4729k4531b3589A06345a86102
12854b514H0143N4574a33065j1034M6716A78483F5300P772M4041D0037P2305J6925
12842A29267J46695k5541A499K38080q9255a91325Q4529j582m6858O6698l5624
$$ plain form
12831 -124162 11915 -55508 -101358 -73774 89252 140410 15467 50659 -99738 193038 -166346
12819 -157847 361976 68266 4323 -5832 -166967 622 -323203 64676 -131526 48435 176290
12808 176290 88767 -538473 -180334 -125237 170338 306010 -106714 67934 61425 -172836
12797 366885 68385 117181 -40843 232583 -25448 182775 251512 -58933 140517 -250430 45664
12785 1355 82761 -289429 22956 -51980 93464 -101962 -441539 302442 481358 -18950 43271
12773 40842 -252623 -51483 -247627 53711 -154917 19102 312912 -398598 -572 46995 -58273
12761 129423 -105615 -30699 -22331 198289 689 -394646 -15479 65445 319024 374336 -110432
12749 403997 -111082 -352763 -40844 -46239 97258 53964 -74792 140098 216248 4794 -233122
$$ packed form
12831a24162A1915e5508m5850K7584H9252N1158A5467L5192i9738A93038a66346
12819a57847C61976F8266D323e832j61135F22c23203F4676a31526D8435J27855
12808A76290q7523e38473a80334N5097A70338J35672a06714F7934o509a72836
12797C66885F8385M8796d0843B32583b5448A82775O8737e8933A40517b50430D5664
12785A355Q1406b89429B2956e1980I3464a01962l39577C02442J78916a8950D3271
12773D0842b52623e1483j96144E3711a54917A9102K93810c98598e72D6995e8273
12761A29423a05615c0699Q368A98289F89c94646a5479F5445K53579N5312a10432
12749D03997a11082k41681d0844n395I7258m3294g4792A40098P6150D794b33122
$$ plain form
12737 -52943 -986 54087 78073 246133 -116904 -98271 252509 304111 57863 -35266 240453
12725 -119371 -29441 94513 -139755 48601 -54362 209786 -60370 -55554 -255686 -56897 280247
12713 64858 288073 182929 143616 214417 216440 -20650 266525 74571 271205 -24860 163503
12701 -13002 -204804 5696 123320 10253 274979 151489 147846 163009 -63783 133725 -60166
12689 -124455 19898 199678 166605 206580 -49298 -222496 165809 -95313 61684 -250306 44857
12677 173679 -23638 -41857 -134532 84487 68077 27670 225605 12951 -160101 125072 -158414
12665 -77206 -180936 14622 17357 -27297 -156321 76727 -48231 246074 146884 301868 -27808
12653 359597 -19214 82479 -39662 298571 82360 217450 102680 -239673 56143 -11146 -308315
$$ packed form
12737e2943i86E4087K3986J68060a16904J8633B52509N1602E7863c5266B40453
12725a19371b9441I4513a39755D8601e4362B09786f0370M816k00132e6897B80247
12713F4858K23215j05144l9313P0801K023b0650B66525G4571J96634b4860A63503
12701a3002j91802E696J17624A0253K64726j23490l643J5163f3783A33725f0166
12689a24455A9898J79780l3073L9975d9298j73198A65809i5313F1684b50306D4857
12677A73679b3638j8219r2675H4487j6410B7670J97935A2951a60101A25072a58414
12665g7206j03730A4622K735b7297j29024G6727d8231B46074r9190J54984b7808
12653C59597a9214H2479c9662B98571H2360J35090A02680b39673E6143a1146k97169
$$ plain form
12642 -308315 59761 321030 199065 111312 40979 118156 104004 -97682 330734 122676 156577
12631 156577 290956 319732 -129114 127963 144285 215348 81981 345546 326408 122825
12620 -225409 -127509 -311414 -10496 263045 97835 -38777 98895 -233102 -17658 125277 397029
12609 397029 -19322 -192359 -87921 167951 490666 -137190 25575 -214359 41347 120420
12599 120420 215775 166126 -186090 131420 202465 60195 325637 152782 143750 -410365 -152453
12587 -35581 113791 -28858 -152242 -140091 -200725 153753 -245033 -8200 108567 -42416 64827
12575 300412 -88789 16356 425604 7465 24737 128602 -52259 -184307 88700 -156853 51469
12563 163331 163511 -83109 140712 146971 192728 105018 -171982 212740 -121212 275618 199236
$$ packed form
12642c08315E9761K61269j21965q7753D0979P7177j4152i7682C30734A22676L3901
12631A56577J34379K8776a29114A27963J6322P1063H1981K63565j9138A22825
12620b25409R7900j83905a0496B63045I7835c8777I8895b33102a7658A25277K71752
12609C97029a9322j73037h7921A67951L22715a37190B5575b14359D1347P9073
12599A20420R5355m9649a86090A31420P1045F0195K65442A52782r032d10365a52453
12587c5581A13791b8858j23384J2151o0634A53753b45033h200A08567d2416F4827
12575C00412h8789A6356M09248G465J7272J03865e2259j32048H8700a56853E1469
12563A63331J80h3109A40712O259M5757q7710a71982B12740a21212B75618p6382
$$ plain form
12552 199236 338805 50061 -56796 489102 -280803 -158458 -54751 223049 36673 -301952
12541 561669 -81705 95692 -305369 -140504 -77625 79193 -260798 186782 195681 33667 447984
12530 447984 37324 170408 -7099 -112008 350394 -188492 -63368 -23089 123455 110837 5929
12518 -82498 -44664 44268 -330027 -263899 248016 138363 -159715 -80934 -155309 65258 -197505
12506 81516 -33200 133303 54133 -216886 -15029 253555 -169181 314989 219724 41349 -168906
12494 184208 -39237 3576 68085 -117274 203456 -68317 -380887 44049 -111594 -60908 173066
12482 -13015 29615 279112 -253509 -124001 -15774 21129 48495 -191997 85229 120629 11679
12470 97425 -163644 -327540 160214 354761 64855 -290201 -202608 23436 -146333 189019
$$ packed form
12552A99236J39569E0061e6796D89102b80803J22345e4751B23049C6673c01952
12541E61669h1705I5692c05369a40504O2879G9193b60798A86782Q899C3667M14317
12530D47984C7324J33084g099j04909C50394a88492f3368b3089A23455j2618E929
12518h2498L7834D4268c30027O6128B48016j09653a59715P8781p4375F5258a97505
12506H1516c3200A33303E4133b16886a5029B53555a69181C14989r5265D1349a68906
12494A84208c9237C576O4509a17274B03456f8317l12570D4049a11594N0686A73066
12482a3015B9615K49497b53509a24001a5774B1129K7366a91997H5229L5400A1679
12470I7425a63644j63896A60214J94547F4855b90201Q7593B3436a46333A89019
$$ plain form
12459 101983 -75055 -290210 33011 49587 44844 253381 131294 -139462 380289 -121321
12448 -103248 -214861 -218708 -218134 180764 306231 -206802 -10575 -328129 -245768 -57096 233039
12436 91997 77858 -28886 82408 105154 -325148 20145 15657 36109 129505 389551 -87770
12424 99172 -90825 8505 -134292 26436 -126539 33315 -153023 -11979 154587 92138 -120765
12412 80893 -98889 3602 -86179 349403 -275388 192105 23989 7043 146523 -152246 -102625
12401 -102625 164668 -38089 190129 290563 -82203 87277 261903 -259983 -233316 3654 34367
12390 34367 37719 26792 -52286 -111722 135120 -68546 -41624 -108501 -154190 238488 234660 -296433
12377 33684 199994 65207 -4930 160932 -64081 -326521 86166 -86240 -231932 -6379 240782
$$ packed form
12459A01983g5055k15155C3011J6576m743K08537j22087a39462C80289a21321
12448a03248j11613l847N74A80764J25467b06802a0575l17554Q2361e7096B33039
12436I1997j4139b8886H2408K2746c25148B0145m488K0452R3396K60046h7770
12424I9172i0825H505a34292B6436a26539C3315a53023a1979A54587o2449a20765
12412H0893i8889C602h6179C49403b75388A92105B3989G043J39480a52246M9621
12401a02625A64668c8089A90129J00434h2203H7277J74626b59983K6667C654L0713
12390C4367L352j0927e2286n9436A35120f8546K6922o6877m5689B38488l828b96433
12377C3684J66310F5207d930A60932f4081k62440H6166h6240j45692f379B40782
$$ plain form
12365 -105271 536133 -51399 220434 -123670 -146540 -6107 21954 -336922 -34913 -99963 -173183
12354 -173183 -227547 100712 -92938 -323994 195767 -81 118476 -12454 -209944 154459 -395899
12342 69013 142399 -38734 -87310 130435 -189842 -21525 98446 -127875 -156843 -60652 -114624
12331 -114624 335362 218906 7123 163329 12474 -249984 181425 77273 179978 -312620
12320 106961 -10898 -254737 105045 -48537 74906 224917 42808 -319612 109618 -11798
12309 54960 -56362 49782 298440 30713 -328320 46864 223605 -38516 -140346 37108 25930
12298 25930 -88506 123467 35806 -133037 -350035 53943 -131804 -194376 -75258 -187806 -90043
12286 51587 48691 263333 -55308 138436 -119807 390828 203532 176535 -51145 3126 67497
$$ packed form
12365a05271E36133e1399B20434a23670k2870f107B1954c36922c4913o5050p3220
12354a73183n4364A00712i2938k31056A95767h1A18476a2454j97490A54459c95899
12342F9013P3386c8734m8576A30435a89842b1525I8446a27875k8968f0652n3972
12331a14624C35362j16456G123J56206A2474b49984A81425G7273J02705c12620
12320A06961a0898k43839A05045d8537G4906J50011D2808c19612A09618a1798
12309E4960e6362D9782K48658C0713c28320D6864J76741c8516j01830C7108j1178
12298B5930h8506A23467C5806a33037k16998E3943a31804o2572g5258j12548i0043
12286E1587k896K14642e5308A38436a19807C90828j87296k6997e1145C126O4371
$$ plain form
12275 67497 297781 -79204 82320 222364 -88073 -64906 -79739 108189 55234 -52212 139596
12263 608914 288170 -17109 -13610 -18917 -212412 -3836 40532 121064 118692 261576 138617
12252 138617 98513 6938 -214882 112329 -72732 337273 170460 -35918 -171600 34375 42715
12241 42715 21314 356665 163977 4217 123470 228519 37190 234830 204791 181723 -90755
12229 153895 29524 65771 267571 411700 599345 111239 -133035 35911 215351 8937
12218 184063 368046 106984 163375 224348 179990 49533 151166 61198 -99346 197076 97297
12206 175707 206966 -33726 182496 284534 -6999 142208 488864 125282 -11237 125023
12195 495244 452724 553008 298773 -119661 2802 107624 161096 -203161 96128 -104832
$$ packed form
12275F7497K30284g9204H2320J40044h8073K3167j4833A08189n2955e2212A39596
12263F08914B88170a7109L499n307j93495c836D0532Q0532k372J42884j22959
12252A38617m0104F938b14882A12329g2732C37273j66813c5918j35682C4375Q340
12241D2715B1314L35351A63977D217J19253J05049C7190J97640l0039k3068i0755
12229A53895B9524L6247K01800J44129J87645A11239a33035C5911J79440H937
12218A84063J83983A06984N6391O0973m4358D9533J01633F1198i9346A97076I7297
12206A75707L1259c3726A82496J02038f999A42208L46656A25282a1237A25023
12195D95244m2520J00284k54235a19661B802J04822N3472b03161I6128a04832
$$ plain form
12184 -106326 49174 46438 367136 60584 208154 -198247 209641 301149 390157 -73190 249784
12172 159317 272954 68246 515059 97618 -49427 -163174 -197326 -152579 51368 142010 483197
12161 483197 90178 136923 1463 54442 61798 -117157 -32398 16713 190176 173943 89893
12150 89893 9159 -451545 183160 94953 169634 50071 -37824 -315340 56690 -344704 17768
12138 97436 -38944 216944 -114878 -102488 -35103 -248676 221487 -52669 -87101 388359 5094
12126 52989 -107790 27774 201719 140040 293679 -67762 -109902 -158278 -46006 -165729 -78640
12114 105813 257091 113537 238234 -64823 209485 235341 198982 226809 234421 245761 78087
12102 -190203 -266555 -85604 -168531 146783 -15407 23194 49153 -184283 103672 -168267 -11451
$$ packed form
12184a06326D9174k736L20698F0584J47570a98247B09641R1508Q9008g3190B49784
12172A59317J13637F8246M46813I7618d9427j13747l4152M4747E1368R0642L41187
12161D83197I0178M6745A463N2979P356a17157c2398A6713J73463j6233q4050
12150H9893I159d51545A83160q8207P4681E0071c7824k77516E6690c44704A7768
12138I7436c8944B16944a14878J2390c5103k13573B21487e2669l4432C88359E094
12126E2989a07790B7774J73945o1679J53639f7762m2140m8376d6006j19723g8640
12114A05813J51278A13537J24697f4823B09485K5856l6359K7827P612J1340G8087
12102a90203p6352h5604q2927A46783a5407B3194K5959a84283A03672a68267a1451
$$ plain form
12090 280232 22309 -230461 -306195 24554 220636 -1383 32434 125031 46961 -209674 193117
12078 -60804 145265 70614 59274 246234 359362 1007864 1964432 1416624 459379 198952
12067 249741 163443 181361 60723 101132 -45185 74346 89050 -146846 -99781 -236425 20036
12055 -176607 -18196 233555 96832 60849 5801 93287 93544 12344 66193 7130 174910 -260479
12042 -215871 -140566 -327743 -79256 -127064 -293436 -16092 119716 -252674 -133836 -91855
12032 -91855 184658 -231032 -37245 -76246 244495 -206618 -161156 -20547 -185113 -306132
12022 -306132 -43717 67537 91794 34429 -53205 75659 70341 194477 -110448 195148 115430
12011 115430 174403 -143824 -184419 -7083 147531 -186594 -162387 -59847 -214859 -43926 210997
$$ packed form
12090B80232B2309b30461p5734B4554J96082a383C2434R2597D6961b09674A93117
12078f0804A45265G0614j1340J86960J13128O48502R56568n47808D59379A98952
12067B49741q6298J7918F0723M0409d5185G4346J4704a46846M7065j36644B0036
12055a76607a8196B33555I6832l5983E801Q7486K57A2344N3849G130J67780b60479
12042b15871P5305j87177g9256m7808j66372a6092A19716b52674J18838M1981
12032i1855A84658b31032c7245l9001B44495b06618M5462b0547j64566j21019
12022c06132d3717F7537K4257C4429e3205G5659n318J24136a10448A95148p9718
12011A15430N8973a43824m0595g083A47531a86594K4207e9847j55012d3926B10997
$$ plain form
11999 142879 136328 -93686 -277733 -61230 -91634 -160942 5353 -87185 -149821 -342075 -318274
11988 -318274 316829 -17535 -200304 -229571 210332 250983 162192 -212909 -215915 -83118 197040
11976 -6752 -145939 -22289 53942 -63870 -179806 -326625 199909 -129041 -209835 65851 261177
11965 261177 -82474 14749 154478 -173137 -158391 88553 1576 255836 -206290 -148569 -88033
11954 -88033 -105425 6320 -266740 -33725 -339043 -36094 322545 -37569 -182837 -111481 114108
11942 18842 -73126 52022 -17953 -204905 61978 237598 44754 -500903 -44945 16174 -95739
11930 -209921 157938 118207 -76209 243218 -221832 -165156 -107078 214822 277265 -88724 206122
11918 51273 4701 320625 -142332 -131119 137117 -170200 153506 239448 -130360 -307964
$$ packed form
11999A42879o551i3686j84047f1230l0404o9308E353h7185o2636j92254K3801
11988c18274C16829a7535j82769k9267B10332M0651q8791b12909l006h3118A97040
11976f752j39187b2289E3942f3870j15936j46819A99909a29041q0794F5851J95326
11965B61177h2474A4749J39729a73137J4746H8553A576K54260b06290N7721O0536
11954h8033j7392F320b66740c3725l05318c6094C22545c7569j45268P1356A14108
11942A8842g3126E2022a7953j86952F1978J75620D4754e00903d4945A6174i5739
11930b09921A57938l9731g6209B43218b21832N6676N8078B14822O2443h8724B06122
11918E1273D701L15924a42332J1213A37117a70200A53506Q5942a30360j77604
$$ plain form
11908 -307964 -227874 140360 -188256 -139278 38765 -40368 146778 -7048 -52747 -90031 -37249
11896 275824 160563 -331612 -169442 13668 -308057 216221 7165 104914 -32101 160315
11885 -136520 128590 -50169 -171726 -157157 46962 -214245 -7686 285275 26861 -192867 -81764
11873 165525 350788 36312 -83369 -49449 -67398 268114 -71769 -51989 -83777 -217296 2811
11861 109846 9704 -68090 -122123 173334 -280617 -108979 -45750 62361 -103374 -118833 -31576
11849 165392 140263 256389 -59984 38497 -113576 517235 -80196 -172508 -51370 19639 -93704
11837 -123499 -202063 -192868 -258629 80624 192123 218266 -187908 -310364 95148 90080 -285438
11825 82922 -141647 43513 -398212 43449 -307305 -36797 -39606 89345 -32376 -57994 115333
$$ packed form
11908c07964Q0090A40360a88256M8978C8765d0368A46778g048m5699l7284c7249
11896B75824j15261c31612J62170A3668c08057B16221G165R7749c2101A60315
11885a36520A28590e0169j21557J4569D6962b14245g686B85275B6861a92867h1764
11873A65525J85263C6312h3369L3920j7949B68114g1769J9780l1788j33519B811
11861A09846I704f8090n4033A73334b80617a08979d5750F2361a03374j5459c1576
11849A65392k5129J16126e9984C8497a13576E17235h0196r2312e1370A9639i3704
11837a23499p8564R195o5761H0624J11499K6143a87908j22456I5148n068b85438
11825H2922a41647D3513c98212D3449c07305c6797k809H9345c2376k5618A15333
$$ plain form
11813 -289554 106792 45017 137409 250385 99311 -164355 -69311 -139473 -182648 -112858 89347
11801 287411 -148608 -117956 78229 -76518 -238494 -172392 -81294 54430 155672 -36919 -78973
11790 -78973 381 45518 367060 136007 187305 132151 157113 78507 282966 -73013 87711
11778 7767 139953 -5322 -167303 -415691 70629 262637 -505418 122615 9484 28147 121087
11767 121087 82443 135664 -296045 20166 -69204 88399 215458 42468 -103390 -84397 41673
11755 277509 52782 -181007 159629 -126553 -86763 -113384 275018 -62115 -73928 -39916 144850
11743 328240 152074 -230086 -110939 131565 90425 -128031 157062 -221391 -15073 10077
11732 69097 23218 47392 -50514 -281333 88728 -9941 -107678 -67724 148468 21610 -164238
$$ packed form
11813b89554A06792D5017R2392J12976I9311a64355f9311p0162m3175O9790H9347
11801B87411a48608L0652G8229g6518j61976O6102h1294E4430J01242c6919m2054
11790g8973C81M5137L21542A36007N1298n5154K4962G8507K04459g3013H7711
11778G767J32186e322j61981k48388G0629J92008e05418A22615I484J8663R2940
11767A21087l8644N3221b96045B0166f9204H8399J27059D2468a03390J8993D1673
11755B77509E2782a81007A59629a26553L9790k6621B75018f2115j1813L4012A44850
11743C28240A52074b30086a10939A31565m1140a28031A57062b21391a5073A0077
11732F9097B3218K4174e0514k30819H8728i941r7737L9954A48468B1610a64238
$$ plain form
11720 395998 15314 -176021 -16495 5343 114357 141101 39583 139526 -1847 227953 109980
11708 87242 -53579 226949 68473 -136296 -88998 -137599 -65242 -59311 -139741 158363 267692
11697 267692 -21403 -88366 -279856 -226840 73310 -39450 -33731 65992 -591 22016 -66539 62979
11684 10446 -106179 -36608 213068 -15416 -148673 -189755 123414 -170590 316305 83004
11673 -225216 -127261 178234 24583 -210742 -143926 -61172 -112439 -59005 176805 3029 -36832
11661 254957 -106562 209060 22266 213014 85340 117116 -176630 111766 -74410 -149520
11651 -149520 85235 40723 26691 491097 154144 149042 50161 23740 135394 -70466 311449
11639 259562 146732 -179925 308139 -11845 107349 -33647 141105 -68853 153512 -40790
$$ packed form
11720C95998A5314a76021a6495E343J09014K6744C9583R9943a847B27953A09980
11708H7242e3579B26949F8473a36296M7298m8601f5242N931q0430A58363J09329
11697B67692b1403o6963j91490N3016G3310c9450N719F5992e91B2016f6539F2979
11684A0446a06179c6608B13068a5416j33257m1082A23414a70590C16305H3004
11673b25216R7955A78234B4583b10742O6816f1172n1267N3434A76805C029c6832
11661B54957a06562B09060B2266J90748H5340L1776a76630A11766g4410p5110
11651a49520H5235D0723j4032M64406A54144n102E0161B3740J11654g0466C11449
11639B59562j12830a79925C08139a1845A07349c3647A41105f8853A53512d0790
$$ plain form
11628 97665 39140 26166 -134203 78472 -126439 -157621 198049 -134831 299383 113268
11617 120766 -220633 -228892 -42864 63588 -105408 281289 -118773 4666 80359 137456 257401
11606 257401 91693 -93356 -52624 105712 427266 -53360 80157 55413 -184764 -68025 -77331
11595 -77331 -90046 -114880 -365504 24445 -85727 -186120 286752 126868 -120764 16024 263462
11584 263462 146146 87022 266138 117162 36901 -205441 -100300 -34086 320741 13494
11573 43136 149993 148662 91670 25894 -115587 -28937 -180598 171253 226476 336024 150453
11561 174356 -131741 89527 214117 -189758 176413 92877 -284756 197244 -19471 284168
11550 83908 -24180 180740 -138518 38464 211703 -13026 -61847 -128454 149150 -150653 -184746
$$ packed form
11628I7665C9140j2974a34203G8472a26439l1182A98049a34831B99383A13268
11617A20766b20633q259d2864F3588a05408B81289a18773D666P5693N7097J19945
11606B57401I1693i3356M0732A05712L21554e3360H0157k4744a84764f8025r306
11595g7331j2715k4834k50624B4445h5727j00393B86752A26868a20764A6024K47438
11584B63462j17316n9124J79116A17162C6901b05441a00300c4086C20741A3494
11573D3136J06857j331n6992B5894a15587b8937j51661A71253N5223J09548A50453
11561A74356a31741H9527J24590a89758A76413q3536b84756A97244a9471B84168
11550H3908b4180A80740a38518C8464J73239a3026m8821o6607A49150a50653l4093
$$ plain form
11539 -184746 174718 176188 339900 272092 -28177 142266 142671 142678 196479 125018 -216728 42911
11526 349459 -78653 -11687 245497 -59277 -84005 96013 -27258 171963 174496 -211359 129575
11514 -59447 -104419 126076 211490 -47127 229697 247060 424633 131467 -333673 133895
11503 -52083 349329 38238 167375 133313 -139822 -17306 56594 -106385 76379 -20770 68910
11491 321180 196230 -59509 -22656 -54377 319055 263167 -64361 170972 -144828 202375
11480 64529 328202 26264 168933 -106685 -81187 97071 59355 92571 186592 30363 318196
11469 318196 276584 172395 291362 82317 303418 168027 201445 354306 -11256 202667
11458 -160543 -111181 161723 182725 198639 -121379 40237 293641 8244 68617 151671 -146579
$$ packed form
11539a84746A74718J470J63712o7808b8177A42266M05PN3801p1461b16728D2911
11526C49459g8653a1687B45497e9277k4728I6013b7258A71963K533b11359A29575
11514e9447m4972A26076Q5414d7127B29697J7363J77573A31467c33673A33895
11503e2083C49329C8238J29137l4062a39822a7306E6594a06385G6379b0770F8910
11491C21180j24950e9509b2656l1721C19055n5888f4361A70972a44828B02375
11480F4529K63673B6264J42669a06685K5498I7071l7716L3216R4021C0363K87833
11469C18196m1612j04189J18967H2317K21101j35391L3418J52861a1256B02667
11458a60543M9362A61723K1002J5914a21379D0237K53404H244O0373Q3054a46579
$$ plain form
11446 85560 -251295 302793 185170 212819 260217 59609 -49760 -5284 303983 63723 -23490
11434 154031 258372 320586 -109605 -69023 131426 115388 233455 -254148 -35977 24001
11423 -143391 647064 -142731 -6816 -15553 54122 29831 104923 -100063 -299138 159913 76783
11411 -275207 -100708 32392 186514 53096 -231015 92480 -70352 -228002 349139 -139472
11400 119622 -304072 -149469 4517 -141397 47053 81013 -157436 -11939 60179 64166 3229
11388 168532 168395 223413 169309 -473895 -143001 240664 18289 333400 3444 -43448 -19072
11376 -185253 171603 -144358 247161 -46489 -97373 -115117 -11895 -254414 -114223 98932
11365 -79200 166725 -197635 95427 255342 -227464 250732 29414 -146549 77947 -79655
$$ packed form
11446H5560b51295C02793j17623K7649M7398E9609d9760e284C03983F3723b3490
11434A54031J04341O2214a09605M0582A31426j6038J18067b54148c5977B4001
11423a43391F47064a42731f816q737E4122k4291P5092a00063j99075A59913G6783
11411b75207a00708C2392J54122E3096b31015I2480g0352j57650C49139a39472
11400A19622c04072a49469D517a41397D7053L3960a57436a1939F0179L987C229
11388A68532j37N5018n4104d73895a43001B40664A8289L15111C444d3448a9072
11376a85253A71603a44358B47161d6489n0884j7744a1895k42519a14223I8932
11365g9200A66725a97635I5427J59915b27464B50732B9414a46549G7947g9655
$$ plain form
11354 -306396 16822 227587 -125873 38370 51639 -40398 -137940 -79761 86292 113073 181089
11343 181089 -118275 10630 141403 -12071 57360 47686 133643 222139 11538 277592 23516
11331 -157923 118901 -128522 -56894 -34709 -98906 -85358 -370381 100437 -25345 -211132
11321 -211132 194171 -66308 -307162 80453 -196948 -274654 66967 182562 -119717 -6357 52092
11309 -31260 -38391 -182736 216797 187760 -262309 83053 -80943 -50635 1992 94641 -131254
11297 29196 148979 -317059 -1988 198075 140852 -230775 -83921 -146764 9493 -39238 -302495
11286 -302495 -37874 55763 -132824 -221373 86496 -135183 92152 169978 -79307 44714 258264
11275 258264 7640 2352 -175875 -8878 -194757 -474210 366099 170902 85329 -11285 41368
$$ packed form
11354c06396A6822K10765a25873C8370J3269d0398r7542N8179H6292K6781O8016
11343A81089a18275A0630J30773a2071E7360r674Q5957Q8496A1538K66054B3516
11331a57923A18901a28522e6894K2185o4197J3548k85023A00437b5345j85787
11321b11132A94171f6308k40854H0453a96948p7706F6967J15595a19717f357E2092
11309c1260p131j44345B16797k9037b62309H3053h0943L0308A992R2649a31254
11297B9196J19783c17059a988A98075n7223b30775h3921o2843I493c9238k63257
11286c02495c7874E5763a32824q8549H6496a35183I2152P7826g9307D4714K13550
11275B58264G640B352a75875h878j85879k79453C66099A70902H5329a1285D1368
$$ plain form
11263 -11652 -3544 79687 -85686 -96753 -37546 4009 -163621 -45815 -141328 -179207 28954 181366
11251 181366 -210102 -53276 237223 53639 -245236 52876 -51896 -12754 -164496 -118437 -39746
11239 100545 -190047 215504 69515 20140 -140270 -191386 71433 105046 -26032 264913 -11274
11227 40716 -283634 28187 -122872 -151809 -253411 -171471 297187 83496 -131593 -62306 176673
11215 115914 115642 122595 -94114 -369000 -309058 -79262 -22159 -32189 -191682 -105049 -54569 9581
11202 -73239 -266927 230335 -143948 -89174 -262935 -18032 247326 -116477 104670 -59195
11191 76448 -179638 -226260 72718 69451 -73366 -61113 -267636 82172 -12527 -184118 48388
11179 -81942 234854 -157945 3856 -120596 -284950 49855 -139204 -47929 -61191 -144522 -262236
$$ packed form
11263a1652c544G9687h5686j1067c7546D009a63621d5815r5513l7879B8954J52412
11251A81366b10102e3276B37223E3639b45236E2876e1896a2754j51742M6059c9746
11239A00545a90047B15504F9515B0140a40270n1116G1433L3613b6032B64913a1274
11227D0716b83634B8187a22872k8937j01602Q1940B97187H3496a31593f2306A76673
11215A15914k72O953i4114k74886N9942g9262b2159j0030j59493Q6633N0480I581
11202g3239j93688B30335a43948N4774j73761a8032B47326a16477A04670e9195
11191G6448a79638m6622G2718l267g3366J2253k06523H2172a2527j71591D8388
11179h1942B34854a57945C856a20596j64354D9855a39204d7929j3262q3331j17714
$$ plain form
11168 -262236 -73175 39692 28426 -61600 -80499 73336 -103417 -2220 82582 -24557 90773
11156 -105099 89203 -386016 21259 -335935 -261136 33140 320873 97660 -2847 -129726 102955
11144 -39922 -329997 -424741 -4844 19315 118524 420794 310583 36582 -93474 53785 112149
11133 112149 -36822 -131356 -32072 134952 53026 96125 124234 -16332 14813 132584 -30169
11121 220160 226824 301091 -152889 50553 -51708 -224641 -96030 -65176 20323 -28336 239230
11109 59080 230415 -61626 77538 404096 -406732 -49229 450973 -38143 51412 338040 330008
11098 330008 104110 223348 -153328 272858 187730 93753 137260 70745 11906 251362
11088 251362 481622 -123785 353032 51526 -22037 102611 240256 333428 -8350 144164
$$ packed form
11168b62236g3175C9692j1266f1600j8899G3336a03417b220H2582b4557I0773
11156a05099H9203c86016B1259c35935P4799C3140K87733I7660b847j26879A02955
11144c9922k90075r4744d844A9315R9209L02270j10211C6582i3474E3785N8364
11133A12149c6822r4534c2072A34952E3026M3099K8109a6332A4813J17771c0169
11121B20160O664P4267a52889E0553e1708j72933i6030L0854B0323b8336B39230
11109E9080J71335f1626G7538L26558d06732d9229D50973c8143E1412K86628q032
11098C30008A04110J19238a53328B72858q5128I3753M3507o6515A1906K39456
11088B51362K30260a23785C53032E1526b2037A02611J37645R3172h350A44164
$$ plain form
11077 137385 410364 132556 154660 -5983 2523 337866 314820 350290 280624 40482 255483
11066 255483 429767 213327 78789 230963 522591 557431 395220 264752 129658 277105
11056 277105 576756 874174 491874 777795 443499 668718 705846 695484 411290 870090
11046 870090 535696 728100 518843 738919 814690 599457 827660 691524 399873 437369
11036 437369 450781 619410 764764 553492 694919 945671 578454 492850 469691 647526
11026 647526 604901 511629 818671 833489 509715 511882 603514 350896 732545 604616 553184
11015 553184 502367 671549 523925 314124 402056 640268 254132 597828 452863 572062
11005 572062 299828 680925 620462 545569 718890 606084 506293 613228 360916 185717
$$ packed form
11077A37385K72979A32556K2104e983B523L35343k3046L5470o9666D0482K15001
11066B55483J74284B13327G8789J52174K91628L4840j62211j30468A29658J47447
11056B77105K99651K97418l82300K85921l34296K25219L7128j0362k84194M58800
11046H70090l34394J92404k09257K20076P5771k15233K28203j36136k91651L7496
11036D37369J3412J68629J45354k11272J41427K50752l67217q5604k3159J77835
11026F47526m2625r3272L07042J4818l23774K167R1632k52618L81649j27929n1432
11015E53184n0817J69182j47624k09801Q7932K38212B54132L43696j44965J19199
11005E72062k72234L81097o0463p4893J73321j12806r9791J06935k52312j75199
$$ plain form
10995 185717 648291 665737 781077 496555 726471 641342 450761 697574 748920 522954
10985 522954 895659 1039255 866132 1162086 1167881 1326596 1140317 1350778 1222915 1659212
10975 1659212 1682104 2400674 2329001 2407602 2603978 2546661 2459073 2167612 1915505 1817744
10965 1817744 1788897 1527864 1645520 1334615 1439874 1572371 1749647 1630975 1883894 1369242
10955 1369242 1524335 1303288 1329615 1014805 668457 1041916 530062 568120 430386 491015
10945 491015 317162 401780 275684 180389 254995 109964 442391 285076 37946 236086
10935 236086 114237 34500 126482 -69794 131514 204062 51278 -106979 299566 63536 -10982
10923 78723 233607 109481 -2210 112698 9555 -50929 279545 -468826 -72784 -198418 147727
$$ packed form
10995A85717M62574J7446J15340k84522K29916q5129j90581K46813N1346k25966
10985E22954L72705J43596j73123K95954N795J58715j86279K10461j27863M36297
10975A659212K2892P18570p1673P8601J96376n7317q7588k91461k52107r7761
10965A817744k8847k61033J17656l10905J05259J32497J77276j18672K52919n14652
10955A369242J55093k21047K6327l14810l46348L73459n11854L8058j37734O0629
10945D91015j73853Q4618j26096r5295P4606A09964L32427j57315C7946J98140
10935B36086A14237C4500R1982f9794A31514P2548E1278a06979B99566F3536a0982
10923G8723J54884A09481b210A12698I555e0929B79545d68826g2784j25634A47727
$$ plain form
10911 159883 50332 -108702 -28187 141867 122363 296650 32801 -256086 -233089 172482
10900 128416 -49754 -380214 149 -173537 -59676 16350 -81700 214414 -41048 64819 -93531
10888 -161281 44629 64736 -50815 307689 14096 167069 167487 -381633 -214131 89258 132071
10877 132071 207948 -221529 -72284 332967 -283778 -209731 -4882 -87928 65487 56413 90333
10866 90333 -44655 66818 -52525 -221155 -77073 30574 -38007 50901 -41246 -151892 -157296
10855 -157296 -192131 211462 -288235 -130884 122402 -48475 -307883 -27335 -103728 1542 85403
10844 85403 -288416 -180587 282435 317639 128652 129219 301133 59374 24836 -321721 -232182
10833 -232182 81850 89915 90269 -122481 -27973 -24149 10542 18821 247268 -1557 325700 326771
$$ packed form
10911A59883E0332a08702b8187A41867j9504J74287C2801b56086K2997A72482
10900A28416d9754l30460A49a73537e9676A6350h1700B14414d1048F4819i3531
10888a61281D4629K0107e0815C07689A4096J52973M18c81633J67502H9258M2813
10877A32071P5877b21529g2284C32967b83778P4047d882q3046F5487r074L3920
10866I0333d4655F6818e2525j68630g7073C0574c8007E0901d1246j10646n404
10855a57296l4835B11462b88235a30884A22402d8475k59408b7335p6393A542Q3861
10844H5403b88416J07829B82435L5204A28652N67J71914E9374B4836c21721Q9539
10833b32182H1850Q065L54a22481b7973L824A0542Q279K28447a557C25700J071
$$ plain form
10821 326771 -123955 48116 118953 -137572 334439 322488 -46368 -245079 -130263 26479
10810 150652 -82935 -107889 -169462 9870 -40147 -9262 -208547 -121616 65454 -197011 -46385
10798 -33104 -427660 14601 1750 -337543 -111200 -31817 48776 -73144 -224722 -125976 115064
10786 -35376 -32550 73997 -264938 227368 144507 -255649 196873 -161637 63880 -163308 -66994
10774 -126998 61248 -107823 -209544 201212 264128 84508 147537 -20353 -25185 99668 -22502
10762 40133 -189602 266358 28801 276998 40259 147723 112921 -141702 -133040 89654 -115370
10750 116120 -105136 -109873 -175918 145006 126975 225382 -70728 16631 -21202 -272657 -86647
10738 -175830 -106789 -308082 -272627 -276285 -223437 -47511 -125250 -42428 -169431 -340256 -109184
$$ packed form
10821C26771a23955D8116P0837a37572C34439j1951d6368j98711J14816B6479
10810A50652h2935k4954o1573I870d0147i262j99285Q6931F5454a97011d6385
10798c3104l94556A4601A750c37543a11200c1817D8776g3144j51578R8746A15064
10786c5376K826G3997b64938B27368q2861b55649A96873a61637F3880a63308f6994
10774a26998F1248a07823j01721B01212O2916H4508O3029b0353m832I9668b2502
10762D0133a89602B66358B8801K48197D0259J07464l4802a41702Q662H9654a15370
10750A16120a05136m737o6045A45006j8031R8407g0728A6631b1202k51455h6647
10738a75830O9041k01293L5455l658N2848d7511p7739d2428j27003j70825a09184
$$ plain form
10726 -58795 140792 -48835 -318182 -449839 -293809 -271890 44017 -272935 -110384 19015
10715 -35261 50083 29730 714 -33500 -65851 -80759 -199464 4070 24899 314002 -21658 -225457
10703 -225457 -221011 34862 204783 162668 123540 -291774 -174074 -116392 275232 285649 131645
10691 -211187 -286214 64611 -115383 138189 48651 15346 -38100 315383 -471263 -162327
10680 -284245 185034 -128712 -583350 -39847 37410 156878 -260304 -148810 195954 141212
10670 141212 118181 198429 -56267 -35453 -162097 -216764 36073 -150104 -134034 -213957 -81441
10658 -50882 253612 -129981 71945 728 -135504 -143312 -134246 -200914 -214818 -47454 -28977 359624
10645 -158176 -114959 14154 -330921 -190719 -128046 154990 -197935 -130023 237013 -62449
$$ packed form
10726e8795A40792d8835k69347j31657J56030K1919D4017b72935a10384A9015
10715c5261E0083k0353G14c3500l2351j4908j18705D070K0829K89103b1658k03799
10703b25457M446C4862J69921m2115l9128b91774J17700N7682B75232J0417A31645
10691b11187p5027F4611a15383A38189D8651A5346c8100C15383d71263a62327
10680b84245A85034a28712m54638c9847C7410J19468b60304J11494A95954n4742
10670A41212k3031Q0248e6267K0814j26644n4667C6073a50104J6070p9923h1441
10658e0882B53612a29981G1945G28a35504p808R066o6668j3904d7454J8477C59624
10645a58176M3217A4154c30921J40202O2673A54990a97935O7912B37013f2449
$$ plain form
10634 100392 72964 -56487 -149550 -323131 -186785 -115689 -224037 126346 109883 50451 -36633
10622 -76154 -196861 -29394 193318 1192 100601 -26470 371882 87684 -248976 386606 -297529
10610 58834 -58719 -19160 133049 110113 477 26052 -242464 -124696 62261 66821 21312 -55878
10597 25562 31722 212172 172523 -184969 119369 -201274 -148053 -293321 167605 -109322
10586 19253 50097 92633 -282841 -124320 -87350 -108345 294959 58635 41782 -334497 17819
10574 106496 -32524 -62042 72890 -94143 424397 -304632 -153849 -68450 -212828 -69875 -49388
10563 -49388 -139057 -199568 380294 230402 -92959 -101540 168970 14796 84211 10794 3735
10551 -170057 -96896 -385284 306067 38385 -211674 -148633 -91762 91384 382283 282731 296109
$$ packed form
10634A00392k7428e6487r3063j73581J36346P1096j08348A26346j6463E0451c6633
10622g6154j20707b9394A93318A192R9409b6470C71882H7684b48976C86606b97529
10610E8834e8719a9160A33049k2936D77K5575b42464J17768F2261M560B1312e5878
10597B5562O160J80450l9649a84969A19369b01274N3221j45268A67605a09322
10586A9253L0844M2536b82841a24320L6970k0995B94959E8635j6853c34497A7819
10574A06496c2524k9518G2890i4143D24397c04632J50783f8450j44378f9875K0487
10563d9388q9669o0511C80294j49892i2959q581A68970A4796O9415A0794C735
10551a70057P3161k88388C06067C8385b11674O3041N6871I1384K90899r9552J3378
$$ plain form
10540 296109 43303 -112432 -177251 24414 -395517 -38520 -131888 29653 183376 -402840 -156698
10528 -10008 51900 -144639 -43836 -240379 11956 71528 -34329 -177062 84248 -289322 129318
10516 180936 148864 -141082 -79823 -97630 -347696 -1481 307521 -283004 -398453 91374 -194120
10504 -192130 -128684 135754 -203395 -103 222425 78452 673082 -141599 -187272 -248641 77251
10492 270159 -71673 -136053 -419298 -146448 -260026 -377974 -317015 -98688 200215 496431
10482 496431 168856 527486 520968 334819 35073 310053 146983 312036 -25582 -200042
10472 -200042 -26105 -231632 23793 -48457 156626 182700 3677 -178143 -115049 140358 200549
10461 200549 -22231 23034 -130569 -251734 -37046 -54571 260399 264227 -361118 105640 61802
$$ packed form
10540B96109D3303a12432o4819B4414c95517c8520r3368B9653J53723d02840a56698
10528a0008E1900a44639d3836j96543A1956N9572c4329j42733H4248b89322A29318
10516A80936l2072a41082O1259j7807k50066a481C07521b83004j15449I1374a94120
10504a92130O3446A35754b03395a03B22425G8452N94630a41599m5673o1369G7251
10492B70159g1673o4380k83245a46448j13578j17948O0959i8688B00215K96216
10482D96431A68856L58630o518j86149C5073K74980A46983J65053b5582j74460
10472b00042b6105k05527B3793d8457A56626K6074C677a78143O3094A40358O0191
10461B00549b2231B3034a30569j21165c7046j7525B60399L828c61118A05640m3838
$$ plain form
10450 61802 -163748 -208899 71662 -357446 211121 9587 111344 212750 26955 -41267 -151961
10439 -151961 -62964 -139597 -111603 8315 -1060 239536 26504 -18009 -196434 479742 -24767
10427 -169639 -216691 -336162 -92443 -102700 -440669 -81783 -51181 34861 237678 41249 170532
10416 170532 -343065 13646 167247 -239145 -35209 -39020 92595 55166 -509147 134446 277861
10405 277861 298211 85988 -444237 20160 -402266 -236385 -182061 -182354 -190010 -137824 -14230
10393 127401 607330 -100444 19717 -105343 -44954 122866 378 78044 -17999 50604 -314932
10381 -65449 189422 370811 84334 5721 319982 213499 518253 181486 263321 -55883 227038
10369 338980 281731 2705 519315 253669 536830 304233 235262 238855 160516 16018 -126778
$$ packed form
10450F1802a63748m5151G1662c57446B11121I587J01757J01406B6955d1267j10694
10439a51961f2964p6633K7994H315a060B39536B6504a8009j78425D79742b4767
10427a69639m7052j19471i2443j0257l37969h1783L0602C4861K02817D1249J29283
10416A70532c43065A3646J53601b39145c5209l811I2595l7429e09147A34446J43415
10405B77861K0350H5988d44237B0160d02266J65881N4324k93p656N2186a4230
10393A27401M79929a00444A9717a05343d4954A22866C78P7666a7999E0604c14932
10381f5449A89422J81389H4334E721L14261j06483L04754A81486Q1835e5883B27038
10369C38980n7249B705N16610B53669K83161k32597o8971L593p8339A6018a26778
$$ plain form
10357 167078 86377 -90646 365973 -33380 536781 167339 399384 376835 409600 591417
10347 591417 583229 151420 71683 538027 228281 44852 10372 173365 333924 -207440
10336 302052 286705 166275 23414 143628 271442 126048 -34880 -33871 222533 129893 -232404
10324 448550 261294 229021 324679 165474 -64482 96359 -56016 -221562 -168756 333078 226336
10313 226336 -229283 119770 -300982 -22090 17999 -212106 -174490 324602 44952 151478
10303 151478 89372 38737 -83657 341492 132565 -89948 -90718 38386 61439 107256 133279
10292 133279 -56496 -271700 -140088 89867 -129781 225358 162422 -101458 -24842 -293510
10282 -293510 99835 87606 -308489 -78134 191079 -382668 -326005 9036 -392122 -205491 320913
$$ packed form
10357A67078q0701i0646C65973c3380E36781A67339K32045k2549L2765J81817
10347E91417q188A51420G1683M66344B28281D4852A0372J62993J60559b07440
10336C02052j5347j20430B3414J20214J27814A26048c4880J009B22533r2640b32404
10324D48550j87256l2273R5658j59205f4482I6359e6016j65546N2806C33078j06742
10313B26336b29283A19770c00982b2090A7999b12106L7616C24602D4952J06526
10303A51478o2106C8737h3657C41492A32565h9948p70C8386K3053M5817K6023
10292A33279e6496k15204J31612H9867a29781B25358o2936a01458b4842k68668
10282b93510I9835j2229c08489g8134A91079c82668N6663I036c92122J86631C20913
$$ plain form
10270 7053 305339 -62675 -108242 -130390 -55672 241562 136076 94206 -231039 86741 -48703
10258 112819 26411 57773 87387 -186698 532 204175 -24024 399876 -81487 -82534 -48818
10247 -48818 237390 144127 -118497 30515 -181717 334028 255689 -75520 82108 4824 -65104
10235 139443 157248 -362278 -57320 -58252 -211594 148646 -118457 -227331 -155494 317916 322606
10224 322606 -1010 -137998 -184842 -313981 -249829 -41126 257829 -100419 -29382 45598 -351931
10212 115406 167810 -16423 18455 -79955 155472 -214930 -216092 55459 -236273 156261 108973
10201 108973 -273855 -206119 -129161 -238871 -410758 27421 31087 28370 -173418 77165 121793
10190 121793 -83881 72897 109078 30986 -8403 -448823 -190955 -94734 306352 -232282 -209664
$$ packed form
10270G053K98286f2675m5567k2148e5672B41562j05486m1870b31039H6741d8703
10258A12819B6411L1362K9614a86698E32K03643b4024C99876h1487j047L3716
10247d8818B37390r3263a18497C0515a81717C34028p8339g5520H2108D824f5104
10235A39443J7805c62278e7320r32j53342A48646a18457j08874P1837C17916M690
10224C22606a010j36988m6844j29139O4152d1126B57829a00419b9382D5598c51931
10212A15406N2404a6423A8455g9955A55472b14930j162E5459b36273A56261m7288
10201A08973b73855O7736P6958j09710j71887B7421L666k717a73418G7165M4628
10190A21793h3881G2897L6181C0986h403m40420a90955i4734C06352b32282K2618
$$ plain form
10179 -209664 -297724 -362451 -35188 -287826 72048 -87607 -311669 39441 101611 -256183 -404368
10168 -404368 -25662 249899 58742 -339878 56326 -271543 -103055 -329702 10073 -15128
10157 -102383 247332 -111097 11372 -197001 -81113 -82256 -114602 25433 125960 61402 -78498
10145 110170 -347305 -113588 -33366 209302 267847 -139740 -515203 -223890 109378 -59404
10134 -253759 12675 387160 -14287 -53644 -112224 79142 -174218 47264 -228304 -134053 273730
10122 34839 177774 188008 -288506 -52045 -190079 -33864 -183627 -97978 55420 -213521 -206331
10111 -206331 -306764 -142568 -296244 227993 79613 77146 -28584 -104880 80327 -262647 -94435
10099 92099 -154510 -61199 -155020 -183806 -345103 -31007 -255467 -187078 -155948 -219827 264182
$$ packed form
10179b09664q8060o4727c5188k52638G2048h7607k24062C9441O2170b56183j48185
10168d04368b5662B49899E8742c39878E6326b71543a03055k26647A0073a5128
10157a02383B47332a11097A1372a97001h1113j143l2346B5433J00527F1402g8498
10145A10170c47305a13588c3366B09302N8545a39740l75463b23890A09378e9404
10134b53759A2675L74485a4287l9357n8580G9142a74218D7264b28304R4251B73730
10122C4839J42935J0234b88506e2045j38034c3864j49763Q5649E5420b13521P190
10111b06331j00433a42568j53676B27993G9613k467b8584p6296H0327b62647i4435
10099I2099a54510f1199r3821k8786j61297c1007k24460O8389L1130o3879B64182
$$ plain form
10087 1541 138520 -1002 -146175 -301089 -471966 -113018 198729 -75952 -142510 290758 218290
10076 218290 -233111 -22495 -94727 -261080 415280 -156113 64860 -381776 308041 139333
10065 -78043 21296 103432 310690 -95604 -129651 -137354 -8514 -306616 -245764 -15482 247570
10053 -7084 183228 43297 -39099 90232 119099 -46796 143544 106475 159401 -36547 -329712
10042 -329712 -3953 -87568 23831 76828 10792 12978 93940 -104570 -154571 -55640 -170423
10031 -170423 -112693 -233111 -42955 -246193 67404 31252 90229 -133424 -442484 -254343
10021 -254343 -313752 -267952 -83404 -182198 79847 -152130 -278546 -195904 -192753 -116142 -313376
10010 -313376 75008 -140549 -48713 -85441 -281936 -18773 -138104 -3119 -135136 -229025 111105
$$ packed form
10087A541J36979a002j45173j54914j70877a13018A98729g5952o6558B90758p2468
10076B18290b33111b2495p2232j66353D15280a56113F4860c81776C08041A39333
10065g8043B1296Q2136K07258i5604l4047p703h514k98102O0852a5482B47570
10053g084A83228D3297c9099I0232K8867d6796A43544l7069N2926c6547k93165
10042c29712c953q3615B3831N2997A0792K186Q0962a04570n0001e5640j14783
10031a70423N7730j20418d2955k03238F7404C1252N8977a33424l09060J88141
10021b54343n9409M5800h3404r8794G9847a52130j26416Q2642L151P6611j97234
10010c13376G5008a40549d8713l6728j96495a8773j19331c119j32017r3889A11105
$$ plain form
9998 -152935 -330388 210639 -201990 -135926 -77403 52966 -394557 -145396 -42937 -293455
9988 -293455 -79601 -43437 -93887 68247 -14538 -349776 128898 1341 222898 76763 265265
9977 265265 -65969 -142233 170423 -163788 -126384 -4446 -257811 74605 -119864 63692 -220754
9965 -28203 82460 65531 -206147 -126287 77134 30258 -180689 -64476 14966 -135476 -329568
9954 -329568 -134737 -265322 -150949 25470 -473940 120640 78179 30379 -161173 -118519
9944 -118519 15678 -918 -6048 -107898 -162963 -337013 -229772 -41659 -8993 -105222 -222702 -40405
9931 190696 26447 -41077 -212647 75061 -7489 67685 328980 -127239 -105971 207916 -30619
9919 -74127 -136028 -64822 -64330 -244956 110792 -398235 -194556 -140637 -260533 -363818 -25270
$$ packed form
9998a52935j77453B10639b01990O6064N8523E2966c94557a45396d2937k50518
9988b93455g9601L6164n0450F8247a4538l35238A28898A341K21557G6763J88502
9977B65265f5969p6264A70423a63788L7404d446k53365G4605a19864F3692b20754
9965b8203H2460j6929b06147P9860G7134C0258a80689f4476A4966a35476j94092
9954c29568a34737j30585J14373B5470d73940A20640m2461C0379a61173M2654
9944a18519A5678i18n130j01850n5065j74050J07241d1659h993r6229j17480d0405
9931A90696B6447d1077j71570G5061g489F7685K61295a27239K1268B07916c0619
9919g4127o1901f4822M92j80626A10792c98235a94556N3919j19896j03285b5270
$$ plain form
9907 144899 130021 -183156 -133578 14999 119581 26576 -324241 97537 4084 123278 -196365
9895 -338330 -225520 -145501 -64487 80127 -261942 -54930 4745 9971 -321100 22739 -223471
9883 21559 -271291 58501 -44934 -220409 -319456 -146944 -308840 -181031 -193685 -160158 -206584
9872 -206584 -361534 290282 -127105 -43988 239535 91338 -149504 -21169 117955 88745
9862 88745 1696 -177528 -35518 240369 -4243 61950 143859 -183581 -109559 -95844 -415687
9851 -415687 -220674 -186895 -61464 4533 -321312 271726 -109919 -247709 105222 -17076 102063
9839 -301040 -115568 -383041 -231285 -267976 -38482 126488 111838 -71493 -577991 -7612 330214
9827 72433 -197767 58276 42512 181674 -199972 195083 37312 -322467 108657 190089 -299094
$$ packed form
9907A44899j4878a83156M9578A4999J04582B6576c24241I7537D084J19194a96365
9895c38330J12810Q0019f4487H0127b61942e4930D745N226c21100B2739b23471
9883B1559b71291E8501d4934j75475r9047a46944j61896J27809j2654L3527m6426
9872b06584j54950B90282a27105d3988B39535I1338a49504b1169A17955k9210
9862H8745A696a77528c5518B40369d243F1950Q1909a83581P4022J3715l19843
9851d15687J95013L3779f1464D533c21312B71726a09919j37790A05222a7076A02063
9839c01040a15568k67473J51756l6691c8482A26488j4650g1493n06498g612C30214
9827G2433a97767E8276j5764J39162a99972A95083C7312c22467A08657Q1432b99094
$$ plain form
9815 -13422 -237126 -7146 22247 33133 -125464 220318 -19953 -123305 -343459 13855 104349
9804 104349 -32419 234083 -97118 -78467 22761 88791 -225488 -34235 -101957 -179014 160247
9792 -88285 -252178 91541 -123316 -521827 45818 -167966 30088 -220260 -195017 54542 90878
9781 90878 25956 91678 -261039 -1403 20946 -8661 -64587 65426 -144123 -9442 -324599 129323
9768 178792 -237831 54841 -208578 -404646 -7478 -78788 270427 -14604 -95450 -37026 -175812
9757 -175812 117397 -83668 -384799 168307 -188811 -139434 207479 4591 -60396 40337 -38375
9745 -154363 3798 -123260 88787 -395814 -191130 -103846 7156 -46212 98073 122923 54974
9733 -14785 -49777 -76071 -298194 -2580 281265 189168 276100 -69775 91397 -332248 -110073
$$ packed form
9815a3422k23704g146B2247J0886a25464B20318a9953j03352k20154A3855R0494
9804A04349c2419B34083i7118J8651B2761O6030b25488c4235o7722p7057A60247
9792h8285j63893I1541a23316l98511D5818a67966C0088b20260K5243E4542L6336
9781I0878B5956O5722b61039a403B0946h661n5926F5426a44123i442l15157A29323
9768A78792b37831E4841b08578j96068g478p1310B70427a4604q0846c7026j38786
9757a75812A17397h3668l01131A68307a88811M9377B07479D591f0396D0337c8375
9745a54363C798a23260H8787c95814a91130Q7284G156d6212I8073K4850E4974
9733a4785l4992k6294k22123b580B81265r2097Q6932f9775I1397c32248a10073
$$ plain form
9721 22901 -215214 -376789 -18524 111891 231244 141108 12534 -21473 -286788 -263921 4047
9709 118196 -13994 97565 80830 -46916 -123807 -69385 -314757 -106985 -168044 -428169 202695
9697 -464850 -13852 -300214 271192 -228842 -58252 -150528 124421 -281319 -57141 -110381 216774
9685 -131395 173029 -534375 -77064 -77352 66314 10299 180129 40486 19034 97498 37877
9673 -58546 -266375 30766 -4971 -412817 243599 -251683 -443658 -172572 72651 -45833 306544
9661 -56111 98703 -314486 119203 39670 -81090 -225536 31498 -56045 -220181 69018 -176569
9649 -247611 -228717 -329757 -265659 64543 168896 -352505 -97506 -186402 114299 59295 -414431
9637 294515 -21281 -5015 -101654 -278099 -229545 -312212 89201 -29913 225166 -85434 -248859
$$ packed form
9721B2901b15214j61575a8524A11891J19353r0136A2534b1473k65315K2867D047
9709A18196a3994I7565j6735d6916p6891N4422k45372a06985o1059k60125B02695
9697d64850a3852k86362B71192b28842e8252r2276A24421b81319e7141n3240B16774
9685a31395A73029e34375g7064k88F6314A0299J69830D0486A9034P8464C7877
9673e8546k07829C0766d971m07846B43599b51683j91975a72572G2651d5833C06544
9661e6111I8703c14486A19203C9670h1090j44446C1498e6045j64136F9018a76569
9649b47611J8894j01040O4098F4543J04353c52505i7506q8896A14299n5004d14431
9637B94515b1281e015r6639j76445M8554q2667H9201b9913B25166h5434j63425
$$ plain form
9626 -248859 -168980 175056 -226546 182417 -115937 -124470 19418 -138759 75016 -366422 -86504
9614 -56662 -153659 -119588 -51235 -17391 -195923 -66142 148828 -183093 -16164 -184104 5475
9602 90744 1309 151263 -52164 -369919 90280 -130267 -307052 -114906 -129104 23133 140639
9591 140639 -199605 -187668 -40251 50871 -351096 109977 -435362 -291919 221439 124528
9581 124528 172459 -222992 6921 -24742 227657 -175497 119107 -62077 308038 -162108 -191249
9570 -191249 -203476 -176036 -90610 -306966 -8669 152796 -21197 -213992 -146079 148179 1614
9558 110044 -253143 85539 -259509 -190223 42750 -250275 224372 -141283 78257 -264119
9547 211334 -5036 301162 230406 47590 -221370 -68588 -85482 -38804 -169613 83933 55786
$$ packed form
9626b48859P9879A75056b26546A82417a15937q533A9418a38759G5016c66422h6504
9614e6662r6997L4071e1235a7391j78532f6142A48828a83093a6164j67940E475
9602I0744A309J49954e2164l17755I0280a30267j76785a14906j4198B3133J17506
9591A40639a99605J1937d0251E0871c51096A09977d35362J43443B21439r6911
9581A24528M7931b22992F921b4742B27657a75497A19107f2077C08038a62108k9141
9570a91249j2227K7440Q5426k16356h669A52796b1197j92795O7913A48179A614
9558A10044b53143H5539b59509O9286D2750b50275B24372a41283G8257b64119
9547B11334e036C01162p0756D7590b21370f8588j6894c8804j30809H3933k8147
$$ plain form
9536 55786 92024 -196532 137448 -389740 -9674 -81837 -56892 166741 259626 -275270 -141438
9525 -141438 158968 -260276 163840 -79115 -189956 152004 -57012 33806 102425 26706 -280570
9513 -12407 -138545 -226382 -229007 -378353 202347 -500466 232270 -140599 299567 157557
9503 157557 -318900 -70822 -278303 -91558 322237 7260 -409544 -71240 -237510 56608 55421
9492 55421 -272650 -547 -73245 -145718 65018 -182579 52493 -315812 293369 -53457 -53386 -68520
9480 -68520 162426 165352 -108606 -41849 166799 74621 -148833 52566 -171910 22652 -180274
9468 90686 50314 -101708 -236538 83499 184555 -159776 -73457 322464 -25264 -5331 -59938
9457 -59938 -197357 241083 4923 -61063 276215 -186625 -354897 -137123 22327 -143725 -177302
$$ packed form
9536E5786L6238a96532A37448c89740i674p2163K4945A66741R2885b75270J33832
9525a41438A58968b60276A63840g9115j10841A52004e7012C3806O8619B6706b80570
9513a2407j26138q7837k625j49346B02347e00466B32270a40599B99567j42010
9503A57557c18900g0822k07481i1558C22237G260d09544g1240j66270E6608j187
9492E5421b72650e47p2698p2473F5018a82579E2493c15812B93369e3457P1j5134
9480f8520A62426K926a08606d1849A66799G4621a48833E2566a71910B2652a80274
9468I0686m0372a01708j34830H3499J01056a59776g3457C22464b5264e331n4607
9457e9938j37419B41083D923f1063B76215a86625j68272a37123B2327a43725l3577
$$ plain form
9446 -177302 92076 224824 -21950 40771 -46413 -98678 -39511 -472178 -236132 -223844 -332193
9435 -332193 -252012 -201674 46715 57994 -280733 158073 162815 266175 84542 318256 15280
9423 428602 19263 -37892 268286 164716 -71638 -180797 -61517 75204 10759 30437 -76846
9411 2583 -336709 20031 -241104 -305065 438423 -22159 -152757 -253582 -185460 261452 -488454
9399 -457031 212123 67688 -185667 -15372 -323436 -303429 -173688 -305380 -36616 24653 -95864
9387 -313895 -65580 -88882 -307838 -44737 6446 -169592 -66828 -113593 11015 -96303 307144
9375 126364 -90197 45121 -274727 -81828 -107299 29579 -124876 113449 -111714 -127113 387140
9363 -139948 -166763 -10003 170983 89360 -233055 38052 -300576 -254128 125025 -157592 -93139
$$ packed form
9446a77302I2076J32748b1950D0771d6413n2265c9511m32667K36046J2288j08349
9435c32193Q0181N0338D6715J1279b80733A58073M742J03360H4542K33714A5280
9423D28602A9263c7892B68286j03570g1638j09159f1517G5204A0759J9678g6846
9411B583c36709B0031b41104o3961D38423b2159j30598j00825O8122B61452d88454
9399d57031B12123F7688a85667a5372l08064K0007J29741j31692c6616B4653i5864
9387c13895f5580k3302k18956d4737F446a69592f6828m6765A1015i6303C07144
9375A26364i0197D5121b74727h1828k5471B9579a24876A13449a11714j5399C87140
9363a39948k6815a0003A70983q1623b33055C8052c00576M6448A25025a57592O4453
$$ plain form
9352 -93139 155112 -34329 126800 171337 -186686 -115018 -177128 -151946 -32637 -82886 372671
9340 60943 -133496 -57897 49019 -260031 -9014 129907 -116883 -150356 -106699 -210678 -87696
9328 -181674 -126224 -152477 94028 12996 -262285 34061 -231185 212649 -27691 -111807 43129
9316 -59841 -21067 -63600 -69667 -269381 -360609 79296 -54651 248653 -120140 -228708 30114
9304 321979 -116894 79925 -121576 426776 140680 -64387 -261353 180779 -171504 -92811
9294 -92811 -264406 -188862 -286671 -261260 -209408 -241868 -134400 19154 -33474 85728 35320
9282 -49647 -46364 -85633 -11812 -461311 -247821 174576 86529 -450088 -344094 17768 44062
9271 44062 -225879 -1239 -80324 -87848 -195444 -169117 -179144 -76323 -238589 -301217 -252950 -335225
$$ packed form
9352i3139A55112c4329A26800M4537a86686P1668o2110K5182c2637n0249C72671
9340F0943a33496e7897D9019b60031i014A29907a16883l3473M3657j03979h7696
9328a81674N5450k6253I4028A2996b62285C4061b31185B12649b7691q4116D3129
9316e9841b1067m2533o067j99714r1228G9296e4651B48653a20140j08568C0114
9304C21979a16894G9925a21576D26776A40680f4387j96966A80779a71504P8693
9294i2811j71595P5544r7809K5411N1852l2460J07468A9154c3474H5728C5320
9282d9647L283l9269a1812m49499K13490A74576H6529d50088J05994A7768K6294
9271D4062b25879a239p9085p524j07596K6327j0027g6323j62266o2628M8267q2275
$$ plain form
9259 -335225 -177703 206097 94745 -277696 188784 -195439 -131160 -117509 94972 -492631
9248 460810 257737 -300763 -1787 -5638 -163578 24271 -101487 -26310 -488059 25696 279590
9237 279590 -386963 79836 -300049 -67983 229922 40884 -26769 -89488 -28411 91032 -239010
9225 -136324 -124517 77922 161501 27396 336089 -123472 -209603 -123334 -87833 -16239 -38314
9214 -38314 201369 -121416 -4728 -172462 -334182 -91351 -271628 -163473 25342 244367 -144796
9202 96377 1816 27796 31113 -310653 -108419 -146910 -248749 -77097 -343432 296633 191002
9191 191002 -13572 -23981 33198 -221320 -122116 -297344 -308939 -228770 -418587 -116849 69760
9179 -22070 71158 165203 224228 -9144 -183637 39634 127350 66763 -94807 -30212 145927 -153908
$$ packed form
9259c35225J57522B06097I4745b77696A88784a95439O4279J3651I4972d92631
9248D60810k03073c00763a787l851j57940B4271a01487b6310m61749B5696K53894
9237B79590c86963G9836c00049f7983B29922D0884b6769o2719b8411I1032b39010
9225a36324J1807G7922Q3579B7396L08693a23472q6131Q6269L5501a6239k2075
9214c8314B01369a21416d728j67734j61720i1351j80277J08155B5342K19025a44796
9202I6377A816K5980L317c10653a08419l8491j01839g7097k66335B96633j05631
9191A91002a3572j0409C3198b21320R9204j75228j1595Q0169j89817a16849F9760
9179b2070G1158R4045N9025i144j74493C9634Q7716o0587i4807c0212A45927a53908
$$ plain form
9166 -102511 -266690 -86154 50432 45039 -103377 284200 -48800 -154243 -200056 -124817 -138619
9155 -138619 -96557 100401 -73728 -282242 -223841 -188936 119170 -81992 -158281 -206448 -189462
9144 -189462 -67653 -83361 -146449 -3910 -27290 96477 -21724 -107104 -56129 46723 6615 27759
9132 27759 -222202 -53255 17398 -56712 8869 -152829 212837 116180 -242932 67461 -73995
9120 49327 -183959 17806 69306 -127003 39780 -162282 -48787 -135216 -398765 -314526 -99850
9108 -324693 -215500 57001 116341 261611 -176595 67830 -86004 26203 -53589 -270985 116815
9096 90670 107814 59609 -133337 -165141 -135475 108951 20276 -320243 -216549 -150743 -328541
9085 -328541 -52422 -204021 61554 23107 234213 35569 -383622 -123000 52863 -333938 181851
$$ packed form
9166a02511j64179h6154E0432n393a03377B84200d8800j05443m5813P5239j3802
9155a38619M2062A00401g3728k08514N8401L4905A19170h1992p6289m8167J6986
9144a89462f7653j5708o3088c910k3380I6477b1724q5380N0975D6723F615K1144
9132B7759b22202e3255A7398e6712H869a52829B12837r6657b42932F7461g3995
9120D9327a83959A7806N1500a27003C9780a62282d8787q6429k63549Q4239i9850
9108c24693J09193E7001N9340J45270a76595F7830h6004B6203e3589k17396A16815
9096I0670J7144m8205a33337l1804K9666A08951B0276c20243J03694O5806j77798
9085c28541e2422j51599F1554B3107K11106C5569c83622a23000E2863c33938A81851
$$ plain form
9073 137881 -13386 -80079 -283715 -93721 378462 -284258 -218420 -50708 -12059 -268033 -8330
9061 -74709 122915 -148763 -297205 28662 86405 -457 150059 -300031 -56777 -19851 227413
9049 14079 -470541 -258918 -25354 289166 -340871 243653 59331 -234580 -198311 -54314 -378061
9038 -378061 -135196 50465 -45477 -18397 -118788 347342 25982 83342 -157209 113648 -280109
9026 -89396 157279 -201740 6025 189018 15337 59522 -104180 48054 91685 168605 129454
9015 129454 -223740 142171 -52255 135781 34200 -454244 -134350 -282371 263713 115487
9004 -111121 -97718 -192629 -159372 -121292 266744 -16177 -26190 -61199 103585 248371 -49699
8992 -336745 -9152 38737 176163 -65764 195358 -375664 -275262 70726 -29299 -145979 -61859
$$ packed form
9073A37881a3386o6693k03636i3721C78462b84258O5838e0708a2059k55974h330
9061g4709A22915a48763j48442B8662N7743d57A50059c00031e6777a9851B27413
9049A4079d70541K11623b5354B89166c40871B43653E9331b34580L6269e4314l23747
9038c78061a35196E0465d5477a8397j00391C47342B5982N7360a57209A13648b80109
9026h9396A57279b01740F025J82993A5337M4185a04180D8054M3631P6920l9151
9015A29454b23740A42171e2255A35781C4200d54244a34350j48021B63713A15487
9004a11121J3403r4911L3257L8080B66744a6177j0013l5009A03585J44786d9699
8992c36745i152C8737J37426f5764A95358c75664J00402G0726b9299j16680f1859
$$ plain form
8980 16116 -139334 -128317 -134176 -282162 220199 -56919 -157151 91208 -76944 -18980 -281585
8969 -281585 -50293 -249376 -41486 63067 -135984 -393743 -327064 -112387 -229699 -32703 -210322
8958 -210322 52691 -276189 -119157 -15717 -100320 78713 284755 -120115 -140221 -267418 136732
8946 314755 -296613 -41975 -219573 144758 65699 213388 -462180 -30914 -87747 17539 -99308
8934 3553 -7641 52583 184599 -160965 -257611 -314360 -103245 109800 -188882 89156 187435
8923 187435 534049 975259 1125337 348030 269753 -222453 34360 -205516 -57212 -139787
8913 -139787 177480 322769 -170342 -422849 27567 -99753 85175 -117267 -103382 24362 28475
8902 28475 -195802 30377 -180157 -127047 133489 4536 21864 10559 157417 127329 40574
$$ packed form
8980A6116a39334J1017n859j47986B20199e6919j00232I1208g6944a8980k62605
8969b81585e0293j99083d1486F3067a35984k57759O6679a12387j17312c2703j77619
8958b10322E2691b76189a19157a5717q4603G8713K06042a20115k0106j27197A36732
8946C14755b96613d1975j77598A44758F5699J47689d62180c0914n6833A7539i9308
8934C553g641E2583J32016a60965r6646n6749a03245A09800a88882H9156R8279
8923A87435L46614M41210J50078C48030p8277b22453C4360b05516e7212q2575
8913a39787A77480J45289a70342k52507B7567i9753H5175a17267J3885B4362M113
8902B8475a95802C0377a80157N3110A33489D536J7328A0559J46858l0088D0574
$$ plain form
8890 64799 185918 149455 216247 116860 -90353 76763 66281 185981 2230 270393 69582
8878 -49886 -104202 -289046 -123546 64487 100854 -153023 -138436 91713 -119140 -242397 62757
8866 167506 30181 118374 -100549 -377999 -207892 -279112 307903 39630 -225519 101671
8855 139826 -93200 -68873 -62749 18733 -107946 -148473 -327576 90896 -19168 85814 65716
8844 65716 -56456 -138296 -76281 -76174 151548 -24368 -317358 -91416 -286782 -353242 -312485 -147905
$$ packed form
8890F4799J21119l6463O6792r9387i0353G6763j0482J19700B230K68163F9582
8878d9886n4316j84844a23546F4487L6367a53023J4587I1713a19140j23257F2757
8866A67506C0181Q8193a00549k77450J70107p1220C07903C9630b25519A01671
8855A39826i3200K4327O124A8733a07946m0527j79103I0896a9168H5814k0098
8844F5716e6456q1840O2015J07A51548b4368k92990i1416j95366o6460M0757a47905
$$ [...]
##END NTUPLES=NMR SPECTRUM
##END=
