##TITLE=AC1466_CTIAA13297_8011847_UUfE9WZPqj
##JCAMPDX= 6.0         $$ Bruker NMR JCAMP-DX V2.0
##DATA TYPE= NMR SPECTRUM
##DATA CLASS= NTUPLES
##ORIGIN= BRUKER
##OWNER= Administrator
$$ 1.72 TOPSPIN		Version 2.1
$$ 2013-07-05 23:25:18.234 -0700  Administrator@X
$$ Compression mode = diff/dup
##.OBSERVE FREQUENCY= 400.02188249412
##.OBSERVE NUCLEUS= ^1H
##.ACQUISITION MODE= SIMULTANEOUS (DQD)
##.ACQUISITION SCHEME= undefined
##.AVERAGES= 64
##.DIGITISER RES= 22
##SPECTROMETER/DATA SYSTEM= spect
##.PULSE SEQUENCE= noesygpps1d.comp
##.SOLVENT NAME= COFFEE_meoh
##.SHIFT REFERENCE= INTERNAL, COFFEE_meoh, 1, 14.96088
##AUDIT TRAIL= $$ (NUMBER, WHEN, WHO, WHERE, PROCESS, VERSION, WHAT)
$$ ##TITLE= Audit trail, TOPSPIN		Version 2.1
$$ ##JCAMPDX= 5.01
$$ ##ORIGIN= Bruker BioSpin GmbH
$$ ##OWNER= Administrator
$$ $$ E:\/data/COFFEE/nmr/AC1466_CTIAA13297_8011847_UUfE9WZPqj/12/pdata/1/auditp.txt
$$ ##AUDIT TRAIL=  $$ (NUMBER, WHEN, WHO, WHERE, PROCESS, VERSION, WHAT)
(   1,<2013-07-05 23:25:12.765 -0700>,<Administrator>,<X>,<go>,<TOPSPIN 2.1>,
      <created by zg
	started at 2013-07-05 23:13:42.609 -0700,
	POWCHK enabled, PULCHK disabled,
       configuration hash MD5:
       C8 4E 4E 5D D3 5C D8 9E 9F 52 82 E0 59 8A DE 15
       data hash MD5: 64K
       C2 16 DE B1 87 92 A6 52 46 27 DE 24 54 71 4F C1>)
(   2,<2013-07-05 23:25:15.875 -0700>,<Administrator>,<X>,<proc1d>,<TOPSPIN 2.1>,
      <Start of raw data processing
       efp LB = 0.3 FT_mod = 6 PKNL = 1 PHC0 = 0 PHC1 = 0 SI = 128K 
       data hash MD5: 128K
       68 AB 9A 79 FF 4F 61 93 63 00 15 78 6C 47 C7 53>)
(   3,<2013-07-05 23:25:16.969 -0700>,<Administrator>,<X>,<proc1d>,<TOPSPIN 2.1>,
      <pk PHC0 = -82.40295 PHC1 = 0 
       data hash MD5: 128K
       48 F1 71 AF C8 B4 A0 EE C0 91 6B D0 77 48 F3 66>)
(   4,<2013-07-05 23:25:17.609 -0700>,<Administrator>,<X>,<proc1d>,<TOPSPIN 2.1>,
      <abs ABSG = 1 
       data hash MD5: 128K
       10 0E A7 34 E1 9E 1E 41 E7 BF 6B 07 DB 61 48 D1>)
(   5,<2013-07-05 23:25:17.750 -0700>,<Administrator>,<X>,<proc1d>,<TOPSPIN 2.1>,
      <abs ABSG = 2 
       data hash MD5: 128K
       75 74 10 2C DB C9 EC 3A 3D 8C 65 A8 F7 E7 37 AE>)
(   6,<2013-07-05 23:25:17.828 -0700>,<Administrator>,<X>,<proc1d>,<TOPSPIN 2.1>,
      <abs ABSG = 3 
       data hash MD5: 128K
       2E 3A 1F 7A 84 30 4C 75 54 20 1E EF CF D2 C8 A1>)
(   7,<2013-07-05 23:25:17.937 -0700>,<Administrator>,<X>,<proc1d>,<TOPSPIN 2.1>,
      <abs ABSG = 4 
       data hash MD5: 128K
       13 D3 4E 7E 63 DE E3 D3 2B 60 9F 49 AB 89 52 C2>)
(   8,<2013-07-05 23:25:18.031 -0700>,<Administrator>,<X>,<proc1d>,<TOPSPIN 2.1>,
      <abs ABSG = 5 
       data hash MD5: 128K
       D4 1D 17 96 72 4C 50 1D CC 43 01 A4 59 39 52 FA>)
$$ ##END=
$$ 
$$ $$ hash MD5
$$ $$ 6C 6B 41 E7 3E CF DF 18 15 F1 AC 7B B5 AD 2F 21
##$RELAX= 
##$RELAX= 
##$RELAX= 
##$RELAX= 
##$RELAX= 
##$RELAX= 
##$RELAX= 
##$RELAX= 
$$ Bruker specific parameters
$$ --------------------------
##$DU= <E:\>
##$EXPNO= 12
$$ [...]
##$TP07= 0
##$TPNAME0= <>
##$TPNAME1= <>
##$TPNAME2= <>
##$TPNAME3= <>
##$TPNAME4= <>
##$TPNAME5= <>
##$TPNAME6= <>
##$TPNAME7= <>
##$TPOAL= (0..7)
0.5 0.5 0.5 0.5 0.5 0.5 0.5 0.5
##$TPOFFS= (0..7)
0 0 0 0 0 0 0 0
##$TUNHIN= 0
##$TUNHOUT= 0
##$TUNXOUT= 0
##$USERA1= <user>
##$USERA2= <user>
##$USERA3= <user>
##$USERA4= <user>
##$USERA5= <user>
##$V9= 5
##$VALIST= <valist>
##$VCLIST= <CCCCCCCCCCCCCCC>
##$VD= 0
##$VDLIST= <DDDDDDDDDDDDDDD>
##$VPLIST= <PPPPPPPPPPPPPPP>
##$VTLIST= <TTTTTTTTTTTTTTT>
##$WBST= 1024
##$WBSW= 4
##$XGAIN= (0..3)
0 0 0 0
##$XL= 0
##$YL= 0
##$YMAX_a= 6207123
##$YMIN_a= -12123959
##$ZGOPTNS= <>
##$ZL1= 120
##$ZL2= 120
##$ZL3= 120
##$ZL4= 120
##$ABSF1= 14.96088
##$ABSF2= -5.597301
##$ABSG= 5
##$ABSL= 3
##$ALPHA= 0
##$AQORDER= 0
##$ASSFAC= 0
##$ASSFACI= 0
##$ASSFACX= 0
##$ASSWID= 0
##$AUNMP= <proc_prof1d_extract.lims>
##$AXLEFT= 0
##$AXNAME= <>
##$AXNUC= <1H>
##$AXRIGHT= 0
##$AXTYPE= 0
##$AXUNIT= <>
##$AZFE= 0.1
##$AZFW= 0.1
##$BCFW= 0
##$BC_mod= 0
##$BYTORDP= 0
##$COROFFS= 0
##$CY= 15
##$DATMOD= 1
##$DC= 0
##$DFILT= <>
##$DTYPP= 0
##$F1P= 0
##$F2P= 0
##$FCOR= 0.5
##$FTSIZE= 131072
##$FT_mod= 6
##$GAMMA= 0
##$GB= 0
##$INTBC= 1
##$INTSCL= 1
##$ISEN= 128
##$LB= 0.3
##$LEV0= 0
##$LPBIN= 0
##$MAXI= 10000
##$MC2= 0
##$MEAN= 0
##$ME_mod= 0
##$MI= 0
##$NCOEF= 0
##$NC_proc= -2
##$NLEV= 6
##$NOISF1= 0
##$NOISF2= 0
##$NSP= 0
##$NTH_PI= 0
##$NZP= 0
##$OFFSET= 14.96088
##$PC= 1
##$PHC0= -82.40295
##$PHC1= 0
##$PH_mod= 1
##$PKNL= yes
##$PPARMOD= 0
##$PPDIAG= 0
##$PPIPTYP= 0
##$PPMPNUM= 2147483647
##$PPRESOL= 1
##$PSCAL= 4
##$PSIGN= 0
##$PYNMP= <proc.py>
##$REVERSE= no
##$SF= 400.020009684771
##$SI= 131072
##$SIGF1= 0
##$SIGF2= 0
##$SINO= 400
##$SIOLD= 131072
##$SPECTYP= <>
##$SREGLST= <1H.CDCl3>
##$SSB= 0
##$STSI= 131072
##$STSR= 0
##$SW_p= 8223.68421052631
##$SYMM= 0
##$S_DEV= 0
##$TDeff= 65536
##$TDoff= 0
##$TI= <>
##$TILT= no
##$TM1= 0
##$TM2= 0
##$TOPLEV= 0
##$USERP1= <user>
##$USERP2= <user>
##$USERP3= <user>
##$USERP4= <user>
##$USERP5= <user>
##$WDW= 1
##$XDIM= 131072
##$YMAX_p= 418991053
##$YMIN_p= -12320
##$CURPLOT= <Network HP LaserJet P1505>
##$CURPRIN= <$Network HP LaserJet P1505>
##$DFORMAT= <normdp>
##$LAYOUT= <+/1D_H.xwp>
##$LFORMAT= <normlp>
##$PFORMAT= <normpl>
##$SURQMSG= 1
$$ End of Bruker specific parameters
$$ ---------------------------------
##NTUPLES= NMR SPECTRUM
##VAR_NAME=  FREQUENCY,     SPECTRUM/REAL,   SPECTRUM/IMAG
##SYMBOL=    X,             R,               I
##VAR_TYPE=  INDEPENDENT,   DEPENDENT,       DEPENDENT
##VAR_FORM=  AFFN,          ASDF,            ASDF
##VAR_DIM=   131072,        131072,          131072
##UNITS=     HZ,            ARBITRARY UNITS, ARBITRARY UNITS
##FACTOR=    0.0627417313425164, 1,          1
##FIRST=     8223.62146879497, -174,         -56391
##LAST=      0,             2878,            -56611
##MIN=       0,             -12320,          0
##MAX=       8223.62146879497, 418991053,    0
$$ Real data points
##PAGE= N=1
##DATA TABLE= (X++(R..R)), XYDATA
$$ [...]
63932D412617Q4085N0927J7074j6911n0287q2367j12736j40859j65793j86557
63922C809193k02559k13425k18766k18659k14222k07087j98183j87322j74137
63913A974833j59139j43510j28159j13263r8842q5366p3542o3576n4949m7046
63903A007441l9850l3895k9626k6960k5320k4009k2562k1014j9765j9065j8671
63892G26704j8097j7145j5950j4623j3152j1618j0163q658o743m307j670Q38L231
63879F08647N665Q192J0826J3552J6133J8228J9952K1897K4315K6599K8026K8704
63867H30736K9269K9850K9907K9132K7910K6679K5284K3263K0499J7243J3657
63856A103429R639N196P89k981o097r318j3366j7983k2103k5049k7224k9417l1764
$$ plain form
63932 4412617 4496702 4547629 4564703 4547792 4497505 4415138 4302402 4161543 3995750 3809193
63922 3809193 3606634 3393209 3174443 2955784 2741562 2534475 2336292 2148970 1974833
63913 1974833 1815694 1672184 1544025 1430762 1331920 1246554 1173012 1109436 1054487 1007441
63903 1007441 967591 933696 904070 877110 851790 827781 805219 784205 764440 745375 726704
63892 726704 708607 691462 675512 660889 647737 636119 625956 617298 610555 606248 604578 605416 608647
63879 608647 614312 622504 633330 646882 663015 681243 701195 723092 747407 774006 802032 830736
63867 830736 860005 889855 919762 948894 976804 1003483 1028767 1052030 1072529 1089772 1103429
63856 1103429 1113068 1118264 1119053 1116072 1109975 1100657 1087291 1069308 1047205 1022156 994932 965515 933751
63843I33751l3767l5067l5778l6158l6262l5985l5239l4051l2596l1020k9194
63832E58634k6887k4314k2143k0703j9558j8194j6721j5467j4312j3017j1841
63821C55477j1143j0578r522q097o949o129n114l963l422l621l712l191k652k689
63807B74695k928k851k754l063l337k894k026j632j870k118k041j900j837j646
63793B41798j378j394j717j959j988k102k362k391k009j546j285j102q01m41j03
63778B19220J62M1p49j672j560j07J365J359J4j210j419j054q24p13l77J28M42
63761B13046M64L57J83q1l03k58O4M45P48R83J089R09N19L44P40J463J796J272
63743B23780K63k82K30J410K310K454K233K196K294K118J646J269J134R75Q10
$$ plain form
63843 933751 899984 864917 829139 792981 756719 720734 685495 651444 618848 587828 558634
63832 558634 531747 507433 485290 464587 445029 426835 410114 394647 380335 367318 355477
63821 355477 344334 333756 324234 316137 309188 303059 297945 293982 290560 286939 283227 280036 277384 274695
63807 274695 271767 268916 266162 263099 259762 256868 254842 253210 251340 249222 247181 245281 243444 241798
63793 241798 240420 239026 237309 235350 233362 231260 228898 226507 224498 222952 221667 220565 219764 219323 219220
63778 219220 219382 219423 218674 217002 215442 215335 216700 218059 218073 216863 215444 214390 213566 212853 212476 212604 213046
63761 213046 213510 213867 214050 213969 213666 213408 213472 213917 214665 215648 216737 217646 218165 218509 219249 220712 222508 223780
63743 223780 224043 223761 223991 225401 227711 230165 232398 234594 236888 239006 240652 241921 243055 244030 244840
63728B44840J169K310L576M066L723L321L466M056M613M716M123K927J633P53
63714B89292J53p49k130l374l800l437k872k541k344j896r97J21R92J402J567
63699B69387J808K164K540K974L467L776L736L576L445K925J693M58L79J391K087
63684C05806J572N93K76N31M19l82j320j839j802j223k93M76O52M64M76P29P33
63667C05868K47m00q32j007j035j021j097j319j524j588j777k465l457m005l641
63652B80947k748k106k079k325k206j445l83M62J036J696K550L232L531L744M085
63637B87991M222L898L602L970M796N427N869O707P946Q901R386J0077J1309J2395
63623C86496J2718J2850J3824J5731J7725J9254K0521K1825K3090K4188K5268
$$ plain form
63728 244840 246009 248319 251895 255961 259684 263005 266471 270527 275140 279856 283979 286906 288539 289292
63714 289292 289445 288696 286566 283192 279392 275955 273083 270542 268198 266302 265305 265426 266418 267820 269387
63699 269387 271195 273359 275899 278873 282340 286116 289852 293428 296873 299798 301491 301949 302328 303719 305806
63684 305806 307378 307971 308247 308778 309197 308815 307495 305656 303854 302631 302338 302814 303466 303930 304406 305135 305868
63667 305868 306115 305715 304883 303876 302841 301820 300723 299404 297880 296292 294515 292050 288593 284588 280947
63652 280947 278199 276093 274014 271689 269483 268038 267655 268117 269153 270849 273399 276631 280162 283906 287991
63637 287991 292213 296111 299713 303683 308479 313906 319775 326482 334428 343329 352715 362792 374101 386496
63623 386496 399214 412064 425888 441619 459344 478598 499119 520944 544034 568222 593490
63612E93490K6533K7955K9282L0161L0172K8913K6124K1764J6087R799L941p77
63600H43444m476p644j0236j1620j1568j0889j0732j1491j2786j4324j6256j8607
63588G02815k0874k2483k3395k3908k4025k3396k1850j9669j7296j5015j2973
63577D77931j1233r659p910n721l138m56J971L891N246O191O916P542Q182Q995
63563D88748R981J0947J1864J3071J4742J6427J7633J8697K0508K3312K6495K9484
63551G01909L2145L4195L5122L5043L4663L3779L0669K3850J4029L535n645j2581
63539I60713j6783j8165j7547j6228j4848j3349j1981j1454j2023j3207j4681
63528H00447j6741j9617k2999k6464k9781l2396l3235l1664k8426k5197k3194
$$ plain form
63612 593490 620023 647978 677260 707421 737593 766506 792630 814394 830481 840280 844221 843444
63600 843444 838968 831324 821088 809468 797900 787011 776279 764788 752002 737678 721422 702815
63588 702815 681941 659458 636063 612155 588130 564734 542884 523215 505919 490904 477931
63577 477931 466698 457039 449129 443408 440270 439814 441785 445676 450922 457113 464029 471571 479753 488748
63563 488748 498729 509676 521540 534611 549353 565780 583413 602110 622618 645930 672425 701909
63551 701909 734054 768249 803371 838414 873077 906856 937525 961375 975404 978939 973294 960713
63539 960713 943930 925765 908218 891990 877142 863793 851812 840358 828335 815128 800447
63528 800447 783706 764089 741090 714626 684845 652449 619214 587550 559124 533927 510733
63517E10733k2328k1549j9882j7268j4482j2155j0198q363p046o871p535p856
63505C55200p147n944n101m730m363l737k915j950r23k16k87j104j965k026j098
63490C11694P7N22J57K2R88K537L352L022K533K829L593L802L129K200J698J627
63474C43782J547J228Q25M34k95j755l541m478l852k341j316j345j874k124j802
63459C23093j020j17N08P98J237K204L315M042M697O019P770Q780Q575Q200R000
63444C87101J1246J4291J7427K0193K2342K3985K5474K6925K8188K9071K9106
63433F35349K7199K2587J6311J0773P426N798N110N713Q171J1929J5896J9706
63421G91968K3559K7328L0678L3519L5467L5419L2571K7489K1294J4314O464j473
$$ plain form
63517 510733 488405 466856 446974 429706 415224 403069 392871 384508 377462 370591 363056 355200
63505 355200 348053 342109 337008 332278 327915 324178 321263 319313 318390 318174 317887 316783 314818 312792 311694
63490 311694 311771 312293 312450 312472 313460 315997 319349 322371 324904 327733 331326 335128 338257 340457 342155 343782
63474 343782 345329 346557 347382 347816 347521 345766 342225 337747 333895 331554 330238 328893 327019 324895 323093
63459 323093 322073 321956 322464 323262 324499 326703 330018 334060 338757 344776 352546 361326 369901 378101 387101
63444 387101 398347 412638 430065 450258 472600 496585 522059 548984 577172 606243 635349
63433 635349 662548 685135 701446 712219 719645 725443 730553 736266 744437 756366 772262 791968
63421 791968 815527 842855 873533 907052 942519 977938 1010509 1037998 1059292 1073606 1080070 1078597
63409A078597q122j2886j5995j7458j7110j5707j4790j5188j6575j8498k1010
63398I05258k4018k6991k9638l1976l3584l3690l2367l0685k9223k7356k4605
63387E81125k1708j9469j7333j4255j0571p759o331n122k916K3K500L879M529
63374D86592N178O384Q396J1082J3900J6295J8216K0057K2072K4099K5919K7649
63362F85839K9525L1461L3073L4127L4724L5024L4817L3504L0409K5318J8798
63351A026619J1922N454n60o240j1097j4260j5454j5384j5084j5142j5671j6639
63339I18464j8081k0105k2764k5754k8361l0103l1147l1677l0995k8172k3602
63328F27703j9012j5583j2886j0095p325n107l419k251k563n401j0183j4867j7917
$$ plain form
63409 1078597 1070475 1057589 1041594 1024136 1007026 991319 976529 961341 944766 926268 905258
63398 905258 881240 854249 824611 792635 759051 725361 692994 662309 633086 605730 581125
63387 581125 559417 539948 522615 508360 497789 490030 483699 478577 475661 475684 478184 482063 486592
63374 486592 491770 498154 506550 517632 531532 547827 566043 586100 608172 632271 658190 685839
63362 685839 715364 746825 779898 814025 848749 883773 918590 952094 982503 1007821 1026619
63351 1026619 1038541 1043995 1043435 1037195 1026098 1011838 996384 981000 965916 950774 935103 918464
63339 918464 900383 880278 857514 831760 803399 773296 742149 710472 679477 651305 627703
63328 627703 608691 593108 580222 570127 562802 557695 554276 552025 549462 544061 533878 519011 501094
63315E01094j9294j9490j8637j6866j4769j2925j1360r866q487p373o408n335
63303C50284m208l440l346l682l752l138k274j986k355k461j602l84j1p29j579
63288C15337j722j380j313j754k208k154j717j493j733j873j287l36q9q33j540
63273B93905j279m03K46P00J475K317K435J834J322J174Q55L21M95J879L528M116
63257C14920L502K558J937J664J764K459L642M673N040M995N285O266P477Q221
63243C74403Q449Q743R443J0267J0971J1937J3630J5715J7325J8170J8842J9944
63231E37839K1309K2214K2138K1237K0179J9569J9384J9158J8744J8505J8632
63220G58908J8764J8648J8604J8840J8816J7963J6554J5035J2932R443M860K68
$$ plain form
63315 501094 481800 462310 443673 426807 412038 399113 387753 377887 369400 362027 355619 350284
63303 350284 346076 342636 339290 335608 331856 328718 326444 324458 322103 319642 318040 317656 317645 316916 315337
63288 315337 313615 312235 310922 309168 306960 304806 303089 301596 299863 297990 296703 296367 296278 295445 293905
63273 293905 292626 292223 292469 293169 294644 296961 299396 301230 302552 303726 304581 304902 305397 307276 310804 314920
63257 314920 318422 320980 322917 324581 326345 328804 332446 337119 342159 347154 352439 358705 366182 374403
63243 374403 382852 391595 401038 411305 422276 434213 447843 463558 480883 499053 517895 537839
63231 537839 559148 581362 603500 624737 644916 664485 683869 703027 721771 740276 758908
63220 758908 777672 796320 814924 833764 852580 870543 887097 902132 915064 924507 929367 929635
63208I29635m045q788j4090j8916k2396k4768k6544k7580k7503k6394k4539k2041
63196F82031j9078j6042j3100j0078o978m073j330J553M408O640Q295J0228J2798
63183F55274J5216J6637J7175J7299J7081J6694J6826J7753J8607J8423J7432
63172H44417J6496J5718J4566J3009J1540J0147Q161N191J517k523o904j1568
63160I19767j6180k0348k3889k6835k9311l1223l2032l1261k9424k7796k6907
63149F24561k5803k3476k0357j7649j5640j3718j1674r928q520o915n024l532
63137D62325k899k750k499k023j419p37j76j1l8L38J191J733J407Q18J095K458
63121D58813L913M403L905L270L182L435L323K626J971K032K665L131L010K545
$$ plain form
63208 929635 925590 916802 902712 883796 861400 836632 810088 782508 755005 728611 704072 682031
63196 682031 662953 646911 633811 623733 616755 612682 611352 612905 617313 623953 632248 642476 655274
63183 655274 670490 687127 704302 721601 738682 755376 772202 789955 808562 826985 844417
63172 844417 860913 876631 891197 904206 915746 925893 934054 939245 940762 938239 931335 919767
63160 919767 903587 883239 859350 832515 803204 771981 739949 708688 679264 651468 624561
63149 624561 598758 575282 554925 537276 521636 507918 496244 486316 477796 470881 465857 462325
63137 462325 459426 456676 454177 452154 450735 449998 449822 449811 449773 450111 451302 453035 454442 455260 456355 458813
63121 458813 462726 467129 471034 474304 477486 480921 484244 486870 488841 490873 493538 496669 499679 502224
63107E02224K145J950J917J916J692J064K87q6J30N10M98k8q00j473j760j508
63091E08678q81l12r4n6J69O42J025J134J346K294L988N510N897N307M883N383
63075E44913O314O741O551O431O839P506Q022Q394Q909R765J1033J2719J4668
63062F58805J6564J8243J9867K1715K3889K6332K9010L1914L4835L7300L9024
63051I57498M0405M2350M5283M8466N0608N1154N0607M9684M8682M7794M7393
63040A479924M7537M7660M7228M6482M5972M5616M4743M2909M0198L6684L2093
63029A957046K6006J8179Q730j675j1984k1540l0569l9499m7960n4932n9755o2481
63017A679566o3247o2035n9123n5204n0703m5444l9194l2246k5218j8550j2345
$$ plain form
63107 502224 504369 506319 508236 510152 511844 512908 513195 513109 513239 513749 514247 514219 513419 511946 510186 508678
63091 508678 507797 507485 507391 507335 507504 508146 509171 510305 511651 513945 517933 523443 529340 534647 539530 544913
63075 544913 551227 557968 564519 570950 577789 585295 593317 601711 610620 620385 631418 644137 658805
63062 658805 675369 693612 713479 735194 759083 785415 814425 846339 881174 918474 957498
63051 957498 997903 1040253 1085536 1134002 1184610 1235764 1286371 1336055 1384737 1432531 1479924
63040 1479924 1527461 1575121 1622349 1668831 1714803 1760419 1805162 1848071 1888269 1924953 1957046
63029 1957046 1983052 2001231 2009961 2008286 1996302 1974762 1944193 1904694 1856734 1801802 1742047 1679566
63017 1679566 1616319 1554284 1495161 1439957 1389254 1343810 1304616 1272370 1247152 1228602 1216257
63006A216257o398l20O037J2105J6981K0432K3172K5953K8737L1027L2585L3503
62994A440071L3855L3677L3176L2632L2153L1662L0913K9449K6796K2942J8310
62983A765636J3121P107K05o952j3756k0588k8301l6796m4713n0772n4854n7539
62971A471798n9088n9361n8406n6513n3766n0094m5872m1988l8981l6407l3464
62960I37858l0092k7049k4921k3486k2197k0902j9824j9096j8637j8311j7903
62949F95440j7075j5722j4300j3375j2877j2193j1096j0054r461r012q240p306
62937E54729o750o582o260n516m710m161l612k718j713j160j151j275j323j595
62923E06203k229k693k302j158j82j68j019j975k398k229j833j604j677j921k145
$$ plain form
63006 1216257 1209859 1209539 1215576 1227681 1244662 1265094 1288266 1314219 1342956 1373983 1406568 1440071
62994 1440071 1473926 1507603 1540779 1573411 1605564 1637226 1668139 1697588 1724384 1747326 1765636
62983 1765636 1778757 1785864 1786069 1779117 1765361 1744773 1716472 1679676 1634963 1584191 1529337 1471798
62971 1471798 1412710 1353349 1294943 1238430 1184664 1134570 1088698 1046710 1007729 971322 937858
62960 937858 907766 880717 855796 832310 810113 789211 769387 750291 731654 713343 695440
62949 695440 678365 662643 648343 634968 622091 609898 598802 588748 579287 570275 562035 554729
62937 554729 547979 541397 535137 529621 524911 520750 517138 514420 512707 511547 510396 509121 507798 506203
62923 506203 503974 501281 498979 497821 497639 497471 496452 494477 492079 489850 488017 486413 484736 482815 480670
62908D80670k266k254k091j805j552j488j607j727j684j410r30l26K65P10Q86
62893D63391O57N6m53l10L48N81j97j307j578q38N6N32Q46J239J425J242J070
62876D66760J095Q57L6p92r63p70j032j877k647k890k681k119j182j98K04j77
62860D51624q75j326j337q94j7J063J915K285K187J638O59l52p20k47M17M54k23
62843D56251j007j366j338j292j417j595j671j691j756j761j538j139p61l54L09
62828D37874J072J348Q94K64J33M97R34J357J969K660L049L115L247L650M015
62813D66078M000L690L515L849M675N556O014O058O131O458O803P093P676Q577
62799E46173R057Q640Q112Q630J0137J1632J2841J4576J7315K0518K3736K7364
$$ plain form
62908 480670 478404 476150 474059 472254 470702 469214 467607 465880 464196 462786 461856 461530 461795 462505 463391
62893 463391 464048 464104 463651 463341 463689 464270 464073 462766 461188 460350 460406 460938 461784 463023 464448 465690 466760
62876 466760 467855 468712 468748 467956 466993 466223 465191 463314 460667 457777 455096 452977 451795 451597 451801 451624
62860 451624 450749 449423 448086 447192 447175 448238 450153 452438 454625 456263 456922 456570 455850 455603 456020 456474 456251
62843 456251 455244 453878 452540 451248 449831 448236 446565 444874 443118 441357 439819 438680 437919 437565 437874
62828 437874 438946 440294 441188 441452 441585 442082 443016 444373 446342 449002 452051 455166 458413 462063 466078
62813 466078 470078 473768 477283 481132 485807 491363 497377 503435 509566 516024 522827 529920 537596 546173
62799 546173 555230 563870 571982 580612 590749 602381 615222 629798 647113 667631 691367 718731
62787G18731L1795L6524M0828M4809M9103N3910N8793O3284O7213P0599P3551
62776A309140P6098P7914P8351P6909P3441O7855N9998N0021L8507K6059J3011
62765A947304l49j3648k6606l8871m9651n8101o4291o9174p3242p5856p6296p4903
62753A326316p2636o9967o6800o3140n9115n4679m9810m4954m0665l6973l3507
62742G34070l0129k6985k4034k1019j7906j4996j2636j1069j0347j0100r574q282
62730E36993o519m905l623k408j108J18J055J549J538J351J661K785M249N500
62716E38236O781Q692J1153J3471J5348J7166J9257K1542K3954K6604K9429L2235
62704G63868L5224L8849M3036M7130N0751N4214N7826O1330O4387O6928O8732
$$ plain form
62787 718731 750526 787050 827878 872687 921790 975700 1034493 1097777 1164990 1235589 1309140
62776 1309140 1385238 1463152 1541503 1618412 1691853 1759708 1819706 1869727 1908234 1934293 1947304
62765 1947304 1946955 1933307 1906701 1867830 1818179 1760078 1695787 1626613 1553371 1477515 1401219 1326316
62753 1326316 1253680 1183713 1116913 1053773 994658 939979 890169 845215 804550 767577 734070
62742 734070 703941 676956 652922 631903 613997 599001 586365 575296 564949 554849 545275 536993
62730 536993 530474 525569 521946 519538 518430 518548 519603 521152 522690 524041 525702 528487 532736 538236
62716 538236 545017 553709 564862 578333 593681 610847 630104 651646 675600 702204 731633 763868
62704 763868 799092 837941 880977 928107 978858 1033072 1090898 1152228 1216615 1283543 1352275
62693A352275O9159O7776O4746O0178N3621M4762L4166K2676J0464k522j5553
62682A761748k7510l8210m8308n7685o4940o9011p0527p0864p0419o8595o5235
62671A110444o1164n7245n3522m9574m5324m1162l7417l4025l0681k7318k4290
62660F48722k2003k0329j8620j6458j4237j2697j2074j1956j1814j1345j0381
62649D86808q956p479o386n542m465l241k607k836l137k644j512n30rK48J78n20
62633D37370j633k426k558k369k125j589o58J15J22m89j013r90m96J62O89Q66
62617D22978P48Q11J604L166M902O043O209N612M923M911O004Q005J0279J2234
62603D98429J3728J4996J6333J7885J9817K2370K5542K8790L1431L3440L5407
$$ plain form
62693 1352275 1421434 1489210 1553956 1614134 1667755 1712517 1746683 1769359 1779823 1777301 1761748
62682 1761748 1734238 1696028 1647720 1590035 1525095 1456084 1385557 1314693 1244274 1175679 1110444
62671 1110444 1049280 992035 938513 888939 843615 802453 765036 731011 700330 673012 648722
62660 648722 626719 606390 587770 571312 557075 544378 532304 520348 508534 497189 486808
62649 486808 477852 470373 463987 458445 453980 450739 448132 445296 442159 439515 438003 437473 437464 437712 437890 437370
62633 437370 435737 433311 430753 428384 426259 424670 424012 424127 424249 423760 422747 421757 421261 421423 422112 422978
62617 422978 423726 424537 426141 429307 434209 440252 446461 452073 456996 461907 467911 475916 486195 498429
62603 498429 512157 527153 543486 561371 581188 603558 629100 657890 689321 722761 758168
62592G58168L7522L9029L9019L7472L4987L1784K7537K2056J5641Q703J605n189
62580A048334j1360j7136k2868k8113l1781l3487l4121l4720l5226l4869l3395
62569G31258l1328k9250k7297k5357k3299k1045j8647j6344j4377j2749j1278
62558E00287r821q398p183o425o195o119n613m512l274k430k023j721j265o28
62544D34680P5N71N03k22j173j660j356n66O1J43l6J66R83J898K355K591L422
62527D42435N190P394R399J1097J2718J4394J6207J8346K0950K3871K6736K9205
62515F37942L1160L2865L4788L7056L9161M0469M0901M0636L9378L6529L2073
62504A042958K6639K0703J4389Q041K135l491r373j5025j8823j9803j8804j7166
$$ plain form
62592 758168 795690 834719 873738 911210 946197 977981 1005518 1027574 1043215 1051918 1053523 1048334
62580 1048334 1036974 1019838 996970 968857 937076 903589 869468 834748 799522 764653 731258
62569 731258 699930 670680 643383 618026 594727 573682 555035 538691 524314 511565 500287
62558 500287 490466 482068 474885 468460 462265 456146 450533 446021 442747 440317 438294 436573 435308 434680
62544 434680 434755 435326 435829 435607 434434 432774 431418 430852 430913 431056 431020 431186 432169 434067 436422 439013 442435
62527 442435 447625 455019 464418 475515 488233 502627 518834 537180 558130 582001 608737 637942
62515 637942 669102 701967 736755 773811 812972 853441 894342 934978 974356 1010885 1042958
62504 1042958 1069597 1090300 1104689 1112730 1114865 1111374 1102001 1086976 1068153 1048350 1029546 1012380
62492A012380j5117j2228q690n083j355K904P355J1174J4242J7169K0066K2169
62480A064986K2907K2539K1366J8861J4136P121r39q292j4076j8976k4331l0484
62468A074818l6330m0620m3187m4598m5166m4871m3854m2265l9848l6306l2017
62457F25756k7828k4180k0893j7701j4576j1618r054p198o037n028l661j982j92
62444D75808J842M127O034O972P245P512P667P124N984M941M053K578J95k428
62430E39654m593o287p721q777r322r537r653r668r501r091q344p378o668o435
62416D26679o028m765l229k813l731m568m131k913k087j928j906j755j607j356
62402C83862o83L65J285J614J260M76j92j35Q05K112L050L279K930K405K156K434
$$ plain form
62492 1012380 997263 985035 976345 971262 969907 972811 980166 991340 1005582 1022751 1042817 1064986
62480 1064986 1087893 1110432 1131798 1150659 1164795 1171916 1170977 1162685 1148609 1129633 1105302 1074818
62468 1074818 1038488 997868 954681 910083 864917 820046 776192 733927 694079 657773 625756
62457 625756 597928 573748 552855 535154 520578 508960 499906 492708 486671 481643 477982 476000 475808
62444 475808 477650 481777 487811 494783 502028 509540 517207 524331 530315 535256 539309 541887 542082 539654
62430 539654 535061 528774 521053 512276 502954 493417 483764 474096 464595 455504 447160 439782 433114 426679
62416 426679 420651 415886 412657 409844 406113 401545 397414 394501 392414 390486 388580 386825 385218 383862
62402 383862 383179 383544 384829 386443 387703 388179 387987 387852 388657 390769 393819 397098 400028 402433 404589 407023
62386D07023L097L810M453N109N681O003O305P074Q253R098R065Q532Q353R006
62372E00862J0361J1946J3281J4286J5491J7469K0058K2610K5094K8281L2579
62361G12318L7318M1596M5228M8430N1133N3162N4653N5547N4959N1763M5791
62350A251898L7967K9340K0459J1608L131m688j1761j8152k3994k9336l3946l7413
62338A195113l9584m0762m1264m1018l9814l7732l4996l1644k7738k3777k0495
62327H16289j8183j6553j5289j4482j4408j5060j6045j6969j7745j8459j9013
62316F34083j9073j8530j7756j7093j6329j5041j3391j2059j1302j0576r272p438
62304D66223n542l919k734k120j971j811j202k72M66P15P10R37J594K403K994
$$ plain form
62386 407023 410120 413930 418383 423492 429173 435176 441481 448555 456808 465906 474971 483503 491856 500862
62372 500862 511223 523169 536450 550736 566227 583696 603754 626364 651458 679739 712318
62361 712318 749636 791232 836460 884890 936023 989185 1043838 1099385 1154344 1206107 1251898
62350 1251898 1289865 1319205 1339664 1351272 1354403 1349715 1337954 1319802 1295808 1266472 1232526 1195113
62338 1195113 1155529 1114767 1073503 1032485 992671 954939 919943 888299 860561 836784 816289
62327 816289 798106 781553 766264 751782 737374 722314 706269 689300 671555 653096 634083
62316 634083 615010 596480 578724 561631 545302 530261 516870 504811 493509 482933 473661 466223
62304 466223 460681 456762 454028 451908 449937 448126 446924 446652 447118 447833 448543 449480 451074 453477 456471
62289D56471L509M370N286N092L329J420J237K636L665L365L015L968N520O089
62275E08972N554N196N771O849P965R239J0795J2488J4406J6950K0223K3885K7741
62262F76034L1888L6169M0108M3556M6974N0764N4655N7926N9943O0307N8744
62251A217068N5119M9436M1760L2284K1599J0740Q48p402j4163k0193k6169l2127
62239A328800l7683m2608m6731m9460n0107m8851m6715m4278m1144l7074l2786
62228H51363k8983k5364k1548j8269j6418j5374j3723j1471j0112j0344j1138
62217F68619j1491j1703j2238j2563j2163j1727j2141j2913j2816j1722j0678
62206E36464j0286j0067r441q354o796m625k184l56M30P03J118J680K192K903
$$ plain form
62289 456471 459980 464350 469636 474728 478057 479477 480714 483350 487015 490380 493395 497363 502883 508972
62275 508972 514526 519722 525493 532342 540307 549546 560341 572829 587235 604185 624408 648293 676034
62262 676034 707922 744091 784199 827755 874729 925493 980148 1038074 1098017 1158324 1217068
62251 1217068 1272187 1321623 1363383 1395667 1417266 1428006 1428854 1421452 1407289 1387096 1360927 1328800
62239 1328800 1291117 1248509 1201778 1152318 1102211 1053360 1006645 962367 921223 884149 851363
62228 851363 822380 797016 775468 757199 740781 725407 711684 700213 690101 679757 668619
62217 668619 657128 645425 633187 620624 608461 596734 584593 571680 558864 547142 536464
62206 536464 526178 516111 506670 498316 491520 486895 484711 484355 484785 485488 486606 488286 490478 493381
62192D93381M136N644O919P967R090J0030J0073R161Q353Q715J0051J1087J0866
62179F05473R666Q596Q482R269J0370J1438J2698J4578J7207K0423K4063K7950
62167G80213L1741L5123L8169M0971M2912M2868M0411L6306L1420K5595J8197
62156A163926R538J007o167j1740j6053j9482k2424k5274k8118l0681l2764l4386
62144I47382l5302l4821l2459k8684k4705k1460j8876j6121j2610q779n726m073
62132G03766l402k945k443j994j489p29J65J050K187L768N290O194O842P933Q994
62117G33187Q632O423L478Q79j323l124l841l231k321k280l151m528o605r484
62103G12711j2068j2841j1517r063o385l864j758%K139N146Q107R505R181Q570
$$ plain form
62192 493381 497517 503161 510080 518047 527137 537167 547240 556401 564754 573469 583520 594607 605473
62179 605473 615139 623735 632217 641486 651856 663294 675992 690570 707777 728200 752263 780213
62167 780213 811954 847077 885246 926217 969129 1011997 1052408 1088714 1120134 1145729 1163926
62156 1163926 1173464 1174471 1168304 1156564 1140511 1121029 1098605 1073331 1045213 1014532 981768 947382
62144 947382 912080 877259 844800 816116 791411 769951 751075 734954 722344 713565 707839 703766
62132 703766 700364 697419 694976 692982 691493 690764 690929 691979 694166 697934 703224 709418 716260 724193 733187
62117 733187 741819 748242 751720 752599 751276 748152 744311 741080 738759 736479 733328 728800 722195 712711
62103 712711 700643 687802 676285 667222 660837 656973 655215 655215 657354 662500 670607 680112 689293 697863
62089F97863Q911J0100J1431J2485J3019J2784J1906J0987J0554J0788J1832J3791
62077H36451J6327J8777K0803K2469K3720K4366K4666K5251K6322K7445K8234
62066A094831K8748K9061K9023K8514K7440K5435K2174J7965J3390Q347K292m417
62054A322803j0336j4534j7662k0901k4527k8051l1171l3901l6126l7675l8586
62043A029333l8865l8302l6936l5445l4494l3903l2923l1231k9177k7198k5341
62032F65518k3394k1177j8753j6467j4683j3367j2065j0478q802p423o568o374
62020E05967o903p738p986p168n821m838m362l833k930j988j363r39l12P49K164
62005D52699L646M849N664O283O820O924O151M737L590L266L247K557R46q41j948
$$ plain form
62089 697863 706774 716874 728305 740790 753809 766593 778499 789486 800040 810828 822660 836451
62077 836451 852778 871555 892358 914827 938547 962913 987579 1012830 1039152 1066597 1094831
62066 1094831 1123579 1152640 1181663 1210177 1237617 1263052 1285226 1303191 1316581 1324928 1327220 1322803
62054 1322803 1312467 1297933 1280271 1259370 1234843 1206792 1175621 1141720 1105594 1067919 1029333
62043 1029333 990468 952166 915230 879785 845291 811388 778465 747234 718057 690859 665518
62032 665518 642124 620947 602194 585727 571044 557677 545612 535134 526332 518909 512341 505967
62020 505967 499064 491326 483340 476172 470351 465513 461151 457318 454388 452400 451037 450098 449786 450535 452699
62005 452699 456345 461194 466858 473141 479961 486885 493036 497773 501363 504629 507876 510433 511379 510538 508590
61990E08590k238k202k418l188m485n912o886p156p068p070p069o639n814n186
61976D35259n109n219m993m419l781l141k398j646j082p58o82j006j684k205k082
61961C95054j450q34m34NO93J557K401L036L337L472L903M862O001O868P445P951
61945D43867Q462R162J0498J2477J4185J4752J4500J4384J4585J4537J4061J3481
61933E98951J2748J1489R968Q846P951O375M023J966Q17p1j310k503l262m082
61919F51906n328o287o203n476m804l767j502J618M167N474O234P309Q755J0156
61905F62252J1157J1419J0628Q730O042K967j30l023n795q632j1299j3123j3866
61892F57327j4100j4317j4168j3162j1620j0261r230q258p486p295p555p786p857
$$ plain form
61990 508590 506352 504150 501732 498544 494059 488147 481261 474105 467037 459967 452898 446259 440445 435259
61976 435259 430150 424931 419938 415519 411738 408597 406199 404553 403471 402713 402031 401025 399341 397136 395054
61961 395054 393604 392770 392336 392341 393034 394591 396992 400028 403365 406837 410740 415602 421603 428471 435916 443867
61945 443867 452329 461491 471989 484466 498651 513403 527903 542287 556872 571409 585470 598951
61933 598951 611699 623188 633156 642002 649953 656328 660351 662317 663134 663063 661753 659250 655988 651906
61919 651906 646578 640291 634088 628612 623808 620041 618539 620157 624324 629798 636032 643341 652096 662252
61905 662252 673409 684828 695456 704186 710228 713195 713065 710042 704247 695615 684316 671193 657327
61892 657327 643227 628910 614742 601580 589960 579699 570469 562211 554725 547430 539875 532089 524232
61879E24232p869p586o839o172o172o297n426l559j890j083n54K74J110J717K594
61864D76480M097N712O956Q288J0228J2184J3157J3336J4026J5981J8622K0924
61852F19991K2449K3264K3503K3345K3121K3006K2713K1691J9696J7063J4371
61841H54213J1728Q572M352n57m922p858r635j1037j2075j1818r581n908k159
61828H03315P48K948N048P200Q910R668R429Q352O316L025j385o240j0861j4969
61814H31504j8423k0929k2337k3033k3665k4451k5035k5006k4270k2903k0936
61803E80516j8480j5851j3349j1093r192p979p661p792p445o170m535l505l387
61790D64077l582l338k488j500r58j064j496j729j547j163p95l83J01K82k22j084
$$ plain form
61879 524232 516363 508777 501938 495766 489594 483297 477871 474312 472422 471339 470785 471059 472169 473886 476480
61864 476480 480577 486289 493245 501533 511761 523945 537102 550438 564464 580445 599067 619991
61852 619991 642440 665704 689207 712552 735673 758679 781392 803083 822779 839842 854213
61841 854213 865941 874513 878865 878308 873386 865528 855893 844856 832781 820963 811382 805474 803315
61828 803315 804063 807011 812059 819259 828169 837837 847266 855618 861934 864959 863574 857334 846473 831504
61814 831504 813081 792152 769815 746782 723117 698666 673631 648625 624355 601452 580516
61803 580516 562036 546185 532836 521743 512551 504572 496911 489119 481674 475504 470969 467464 464077
61790 464077 460495 457157 454669 453169 452211 451147 449651 447922 446375 445212 444417 444034 444135 444417 444195 443111
61774D43111j506j204p46o82q11o18n3N26R22J186J317J252J134J189J410J650
61758D48077J929K356K763K797K391J846J348P45j06j008j587j681j451j186j047
61743D56186r71q09n66l66j83J49N73O82K92j66j23L52P33Q27R45J248J546J739
61725D62088K001K254K071J394R09J265K249L148L630L745L388K398J172M58L27
61710D92497K7q74j745j798j340j447k513l741m206l897l441l164k886k445k003
61695D57024j807j892k078k133j884j384r30q30j053j314j438j482j454j194p59
61680D35392o52j312k409l010k592j644j022r49r16n14L6K79Q2m10j087j800k170
61663D15302j891j192o06l07j22j42p53j828k498k116j044k7P47J452J839J523
$$ plain form
61774 443111 441605 440401 439655 438973 438162 437544 437491 438017 438939 440125 441442 442694 443828 445017 446427 448077
61758 448077 450006 452362 455125 457922 460313 462159 463507 464252 464146 463138 461551 459870 458419 457233 456186
61743 456186 455215 454406 453840 453474 453291 453440 454013 454695 454987 454821 454698 455050 455783 456610 457555 458803 460349 462088
61725 462088 464089 466343 468414 469808 470717 471982 474231 477379 481009 484754 488142 490540 491712 492170 492497
61710 492497 492524 491650 489905 488107 486767 485320 482807 479066 474860 470963 467522 464358 461472 459027 457024
61695 457024 455217 453325 451247 449114 447230 445846 444916 444086 443033 441719 440281 438799 437345 436151 435392
61680 435392 434740 433428 431019 428009 425417 423773 422751 421802 420886 420372 420408 420687 420769 420359 419272 417472 415302
61663 415302 413411 412219 411613 411306 411184 411042 410289 408461 405963 403847 402803 402776 403523 404975 406814 408337
61647D08337Q81Q13J475J965J599Q90Q40J633K530K819K413J613O47m32j597k715
61631D23711l556m051m423m861n121m663l399k015j420j835k569k704j963q71
61617C80260r8K29L32J30p48k179l307l488l022k600k481k694l508m892n920n678
61601C40336m586l915m058m222l880l396l034k496j842j784k485k983k545j788
61587B97322j631j894j795j337j190j521j809j764j612j555j521j458j417j363
61573B75455j218r87o33j10L28K44k80o34o23q02j420j712j003J93R42J192J427
61556B70359J563J177N61M19P44R33Q87J012J254J142P73O89P70L82k20J35J746
61539B84326L297L502K621J737J307J167J268J572J630J024N4o36r30j182j453
$$ plain form
61647 408337 409218 410031 411506 413471 415070 415960 416800 418433 420963 423782 426195 427808 428455 428023 426426 423711
61631 423711 420155 416104 411681 406820 401699 397036 393637 391622 390202 388367 385798 383094 381131 380260
61617 380260 380162 380391 380723 380853 380105 377926 374619 371131 368109 365509 363028 360334 356826 351934 346014 340336
61601 340336 335750 331835 327777 323555 319675 316279 313245 310749 308907 307123 304638 301655 299110 297322
61587 297322 295691 293797 292002 290665 289475 287954 286145 284381 282769 281214 279693 278235 276818 275455
61573 275455 274237 273250 272617 272507 272835 273079 272799 272165 271542 270740 269320 267608 266605 266798 267740 268932 270359
61556 270359 271922 273099 273660 274079 274823 275756 276643 277655 278909 280051 280824 281513 282283 282665 282445 282580 284326
61539 284326 287623 291125 293746 295483 296790 297957 299225 300797 302427 303451 303505 302869 301939 300757 299304
61524B99304j436j109r19j168j591j748j517j021l15M98R03L06j054j922j360
61509B85851OP06L93K09R22J607R83o27j694j492p72m75o75r61j062q66l51K44
61491B81946N13L58N5p7J62Q37J672K067J775J317J200J117O14J87O89J826K335
61474B98593J736R23O99P47M90N6j36j26j95l83o38r78j192q29J49J135J512J178
61456C02741L67n13q08j54Q11J036N44M38J115J548R44P6O7P36J091R29Q35J011
61438C12814J195J527K355L268L323K454J686J652J720J142L81N48J744K731K443
61423C40983J303O66J159K082K512K430K390K451K140J301L95j68m53o88r43j278
61407C56282j720k055k042j868j837j676q73K05M09o88k126k824k758k378j683
$$ plain form
61524 299304 297868 296759 295840 294672 293081 291333 289816 288795 288480 288978 289881 290187 289133 287211 285851
61509 285851 285857 286563 286956 287165 288087 289694 290677 290050 288356 286864 286092 285617 284942 283981 282919 282053 281702 281946
61491 281946 282459 282817 282872 282795 282957 283794 285466 287533 289308 290625 291825 292942 293556 293743 294432 296258 298593
61474 298593 300329 301252 301951 302698 303188 303244 303108 302982 302787 302404 301766 300788 299596 298767 298916 300051 301563 302741
61456 302741 303108 302595 301787 301633 302444 303480 304024 304462 305577 307125 308069 308145 308212 308948 310039 310968 311803 312814
61438 312814 314009 315536 317891 321159 324482 326936 328622 330274 331994 333136 333517 334065 335809 338540 340983
61423 340983 342286 342952 344111 346193 348705 351135 353525 355976 358116 359417 359812 359644 359191 358503 357560 356282
61407 356282 354562 352507 350465 348597 346760 345084 344211 344416 344825 344137 342011 339187 336429 334051 332368
61392C32368n46O02J188J203Q83J60q66j410p94M25R28K52p27r32k00P89J289
61375C34612J164R71J324K063K347J741Q21L94N72R76J385J750J913J902K169
61360C56104L043M198N136N783O202O201N840N907P026Q619R493R325Q785Q384
61346D50046P889O869N174K966Q30l28j51N71Q59Q50J299K010J853M89j015j646
61330D78565j667j830k175k252k049k042k472k996k995j999r2J969L236L433L200
61315D67834L431M531O253P975R116R592R968J0826J2027J2897J3127J3033J2913
61302E93523J2602J1835J0548Q679O087K917l26l274n883p931q875q564p784p576
61288E95978q177q994r464r532r326q769p789o615n654n000m252k977j281K94
$$ plain form
61392 332368 331822 332424 333612 334815 335698 335858 334992 333582 332788 333213 334141 334393 333666 332734 332534 333323 334612
61375 334612 335776 336747 338071 340134 342481 344222 345043 345437 346009 346985 348370 350120 352033 353935 356104
61360 356104 359147 363345 368481 374264 380466 386667 392507 398414 405440 414059 423552 432877 441662 450046
61346 450046 457935 464804 469978 472944 473774 473446 473295 473866 474725 475575 476874 478884 480737 481226 480211 478565
61330 478565 476898 475068 472893 470641 468592 466550 464078 461082 458087 456088 455996 457965 461201 464634 467834
61315 467834 471265 475796 482049 490024 499140 508732 518700 529526 541553 554450 567577 580610 593523
61302 593523 606125 617960 628508 637187 643274 646191 645865 642591 636708 628777 619902 611338 603554 595978
61288 595978 587801 578807 569343 559811 550485 541716 533927 527312 521658 516658 512406 509429 508148 508442
61274E08442J474K534L676M493M437L751L327L666M395M986N487O212P077P683
61260E71640P996Q439R233R918R738Q417O367M188K173L23j321k622l502m051
61246F26936m433m834n353n779n643m799l796l242k953k236j051j64l0j84m6L46
61230E82739Q42J701L032M256M886N289N970O507O192N434N414O376P308P487
61216F53433P360P555P857P759P352P017O636N766M423L183K527K461K805L534
61202G29668M714O163P473Q513R819J2054J4964J7314J8151J7849J7388J6950
61190H81020J5842J3642J0739P712M784K076j18j596k491l132l894n144o976q967
61176I03497j0529j1555j2367j3132j3715j4077j4344j4495j4454j4465j4804
$$ plain form
61274 508442 509916 512450 516126 520619 525056 528807 532134 535800 540195 545181 550668 556880 563957 571640
61260 571640 579636 588075 597308 607226 616964 625381 631748 635936 638109 638432 637111 634489 630987 626936
61246 626936 622503 617669 612316 606537 600894 596095 592299 589057 586104 583868 582817 582653 582623 582439 582393 582739
61230 582739 583581 585282 588314 592570 597456 602745 608715 615222 621414 626848 632262 638638 645946 653433
61216 653433 660793 668348 676205 683964 691316 698333 704969 710735 715158 718341 720868 723329 726134 729668
61202 729668 734382 740545 748018 756531 766350 778404 793368 810682 828833 846682 864070 881020
61190 881020 896862 910504 921243 928955 933739 935815 935697 934101 931610 928478 924584 919440 912464 903497
61176 903497 892968 881413 869046 855914 842199 828122 813778 799283 784829 770364 755560
61165G55560j5144j4865j4025j3400j3350j3307j2677j1611j0497r288p756n983
61153F13657m193k414p03O83J620K261K536J974M78j239k499l592n220p292q895
61138E87162r323q564o864m497j959J21J512K487L337M206N361P181R538J1767
61124F01465J3460J4989J6840J8855K0565K2112K4022K6189K7704K8020K7622
61113H41843K7198K6773K6144K5636K5500K4969K2994J9900J7193J5396J3239
61102A086785R496M670M7m028p955j1644j4719j7531k0710k3779k5466k5620k5642
61089I23904k6635k7988k8349k7265k5356k3396k1789k0569j9424j8007j6412
61078F68714j5081j4071j2792j0834q633p025o249n750m790l129j192L83J362
$$ plain form
61165 755560 740416 725551 711526 698126 684776 671469 658792 647181 636684 627396 619640 613657
61153 613657 609464 607050 606347 607030 608650 610911 613447 615421 615899 614660 612161 608569 603349 596057 587162
61138 587162 577839 569275 562411 557914 555955 556076 557588 560075 563412 567618 572979 580160 589698 601465
61124 601465 614925 629914 646754 665609 686174 708286 732308 758497 786201 814221 841843
61113 841843 869041 895814 921958 947594 973094 998063 1021057 1040957 1058150 1073546 1086785
61102 1086785 1096281 1100951 1100998 1096970 1089015 1077371 1062652 1045121 1024411 1000632 975166 949546 923904
61089 923904 897269 869281 840932 813667 788311 764915 743126 722557 703133 685126 668714
61078 668714 653633 639562 626770 615936 607303 600278 594029 588279 583489 580360 579168 579551 580913
61065E80913K042K664L046L105L342M236N391O044O314P140Q840J0624J1781J2603
61051F68085J3678J4975J6140J7303J8903K0938K2820K4039K4770K5769K7665
61040H95085L0226L2535L4072L5298L6858L8625M0082M1285M2623M3972M4873
61029A315534M5386M5905M6394M6799M7980N1010N5731O1306O8048P7122Q8434
61018A949649J00639J13680J29491J49873J75751K09264K54077L12316L83443
61009C778183M67827N68778O88651Q24918R72000J123626J270561J402422J520018
61000A2616984J639451J763279J837514J755693J437621R18805L52109r2514l32656
60991B1896286l85480l04576j40071L4847R7679p2459m96127j054653j562248
$$ plain form
61065 580913 582955 585619 588665 591770 595112 599348 604739 610783 617097 624237 633077 643701 655482 668085
61051 668085 681763 696738 712878 730181 749084 770022 792842 816881 841651 867420 895085
61040 895085 925311 957846 991918 1027216 1064074 1102699 1142781 1184066 1226689 1270661 1315534
61029 1315534 1360920 1406825 1453219 1500018 1547998 1599008 1654739 1716045 1784093 1861215 1949649
61018 1949649 2050288 2163968 2293459 2443332 2619083 2828347 3082424 3394740 3778183
61009 3778183 4246010 4814788 5503439 6328357 7300357 8423983 9694544 11096966 12616984
61000 12616984 14256435 16019714 17857228 19612921 21050542 21969347 22321456 22228942 21896286
60991 21896286 21510806 21206230 21066159 21101006 21198685 21126226 20630099 19575446 18013198
60982A8013198j881605j981039j907667j730884j508889j281807j072512q89004
60974E759791p31313n98539m89679m01381l29154k70453k24339j88810j60781
60965B365342j38236j20424j06221r4069q3388p4426o6653n8791n0468m2557l5723
60954A494386k9783k4700k1138j9567j9521j9982j9987j8825j6372j3448j1290
60943A279773j0398j0232j0053r602q984q372q030q235r110j0578j2380j3947
60931A159852j4643j4510j4408j4976j5707j5699j4942j4216j3963j4033j4375
60920I98380j5052j5554j5103j3916j3235j3755j4699j4921j4239j3170j1979
60909H42757j0682r591r071q898q471p641o836o328n877n248m720m827n648o616
$$ plain form
60982 18013198 16131593 14150554 12242887 10512003 9003114 7721307 6648795 5759791
60974 5759791 5028478 4429939 3940260 3538879 3209725 2939272 2714933 2526123 2365342
60965 2365342 2227106 2106682 2000461 1906392 1823004 1748578 1681925 1623134 1572666 1530109 1494386
60954 1494386 1464603 1439903 1418765 1399198 1379677 1359695 1339708 1320883 1304511 1291063 1279773
60943 1279773 1269375 1259143 1249090 1239488 1230504 1222132 1214102 1205867 1196757 1186179 1173799 1159852
60931 1159852 1145209 1130699 1116291 1101315 1085608 1069909 1054967 1040751 1026788 1012755 998380
60920 998380 983328 967774 952671 938755 925520 911765 897066 882145 867906 854736 842757
60909 842757 832075 822484 813413 804515 796044 788403 781567 775239 769362 764114 759394 754567 748919 742303
60895G42303p057o855o458o286o269o160n980n921n950n952o141o839p784q240
60881F50411p904p281o919o794o619o277n718m933m319m461n138n181l935k279
60867E72653j469j518j586j454j523j625j111j96mr45k112k730l187m040m853
60852E44300m830m008l078k440k125k267k969l912m669n143n320m936l984l186
60838D91433l338m362n459o016n835m900l529k507k336k511k190j411r52j107
60824D44980j301r50p4R08J464J125O1p13l94M08L77o57j529j483j113j124j193
60807D38792o83J91O12K69l70o50k97L71N94j57j437k202k073j775k131l067l882
60790D22105m029l408k338j494j391j781j994j967k221k723k730k129j968k890
$$ plain form
60895 742303 735246 728391 721933 715647 709378 703218 697238 691317 685367 679415 673274 666435 658651 650411
60881 650411 642507 635226 628307 621513 614894 608617 602899 597966 593647 589186 584048 578867 574932 572653
60867 572653 571184 569666 568080 566626 565103 563478 562367 562171 562167 561222 559110 556380 553193 549153 544300
60852 544300 539470 535462 532384 529944 527819 525552 522583 518671 514002 508859 503539 498603 494619 491433
60838 491433 488095 483733 478274 472258 466423 461523 457994 455487 453151 450640 448450 447039 446087 444980
60824 444980 443679 442729 442655 443563 445027 446152 446213 445500 445106 445514 445891 445234 443705 442222 441109 439985 438792
60807 438792 438109 438300 438912 439181 438811 438161 437864 438235 438829 438672 437235 435033 432960 431185 429054 425987 422105
60790 422105 418076 414668 412330 410836 409445 407664 405670 403703 401482 398759 396029 393900 391932 389042
60776C89042l905l588j921m7J292K088K265J602M47l80n04j86L36J048J703J880
60760C91172J566J216J097J048R03P38O76P59J046J515J889J868J444Q09K06R5
60744D08047R66K574L618K908O21k051m191n501n800n070m084l966m908n893n900
60729C71370m928l687k829k610k785k641j656k92L35k31j262j794j650j275j035
60714C43030j032j217j348j085m67m6k52p75r02l62M03Q00P19N65P21J072J160
60697C40984Q00L36J68K40K81L39P22J436K098K465K722L133L653M000L982L674
60681C71033L374L371L712M178M538M687M506L929L220K915L150L339K856J755
60667D20563M72q87k372l573l855l276k670k630k876k777k124j136r3P54J166
$$ plain form
60776 389042 385137 381549 379628 379581 380873 382961 385226 386828 387275 386895 386391 386205 386541 387589 389292 391172
60760 391172 392738 393954 395051 396099 397002 397740 398416 399175 400221 401736 403625 405493 406937 407746 407952 408047
60744 408047 409013 411587 415205 418113 418734 416683 412492 406991 401191 396121 392037 388071 383163 377270 371370
60729 371370 366442 362755 359926 357316 354531 351890 350234 349942 350277 350046 348784 346990 345340 344065 343030
60714 343030 341998 340781 339433 338348 337881 337835 337583 336808 335906 335544 335947 336747 337466 338031 338752 339824 340984
60697 340984 341784 342120 342288 342528 342809 343148 343870 345306 347404 349869 352591 355724 359377 363377 367359 371033
60681 371033 374407 377778 381490 385668 390206 394893 399399 403328 406548 409463 412613 415952 418808 420563
60667 420563 421035 420148 417776 414203 410348 407072 404402 401772 398896 396119 393995 392859 392766 393520 394686
60652C94686J070P21M89N00N43L46j01n57q63j150j575k036k413k893l579l961
60636C79227l440k449k156k812l252k587j506j120j215p60L66J259J416J256J188
60621C63415J070P30K58l08r77j400j162m59J03L40M95N58L58J88M93R26O90r2
60603C65226l85J57O14K55l07j22P17J331J280Q21L09j67o32j035j161p52L5L92
60585C66576k92j431j706o89P31J591J823J698J253P70J013K354M076N206N646
60570C88619N990O584P343Q149Q883R236Q979Q261P366O278M779K762L18k240
60556D71307m232m942m391l466k967k760k143p12J362L674N818P522Q729R483
60542D82282R779R723R786J0385J1192J1413J0783R750Q558O841M362J508j255
$$ plain form
60652 394686 395756 396477 396966 397466 398009 398355 398254 397697 396834 395684 394109 392073 389660 386767 383188 379227
60636 379227 375787 373338 371182 368370 365118 362531 361025 359905 358690 357930 358296 359555 360971 362227 363415
60621 363415 364485 365215 365473 365165 364188 362788 361626 361167 361270 361610 362105 362663 363021 363209 363702 364628 365318 365226
60603 365226 364841 364998 365612 365867 365560 365438 366155 367486 368766 369587 369896 369729 369097 368062 366901 366149 366184 366576
60585 366576 366284 364853 363147 362458 363189 364780 366603 368301 369554 370324 371337 373691 377767 382973 388619
60570 388619 394609 401193 408536 416685 425568 434804 443783 452044 459410 465688 470467 473229 473547 471307
60556 471307 467075 462133 457742 454276 451309 448549 446406 445694 447056 450730 456548 464070 472799 482282
60542 482282 492061 501784 511570 521955 533147 544560 555343 565093 573651 580492 584854 586362 585107
60529E85107l805n902p002p012o655o535o359n546m174k807j774j184j175j560
60515E23617j602p50N96J579J963K257K939M047N415O974Q822J1255J4522J8406
60501F00040K2290K5752K8801L1507L3817L5852L7734L8941L8496L6075L2310
60490I61615K7538K1057J2183J488r647k0201k9609l7264m2698m5853m6655m4793
60478G47161m0634l5828l2043k9353k6655k3412k0156j7450j5277j3447j1900
60467D81006j0500r155q084p503p123o502n734n244n032m730m224l729l292k824
60453C97330k466k345k181j694j213j230j531j542j326j451j882j920j291n14
60439C74744J8M67Q62Q24K87j73j51J1j32m23m94m00l68k53J70O39O00k7o76q13
$$ plain form
60529 585107 581302 575400 568398 561386 554731 548196 541837 536291 532117 529310 527536 526352 525177 523617
60515 523617 522015 521265 521861 523440 525403 527660 530599 534646 540061 547035 555857 567112 581634 600040
60501 600040 622330 648082 676883 708390 742207 778059 815793 854734 893230 929305 961615
60490 961615 989153 1010210 1022393 1023881 1014234 994033 964424 927160 884462 838609 791954 747161
60478 747161 706527 670699 638656 609303 582648 559236 539080 521630 506353 492906 481006
60467 481006 470506 461351 453267 445764 438641 432139 426405 421161 416129 411399 407175 403446 400154 397330
60453 397330 394864 392519 390338 388644 387431 386201 384670 383128 381802 380351 378469 376549 375258 374744
60439 374744 374762 375229 376091 376915 377202 377029 376878 376889 376757 376334 375840 375440 375072 374819 374989 375628 376228 376201 375525 374712
60419C74712m97j29J50N92J319J941J981J550J275J467J745J643J196O42K8n22
60403C89093n49J72J122J573J471J251J059P23L93M55Q59J147J196J377J834K153
60387D05329J974J543J450K005K908L410K914J711Q85J134J911K196J817J435
60373D32622J375J302J059J007J383J913K285K455K337J775J073R09J426J947
60359D54868J974J939K579L902N305O425P355Q220Q926R364R490R175Q176O353
60345E44051L854J101j402l348m791n984p004p621p563o893o051n494n174m583
60331D83098l466k382k132k656l079k908k583k564k558k262k114k532k869k135
60317D46858m65J103K181L323M789O094P056Q238R895J1355J2087J2587J3514
$$ plain form
60419 374712 374215 374086 374236 374828 376147 378088 380069 381619 382894 384361 386106 387749 388945 389587 389615 389093
60403 389093 388544 388716 389838 391411 392882 394133 395192 395915 396308 396763 397622 398769 399965 401342 403176 405329
60387 405329 407303 408846 410296 412301 415209 418619 421533 423244 424129 425263 427174 429370 431187 432622
60373 432622 433997 435299 436358 437365 438748 440661 442946 445401 447738 449513 450586 451495 452921 454868
60359 454868 456842 458781 461360 465262 470567 476992 484347 492567 501493 510857 520347 529522 537698 544051
60345 544051 547905 549006 547604 544256 539465 533481 526477 518856 511293 504400 498349 492855 487681 483098
60331 483098 479632 477250 475118 472462 469383 466475 463892 461328 458770 456508 454394 451862 448993 446858
60317 446858 446393 447496 449677 453000 457789 463883 470939 479177 489072 500427 512514 525101 538615
60304E38615J4479J4508J3380J1661R570O604K503k004n854q780j1387j4039j6031
60291E53225j6226j4416j1652r137p167n446l929k872k304k079k300l086l966
60278D68645m202l775l446l672l976l688k832j975j534j566j925k377k659k583
60264D28435k035r42M95J572J510L01j156j845j440m08M33N65K51L10J084J911
60248D29041K006J603J536J898J916J200K75l78r51j617j898j311j96O84J012
60233D34820R74P48M12K43N98J489K501L148L288L213L307L539L438K859K535
60218D67112L289M870O140O522O552O858P246P237O931O829P057P252P057O449
60204E57401N706N235N245N463N363M756L908L124K512K086J689Q16r06k988m373
$$ plain form
60304 538615 553094 567602 580982 592643 602213 608817 611320 609316 603462 594682 583295 569256 553225
60291 553225 536999 522583 510931 501794 494627 489181 485252 482380 480076 477997 475697 472611 468645
60278 468645 464443 460668 457222 453550 449574 445886 443054 441079 439545 437979 436054 433677 431018 428435
60264 428435 426400 425458 425953 427525 429035 429336 428180 426335 424895 424487 424920 425485 425736 426046 427130 429041
60248 429041 431047 432650 434186 436084 438000 439200 439475 439097 438146 436529 434631 433320 433124 433808 434820
60233 434820 435794 436542 436954 437197 437795 439284 441785 444933 448221 451434 454741 458280 461718 464577 467112
60218 467112 470401 475271 481411 487933 494485 501343 508589 515826 522757 529586 536643 543895 550952 557401
60204 557401 563107 568342 573587 579050 584413 589169 593077 596201 598713 600799 602488 603304 602398 599410 595037
60189E95037m664m539m744n282n787o161o368o200n631n058m804m735m682m755
60175E21627m923m734l901k811k005j589j439j599j936j918j195j95L87M19K16
60160D94404l6k31o9N67J229J441J411J635K034K137J963J996K310K440K200J999
60144E17430K193K674L257L923M494M639M490M829O131P742Q467P889O712N800
60130E90670N242M545L494K515K095K133K069J649J292J552K371L069L065K377
60116F28138J466O94J16l22o15p60q89j124j411j698k237l330m679n412n123m525
60100E98289m612n328n692n111m070l303k895k452j812j148n86K1P98J535J783
60085E65417J359P46O37J032J131M02o56j228j300j395j590j564j537k211l633
$$ plain form
60189 595037 590373 585834 581090 575808 570021 563860 557492 551292 545661 540603 535799 531064 526382 521627
60175 521627 516704 511970 508069 505258 503253 501664 500225 498626 496690 494772 493577 493382 493769 494188 494404
60160 494404 494368 494137 494068 494635 495864 497305 498716 500351 502385 504522 506485 508481 510791 513231 515431 517430
60144 517430 519623 522297 525554 529477 533971 538610 543100 547929 554060 561802 570269 578158 584870 590670
60130 590670 595912 600457 603951 606466 608561 610694 612763 614412 615704 617256 619627 622696 625761 628138
60116 628138 629604 630298 630414 630092 629477 628717 627828 626704 625293 623595 621358 618028 613349 607937 602814 598289
60100 598289 593677 588349 582657 577546 573476 570173 567278 564826 563014 561866 561280 561301 562099 563634 565417
60085 565417 566776 567522 568159 569191 570322 570724 570068 568840 567540 566145 564555 562991 561454 559243 555610
60070E55610m927n455n530n746o193o610o733o269n118l898l551m132m623m316
60056D82509l632l109k402r84P69K034K682L191L718M043M211M566N155N649N859
60041E14259N851N619N042M174L248K432J810J410J018K54r23k066k896l741m954
60026E30537o283p264p819q001p582o574n710n709o196o192n484m766m444m187
60012D44326l761l467l431l230k597j974j859k057k047j739j366q93r0Q30J291
59997D17936J155R75J176J379J037N06Q48K351L872M144L340K729K905L163K692
59982D50208J630N45n39j938l373m002l447k343j657j727k115k280k158k003j838
59967D22963j338l91N50R86J046J260J770K220K383K404K368K074J462Q01L25
$$ plain form
60070 555610 550683 545228 539698 533952 527759 521149 514416 508147 503029 499131 495580 491448 486825 482509
60056 482509 478877 475768 473366 472382 473151 475185 477867 481058 484776 488819 493030 497596 502751 508400 514259
60041 514259 520110 525729 530771 534945 538193 540625 542435 543845 544863 545117 544194 542128 539232 535491 530537
60026 530537 524254 516990 509171 501170 493588 487014 481304 475595 469399 463207 457723 452957 448513 444326
60012 444326 440565 437098 433667 430437 427840 425866 424007 421950 419903 418164 416798 415905 415815 416645 417936
59997 417936 419091 420066 421242 422621 423658 424164 425012 427363 431235 435379 438719 441448 444353 447516 450208
59982 450208 451838 452383 451844 449906 446533 442531 439084 436741 435084 433357 431242 428962 426804 424801 422963
59967 422963 421625 421234 421784 422770 423816 425076 426846 429066 431449 433853 436221 438295 439757 440558 440883
59952D40883j5k28j45K20N55P05Q79J143J105L65r20k149k830k907k721k657k648
59935D28635k175j044Q8N13M79P62J425J937K395L490N003N550M471K969K641
59920D57139L588M719N327N565N819O256O785O923O133M611L237K410J624O11
59906E20747O1M39R46M90p81j865k255k141j742j287j250j626j475n6J905L092
59890E13202L328L352L311K748J980K077L255M456M884M971N352N749N453M378
59876E68496L107K229J896J718J001n51k307l286l298l040l086l318l407l297
59862E52857k968k282j313m34J53O32J244J955K664L462M502N759O932P473O863
59847E87499N077K743O31r14j933k473k542k287j891j469j243j621k798m411n822
$$ plain form
59952 440883 440868 440640 440495 440715 441270 441975 442854 443997 445102 445467 444547 442398 439568 436661 433940 431283 428635
59935 428635 426460 425416 425504 426017 426496 427258 428683 430620 433015 436505 441508 447058 451529 454498 457139
59920 457139 460727 465446 470773 476338 482157 488413 495198 502121 508254 512865 516102 518512 520136 520747
59906 520747 520808 521247 522193 522683 521902 520037 517782 515641 513899 512612 511362 509736 508261 508205 510110 513202
59890 513202 516530 519882 523193 525941 527921 529998 533253 537709 542593 547564 552916 558665 564118 568496
59876 568496 571603 573832 575728 577446 578447 577896 575589 572303 569005 565965 562879 559561 556154 552857
59862 552857 549889 547607 546294 545860 546013 546645 547889 549844 552508 555970 560472 566231 573163 580636 587499
59847 587499 592576 595319 595950 595036 593103 590630 588088 585801 583910 582441 581198 579577 576779 572368 566546
59832E66546o537o292n135l649k679k441k351j987j728k027k566k706k367j938
59818E22143j648j480j387j174o47k20p09k071l033k721j912j837k411k669k431
59803D95793k376k763l151l269l193k814k073j554j910k765l067k483j618j001
59789D61756o74o91j152j732j918j666j226n54M03J131J102O28L50K43N2J70J040
59772D57262K058K332K166K436K837K344J284J212K496L655L551K789K351K258
59758D91031K196K304K559K463K005J989K730L388L295L048L513M442M857M315
59744E34135L183K136J815K404L262L442K848K248J973J437K53r75j465j201n86
59729E54909J21O91Q01M70J20p6l55p93j143j324j421j196m19L62L43k20l00J87
$$ plain form
59832 566546 560009 553717 548582 544933 542254 539813 537462 535475 533747 531720 529154 526448 524081 522143
59818 522143 520495 519015 517628 516454 515807 515587 514878 512807 509774 507053 505141 503304 500893 498224 495793
59803 495793 493417 490654 487503 484234 481041 478227 476154 474600 472690 469925 466858 464375 462757 461756
59789 461756 461082 460391 459239 457507 455589 453923 452697 452143 452546 453677 454779 455407 455757 456000 456052 456222 457262
59772 457262 459320 461652 463818 466254 469091 471435 472719 473931 476427 480082 483633 486422 488773 491031
59758 491031 493227 495531 498090 500553 502558 504547 507277 510665 513960 517008 520521 524963 529820 534135
59744 534135 537318 539454 541269 543673 546935 550377 553225 555473 557446 558883 559136 558161 556696 555495 554909
59729 554909 555030 555721 556522 556992 557112 557036 556681 555888 554745 553421 552000 550804 550385 550747 551090 550870 550570 550757
59711E50757J60q02j714j729j238q87n40Q2P38J261J885K463K340J581J268J924
59695E57549K679K737K517K500K092P52p29j229r26p61r06q45n46m78p38j017
59679E62651j237j537j938k522l525m730n385n239n005n193n214m396l164k332
59665E11234j943j615j431j571j633j256q26p14l71P64K037K396K054K163L050
59650E12338L891M062L747L190K282J022k86j446k459l203l485l365l050k603
59636E10635k072j644j309p54M8N73M87J18k21p96j737k436k393k065k129k364
59620D91941k170j766j922k783l764m389m509l911k551r85J00O16Q32P28L07J21
59604D65895P28J811K583K806K706K274J382M37J3P3K26N33J183J626J018m33
$$ plain form
59711 550757 550917 550115 548401 546672 545434 544547 544007 544089 544827 546088 547973 550436 552776 554357 555625 557549
59695 557549 560228 562965 565482 567982 570074 570826 570097 568868 567942 567181 566275 565430 564884 564406 563668 562651
59679 562651 561414 559877 557939 555417 551892 547162 541777 536538 531533 526340 521126 516730 513566 511234
59665 511234 509291 507676 506245 504674 503041 501785 500959 500245 499874 500638 502675 505071 507125 509288 512338
59650 512338 516229 520291 524038 527228 529510 530532 530246 528800 526341 523138 519653 516288 513238 510635
59636 510635 508563 506919 505610 504856 504904 505477 505964 506082 505861 505065 503328 500892 498499 496434 494305 491941
59620 491941 489771 488005 486083 483300 479536 475147 470638 466727 464176 463191 463291 463907 464739 465467 465774 465895
59604 465895 466623 468434 471017 473823 476529 478803 480185 480622 480635 480708 480934 481467 482650 484276 485294 484861
59588D84861j485j411q66q89j607k209j952r92k96o44j738k532k474j936j338
59573D62492n93K01L59m03j242j226n49L1M91J303K218K290J137m85j498j425
59557D63101n63L96R75J296J703K092K153K219K977M197M812M617M753N974P645
59542E08347R050J0428J1786J2338J2202J3117J5568J6623J2872M925l095q145
59530F16016j0243j0313q632n804l223j550j75J243K041J902J618J813J908J086
59516E87687n63k408m101n556o699p569q157q143p372o463o176o261n903n122
59502E07194m626m344l418j807o01l57l41L7K49j85o16k20P02J208J034P34P93
59485D95436J301K253L608N078O227O775O815O737O880P178P295P223P263P165
$$ plain form
59588 484861 483376 481965 481099 480210 478603 476394 474442 473450 473154 472510 470772 468240 465766 463830 462492
59573 462492 461899 462100 462459 462056 460814 459588 459039 459070 459561 460864 463082 465372 466509 466024 464526 463101
59557 463101 462538 462934 463909 465205 466908 469000 471153 473372 476349 480546 485358 489975 494728 500702 508347
59542 508347 517397 527825 539611 551949 564151 577268 592836 609459 622331 627256 624161 616016
59530 616016 605773 595460 586828 581024 577801 576251 576076 577319 579360 581262 582880 584693 586601 587687
59516 587687 587124 584716 580615 575059 568360 560791 552634 544491 537119 530656 524480 518219 512316 507194
59502 507194 502568 498224 494806 492999 492398 492041 491700 491737 491986 491801 491185 490965 491667 492875 493909 494643 495436
59485 495436 496737 498990 502598 507676 513903 520678 527493 534230 541110 548288 555583 562806 570069 577234
59471E77234N987L416O65p76q87q41j276j780j809j191R6J836L376M336N207O517
59455F00110P801Q374Q645R497J0670J1072J0430R368Q028O026L666J721o1k660
59441F92687n909q380r413r795j0104r911r119q611q830q969q269p028n753m394
59427E78202k914j488L80L666Q105J1894J3876J4919J6456J8760K1316K3687K5226
59414G32085K5249K4405K4460K5377K3904J6782M821p568j6333k0175j9837j6930
59402G96240j3294r898o026o70M923P176L215o315j7618k6422l0405k9822k6554
59389F44530k2552j8864j5658j2706r741o755m160k488j777j540j357j167r37
59376E44828n03J32P83J417K121K756L089L275L680M279M807N358O190P000P255
$$ plain form
59471 577234 583221 586637 587302 586526 585639 584798 583522 581742 579933 578742 578838 580674 584050 588386 593593 600110
59455 600110 607911 616285 624930 634427 645097 656169 666599 675967 683995 690021 693687 695408 695347 692687
59441 692687 686778 678398 668985 659190 649086 639175 630056 621445 612615 603646 595377 588349 582596 578202
59427 578202 575288 573800 574180 577846 585951 597845 611721 626640 643096 661856 683172 706859 732085
59414 732085 757334 781739 806199 831576 855480 872262 877083 869515 853182 833007 813170 796240
59402 796240 782946 773048 767022 766352 771275 778451 781666 775351 757733 731311 700906 671084 644530
59389 644530 621978 603114 587456 574750 565009 558254 554094 551606 549829 548289 546932 545765 544828
59376 544828 544325 544457 545240 546657 548778 551534 554623 557898 561578 565857 570664 576022 582212 589212 596467
59361E96467P156P421Q099Q589Q834R416J0352J1021J1450J2396J3699J4050J3036
59348G31986J2115J2600J3825J4382J4142J3780J3233J1982J0298Q905P571N235
59336H70054J533k705o497r510j1831j3571j4847j5749j6343j6763j7158j7378
59324G29235j7069j6149j4762j2793j0187p749o626o625o142m338k337j423j051
59311F21984J63K242L956M779N448O599P931Q947R691J0434J1072J0937Q965M333
59297G17481k610j0068j5925j9176k0095j9305j7259j4473j1673r402p664o073
59285E63758m386k818j753j069j37J328K702L352L663M530O039P487Q606R757
59271F01059J0928J1581J1683J1812J1983J1388R719P739O046M259J971m02k340
$$ plain form
59361 596467 603623 611044 619143 627732 636566 645982 656334 667355 678805 691201 704900 718950 731986
59348 731986 744101 756701 770526 784908 799050 812830 826063 838045 848343 857248 864819 870054
59336 870054 871587 868882 862385 852875 841044 827473 812626 796877 780534 763771 746613 729235
59324 729235 712166 696017 681255 668462 658275 650526 643900 637275 631133 626795 624458 623035 621984
59311 621984 622147 624389 628345 633124 638572 645171 653102 662049 671740 682174 693246 704183 713148 717481
59297 717481 714871 704803 688878 669702 649607 630302 613043 598570 586897 577495 569831 563758
59285 563758 559372 556554 554801 553732 553595 554923 557625 560977 564640 569170 575209 582696 591302 601059
59271 601059 611987 623568 635251 647063 659046 670434 680153 687892 693938 698197 700168 699766 697426
59258F97426l981n515o621p122p537q316r117r409r119q299o908n318m245l728
59244F02191k963j652n27J6O89K044L453M223M729N484O028N737M937M098K765
59229F41252M58j984l215l138k798k906l427m201n049n526n450n315n485n479
59215E87737m817m019l843m091m030l552k973k207j102j93p4l70l17O0K06J55
59199E56570L81P91Q36M05j98q54j438j404n06M69N76Q3K0O16J113R58L48k41
59181E58525l99J64J204J962K146K495L580M732N089N112N887P345Q403Q681Q867
59166F23793R424J0006J0203R904Q902O974M489K242O41m37j238k145l719n996
59152F73043q039q989r209r600j0214j0403r990r292q340p107o203o303p041p440
$$ plain form
59258 697426 693445 687930 681309 674187 666650 658334 649217 639808 630689 622390 615482 610164 605919 602191
59244 602191 599228 597576 597049 597065 597754 599798 603251 607474 612203 617687 623715 629452 634389 638487 641252
59229 641252 641710 639726 636511 633373 630575 627669 624242 620041 614992 609466 604016 598701 593216 587737
59215 587737 582920 578901 575058 570967 566937 563385 560412 558205 557103 556910 556836 556466 556149 556209 556415 556570
59199 556570 556951 557742 558578 558983 558785 557931 556493 555089 554583 555052 555628 555711 555731 556347 557460 558418 558766 558525
59181 558525 558126 558290 559494 561456 563602 566097 569677 574409 579498 584610 590497 597842 606245 614926 623793
59166 623793 633217 643223 653426 663330 672232 679206 683695 685937 686578 686141 684903 682758 679039 673043
59152 673043 665004 656015 646806 637206 626992 616589 606599 597307 588967 581860 575657 569354 562313 554873
59138E54873p275p007o616n620m203l194k832k490j811j205j057j168j111o00
59124E08684M80J878K910L214L348M058N259O352P204Q048Q768R125R358R699
59110E88385R704Q931P969P759Q176Q241P521O359M924L146J408K55m77j372k402
59095F58527l140l699m432m930m435l203k279j980j758j499j806k767l628l938
59081F15033m123m651n423o191o841p119o722n816m962m482m312m287m079l268
59067E42757k043j363j737k390k434k189k337k495j859p40j38j80k98m66r09j003
59051E20176o8J047Q50m77j383j398j473j795j235M62J754J328k42j569j929j236
59035E12812K63J577J502K39n60J75J762L170M417N921P464Q593R340R930J0289
$$ plain form
59138 554873 547598 540591 533975 528355 524152 520958 518126 515636 513825 512620 511563 510395 509284 508684
59124 508684 509164 511042 513952 517166 520514 524572 529831 536183 543387 551435 560203 569328 578686 588385
59110 588385 598089 607020 614989 622748 630924 639165 646686 653045 657969 661115 662523 662778 662301 660929 658527
59095 658527 655387 651688 647256 642326 637891 634688 632409 630429 628671 627172 625366 622599 618971 615033
59081 615033 610910 606259 600836 594645 587804 580685 573963 568147 563185 558703 554391 550104 546025 542757
59067 542757 540714 539351 537614 535224 532790 530601 528264 525769 523910 523170 523032 522852 522554 522088 521179 520176
59051 520176 520108 521155 522005 521528 520145 518747 517274 515479 514244 514706 516460 517788 517546 515977 514048 512812
59035 512812 513075 514652 516154 516393 515833 516008 517770 520940 525357 531278 538742 547335 556675 566605 576894
59020E76894J0324J0155R800R123Q208P200N795L680J345l94j608k996m418m890
59006F28218m105k811j507J50K282M250N502O124O221N728M986M632M687M590
58992F68947M235L992L754L011J951J315J079M60o01j097m81O43J614K443L241
58977F94506L942M791O071P277P663P625Q287R661J0598J0692J0773J1238J1379
58964H04503J0749R872R141Q329P474O902O070L881N38k446m468o556r384j2146
58950H32459j4066j5459j6564j6845j6232j5575j5119j3932j1663r399p953o797
58938F72855n525m831m999m921l839k645k313k300j799j234j193j013L3J123R36
58923F38335l81j647k343k712k785k442j913j304k01J382K430K235J562J617K563
$$ plain form
59020 576894 587218 597373 607173 616296 624504 631704 637499 641179 642524 642130 640522 637526 633108 628218
59006 628218 624113 621302 619795 619945 622227 626477 631979 638103 644324 650052 655038 659670 664357 668947
58992 668947 673182 677174 680928 683939 685890 687205 688284 688744 688143 687046 686565 687208 688822 691265 694506
58977 694506 698448 703239 709310 716587 724250 731875 740162 749823 760421 771113 781886 793124 804503
58964 804503 815252 825124 834265 842594 850068 856970 863040 866921 867459 865013 860545 853989 844605 832459
58950 832459 818393 802934 786370 769525 753293 737718 722599 708667 697004 687605 679652 672855
58938 672855 667330 662499 657500 652579 648740 646095 643782 641482 639683 638449 637256 636243 636276 637399 638335
58923 638335 637954 636307 633964 631252 628467 626025 624112 622808 622607 623989 626419 628654 630216 631833 634396
58908F34396L904N508P268Q590R261J0090J1605J2874J2776J1783J1299J1689
58896G51043J2109J2030J1837J2091J2968J4351J5950J7443J8780K0039K0852
58885I19493K0632J9511J8165J6553J3827R844N612J853j745n390q611j1362j4325
58872I84057j7367j9136j9098j8493j8265j7513j5301j2597j0864r848q456o876
58860H10243o202o526o998p307p753q212q326q364q742r063q713q025p836q155
58846G00021q298p980p441o887o510o680p367p889p798p463p226o772n975n414
58832F00321n284m709l068j125O5N29Q16J025J298K290M067N460N601N166N075
58817F17527N015M449L953M118M136L014J367M74K65j53p21q43j039k383m529
$$ plain form
58908 634396 638300 643808 651076 659666 668927 679017 690622 703496 716272 728055 739354 751043
58896 751043 763152 775182 787019 799110 812078 826429 842379 859822 878602 898641 919493
58885 919493 940125 959636 977801 994354 1008181 1018025 1023637 1025490 1023745 1018355 1009744 998382 984057
58872 984057 966690 947554 928456 909963 891698 874185 858884 846287 835423 825575 817119 810243
58860 810243 804041 797515 790517 783210 775457 767245 758919 750555 741813 732750 724037 716012 708176 700021
58846 700021 691723 683743 676302 669415 662905 656225 648858 640969 633171 625708 618482 611710 605735 600321
58832 600321 595037 590328 587260 586135 586200 586729 587545 588570 589868 592158 596225 601685 607286 612452 617527
58817 617527 622542 626991 630944 635062 639198 642212 643579 644053 644318 644165 643444 642601 641562 639179 634650
58802F34650n982o238o209o532o846o764o448o057n619n349n323n022m087l112
58788E55062k784k642j726j93Q67J040J027J514K515L679M597M835M262L250K183
58773E77486J096P1p18j566l062m980o232o446o411o504n962m518l320l138k973
58758E22823j755j84N35O83J276K179K550K400K281K090J579J335J959K869L178
58743E45798L113L365L825M092M456N147N502N153N033N853O651O326N567N612
58729F15493O056N779N147N359O203O368N527M419L314K084J322J702K645L161
58715F74579L511M434N417N393M613M039L462K016N0j385k448m080o082p462q391
58700F77666r894j1914j3420j4237j4939j5235j4322j2636j1462j0926j0045q549
$$ plain form
58802 634650 628668 622430 616221 609689 602843 596079 589631 583574 577955 572606 567283 562261 558174 555062
58788 555062 552278 549636 547910 547717 548584 549624 550651 552165 554680 558359 562956 567791 572053 575303 577486
58773 577486 578582 578653 577935 576369 573307 568327 562095 555649 549238 542734 536772 532254 528934 525796 522823
58758 522823 521068 520884 521419 522102 523378 525557 528107 530507 532788 534878 536457 537792 539751 542620 545798
58743 545798 548911 552276 556101 560193 564649 569796 575298 580451 585484 591337 597988 604314 609881 615493
58729 615493 621549 627328 632475 637834 644037 650405 655932 660351 663665 665749 667071 668773 671418 674579
58715 674579 678090 682524 687941 693334 697947 701986 705448 707464 707514 706129 703681 699601 693519 686057 677666
58700 677666 667772 655858 642438 628201 613262 598027 583705 571069 559607 548681 538636 530087
58688E30087p037n667m379l962m976o031n182k859j354j534k121k157k020j821
58674D78987r10O56J906K578L366M396N090N644O955Q956J0579J1543J2487J3275
58660E65508J2781J0591P434L845m7l492n495o342p174q062q057p145o401o112
58646E41832n435m122l062k768k746k518k085j333j70Q61J213J275J520J399N01
58631E24362o7Q79K405K646J580O40J74n31j181p64L53Q88J036K125M056N354
58615E43955N713O181O827O601N580N019N004M295K688J349N91m17j638k102j994
58600E87652k526l524l557k644k482l521m196l537k281j012O10K376L500M426
58586E69284O371Q820R834R199Q826R579J0184R797R232Q958Q297P302P126P864
$$ plain form
58688 530087 523050 517383 513004 509042 504066 498035 492853 489994 488640 487106 484985 482828 480808 478987
58674 478987 478077 478733 480639 483217 486583 490979 496069 501713 508668 517624 528203 539746 552233 565508
58660 565508 578289 588880 596314 600159 600112 596620 591125 584783 577609 569547 561490 554345 547944 541832
58646 541832 536397 532275 529213 526445 523699 521181 519096 517763 517593 518454 519667 520942 522462 523861 524362
58631 524362 524295 525174 527579 530225 531805 532445 532619 532088 530907 530143 530496 531384 532420 534545 538601 543955
58615 543955 549668 555849 562676 569277 574857 579876 584880 589175 591863 593212 593803 593386 591748 589646 587652
58600 587652 585126 581602 578045 575401 572919 569398 565202 561665 559384 558372 558982 561358 564858 569284
58586 569284 575655 584475 594309 603508 612334 621913 632097 641894 651126 660084 668381 675683 682809 690673
58572F90673Q245Q011Q362R532J0381J0906J2628J5786J8598K0147K1479K3158
58560H57906K4201K4268K4328K4279K2512J8694J4513J0720O156P93l134m426
58548A020810m858o175p554p614o852o485o705p495r457j2546j5615j8100k0458
58535H90896k2338k2468k1019j9767j9101j7329j3917j0781r149p719n329l095
58523G18884k273k126j517p42l57K9N68M94l12q40p90j087j923k396k571l541
58507F99500m929m976l734l348m328m583l162j880j973k249j847j795k328j809
58493F56559N1J030J77k99J191L046L700M297N946P331P469Q057J0519J3247J4338
58478G36659J4571J5233J5426J4141J2632J2087J1025P667K940j284n007q763
$$ plain form
58572 690673 698918 706929 715291 724823 735204 746110 758738 774524 793122 813269 834748 857906
58560 857906 882107 906375 930703 954982 977494 996188 1010701 1021421 1027577 1028370 1025236 1020810
58548 1020810 1015952 1009777 1002223 994609 987757 981272 974567 967072 957615 945069 929454 911354 890896
58535 890896 868558 846090 825071 805304 786203 768874 754957 744176 735027 727308 721979 718884
58523 718884 716611 714485 712968 712226 711869 711898 712466 712960 712648 711808 711018 709931 708008 705612 703041 699500
58507 699500 694571 689595 685861 682513 678185 673602 670440 668560 666587 664338 662491 660696 658368 656559
58493 656559 656610 657640 657817 657518 658709 661755 665455 669752 675698 683029 690498 698555 709074 722321 736659
58478 736659 751230 766463 781889 796030 808662 820749 831774 839441 842381 841097 836090 827327
58466H27327j1408j1668j0311q632o535l896j897j011L07L031N718P120Q319J0268
58452H06732J1577J0904R335Q130O346K884j168m375p042r560j0883j0625j0259
58439H01996j0370r299o423l953l317k713p09Q91N41K90K416N414O696O875Q038
58424G96373R846J0567J0201R585Q153N333K463P13r87l645n976o856p586r253
58410H18931j0354r637q728r162r474q085o458o334o402m866k827k020j512J49
58396G33221J956K591L116M522N214L993K845L570M426L390J941K168K999K852
58382G78804L089N104O854O247N197O242P847P180N076M066L906L188K981M752
58368H50533O937P519P672R114J0430R979R507J0867J2117J1123R973J1193J2698
$$ plain form
58466 827327 815919 804251 793940 785308 778773 774877 772980 771969 772276 775307 781025 788145 796464 806732
58452 806732 818309 829213 838548 846678 853024 855908 854740 850365 843323 833763 822880 812255 801996
58439 801996 791626 782327 775904 771951 768634 765921 765212 766103 766644 766934 769350 774764 781460 788335 796373
58424 796373 806219 816786 826987 836572 844725 850058 852521 853234 852247 848602 842626 835770 828184 818931
58410 818931 808577 798940 790212 781050 771576 763491 757033 750699 744297 739431 736604 734584 733072 733221
58396 733221 735177 737768 740884 745406 750620 754613 757458 761028 765454 768844 770785 772953 775952 778804
58382 778804 781893 786997 793851 800098 805295 811537 819384 826564 831640 835706 839612 842800 845781 850533
58368 850533 857470 864989 872661 881775 892205 902184 911691 922558 934675 945798 955771 966964 979662
58355I79662J1366Q624P434O622L583n0r52J3j28p84M63K626L207L338N637Q898
58339A039559J0135J0031J1280J3400J4275J4712J6507J8112J7215J5296J4732
58328A195254J3999J0866P446O610O367L510r9p76L65J42l85J382L621L303K495
58313A254100M751Q176Q901Q394J0276J2904J2575J1167J2942J6361J6936J5581
58301A393064J6223J7784J6667J4655J5984J8941J8908J7246J8466K1018K0068
58290A589024J7175J7774K0988K1481J9707K0652K3912K4759K3674K5136K8280
58279A832562K8504K6964K8600L2224L2647L1129L3283L8128L9935L9498M2487
58268B205961M7874M9501M8091M9979N4737N5946N3764N4640N8917O0724N9897
$$ plain form
58355 979662 991028 999652 1007086 1013708 1017291 1017241 1016289 1016302 1016174 1015390 1015853 1018479 1021686 1025024 1030661 1039559
58339 1039559 1049694 1059725 1071005 1084405 1098680 1113392 1129899 1148011 1165226 1180522 1195254
58328 1195254 1209253 1220119 1227565 1234175 1240542 1244052 1243953 1243177 1243542 1243684 1243299 1244681 1248302 1251605 1254100
58313 1254100 1258851 1267027 1275928 1284322 1294598 1307502 1320077 1331244 1344186 1360547 1377483 1393064
58301 1393064 1409287 1427071 1443738 1458393 1474377 1493318 1512226 1529472 1547938 1568956 1589024
58290 1589024 1606199 1623973 1644961 1666442 1686149 1706801 1730713 1755472 1779146 1804282 1832562
58279 1832562 1861066 1888030 1916630 1948854 1981501 2012630 2045913 2084041 2123976 2163474 2205961
58268 2205961 2253835 2303336 2351427 2401406 2456143 2512089 2565853 2620493 2679410 2740134 2800031
58257B800031O1866O5940O6138O3302O4028O7906O8616O7013O9947P6756Q0599
58246C552142Q2461Q9507J00214J05989J07249J12609J22428J28959J32507J40955
58236D675020J53355J61015J65048J75289J91572K04163K12972K27461K47300
58227F413195K62802K75141K95457L23329L47556L68919L99716M39979M77917
58218I604011N14725N63942O25155O85021P45574Q23382R19289J019181J126487
58209A6626767J261861J428854J614674J827307K094942K427166K818815L295747
58201C3396133L912210M699871N668882O860629Q339964J0130046J2220491J4641426
58193I9869652J7436993K0530009K3678991K6582947K8966209L0626220L1592194
$$ plain form
58257 2800031 2861897 2927837 2993975 3057277 3121305 3189211 3257827 3324840 3394787 3471543 3552142
58246 3552142 3634603 3724110 3824324 3930313 4037562 4150171 4272599 4401558 4534065 4675020
58236 4675020 4828375 4989390 5154438 5329727 5521299 5725462 5938434 6165895 6413195
58227 6413195 6675997 6951138 7246595 7569924 7917480 8286399 8686115 9126094 9604011
58218 9604011 10118736 10682678 11307833 11992854 12738428 13561810 14481099 15500280 16626767
58209 16626767 17888628 19317482 20932156 22759463 24854405 27281571 30100386 33396133
58201 33396133 37308343 42008214 47677096 54537725 62877689 73007735 85228226 99869652
58193 99869652 117306645 137836654 161515645 188098592 217064801 247691021 279283215
58186B79283215L2183150L2464402L1335069K6515438J6186702J023077j5566607
58179D03424446k9448436l8123524m1448483m0719365l7504392l3096538k8408390
58172A54675318k3960646j9961156j6481976j3561946j1177536r234606p644683
58165E2652769o363813n344893m514679l821559l256661k808214k438269k120153
58157B1984528j857256j648246j469799j307785j171457j063159r64963q67414
58149A1634449p82154p14491o50938n84781n27678m85062m44788m00737l64284
58140F679536l41877l22952l00060k80415k67956k53632k32976k14930k04244
58131D260494j92550j75304j60676j53292j45391j32307j21160j16266j10825
$$ plain form
58186 279283215 311466365 343930767 375265836 401781274 417967976 418991053 403424446
58179 403424446 373976010 335852486 294404003 253684638 216180246 183083708 154675318
58172 154675318 130714672 110753516 94271540 80709594 69532058 60297452 52652769
58165 52652769 46288956 40944063 36429384 32607825 29351164 26542950 24104681 21984528
58157 21984528 20127272 18479026 17009227 15701442 14529985 13466826 12501863 11634449
58149 11634449 10852295 10137804 9486866 8902085 8374407 7889345 7444557 7043820 6679536
58140 6679536 6337659 6014707 5714647 5434232 5166276 4912644 4679668 4464738 4260494
58131 4260494 4067944 3892640 3731964 3578672 3433281 3300974 3179814 3063548 2952723
58122B952723j00852r3013r1013q7981p9850p3169p2290p1429o6421o2233o2017
58111B092455o0509n4840n0595n0740m9711m4599m1194m2813m3851m0523l7613
58100A575467l8502l8635l4896l1787l2349l2380k9234k7137k8335k8188k4439
58089A229585k2137k3935k4563k0589j6743j6910j7486j5376j4215j6742j9039
58078A021850j8079j7362j9393k0243j7184j4373j5301j6674j5267j3884j5020
58067H39070j5447j2640j0071j0689j1470r559p658q224q514o448n253p237r004
58054G16856p845o920q931j0656q927o433o344o672n146m258o223q068o938n376
58040F18119o298p598o723n761o959p869n971l708m015n145m754m760p282r886
$$ plain form
58122 2952723 2851871 2758858 2667845 2579864 2500014 2426845 2354555 2283126 2216705 2154472 2092455
58111 2092455 2031946 1977106 1926511 1875771 1826060 1781461 1740267 1697454 1653603 1613080 1575467
58100 1575467 1536965 1498330 1463434 1431647 1399298 1366918 1337684 1310547 1282212 1254024 1229585
58089 1229585 1207448 1183513 1158950 1138361 1121618 1104708 1087222 1071846 1057631 1040889 1021850
58078 1021850 1003771 986409 967016 946773 929589 915216 899915 883241 867974 854090 839070
58067 839070 823623 810983 800912 790223 778753 769194 761536 753312 744798 738350 733097 725860 716856
58054 716856 709011 702091 693160 682504 673577 667144 660800 654128 648982 644724 638501 630433 623495 618119
58040 618119 611821 604223 597500 591739 584780 576911 570940 567232 563217 558072 553318 548558 541276 531390
58026E31390r749q658r198r828q327o369o153o147m565l389m581n901m779k847
58012D40899k499k491j088l7j205k662k131r97j077r18Q66K159J070m36m00o34
57996D28419k764m434l533k355l332m395k990r95j065j609j65J529P67r24o93
57981D01461L75l51j989k185j783k786l975l090j256r23j434q05J52l43j170l11
57965C79587J187J190M57Q75J699J254L59M92O36m46j194j11Q73l52j947j297
57949C83262K09j55j374o89J363K345K567L959N934O653O818Q136R586R378Q952
57934D46944J0738J3362J3496J1203R208P907N422J785j110l119n583q101r106
57921D93046r038r497j0059r247p748p294p340o237m592m126m214l053j227n75
$$ plain form
58026 531390 521641 512983 503785 493957 485630 479261 473108 466961 462396 459007 454426 448525 443746 440899
58012 440899 438400 435909 434821 434784 433579 430917 428786 427789 426712 425794 426660 428819 429889 429453 429053 428419
57996 428419 425655 421221 417688 415333 412001 407606 404616 403621 402556 400947 400782 402311 403078 402154 401461
57981 401461 401836 401485 399496 397311 395528 392742 388767 385677 384421 383498 382064 381259 381411 381068 379898 379587
57965 379587 380774 381964 382421 383296 384995 386249 386608 387100 387736 387290 386096 385985 386858 386506 384559 383262
57949 383262 383471 383316 381942 381253 382616 384961 387528 391487 397421 404074 410892 419028 428614 437992 446944
57934 446944 457682 471044 484540 495743 504951 512858 518280 520065 518955 515836 510253 502152 493046
57921 493046 484008 474511 464452 455205 447457 440163 432823 426586 421994 417868 413654 410601 409374 408799
57907D08799o41K45J344O45j232k009j740k317l623l845l038k869l249k578r73
57892C82919q5o6K29O83M63L75J594K894K255M10l89k18p67j763j662j069j889
57875C83914l573l856k766k344k713k048k93O31L51M66J370J823J755K465L933
57860C79115M791M937N391N811M985L574L388M215M158K892J703O58j232l330
57846D21056l973l582m140n760o663o434o290o276n230l468k534k421j937j461
57832C60887k302l585l111j175j69m12J71K019L065K450J774J967J962J226Q21
57817C65588J220J547J364Q72p04m152p762q794p557o937p753p843o266m838m694
57802C03291m523l358k182j616o83R70K131K331K694L670M172L815L659M068M163
$$ plain form
57907 408799 408158 408403 409747 410392 409160 407151 405411 403094 399471 395626 392588 389719 386470 383892 382919
57892 382919 382834 382768 382997 383680 384143 384518 386112 389006 391261 391671 391282 391064 390297 388534 386872 385803 383914
57875 383914 380341 376485 373719 371375 368662 366614 366321 366952 367303 367769 369139 370962 372717 375182 379115
57860 379115 383906 388843 394234 400045 405030 408604 411992 416207 420365 423257 424960 425618 424386 421056
57846 421056 417083 413501 409361 403601 396938 390504 384214 377938 372708 369240 366706 364285 362348 360887
57832 360887 358585 355000 351889 350714 350545 350133 350304 352323 355388 357838 359612 361579 363541 364767 365588
57817 365588 366808 368355 369719 370591 369887 365735 357973 349179 341622 334685 326932 319089 312823 307985 303291
57802 303291 298768 295410 293228 291612 290929 291899 294030 296361 299055 302725 306897 310712 314371 318439 322602
57787C22602L986M791O509P368O775O099O004N489M339L864M347M250K981J972
57773C91376K006J870P15n80j484k990n480p524q046p831p798p594o890o342o278
57758C27130o021n221m355l488k265j355j875l087k893j060M39P08J038K088K617
57743C02400J946J262J309J162M08K71J296K050J490O23N51O92K70j91r0P8j82
57726C15345n02p52j401k157j933q25l21q67j227r26j167k476l578l650l620m141
57710B85802m347l756l458m051m365l481k341k073k289k288k306k423j826l23
57696B46475Q88R76M94j12j297k807l112j590L04J137J165J059P60N56J506L674
57680B50076N630O736Q221J0994J4253J7356K1150K6125L1041L4767L7817M0796
$$ plain form
57787 322602 326588 331379 337888 345256 352031 358130 364134 369623 373962 377826 382173 386423 389404 391376
57773 391376 393382 395252 395967 395387 393903 390913 385433 377909 369863 362032 354234 346640 339750 333408 327130
57758 327130 321109 315888 311533 308045 305780 304425 302550 299463 296570 295510 295949 296657 297695 299783 302400
57743 302400 304346 305608 306917 308079 308487 308758 310054 312104 313594 314217 314768 315460 315730 315539 315449 315527 315345
57726 315345 314843 314091 312690 310533 308600 307775 307454 306587 305360 304434 303267 300791 297213 293563 289943 285802
57710 285802 281455 277699 274241 270190 265825 262344 260003 257930 255641 253353 251047 248624 246798 246475
57696 246475 247363 248339 248833 248721 247424 244617 241505 239915 240219 241356 242521 243580 244340 244896 246402 250076
57680 250076 255706 262442 270663 281657 295910 313266 334416 360541 391582 426349 464166 504962
57668E04962M3012M3938M4186M3367L8632K7157R316j1604l1594m6978n5189n6290
57656E52915n2813m7171m0211l2717k6283k1582j7574j3560j0415q647p183n323
57644B69436m057l981l778k363q17m68o34j08O66O79L57O60J261J269P74K79l94
57627B58781j297j657j215j068j885k638k369j847k064k490k257j756j596j306
57613B33336n46k27q67j284n11L59n7j123j454j241j433j770j447q01o17o55n08
57596B19154q13j959k700j996j115j866l575l915k272k64P36P95L41l93r26q42
57580A98390n14n50q39r86j123j389j332p44l19o14j174j484j800k173j904r44
57564A80501m94j080j347j52J480J915J217M91O2j76J76J159J738J360J027J484
$$ plain form
57668 504962 547974 591912 636098 679465 718097 745254 754570 742966 711372 664394 609205 552915
57656 552915 500102 452931 412720 380003 353720 332138 314564 301004 290589 281942 274759 269436
57644 269436 265379 261398 257620 255257 254440 253972 253338 253230 253896 254575 254932 255592 256853 258122 258896 259175 258781
57627 258781 257484 255827 254612 253544 251659 249021 246652 244805 242741 240251 237994 236238 234642 233336
57613 233336 232790 232563 231696 230412 229901 230260 230203 229080 227626 226385 224952 223182 221735 220934 220317 219662 219154
57596 219154 218341 216382 213682 211686 210571 208705 205130 201215 198943 198679 199415 200210 200551 200158 199232 198390
57580 198390 197876 197326 196487 195501 194378 192989 191657 190913 190594 189980 188806 187322 185522 183349 181445 180501
57564 180501 180007 178927 177580 177428 178908 180823 182040 182531 182593 182417 182593 183752 185490 186850 187877 189361
57548A89361J841J396J327K611L881L434K043J518J664J182N35J254K952L568
57534B18567K471J088M09m4q08j639k256k556k333j775j687k139j888m19O64k7
57518B05628j256j099p5k2q20q11R1L81k41n40k05k52q69j072p28q40j549j733
57500A93988r65j57N6nj62o43j093q02p8K7o28j178j270j262j093l69O06J163
57482A86135J461J940K066J141j05m42k35p50j684j533k93K62o53j818k055j529
57466A81908o23P09J962K056R56M2K86J124J529J188L59m87p53l17J0m69j138
57449A88342q91K00J186J732K026J793Q40J06N82J599J807J365J389J634Q44p67
57433B03787j493p81Q6K13J64N03R22J198J490J435M86p14q09K46J103J064O49
$$ plain form
57548 189361 191202 192598 193925 196536 200417 203851 205894 207412 209076 210258 210793 212047 214999 218567
57534 218567 221038 222126 222535 222491 221683 220044 217788 215232 212899 211124 209437 207298 205410 204991 205655 205628
57518 205628 204372 203273 203198 203176 202356 201545 201636 202017 201776 201236 201031 200779 199910 198838 198110 197270 195721 193988
57500 193988 193023 192866 192922 192917 192755 192112 191019 190217 190139 190166 189538 188360 187090 185828 184735 184366 184972 186135
57482 186135 187596 189536 191602 192743 192638 192196 191961 191211 189527 187994 187701 187963 187310 185492 183437 181908
57466 181908 181285 181994 183956 186012 186968 187010 187296 188420 189949 191137 191496 191009 190256 189939 189949 189480 188342
57449 188342 187451 187651 188837 190569 192595 194388 195228 195334 195916 197515 199322 200687 202076 203710 204554 203787
57433 203787 202294 201513 201599 201812 201976 202479 203401 204599 206089 207524 208010 207296 206487 206733 207836 208900 209549
57416B09549J77n22r39k71R39J312R39J273K472K948J983Q17M49K72k95n80k8
57399B20495P12R23Q10O65L14l2K75J032J173N32K18O83J009P28Q22K017L419
57382B35795L827L271K500J905J652J859K120J730Q42M26P78J199J339J621J977
57367B62841J618N59m1M23J141J304J162J150J127J061J310J739J650J016O34
57352B78694P60Q59R32J691K939L340K372J108M33j0m69k24R83K012J835R52L76
57335B98583K68L68P97J576K148K139J924J842J690J362J168J137R47P84J271
57320C18004K258K783K559K329K554K886L162L572L664K698J276R98K014K631
57306C53388J948J198J591K524K890K781K802K932L051L417L836L510K540K226
$$ plain form
57416 209549 209726 209204 208265 207994 208933 210245 211184 212457 214929 217877 219860 220677 221126 221398 221103 220523 220495
57399 220495 221207 222130 222940 223605 223919 223887 224162 225194 226367 226899 227117 227800 228809 229537 230359 232376 235795
57382 235795 239622 242893 245393 247298 248950 250809 252929 254659 255501 255927 256705 257904 259243 260864 262841
57367 262841 264459 265018 264977 265400 266541 267845 269007 270157 271284 272345 273655 275394 277044 278060 278694
57352 278694 279454 280313 281245 282936 285875 289215 291587 292695 293128 293118 292649 292425 293408 295420 297255 298207 298583
57335 298583 298851 299219 300016 301592 303740 305879 307803 309645 311335 312697 313865 315002 315949 316733 318004
57320 318004 320262 323045 325604 327933 330487 333373 336535 340107 343771 346469 347745 348743 350757 353388
57306 353388 355336 356534 358125 360649 363539 366320 369122 372054 375105 378522 382358 385868 388408 390634
57292C90634L128M085M091L728L871M289M603N244O416P263P276P327Q184R164
57278D69303R390R255R392R277Q292P228P321Q367R107Q915Q073O841N360M088
57264E80209L387K994K500J926J462J173J351K293L423L675L120L014L798M408
57250F18733M191M085M895N902O249O502P514Q788R267Q971Q574Q159P562P303
57236G16695P974R142R844R822R526R355R553J0326J1466J2387J3004J3810J4848
57223H57752J5514J5777J6402J7459J7819J6940J5954J6080J6957J7464J7269
57212A041387J6719J6075J5645J5875J6690J7461J8046J8896J9888K0319K0366
57201A237367K1088K2578K3730K4368K5706K7929K9365K9115K8586K9061K9670
$$ plain form
57292 390634 393762 397847 401938 405666 409537 413826 418429 423673 430089 437352 444628 451955 460139 469303
57278 469303 478693 487948 497340 506617 514909 522137 529458 537825 546932 555847 563920 570761 576121 580209
57264 580209 583596 586590 589090 591016 592478 593651 595002 597295 600718 604393 607513 610527 614325 618733
57250 618733 622924 627009 631904 637806 644055 650557 658071 666859 676126 685097 693671 701830 709392 716695
57236 716695 724669 733811 743655 753477 763003 772358 781911 792237 803703 816090 829094 842904 857752
57223 857752 873266 889043 905445 922904 940723 957663 973617 989697 1006654 1024118 1041387
57212 1041387 1058106 1074181 1089826 1105701 1122391 1139852 1157898 1176794 1196682 1217001 1237367
57201 1237367 1258455 1281033 1304763 1329131 1354837 1382766 1412131 1441246 1469832 1498893 1528563
57190A528563K9364K8951K9379K9625K8429K6772K6447K7202K7351K6512K5734
57179A834329K5517K5612K6273K7978L0179L1763L2506L2860L2847L2407L2246
57168B164517L3039L4229L4784L4602L4236L3852L3481L3470L3745L3492L2579
57157B536026L2230L3155L4131L3747L2533L1862L1797L1542L1183L1378L1985
57146B891569L2475L3059L4118L5237L6003L6916L8245L8912L7993L6494L6110
57135C287131L6977L8073L9083M0336M1521M2063M2311M3078M4462M6269M9019
57124C750323N3416N9374O6543P5012Q4619R4409J03741J12951J22101J30250
57114D652739J36947J43282J50629J59774J72189J90434K15910K47663K84561
$$ plain form
57190 1528563 1557927 1586878 1616257 1645882 1674311 1701083 1727530 1754732 1782083 1808595 1834329
57179 1834329 1859846 1885458 1911731 1939709 1969888 2001651 2034157 2067017 2099864 2132271 2164517
57168 2164517 2197556 2231785 2266569 2301171 2335407 2369259 2402740 2436210 2469955 2503447 2536026
57157 2536026 2568256 2601411 2635542 2669289 2701822 2733684 2765481 2797023 2828206 2859584 2891569
57146 2891569 2924044 2957103 2991221 3026458 3062461 3099377 3137622 3176534 3214527 3251021 3287131
57135 3287131 3324108 3362181 3401264 3441600 3483121 3525184 3567495 3610573 3655035 3701304 3750323
57124 3750323 3803739 3863113 3929656 4004668 4089287 4183696 4287437 4400388 4522489 4652739
57114 4652739 4789686 4932968 5083597 5243371 5415560 5605994 5821904 6069567 6354128
57105F354128L27206L76787M34181N01941N85628O91947Q27030R97382J210058
57096A2306288J470253J780101K139995K548132K998006L479568L983477M500348
57088C5206168N015695N511530N975136O401902O790370P141471P454699P694555
57080H7191526P740101P389949O466032M943778K983489Q34721j285206l236522
57072A13027868m931081o303724p312748p948694q232180q205918p927497p460467
57064E4705559o865120o194996n497280m810510m161319l566152l035479k574023
57056A8000680k179215j844112j562497j329308j137855r80260q50455p44157
57048G372821o56512n82435n18969m64898m18398l77076l39770l06290k75775
$$ plain form
57105 6354128 6681334 7058121 7492302 7994243 8579871 9271818 10098848 11096230 12306288
57096 12306288 13776541 15556642 17696637 20244769 23242775 26722343 30705820 35206168
57088 35206168 40221863 45733393 51708529 58110431 64900801 72042272 79496971 87191526
57080 87191526 94931627 102321576 108787608 113731386 116714875 117549596 116264390 113027868
57072 113027868 108096787 101793063 94480315 86531621 78299441 70093523 62166026 54705559
57064 54705559 47840439 41645443 36148163 31337653 27176334 23610182 20574703 18000680
57056 18000680 15821465 13977353 12414856 11085548 9947693 8967433 8116978 7372821
57048 7372821 6716309 6133874 5614905 5150007 4731609 4354533 4014763 3708473 3432698
57039C432698k47113k20271j95309j70853j45418j19623r5333p3422n3980l7510
57029B073866k3959j2089k740j784j6005m5066p9653j08323j24798j29028j24111
57018A406310j13870j01712q9748p8590o8280n9141n1644m5830m1089l6537l1878
57007F87991k7874k5393k3929k1960j9138j6940j6584j7295j7427j6396j4643
56996D70412j2673j1019j0346j0545j0398q963o674m373k108L39K597M326N902
56983D06477P581Q739Q666P299M435o19p588j4330j8613k0196k0197j9240j7254
56970C25160j4446j1359q366n756l651j369K189O771J0544J2419J3494J5132J6881
56957C57643J7626J7593J7557J6723J3083N774l947j3753k1467k5785k6851k5839
$$ plain form
57039 3432698 3185585 2965314 2770005 2599152 2453734 2334111 2238778 2165356 2111376 2073866
57029 2073866 2049907 2037818 2035078 2033294 2017289 1972223 1892570 1784247 1659449 1530421 1406310
57018 1406310 1292440 1190728 1100980 1022390 954110 894969 843325 797495 756406 719869 687991
57007 687991 660117 634724 610795 588835 569697 552757 536173 518878 501451 485055 470412
56996 470412 457739 446720 436374 425829 415431 406468 399794 395421 393313 393652 396249 400575 406477
56983 406477 414058 422797 431463 438762 443197 442578 434990 420660 402047 381851 361654 342414 325160
56970 325160 310714 299355 290989 285233 281582 280213 282402 289173 299717 312136 325630 340762 357643
56957 357643 375269 392862 410419 427142 440225 445999 442052 428299 406832 381047 354196 328357
56945C28357k3494j9711j4953j0800q082n567j715L106P447J0954J4437J8274
56933B98253K1962K4912K6810K7510K7147K5596K1410J2543q34j5254k6766l3933
56921D09356l7243l7156l4269l0210k6440k2742j8342j3909j0919r595q926q274
56909A51331p636o805n639m693m387l969k569p22L93P57J237K075K914L876N282
56894A31445O768P904R254J1596J4516J7016J8976K0831K2395K3262K3716K3714
56882C31393K1657J5915P270j684r198j4887j8108j7939j4913j1004p396l582
56870B77524J096O316J1561J6876K2398K8015L3770L9762M5451M9809N2395N3625
56858F38598N3776N1928M5976L3677J4611q236k9428m4501n2194n3373m9129m0903
$$ plain form
56945 328357 304863 285152 270199 259399 251317 245750 244035 247141 254588 265542 279979 298253
56933 298253 320215 345127 371937 399447 426594 452190 473600 486143 485309 470055 443289 409356
56921 409356 372113 334957 300688 270478 244038 221296 202954 189045 178126 168531 159605 151331
56909 151331 143695 136890 131251 126558 122171 118202 115633 114911 115304 116061 117298 119373 122287 126163 131445
56894 131445 138213 146117 155371 166967 181483 198499 217475 238306 260701 283963 307679 331393
56882 331393 353050 368965 376235 374551 365353 350466 332358 314419 299506 288502 281106 277524
56870 277524 278620 284936 296497 313373 335771 363786 397556 437318 482769 532578 584973 638598
56858 638598 692374 744302 790278 823955 838566 830330 800902 756401 704207 650834 601705 560802
56846E60802l1093k1767j3070m000N845J6303K7552L9607N1486O2124P1385P9137
56834H44311Q4308Q6373Q6407Q4431P6511N7217K5545j3009n0170p9193r6396
56823A106335j01409r7088q7693p6116o3262m9692l6314k3438j0706J754J3335
56812E75706K4157L4884M5059N2974N7627N9712O0256N8930N3692M1549K0373
56801A084919q392l8783o3492p8474q4035q2299p5272o5102n4062m3508l3695
56790D57805k4706j6637q979j158O423J2983J8710K4071K8213K9861K9587K9083
56778E85256K7831K2639J1378m281k0522l4284m3905m8648m8975m6521m2763l8202
56766C19003l3143k8303k4126k0371j6898j4135j2251j0703r011p387o155n248
$$ plain form
56846 560802 529709 507942 494872 490872 496717 513020 540572 580179 631665 693789 765174 844311
56834 844311 928619 1014992 1101399 1185830 1262341 1319558 1345103 1332094 1281924 1202731 1106335
56823 1106335 1004926 907838 820145 744029 680767 631075 594761 571323 560617 562371 575706
56812 575706 599863 634747 679806 732780 790407 850119 910375 969305 1022997 1064546 1084919
56801 1084919 1076527 1037744 974252 895778 811743 729444 654172 589070 535008 491500 457805
56790 457805 433099 416462 407483 406325 412748 425731 444441 468512 496725 526586 556173 585256
56778 585256 613087 635726 647104 642823 622301 588017 544112 495464 446489 399968 357205 319003
56766 319003 285860 257557 233431 213060 196162 182027 169776 159073 150062 142675 136520 131272
56754A31272m544m149m079m139m203m159l699k726j728j114o15J3J90n28j309
56739I4483j084k61n7n04n94k24k81q59j001l65K75M77O36R09R57R06J261J717
56721I6391J453P01N51J075J166N23K18Q55J621J738J458J129N91L1K23J292K268
56704A13284K383J870J200N04qj00r8m42p21k90L54J86m95m76K21L80j60k30M59
56685A17821P88L45J22N14N20l21j084j259j596k254k034m71R82J077M70K20Q4
56668A13924m01n99J42J227J813K059K320K272J766J457J598J336K36o98n75k0
56652A27857N5n4K55N75L55J25O17J412J637J291R05M92j14n50m04Q1M64P16Q48
56633A36563O74M02N81J038Q47k34j337j883k212k392j839p03j66n96q59l12P1
$$ plain form
56754 131272 126728 122579 118500 114361 110158 105999 102300 99574 97846 96732 96117 96130 96320 95792 94483
56739 94483 93399 93138 93081 92577 91983 91759 91478 90619 89618 89253 89528 90005 90641 91550 92507 93413 94674 96391
56721 96391 97844 98545 99096 100171 101337 101860 102078 102933 104554 106292 107750 108879 109470 109501 109724 111016 113284
56704 113284 115667 117537 118737 119241 119233 119133 119035 118593 117872 117582 117936 118122 117627 117151 117372 117752 117592 117362 117821
56685 117821 118609 118954 119076 119590 120110 119789 118705 117446 115850 113596 111562 111091 112073 113150 113620 113840 113924
56668 113924 113523 112924 113066 114293 116106 118165 120485 122757 124523 125980 127578 128914 129150 128452 127877 127857
56652 127857 127912 127858 128113 128688 129043 129168 129785 131197 132834 134125 135030 135522 135408 134858 134454 134535 134999 135715 136563
56633 136563 137237 137639 138220 139258 140105 139871 138534 136651 134439 132047 130208 129505 129339 128743 127884 127572 127643
56616A27643m91j139r01l19k98n66n46n01o82m23N63J133L09j072j535r69k62
56599A19944J70M28N03O13J283K285K490J636R35J106J160K89n88l98L19O01O95
56582A33471J036R41m5q00k32Q84J342J551K394L177K739J676J456K018K221K055
56566A55884K516L672M594M925M961M670M015L765M458N147M641L305K174J114
56552B09841m65j871k055j561j659k116j841j221j641k912l356k460j470j236
56538A83977j366j582k172k771k461j346n64m78l67M7K19J28M26J076J270R31
56522A74967Q36J031O09n82j484j437r50m57L29J315J617Q82j7k13Q2K23M7k76
56504A76522o48q94q13n84n41n47k36J62L5n60q78o48m08n54p96p86o15m66k94
$$ plain form
56616 127643 127152 126013 125112 124793 124495 123929 123383 122882 122200 121777 122340 123473 123782 122710 121175 120206 119944
56599 119944 120114 120542 121045 121658 122941 125226 127716 129352 130287 131393 132553 132842 132254 131856 132175 132776 133471
56582 133471 134507 135448 135403 134603 134371 135255 136597 138148 140542 143719 146458 148134 149590 151608 153829 155884
56566 155884 158400 162072 166666 171591 176552 181222 185237 189002 193460 198607 203248 206553 208727 209841
56552 209841 209376 207505 205450 203889 202230 200114 198273 197052 195411 192499 189143 186683 185213 183977
56538 183977 182611 181029 178857 176086 173625 172279 171715 171237 170870 170917 171136 171264 171690 172766 174036 174967
56522 174967 175803 176834 177443 176861 175377 173940 172990 172533 172862 174177 175794 176676 176659 176446 176528 176751 176798 176522
56504 176522 175874 174980 174167 173583 173042 172495 172259 172421 172456 171896 171018 170370 169962 169408 168612 167826 167211 166745 166451
56485A66451j9L20O17O76L33j32r4N37R83O50m4l59k56q1J16L40K65j81m01j3
56465A69708M90N89N91Q77J056O47n4n88j030j335r24K10R56N88j01j40J95L34
56447A72069O04J224J351N57N4Q11J697J299M04O50J639J670O71J09L87N95N55
56430A86346R52J566J471R72J250K012J675L6j221j060l09O6J77K85K00L5K01
56413A94654L81j12q46o48M07R60N42K65R20J819K072J742J292Q78N85M87L62
56396B05760J29M20J678K998L050J987J176J206J459J479J427J295R19P12J124
56381B26819J620J411Q33P44R04M86k13k10K40o2j201j949j683r65k69M24Q67
56364B27796P33M89P34J042P40L46O52J037M40n08l01R25J691J634J613J731J322
$$ plain form
56485 166451 166432 166752 167369 168045 168378 168246 168152 168689 169672 170322 170278 169919 169663 169582 169698 170038 170303 170122 169721 169708
56465 169708 170198 170787 171378 172255 173311 173958 173904 173316 172286 170951 170027 170237 171193 171781 171680 171540 171735 172069
56447 172069 172673 173897 175248 175805 175859 176670 178367 179666 180070 180720 182359 184029 184700 184809 185196 185791 186346
56430 186346 187298 188864 190335 191307 192557 194569 196244 196280 195059 193999 193690 193756 193933 194218 194418 194453 194654
56413 194654 195035 194923 194077 193429 193836 194796 195338 195603 196523 198342 200414 202156 203448 204326 204911 205398 205760
56396 205760 205889 206309 207987 210985 214035 216022 217198 218404 219863 221342 222769 224064 224983 225695 226819
56381 226819 228439 229850 230683 231427 232331 232817 232604 232394 232634 232572 231371 229422 227739 226774 226505 226929 227796
56364 227796 228529 229018 229752 230794 231534 231880 232532 233569 234009 233501 233200 234125 235816 237450 239063 240794 242116
56347B42116P50J031J818J808J022O37P61N96M89J493L019L371K633K455L023
56332B67022K888J966J906L011L503K610J751J930K312K248K421L062L160K309
56318C02099J422R32K61m63k03R27J564J485J863K764K788J846J699K953M007
56303C25944L890L706M207M346L461K711L065L837M269M695N207N127M666N070
56289C84201O313O808O176O054P235Q326Q325Q225Q977R993J0829J2144J3887
56276D97493J4707J4321J4374J5770J7301J8019J8882K0795K3079K5032K6992
56265G06765K9038L0681L2699L6816M2715M7962N1972N7312O5736P5607Q4866
56254A262169R3924J03865J14189J24158J34239J44522J53679J60989J67243J72379
$$ plain form
56347 242116 242866 243897 245715 247523 248545 249182 249943 250539 251028 252521 255540 258911 261544 263999 267022
56332 267022 269910 271876 273782 276793 280296 282906 284657 286587 288899 291147 293568 296630 299790 302099
56318 302099 303521 304453 304714 304251 304048 304975 306539 308024 309887 312651 315439 317285 318984 321937 325944
56303 325944 329834 333540 337747 342093 345554 348265 351330 355167 359436 364131 369338 374465 379131 384201
56289 384201 390514 397322 403498 409552 416787 425113 433438 441663 450640 460633 471462 483606 497493
56276 497493 512200 526521 540895 556665 573966 591985 610867 631662 654741 679773 706765
56265 706765 735803 766484 799183 835999 878714 926676 978648 1035960 1101696 1177303 1262169
56254 1262169 1356093 1459958 1574147 1698305 1832544 1977066 2130745 2291734 2458977 2631356
56244B631356J74423J72131J66317J57329J43735J25014J02873P8499N1178K1277
56234C824132q373l5885o2245q7813j09883j26127j37845j47256j54108j57315
56224B797282j57596j55905j51531j44279j36283j29235j21953j13095j04049
56215A583356r6537q9576q1595p3555o7187o1964n6487n1172m6971m3076l8439
56204H76797l3961l0842k8275k5042k1770j9449j7465j5167j3516j3096j2454
56193F45760j0572q864q522q138o316m405m065m345l796l299m067m899m236l011
56179E67225k756k771j783n01K0O30K177L440L414L471M727N666M969M285N318
56164E97531O711O689O409P600R318J0141J1079J3189J4898J4960J5499J8603
$$ plain form
56244 2631356 2805779 2977910 3144227 3301556 3445291 3570305 3673178 3751677 3802855 3824132
56234 3824132 3815759 3779874 3717629 3629816 3519933 3393806 3255961 3108705 2954597 2797282
56224 2797282 2639686 2483781 2332250 2187971 2051688 1922453 1800500 1687405 1583356
56215 1583356 1486819 1397243 1315648 1242093 1174906 1112942 1056455 1005283 958312 915236 876797
56204 876797 842836 811994 783719 758677 736907 717458 699993 684826 671310 658214 645760
56193 645760 635188 626324 617802 609664 603348 598943 594878 590533 586737 583438 579371 574472 570236 567225
56179 567225 564469 561698 559915 559414 559434 560064 562241 565681 569095 572566 577293 582959 587928 592213 597531
56164 597531 604242 610931 617340 624940 634258 644399 655478 668667 683565 698525 714024 732627
56152G32627K2551K4992K7311L2015L8292M4081N0193N8387O7610P6143Q5207
56141A259409R6381J07700J16284J22511J27456J28686J23046J11578R7410Q1252
56131B371713O3524M8272L9657L6182L3084K8545K2924J4452J314j3638k5651
56120B620378l4206m1665m8032n2508n8312o9754q5534j00355j11943j20972j25685
56109A771412j22925j13880j02969r1476p7804o3187n1264m2401l4088k6529k2209
56098A022680k0286j7129j2309q648o653m294j854j443k025m77K657L947L269
56085I57435L673N418N873N054N637P564Q166P451P812Q956Q595P568Q588J0677
56071A058467J0687R501J0562J3128J3556J2428J3519J6327J6808J5147J5448
$$ plain form
56152 732627 755178 780170 807481 839496 877788 921869 972062 1030449 1098059 1174202 1259409
56141 1259409 1355790 1463490 1579774 1702285 1829741 1958427 2081473 2193051 2290461 2371713
56131 2371713 2435237 2483509 2523166 2559348 2592432 2620977 2643901 2658353 2659667 2646029 2620378
56120 2620378 2586172 2544507 2496475 2443967 2385655 2315901 2230367 2130012 2018069 1897097 1771412
56109 1771412 1648487 1534607 1431638 1340162 1262358 1199171 1147907 1105506 1071418 1044889 1022680
56098 1022680 1002394 985265 972956 964308 957655 953361 951507 950064 948039 947562 950219 954166 957435
56085 957435 961108 966526 972399 977453 983090 990654 998820 1006271 1014083 1023039 1031634 1039202 1047790 1058467
56071 1058467 1069154 1078655 1089217 1102345 1115901 1128329 1141848 1158175 1174983 1190130 1205578
56060A205578J7810J8121J5910J5035J6203J6099J4404J4336J5768J5154J2808
56049A377226J2837J5425J6562J5949J7407K0919K2264K1215K2102K5363K6648
56038A593917K5318K5586K8160K9061K7901K8957L2697L4699L4297L5826L9910
56027A936329M2098M1524M2339M5203M6155M5128M6542N0340N1701N0807N3097
56016B451263N8742O1917O1910O4369P0147P3734P4440P7900Q4679Q8813Q9682
56005C257596R3551J01218J06347J08222J13548J23106J29685J31927J36933J46410
55995D448543J54018J59195J69015J83427J93979K00461K12697K32114K48572
55986F202021K59737K75869L00471L24557L45602L73251M10049M46078M79253
$$ plain form
56060 1205578 1223388 1241509 1257419 1272454 1288657 1304756 1319160 1333496 1349264 1364418 1377226
56049 1377226 1390063 1405488 1422050 1437999 1455406 1476325 1498589 1519804 1541906 1567269 1593917
56038 1593917 1619235 1644821 1672981 1702042 1729943 1758900 1791597 1826296 1860593 1896419 1936329
56027 1936329 1978427 2019951 2062290 2107493 2153648 2198776 2245318 2295658 2347359 2398166 2451263
56016 2451263 2510005 2571922 2633832 2698201 2768348 2842082 2916522 2994422 3079101 3167914 3257596
56005 3257596 3351147 3452365 3558712 3666934 3780482 3903588 4033273 4165200 4302133 4448543
55995 4448543 4602561 4761756 4930771 5114198 5308177 5508638 5721335 5953449 6202021
55986 6202021 6461758 6737627 7038098 7362655 7708257 8081508 8491557 8937635 9416888
55977I416888N20753N73699O27659O81436P48668Q33368R23953J019918J138929
55968A6485271J288720J459565J654533J898033K204442K570848L012842L572727
55960C4146981M280381N145329O200325P506208R096383J0967638J3141608J5661731
55952A06146584J8480586K1397297K4136409K6442679K8128968K9190649K9877537
55945B83800709L0307635K9678338K6063949J7630097M483176j0735893k4298152
55938C56929859l3537349l7840566l8105525l5711123l1905777k7625431k3447380
55931A28756708j9633590j6279922j3432695j1086115r167816p595468o322188
55924D5238914n306676m484974l802984l243066k793600k422752k103492j834995
$$ plain form
55977 9416888 9937641 10511340 11138999 11820435 12569103 13402471 14326424 15346342 16485271
55968 16485271 17773991 19233556 20888089 22786122 24990564 27561412 30574254 34146981
55960 34146981 38427362 43572691 49773016 57279224 66375607 77343245 90484853 106146584
55952 106146584 124627170 146024467 170160876 196603555 224732523 253923172 283800709
55945 283800709 314108344 343786682 369850631 387480728 391963904 381228011 356929859
55938 356929859 323392510 285551944 247446419 211735296 179829519 152204088 128756708
55931 128756708 109123118 92843196 79410501 68324386 59156570 51561102 45238914
55924 45238914 39932238 35447264 31644280 28401214 25607614 23184862 21081370 19246375
55916A9246375j617994j434223j268385j126126j012639r15315q23312p43211
55908A0305170o80259o23807n65663n14030m75415m40497m01270l65359l40062
55899E898808l17966k91273k65710k47737k31653k11479j92746j80931j70145
55890C789168j54465j39182j30192j22935j12044j01808r7384r5214r1276q9399
55880B655269r2487r4720r1070q5853q3688q0770p3302o5953o3672o3022n9554
55869A801178n5998n5475n4225m8729m2886m0861l9733l6176l3362l4294l5279
55858A324160l2841l0318l0861l0844k7057k3571k4388k5896k3844k1400k2938
55847A030202k5756k5452k3952k4865k6004k3821k0573k0013k0348j8231j5524
$$ plain form
55916 19246375 17628381 16194158 14925773 13799647 12787008 11871693 11048381 10305170
55908 10305170 9624911 9001104 8435441 7921411 7445996 7005499 6604229 6238870 5898808
55899 5898808 5580842 5289569 5023859 4776122 4544469 4332990 4140244 3959313 3789168
55890 3789168 3634703 3495521 3365329 3242394 3130350 3028542 2931158 2835944 2744668 2655269
55880 2655269 2562782 2468062 2376992 2291139 2207451 2126681 2053379 1987426 1923754 1860732 1801178
55869 1801178 1745180 1689705 1635480 1586751 1543865 1503004 1463271 1427095 1393733 1359439 1324160
55858 1324160 1291319 1261001 1230140 1199296 1172239 1148668 1124280 1098384 1074540 1053140 1030202
55847 1030202 1004446 978994 955042 930177 904173 880352 859779 839766 819418 801187 785663
55836G85663j5528j6463j5119j3082j3232j3808j1929r346q973r273p668n946
55824F45296o727q188p605o639p824r475r225q912j0735j2342j0992q872q923
55811E28837r182o801l945l862m628k680N67J630J486L209N776O164N286N982
55797E27839P230O014L085J372M79j868m656n196m413n300p416p829o446n656
55783D97239n848n657n501o534p287n468j896J154L960P807J1337J2583J2868
55770E08757J4213J4449R573j30j0473j8670k4254k6286k4182k0409j8174j7144
55758C87270j5123j2684j2070j2746j2271j0759j0293j0623r532o934m872l894
55746B65469k908j962j770j295P51K938L005J711J326J418o5k585l789l644m018
$$ plain form
55836 785663 770135 753672 738553 725471 712239 698431 686502 677156 668183 658910 651242 645296
55824 645296 638569 630381 622776 616137 608313 598838 589613 580701 569966 557624 546632 537760 528837
55811 528837 519655 512854 508909 505047 500419 497739 498306 499936 501422 504631 510407 516571 521857 527839
55797 527839 535069 541083 544168 545540 546019 544151 539495 534299 529886 524586 517170 509341 502895 497239
55783 497239 491391 485734 480233 473699 466412 460944 459048 460202 464162 471969 483306 495889 508757
55770 508757 522970 537419 546992 546862 536389 517719 493465 467179 442997 422588 404414 387270
55758 387270 372147 359463 347393 334647 322376 311617 301324 290701 281169 274235 269363 265469
55746 265469 262561 260599 258829 257534 258285 261223 264228 265939 267265 268683 268618 266033 262244 258600 254582
55731B54582m724l958k105j342j810j836j583k759m845n322l705k036j303n03
55717B16751P72J862K981M835O559O804O294O467O350L965J11k571l695m886o030
55702B46569n451l675l265m760o110o363o684p437p433o430n523m732l030r05
55688A74771j40q02j092l88K10L79J055K265L023L352M065M731M295L308K979
55673B02011K539M49k303l215k272j741k223k205j487j573k441k267q58p0k71
55658A82073L74K358L742L459K849K899K764J980J536J770J567N71r5j04n92j829
55642B05322k528k278k374l467m577n117n690o252n751m373l836m582m921l842
55628A45734k613k490k830k542j743j022m41j02l26q13q78o74q90j311j308j441
$$ plain form
55731 254582 249858 245900 243795 242453 240643 238807 237224 234465 229620 224298 220593 218557 217254 216751
55717 216751 217523 219385 222366 227201 233760 240564 246858 253325 259675 263640 263751 261180 257485 252599 246569
55702 246569 241118 237443 234178 229418 223308 216945 210261 202824 195391 188961 183438 178706 175676 174771
55688 174771 174631 173829 172737 172349 172559 172938 173993 176258 179281 182633 186698 191429 195724 199032 202011
55673 202011 204550 204999 202696 199481 197209 195468 193245 191040 189553 187980 185539 183272 182414 182344 182073
55658 182073 182447 184805 188547 192006 194855 197754 200518 202498 204034 205804 207371 207942 207847 207743 207151 205322
55642 205322 202794 200516 198142 194675 190098 184981 179291 173039 167288 162915 159079 154497 149576 145734
55628 145734 143121 140631 137801 135259 133516 132494 132053 131951 131625 130812 129934 129260 128370 127059 125751 124310
55612A24310k592l797l219j214J0k04m11o7l40j413j773r47n31j442k393k112
55596A01865j056o8P90J286P84l23p13k41q1m71l05N91R77N09K85O60P37N80J500
55577A07306L390M284L412K302J984J554N65L70J676L039L161K628K127J020r19
55562A37899k399k638k648l195l372k554j823j980k050j288p29j194j505n70M68
55547A10422Nj394k008j497p48j53L91O08L68L11Q43J266R59M37L13J99l49q94
55529A09079j019j161j564j530o40L25N57L28N9m72j242j501j089j061k030l050
55513I3989l090k486k093k014j992k038j931j210j80J38m04q99j079j548j990
55498G1173j095R99K280J839J209J563J714M92q89p78J86K54o99j428j397r53
$$ plain form
55612 124310 121718 117921 114702 113488 113498 113294 112883 112816 112476 111063 109290 108343 107812 106370 103977 101865
55596 101865 100809 100741 101531 102817 103601 103278 102565 102324 102243 101772 101467 102058 103035 103544 103829 104489 105226 105806 107306
55577 107306 110696 114980 118392 120694 122678 124232 124797 125167 126843 129882 133043 135671 137798 138818 137899
55562 137899 135500 132862 130214 127019 123647 121093 119270 117290 115240 113952 113223 112029 110524 109954 110422
55547 110422 110427 109033 107025 105528 104780 104627 105018 105626 105994 106305 107148 108414 109373 109810 110123 110322 109973 109079
55529 109079 108060 106899 105335 103805 103165 103490 104047 104375 104434 103962 102720 101219 100130 99069 97039 93989
55513 93989 90899 88413 86320 84306 82314 80276 78345 77135 76955 77093 76689 75790 74711 73163 71173
55498 71173 70078 71077 73357 75196 76405 77968 79682 80174 79285 78507 78693 78947 78248 76820 75423 74470
55482G4470k94L60M20j1K52J648K784K442J403R88J027P31L78N10N05l90j509
55465H5714j787j496j484j571j121m35p9K98J107J581R57L3K2N29K79p23j340
55448H0484j154p17k82L22Q95J037R36R43Q43L96M4J81L88K83L03P15P80J0p05
55429H5702m96m7l44q29l51P45J099N30J04L61Q04J027J084R07M61K97R33J841
55411I3828K011J245J90o68j289j737k145k600k719j977p94k96n60l85O15J162
55395H3881M69l28j04L79j8p63p31j74P2K35Q06J066K59p07n13L26L35m71q78
55376H3141o09l34pR58K157K535J972J086n4j448k121j318j19o1p01n60J27j28
55358H4516j147j137K56J288R31K05R7J21k93o86o34n00m59r0M92L86n83j259
$$ plain form
55482 74470 74176 74536 74956 74945 75197 76845 79629 82071 83474 84462 85489 86220 86598 87108 87613 87223 85714
55465 85714 83927 82431 80947 79376 78255 77820 77741 78039 79146 80727 81684 81717 81739 82268 82547 81824 80484
55448 80484 79330 78613 78331 78653 79548 80585 81521 82464 83307 83703 83747 83928 84316 84599 84902 85617 86397 86407 85702
55429 85702 85206 85159 84815 83986 83635 84380 85479 86009 86113 86474 87278 88305 89389 90296 90757 91054 91987 93828
55411 93828 95839 97084 97274 96606 95317 93580 91435 88835 86116 84139 83345 83049 82489 82104 82719 83881
55395 83881 84350 84022 83918 84297 84279 83516 82785 82611 82683 82918 83724 84790 85049 84342 83829 84155 84490 84019 83141
55376 83141 82532 82198 82191 83149 85306 87841 89813 90899 90845 89397 87276 85958 85839 85778 85077 84517 84644 84516
55358 84516 83369 82232 82488 83776 84707 84912 85009 85130 84837 84151 83517 83017 82558 82468 82960 83346 82763 81504
55340H1504p77K27O38K48l09m18R8P89Q24N8m28K20J097P07o42j204n64k74j358
55321H0436k669k545r42P89J450P96m63j101m50Q26J562J521J246P97j54j100
55305G9999r74J69J047R82O44O65P76P15Q05J118J087M95p3k26l13n78o26k41
55287H5471J52K44L11M60K62m28j008r90o83n52n37m10k51j34Q9M23N64M12K55
55268H3650K44K40K61N23P89M75l77r01n86r9l92j393k077j671m21P74J271J178
55250H1488R93R13P42M28J65o6n13r52p33J34O77K88m13o28m93m03j43L63L88
55231H2235m42j055l34J060J631J206O97L22l27q20l10P18Q57j0n71l30k50q45
55213H3432j258q50k65j75k03J72O66P97O60M70J32l10m37r7L49N66N27K15k87
$$ plain form
55340 81504 80727 80954 81592 81840 81531 81113 81211 82000 82824 82882 82454 82674 83771 84478 83836 82632 82068 81794 80436
55321 80436 77767 75222 74280 75069 76519 77315 76852 75751 75301 76127 77689 79210 80456 81253 81099 79999
55305 79999 79025 79194 80241 81223 81867 82532 83308 84023 84828 85946 87033 87528 87455 87229 86916 86338 85712 85471
55287 85471 85623 85867 86178 86638 86900 86472 85464 84474 83791 83239 82702 82292 82041 81907 81996 82419 82983 83395 83650
55268 83650 83894 84134 84395 84918 85707 86182 85805 84904 84318 84219 83827 82434 80357 78686 78265 79039 80310 81488
55250 81488 82481 83394 84136 84564 84729 84663 84150 83198 82465 82599 83276 83564 83151 82523 82030 81627 81484 81847 82235
55231 82235 81793 80738 80404 81464 83095 84301 84998 85320 84993 84173 83863 84581 85438 85428 84857 84527 84277 83432
55213 83432 82174 81324 81059 80884 80681 80853 81519 82316 82976 83446 83578 83268 82831 82734 83083 83649 84176 84391 84104
55194H4104n24k20J23mq8N60J271P80o73j471j007l45l45n75n00k78Q3R73K068
55175H3932K216J091k12p03n51j68M44R60O21m38r71l75M32N67M12O02Q80Q67
55157H9606R04J208J151L13n69o04q7J30o3j79n5Q5J77K99M05M55M59K46l15q24
55137I2742p74m13l61m20J35J022J093K58k04K77O25L0o57m14K55K91j92l09J50
55118I3134O80R35Q49M36P3L33J021J146L98k85k29k8l09n61j51M94P98J125J828
55099A01687K040P90j240k336j829n01P12J432J516J108P89R52J146P28r5n70
55083A06329m99l42m75q74j306j399q51R4P09P02N56O31O26L32J82N43J054J190
55065A07202Q78J59r40j809j490j13Q99P10J80L35P81O95L19K60K14m04j210j468
$$ plain form
55194 84104 83580 83360 83483 83479 83391 83951 85222 86002 85329 83858 82851 82506 82161 81586 81086 80808 80891 81864 83932
55175 83932 86148 87239 87027 86324 85773 85605 86049 87009 87630 87192 86221 85846 86278 86845 87257 87859 88739 89606
55157 89606 90510 91718 92869 93182 92613 92009 91922 92052 91989 91810 91755 91840 92017 92316 92721 93176 93635 93881 93566 92742
55137 92742 91968 91555 91194 90774 90909 91931 93024 93282 93078 93355 93980 94010 93353 92939 93194 93485 93293 92984 93134
55118 93134 93814 94749 95598 96034 96107 96440 97461 98607 99005 98720 98491 98463 98154 97593 97442 97936 98734 99859 101687
55099 101687 103727 104517 103277 100941 99112 98611 99323 100755 102271 103379 104168 105120 106266 106994 106899 106329
55083 106329 105830 105488 105013 104139 102833 101434 100583 100677 101386 102088 102644 103275 103901 104233 104415 104958 106012 107202
55065 107202 108080 108239 107299 105490 104000 103887 104786 105496 105676 106011 106792 107487 107806 108066 108280 107876 106666 105198
55047A05198j374j457j348m89M25K17q21j197l98N32O73L15J25K07K78Q6n09j330
55029I9133j785j511r20o11m68J0P43J150R73M01l41r38r19k43M09N61O76J258
55011I7578J835J679J053O60M13j33n36O6J381K096J611N89k88r82j404j159l02
54994A04157M73P61Q29Q85O99J46m08n93m48j80J03L47N73R34J403J590J208N23
54976A13002K8j17P0O18J186R92j53j217j131k14L74K23k08o13r22o76M98J848
54958A13588K086J099Q9o8L41P95J174J260O83k50n49J46R83J087O09J50j86n99
54940A22438r48r70p79o63n83l34nJ46J98N29J253J963K276K414K941L903M632
54923A38411M646M428M754N534N904N465M647L733K416N66j377l123m802o206
$$ plain form
55047 105198 103824 102367 101019 100530 100955 101172 100351 99154 98756 99288 99961 100276 100401 100608 100886 100972 100463 99133
55029 99133 97348 95837 94917 94306 93838 93848 94591 95741 96714 97115 96774 95836 94917 94674 95083 95644 96320 97578
55011 97578 99413 101092 102145 102805 103218 103085 102549 102615 103996 106092 107703 108292 108004 107022 105618 104459 104157
54994 104157 104630 105391 106220 107105 107804 107950 107542 106949 106501 106321 106424 106771 107344 108278 109681 111271 112479 113002
54976 113002 113030 112913 112983 113601 114787 115779 115626 114409 113278 113064 113438 113661 113453 112840 111918 111242 111740 113588
54958 113588 115674 116773 116862 116794 117135 117930 119104 120364 121047 120797 120248 120394 121377 122464 123073 123223 123037 122438
54940 122438 121490 120520 119741 119078 118495 118161 118156 118302 118500 119029 120282 122245 124521 126935 129876 133779 138411
54923 138411 143057 147485 152239 157773 163677 169142 173789 177522 179938 180504 179127 176004 171202 164996
54909A64996o605n928n153m900m522l437k369k219k521k201j295o89o35o95p64
54894A21063r58q75r9Q42J182J163J418J619J110N34J147K632L354K916K779L881
54878A43708N260N699N393N065M623L621K257J021p6j250k413l459m518n524n969
54863A53438n566m670l772l035k557k500k654k504j968j514j317r77l84j31n52
54848A19337j010p22O6L85k37j314k032k006j426p14r1M82Q98P48j44j264j912
54831A09044j947j645j072j80P18J211J450J840K212J985J085N2p59j359j574
54816A11061j099j80M83N98M41J64l13p61p01j21N76J249J937K250J683N96p1
54799A17792r1o2k24k19n1j67m04r7N29L46p38j227j73J292J568Q04L24O03J016
$$ plain form
54909 164996 158391 152463 147310 142410 137888 134451 132082 129863 127342 125141 123846 123157 122522 121827 121063
54894 121063 120105 119230 119131 119973 121155 122318 123736 125355 126465 126999 128146 130778 134132 137048 139827 143708
54878 143708 148968 154667 160060 165125 169748 173369 175626 176647 176571 175321 172908 169449 164931 159407 153438
54863 153438 147872 143202 139430 136395 133838 131338 128684 126180 124212 122698 121381 120404 120020 119889 119337
54848 119337 118327 117605 117671 118056 117819 116505 114473 112467 111041 110327 110236 110718 111616 112364 112220 110956 109044
54831 109044 107097 105452 104380 104200 104918 106129 107579 109419 111631 113616 114701 114753 113994 112635 111061
54816 111061 109962 109782 110265 110863 111304 111468 111155 110394 109693 109572 110148 111397 113334 115584 117267 117863 117792
54799 117792 117701 117639 117415 117196 117145 116978 116574 116477 117006 117352 116614 115387 115214 116506 118074 118878 119202 119805 120821
54780A20821J149J315J815K530L196L515L217K524K298L104M387N154N271N429
54766A65725N957O319N913M771L338J912N38p93k099l458m821n809n935n279m674
54751A61605m803n234m909l690k631k439k481j955j248j209j623j534p38Q6O30
54736A27827J199J797K003J805J588J315P27L56J150K881M132M150L717L786M307
54721A62740M723M706M009K499P30m01r29j790l231m289m313l946m046m553m974
54706A46935n056m502l068j431q74j455j655o40L88J04q75j120o83p28j468j957
54690A21915j762j474j496j428q23J30Q83J040N61j37m61k53P8K72N19P89N67
54673A18920k76j067j292j295j433j263m18M41N06J29J83N99N71J4k99L2N85R13
$$ plain form
54780 120821 121970 123285 125100 127630 130826 134341 137558 140082 142380 145484 149871 155025 160296 165725
54766 165725 171682 178001 183914 188685 192023 193935 194473 193680 191581 188123 183302 177493 171558 166279 161605
54751 161605 156802 151568 146659 142969 140338 137899 135418 133463 132215 131006 129383 127849 127111 127197 127827
54736 127827 129026 130823 132826 134631 136219 137534 138261 138617 139767 142648 146780 150930 154647 158433 162740
54721 162740 167463 172169 176178 178677 179407 179006 178077 176287 173056 168767 164454 160508 156462 151909 146935
54706 146935 141879 137377 134309 132878 132004 130549 128894 128254 128642 128746 127871 126751 126068 125340 123872 121915
54690 121915 120153 118679 117183 115755 114932 115062 115945 116985 117546 117409 116948 116695 116773 117045 117564 118353 118920
54673 118920 118644 117577 116285 114990 113557 112294 111876 112317 112823 112952 113135 113734 114305 114319 114020 114052 114637 115550
54655A15550R93Q39M32Q3K31P80J141R58M03k70r71j515j551q29M85J724K021
54638A20504J101j93p20m78m92j118j402o75K53L68R8N59J715K429K088J081r8
54621A25020j178j586p55P88J562P76p28j498r95J45R97J180Q88L72l74j219j543
54604A21852q66J63K63p64j636j307k55N13Q39J038R56M41J14N68J222J053J48
54587A24342n35o71p94j087j105p29m36m49m58k69l2K57P39J074O49m54j327j295
54569A17420n63K50P26P66N84O40J035J159M31p24j276r10k42J83M45P40J027
54552A21691J299J589J638J109K20l44k89Q0M72R15J373J664J859K193K498K224
54536A40191J229P1p00j118j481j826j924j620j006l74LJ35L06N93P02L93j15
$$ plain form
54655 115550 116543 117382 117814 117897 118128 118908 120049 121007 121410 121140 120169 118654 117103 116274 116759 118483 120504
54638 120504 121605 121412 120692 120214 119722 118604 117202 116527 116780 117148 117246 117805 119520 121949 124037 125118 125020
54621 125020 123842 122256 121501 122289 123851 124627 123899 122401 121406 121551 122548 123728 124616 124988 124614 123395 121852
54604 121852 120986 121149 121412 120648 119012 117705 117450 117963 118802 119840 120796 121237 121351 121919 123141 124194 124342
54587 124342 123807 123136 122342 121255 120150 119421 118985 118536 118078 117809 117777 118034 118773 119847 120496 120042 118715 117420
54569 117420 116857 117107 117833 118599 119183 119823 120858 122017 122448 121724 120448 119538 119296 119479 119924 120664 121691
54552 121691 122990 124579 126217 127326 127546 127202 126913 126993 127465 128380 129753 131417 133276 135469 137967 140191
54536 140191 141420 141491 140791 139673 138192 136366 134442 132822 131816 131442 131445 131580 131886 132479 133181 133574 133459
54519A33459m34m56k79J8K33J18j99k93k24n93j434j828j247n21o01j018o92L01
54501A24310Q90O93K67j36q60j723j872j014Q3P21J054J471J871J916J484P04
54485A29859m7k16L39R30Q23L10K47O64P36J70k95j7P12J210J152O22%j76K24
54466A37247N38J58m12j80P61J302R93N86O51P28K37o67j625k537l091k686j399
54449A30604k64k8k07pN03O80L36j36l51j74L05P10O03L1m07k76K37P11R55R63
54429A34788Q22P42Q24P81L36j83k23J21L38M09O79Q21Q9j268j927j289k97Q6
54411A35649K00P71J615K094K154K087J743Q44k55q64p75k70L44P98Q13N54O69
54394A48171J342J755J076k95j151r18j08M62M06j47p12p62k39L57N37L59J56
$$ plain form
54519 133459 133025 132569 132290 132308 132541 132659 132460 132167 131943 131350 129916 128088 126841 126320 125719 124701 124009 124310
54501 124310 125200 125893 126160 126024 125164 123441 121569 120555 120638 121359 122413 123884 125755 127671 129155 129859
54485 129859 129812 129596 129935 130865 131688 131998 132245 132909 133645 133815 133520 133503 134215 135425 136577 137199 137199 137023 137247
54466 137247 137785 137943 137531 137351 138112 139414 140407 140993 141644 142372 142609 141942 140317 137780 134689 132003 130604
54449 130604 130340 130312 130105 130098 130601 131281 131617 131481 131130 130956 131261 131971 132574 132605 132198 131922 132159 132870 133825 134788
54429 134788 135610 136352 137176 137957 138293 138110 137887 138008 138346 138755 139434 140255 140344 139076 137149 135860 135563 135649
54411 135649 135849 136620 138235 140329 142483 144570 146313 147157 146902 146038 145263 144993 145337 146135 146948 147502 148171
54394 148171 149513 151268 152344 152049 150898 149980 149872 150334 150740 150593 149881 149119 148880 149237 149774 150133 150289
54377A50289P9R4J70K34K00K61P03J355J615J328J040J177J458J517J540J782
54361A64842K014J970J954K390L121L624L688L403K799J963J235Q36N25mo42j180
54345A92538j736k426k974l122l110l298l518l391k958k533k147j693j398j553
54331A56681j895j832j299q14o98p28n77k02K77P07Q42N17k9k91j08J26m0n54
54313A50083r38q95o52o57j031j452j636j649j603j321o11K64Q27R57Q68O94M98
54296A41746N58R88J320J001L12K8K22K62M6L14J337K237K165J442R13P82O84
54279A56357M17M0m28q06o96m3N28M07k95j018j345j043l0J253J935J614Q28K80
54261A57955P0J8J84N76Q36P91Q12J166J468J281P86L66l0n29q64p93o02o23p42
$$ plain form
54377 150289 150368 150462 150632 150866 151066 151327 152030 153385 155000 156328 157368 158545 160003 161520 163060 164842
54361 164842 166856 168826 170780 173170 176291 179915 183603 187006 189805 191768 193003 193839 194364 194360 193718 192538
54345 192538 190802 188376 185402 182280 179170 175872 172354 168963 166005 163472 161325 159632 158234 156681
54331 156681 154786 152954 151655 150841 150143 149415 148838 148636 148913 149620 150462 150979 150950 150659 150551 150677 150637 150083
54313 150083 149145 148250 147598 146941 145910 144458 142822 141173 139570 138249 137638 137902 138729 139686 140554 141248 141746
54296 141746 142304 143292 144612 145613 145925 145953 146175 146437 146483 146797 148134 150371 152536 153978 154891 155673 156357
54279 156357 156774 156814 156386 155580 154884 154841 155369 155776 155481 154463 153118 152075 152045 153298 155233 156847 157675 157955
54261 157955 158025 158043 158227 158803 159639 160430 161242 162408 163876 165157 165943 166309 166279 165750 164886 164093 163491 162868 162126
54242A62126p64q69j101j080o69l80m75m39M5L44k2l36J54P94N19k78l15M04N62
54223A58220l00j063q35j85o4n00q75q09k71N30J065Q57J88j44O7K03j51o31q06
54204A54496p84p38m80O8M90L88n9m10n05m12j56J81L55K49P6Q3J88J31j34l92
54184A52635m12j40K75O31Q29Q00L98m00j105j024j65N21K55n63r34n47M3L54
54166A51451M77O05O24L25k51p39p05p0O27P17K56p6j7o1m23n22mN14N39O93J605
54145A55565K476K060O39l18k54K4m3q5J25K22J64L83P43M37n76j188p13J72O20
54126A60453P76J025J090O42J15N9K26Q1k43k11K76R40J612K066J819P77k13k08
54108A71082O44J310J102K68n18p57l90J53K66j36m81l41rj3l69p63j058j170
$$ plain form
54242 162126 161362 160493 159392 158312 157643 157263 156788 156349 156394 156738 156716 156380 156534 157328 157847 157569 157254 157658 158220
54223 158220 157920 156857 156022 155837 155773 155273 154398 153589 153318 153848 154913 155770 155958 155814 155881 156084 155933 155302 154496
54204 154496 153712 152974 152494 152562 153052 153440 153381 152971 152466 152054 151898 152079 152434 152683 152759 152842 153030 153161 153027 152635
54184 152635 152223 152083 152358 152989 153818 154618 155016 154616 153511 152487 152322 152843 153098 152535 151601 151054 151097 151451
54166 151451 151928 152533 153157 153482 153231 152492 151787 151717 152344 153061 153317 153241 153224 153163 152740 152218 152214 152728 153267 153960 155565
54145 155565 158041 160101 160740 160422 160168 160192 160149 160064 160189 160411 160575 160958 161701 162138 161562 160374 159661 159833 160453
54126 160453 161229 162254 163344 163986 164101 164160 164386 164467 164224 164013 164289 165229 166841 168907 170726 171503 171290 171082
54108 171082 171726 173036 174138 174406 173888 173131 172741 172894 173160 173024 172543 172202 172193 172180 171811 171048 169990 168820
54090A68820p80K74J501K235K509K890L536L937L704L173L010L531M585N866P097
54075B15888P947P990P024N462M092L157J849p67m325p222q277p895p294p076
54061B10553o916o313n111l468j717l31L51M13K85L89Q45J414J730J772K014K800
54045A98710L665L799L244L034L820M939N255M586L708L327L552M204N043N680
54031B56566N723N180M473L973L662L241K461J436O07L13L67L73L84Q22J622J931
54015B93134J138k43j147j171p07k28ol53j424k695l306l167l233m265n702o278
53999B60347n581m561m337m876n205m782m147m053m322m073l022j904j468j568
53985B06448j600j440j375j368j034l81L2j21m69n62n46q02j168j111n53o3l5
$$ plain form
54090 168820 168040 168314 169815 172050 174559 177449 180985 184922 188626 191799 194809 198340 202925 208791 215888
54075 215888 223835 231825 238849 244311 248403 251560 253409 252642 248317 241095 232818 224923 217629 210553
54061 210553 203637 197324 192213 188745 187028 186697 187048 187461 187746 188135 188980 190394 192124 193896 195910 198710
54045 198710 202375 206174 209418 212452 216272 221211 226466 231052 234760 238087 241639 245843 250886 256566
54031 256566 262289 267469 271942 275915 279577 282818 285279 286715 287322 287635 288002 288375 288759 289581 291203 293134
54015 293134 294272 294029 292882 291711 291004 290776 290770 290417 288993 286298 282992 279825 276592 272327 266625 260347
53999 260347 254766 250205 245868 240992 235787 231005 226858 222805 218483 214410 211388 209484 208016 206448
53985 206448 204848 203408 202033 200665 199631 199250 199282 199161 198692 198130 197584 196782 195614 194503 193950 193887 193852
53968A93852j62P6P20J435J990K200J778P35k40m07%P2m06o47j16O45R80J138
53950B03643J700K493K958L219L786M448M425L696L265L773M620M880M504M220
53936B55630M588N596O848P915Q669R450J0582J1703J1971J1214J0397J0508J1231
53923C76302J1064Q822M763L18l103n008n667n328l900j504J068K804L249K604
53909C86484J346J06m70l60m24j385k728l326l054k920l498m129m060l548l428
53894C54606m043n080o035o512o419o108o054o278o465o602o924p164o606n165
53880B69151l749l202l423l793l966l888l630l465l624l733l124j931j142j272
53866B25209j762k040k267k584k587k173k006k368k458j732r92j079j311n79O27
$$ plain form
53968 193852 193690 193766 194486 195921 197911 200111 201889 202624 202384 201977 201977 202049 201643 200996 200880 201525 202505 203643
53950 203643 205343 207836 210794 214013 217799 222247 226672 230368 233633 237406 242026 246906 251410 255630
53936 255630 260218 265814 272662 280577 289246 298696 309278 320981 332952 344166 354563 365071 376302
53923 376302 387366 396188 400951 401269 398166 393158 387491 382163 378263 376759 377827 380631 383880 386484
53909 386484 387830 387936 387466 387106 386682 385297 382569 379243 376189 373269 369771 365642 361582 358034 354606
53894 354606 350563 345483 339448 332936 326517 320409 314355 308077 301612 295010 288086 280922 274316 269151
53880 269151 265402 262200 258777 254984 251018 247130 243500 240035 236411 232678 229554 227623 226481 225209
53866 225209 223447 221407 219140 216556 213969 211796 209790 207422 204964 203232 202240 201161 199850 199271 199898
53851A99898Q21j74j041j060q53r28q14j64M92O83P24R55R99M57l02o13l26K98
53833A99052J084J786J899J163Q9m53j55N01Q58O80K48lM8J43Q3P5L80Q38J085
53814B09401J144J344J708J972K257L102M539N677N620M610L808M053N089N969
53800B60293N952N035L834K998K731K742K618K230J839J746J837J593P89j2j20
53785B96105K04o0j299k710l450l696l983m192l933l505l536l915l972l572l185
53770B51301k954k640k463k975l955m383l876l204k956k625j663o43n29j295k081
53755B13059k320k009j232k55J52n94j812k055q24P78J422J028N09N02Q44J072
53739B08265R90O88L34N3j06j74j86j00J16L43L61J56N1M00J169J963K493K783
$$ plain form
53851 199898 200719 200545 199504 198444 197591 196663 195849 195685 196177 196860 197584 198539 199538 199995 199693 199080 198754 199052
53833 199052 200136 201922 203821 204984 205073 204620 204465 204966 205824 206504 206752 206749 206797 206940 207023 207098 207478 208316 209401
53814 209401 210545 211889 213597 215569 217826 220928 225467 231144 236764 241374 245182 249235 254324 260293
53800 260293 266245 271280 275114 278112 280843 283585 286203 288433 290272 292018 293855 295448 296237 296225 296105
53785 296105 296309 296249 294950 292240 288790 285094 281111 276919 272986 269481 265945 262030 258058 254486 251301
53770 251301 248347 245707 243244 240269 236314 231931 228055 224851 221895 219270 217607 216964 216435 215140 213059
53755 213059 210739 208730 207498 207243 207395 206801 204989 202934 202110 202888 204310 205338 205847 206349 207193 208265
53739 208265 209255 209943 210277 210330 210224 210050 209864 209764 209880 210223 210584 210740 210791 211191 212360 214323 216816 219599
53721B19599K863K499J504J94p39q66l54L40R31J413J907K443K852K835K339J789
53705B41549J733K223K796L124L389L799M029L593K665K065K253K703K591J890
53691B80402J282J156J118P12R2l40n95r42j281j215p19k58j89m13p32j075j284
53674B75719j060l49M58R35R47N85O3k74k34j14l28o64n41r1k10j182k041j897
53656B69722j159p30n80r1O35Q17K55l73n07j94M16J263J934J889J332J206J909
53639B77744K669K574J755J132J289J990K603K636K019J097L67J16L69J055J953
53624C01368K612K687K405K393K950L747M259M243L805L356L433M271N427O118
53610C53074O020N512N162N252N757O394O736O544O011N400M569L240J604K00
$$ plain form
53721 219599 222462 224961 226465 226659 225920 225054 224700 225040 225971 227384 229291 231734 234586 237421 239760 241549
53705 241549 243282 245505 248301 251425 254814 258613 262642 266235 268900 270965 273218 275921 278512 280402
53691 280402 281684 282840 283958 284670 284762 284422 283827 282885 281604 280389 279670 279412 279223 278810 278078 277003 275719
53674 275719 274659 274310 274768 275703 276650 277235 277298 277024 276790 276676 276348 275684 275143 275052 274842 273660 271619 269722
53656 269722 268563 267833 267253 267162 267797 268614 268869 268496 267989 267795 268211 269474 271408 273297 274629 275835 277744
53639 277744 280413 282987 284742 285874 287163 289153 291756 294392 296411 297508 297875 297991 298360 299415 301368
53624 301368 303980 306667 309072 311465 314415 318162 322421 326664 330469 333825 337258 341529 346956 353074
53610 353074 359094 364606 369768 375020 380777 387171 393907 400451 406462 411862 416431 419671 421275 421475
53596D21475p86j599k355k870l078l116k987k646k418k686l161l107k470k026
53582C86170k196k459k310k093k296k600k378j771j542j952k394k229j495o76
53568C57779j08K58N69P42M62l27j066j046k98L39K16l24m13L01J298J796J549
53551C61727J041R46J354J669J365P42N73J130J953K505K697K760K965L518M359
53536C91304N113N521N846O379O810O733O636P492R218J0565J0766J0479J0645
53523D93507J1265J1876J2505J3363J4200J4774J5462J6663J7938J8622J8972
53512F59147J9886K1514K2972K3503K3325K3156K3399K3893K4178K3898K3159
53501I12030K2407K1821K1056J9889J8753J8163J7951J7577J7003J6680J6755
$$ plain form
53596 421475 420689 419090 416735 413865 410787 407671 404684 402038 399620 396934 393773 390666 388196 386170
53582 386170 383974 381515 379205 377112 374816 372216 369838 368067 366525 364573 362179 359950 358455 357779
53568 357779 357671 357929 358498 359240 359702 359375 358309 357263 356965 357304 357520 357196 356783 357084 358382 360178 361727
53551 361727 362768 363714 365068 366737 368102 368844 369417 370547 372500 375005 377702 380462 383427 386945 391304
53536 391304 396417 401938 407784 414163 420973 427706 434342 441834 451052 461617 472383 482862 493507
53523 493507 504772 516648 529153 542516 556716 571490 586952 603615 621553 640175 659147
53512 659147 679033 700547 723519 747022 770347 793503 816902 840795 864973 888871 912030
53501 912030 934437 956258 977314 997203 1015956 1034119 1052070 1069647 1086650 1103330 1120085
53490A120085J6898J6878J6833J6876J6971J7215J7789J8451J8514J7571J6019
53479A310100J4695J4090J3925J3439J2080J0022P856N762L310K54k883n433p446
53466A389771r464j1645j3588j4920j5572j5629j5362j5355j5999j6915j7371
53455A227951j7297j7367j8076j9165k0036k0283j9819j8887j8064j7740j7622
53444A023595j7088j6063j5003j4041j2757j0895q697o413m054j904o03k56m7
53431I15774P86J996K867L347M048N288O712P897Q926J0230J2050J4153J6000
53418A010074J7267J8269J9595K1347K2956K3969K4600K5366K6473K7853K9472
53407A267241L1248L2912L4364L5895L7717L9486M0844M2128M3998M6389M8550
$$ plain form
53490 1120085 1136983 1153861 1170694 1187570 1204541 1221756 1239545 1257996 1276510 1294081 1310100
53479 1310100 1324795 1338885 1352810 1366249 1378329 1388351 1396207 1401969 1405279 1405533 1402650 1397217 1389771
53466 1389771 1380307 1368662 1355074 1340154 1324582 1308953 1293591 1278236 1262237 1245322 1227951
53455 1227951 1210654 1193287 1175211 1156046 1136010 1115727 1095908 1077021 1058957 1041217 1023595
53444 1023595 1006507 990444 975441 961400 948643 937748 929051 922638 918584 916680 916077 915821 915774
53431 915774 916560 918556 921423 924770 928818 934106 940818 948715 957641 967871 979921 994074 1010074
53418 1010074 1027341 1045610 1065205 1086552 1109508 1133477 1158077 1183443 1209916 1237769 1267241
53407 1267241 1298489 1331401 1365765 1401660 1439377 1478863 1519707 1561835 1605833 1652222 1700772
53396A700772N0093N1372N2639N3462N3435N2916N2595N2619N2581N2180N1419
53385B276083N0218M8320M5686M2691L9834L7304L4819L1829K7992K3599J9291
53374B677666J5248J0867N592k01n659j0643j5909k1938k8187l3759l8447m2692
53362B511938m6735n0189n2491n3471n3467n3033n2515n1898n1025m9925m8758
53351A948431m7496m5912m3916m1700l9548l7882l7331l8179l9562l9896l8527
53340A498482l6419l4713l3171l0756k7342k3963k1543k0114j9221j8245j6460
53329A216535j3622j0706r200r384r981r861r306r250r942j0851j1385j1091r691
53316A082265p481n421m244l717l105k022m58J565L782N515O319O618P173Q175
$$ plain form
53396 1700772 1750865 1802237 1854876 1908338 1961773 2014689 2067284 2119903 2172484 2224664 2276083
53385 2276083 2326301 2374621 2420307 2462998 2502832 2540136 2574955 2606784 2634776 2658375 2677666
53374 2677666 2692914 2703781 2709373 2709172 2703513 2692870 2676961 2655023 2626836 2593077 2554630 2511938
53362 2511938 2465203 2415014 2362523 2309052 2255585 2202552 2150037 2098139 2047114 1997189 1948431
53351 1948431 1900935 1855023 1811107 1769407 1729859 1691977 1654646 1616467 1576905 1537009 1498482
53340 1498482 1462063 1427350 1394179 1363423 1336081 1312118 1290575 1270461 1251240 1232995 1216535
53329 1216535 1202913 1192207 1183007 1173623 1163642 1153781 1144475 1135225 1125283 1114432 1103047 1091956 1082265
53316 1082265 1074784 1069363 1065119 1061402 1058297 1056275 1055817 1057382 1061164 1066679 1072998 1079616 1086789 1094964
53302A094964R357J0673J2233J3830J5236J6758J8839K1191K3090K4435K5739
53291A286345K7062K7831K7880K7770K7640K6572K3793J9993J6727J4732J3431
53280A539776J1904R766P093M060Q68k220m984p310r259j1097j3198j5650j8040
53267A491709j9848k1078k2243k3721k5283k6469k7160k7603k7979k8200k8216
53256A213909k8227k8434k8710k8704k8205k7267k6084k4929k4145k3864k3757
53245I21583k3365k2728k2372k2476k2493k1794k0479j9161j8154j7270j6322
53234F94969j5381j4450j3268j1664r892q398p374o671o161n960o218o833p547
53221E75152q287r208j0312j1256j1732j1900j2180j2689j3140j3162j2522j1155
$$ plain form
53302 1094964 1104321 1114994 1127227 1141057 1156293 1173051 1191890 1213081 1236171 1260606 1286345
53291 1286345 1313407 1341238 1369118 1396888 1424528 1451100 1474893 1494886 1511613 1526345 1539776
53280 1539776 1551680 1561446 1568539 1572599 1573467 1571247 1566263 1558953 1549694 1538597 1525399 1509749 1491709
53267 1491709 1471861 1450783 1428540 1404819 1379536 1353067 1325907 1298304 1270325 1242125 1213909
53256 1213909 1185682 1157248 1128538 1099834 1071629 1044362 1018278 993349 969204 945340 921583
53245 921583 898218 875490 853118 830642 808149 786355 765876 746715 728561 711291 694969
53234 694969 679588 665138 651870 640206 630314 621916 614542 607871 601710 595750 589532 582699 575152
53221 575152 566865 557657 547345 536089 524357 512457 500277 487588 474448 461286 448764 437609
53209D37609r408q015p410p103o352n351n042n673o370o492o432o620o571n788
53195C44982m911m912n526n541m551l376k713k419k252k423k937l244l023k778
53181B94376l049l482l219k027n85K33R1p33j638k118k085j814j566j436j513
53166B69435j870k308k307j579m87K82M57L81M89P04N20k77j141j267o05k1k29
53149B60177q65r94m11R3k26j128j644j108K18J352J445M75p88j547j590j161
53133B52298n44J1L08M68R82K015K885K749J719P55M66N21L57o2m06m97m24l86
53115B63215n79r96j303j191q53q00j137j400j198o74k27p9k29n03o35n54o26
53098B50231j200j934k025j224j98L21L26K72M63Q82J307J372Q41N1k62J74P88
$$ plain form
53209 437609 428201 420186 412776 405673 399321 393970 388928 383255 376885 370393 363961 357341 350770 344982
53195 344982 340071 335159 329633 324092 319541 316165 313452 311033 308781 306358 303421 300177 297154 294376
53181 294376 291327 287845 284626 282599 282014 282247 282338 281605 279967 277849 275764 273950 272384 270948 269435
53166 269435 267565 265257 262950 261371 260884 261166 261623 262004 262493 263197 263717 263440 262299 261032 260427 260406 260177
53149 260177 259312 258318 257907 258000 257774 256646 255002 253894 254112 255464 256909 257384 256596 255049 253459 252298
53133 252298 251754 251765 252073 252541 253523 255538 258423 261172 262891 263646 264112 264633 264990 264928 264522 264025 263601 263215
53115 263215 262636 261640 260337 259146 258293 257493 256356 254956 253758 253084 252857 252778 252549 252046 251411 250857 250231
53098 250231 249031 247097 245072 243848 243650 243971 244297 244569 245032 245914 247221 248593 249434 249485 249223 249397 250185
53081B50185Q96M87K5j74j06J16K56jp44j646k325k603k387j617o11l1j98o30
53063B38892p08m79m73q17j030o88N0O84R25R04Q66P97M79jj36K65N23j64j448
53044B38441k052j432m81k11m14k46M04Q62P19K51q8m1M54J147J433R56J37k68
53026B39571r6K12M37Q23J452J916J793J121K58m86r30j043r67q61o77l27j0l9
53008B42147l31m27j46J52N2l71o79n08J41Q99J232Q46O9m12k53K42N64N64M91
52989B44272O45J069J493J522J086O67Q33J426J652J149O22R65J956K450J889
52974B63696J035R05J399J572J035M48N40J133J446J062K43n21r40r66p38n10
52958B70839m93p43j224j857k435k666k436j874j083j83L27j95j552k481k064
$$ plain form
53081 250185 251081 251568 251593 251419 251313 251429 251685 251684 250940 249294 246969 244366 241979 240362 239751 239720 239522 238892
53063 238892 238184 237705 237232 236415 235385 234697 234747 235431 236356 237260 238126 238923 239402 239401 239265 239530 240053 239889 238441
53044 238441 236389 234957 234476 234265 233851 233605 234009 234871 235590 235841 235753 235712 236166 237313 238746 239702 239839 239571
53026 239571 239475 239687 240124 240947 242399 244315 246108 247229 247487 247001 246071 245028 244061 243200 242523 242196 242186 242147
53008 242147 241816 241389 241243 241395 241447 241076 240397 239889 240030 240929 242161 243007 243076 242664 242411 242653 243217 243781 244272
52989 244272 244917 245986 247479 249001 250087 250754 251587 253013 254665 255814 256436 257401 259357 261807 263696
52974 263696 264731 265636 267035 268607 269642 270090 270630 271763 273209 274271 274514 273993 273053 272087 271349 270839
52958 270839 270346 269603 268379 266522 264087 261421 258985 257111 256028 255845 256172 255977 254425 251944 249880
52943B49880q75j19J6J68L81O6o16o47J99Q02L26n95j028j090j255j197m02O11
52925B44625Q51L22p8Q9M17N34M85L94M28R44J831K094J010n04q36O8O40j5j060
52906B52239j526j667j971j961j009L61J038Q36M78L34R0l88o42l06L77R21J139
52889B48343J162J147J111R21M40l01j101j711j889j471o35OL1r6M84J726K483
52872B50650J930O49j57l2O22J391K130K639K683K315J753J047J99n60j048j457
52856B64754j935k150j789j321j539k411l071l038k692k449k132j477o94j61J3
52841B37908j93q00j453j441n41N07Q26L65l35r95j601j861j299l3J150J556J181
52824B32941L94n19j316j603j066M1R05Q81K81J49J058K306K752K288J860J913
$$ plain form
52943 249880 249005 248886 248902 249070 249451 249517 248901 248254 248453 249255 249581 248986 247958 246868 245613 244416 244014 244625
52925 244625 245476 245798 245720 245809 246226 246760 247245 247639 248067 249011 250842 252936 253946 253442 252606 252674 253314 253299 252239
52906 252239 250713 249046 247075 245114 244105 244466 245504 246340 246818 247152 247242 246854 246212 245906 246283 247204 248343
52889 248343 249505 250652 251763 252684 253124 252823 251722 250011 248122 246651 246016 246022 246053 245957 246441 248167 250650
52872 250650 252580 253229 253072 253040 253662 255053 257183 259822 262505 264820 266573 267620 267819 267259 266211 264754
52856 264754 262819 260669 258880 257559 256020 253609 250538 247500 244808 242359 240227 238750 238056 237895 237908
52841 237908 237715 236915 235462 234021 233480 233987 234813 235178 234843 233848 232247 230386 229087 229054 230204 231760 232941
52824 232941 233335 232816 231500 229897 228831 228872 229777 230658 230939 231088 232146 234452 237204 239492 241352 243265
52808B43265J611J26j952l207l095k282j517j011p79q14p92l73Q9j44j013j530
52792B26582j173n94m80m38K16J139J317N22l74n72j44L99Q00J026J042Q40N69
52775B30677M01L11J74Kp4p5l16r54j461j020K63J027K08j394j979j040J86O78
52757B25614Q32J214J339O10l62n11J04N48N10M84O96Q65R40J140J272R53M82
52740B36730N81J243J718J710J689J894J920J507R51M95J03o2K05L95l03j619
52724B49157k251j640o71k48k14k50o31j348j570r29l71o87j120n97L51L48o40
52707B36689j297r36j49N05J150J718J637Q85L37O05J165J187O75K69L23O38Q65
52690B46266Q32O21M64M64L62j67r56j414j223p03l83m18n38m03Q7P16J106J025
$$ plain form
52808 243265 244876 245002 243050 239843 236748 234466 232949 231938 231159 230345 229553 229180 229269 229125 228112 226582
52792 226582 225409 224815 224335 223897 224113 225252 226569 227091 226717 226145 226001 226400 227200 228226 229268 230108 230677
52775 230677 231078 231389 231563 231565 231491 231416 231100 230146 228685 227665 227928 228955 229163 227769 225790 224750 224936 225614
52757 225614 226446 227660 228999 229609 229247 228736 228840 229388 229898 230382 231078 231943 232883 234023 235295 236248 236730
52740 236730 237311 238554 240272 241982 243671 245565 247485 248992 249943 250438 250541 250479 250684 251079 250776 249157
52724 249157 246906 245266 244595 244347 244133 243883 243252 241904 240334 239405 239034 238347 237227 236630 236981 237329 236689
52707 236689 235392 234456 234307 234812 235962 237680 239317 240202 240539 241144 242309 243496 244171 244440 244763 245401 246266
52690 246266 247098 247719 248183 248647 249009 248842 247886 246472 245249 244546 244163 243745 243207 242804 242891 243607 244713 245738
52672B45738N79N9k50j36M34J149J480J154M41j39k25K54J010J466J234O33L49
52655B55230N46Q57J167J725K309K160J072k01j063j699k133j737m97L09k18j076
52639B56751q63nL7o98p22M64J585J606J002O08N28O35J001J302Q20m19j480j908
52621B60244k250k718k487j087M57Q81L24j48n7L26Q02J278J377Q36J19q1J83
52604B57999L00Q9p8OO6j64n31o01p9Q37J487J392R08Q29J292J634J470J221J286
52585B69363J425J415J562J963K001J192K4q00j315j751j676o71N27P65N4o40
52569B73438r57j311j564r10N64J464Q82l58j041j196j542j914j483k84N73M14
52553B64775j80m30n31j111j970k121j145K05R73J078R50O02k73j368j746r53
$$ plain form
52672 245738 246317 246376 246126 245990 246424 247573 249053 250207 250648 250509 250284 250538 251548 253014 254248 254881 255230
52655 255230 255776 256633 257800 259525 261834 263994 265066 264865 263802 262103 259970 258233 257736 258045 257827 256751
52639 256751 255888 255883 255920 255222 254500 254964 256549 258155 259157 259765 260293 260928 261929 263231 264051 263632 262152 260244
52621 260244 257994 255276 252789 251702 252159 253040 253364 253216 253159 253485 254287 255565 256942 257778 257897 257816 257999
52604 257999 258299 258388 258310 258316 258382 258218 257687 257086 257007 257844 259331 260723 261631 262460 263752 265386 266856 268077 269363
52585 269363 270788 272203 273765 275728 277729 278921 278945 278145 276830 275079 273403 272732 273259 274024 274078 273438
52569 273438 272481 271170 269606 268696 269260 270724 271606 271248 270207 269011 267469 265555 264072 263788 264361 264775
52553 264775 264595 264165 263634 262523 260553 258432 257287 257492 258465 259543 260493 261095 260822 259454 257708 256755
52537B56755L97J501K243K778K800K002R46O55J218J513O04j051k152j972q80
52522B67357K98J056J338J323J244J347J748K267K518K316J934J820K116K594
52508B91276K965L056K699J778N13o25j385j952k572l166l463l297k734k067j743
52493B79283j927k093j468q0J114J369R39M27p9o65r20m06M54P92N23L78O87R07
52475B79235N97J46J79P35J424J969K238K112J729J528J709J925J822J642J752
52460C00742J904J475M02p41j603k405l281l811l658l157k880k776k340j483p13
52445B75675l77k33L7L14K93o3o02j293k092k667k607j878q16K39J038J322R39
52428B67229J56m53n59l70l17n12n18K68J847L303L601K860K366L039M384N389
$$ plain form
52537 256755 257152 258653 260896 263674 266474 268476 269422 270077 271295 272808 273412 272361 270209 268237 267357
52522 267357 267655 268711 270049 271372 272616 273963 275711 277978 280496 282812 284746 286566 288682 291276
52508 291276 294241 297297 299996 301774 302287 301662 300277 298325 295753 292587 289124 285827 283093 281026 279283
52493 279283 277356 275263 273795 273715 274829 276198 277137 277564 277485 276820 275900 275494 275948 276740 277263 277641 278328 279235
52475 279235 279832 279978 280157 280892 282316 284285 286523 288635 290364 291892 293601 295526 297348 298990 300742
52460 300742 302646 304121 304523 303782 302179 299774 296493 292682 289024 285867 282987 280211 277871 276388 275675
52445 275675 275298 275065 275102 275416 275709 275646 275044 273751 271659 268992 266385 264507 263691 263930 264968 266290 267229
52428 267229 267385 266932 266373 266003 265686 265174 264656 264924 266771 270074 273675 276535 278901 281940 286324 291713
52412B91713N970O752P813Q528Q637Q548Q501Q207P458O288M343J009l422p458
52398C62887r773j0349r868q697p045n430m269l346k312j350q60p96q32q51p26
52383B96383j05J038J984K114J789J797K202K502K629K953L438L642L568L718
52369C29652M182M374L868K865J749O99r6m28m73o98j185j534j575j642j864j759
52353C36135r14K89J070J160R68J008J397J914K303K506K635K807K990L159L440
52338C62867L957M670N467O376P453Q605R678J0578J1170J1339J1352J1880J3207
52325D78599J4737J5741J6293J6917J7475J7236J6063J4853J4523J5055J5763
52314F53255J6030J5662J4928J4508J4986J6156J7061J6946J5921J4641J3625
$$ plain form
52412 291713 297683 304435 312248 320776 329413 337961 346462 354669 362127 368415 372758 373767 370345 362887
52398 362887 353114 342765 332897 324200 317155 311725 307456 304110 301798 300448 299588 298792 297960 297109 296383
52383 296383 296278 297316 299300 301414 303203 305000 307202 309704 312333 315286 318724 322366 325934 329652
52369 329652 333834 338208 342076 344941 346690 347389 347293 346865 346392 345694 344509 342975 341400 339758 337894 336135
52353 336135 335221 335510 336580 337740 338708 339716 341113 343027 345330 347836 350471 353278 356268 359427 362867
52338 362867 366824 371494 376961 383337 390790 399395 409073 419651 430821 442160 453512 465392 478599
52325 478599 493336 509077 525370 542287 559762 576998 593061 607914 622437 637492 653255
52314 653255 669285 684947 699875 714383 729369 745525 762586 779532 795453 810094 823719
52303H23719J3054J2813J2590J2040J1024R583P768N826M290L402K459L53k988
52290I15933o243q056q363q074p862p617o951n847m789m257m061l363j677K94
52276H39067J393J510J757K958M638N878O610P549R074J0704J1661J1669J1248
52263I25716J1198J1699J1993J1400J0456J0453J1723J3141J3538J2920J1938
52252A056175J0853R632Q370O956M788J660j520l672m938o266p855r004r411r578
52238A046190r749r454q560p908q221q980r123q510q013q207q542q050o483m626
52224I31764l503l366l451k867j575k81N78J303K250L144L479L326L279L724M457
52209I42261N070N273M958M245L574L400L713M046M076L960L999M305M873N743
$$ plain form
52303 823719 836773 849586 862176 874216 885240 894823 902591 908417 912707 916109 918568 918921 915933
52290 915933 909690 901634 893271 885197 877335 869718 862767 856920 852131 847874 843813 840450 838773 839067
52276 839067 840460 841970 843727 846685 851323 857201 863811 871360 880434 891138 902799 914468 925716
52263 925716 936914 948613 960606 972006 982462 992915 1004638 1017779 1031317 1044237 1056175
52252 1056175 1067028 1076660 1085030 1091986 1096774 1098434 1096914 1093242 1088304 1082038 1074183 1065179 1055768 1046190
52238 1046190 1036441 1026987 1018427 1010519 1002298 993318 984195 975685 967672 959465 950923 942873 936390 931764
52224 931764 928261 924895 921444 918577 917002 916721 917299 918602 920852 923996 927475 930801 934080 937804 942261
52209 942261 947331 952604 957562 961807 965381 968781 972494 976540 980616 984576 988575 992880 997753 1003496
52195A003496O763P437P259O177M624L188K302J979J682O98j090l025m499n663
52181A031328o918q036q448q212q044q281q423p986p142o236n214l871k328q35
52167I41354N18J551J903J606J340J654K212K365K144K032K053J760J112N82L53
52152I64539O4m43p86o89m25k69J9O95J361J295L71p75j486j705j736j618j021
52135I57391K66J899L337M482N763P516R599J1748J3968J6248J8230J9575K0514
52122A090536K1588K2929K4156K4930K5256K5247K4948K4398K3601K2521K1252
52111A351362K0033J8857J7382J5527J3774J2402J0903Q883P075O474O648O053
52099A495373M056J531p82l277o361r486j2074j4465j7006j8925j9242j8319j7462
$$ plain form
52195 1003496 1010259 1017696 1024955 1031132 1035756 1038944 1041246 1043225 1044907 1045605 1044515 1041490 1036991 1031328
52181 1031328 1024410 1016374 1007926 999714 991670 983389 974966 966980 959838 953602 948388 944517 942189 941354
52167 941354 941872 943423 945326 946932 948272 949926 952138 954503 956647 958679 960732 962492 963604 964186 964539
52152 964539 964603 964160 963374 962685 962260 961991 962010 962705 964066 965361 965732 964957 963471 961766 960030 958412 957391
52135 957391 957657 959556 962893 967375 973138 980654 990253 1002001 1015969 1032217 1050447 1070022 1090536
52122 1090536 1112124 1135053 1159209 1184139 1209395 1234642 1259590 1283988 1307589 1330110 1351362
52111 1351362 1371395 1390252 1407634 1423161 1436935 1449337 1460240 1469123 1476198 1482672 1489320 1495373
52099 1495373 1499429 1500960 1500178 1496901 1490540 1481054 1468980 1454515 1437509 1418584 1399342 1381023 1363561
52086A363561j7138j6608j5185j2948j0260p439n096l844l401k607p57J623L638
52073A273539N147O622Q235R674J0714J1525J2403J3398J4225J4439J3816J2672
52061A406409J1699J1249J0997J0491R833R439R169Q271O288L622R42j500l742
$$ plain form
52086 1363561 1346423 1329815 1314630 1301682 1291422 1283983 1278887 1275043 1271642 1269035 1268278 1269901 1273539
52073 1273539 1278686 1285308 1293543 1303217 1313931 1325456 1337859 1351257 1365482 1379921 1393737 1406409
52061 1406409 1418108 1429357 1440354 1450845 1460678 1470117 1479286 1487557 1493845 1497467 1498409 1496909 1493167
$$ [...]
##END NTUPLES=NMR SPECTRUM
##END=
