##TITLE=AC1466_CTIAA13297_8011847_UUfE9WZPqj
##JCAMPDX= 6.0         $$ Bruker NMR JCAMP-DX V2.0
##DATA TYPE= NMR SPECTRUM
##DATA CLASS= NTUPLES
##ORIGIN= BRUKER
##OWNER= Administrator
$$ 1.72 TOPSPIN		Version 2.1
$$ 2015-11-19 11:44:41.704 -0800  Administrator@X
$$ Compression mode = diff/dup
##.OBSERVE FREQUENCY= 400.02188249412
##.OBSERVE NUCLEUS= ^1H
##.ACQUISITION MODE= SIMULTANEOUS (DQD)
##.ACQUISITION SCHEME= undefined
##.AVERAGES= 64
##.DIGITISER RES= 22
##SPECTROMETER/DATA SYSTEM= spect
##.PULSE SEQUENCE= noesygpps1d.comp
##.SOLVENT NAME= COFFEE_meoh
##.SHIFT REFERENCE= INTERNAL, COFFEE_meoh, 1, 14.96088
##AUDIT TRAIL= $$ (NUMBER, WHEN, WHO, WHERE, PROCESS, VERSION, WHAT)
$$ ##TITLE= Audit trail, TOPSPIN		Version 2.1
$$ ##JCAMPDX= 5.01
$$ ##ORIGIN= Bruker BioSpin GmbH
$$ ##OWNER= Administrator
$$ $$ E:/data/COFFEE/nmr/AC1466_CTIAA13297_8011847_UUfE9WZPqj/22/pdata/1/auditp.txt
$$ ##AUDIT TRAIL=  $$ (NUMBER, WHEN, WHO, WHERE, PROCESS, VERSION, WHAT)
(   1,<2013-07-05 23:25:12.765 -0700>,<Administrator>,<X>,<go>,<TOPSPIN 2.1>,
      <created by zg
	started at 2013-07-05 23:13:42.609 -0700,
	POWCHK enabled, PULCHK disabled,
       configuration hash MD5:
       C8 4E 4E 5D D3 5C D8 9E 9F 52 82 E0 59 8A DE 15
       data hash MD5: 64K
       C2 16 DE B1 87 92 A6 52 46 27 DE 24 54 71 4F C1>)
(   2,<2013-07-05 23:25:20.640 -0700>,<Administrator>,<X>,<audit>,<TOPSPIN 2.1>,
      <user comment:
       ICON-NMR User ID: COFFEE
       data hash MD5: 64K
       C2 16 DE B1 87 92 A6 52 46 27 DE 24 54 71 4F C1>)
(   3,<2015-11-19 11:43:13.220 -0800>,<Administrator>,<X>,<dirdata>,<TOPSPIN 2.1>,
      <wra from 12 "AC1466_CTIAA13297_8011847_UUfE9WZPqj" "COFFEE" "E:"
       data hash MD5: 64K
       C2 16 DE B1 87 92 A6 52 46 27 DE 24 54 71 4F C1>)
(   4,<2015-11-19 11:44:39.204 -0800>,<Administrator>,<X>,<proc1d>,<TOPSPIN 2.1>,
      <Start of raw data processing
       efp LB = 0.3 FT_mod = 6 PKNL = 1 PHC0 = 0 PHC1 = 0 SI = 128K 
       data hash MD5: 128K
       68 AB 9A 79 FF 4F 61 93 63 00 15 78 6C 47 C7 53>)
(   5,<2015-11-19 11:44:40.095 -0800>,<Administrator>,<X>,<proc1d>,<TOPSPIN 2.1>,
      <pk PHC0 = -82.40845 PHC1 = 0 
       data hash MD5: 128K
       7F 48 5B D0 A6 36 C3 7D 24 00 C4 DE F0 80 7C C7>)
(   6,<2015-11-19 11:44:40.923 -0800>,<Administrator>,<X>,<proc1d>,<TOPSPIN 2.1>,
      <abs ABSG = 1 
       data hash MD5: 128K
       66 FB E3 A3 BB 1A 83 EB 39 2A CC 5A 8B 30 A7 75>)
(   7,<2015-11-19 11:44:41.126 -0800>,<Administrator>,<X>,<proc1d>,<TOPSPIN 2.1>,
      <abs ABSG = 2 
       data hash MD5: 128K
       41 DA 2B AC 38 F8 A8 3A 25 09 14 DB 5E 2D 70 E4>)
(   8,<2015-11-19 11:44:41.220 -0800>,<Administrator>,<X>,<proc1d>,<TOPSPIN 2.1>,
      <abs ABSG = 3 
       data hash MD5: 128K
       D2 DE B6 50 41 E4 A8 D7 CA 67 2C FE 24 CD 53 05>)
(   9,<2015-11-19 11:44:41.329 -0800>,<Administrator>,<X>,<proc1d>,<TOPSPIN 2.1>,
      <abs ABSG = 4 
       data hash MD5: 128K
       A9 D2 1C 68 1D D6 7E DC CB 1E 91 78 CC DA 17 B9>)
$$ [...]
##$TP07= 0
##$TPNAME0= <>
##$TPNAME1= <>
##$TPNAME2= <>
##$TPNAME3= <>
##$TPNAME4= <>
##$TPNAME5= <>
##$TPNAME6= <>
##$TPNAME7= <>
##$TPOAL= (0..7)
0.5 0.5 0.5 0.5 0.5 0.5 0.5 0.5
##$TPOFFS= (0..7)
0 0 0 0 0 0 0 0
##$TUNHIN= 0
##$TUNHOUT= 0
##$TUNXOUT= 0
##$USERA1= <user>
##$USERA2= <user>
##$USERA3= <user>
##$USERA4= <user>
##$USERA5= <user>
##$V9= 5
##$VALIST= <valist>
##$VCLIST= <CCCCCCCCCCCCCCC>
##$VD= 0
##$VDLIST= <DDDDDDDDDDDDDDD>
##$VPLIST= <PPPPPPPPPPPPPPP>
##$VTLIST= <TTTTTTTTTTTTTTT>
##$WBST= 1024
##$WBSW= 4
##$XGAIN= (0..3)
0 0 0 0
##$XL= 0
##$YL= 0
##$YMAX_a= 6207123
##$YMIN_a= -12123959
##$ZGOPTNS= <>
##$ZL1= 120
##$ZL2= 120
##$ZL3= 120
##$ZL4= 120
##$ABSF1= 14.96088
##$ABSF2= -5.597301
##$ABSG= 5
##$ABSL= 3
##$ALPHA= 0
##$AQORDER= 0
##$ASSFAC= 0
##$ASSFACI= 0
##$ASSFACX= 0
##$ASSWID= 0
##$AUNMP= <proc_prof1d_extract.lims>
##$AXLEFT= 0
##$AXNAME= <>
##$AXNUC= <1H>
##$AXRIGHT= 0
##$AXTYPE= 0
##$AXUNIT= <>
##$AZFE= 0.1
##$AZFW= 0.1
##$BCFW= 0
##$BC_mod= 0
##$BYTORDP= 0
##$COROFFS= 0
##$CY= 15
##$DATMOD= 1
##$DC= 0
##$DFILT= <>
##$DTYPP= 0
##$F1P= 0
##$F2P= 0
##$FCOR= 0.5
##$FTSIZE= 131072
##$FT_mod= 6
##$GAMMA= 0
##$GB= 0
##$INTBC= 1
##$INTSCL= 1
##$ISEN= 128
##$LB= 0.3
##$LEV0= 0
##$LPBIN= 0
##$MAXI= 10000
##$MC2= 0
##$MEAN= 0
##$ME_mod= 0
##$MI= 0
##$NCOEF= 0
##$NC_proc= -2
##$NLEV= 6
##$NOISF1= 0
##$NOISF2= 0
##$NSP= 0
##$NTH_PI= 0
##$NZP= 0
##$OFFSET= 14.96088
##$PC= 1
##$PHC0= -82.40845
##$PHC1= 0
##$PH_mod= 1
##$PKNL= yes
##$PPARMOD= 0
##$PPDIAG= 0
##$PPIPTYP= 0
##$PPMPNUM= 2147483647
##$PPRESOL= 1
##$PSCAL= 4
##$PSIGN= 0
##$PYNMP= <proc.py>
##$REVERSE= no
##$SF= 400.020009684771
##$SI= 131072
##$SIGF1= 0
##$SIGF2= 0
##$SINO= 400
##$SIOLD= 131072
##$SPECTYP= <>
##$SREGLST= <1H.CDCl3>
##$SSB= 0
##$STSI= 131072
##$STSR= 0
##$SW_p= 8223.68421052631
##$SYMM= 0
##$S_DEV= 0
##$TDeff= 65536
##$TDoff= 0
##$TI= <>
##$TILT= no
##$TM1= 0
##$TM2= 0
##$TOPLEV= 0
##$USERP1= <user>
##$USERP2= <user>
##$USERP3= <user>
##$USERP4= <user>
##$USERP5= <user>
##$WDW= 1
##$XDIM= 131072
##$YMAX_p= 418987249
##$YMIN_p= -12323
##$CURPLOT= <Network HP LaserJet P1505>
##$CURPRIN= <$Network HP LaserJet P1505>
##$DFORMAT= <normdp>
##$LAYOUT= <+/1D_H.xwp>
##$LFORMAT= <normlp>
##$PFORMAT= <normpl>
##$SURQMSG= 1
$$ End of Bruker specific parameters
$$ ---------------------------------
##NTUPLES= NMR SPECTRUM
##VAR_NAME=  FREQUENCY,     SPECTRUM/REAL,   SPECTRUM/IMAG
##SYMBOL=    X,             R,               I
##VAR_TYPE=  INDEPENDENT,   DEPENDENT,       DEPENDENT
##VAR_FORM=  AFFN,          ASDF,            ASDF
##VAR_DIM=   131072,        131072,          131072
##UNITS=     HZ,            ARBITRARY UNITS, ARBITRARY UNITS
##FACTOR=    0.0627417313425164, 1,          1
##FIRST=     8223.62146879497, -196,         -56391
##LAST=      0,             2894,            -56612
##MIN=       0,             -12323,          0
##MAX=       8223.62146879497, 418987249,    0
$$ Real data points
##PAGE= N=1
##DATA TABLE= (X++(R..R)), XYDATA
$$ [...]
67934 67313 67840 67177 66263 66401 67744 69545 71305 72996 74490 75464 75835 75879 75961 76327 77006 77741 78195 78335
67916 78335 78336 78083 77228 75888 74766 74225 73756 72779 71512 70551 69940 69278 68519 68060 68092 68392 68755 69210 69742
67897 69742 70183 70405 70392 70108 69522 68806 68343 68547 69699 71704 73878 75260 75429 74801 73964 73050 72112 71623
67879 71623 71989 72793 73221 73206 73506 74589 76003 77018 77395 77304 76915 76332 75636 74772 73645 72491 71885 72093
67861 72093 72603 72586 71757 70642 70049 70328 71052 71368 70783 69675 68982 69353 70662 72276 73587 74269 74266 73682
67843 73682 72648 71252 69706 68488 68140 68781 69916 70792 70935 70487 70138 70669 72379 74929 77831 80911
67827 80911 84086 86902 88755 89612 90139 90976 92141 93252 93989 94114 93408 91967 90413 89389 88847 88151
67811 88151 86964 85700 84886 84313 83197 81213 78978 77344 76433 75735 74947 74219 73512 72313 70362 68278
67795 68278 66960 66499 66197 65591 64901 64344 63574 62222 60633 59564 59269 59278 59143 58981 59107 59467 59772 60098
67777 60098 60880 62262 63760 64872 65721 66744 67891 68630 68776 68800 69099 69344 68995 68203 67812 68491 70147
67760 70147 72116 73689 74512 74705 74665 74668 74713 74757 74826 74728 74035 72667 71263 70524 70345 69998 69182 68407 68277 68751
67740 68751 69240 69173 68405 67240 66115 65117 63853 62010 59901 58227 57433 57578 58593 60128 61264 61070
67724 61070 59667 58287 57994 58691 59532 59926 59957 60127 60926 62358 63719 64165 63632 62905 62607 62541 62266 61837
67706 61837 61623 61691 61819 61904 61985 62074 62316 63046 64264 65218 65107 64133 63399 63669 64690 65772 66550 66907 66620
67687 66620 65588 64316 63676 64072 65057 65916 66366 66507 66292 65507 64312 63410 63340 63853 64360 64794 65591 66868
67669 66868 68152 69062 69781 70622 71506 72220 72876 73715 74619 75155 75050 74375 73377 72425 71962 72126 72391 71947 70545
67650 70545 68760 67297 66273 65296 64157 63180 62864 63216 63619 63408 62574 61764 61625 62217 63087 63711 63875 63805
67632 63805 64030 64912 66210 67241 67576 67471 67554 68340 70034 72426 74741 75956 75719 74855 74625 75523 76994
67615 76994 78172 78554 78098 77172 76465 76583 77501 78591 79252 79332 78909 78011 76734 75413 74468 74076 74095 74202
67597 74202 74042 73427 72516 71660 70929 69942 68344 66354 64557 63154 61763 60100 58562 57793 57765 57732 57158
67580 57158 56370 56066 56453 57171 57868 58529 59300 60298 61542 62762 63383 63050 62113 61198 60342 59104 57585 56656
67562 56656 56886 57816 58740 59665 60908 62118 62458 61634 60162 58656 57435 56748 56721 56954 56788 56259 56263 57416
67544 57416 59142 60272 60294 59603 58748 57895 57039 56380 56276 56965 58370 60048 61343 61742 61263 60455 59954 60011
67526 60011 60477 61168 61963 62516 62224 60917 59423 58878 59351 59674 58897 57393 56079 55055 53765 52220 51199
67509 51199 51139 51563 51863 52033 52328 52745 53280 54214 55636 56952 57401 56961 56345 56177 56471 56864 57004 56741 56192
67490 56192 55684 55452 55427 55403 55262 54915 54274 53575 53461 54325 55659 56479 56380 55726 54831 53583 52110 51245 51771
67471 51771 53418 55091 56025 56311 56302 55973 55118 53929 53024 52908 53534 54444 55252 55933 56676 57493 58079 58088 57545
67452 57545 56893 56567 56564 56513 56198 55919 56215 57186 58275 58830 58805 58690 58784 58862 58659 58381 58446 58811 58935 58443 57511
67431 57511 56538 55697 55051 54804 55151 55912 56628 57068 57430 57951 58469 58565 58106 57515 57374 57788 58260 58312 58156 58503
67411 58503 59681 61137 61994 61962 61490 61129 60967 60716 60129 59261 58359 57578 56858 56115 55498 55219 55103 54638 53671
67392 53671 52726 52323 52236 51913 51438 51459 52215 53216 53999 54572 54870 54470 53316 52249 52205 53134 54247 55089 55788
67373 55788 56401 56726 56834 57175 57902 58515 58492 57953 57415 57147 57089 57237 57749 58694 59919 61188 62243 62750 62450
67354 62450 61510 60528 59973 59649 59013 58021 57415 57898 59243 60476 60880 60509 59751 58823 57877 57291 57518 58653
67336 58653 60316 61903 62920 63282 63415 63871 64710 65408 65486 65009 64326 63609 62925 62503 62576 63089 63826 64738 65814
67317 65814 66764 67179 66982 66465 65912 65503 65480 66054 67099 68188 68956 69239 68957 68204 67410 67112 67498 68416 69735
67298 69735 71369 73015 74276 75087 75695 76221 76604 76937 77386 77729 77494 76695 75918 75476 75012 74287 73790 74036
67280 74036 74608 74591 73807 73010 72852 73193 73626 74226 75394 77112 78661 79228 78699 77812 77463 77881 78498 78539 77695
67261 77695 76326 75201 74972 75594 76284 76312 75922 76076 77194 78529 79087 78856 78731 79436 80893 82554 83921
67244 83921 84712 84889 84666 84324 83970 83572 83186 82968 83016 83358 83981 84664 84887 84288 83195 82372 82155 82172 82125 82361
67224 82361 83308 84556 85039 84232 82761 81636 81168 80939 80639 80497 80823 81543 82421 83510 85011 86783 88321
67207 88321 89280 89762 90002 90045 89871 89601 89388 89185 88848 88383 87946 87633 87424 87308 87373 87758 88560 89702 90820
67188 90820 91414 91292 90863 90819 91447 92326 92781 92640 92481 93066 94497 96059 96986 97282 97539 98076 98603 98907 99430
67169 99430 100792 102888 104826 105775 105591 104609 103216 101781 100717 100269 100252 100263 100183 100335 101031 102055 102790 102892
67151 102892 102703 102876 103642 104605 105288 105680 106180 107109 108431 109833 110933 111459 111448 111300 111489 112147 112995 113744
67133 113744 114433 115245 116117 116741 116994 117176 117691 118624 119717 120665 121257 121428 121419 121854 123254 125387 127394 128639
67115 128639 129141 129107 128570 127842 127761 128840 130408 131305 131430 131897 133502 135734 137588 138838 140021 141548 143318
67098 143318 145038 146483 147539 148310 149117 150099 150954 151341 151475 151978 153163 154744 156226 157294 157772 157566
67082 157566 156924 156587 157318 159139 161170 162393 162629 162694 163532 165307 167396 169110 170241 171036 171927 173290
67066 173290 175180 177261 179132 180745 182313 183887 185330 186659 188058 189555 191091 192943 195565 198819
67052 198819 201869 204136 205909 207640 209163 210151 211004 212582 215079 217711 219592 220572 221218 222300 224317
67037 224317 227189 230330 233189 235683 238007 240213 242286 244461 247077 250152 253333 256190 258342 259552
67023 259552 260094 260879 262757 265724 269149 272642 276222 279785 283048 286113 289512 293405 297216 300275 302512
67008 302512 304318 306159 308579 312175 317093 322678 327947 332409 336275 340049 344109 348569 353285 357979
66994 357979 362452 366600 370307 373505 376437 379620 383428 387839 392725 398182 404454 411648 419632 427968
66980 427968 435871 442525 447777 452394 457346 462908 468642 474161 479634 485525 492110 499348 507002 514782
66966 514782 522482 530163 538134 546602 555359 564027 572684 582001 592534 603943 615181 625443 634771
66953 634771 643796 653235 663595 674912 686578 697800 708496 719402 731054 743128 755185 767588
66941 767588 781059 795624 810739 826257 842473 859234 875863 892124 908485 925168 941748
66930 941748 958125 975135 993602 1013332 1033698 1054719 1076762 1099454 1121841 1143609 1165410
66919 1165410 1187788 1210432 1232886 1255529 1279368 1304954 1331791 1358851 1385500 1411922 1438793
66908 1438793 1466630 1495417 1524714 1554007 1583034 1611995 1641449 1671796 1702799 1733783 1764341
66897 1764341 1794620 1824875 1855115 1885341 1915781 1946602 1977616 2008611 2039722 2071055 2102062
66886 2102062 2131747 2159583 2185960 2211635 2236969 2261679 2285096 2306630 2326193 2344274 2361424
66875 2361424 2377586 2392085 2404326 2414353 2422665 2429562 2434783 2437748 2438172 2436431 2433251 2428976 2423228
66862 2423228 2415378 2405273 2393356 2380142 2365756 2350009 2332784 2314229 2294566 2273777 2251537
66851 2251537 2227609 2202269 2176169 2149704 2122733 2095012 2066692 2038095 2009144 1979364 1948541
66840 1948541 1917159 1886043 1855589 1825399 1794645 1762857 1730396 1698090 1666393 1635012 1603490
66829 1603490 1571968 1541205 1511876 1484028 1457130 1430452 1403440 1375975 1348421 1321338 1295106
66818 1295106 1269810 1245325 1221342 1197414 1173336 1149488 1126552 1104715 1083370 1061809 1040151
66807 1040151 1019274 999836 981563 963688 945914 928685 912471 897047 881638 865653 849072
66796 849072 832220 815407 798869 782817 767393 752622 738458 724815 711608 698849 686711
66785 686711 675329 664531 653941 643334 632731 622146 611521 600965 590800 581155 571752 562252
66773 562252 552702 543453 534741 526492 518480 510575 502836 495405 488240 481059 473657 466210 459015 452061
66759 452061 445203 438674 432913 427815 422697 417172 411525 405948 400030 393527 387104 381638 377006 372259
66745 372259 366915 361431 356418 351906 347553 343198 339036 335422 332476 329715 326337 322159 318031 314864
66731 314864 312459 309814 306431 302696 299053 295449 291700 287787 283616 279034 274279 269881 265956 262113
66717 262113 258335 255331 253601 252598 251302 249290 246775 243959 240882 237784 235027 232665 230492 228498
66703 228498 226834 225232 222951 219627 215928 212980 211104 209454 207101 204267 202097 201209 200897 200019 198314
66688 198314 196417 194787 193207 191327 189168 186916 184663 182558 180866 179599 178396 176988 175589 174616
66674 174616 174246 174363 174656 174559 173447 171195 168421 165897 163866 162086 160321 158623 157236 156462 156400 156679
66658 156679 156643 155998 155006 153876 152307 149958 147157 144732 143266 142787 143054 143736 144371 144471 143777 142325 140431
66641 140431 138711 137817 137756 137665 136697 135100 133929 133696 133718 132995 131406 129712 128540 127668 126435 124718 123196
66624 123196 122506 122337 121754 120432 119070 118419 118349 118256 117992 117857 117896 117786 117364 116762 116092 115434 115096 115348 115854
66605 115854 115896 115280 114532 114082 113734 113194 112577 112057 111491 110841 110627 111375 112710 113468 112791 110871 108640 106941
66587 106941 105917 104902 103017 100170 97511 96480 97301 98690 99230 98770 98203 98132 98281 98197 97990 98066 98428
66570 98428 98706 98733 98650 98397 97628 96293 94918 93972 93294 92461 91476 90674 90146 89744 89543 89884 90891 92314
66552 92314 93810 94940 94990 93393 90577 87873 86249 85473 84787 84060 83806 84323 85235 85854 85714 84796 83514
66535 83514 82490 82117 82317 82734 83024 82919 82337 81651 81548 82282 83282 83850 84029 84332 84766 84785 84239 83720 83650
66516 83650 83586 82891 81704 80678 79938 79001 77789 77091 77616 78973 80061 80295 79975 79515 78869 77968 77213 77092
66498 77092 77511 77938 78110 78152 78103 77803 77339 77044 76822 75950 73958 71400 69332 68277 68125 68761 70162 71886
66480 71886 73112 73455 73379 73595 74364 75501 76671 77388 77099 75698 73833 72415 71863 72058 72755 73669 74262
66463 74262 73972 72825 71503 70665 70428 70612 71162 72037 72898 73227 72810 71939 71217 71219 72138 73495 74315 73916 72574
66444 72574 71206 70430 70205 70308 70677 71102 71081 70427 69754 69860 70709 71436 71379 70748 70263 70413 71125 71806 71682
66425 71682 70467 68812 67731 67456 67226 66389 65270 64596 64476 64446 64246 63984 63645 63084 62533 62550 63244 64017
66407 64017 64379 64618 65306 66411 67294 67508 67247 67054 67390 68468 70163 71920 72975 72923 72080 71155 70579 70250
66389 70250 69908 69580 69527 69809 70123 70111 69735 69257 68949 68902 69044 69140 68867 68073 67020 66207 65842 65590 64907 63583
66369 63583 61937 60567 59960 60242 61166 62284 63198 63772 64219 64927 66042 67140 67479 66725 65356 64239 63881
66352 63881 64230 65006 65929 66691 67023 66912 66572 66209 65973 66115 66812 67793 68437 68479 68357 68659 69388 69970 69821
66333 69821 68799 67331 66304 66551 68062 69794 70559 70116 69196 68591 68508 68719 68944 68942 68499 67561 66342 65306
66315 65306 65035 65969 67987 70263 71816 72274 71977 71378 70637 69814 69048 68360 67558 66610 65929 65997 66792 67821
66297 67821 68636 69133 69376 69438 69415 69439 69583 69872 70320 70790 70846 70039 68472 66854 65844 65495 65528 65904 66818 68180
66277 68180 69472 70248 70542 70633 70587 70230 69461 68452 67541 67007 66837 66654 66024 64967 64032 63719 63961 64364 64754
66258 64754 65242 65894 66700 67750 69011 69971 69999 69178 68354 68136 68304 68432 68660 69380 70509 71516 71962 71633
66240 71633 70388 68492 66952 66833 68058 69383 69793 69474 69190 69141 68900 68278 67716 67698 68067 68165 67583 66626
66222 66626 65946 65836 66012 66053 65821 65438 65131 65236 66065 67466 68802 69637 70163 70565 70340 68927 66823 65232
66204 65232 64507 63775 62506 61656 62575 65205 68106 70078 71097 71661 71889 71570 70795 70213 70590 72116 74124
66187 74124 75601 76079 75960 75925 76254 76788 77309 77662 77639 77078 76087 75067 74489 74649 75405 76001 75463 73519 70999
66168 70999 69050 68030 67485 67028 66779 66866 66940 66531 65767 65454 66307 68131 69937 70995 71626 72619 73931 74484
66150 74484 73483 71475 69706 68810 68601 68800 69279 69685 69531 68817 68096 67835 68133 69027 70484 71933 72455
66133 72455 71822 70915 70723 71314 72140 72890 73551 73906 73640 72896 72234 71926 71744 71537 71656 72571 74237 75993
66115 75993 77027 76948 76058 75146 74885 75333 76060 76736 77434 78330 79247 79682 79301 78392 77760 78134 79573 81452
66097 81452 83001 83863 84120 83965 83531 83082 83130 84128 85949 87751 88520 87871 86333 84835 83901 83365 82746 81788
66079 81788 80607 79483 78612 78060 77832 77935 78375 79134 80193 81504 82860 83795 83833 82971 81801 81023 80870
66062 80870 81182 81874 83014 84404 85428 85546 84740 83363 81748 80234 79369 79646 80905 82313 83116 83292
66046 83292 83308 83378 83220 82577 81731 81321 81750 82857 84158 85302 86340 87645 89516 91697 93325 93591 92544
66029 92544 91104 90185 89963 90100 90461 91302 92813 94701 96384 97511 98207 98874 99712 100472 100730 100368 99677
66012 99677 98988 98504 98556 99685 102077 105093 107731 109600 111167 113065 115444 118035 120559 122951 125340
65997 125340 127868 130383 132389 133514 134027 134606 135568 136556 136994 136571 135249 133196 130897 128991 127701 126578
65981 126578 125062 123139 121199 119404 117521 115423 113430 111902 110594 108702 105756 102378 99847 98848
65967 98848 98921 99250 99608 100207 100930 101352 101412 101520 101945 102582 103383 104459 105619 106415 106875 107666 109171 110962
65949 110962 112578 114259 116344 118479 120139 121605 123561 125861 127578 128360 128937 129962 131060 131469 131164
65934 131164 130772 130722 131024 131758 133244 135540 138146 140455 142346 144131 145944 147460 148358 148944 150040 152210
65918 152210 155288 158714 162100 165297 168162 170540 172443 173985 175117 175645 175501 174896 174204 173851 174236 175520
65902 175520 177413 179298 180622 181130 180776 179553 177435 174407 170607 166417 162305 158446 154667 150868 147332
65887 147332 144389 141963 139732 137618 135775 134119 132230 129769 126749 123391 120037 117275 115783 115706 116350
65872 116350 116697 116258 115384 114835 115102 116063 117166 117919 118207 118158 117904 117612 117576 117971 118569 118949 119009 118993 119003 118819
65852 118819 118320 117826 117809 118418 119433 120523 121400 121930 122272 122791 123653 124639 125500 126348 127421 128622 129615 130403
65834 130403 131457 133170 135437 137980 140861 144373 148480 152610 156066 158492 159996 161060 162412 164660
65820 164660 167746 170824 172916 173682 173481 172793 171809 170497 168724 166315 163206 159618 155870 152085 148387
65805 148387 145361 143766 143611 143933 143810 143257 142827 142699 142685 142893 143766 145451 147518 149457 151157 152861 154900
65788 154900 157514 160776 164679 169331 174931 181400 188287 195216 202173 208987 214850 218902 221195 222562
65774 222562 223499 223598 222115 218707 213605 207473 201110 194943 188750 182213 175643 169709 164648 160368 157272
65759 157272 156180 157223 159605 162771 167114 173106 180464 188725 198025 208579 219846 230974 241823
65746 241823 252752 263539 273192 280830 286200 289376 290500 289852 287556 283177 276129 266613 255714 244467
65732 244467 233243 222153 211463 201331 191572 182078 173221 165565 159334 154330 150173 146407 142610
65719 142610 138678 134863 131339 127945 124607 121822 120308 120094 120283 119930 119029 118438 118831 119903 120735 120834
65703 120834 120537 120324 120085 119390 118284 117324 116837 116696 116940 118054 120155 122314 123326 123128 122865 123493 124818
65686 124818 126108 127187 128547 130676 133684 137506 142140 147657 154174 161781 170356 179591 189457 200433
65672 200433 212858 226073 238797 250530 262092 274363 286825 297915 306688 313626 319771 325549
65660 325549 330623 334496 336902 337839 337651 337090 336961 337507 338184 338165 337089 335342 333639 332371 331318 329835
65644 329835 327213 322950 316904 309277 300336 290066 278305 265294 251887 238898 226369 213767
65632 213767 200905 188419 177302 168126 160719 154333 148107 141671 135512 130612 127534 125907 124834
65619 124834 123675 122355 121038 119770 118460 117109 115916 115057 114409 113611 112484 111239 110212 109561 109394
65604 109394 109953 111334 113113 114621 115607 116306 116826 116869 116272 115496 115218 115566 116044 116299 116766 118405 121737
65587 121737 126250 130975 135668 141075 147813 155362 162692 169698 177373 186505 196822 207653 218854
65574 218854 230651 242891 254915 265996 275554 283131 288542 292042 294042 294644 293554 290384 284904
65561 284904 277098 267199 255731 243457 231265 219905 209567 199735 189810 179990 171209 164098 158299
65548 158299 152991 147738 142625 137898 133838 130736 128643 127280 126478 126479 127474 129060 130577 131901 133486
65533 133486 135558 137587 138722 138554 137435 136106 135068 134195 132980 131093 128682 126195 124090 122636 121693
65518 121693 120667 119066 117149 115653 114844 114341 114000 114318 115541 116961 117731 118010 118662 120032 121582 122598
65502 122598 122743 122059 120962 120188 120270 121096 122293 123810 125683 127528 128972 130410 132624 135643 138698 141363
65486 141363 143996 146871 149572 151599 152972 153834 153960 153143 151762 150511 149645 148837 147661 145985 143936
65471 143936 141651 139058 135927 132212 128257 124526 121287 118791 117464 117423 117920 117846 116838 115395 113985
65456 113985 112685 111806 112016 113431 115130 116121 116358 116449 116797 117490 118603 120024 121215 121734 121880 122379 123498
65439 123498 124906 126286 127637 129005 130345 131700 133211 134864 136470 137833 138761 138983 138397 137321 136191
65424 136191 135023 133549 131900 130676 130133 129684 128573 126874 125408 124678 124280 123579 122728 122593 123649 125330
65408 125330 126737 127745 128950 130634 132338 133700 135213 137653 140923 144049 146401 148445 150939 153726
65394 153726 155790 156500 156334 156092 155739 154509 152056 149006 146186 143761 141500 139541 138406 138329 138979 139866
65378 139866 140686 141313 141823 142592 144020 146028 148057 149589 150426 150526 149990 149334 149352 150507 152653 155450 158763
65361 158763 162611 167104 172557 179262 186945 194893 202789 210967 219488 227520 234150 239421 243879 247355
65347 247355 248946 248248 245976 243125 240053 236639 232891 229005 224968 220441 215042 208622 201297 193370
65333 193370 185286 177588 170870 165597 161820 159125 156994 155191 153670 152228 150596 148929 147795 147376
65319 147376 146932 145502 143063 140551 138665 137184 135724 134610 134331 134446 133845 132258 130731 130276 130652 131046
65303 131046 131407 132453 134583 137435 140385 142981 145013 146761 149008 152171 155516 157918 159327 160629
65289 160629 162003 162461 161433 159910 159268 159558 159704 158993 157624 156030 154380 152734 151184 149774 148579
65274 148579 147770 147316 146798 145809 144374 142706 140789 138599 136536 135158 134604 134639 135179 136343 138011 139721
65258 139721 140986 141522 141278 140536 139867 139684 139918 140345 140977 141773 142240 141879 140908 140020 139413 138540 136922 134793
65240 134793 132814 131475 130909 131007 131616 132720 134437 136622 138630 139758 139886 139391 138494 137072 135059 132646
65224 132646 130067 127564 125535 124316 123724 123185 122437 121757 121446 121468 121780 122548 123812 125204 126289 126997 127493
65207 127493 127838 128030 128239 128727 129564 130530 131261 131434 130949 130048 129207 128778 128751 128883 129072 129553 130712 132644
65189 132644 134922 136954 138589 140159 141863 143440 144628 145632 146701 147481 147302 146051 144331 142722 141369
65174 141369 140329 139826 139900 140190 140378 140648 141415 142706 144036 144893 145309 145949 147576 150252 153135 155254 156408
65157 156408 157165 158144 159639 161814 164703 167923 170816 173162 175461 178384 182158 186617 191508 196616 201962
65142 201962 208105 215911 225550 235905 245315 252911 259033 264488 269760 274913 279859 284423 288220 290756
65128 290756 291788 291587 290686 289396 287672 285446 282814 279778 276059 271456 266259 261024 255983 250866 245184
65113 245184 238541 230981 223301 216670 211428 206519 200698 194076 187739 182090 176541 170937 166115 162604
65099 162604 159719 156668 153761 151676 150216 148786 147662 147622 148395 148672 147937 147341 148169 150062 151441 151386
65083 151386 150453 149716 149499 149310 148729 147981 147568 147607 147839 148184 148859 149813 150451 150329 149848 149859 150696 152017 153471
65064 153471 155029 156587 157775 158392 158697 158996 159172 158897 158170 157374 156856 156622 156466 156268 156105 156055 155921 155259
65046 155259 153865 152176 150953 150433 150018 148936 147062 144880 142822 140930 139143 137553 136234 135043 133814
65031 133814 132658 131832 131363 131010 130563 130042 129567 129270 129356 129965 130820 131281 131087 130911 131824 134141 137001 139140
65013 139140 139972 139912 139884 140541 141833 143235 144449 145884 148293 151939 156175 159854 162109 162864 162744 162465
64997 162465 162227 161821 161365 161568 162897 164707 165729 165451 164625 164405 165384 167439 169934 171980 173037 173538
64981 173538 174455 175995 177200 177218 176403 175661 175098 174002 171988 169468 166945 164379 161471 158225 155094 152711
64965 152711 151488 151198 150952 149882 147977 146142 145351 145821 146923 147738 147764 147263 146875 146817 146590 145691 144356
64948 144356 143265 142592 141841 140700 139716 139826 141334 143509 145158 145615 145262 145093 145689 146636 147017 146322 144748
64931 144748 142786 140871 139424 138872 139457 141092 143409 145818 147643 148545 148859 149174 149523 149314 148275 147055
64915 147055 146538 146744 146867 146348 145533 145184 145711 147094 149236 152023 155163 158377 161855 166189 171697 177988
64899 177988 184395 190643 196874 203237 209736 216349 222909 228963 234149 238688 243025 246926 249469 250244
64885 250244 250024 249867 249870 249244 247288 243768 238636 232098 225006 218534 213202 208553 203977 199528 195757 193096
64869 193096 191624 191216 191641 192567 193572 194147 193788 192352 190393 188827 188013 187349 185889 183215 179599 175563
64853 175563 171542 167826 164524 161569 158919 156732 155172 154098 153152 152198 151467 151174 151145 151003 150649 150342
64837 150342 150233 149998 149153 147723 146404 145941 146447 147481 148666 149952 151336 152642 153820 155204 157198
64822 157198 159780 162625 165666 169253 173656 178701 184070 189758 195981 202773 209885 217054 224129 231025
64808 231025 237751 244398 250731 255812 258463 258253 255771 251823 246766 240778 234290 227725 221115 214445
64794 214445 208099 202516 197628 193240 189699 187508 186321 185131 183646 182768 183326 184936 186544 187627 188342
64779 188342 188862 189173 189474 190275 192005 194682 197940 201299 204572 208193 212938 219159 226431 234057 241677
64764 241677 249269 256830 264279 271465 278111 284000 289314 294522 299751 304644 308927 312625 315524 317009
64750 317009 316841 315514 313333 309679 303907 296517 288632 280571 271875 262611 253694 245716 238313 231069
64736 231069 224449 219334 216031 214116 213031 212559 212767 213707 215173 216798 218440 220233 222126 223645 224498
64721 224498 225108 226118 227611 229412 231866 235505 239939 243893 246531 248070 248856 248562 246752 243663 239914
64706 239914 235781 231182 226139 220935 215982 211704 208238 205053 201302 196811 192414 189007 186659 184962
64692 184962 183836 183450 183656 184108 184904 186637 189656 193543 197438 200800 203856 207351 211844 217265 223247
64677 223247 229699 236703 243913 250609 256526 262130 267738 272811 276495 278473 278768 277088 273120 267442
64663 267442 261474 256274 251772 247353 242799 238403 234463 231076 228359 226518 225571 225191 225056 225286 226272
64648 226272 228040 230101 232140 234622 238380 243700 250188 257421 265328 273889 282919 292285 301922 311475
64634 311475 320238 327658 333605 338033 340742 341650 340938 338670 334641 328903 322112 314991 307664 299820 291299
64619 291299 282195 272672 263063 253994 246028 239261 233512 228734 224917 221760 218819 215944 213268 210916
64605 210916 208968 207607 207003 207157 208095 210004 212854 216129 219378 222917 227487 233209 239271 244691 249043
64590 249043 252464 255373 258341 261902 266303 271488 277257 283244 288870 293742 298092 302440 306727 310119
64576 310119 311819 311791 310557 308509 305605 301555 296175 289650 282546 275431 268447 261348 253903 246081 237928
64561 237928 229610 221669 214890 209668 205719 202602 200336 199268 199408 200186 200874 201112 200954 200586 200170 199972
64545 199972 200450 201978 204427 207135 209372 210757 211227 210808 209581 207764 205633 203405 201290 199503 198029
64530 198029 196520 194699 192854 191673 191567 192288 193184 193646 193424 192776 192360 192660 193467 194145 194545 195352 197296
64513 197296 200197 203097 205381 207498 210484 214872 220218 225688 230950 236354 242367 249041 256080 263225
64499 263225 270333 277139 283093 287479 289725 289726 287863 284680 280479 275353 269580 263769 258512 254055 250443
64484 250443 247804 246287 245792 245932 246217 246264 245873 244919 243082 239844 235097 229721 225074 221811 219614 218204
64468 218204 217934 218949 220444 221513 222426 224297 227613 231714 235576 238405 239581 238946 237364 236241 236074
64453 236074 235937 234683 232182 229169 226449 224631 224165 225047 226757 228915 231769 235705 240446 245197 249497
64438 249497 253621 258218 263792 270430 277856 285887 294982 306121 319901 336059 354213 374809 398871
64425 398871 427006 459246 495948 538299 587615 644402 708305 778772 855466 938019 1025403
64414 1025403 1115406 1204657 1289457 1367021 1436213 1497083 1549663 1593110 1625829 1646115 1652513
64403 1652513 1643820 1619453 1580349 1529322 1469842 1403982 1331662 1252071 1165745 1075176 983754
64392 983754 894530 809870 731650 661272 599456 546178 500881 462751 430907 404473 382562
64381 382562 364241 348598 335007 323325 313745 306262 300296 294958 289724 284672 280012 275551 270843
64368 270843 265718 260417 255217 250182 245320 240694 236299 232075 228255 225497 224404 224903 226276 227851
64354 227851 229579 231920 235254 239488 244181 248925 253431 257265 259698 260089 258423 255302 251433 247218
64340 247218 242847 238480 234186 229906 225630 221594 218160 215562 213864 213055 213046 213608 214451 215436 216584 217895
64324 217895 219272 220646 222060 223477 224641 225355 225886 226821 228317 229769 230534 230800 231242 231790 231306 228819
64308 228819 224705 220249 216290 212729 209130 205299 201268 197206 193500 190618 188779 187908 187844 188312 188793
64293 188793 188897 188910 189555 191049 192800 194255 195706 197965 201466 205963 210976 216256 221858 227938 234522
64278 234522 241434 248479 255579 262567 268944 274176 278184 281250 283414 284414 284240 283312 281964 280260 278539
64263 278539 277644 278182 279861 281873 283569 284469 284040 282043 278833 274824 269846 263496 255958 248010 240442
64248 240442 233940 229179 226249 224022 221003 217008 213359 211177 210130 209167 207837 206382 205089 204207 204171
64233 204171 205205 206817 208243 209330 210455 211600 212177 211921 211342 210960 210530 209487 207849 206130 204521
64218 204521 202697 200514 198339 196490 194753 192801 190831 189354 188504 187947 187464 187273 187677 188633 189745 190521
64202 190521 190716 190755 191816 195044 200430 206724 212663 218049 223487 229518 236447 244710 254733 266276
64188 266276 278291 289652 299888 309150 317644 325113 330721 333435 332693 328710 321981 312646 300715
64175 300715 286983 273271 261378 251839 243883 236498 229402 222999 217673 213286 209405 205858 202857
64162 202857 200462 198210 195591 192890 191129 191008 192156 193621 194900 196223 198002 200388 203370 206937
64148 206937 210960 215085 218888 222032 224193 225110 224962 224572 224848 225896 226897 226968 225999 224582 223347 222519
64132 222519 221970 221445 220862 220569 221215 223148 226002 229077 232035 234996 238097 241355 245009 249547 255236
64117 255236 261954 269593 278261 287837 297705 307210 316089 324127 330726 335330 338179 340206 342171 344304
64103 344304 346788 350124 354760 360622 367216 374060 380851 387337 393136 397712 400518 401309 400358 398272 395523
64088 395523 392161 387911 382462 375748 368118 360266 352820 345872 338958 331584 323833 316435 310153 305015
64074 305015 300246 295146 289936 285487 282238 279791 277656 275907 274804 274196 273757 273521 273640 273787 273399 272482
64058 272482 271739 271849 273078 275529 279215 283755 288462 292977 297525 302472 307993 314252 321477 329680 338710
64043 338710 348681 359894 372147 384615 396596 407855 417932 425779 430672 433011 433579 432379 428967
64030 428967 423694 417763 412021 406480 401216 396965 394341 392980 391960 390799 389521 387861 384940 379950
64016 379950 372964 364894 356696 348735 340929 333330 326315 320201 314925 310238 305964 301896 297720 293475
64002 293475 289936 288057 287979 288919 290082 291311 292760 294422 296228 298298 300771 303625 306869 310684 315108
63987 315108 319836 324713 330227 337051 345154 353701 361889 369546 376894 384110 391341 398863 406955 415765
63973 415765 425455 436330 448534 461696 475179 488827 503320 519654 538385 559443 582572 607689
63961 607689 634853 664240 696467 732853 775049 824339 881456 947052 1022148 1108047 1206062
63950 1206062 1317428 1443168 1583803 1739275 1909284 2093430 2290667 2498762 2714633
63941 2714633 2935145 3157250 3377423 3591462 3794957 3983542 4152582 4297150 4412901
63932 4412901 4496959 4547858 4564904 4547965 4497650 4415256 4302495 4161612 3995798 3809223
63922 3809223 3606648 3393209 3174434 2955767 2741540 2534450 2336266 2148945 1974810
63913 1974810 1815676 1672170 1544018 1430761 1331926 1246566 1173031 1109461 1054519 1007480
63903 1007480 967635 933746 904124 877169 851851 827847 805288 784277 764516 745454 726786
63892 726786 708692 691550 675603 660983 647834 636219 626060 617404 610665 606361 604694 605535 608770
63879 608770 614438 622632 633461 647016 663152 681382 701336 723235 747551 774152 802180 830884
63867 830884 860154 890003 919910 949041 976950 1003627 1028908 1052169 1072666 1089906 1103561
63856 1103561 1113196 1118388 1119174 1116191 1110090 1100769 1087400 1069413 1047307 1022256 995029 965610 933844
63843 933844 900075 865007 829228 793069 756806 720822 685583 651532 618937 587917 558725
63832 558725 531839 507527 485385 464683 445127 426934 410215 394750 380439 367424 355584
63821 355584 344443 333866 324347 316251 309304 303176 298063 294102 290681 287061 283350 280160 277509 274822
63807 274822 271893 269044 266291 263228 259892 256999 254973 253342 251473 249355 247315 245416 243580 241934
63793 241934 240557 239163 237447 235489 233502 231400 229039 226649 224640 223095 221810 220710 219910 219470 219368
63778 219368 219530 219571 218823 217152 215593 215486 216852 218212 218226 217017 215597 214544 213721 213008 212633 212760 213203
63761 213203 213668 214026 214209 214128 213826 213569 213633 214079 214828 215812 216901 217811 218330 218674 219415 220879 222675 223947
63743 223947 224210 223929 224160 225571 227881 230335 232569 234765 237060 239179 240825 242095 243229 244204 245015
63728 245015 246184 248495 252071 256137 259861 263182 266648 270705 275318 280034 284157 287083 288717 289469
63714 289469 289623 288873 286743 283369 279568 276131 273259 270719 268376 266480 265484 265605 266598 268000 269568
63699 269568 271376 273540 276081 279055 282523 286299 290034 293610 297056 299981 301673 302132 302511 303902 305989
63684 305989 307562 308155 308433 308964 309383 309000 307680 305841 304040 302817 302525 303001 303653 304117 304594 305323 306056
63667 306056 306303 305904 305071 304065 303030 302009 300913 299594 298069 296482 294705 292241 288784 284780 281139
63652 281139 278392 276287 274208 271883 269679 268236 267853 268316 269353 271050 273601 276834 280366 284110 288196
63637 288196 292420 296318 299921 303891 308689 314117 319987 326695 334642 343544 352931 363007 374318 386714
63623 386714 399432 412283 426108 441840 459566 478820 499342 521167 544257 568446 593713
63612 593713 620246 648201 677483 707642 737813 766724 792845 814607 830690 840486 844424 843643
63600 843643 839165 831518 821280 809658 798089 787198 776464 764971 752184 737858 721601 702992
63588 702992 682117 659633 636238 612330 588305 564910 543060 523392 506097 491084 478112
63577 478112 466880 457223 449315 443596 440459 440006 441978 445871 451119 457310 464227 471770 479954 488949
63563 488949 498933 509881 521746 534818 549561 565990 583623 602322 622830 646143 672638 702123
63551 702123 734268 768463 803583 838625 873286 907063 937727 961574 975598 979127 973478 960894
63539 960894 944107 925940 908391 892161 877311 863961 851978 840522 828498 815289 800606
63528 800606 783863 764243 741243 714778 684995 652598 619363 587699 559274 534077 510884
63517 510884 488557 467009 447129 429862 415383 403229 393032 384670 377625 370756 363222 355367
63505 355367 348221 342279 337178 332449 328088 324352 321438 319489 318567 318352 318066 316963 314998 312973 311876
63490 311876 311955 312477 312635 312658 313647 316185 319537 322560 325094 327924 331517 335319 338450 340650 342349 343976
63474 343976 345524 346752 347577 348011 347716 345962 342421 337944 334093 331753 330438 329093 327220 325096 323296
63459 323296 322277 322161 322670 323469 324708 326913 330230 334273 338972 344992 352764 361545 370121 378322 387324
63444 387324 398572 412863 430292 450487 472830 496816 522290 549216 577403 606474 635580
63433 635580 662778 685364 701673 712445 719870 725667 730776 736489 744661 756590 772486 792193
63421 792193 815752 843080 873757 907276 942742 978158 1010727 1038212 1059503 1073812 1080271 1078795
63409 1078795 1070669 1057779 1041781 1024320 1007208 991498 976707 961514 944937 926438 905425
63398 905425 881406 854413 824773 792796 759212 725522 693156 662471 633250 605894 581291
63387 581291 559585 540118 522787 508534 497965 490209 483880 478760 475846 475871 478373 482254 486784
63374 486784 491965 498351 506748 517833 531735 548031 566249 586307 608380 632480 658401 686051
63362 686051 715576 747037 780111 814236 848960 883982 918798 952299 982706 1008020 1026815
63351 1026815 1038733 1044183 1043619 1037374 1026274 1012010 996554 981168 966082 950938 935266 918624
63339 918624 900541 880435 857669 831913 803551 773447 742298 710621 679627 651455 627855
63328 627855 608844 593263 580378 570283 562960 557853 554435 552184 549621 544220 534037 519170 501252
63315 501252 481959 462469 443832 426968 412199 399277 387917 378053 369568 362196 355790 350456
63303 350456 346249 342810 339464 335784 332033 328896 326623 324638 322283 319823 318222 317839 317829 317101 315522
63288 315522 313801 312421 311110 309356 307149 304995 303279 301786 300054 298182 296896 296561 296473 295641 294101
63273 294101 292824 292421 292668 293368 294844 297162 299598 301432 302756 303929 304785 305108 305603 307484 311012 315128
63257 315128 318629 321189 323126 324791 326556 329017 332660 337334 342375 347370 352657 358924 366402 374624
63243 374624 383075 391819 401262 411531 422502 434441 448072 463788 481114 499284 518128 538073
63231 538073 559382 581595 603734 624971 645150 664718 684101 703259 722003 740507 759139
63220 759139 777902 796549 815152 833991 852805 870766 887318 902351 915280 924721 929578 929843
63208 929843 925795 917003 902911 883993 861594 836824 810278 782697 755194 728800 704262 682222
63196 682222 663145 647104 634006 623931 616954 612883 611555 613110 617520 624160 632457 642686 655486
63183 655486 670702 687340 704516 721815 738896 755590 772416 790169 808775 827197 844629
63172 844629 861123 876840 891404 904411 915950 926095 934252 939441 940955 938429 931523 919951
63160 919951 903769 883418 859527 832690 803377 772153 740121 708859 679436 651640 624734
63149 624734 598931 575457 555101 537453 521814 508097 496425 486499 477980 471067 466045 462514
63137 462514 459616 456868 454370 452348 450931 450195 450020 450010 449973 450312 451504 453238 454646 455465 456560 459020
63121 459020 462933 467338 471243 474513 477696 481132 484456 487082 489054 491086 493752 496883 499893 502439
63107 502439 504584 506535 508453 510369 512061 513125 513414 513328 513458 513968 514468 514440 513640 512168 510409 508901
63091 508901 508022 507710 507617 507562 507732 508375 509402 510537 511883 514179 518169 523679 529578 534886 539770 545154
63075 545154 551469 558211 564764 571196 578036 585544 593567 601963 610873 620640 631675 644397 659066
63062 659066 675632 693877 713746 735463 759354 785688 814700 846617 881453 918755 957780
63051 957780 998187 1040538 1085822 1134288 1184897 1236050 1286656 1336340 1385020 1432813 1480203
63040 1480203 1527738 1575396 1622622 1669101 1715069 1760681 1805420 1848324 1888517 1925196 1957282
63029 1957282 1983281 2001452 2010174 2008492 1996500 1974952 1944376 1904871 1856905 1801969 1742209 1679726
63017 1679726 1616476 1554440 1495317 1440114 1389412 1343969 1304778 1272534 1247319 1228772 1216432
63006 1216432 1210036 1209720 1215760 1227868 1244851 1265285 1288459 1314413 1343151 1374178 1406763 1440266
62994 1440266 1474121 1507797 1540972 1573602 1605753 1637412 1668322 1697766 1724559 1747495 1765800
62983 1765800 1778916 1786018 1786216 1779258 1765496 1744902 1716596 1679793 1635075 1584299 1529441 1471898
62971 1471898 1412808 1353445 1295038 1238525 1184759 1134665 1088796 1046809 1007829 971423 937961
62960 937961 907871 880823 855905 832420 810224 789323 769500 750406 731770 713461 695559
62949 695559 678486 662765 648466 635092 622217 610025 598931 588878 579419 570408 562170 554865
62937 554865 548116 541536 535277 529763 525054 520894 517283 514566 512854 511695 510545 509271 507948 506354
62923 506354 504127 501434 499132 497975 497794 497627 496609 494635 492236 490008 488175 486572 484896 482975 480830
62908 480830 478566 476312 474222 472417 470866 469378 467772 466046 464363 462952 462023 461699 461964 462673 463560
62893 463560 464218 464274 463821 463512 463860 464442 464245 462939 461362 460524 460580 461112 461958 463199 464624 465867 466937
62876 466937 468033 468890 468927 468135 467172 466402 465370 463494 460847 457958 455277 453159 451977 451779 451984 451808
62860 451808 450933 449607 448271 447378 447362 448425 450341 452627 454814 456452 457112 456761 456041 455795 456212 456667 456444
62843 456444 455437 454071 452734 451443 450026 448431 446761 445070 443316 441555 440018 438879 438120 437766 438076
62828 438076 439149 440498 441392 441657 441792 442289 443224 444582 446551 449212 452261 455377 458626 462278 466294
62813 466294 470295 473986 477501 481351 486028 491585 497599 503658 509790 516248 523053 530147 537825 546403
62799 546403 555461 564103 572216 580848 590986 602621 615465 630043 647360 667881 691620 718986
62787 718986 750783 787310 828141 872951 922057 975968 1034762 1098047 1165261 1235860 1309409
62776 1309409 1385506 1463417 1541765 1618669 1692104 1759952 1819942 1869955 1908453 1934502 1947503
62765 1947503 1947144 1933486 1906871 1867990 1818331 1760223 1695925 1626746 1553499 1477639 1401341 1326436
62753 1326436 1253799 1183831 1117031 1053893 994779 940101 890293 845341 804680 767709 734205
62742 734205 704079 677097 653066 632049 614145 599152 586519 575452 565108 555010 545439 537159
62730 537159 530642 525740 522119 519714 518608 518728 519786 521336 522877 524229 525893 528680 532931 538434
62716 538434 545217 553912 565067 578540 593890 611059 630319 651864 675821 702427 731858 764096
62704 764096 799322 838171 881210 928341 979093 1033309 1091135 1152465 1216852 1283778 1352508
62693 1352508 1421663 1489435 1554175 1614347 1667962 1712716 1746874 1769541 1779996 1777465 1761903
62682 1761903 1734384 1696165 1647850 1590158 1525213 1456197 1385666 1314800 1244379 1175782 1110546
62671 1110546 1049383 992139 938617 889045 843722 802563 765147 731124 700446 673130 648842
62660 648842 626841 606513 587896 571440 557205 544510 532438 520483 508671 497327 486948
62649 486948 477994 470517 464133 458593 454130 450891 448285 445451 442315 439672 438162 437634 437627 437875 438054 437535
62633 437535 435904 433478 430921 428553 426429 424842 424185 424301 424424 423935 422923 421935 421440 421603 422293 423161
62617 423161 423910 424722 426327 429495 434398 440442 446653 452266 457190 462102 468108 476115 486395 498631
62603 498631 512359 527357 543691 561578 581396 603767 629311 658101 689533 722973 758380
62592 758380 795902 834930 873949 911418 946402 978184 1005717 1027769 1043406 1052104 1053705 1048511
62580 1048511 1037147 1020007 997135 969019 937235 903746 869623 834901 799675 764806 731411
62569 731411 700082 670834 643537 618181 594883 573840 555194 538852 524476 511728 500452
62558 500452 490632 482235 475054 468630 462437 456319 450707 446196 442924 440495 438473 436755 435491 434864
62544 434864 434940 435512 436016 435795 434624 432965 431611 431047 431108 431252 431218 431385 432369 434269 436625 439217 442641
62527 442641 447834 455229 464630 475729 488449 502845 519054 537401 558354 582226 608963 638170
62515 638170 669332 702198 736986 774043 813204 853673 894572 935207 974582 1011108 1043179
62504 1043179 1069814 1090513 1104898 1112936 1115066 1111571 1102195 1087167 1068341 1048537 1029732 1012565
62492 1012565 997448 985220 976531 971447 970094 972997 980354 991527 1005770 1022939 1043004 1065172
62480 1065172 1088078 1110615 1131978 1150837 1164968 1172086 1171142 1162846 1148766 1129785 1105450 1074963
62468 1074963 1038630 998007 954818 910218 865052 820180 776327 734061 694215 657911 625895
62457 625895 598070 573892 553001 535303 520730 509115 500063 492867 486832 481806 478147 476166 475976
62444 475976 477819 481948 487983 494956 502201 509714 517381 524505 530489 535431 539484 542061 542256 539827
62430 539827 535234 528946 521225 512448 503127 493590 483937 474269 464769 455679 447335 439958 433291 426857
62416 426857 420830 416065 412836 410024 406293 401727 397596 394684 392599 390671 388766 387012 385406 384052
62402 384052 383370 383736 385022 386637 387898 388374 388183 388049 388856 390968 394020 397299 400230 402637 404794 407228
62386 407228 410327 414138 418593 423703 429385 435388 441695 448770 457025 466124 475190 483723 492078 501085
62372 501085 511448 523395 536677 550965 566458 583930 603989 626601 651696 679979 712560
62361 712560 749881 791478 836706 885137 936270 989431 1044082 1099627 1154583 1206342 1252128
62350 1252128 1290089 1319424 1339876 1351478 1354603 1349909 1338142 1319985 1295986 1266645 1232695 1195279
62338 1195279 1155692 1114928 1073661 1032642 992828 955095 920099 888455 860718 836941 816448
62327 816448 798265 781712 766424 751943 737534 722474 706429 689460 671716 653257 634244
62316 634244 615172 596642 578887 561796 545468 530428 517038 504981 493680 483106 473836 466399
62304 466399 460858 456940 454209 452090 450120 448310 447109 446839 447306 448023 448734 449672 451268 453672 456667
62289 456667 460177 464549 469836 474928 478258 479680 480918 483556 487222 490588 493604 497573 503094 509185
62275 509185 514740 519939 525712 532563 540530 549770 560568 573058 587466 604418 624643 648530 676274
62262 676274 708163 744334 784443 828001 874976 925740 980395 1038320 1098262 1158567 1217307
62251 1217307 1272422 1321853 1363607 1395885 1417477 1428211 1429052 1421643 1407474 1387276 1361101 1328969
62239 1328969 1291282 1248669 1201935 1152473 1102364 1053511 1006794 962517 921373 884300 851516
62228 851516 822533 797171 775624 757356 740940 725566 711844 700375 690263 679920 668783
62217 668783 657293 645590 633353 620790 608628 596902 584762 571850 559035 547315 536637
62206 536637 526353 516287 506848 498495 491701 487078 484896 484542 484973 485678 486798 488480 490674 493578
62192 493578 497716 503361 510281 518250 527341 537372 547446 556609 564963 573680 583731 594820 605686
62179 605686 615353 623949 632432 641702 652074 663512 676211 690791 707999 728423 752487 780439
62167 780439 812180 847303 885473 926444 969354 1012221 1052630 1088932 1120348 1145939 1164132
62156 1164132 1173665 1174667 1168496 1156752 1140695 1121209 1098782 1073506 1045384 1014701 981936 947549
62144 947549 912245 877424 844966 816283 791579 770120 751245 735126 722518 713741 708016 703944
62132 703944 700543 697599 695157 693164 691676 690948 691114 692165 694352 698121 703413 709607 716450 724383 733377
62117 733377 742009 748431 751909 752788 751463 748339 744499 741268 738947 736667 733515 728987 722382 712897
62103 712897 700829 687989 676474 667412 661029 657166 655409 655410 657552 662699 670808 680314 689496 698068
62089 698068 706980 717081 728513 740998 754019 766803 778709 789697 800251 811039 822871 836663
62077 836663 852991 871769 892572 915041 938761 963128 987793 1013042 1039363 1066808 1095041
62066 1095041 1123788 1152846 1181867 1210379 1237816 1263247 1285418 1303379 1316764 1325107 1327394 1322972
62054 1322972 1312633 1298094 1280428 1259523 1234993 1206938 1175764 1141861 1105732 1068055 1029468
62043 1029468 990601 952298 915362 879917 845423 811520 778597 747367 718191 690994 665654
62032 665654 642262 621086 602335 585869 571188 557823 545760 535284 526483 519061 512495 506121
62020 506121 499219 491484 483498 476332 470512 465676 461314 457483 454554 452568 451205 450267 449957 450707 452872
62005 452872 456519 461369 467034 473318 480138 487063 493214 497951 501541 504806 508054 510611 511556 510715 508767
61990 508767 506529 504326 501908 498720 494234 488322 481436 474278 467210 460141 453073 446434 440621 435436
61976 435436 430327 425108 420116 415698 411918 408777 406381 404736 403654 402897 402216 401210 399527 397323 395241
61961 395241 393792 392959 392526 392532 393226 394784 397186 400223 403561 407034 410938 415801 421803 428672 436117 444069
61945 444069 452533 461696 472195 484672 498858 513611 528112 542496 557081 571618 585679 599160
61933 599160 611907 623396 633363 642208 650158 656532 660554 662519 663335 663263 661953 659449 656186 652103
61919 652103 646775 640488 634284 628809 624005 620239 618737 620355 624523 629997 636231 643541 652295 662451
61905 662451 673607 685027 695653 704382 710422 713389 713257 710231 704435 695801 684501 671377 657511
61892 657511 643410 629093 614925 601763 590144 579882 570654 562396 554910 547616 540061 532276 524419
61879 524419 516550 508965 502127 495956 489785 483488 478064 474506 472617 471536 470984 471259 472371 474089 476683
61864 476683 480783 486495 493453 501742 511973 524158 537316 550653 564680 580663 599286 620211
61852 620211 642660 665924 689427 712772 735892 758898 781610 803300 822993 840055 854424
61841 854424 866150 874719 879069 878510 873585 865725 856089 845051 832974 821156 811574 805666 803508
61828 803508 804256 807204 812252 819450 828359 838027 847454 855805 862118 865141 863754 857511 846648 831677
61814 831677 813252 792321 769983 746949 723283 698831 673795 648789 624520 601617 580682
61803 580682 562202 546353 533004 521913 512722 504744 497083 489293 481848 475679 471145 467641 464255
61790 464255 460674 457336 454849 453350 452392 451329 449833 448107 446560 445397 444603 444221 444322 444605 444383 443299
61774 443299 441793 440589 439844 439162 438352 437735 437683 438210 439132 440318 441636 442888 444023 445212 446623 448272
61758 448272 450201 452558 455322 458118 460510 462355 463703 464448 464342 463333 461746 460066 458615 457429 456381
61743 456381 455411 454603 454036 453671 453488 453638 454210 454893 455185 455020 454896 455248 455981 456809 457754 459003 460549 462288
61725 462288 464290 466543 468614 470008 470917 472182 474432 477580 481209 484954 488343 490740 491912 492369 492696
61710 492696 492723 491849 490105 488306 486966 485518 483005 479263 475058 471160 467720 464556 461670 459225 457222
61695 457222 455415 453524 451446 449313 447429 446045 445115 444285 443233 441919 440481 439000 437546 436352 435593
61680 435593 434941 433629 431220 428210 425618 423975 422952 422003 421087 420574 420610 420889 420971 420562 419474 417674 415505
61663 415505 413614 412421 411816 411509 411388 411245 410492 408664 406166 404051 403008 402981 403729 405181 407019 408543
61647 408543 409424 410237 411712 413677 415276 416167 417007 418640 421170 423988 426402 428014 428660 428230 426632 423916
61631 423916 420361 416309 411886 407025 401904 397240 393841 391827 390407 388572 386003 383299 381337 380466
61617 380466 380368 380597 380929 381060 380311 378132 374825 371337 368315 365715 363234 360540 357032 352140 346219 340542
61601 340542 335957 332041 327984 323763 319882 316487 313454 310958 309116 307333 304847 301865 299320 297533
61587 297533 295902 294008 292214 290878 289687 288167 286358 284595 282983 281428 279907 278450 277033 275671
61573 275671 274453 273467 272834 272724 273053 273298 273017 272384 271762 270959 269540 267828 266827 267020 267963 269155 270583
61556 270583 272146 273323 273884 274304 275048 275982 276869 277881 279135 280277 281051 281740 282510 282893 282673 282809 284555
61539 284555 287852 291354 293975 295712 297018 298186 299454 301026 302656 303680 303734 303097 302167 300985 299533
61524 299533 298097 296989 296070 294902 293311 291564 290047 289025 288711 289209 290112 290419 289366 287443 286084
61509 286084 286091 286797 287190 287399 288322 289928 290911 290285 288591 287098 286326 285852 285177 284216 283154 282289 281939 282182
61491 282182 282696 283056 283111 283035 283197 284034 285706 287774 289549 290866 292067 293184 293798 293986 294674 296501 298836
61474 298836 300572 301496 302194 302942 303432 303488 303352 303226 303031 302648 302011 301033 299841 299013 299162 300297 301810 302987
61456 302987 303355 302841 302034 301880 302691 303728 304272 304710 305826 307375 308319 308393 308461 309199 310290 311219 312054 313065
61438 313065 314261 315788 318144 321413 324736 327190 328876 330528 332248 333390 333773 334321 336064 338797 341239
61423 341239 342543 343208 344368 346452 348963 351393 353783 356235 358375 359675 360070 359903 359449 358762 357819 356540
61407 356540 354821 352766 350724 348856 347019 345344 344471 344677 345086 344397 342272 339448 336691 334313 332631
61392 332631 332085 332688 333876 335080 335961 336122 335256 333847 333053 333479 334407 334660 333933 333001 332802 333592 334881
61375 334881 336046 337017 338342 340406 342752 344494 345315 345709 346283 347259 348644 350395 352309 354211 356381
61360 356381 359424 363623 368760 374543 380747 386946 392787 398694 405722 414341 423835 433160 441945 450329
61346 450329 458218 465087 470260 473226 474056 473728 473577 474148 475008 475857 477156 479166 481019 481508 480494 478848
61330 478848 477181 475351 473177 470925 468876 466834 464363 461367 458373 456374 456283 458252 461489 464923 468123
61315 468123 471555 476087 482341 490317 499434 509026 518994 529821 541848 554746 567872 580905 593818
61302 593818 606420 618254 628801 637479 643565 646480 646153 642878 636994 629062 620185 611621 603836 596260
61288 596260 588084 579089 569626 560094 550769 542000 534212 527598 521945 516945 512695 509719 508438 508734
61274 508734 510209 512744 516421 520914 525352 529104 532431 536098 540494 545481 550967 557180 564257 571941
61260 571941 579937 588377 597610 607528 617266 625684 632049 636237 638408 638731 637409 634787 631285 627234
61246 627234 622801 617967 612614 606835 601193 596394 592599 589357 586405 584170 583120 582957 582927 582744 582698 583045
61230 583045 583888 585591 588623 592881 597767 603057 609028 615535 621728 627163 632578 638954 646263 653751
61216 653751 661112 668668 676524 684284 691636 698653 705290 711055 715479 718662 721189 723651 726456 729990
61202 729990 734705 740869 748342 756856 766676 778730 793696 811010 829161 847010 864397 881346
61190 881346 897188 910828 921566 929276 934058 936132 936013 934416 931924 928790 924895 919750 912773 903805
61176 903805 893275 881720 869352 856218 842504 828427 814082 799588 785134 770669 755866
61165 755866 740722 725858 711834 698435 685085 671780 659104 647494 636999 627713 619958 613977
61153 613977 609785 607373 606673 607357 608979 611242 613779 615754 616232 614994 612496 608905 603686 596395 587501
61138 587501 578179 569619 562757 558262 556305 556429 557944 560432 563772 567980 573344 580527 590068 601838
61124 601838 615300 630291 647135 665991 686558 708672 732696 758886 786592 814613 842236
61113 842236 869435 896208 922352 947988 973488 998456 1021449 1041348 1058540 1073934 1087172
61102 1087172 1096666 1101334 1101379 1097349 1089393 1077747 1063027 1045495 1024784 1001004 975539 949919 924277
61089 924277 897643 869656 841310 814048 788694 765301 743513 722947 703525 685521 669113
61078 669113 654035 639968 627179 616350 607721 600700 594455 588709 583924 580799 579612 580000 581366
61065 581366 583413 586081 589132 592242 595589 599830 605226 611275 617595 624740 633585 644215 656002 668611
61051 668611 682296 697277 713424 730734 749643 770588 793416 817462 842240 868016 895690
61040 895690 925924 958467 992548 1027855 1064722 1103355 1143447 1184742 1227375 1271358 1316242
61029 1316242 1361638 1407556 1453962 1500774 1548769 1599794 1655544 1716868 1784935 1862079 1950535
61018 1950535 2051199 2164905 2294425 2444330 2620116 2829417 3083535 3395896 3779387
61009 3779387 4247263 4816094 5504798 6329766 7301813 8425477 9696066 11098501 12618517
61000 12618517 14257944 16021175 17858603 19614164 21051609 21970210 22322114 22229415 21896605
60991 21896605 21511001 21206320 21066154 21100896 21198443 21125820 20629506 19574665 18012257
60982 18012257 16130537 14149430 12241740 10510864 9002006 7720245 6647786 5758839
60974 5758839 5027584 4429101 3939476 3538145 3209038 2938627 2714327 2525554 2364806
60965 2364806 2226601 2106205 2000009 1905965 1822600 1748195 1681562 1622790 1572339 1529800 1494092
60954 1494092 1464324 1439638 1418512 1398957 1379446 1359474 1339497 1320682 1304319 1290880 1279597
60943 1279597 1269207 1258982 1248936 1239341 1230364 1221997 1213973 1205743 1196637 1186063 1173687 1159745
60931 1159745 1145105 1130599 1116194 1101223 1085519 1069824 1054886 1040673 1026713 1012684 998312
60920 998312 983263 967713 952612 938699 925468 911717 897020 882103 867867 854700 842723
60909 842723 832045 822456 813389 804493 796025 788386 781553 775227 769353 764107 759390 754565 748919 742305
60895 742305 735250 728397 721941 715657 709390 703231 697254 691335 685386 679436 673296 666459 658677 650438
60881 650438 642536 635257 628339 621547 614930 608655 602938 598007 593690 589231 584094 578915 574981 572703
60867 572703 571236 569718 568134 566681 565159 563535 562426 562231 562228 561285 559173 556444 553258 549219 544367
60852 544367 539538 535531 532454 530015 527892 525626 522657 518746 514078 508936 503617 498682 494699 491514
60838 491514 488178 483817 478359 472344 466510 461611 458084 455578 453244 450734 448545 447135 446185 445079
60824 445079 443778 442829 442756 443666 445131 446256 446318 445606 445212 445622 446000 445342 443815 442331 441219 440096 438903
60807 438903 438220 438412 439025 439294 438925 438276 437979 438352 438946 438789 437353 435151 433079 431304 429173 426106 422225
60790 422225 418197 414790 412452 410959 409569 407789 405795 403829 401608 398886 396157 394029 392061 389173
60776 389173 385269 381681 379761 379715 381008 383097 385363 386965 387413 387033 386530 386344 386682 387730 389434 391314
60760 391314 392881 394097 395194 396243 397146 397885 398562 399321 400368 401883 403773 405641 407084 407893 408100 408196
60744 408196 409163 411736 415355 418263 418883 416832 412643 407141 401342 396272 392188 388223 383314 377422 371523
60729 371523 366595 362909 360081 357470 354686 352046 350390 350099 350434 350203 348941 347149 345500 344225 343191
60714 343191 342159 340943 339596 338511 338045 337999 337748 336974 336072 335710 336114 336915 337634 338200 338922 339994 341155
60697 341155 341955 342292 342460 342701 342982 343321 344045 345481 347578 350045 352767 355900 359554 363555 367537 371211
60681 371211 374585 377958 381670 385847 390387 395073 399580 403508 406728 409644 412794 416133 418988 420743
60667 420743 421214 420327 417955 414382 410528 407252 404582 401952 399078 396302 394178 393043 392950 393705 394871
60652 394871 395941 396663 397152 397650 398194 398540 398438 397882 397019 395869 394294 392259 389846 386952 383373 379414
60636 379414 375974 373525 371369 368557 365306 362719 361212 360093 358878 358119 358486 359745 361161 362418 363606
60621 363606 364676 365406 365665 365357 364380 362981 361819 361361 361464 361805 362299 362858 363217 363405 363899 364825 365515 365423
60603 365423 365038 365197 365811 366067 365760 365639 366356 367687 368968 369789 370098 369932 369300 368266 367104 366353 366389 366781
60585 366781 366489 365059 363354 362665 363397 364988 366812 368510 369764 370534 371548 373905 377981 383187 388834
60570 388834 394824 401408 408752 416902 425785 435021 444000 452261 459627 465905 470683 473445 473762 471521
60556 471521 467289 462347 457957 454491 451524 448765 446623 445911 447275 450949 456768 464292 473021 482505
60542 482505 492285 502008 511795 522178 533370 544783 555566 565316 573873 580714 585074 586582 585326
60529 585326 581520 575617 568615 561602 554947 548412 542053 536509 532334 529528 527755 526571 525397 523837
60515 523837 522235 521486 522083 523663 525626 527884 530824 534872 540289 547263 556087 567344 581867 600274
60501 600274 622566 648318 677120 708627 742444 778297 816029 854969 893462 929535 961841
60490 961841 989375 1010427 1022605 1024090 1014437 994231 964617 927349 884647 838793 792136 747343
60478 747343 706708 670881 638838 609486 582833 559421 539267 521818 506542 493096 481197
60467 481197 470699 461545 453462 445960 438838 432336 426603 421361 416328 411600 407376 403648 400357 397533
60453 397533 395069 392724 390544 388851 387638 386408 384877 383336 382011 380560 378679 376759 375468 374954
60439 374954 374973 375441 376304 377128 377415 377243 377092 377104 376972 376550 376057 375657 375288 375036 375206 375846 376446 376419 375744 374932
60419 374932 374435 374306 374457 375050 376369 378310 380292 381842 383117 384585 386330 387974 389169 389812 389840 389319
60403 389319 388769 388942 390064 391638 393109 394360 395419 396143 396537 396991 397851 398998 400194 401572 403406 405560
60387 405560 407534 409077 410528 412533 415441 418851 421765 423477 424362 425496 427408 429603 431422 432857
60373 432857 434233 435535 436594 437601 438984 440897 443183 445638 447975 449750 450823 451733 453159 455107
60359 455107 457080 459019 461599 465501 470806 477232 484587 492807 501733 511097 520587 529761 537935 544288
60345 544288 548141 549241 547838 544490 539697 533713 526708 519087 511524 504632 498580 493087 487912 483330
60331 483330 479864 477482 475351 472696 469617 466710 464127 461563 459006 456745 454630 452101 449232 447098
60317 447098 446634 447738 449920 453244 458034 464128 471185 479424 489319 500675 512762 525349 538863
60304 538863 553342 567850 581229 592888 602457 609060 611561 609555 603700 594918 583530 569489 553457
60291 553457 537231 522815 511163 502027 494860 489416 485486 482615 480312 478233 475932 472847 468881
60278 468881 464679 460905 457459 453787 449811 446124 443293 441318 439784 438218 436294 433917 431259 428676
60264 428676 426641 425700 426196 427768 429279 429580 428424 426580 425140 424732 425166 425731 425982 426293 427377 429289
60248 429289 431295 432898 434434 436333 438250 439450 439724 439346 438396 436778 434881 433570 433374 434059 435071
60233 435071 436046 436795 437207 437451 438049 439539 442041 445189 448478 451691 454998 458538 461976 464836 467371
60218 467371 470660 475530 481671 488194 494746 501604 508851 516089 523020 529849 536905 544158 551215 557663
60204 557663 563368 568602 573847 579309 584672 589428 593335 596459 598970 601055 602744 603559 602652 599664 595290
60189 595290 590625 586086 581341 576059 570271 564109 557742 551542 545911 540853 536049 531314 526631 521876
60175 521876 516953 512220 508320 505509 503505 501916 500477 498879 496943 495025 493831 493637 494024 494443 494659
60160 494659 494624 494394 494325 494893 496123 497564 498975 500611 502645 504782 506746 508742 511052 513493 515694 517693
60144 517693 519886 522561 525819 529742 534236 538876 543366 548195 554326 562068 570536 578424 585135 590935
60130 590935 596177 600721 604215 606729 608824 610957 613025 614674 615966 617518 619888 622958 626023 628400
60116 628400 629865 630558 630674 630352 629736 628976 628087 626962 625550 623852 621617 618286 613607 608194 603071 598545
60100 598545 593934 588606 582914 577803 573733 570430 567536 565083 563273 562125 561539 561560 562359 563893 565675
60085 565675 567035 567781 568418 569450 570580 570981 570325 569096 567797 566401 564811 563247 561710 559498 555865
60070 555865 550938 545482 539953 534207 528013 521404 514671 508403 503285 499388 495838 491706 487084 482768
60056 482768 479136 476028 473628 472644 473415 475449 478132 481323 485042 489086 493296 497863 503018 508668 514526
60041 514526 520378 525997 531038 535212 538459 540891 542701 544110 545127 545381 544457 542391 539495 535753 530798
60026 530798 524515 517250 509430 501430 493848 487274 481565 475856 469660 463468 457984 453219 448776 444589
60012 444589 440828 437362 433931 430702 428105 426132 424273 422216 420170 418433 417067 416175 416086 416916 418208
59997 418208 419363 420338 421513 422893 423930 424436 425285 427637 431510 435653 438994 441722 444628 447791 450483
59982 450483 452112 452658 452118 450180 446807 442805 439358 437016 435358 433631 431517 429237 427080 425076 423238
59967 423238 421901 421511 422061 423048 424094 425355 427125 429345 431729 434133 436501 438576 440037 440839 441164
59952 441164 441148 440922 440778 440998 441553 442258 443137 444280 445385 445750 444830 442681 439851 436945 434224 431567 428920
59935 428920 426747 425703 425791 426305 426785 427547 428973 430910 433306 436797 441799 447349 451821 454790 457432
59920 457432 461019 465739 471067 476632 482451 488707 495492 502416 508548 513159 516395 518805 520429 521041
59906 521041 521101 521539 522485 522976 522194 520330 518075 515934 514192 512905 511655 510029 508555 508500 510405 513497
59890 513497 516827 520179 523490 526238 528218 530296 533551 538008 542891 547862 553215 558963 564416 568794
59876 568794 571900 574129 576024 577741 578742 578190 575883 572597 569299 566258 563172 559855 556448 553151
59862 553151 550183 547902 546588 546155 546308 546940 548185 550140 552804 556267 560769 566529 573462 580935 587797
59847 587797 592874 595615 596246 595332 593398 590925 588382 586095 584204 582735 581492 579870 577072 572661 566838
59832 566838 560301 554009 548875 545226 542547 540106 537756 535769 534040 532013 529447 526741 524375 522436
59818 522436 520789 519309 517922 516749 516101 515881 515172 513100 510068 507347 505435 503598 501188 498519 496089
59803 496089 493713 490950 487800 484531 481339 478525 476452 474898 472989 470225 467158 464675 463057 462056
59789 462056 461382 460692 459541 457808 455891 454226 453000 452446 452850 453982 455084 455713 456062 456306 456357 456528 457569
59772 457569 459627 461960 464126 466562 469400 471744 473028 474241 476737 480393 483944 486733 489084 491342
59758 491342 493539 495843 498402 500865 502870 504860 507590 510979 514274 517323 520836 525278 530135 534451
59744 534451 537633 539769 541584 543988 547249 550691 553539 555787 557760 559196 559448 558474 557008 555808 555222
59729 555222 555343 556034 556834 557305 557424 557347 556992 556199 555056 553732 552312 551116 550697 551059 551403 551182 550883 551070
59711 551070 551230 550428 548713 546985 545747 544861 544321 544403 545141 546403 548288 550752 553092 554673 555942 557865
59695 557865 560544 563282 565799 568298 570391 571143 570413 569184 568258 567497 566591 565746 565200 564722 563984 562967
59679 562967 561730 560193 558253 555731 552206 547475 542090 536852 531847 526654 521441 517045 513881 511549
59665 511549 509607 507992 506562 504992 503359 502103 501278 500564 500193 500958 502996 505393 507448 509611 512661
59650 512661 516552 520615 524361 527551 529833 530854 530569 529122 526663 523460 519976 516611 513561 510958
59636 510958 508886 507242 505935 505180 505228 505802 506288 506406 506184 505389 503652 501215 498823 496758 494629 492266
59620 492266 490096 488330 486408 483625 479861 475472 470964 467054 464503 463519 463619 464236 465068 465797 466104 466227
59604 466227 466955 468766 471350 474156 476863 479137 480519 480956 480969 481042 481268 481801 482985 484611 485630 485196
59588 485196 483711 482300 481434 480545 478939 476730 474779 473786 473490 472846 471108 468577 466103 464167 462830
59573 462830 462238 462439 462798 462396 461154 459929 459380 459412 459903 461207 463426 465715 466853 466368 464870 463447
59557 463447 462884 463281 464256 465553 467257 469350 471503 473723 476702 480900 485712 490329 495083 501058 508703
59542 508703 517754 528181 539968 552306 564508 577625 593193 609815 622685 627608 624512 616365
59530 616365 606121 595807 587176 581372 578149 576600 576426 577669 579710 581611 583230 585043 586950 588035
59516 588035 587472 585063 580962 575406 568707 561137 552981 544839 537467 531005 524829 518568 512666 507544
59502 507544 502918 498574 495158 493352 492751 492395 492055 492092 492341 492158 491542 491323 492026 493234 494268 495004 495797
59485 495797 497097 499352 502960 508039 514267 521043 527858 534595 541476 548655 555951 563174 570437 577602
59471 577602 583589 587005 587669 586894 586007 585166 583890 582109 580303 579113 579210 581046 584423 588759 593967 600485
59455 600485 608287 616660 625306 634802 645472 656544 666973 676341 684368 690393 694059 695779 695716 693055
59441 693055 687145 678765 669351 659555 649451 639540 630421 621811 612982 604013 595744 588718 582965 578573
59427 578573 575661 574174 574555 578223 586330 598226 612103 627023 643480 662242 683559 707247 732472
59414 732472 757720 782125 806584 831960 855861 872640 877457 869886 853550 833373 813536 796605
59402 796605 783311 773413 767388 766717 771641 778815 782029 775711 758091 731667 701261 671439 644886
59389 644886 622334 603472 587815 575111 565371 558618 554460 551973 550197 548658 547303 546138 545202
59376 545202 544700 544833 545617 547036 549158 551914 555005 558281 561962 566241 571049 576408 582600 589601 596856
59361 596856 604012 611433 619533 628123 636958 646374 656727 667748 679199 691595 705294 719345 732380
59348 732380 744495 757095 770919 785301 799442 813221 826453 838434 848730 857634 865203 870436
59336 870436 871967 869260 862761 853250 841417 827845 812997 797247 780903 764140 746982 729604
59324 729604 712536 696387 681626 668834 658648 650900 644275 637651 631510 627173 624836 623415 622365
59311 622365 622529 624772 628728 633509 638958 645557 653489 662437 672128 682562 693634 704569 713533 717864
59297 717864 715253 705183 689257 670080 649986 630681 613423 598950 587279 577878 570216 564144
59285 564144 559759 556942 555191 554123 553987 555315 558020 561373 565037 569569 575608 583097 591703 601461
59271 601461 612389 623970 635653 647465 659448 670836 680554 688292 694338 698596 700566 700162 697821
59258 697821 693840 688324 681702 674581 667042 658726 649609 640199 631081 622783 615875 610559 606315 602587
59244 602587 599625 597974 597448 597465 598155 600199 603653 607876 612606 618091 624119 629857 634793 638891 641656
59229 641656 642113 640129 636914 633775 630977 628071 624645 620443 615395 609869 604419 599104 593620 588141
59215 588141 583324 579306 575463 571373 567343 563792 560818 558612 557513 557319 557247 556877 556561 556621 556827 556983
59199 556983 557364 558156 558992 559398 559200 558346 556909 555505 555001 555470 556048 556130 556151 556768 557882 558840 559188 558948
59181 558948 558550 558713 559918 561881 564027 566523 570104 574837 579927 585039 590926 598272 606675 615357 624224
59166 624224 633648 643655 653856 663760 672661 679634 684123 686364 687004 686567 685328 683182 679462 673466
59152 673466 665426 656436 647227 637627 627414 617011 607020 597729 589391 582284 576082 569779 562739 555299
59138 555299 548025 541018 534403 528784 524583 521389 518559 516069 514259 513055 511999 510832 509722 509123
59124 509123 509605 511484 514396 517611 520959 525018 530278 536631 543835 551884 560653 569779 579137 588836
59110 588836 598540 607472 615440 623199 631376 639617 647138 653496 658419 661565 662973 663228 662751 661378 658976
59095 658976 655835 652137 647704 642774 638340 635136 632857 630877 629119 627620 625814 623048 619419 615481
59081 615481 611358 606708 601285 595094 588254 581134 574412 568597 563635 559154 554842 550556 546478 543210
59067 543210 541168 539806 538070 535680 533247 531058 528722 526228 524369 523631 523494 523315 523018 522553 521644 520641
59051 520641 520575 521622 522473 521997 520613 519217 517744 515950 514716 515179 516933 518262 518020 516453 514524 513290
59035 513290 513554 515132 516635 516874 516314 516490 518253 521425 525843 531765 539231 547824 557166 567096 577385
59020 577385 587710 597866 607667 616789 624998 632198 637993 641672 643017 642622 641014 638019 633601 628711
59006 628711 624607 621796 620290 620441 622725 626975 632478 638601 644822 650550 655537 660169 664856 669447
58992 669447 673682 677674 681428 684440 686390 687705 688785 689244 688644 687548 687067 687711 689325 691769 695010
58977 695010 698953 703746 709817 717095 724758 732384 740671 750333 760931 771624 782397 793636 805015
58964 805015 815763 825634 834775 843103 850577 857478 863547 867427 867963 865515 861047 854490 845104 832958
58950 832958 818891 803432 786868 770022 753791 738215 723097 709166 697504 688106 680154 673358
58938 673358 667834 663004 658006 653086 649249 646604 644292 641994 640196 638963 637771 636759 636793 637917 638854
58923 638854 638473 636827 634485 631774 628990 626549 624637 623334 623134 624518 626950 629185 630748 632366 634931
58908 634931 638836 644345 651614 660206 669468 679559 691164 704040 716816 728600 739900 751589
58896 751589 763699 775730 787567 799659 812628 826979 842930 860373 879153 899192 920043
58885 920043 940674 960185 978349 994901 1008726 1018568 1024178 1026029 1024281 1018889 1010276 998912 984586
58872 984586 967218 948081 928983 910489 892224 874711 859411 846815 835952 826105 817649 810773
58860 810773 804572 798045 791048 783742 775989 767777 759451 751087 742346 733284 724572 716547 708712 700558
58846 700558 692260 684281 676841 669955 663445 656766 649401 641513 633716 626254 619029 612258 606285 600872
58832 600872 595590 590882 587816 586692 586758 587288 588106 589132 590431 592722 596791 602252 607854 613021 618096
58817 618096 623110 627560 631513 635632 639769 642783 644150 644624 644890 644737 644016 643174 642135 639752 635223
58802 635223 629241 623004 616796 610263 603420 596656 590209 584153 578535 573187 567865 562844 558758 555648
58788 555648 552865 550225 548501 548309 549177 550219 551246 552762 555279 558959 563557 568393 572655 575907 578089
58773 578089 579186 579257 578539 576974 573912 568933 562701 556256 549846 543343 537382 532866 529547 526410 523438
58758 523438 521684 521502 522038 522724 524001 526181 528733 531134 533416 535507 537087 538423 540384 543254 546434
58743 546434 549547 552913 556740 560833 565291 570438 575941 581096 586130 591984 598636 604961 610530 616142
58729 616142 622199 627978 633126 638485 644689 651057 656585 661004 664319 666403 667725 669428 672074 675236
58715 675236 678747 683183 688601 693994 698607 702646 706108 708124 708174 706788 704341 700260 694178 686716 678326
58700 678326 668431 656517 643097 628861 613923 598690 584370 571735 560274 549349 539305 530758
58688 530758 523723 518057 513680 509720 504746 498717 493537 490679 489327 487795 485676 483520 481502 479683
58674 479683 478775 479433 481342 483922 487290 491688 496780 502425 509382 518340 528921 540465 552953 566229
58660 566229 579011 589603 597037 600882 600835 597343 591848 585506 578333 570272 562216 555072 548672 542561
58646 542561 537128 533008 529948 527181 524437 521921 519837 518507 518338 519199 520415 521691 523212 524614 525116
58631 525116 525051 525932 528339 530987 532568 533209 533385 532855 531676 530913 531269 532159 533196 535323 539382 544737
58615 544737 550453 556635 563463 570067 575648 580668 585675 589969 592659 594009 594600 594185 592548 590448 588456
58600 588456 585931 582408 578853 576211 573730 570211 566017 562482 560204 559194 559809 562186 565689 570118
58586 570118 576492 585314 595151 604352 613180 622761 632947 642746 651979 660939 669238 676542 683670 691536
58572 691536 699783 707796 716160 725694 736077 746984 759615 775403 794004 814152 835633 858793
58560 858793 882995 907264 931593 955872 978384 997078 1011590 1022308 1028464 1029256 1026123 1021697
58548 1021697 1016840 1010666 1003111 995497 988646 982161 975457 967961 958505 945960 930345 912245 891788
58535 891788 869452 846985 825968 806203 787105 769779 755865 745087 735941 728224 722898 719808
58523 719808 717537 715414 713899 713161 712806 712838 713408 713904 713594 712757 711969 710885 708964 706570 704003 700465
58507 700465 695538 690565 686833 683488 679163 674583 671423 669546 667576 665330 663486 661693 659369 657564
58493 657564 657618 658651 658831 658536 659731 662780 666484 670783 676733 684067 691540 699600 710123 723373 737715
58478 737715 752289 767525 782953 797097 809731 821820 832846 840515 843456 842174 837169 828408
58466 828408 817003 805337 795030 786402 779870 775978 774085 773078 773389 776424 782145 789269 797592 807863
58452 807863 819443 830351 839689 847821 854169 857056 855889 851516 844476 834919 824040 813418 803164
58439 803164 792798 783503 777085 773136 769824 767115 766412 767307 767852 768147 770568 775988 782689 789568 797611
58424 797611 807461 818032 828238 837826 845983 851319 853786 854503 853519 849878 843906 837054 829472 820223
58410 820223 809874 800242 791519 782362 772893 764813 758361 752032 745636 740777 737955 735942 734436 734592
58396 734592 736554 739151 742273 746802 752022 756021 758872 762449 766882 770278 772226 774400 777406 780265
58382 780265 783361 788471 795332 801587 806790 813040 820893 828080 833163 837236 841149 844344 847333 852093
58368 852093 859038 866564 874244 883364 893802 903790 913304 924180 936305 947435 957417 968618 981324
58355 981324 992698 1001329 1008772 1015402 1018994 1018952 1018009 1018031 1017912 1017137 1017611 1020247 1023464 1026812 1032460 1041369
58339 1041369 1051514 1061556 1072847 1086259 1100545 1115267 1131785 1149909 1167135 1182442 1197184
58328 1197184 1211194 1222070 1229527 1236148 1242527 1246048 1245961 1245197 1245575 1245730 1245359 1246756 1250390 1253707 1256218
58313 1256218 1260984 1269175 1278092 1286502 1296795 1309717 1322308 1333491 1346451 1362829 1379783 1395381
58301 1395381 1411622 1429424 1446110 1460784 1476787 1495747 1514674 1531940 1550427 1571467 1591555
58290 1591555 1608752 1626548 1647558 1669061 1688791 1709467 1733404 1758187 1781887 1807048 1835355
58279 1835355 1863886 1890877 1919505 1951758 1984433 2015592 2048905 2087065 2127032 2166563 2209084
58268 2209084 2256993 2306528 2354655 2404671 2459445 2515428 2569230 2623910 2682868 2743633 2803572
58257 2803572 2865481 2931466 2997650 3060999 3125075 3193031 3261698 3328764 3398766 3475578 3556236
58246 3556236 3638757 3728327 3828607 3934661 4041979 4154660 4277161 4406196 4538782 4679819
58236 4679819 4833259 4994362 5159502 5334884 5526556 5730823 5943901 6171474 6418890
58227 6418890 6681814 6957082 7252672 7576140 7923842 8292915 8692792 9132942 9611037
58218 9611037 10125951 10690093 11315459 12000703 12746514 13570148 14489706 15509172 16635964
58209 16635964 17898153 19327360 20942413 22770128 24865513 27293160 30112496 33408811
58201 33408811 37321642 42022187 47691795 54553203 62893992 73024894 85246250 99888519
58193 99888519 117326291 137856948 161536369 188119440 217085383 247710886 279301874
58186 279301874 311483286 343945307 375277146 401788338 417969857 418987249 403415130
58179 403415130 373961982 335834893 294384043 253663362 216158479 183062046 154654157
58172 154654157 130694257 110733984 94252947 80691946 69515328 60281597 52637736
58165 52637736 46274686 40930499 36416473 32595517 29339411 26531709 24093913 21974197
58157 21974197 20117346 18469477 17000028 15692572 14521421 13458548 12493856 11626697
58149 11626697 10844783 10130519 9479796 8895219 8367734 7882855 7438241 7037669 6673542
58140 6673542 6331813 6009004 5709080 5428794 5160962 4907449 4674588 4459768 4255628
58131 4255628 4063180 3887975 3727394 3574192 3428889 3296667 3175589 3059401 2948651
58122 2948651 2847873 2754931 2663986 2576072 2496286 2423180 2350949 2279580 2213215 2151037 2089073
58111 2089073 2028616 1973827 1923280 1872587 1822923 1778369 1737219 1694449 1650639 1610156 1572584
58100 1572584 1534119 1495523 1460663 1428913 1396600 1364254 1335053 1307948 1279645 1251488 1227080
58089 1227080 1204973 1181068 1156533 1135973 1119258 1102375 1084914 1069565 1055375 1038657 1019642
58078 1019642 1001587 984249 964878 944658 927497 913146 897866 881213 865967 852103 837103
58067 837103 821676 809055 799004 788334 776882 767342 759702 751496 742999 736568 731332 724109 715122
58054 715122 707292 700388 691471 680831 671919 665500 659171 652513 647381 643137 636927 628873 621948 616585
58040 616585 610300 602715 596004 590256 583308 575451 569492 565796 561793 556659 551916 547167 539895 530020
58026 530020 520282 511634 502447 492629 484312 477954 471811 465674 461118 457739 453168 447277 442507 439670
58012 439670 437181 434699 433621 433593 432396 429743 427620 426632 425563 424653 425527 427696 428774 428345 427953 427326
57996 427326 424570 420142 416617 414270 410945 406557 403575 402587 401528 399927 399769 401305 402079 401161 400475
57981 400475 400856 400511 398528 396349 394572 391792 387823 384740 383490 382574 381146 380347 380505 380167 379003 378698
57965 378698 379892 381088 381551 382431 384136 385395 385759 386256 386897 386456 385267 385161 386040 385692 383751 382459
57949 382459 382673 382523 381154 380470 381838 384188 386761 390724 396663 403321 410143 418284 427875 437257 446214
57934 446214 456955 470322 483821 495027 504239 512149 517574 519361 518256 515139 509559 501461 492358
57921 492358 483323 473829 463774 454530 446786 439496 432160 425927 421339 417216 413006 409956 408734 408163
57907 408163 407525 407774 409120 409769 408539 406534 404797 402484 398864 395022 391988 389122 385876 383302 382332
57892 382332 382251 382189 382421 383108 383574 383952 385549 388447 390704 391118 390731 390515 389751 387991 386332 385265 383379
57875 383379 379809 375956 373193 370852 368142 366097 365808 366441 366794 367264 368637 370463 372220 374688 378624
57860 378624 383418 388358 393751 399565 404553 408128 411518 415736 419897 422791 424496 425155 423925 420597
57846 420597 416626 413047 408908 403150 396489 390058 383770 377497 372269 368804 366273 363854 361920 360461
57832 360461 358161 354578 351470 350297 350130 349721 349895 351916 354983 357436 359212 361180 363144 364372 365195
57817 365195 366417 367965 369333 370206 369503 365353 357592 348800 341246 334310 326561 318719 312456 307621 302929
57802 302929 298409 295053 292873 291261 290581 291552 293687 296020 298716 302387 306562 310379 314040 318110 322276
57787 322276 326264 331057 337568 344938 351714 357815 363821 369312 373653 377518 381867 386118 389100 391073
57773 391073 393080 394952 395668 395088 393605 390617 385138 377614 369569 361740 353944 346352 339463 333123 326847
57758 326847 320826 315608 311255 307770 305507 304154 302280 299195 296304 295246 295687 296398 297438 299527 302147
57743 302147 304094 305358 306669 307832 308242 308515 309813 311864 313355 313980 314532 315227 315497 315307 315219 315298 315118
57726 315118 314616 313866 312466 310311 308380 307555 307235 306369 305144 304219 303054 300579 297003 293353 289735 285595
57710 285595 281250 277496 274040 269990 265628 262149 259809 257738 255451 253164 250860 248439 246615 246294
57696 246294 247185 248162 248657 248547 247252 244446 241337 239748 240054 241194 242361 243421 244183 244741 246250 249927
57680 249927 255559 262298 270520 281517 295773 313132 334285 360412 391455 426224 464045 504842
57668 504842 547854 591792 635976 679340 717969 745120 754431 742821 711222 664240 609048 552757
57656 552757 499945 452776 412567 379852 353572 331992 314421 300863 290451 281806 274625 269305
57644 269305 265250 261271 257494 255134 254318 253852 253219 253114 253781 254462 254821 255483 256745 258016 258791 259071 258678
57627 258678 257383 255727 254513 253447 251562 248926 246558 244713 242650 240161 237906 236151 234556 233252
57613 233252 232707 232480 231615 230332 229823 230183 230127 229006 227552 226313 224881 223112 221667 220867 220252 219599 219092
57596 219092 218280 216322 213623 211628 210515 208650 205077 201163 198893 198629 199367 200165 200507 200115 199190 198350
57580 198350 197837 197289 196451 195465 194343 192956 191625 190882 190564 189951 188779 187296 185497 183325 181423 180481
57564 180481 179988 178910 177565 177415 178897 180812 182031 182523 182586 182411 182589 183749 185489 186851 187876 189362
57548 189362 191204 192603 193931 196543 200426 203861 205905 207423 209088 210271 210807 212063 215016 218585
57534 218585 221057 222145 222556 222512 221706 220067 217814 215259 212927 211153 209468 207330 205444 205026 205691 205666
57518 205666 204411 203313 203239 203218 202399 201590 201682 202064 201825 201286 201082 200831 199962 198891 198165 197325 195778 194046
57500 194046 193083 192928 192986 192981 192821 192179 191087 190287 190210 190239 189613 188436 187167 185907 184815 184448 185055 186220
57482 186220 187682 189623 191690 192832 192728 192287 192054 191305 189622 188091 187799 188061 187410 185593 183539 182012
57466 182012 181391 182101 184065 186122 187079 187122 187410 188534 190065 191254 191615 191129 190378 190062 190073 189605 188469
57449 188469 187579 187781 188969 190702 192729 194524 195365 195473 196056 197657 199465 200832 202222 203856 204701 203935
57433 203935 202444 201664 201752 201966 202131 202636 203559 204759 206250 207687 208174 207461 206655 206903 208007 209073 209723
57416 209723 209902 209381 208444 208175 209116 210429 211370 212644 215118 218068 220051 220870 221320 221594 221301 220722 220694
57399 220694 221409 222333 223145 223812 224128 224097 224374 225408 226582 227116 227336 228021 229030 229761 230585 232603 236024
57382 236024 239852 243125 245627 247534 249187 251048 253169 254900 255744 256172 256952 258152 259493 261116 263093
57367 263093 264713 265273 265233 265658 266801 268106 269270 270423 271551 272614 273926 275667 277318 278336 278971
57352 278971 279733 280595 281529 283223 286164 289505 291879 292989 293423 293415 292948 292726 293712 295725 297562 298517 298894
57335 298894 299165 299534 300333 301912 304061 306202 308128 309973 311665 313030 314200 315339 316288 317074 318348
57320 318348 320607 323394 325955 328287 330843 333732 336896 340470 344136 346837 348115 349115 351132 353765
57306 353765 355716 356916 358510 361037 363929 366713 369517 372452 375505 378925 382763 386276 388818 391047
57292 391047 394177 398266 402360 406091 409964 414257 418862 424110 430529 437795 445075 452405 460593 469760
57278 469760 479152 488410 497804 507085 515379 522610 529934 538304 547414 556332 564407 571251 576614 580704
57264 580704 584094 587090 589592 591522 592987 594163 595518 597814 601240 604919 608043 611060 614862 619273
57250 619273 623469 627558 632457 638363 644617 651123 658642 667434 676706 685680 694259 702423 709989 717295
57236 717295 725274 734421 744269 754096 763627 772986 782543 792875 804345 816737 829746 843561 858414
57223 858414 873934 889715 906123 923587 941411 958355 974315 990400 1007363 1024833 1042107
57212 1042107 1058831 1074911 1090562 1106443 1123139 1140605 1158658 1177560 1197454 1217778 1238151
57201 1238151 1259245 1281830 1305566 1329940 1355653 1383590 1412961 1442081 1470674 1499741 1529417
57190 1529417 1558788 1587746 1617132 1646762 1675198 1701976 1728431 1755640 1782997 1809517 1835259
57179 1835259 1860783 1886403 1912684 1940671 1970858 2002629 2035144 2068012 2100868 2133284 2165539
57168 2165539 2198587 2232825 2267618 2302230 2336475 2370336 2403827 2437307 2471061 2504564 2537154
57157 2537154 2569396 2602562 2636704 2670463 2703008 2734883 2766692 2798247 2829444 2860836 2892835
57146 2892835 2925326 2958401 2992535 3027788 3063807 3100741 3139004 3177935 3215947 3252460 3288590
57135 3288590 3325589 3363684 3402790 3443150 3484695 3526785 3569123 3612230 3656721 3703020 3752072
57124 3752072 3805523 3864933 3931515 4006567 4091229 4185682 4289469 4402469 4524619 4654922
57114 4654922 4791924 4935265 5085957 5245796 5418056 5608566 5824558 6072309 6356964
57105 6356964 6684271 7061167 7495466 7997534 8583300 9275396 10102588 11100146 12310392
57096 12310392 13780846 15561159 17701372 20249725 23247948 26727725 30711393 35211907
57088 35211907 40227734 45739351 51714523 58116401 64906677 72047975 79502408 87196585
57080 87196585 94936168 102325437 108790621 113733405 116715803 117549390 116263064 113025479
57072 113025479 108093430 101788859 94475404 86526152 78293559 70087367 62159718 54699205
57064 54699205 47834127 41639240 36142120 31331804 27170701 23604775 20569525 17995728
57056 17995728 15816731 13972828 12410527 11081404 9943721 8963622 8113316 7369298
57048 7369298 6712917 6130603 5611748 5146959 4728662 4351682 4012002 3705798 3430105
57039 3430105 3183071 2962874 2767636 2596852 2451499 2331938 2236665 2163298 2109371 2071910
57029 2071910 2047997 2035951 2033249 2031499 2015522 1970482 1890855 1782557 1657785 1528785 1404703
57018 1404703 1290863 1189180 1099462 1020900 952649 893535 841918 796115 755051 718538 686683
57007 686683 658832 633460 609553 587613 568495 551575 535009 517732 500322 483944 469318
56996 469318 456661 445658 435328 424798 414414 405465 398806 394448 392353 392707 395317 399656 405570
56983 405570 413162 421912 430589 437897 442342 441733 434153 419832 401228 381040 360852 341623 324378
56970 324378 309942 298593 290236 284490 280849 279489 281688 288469 299021 311449 324951 340089 356978
56957 356978 374611 392211 409773 426501 439588 445366 441423 427674 406211 380430 353585 327752
56945 327752 304266 284562 269616 258823 250748 245189 243480 246593 254048 265009 279452 297733
56933 297733 319701 344618 371432 398946 426096 451695 473106 485649 484815 469562 442796 408865
56921 408865 371625 334473 300208 270003 243568 220831 202494 188590 177677 168088 159167 150898
56909 150898 143267 136467 130834 126146 121763 117799 115235 114518 114917 115679 116921 119000 121920 125800 131087
56894 131087 137860 145768 155026 166627 181148 198168 217147 237982 260381 283646 307365 331081
56882 331081 352739 368655 375926 374244 365047 350162 332057 314121 299212 288213 280821 277243
56870 277243 278345 284666 296232 313113 335517 363537 397311 437077 482533 532344 584740 638367
56858 638367 692142 744069 790043 823717 838323 830083 800651 756148 703953 650581 601455 560558
56846 560558 529470 507708 494644 490651 496502 512811 540370 579982 631475 693603 764993 844131
56834 844131 928440 1014813 1101218 1185644 1262149 1319357 1344891 1331870 1281689 1202487 1106087
56823 1106087 1004675 907589 819898 743787 680530 630843 594536 571105 560405 562167 575509
56812 575509 599672 634561 679624 732602 790230 849943 910198 969125 1022813 1064357 1084723
56801 1084723 1076322 1037531 974033 895556 811519 729221 653950 588851 534794 491290 457600
56790 457600 432899 416267 407293 406140 412567 425555 444269 468343 496559 526421 556010 585093
56778 585093 612923 635559 646933 642648 622123 587836 543929 495281 446306 399786 357026 318826
56766 318826 285686 257387 233263 212896 196000 181868 169620 158920 149912 142528 136376 131130
56754 131130 126589 122443 118366 114229 110028 105873 102177 99452 97727 96615 96002 96018 96210 95684 94376
56739 94376 93294 93036 92980 92479 91886 91663 91384 90526 89527 89165 89442 89921 90558 91469 92428 93336 94598 96316
56721 96316 97772 98475 99028 100104 101273 101797 102017 102873 104496 106236 107695 108826 109418 109450 109675 110968 113238
56704 113238 115622 117494 118695 119200 119193 119094 118997 118556 117836 117548 117904 118091 117597 117122 117344 117726 117567 117339 117799
56685 117799 118589 118935 119059 119574 120095 119776 118693 117435 115840 113587 111555 111086 112069 113148 113619 113840 113925
56668 113925 113526 112928 113071 114299 116114 118174 120495 122769 124536 125994 127593 128930 129167 128470 127896 127879
56652 127879 127935 127882 128138 128714 129070 129197 129816 131229 132866 134159 135065 135558 135446 134896 134494 134575 135041 135759 136607
56633 136607 137281 137684 138267 139306 140154 139920 138584 136703 134492 132101 130263 129562 129398 128803 127945 127635 127707
56616 127707 127217 126079 125180 124862 124565 124000 123455 122955 122275 121854 122418 123552 123862 122791 121256 120289 120028
56599 120028 120199 120629 121133 121747 123032 125318 127810 129447 130382 131489 132652 132942 132355 131958 132279 132881 133577
56582 133577 134614 135557 135512 134714 134484 135369 136712 138265 140660 143838 146578 148255 149711 151731 153953 156010
56566 156010 158527 162200 166796 171722 176684 181355 185372 189138 193598 198746 203388 206693 208868 209982
56552 209982 209517 207646 205592 204033 202374 200259 198419 197199 195559 192648 189293 186834 185366 184129
56538 184129 182765 181184 179013 176243 173784 172438 171876 171399 171034 171082 171303 171431 171860 172937 174209 175140
56522 175140 175978 177010 177620 177039 175556 174120 173171 172716 173047 174362 175981 176864 176848 176637 176720 176942 176991 176716
56504 176716 176069 175176 174364 173782 173242 172696 172461 172625 172661 172103 171227 170580 170173 169620 168825 168040 167427 166963 166670
56485 166670 166652 166974 167592 168270 168604 168473 168381 168918 169903 170553 170510 170153 169899 169819 169936 170279 170545 170365 169965 169954
56465 169954 170445 171036 171628 172506 173563 174212 174159 173572 172543 171210 170287 170499 171456 172045 171945 171807 172003 172339
56447 172339 172945 174170 175521 176080 176135 176947 178646 179946 180352 181003 182644 184315 184988 185098 185487 186084 186641
56430 186641 187594 189162 190635 191609 192860 194873 196550 196587 195368 194309 194002 194069 194247 194534 194736 194772 194975
56413 194975 195356 195246 194402 193755 194164 195125 195669 195936 196857 198678 200752 202496 203791 204670 205257 205746 206108
56396 206108 206239 206661 208341 211341 214392 216381 217559 218767 220228 221708 223137 224434 225355 226068 227193
56381 227193 228815 230227 231062 231808 232713 233201 232990 232781 233023 232962 231763 229816 228135 227172 226905 227332 228200
56364 228200 228936 229426 230162 231206 231948 232296 232950 233989 234431 233925 233626 234553 236246 237881 239496 241228 242553
56347 242553 243305 244338 246159 247968 248993 249631 250395 250993 251485 252981 256002 259376 262011 264468 267494
56332 267494 270385 272353 274262 277274 280780 283393 285146 287078 289392 291643 294067 297131 300292 302603
56318 302603 304027 304962 305225 304765 304565 305495 307062 308550 310416 313182 315973 317823 319525 322481 326491
56303 326491 330385 334094 338304 342653 346118 348831 351900 355740 360012 364711 369921 375051 379721 384794
56289 384794 391111 397922 404101 410159 417398 425729 434058 442286 451267 461264 472098 484247 498139
56276 498139 512850 527176 541555 557329 574635 592659 611547 632347 655432 680469 707467
56265 707467 736511 767198 799904 836726 879448 927417 979394 1036714 1102457 1178072 1262945
56254 1262945 1356876 1460748 1574943 1699106 1833350 1977876 2131557 2292547 2459789 2632166
56244 2632166 2806585 2978709 3145017 3302335 3446057 3571055 3673911 3752392 3803551 3824807
56234 3824807 3816414 3780511 3718248 3630417 3520519 3394377 3256521 3109256 2955141 2797821
56224 2797821 2640220 2484314 2332783 2188505 2052225 1922993 1801046 1687957 1583915
56215 1583915 1487384 1397815 1316227 1242678 1175499 1113543 1057064 1005899 958936 915867 877436
56204 877436 843482 812648 784380 759346 737584 718142 700683 685523 672014 658925 646478
56193 646478 635913 627056 618539 610408 604098 599700 595642 591304 587515 584221 580161 575269 571039 568035
56179 568035 565286 562521 560745 560250 560277 560914 563098 566545 569967 573444 578178 583851 588827 593118 598444
56164 598444 605162 611858 618275 625882 635209 645357 656444 669642 684549 699518 715025 733638
56152 733638 756198 781199 808520 840544 878847 922937 973141 1031538 1099158 1175312 1260528
56141 1260528 1356919 1464627 1580918 1703433 1830894 1959582 2082629 2194206 2291614 2372863
56131 2372863 2436383 2484651 2524306 2560485 2593566 2622109 2645031 2659479 2660789 2647147 2621493
56120 2621493 2587284 2545617 2497583 2445073 2386760 2317004 2231470 2131115 2019174 1898206 1772526
56109 1772526 1649610 1535739 1432781 1341318 1263528 1200355 1149105 1106718 1072643 1046128 1023932
56098 1023932 1003660 986544 974250 965616 958976 954695 952854 951425 949412 948949 951619 955579 958862
56085 958862 962548 967979 973866 978934 984585 992162 1000343 1007807 1015633 1024604 1033213 1040795 1049398 1060091
56071 1060091 1070793 1080309 1090887 1104031 1117602 1130048 1143584 1159927 1176752 1191916 1207381
56060 1207381 1225209 1243347 1259275 1274328 1290550 1306667 1321090 1335446 1351232 1366407 1379235
56049 1379235 1392094 1407540 1424123 1440095 1457524 1478467 1500755 1521993 1544121 1569508 1596182
56038 1596182 1621526 1647139 1675327 1704415 1732345 1761330 1794057 1828786 1863114 1898971 1938914
56027 1938914 1981044 2022602 2064975 2110213 2156404 2201568 2248149 2298527 2350268 2401113 2454253
56016 2454253 2513038 2574999 2636954 2701369 2771564 2845347 2919837 2997789 3082522 3171390 3261130
56005 3261130 3354739 3456018 3562427 3670713 3784327 3907502 4037258 4169258 4306267 4452756
55995 4452756 4606855 4766134 4935237 5118757 5312830 5513391 5726190 5958412 6207097
55986 6207097 6466951 6742943 7043544 7368235 7713979 8087380 8497585 8943829 9423255
55977 9423255 9944192 10518086 11145951 11827605 12576505 13410120 14334336 15354536 16493768
55968 16493768 17782813 19242728 20897638 22796082 25000968 27572298 30585665 34158962
55960 34158962 38439962 43585957 49786995 57293960 66391131 77359570 90501966 106164435
55952 106164435 124645651 146043394 170179982 196622497 224750898 253940539 283816588
55945 283816588 314122162 343797690 369857907 387483367 391961337 381220251 356917513
55938 356917513 323376571 285533514 247426509 211714725 179808894 152183827 128737074
55931 128737074 109104266 92825199 79393379 68308122 59141129 51546439 45224976
55924 45224976 39918973 35434621 31632213 28389678 25596568 23174270 21071199 19236595
55916 19236595 17618964 16185079 14917009 13791177 12778814 11863757 11040689 10297706
55908 10297706 9617662 8994060 8428590 7914744 7439501 6999170 6598057 6232849 5892929
55899 5892929 5575098 5283956 5018371 4770753 4539214 4327845 4135204 3954374 3784326
55890 3784326 3629954 3490862 3360756 3237904 3125939 3024207 2926896 2831753 2740544 2651210
55880 2651210 2558785 2464127 2373116 2287321 2203691 2122976 2049728 1983827 1920205 1857232 1797724
55869 1797724 1741773 1686344 1632162 1583477 1540633 1499813 1460120 1423983 1390658 1356400 1321157
55858 1321157 1288352 1258068 1227240 1196429 1169404 1145863 1121506 1095639 1071824 1050452 1027542
55847 1027542 1001812 976386 952461 927621 901642 877846 857297 837307 816982 798775 783273
55836 783273 767767 751326 736228 723167 709956 696167 684259 674934 665979 656724 649075 643147
55824 643147 636437 628267 620679 614056 606248 596789 587580 578684 567965 555638 544661 535804 526896
55811 526896 517728 510941 507012 503164 498550 495883 496464 498107 499607 502829 508617 514794 520092 526086
55797 526086 533327 539351 542447 543829 544318 542460 537815 532629 528226 522935 515529 507709 501273 495626
55783 495626 489788 484139 478648 472123 464845 459387 457500 458664 462632 470449 481795 494385 507262
55770 507262 521483 535938 545516 545391 534923 516259 492010 465730 441555 421153 402987 385850
55758 385850 370734 358058 345995 333257 320993 310240 299954 289338 279814 272888 268022 264136
55746 264136 261235 259279 257516 256228 256987 259932 262943 264660 265991 267414 267355 264775 260992 257353 253341
55731 253341 248622 244670 242571 241235 239430 237599 236022 233267 228426 223111 219411 217380 216083 215585
55717 215585 216362 218230 221216 226056 232621 239430 245728 252199 258554 262522 262637 260070 256379 251497 245471
55702 245471 240023 236353 233092 228336 222230 215871 209191 201757 194328 187902 182383 177656 174630 173730
55688 173730 173594 172796 171708 171325 171539 171922 172982 175250 178278 181633 185702 190437 194735 198046 201029
55673 201029 203570 204022 201722 198510 196241 194504 192284 190081 188598 187028 184590 182326 181472 181405 181138
55658 181138 181514 183876 187621 191084 193936 196838 199605 201587 203126 204898 206468 207040 206948 206847 206257 204430
55642 204430 201905 199629 197257 193792 189217 184102 178414 172165 166417 162046 158213 153633 148716 144876
55628 144876 142266 139779 136952 134413 132673 131654 131215 131116 130794 129983 129107 128435 127548 126239 124934 123495
55612 123495 120905 117111 113894 112682 112694 112493 112084 112019 111682 110270 108499 107556 107027 105587 103197 101087
55596 101087 100034 99968 100760 102049 102835 102514 101803 101564 101485 101016 100714 101306 102286 102797 103084 103746 104485 105066 106569
55577 106569 109960 114247 117660 119964 121950 123506 124073 124445 126124 129163 132326 134956 137084 138106 137188
55562 137188 134790 132154 129508 126314 122944 120391 118569 116591 114543 113257 112528 111336 109833 109264 109734
55547 109734 109741 108349 106342 104847 104101 103949 104343 104953 105322 105635 106479 107747 108708 109147 109461 109662 109314 108422
55529 108422 107404 106244 104682 103153 102515 102841 103399 103728 103789 103318 102077 100577 99490 98431 96402 93353
55513 93353 90266 87780 85689 83677 81687 79651 77721 76513 76334 76474 76072 75174 74096 72550 70562
55498 70562 69468 70469 72750 74589 75800 77364 79079 79573 78684 77908 78096 78350 77652 76226 74832 73880
55482 73880 73587 73948 74370 74361 74614 76264 79049 81492 82896 83886 84914 85645 86023 86535 87041 86651 85142 83356
55464 83356 81861 80379 78809 77689 77255 77177 77477 78585 80169 81127 81160 81183 81713 81994 81271 79934 78781
55447 78781 78065 77784 78108 79004 80042 80979 81923 82767 83163 83208 83390 83779 84063 84367 85083 85864 85875 85171 84676
55428 84676 84631 84288 83460 83110 83856 84957 85487 85593 85955 86759 87787 88872 89780 90242 90540 91474 93316 95327
55410 95327 96572 96763 96096 94808 93071 90927 88328 85610 83634 82842 82548 81988 81604 82220 83383 83853
55394 83853 83526 83423 83803 83785 83023 82293 82121 82192 82428 83235 84302 84560 83854 83342 83669 84005 83535 82658 82050
55375 82050 81716 81710 82668 84827 87363 89336 90423 90369 88922 86801 85485 85368 85307 84607 84047 84176 84049 82902
55357 82902 81766 82023 83311 84242 84448 84545 84667 84376 83690 83057 82557 82099 82010 82504 82891 82308 81050 80274 80502
55338 80502 81141 81390 81081 80664 80763 81553 82377 82436 82009 82230 83327 84034 83393 82189 81626 81352 79995 77327
55320 77327 74783 73841 74632 76083 76880 76418 75317 74868 75696 77258 78779 80026 80824 80670 79571 78598 78768
55303 78768 79816 80799 81443 82107 82884 83600 84405 85524 86611 87107 87035 86809 86497 85920 85296 85055 85208 85452
55285 85452 85763 86223 86487 86059 85051 84062 83381 82829 82293 81883 81634 81500 81589 82013 82576 82990 83245 83490 83730
55266 83730 83992 84516 85305 85781 85404 84505 83920 83821 83429 82037 79960 78290 77870 78645 79916 81095 82089 83002
55248 83002 83745 84173 84339 84273 83760 82808 82076 82211 82889 83176 82765 82137 81645 81242 81100 81465 81853 81411 80357
55229 80357 80024 81085 82716 83922 84621 84943 84616 83797 83487 84206 85063 85054 84482 84152 83903 83059 81801 80952
55211 80952 80688 80513 80310 80484 81150 81948 82609 83079 83212 82903 82466 82369 82719 83285 83814 84029 83742 83218 82999
55192 82999 83123 83120 83032 83592 84863 85643 84971 83500 82494 82149 81805 81230 80731 80455 80538 81512 83580 85797 86888
55173 86888 86677 85974 85423 85256 85701 86661 87283 86845 85875 85500 85933 86499 86911 87515 88395 89263 90166 91375 92527
55154 92527 92839 92272 91668 91582 91713 91651 91473 91418 91504 91681 91980 92385 92841 93300 93547 93233 92409 91635 91223 90862
55134 90862 90443 90578 91601 92695 92953 92749 93026 93652 93683 93026 92613 92869 93160 92969 92660 92810 93491 94426 95276
55115 95276 95713 95786 96119 97141 98288 98686 98401 98173 98145 97836 97276 97124 97618 98417 99543 101371 103411 104202
55097 104202 102962 100627 98798 98298 99011 100442 101958 103067 103857 104809 105955 106683 106589 106019 105520 105179 104704
55080 104704 103829 102523 101125 100275 100369 101078 101781 102338 102969 103595 103928 104111 104655 105709 106899 107777 107936 106997
55062 106997 105188 103698 103586 104486 105196 105376 105711 106493 107189 107507 107767 107981 107577 106367 104900 103526 102070
55045 102070 100722 100234 100660 100877 100057 98861 98462 98995 99669 99984 100109 100316 100595 100682 100173 98843 97058 95548
55027 95548 94629 94016 93549 93560 94303 95455 96428 96829 96489 95551 94632 94391 94801 95362 96037 97296 99131 100811
55009 100811 101864 102524 102938 102805 102269 102335 103717 105813 107424 108013 107725 106743 105339 104181 103879 104352 105114
54992 105114 105943 106829 107527 107674 107267 106675 106226 106047 106151 106498 107071 108006 109409 111000 112207 112731 112759 112642
54974 112642 112712 113331 114517 115509 115356 114139 113009 112794 113169 113393 113185 112572 111651 110976 111474 113323 115409
54957 115409 116508 116598 116530 116871 117667 118841 120102 120785 120535 119987 120132 121115 122202 122812 122962 122776 122177 121229
54939 121229 120260 119481 118819 118237 117904 117899 118046 118245 118775 120028 121991 124268 126683 129624 133527 138159 142806
54922 142806 147233 151988 157522 163425 168890 173537 177269 179685 180251 178872 175749 170947 164740 158136
54908 158136 152209 147056 142156 137635 134198 131830 129612 127091 124891 123596 122907 122273 121578 120814 119857
54893 119857 118983 118883 119726 120908 122071 123490 125110 126220 126755 127901 130534 133890 136806 139586 143467
54878 143467 148727 154427 159820 164885 169508 173128 175385 176406 176329 175079 172665 169206 164686 159163 153194
54863 153194 147628 142959 139187 136152 133595 131095 128442 125938 123972 122459 121142 120166 119782 119652 119100
54848 119100 118091 117369 117435 117820 117583 116270 114238 112232 110807 110093 110002 110485 111382 112131 111987 110723 108811
54831 108811 106864 105220 104149 103970 104688 105900 107350 109190 111403 113388 114473 114525 113766 112407 110834
54816 110834 109735 109555 110039 110637 111079 111243 110930 110169 109468 109348 109925 111174 113112 115362 117045 117642 117571
54799 117571 117481 117419 117195 116976 116926 116759 116355 116259 116788 117134 116397 115170 114998 116288 117857 118662 118986 119589 120605
54780 120605 121756 123071 124886 127417 130614 134130 137346 139871 142169 145273 149661 154816 160087 165517
54766 165517 171474 177794 183706 188476 191814 193726 194263 193469 191369 187911 183089 177280 171345 166066 161393
54751 161393 156589 151357 146448 142758 140128 137690 135209 133255 132007 130798 129173 127640 126903 126989 127619
54736 127619 128819 130617 132620 134425 136013 137328 138055 138411 139562 142444 146576 150726 154443 158231 162538
54721 162538 167261 171966 175976 178474 179204 178802 177873 176083 172851 168561 164249 160303 156257 151704 146729
54706 146729 141673 137172 134105 132674 131800 130345 128691 128051 128440 128544 127670 126550 125868 125139 123671 121715
54690 121715 119953 118480 116984 115556 114734 114864 115748 116788 117349 117212 116752 116499 116577 116850 117369 118158 118725
54673 118725 118450 117382 116092 114797 113364 112102 111684 112125 112632 112761 112945 113543 114115 114129 113830 113862 114447 115361
54655 115361 116353 117192 117625 117708 117939 118719 119860 120817 121221 120951 119981 118466 116915 116087 116573 118297 120318
54638 120318 121419 121226 120506 120028 119537 118419 117017 116342 116595 116963 117062 117621 119336 121766 123853 124934 124837
54621 124837 123658 122073 121319 122108 123670 124446 123718 122220 121225 121370 122368 123548 124436 124808 124434 123215 121673
54604 121673 120807 120969 121233 120468 118833 117526 117271 117785 118624 119663 120620 121062 121175 121744 122966 124019 124167
54587 124167 123632 122961 122168 121081 119976 119248 118812 118363 117905 117637 117604 117861 118600 119674 120323 119869 118542 117248
54569 117248 116685 116936 117663 118429 119014 119653 120688 121848 122278 121554 120277 119368 119126 119309 119755 120495 121522
54552 121522 122821 124410 126048 127157 127377 127033 126744 126825 127297 128212 129587 131251 133110 135303 137802 140026
54536 140026 141255 141325 140625 139507 138026 136200 134277 132656 131650 131277 131279 131415 131721 132314 133016 133409 133295
54519 133295 132861 132404 132126 132145 132378 132496 132298 132005 131780 131189 129755 127927 126680 126159 125559 124541 123850 124150
54501 124150 125041 125733 126001 125865 125005 123282 121411 120397 120481 121202 122256 123729 125600 127517 129000 129705
54485 129705 129658 129442 129781 130712 131534 131844 132092 132756 133492 133662 133367 133349 134062 135272 136424 137047 137046 136870 137093
54466 137093 137632 137791 137379 137199 137961 139263 140256 140842 141493 142221 142458 141792 140166 137629 134538 131853 130454
54449 130454 130189 130162 129955 129948 130452 131132 131468 131332 130981 130808 131113 131824 132427 132458 132052 131775 132013 132724 133679 134642
54429 134642 135465 136207 137031 137812 138148 137966 137743 137864 138202 138611 139290 140112 140200 138933 137006 135717 135420 135507
54411 135507 135707 136478 138095 140190 142343 144431 146174 147018 146763 145898 145124 144854 145198 145995 146808 147363 148031
54394 148031 149374 151129 152205 151910 150759 149842 149735 150197 150603 150456 149745 148982 148744 149102 149639 149997 150153
54377 150153 150233 150327 150497 150731 150932 151192 151895 153250 154866 156194 157234 158411 159869 161387 162928 164710
54361 164710 166724 168695 170649 173039 176160 179784 183472 186875 189674 191637 192871 193707 194232 194228 193585 192404
54345 192404 190668 188242 185267 182145 179035 175737 172220 168829 165873 163340 161194 159501 158103 156550
54331 156550 154655 152824 151525 150711 150013 149286 148709 148508 148785 149492 150333 150850 150822 150530 150423 150549 150509 149955
54313 149955 149017 148123 147472 146815 145784 144331 142696 141047 139444 138124 137513 137778 138605 139563 140431 141125 141623
54296 141623 142180 143168 144488 145490 145802 145830 146053 146314 146359 146675 148013 150250 152415 153857 154770 155552 156236
54279 156236 156654 156693 156265 155459 154763 154721 155249 155656 155360 154342 152997 151955 151925 153179 155114 156727 157555 157836
54261 157836 157907 157925 158110 158685 159521 160313 161125 162292 163760 165041 165828 166193 166163 165634 164770 163976 163374 162751 162010
54242 162010 161245 160377 159276 158196 157527 157148 156673 156235 156280 156624 156602 156267 156421 157215 157734 157456 157142 157546 158108
54223 158108 157808 156745 155909 155725 155660 155161 154285 153477 153206 153737 154802 155659 155848 155704 155771 155975 155824 155192 154386
54204 154386 153603 152865 152385 152453 152943 153332 153272 152863 152357 151945 151789 151971 152326 152575 152651 152735 152922 153053 152921 152529
54184 152529 152118 151978 152253 152884 153713 154513 154911 154511 153406 152383 152218 152739 152995 152430 151497 150950 150994 151348
54166 151348 151825 152430 153055 153380 153130 152391 151687 151617 152244 152961 153217 153141 153124 153064 152641 152119 152115 152629 153169 153863 155467
54145 155467 157943 160003 160642 160324 160070 160095 160052 159966 160092 160315 160479 160863 161605 162042 161467 160279 159567 159738 160359
54126 160359 161134 162160 163251 163893 164007 164066 164292 164373 164130 163920 164196 165136 166748 168815 170635 171412 171199 170991
54108 170991 171636 172945 174046 174314 173796 173038 172648 172801 173067 172932 172451 172110 172100 172088 171718 170956 169898 168729
54090 168729 167949 168224 169725 171962 174471 177361 180897 184836 188540 191713 194723 198255 202840 208707 215804
54075 215804 223751 231740 238764 244226 248316 251473 253320 252553 248227 241004 232727 224832 217538 210463
54061 210463 203547 197235 192124 188657 186941 186611 186962 187376 187661 188050 188896 190310 192041 193814 195827 198627
54045 198627 202293 206092 209336 212370 216191 221130 226386 230971 234681 238007 241560 245764 250807 256487
54031 256487 262210 267390 271863 275835 279498 282738 285199 286634 287242 287552 287919 288293 288676 289499 291120 293049
54015 293049 294187 293944 292798 291626 290920 290691 290685 290331 288907 286212 282906 279739 276505 272240 266538 260260
53999 260260 254678 250117 245781 240905 235700 230918 226771 222719 218397 214325 211303 209401 207933 206365
53985 206365 204766 203327 201952 200584 199550 199169 199203 199082 198613 198051 197505 196704 195535 194424 193872 193810 193774
53968 193774 193613 193691 194411 195847 197838 200038 201816 202551 202311 201905 201905 201978 201572 200926 200809 201455 202435 203574
53950 203574 205275 207767 210726 213946 217732 222181 226605 230302 233568 237341 241961 246843 251347 255567
53936 255567 260156 265752 272601 280516 289186 298636 309218 320921 332892 344105 354501 365009 376239
53923 376239 387301 396122 400884 401201 398097 393088 387420 382091 378192 376689 377756 380562 383811 386415
53909 386415 387760 387866 387396 387035 386610 385225 382496 379170 376115 373194 369696 365566 361506 357957 354529
53894 354529 350486 345405 339370 332859 326440 320331 314277 307999 301534 294933 288008 280845 274239 269074
53880 269074 265326 262124 258701 254908 250943 247054 243425 239960 236336 232603 229480 227549 226408 225136
53866 225136 223375 221336 219069 216485 213898 211725 209720 207353 204895 203163 202172 201093 199783 199204 199831
53851 199831 200652 200478 199438 198378 197525 196597 195784 195620 196112 196797 197522 198477 199476 199933 199631 199018 198692 198991
53833 198991 200075 201861 203760 204924 205013 204561 204406 204907 205765 206445 206694 206691 206739 206882 206966 207042 207423 208261 209346
53814 209346 210490 211835 213544 215516 217773 220875 225415 231092 236712 241322 245131 249182 254272 260241
53800 260241 266192 271227 275061 278059 280790 283532 286150 288380 290219 291965 293802 295394 296184 296171 296050
53785 296050 296254 296194 294894 292184 288734 285038 281054 276862 272929 269423 265887 261972 258001 254429 251244
53770 251244 248291 245651 243188 240213 236259 231876 228001 224797 221841 219217 217555 216911 216383 215089 213008
53755 213008 210688 208678 207447 207192 207344 206751 204939 202885 202061 202839 204261 205290 205800 206302 207148 208220
53739 208220 209210 209899 210232 210286 210180 210006 209820 209721 209837 210180 210541 210697 210748 211149 212319 214282 216775 219558
53721 219558 222423 224922 226426 226620 225881 225016 224662 225002 225934 227348 229254 231698 234551 237386 239725 241513
53705 241513 243246 245470 248267 251390 254779 258579 262609 266202 268867 270932 273186 275888 278480 280369
53691 280369 281652 282808 283925 284637 284729 284389 283794 282852 281570 280355 279637 279378 279190 278777 278045 276970 275687
53674 275687 274628 274279 274738 275672 276620 277205 277268 276995 276761 276647 276319 275655 275114 275024 274814 273632 271590 269694
53656 269694 268536 267807 267226 267135 267771 268588 268845 268472 267965 267771 268188 269452 271386 273275 274608 275814 277724
53639 277724 280394 282969 284724 285856 287144 289134 291738 294375 296394 297491 297859 297974 298344 299400 301354
53624 301354 303967 306654 309059 311452 314403 318151 322410 326653 330459 333815 337248 341520 346947 353065
53610 353065 359085 364597 369759 375011 380768 387162 393898 400442 406454 411854 416423 419662 421265 421465
53596 421465 420679 419080 416724 413855 410776 407660 404672 402026 399608 396921 393761 390654 388184 386158
53582 386158 383963 381504 379194 377102 374807 372207 369830 368059 366517 364566 362173 359944 358451 357775
53568 357775 357668 357927 358496 359239 359700 359373 358307 357262 356965 357304 357521 357198 356785 357089 358387 360184 361734
53551 361734 362775 363722 365077 366747 368112 368855 369428 370559 372513 375019 377717 380477 383443 386962 391322
53536 391322 396437 401959 407806 414186 420997 427731 434369 441862 451081 461647 472414 482894 493541
53523 493541 504807 516684 529191 542554 556755 571530 586994 603657 621597 640220 659193
53512 659193 679080 700594 723567 747071 770397 793553 816952 840845 865023 888921 912080
53501 912080 934487 956306 977362 997250 1016003 1034165 1052115 1069691 1086693 1103371 1120126
53490 1120126 1137023 1153900 1170732 1187607 1204577 1221792 1239581 1258031 1276543 1294113 1310129
53479 1310129 1324823 1338911 1352834 1366271 1378349 1388368 1396221 1401979 1405287 1405539 1402652 1397216 1389767
53466 1389767 1380301 1368654 1355064 1340142 1324568 1308940 1293576 1278220 1262219 1245304 1227931
53455 1227931 1210635 1193266 1175190 1156025 1135989 1115705 1095887 1077001 1058937 1041196 1023575
53444 1023575 1006488 990426 975425 961385 948629 937737 929041 922631 918580 916677 916076 915822 915777
53431 915777 916565 918562 921432 924781 928830 934120 940834 948733 957661 967893 979944 994100 1010102
53418 1010102 1027370 1045641 1065239 1086587 1109547 1133517 1158119 1183486 1209961 1237815 1267289
53407 1267289 1298538 1331452 1365817 1401714 1439431 1478918 1519763 1561892 1605890 1652279 1700830
53396 1700830 1750922 1802294 1854931 1908393 1961826 2014740 2067334 2119951 2172528 2224705 2276121
53385 2276121 2326335 2374651 2420332 2463017 2502846 2540145 2574958 2606781 2634768 2658359 2677643
53374 2677643 2692884 2703744 2709328 2709120 2703454 2692803 2676888 2654944 2626749 2592984 2554531 2511833
53362 2511833 2465092 2414899 2362403 2308928 2255458 2202423 2149905 2098005 2046978 1997052 1948292
53351 1948292 1900794 1854882 1810966 1769266 1729717 1691835 1654504 1616326 1576764 1536869 1498342
53340 1498342 1461924 1427213 1394043 1363289 1335949 1311987 1290446 1270333 1251114 1232870 1216412
53329 1216412 1202791 1192087 1182887 1173505 1163525 1153665 1144361 1135111 1125171 1114321 1102938 1091848 1082159
53316 1082159 1074679 1069260 1065019 1061303 1058200 1056180 1055723 1057289 1061074 1066590 1072909 1079530 1086704 1094881
53302 1094881 1104238 1114913 1127147 1140979 1156216 1172976 1191816 1213007 1236098 1260533 1286271
53291 1286271 1313333 1341164 1369043 1396812 1424451 1451020 1474811 1494802 1511525 1526254 1539682
53280 1539682 1551584 1561346 1568436 1572493 1573358 1571134 1566149 1558835 1549573 1538473 1525272 1509618 1491576
53267 1491576 1471725 1450645 1428399 1404676 1379390 1352919 1325757 1298152 1270172 1241970 1213754
53256 1213754 1185525 1157091 1128380 1099676 1071471 1044204 1018121 993191 969046 945182 921426
53245 921426 898062 875334 852963 830486 807994 786202 765723 746563 728409 711140 694819
53234 694819 679439 664990 651723 640060 630170 621774 614401 607731 601572 595611 589395 582562 575015
53221 575015 566728 557521 547209 535953 524222 512322 500142 487453 474314 461153 448631 437477
53209 437477 428071 420057 412648 405546 399196 393846 388804 383132 376762 370271 363839 357220 350650 344863
53195 344863 339953 335042 329516 323977 319425 316050 313338 310921 308669 306247 303310 300067 297045 294268
53181 294268 291220 287739 284520 282495 281910 282145 282236 281503 279866 277749 275663 273851 272286 270849 269337
53166 269337 267467 265160 262853 261275 260788 261071 261529 261911 262401 263105 263626 263349 262209 260942 260337 260317 260088
53149 260088 259224 258230 257820 257914 257687 256559 254916 253809 254027 255380 256825 257301 256513 254967 253378 252218
53133 252218 251674 251685 251993 252462 253445 255460 258345 261096 262815 263570 264037 264557 264914 264852 264446 263949 263525 263139
53115 263139 262560 261566 260263 259073 258219 257419 256282 254883 253685 253011 252785 252706 252477 251974 251340 250785 250159
53098 250159 248960 247026 245001 243777 243580 243901 244227 244501 244965 245846 247153 248526 249367 249419 249157 249331 250119
53081 250119 251016 251503 251528 251354 251247 251363 251620 251618 250874 249228 246904 244300 241914 240298 239688 239657 239460 238829
53063 238829 238122 237643 237170 236354 235324 234637 234688 235372 236297 237201 238067 238864 239343 239343 239207 239472 239995 239831 238384
53044 238384 236332 234900 234420 234210 233795 233550 233954 234817 235536 235787 235699 235659 236113 237259 238693 239648 239785 239518
53026 239518 239422 239635 240072 240895 242348 244265 246056 247177 247437 246951 246020 244977 244010 243150 242473 242147 242137 242097
53008 242097 241766 241339 241192 241343 241396 241025 240346 239839 239980 240880 242112 242958 243028 242616 242363 242606 243169 243734 244225
52989 244225 244870 245940 247433 248954 250040 250707 251540 252967 254619 255768 256390 257355 259312 261763 263651
52974 263651 264687 265592 266991 268564 269599 270047 270587 271720 273166 274228 274470 273948 273008 272042 271304 270794
52958 270794 270301 269558 268335 266478 264043 261378 258942 257068 255985 255803 256130 255934 254383 251901 249838
52943 249838 248963 248844 248860 249028 249409 249475 248859 248212 248412 249214 249540 248946 247918 246828 245572 244376 243974 244585
52925 244585 245436 245759 245681 245770 246187 246721 247207 247600 248028 248972 250804 252898 253907 253403 252567 252637 253276 253262 252202
52906 252202 250676 249009 247038 245077 244069 244430 245468 246304 246782 247117 247205 246817 246176 245870 246247 247169 248308
52889 248308 249469 250618 251730 252651 253091 252790 251690 249979 248090 246620 245984 245990 246022 245926 246411 248136 250619
52872 250619 252549 253198 253041 253009 253631 255023 257153 259793 262476 264791 266544 267591 267789 267229 266181 264724
52856 264724 262789 260639 258850 257529 255989 253578 250507 247469 244778 242328 240196 238720 238027 237867 237880
52841 237880 237687 236887 235433 233993 233451 233959 234785 235150 234816 233821 232219 230359 229059 229027 230177 231733 232914
52824 232914 233308 232789 231473 229871 228806 228847 229752 230633 230914 231064 232122 234429 237181 239469 241328 243241
52808 243241 244853 244977 243025 239818 236723 234442 232925 231915 231135 230322 229531 229158 229248 229103 228091 226561
52792 226561 225388 224794 224315 223877 224093 225233 226549 227071 226697 226125 225981 226381 227180 228207 229249 230089 230659
52775 230659 231060 231371 231545 231547 231474 231399 231083 230129 228668 227648 227912 228939 229147 227752 225773 224733 224920 225598
52757 225598 226429 227643 228983 229594 229231 228721 228825 229374 229883 230367 231063 231928 232868 234008 235280 236234 236716
52740 236716 237296 238539 240257 241968 243657 245551 247470 248978 249930 250424 250527 250466 250670 251065 250763 249144
52724 249144 246892 245253 244581 244334 244120 243870 243238 241890 240321 239393 239022 238335 237215 236618 236970 237319 236679
52707 236679 235381 234446 234297 234802 235954 237671 239309 240194 240531 241136 242301 243487 244162 244431 244754 245392 246257
52690 246257 247090 247711 248175 248640 249002 248835 247879 246465 245242 244540 244157 243739 243201 242798 242885 243602 244707 245732
52672 245732 246311 246370 246120 245984 246419 247568 249049 250203 250644 250506 250281 250535 251545 253011 254244 254877 255226
52655 255226 255772 256630 257797 259520 261830 263990 265062 264862 263798 262100 259967 258230 257734 258043 257825 256749
52639 256749 255886 255881 255919 255220 254500 254964 256548 258155 259158 259765 260293 260928 261929 263231 264051 263632 262151 260245
52621 260245 257995 255277 252791 251704 252161 253043 253367 253219 253162 253489 254291 255569 256946 257781 257900 257819 258002
52604 258002 258302 258391 258313 258320 258387 258223 257692 257091 257012 257850 259337 260729 261637 262466 263759 265393 266863 268084 269370
52585 269370 270794 272210 273771 275734 277735 278928 278951 278152 276837 275086 273411 272740 273266 274031 274086 273446
52569 273446 272489 271178 269613 268703 269268 270730 271613 271255 270214 269018 267476 265562 264079 263797 264370 264784
52553 264784 264604 264174 263643 262532 260562 258442 257298 257503 258477 259555 260505 261106 260833 259465 257719 256767
52537 256767 257164 258665 260908 263688 266488 268490 269436 270091 271309 272823 273426 272375 270225 268253 267373
52522 267373 267672 268726 270065 271388 272632 273978 275727 277994 280512 282828 284764 286584 288699 291293
52508 291293 294259 297315 300013 301791 302304 301678 300294 298341 295770 292603 289140 285842 283108 281042 279299
52493 279299 277372 275280 273813 273733 274848 276217 277156 277583 277504 276840 275920 275515 275968 276761 277284 277662 278348 279254
52475 279254 279852 279999 280178 280913 282337 284307 286546 288658 290387 291915 293624 295549 297371 299013 300765
52460 300765 302671 304145 304547 303805 302203 299797 296516 292704 289048 285891 283011 280235 277896 276414 275701
52445 275701 275325 275092 275130 275444 275737 275674 275073 273780 271687 269021 266414 264536 263721 263960 264999 266321 267260
52428 267260 267417 266964 266406 266037 265720 265208 264691 264959 266809 270112 273714 276574 278941 281981 286365 291754
52412 291754 297724 304476 312290 320818 329455 338003 346504 354710 362169 368457 372799 373807 370383 362925
52398 362925 353152 342802 332934 324238 317193 311763 307495 304149 301838 300488 299629 298833 298001 297151 296425
52383 296425 296322 297360 299346 301460 303249 305047 307249 309752 312382 315336 318775 322417 325985 329703
52369 329703 333885 338259 342127 344992 346742 347441 347345 346917 346445 345747 344562 343029 341454 339813 337950 336191
52353 336191 335278 335568 336638 337799 338768 339776 341174 343088 345393 347899 350535 353343 356333 359494 362935
52338 362935 366894 371564 377033 383409 390863 399470 409149 419728 430899 442238 453592 465473 478680
52325 478680 493418 509159 525452 542370 559846 577082 593145 607999 622522 637578 653340
52314 653340 669370 685032 699960 714467 729452 745608 762669 779614 795535 810173 823798
52303 823798 836850 849663 862251 874290 885313 894895 902663 908486 912774 916175 918632 918983 915994
52290 915994 909750 901694 893330 885256 877393 869775 862824 856976 852187 847930 843869 840507 838830 839124
52276 839124 840518 842030 843787 846745 851384 857262 863874 871423 880498 891202 902863 914532 925779
52263 925779 936978 948675 960668 972067 982523 992975 1004698 1017839 1031376 1044296 1056233
52252 1056233 1067085 1076715 1085084 1092038 1096825 1098482 1096960 1093287 1088347 1082080 1074223 1065218 1055806 1046227
52238 1046227 1036477 1027023 1018462 1010553 1002333 993353 984230 975720 967707 959500 950958 942908 936426 931801
52224 931801 928298 924932 921481 918615 917040 916759 917337 918642 920892 924036 927516 930841 934121 937846 942304
52209 942304 947373 952647 957604 961849 965422 968823 972536 976582 980658 984618 988617 992922 997795 1003538
52195 1003538 1010301 1017737 1024995 1031172 1035795 1038984 1041284 1043263 1044944 1045641 1044550 1041524 1037024 1031360
52181 1031360 1024442 1016405 1007957 999745 991700 983419 974995 967009 959868 953632 948419 944549 942222 941388
52167 941388 941907 943458 945361 946968 948308 949962 952174 954540 956684 958716 960769 962528 963641 964223 964575
52152 964575 964640 964196 963411 962722 962298 962030 962049 962744 964106 965401 965772 964997 963512 961808 960072 958454 957435
52135 957435 957700 959601 962939 967422 973186 980704 990304 1002054 1016023 1032273 1050504 1070080 1090594
52122 1090594 1112183 1135112 1159269 1184199 1209455 1234702 1259649 1284047 1307645 1330164 1351414
52111 1351414 1371446 1390301 1407681 1423206 1436979 1449379 1460281 1469161 1476235 1482706 1489352 1495403
52099 1495403 1499456 1500985 1500200 1496921 1490557 1481069 1468993 1454525 1437517 1418590 1399348 1381028 1363566
52086 1363566 1346427 1329819 1314635 1301687 1291428 1283989 1278895 1275051 1271651 1269044 1268287 1269911 1273550
52073 1273550 1278698 1285320 1293555 1303229 1313943 1325468 1337871 1351269 1365493 1379932 1393747 1406418
52061 1406418 1418116 1429364 1440359 1450848 1460679 1470116 1479284 1487553 1493839 1497459 1498398 1496894 1493150
52048 1493150 1487437 1479895 1470070 1457212 1441396 1423879 1406003 1388210 1370636 1353939 1338617 1323893
52036 1323893 1308492 1292563 1277790 1265299 1254470 1244075 1233499 1222275 1209600 1195340 1180785
52025 1180785 1167288 1154635 1141750 1128625 1116374 1105576 1095757 1086576 1078427 1071516 1065187 1058600
52013 1058600 1051478 1043872 1035710 1026888 1017412 1007191 996045 984000 971179 957377 942236 925955
52001 925955 909334 893049 877380 862702 849557 838016 827532 817719 808633 799981 790699 779899
51989 779899 767819 755317 742688 729455 715132 699822 684134 668731 653779 638713 622831
51978 622831 606316 590390 576320 564621 555389 548865 545270 544431 545930 549357 554138 559499 564974
51965 564974 570665 576608 582275 587078 591023 594324 596618 597134 595455 591636 585834 578456 570504 563078
51951 563078 556505 550492 545177 541342 539478 539289 540443 543234 548101 554883 563070 572537 583470 595560
51937 595560 607792 619204 629615 639338 648291 655595 660067 660973 658350 652833 645354 636879 628059 619028
51923 619028 609735 600544 592344 585960 581670 579459 579572 582561 588755 597799 608670 620083 630973 640697
51909 640697 648722 654221 656261 654565 649873 643305 635520 626646 616804 606344 595615 584717 573408
51896 573408 561058 546891 530739 513567 497005 482271 469775 459623 452029 446999 443975 442259
51884 442259 441702 442744 445738 450444 456250 462827 470427 479433 489595 499766 508563 515276 520028 523060
51870 523060 524184 523104 520073 515851 511087 506034 500929 496259 492404 489330 486993 485835 486414 488509
51856 488509 491041 493053 494377 495237 495555 495011 493455 490820 486779 480937 473441 465098 456867 449397 443001
51841 443001 437761 433564 430173 427283 424526 421657 418947 417158 416822 417716 419341 421639 424640 427598 429246
51826 429246 429106 427957 426742 425558 424050 422291 420698 419316 417777 416015 414654 414474 415606 417359 418861
51811 418861 419832 420573 421195 421165 419951 417915 416097 415136 414774 414460 413967 413359 412736 412195 411678 410762 408963 406343
51793 406343 403497 400904 398674 396924 395844 395240 394595 393783 393197 393005 392870 392629 392569 392739 392712 392522 393147 395403
51775 395403 398954 403102 408044 414566 422828 432229 442175 452274 462037 471151 479830 488103 494878 498510
51761 498510 498357 495189 490172 484098 477464 470518 463108 455141 447218 440245 434399 429134 424141 419626
51747 419626 415705 412334 409929 409188 410070 411741 413753 416445 419885 423370 426600 430516 436110 442875 449178
51732 449178 453857 456785 458188 458249 457401 456398 455933 456415 457934 459966 461219 460375 457245 452991 449076 446151
51716 446151 443947 441996 440254 439043 438530 438436 438318 437964 437339 436403 435433 435341 437007 440092 443033 444530 444606
51699 444606 443969 442917 441361 439547 438119 437597 438152 439577 441044 441214 439307 435983 432611 429738 426860
51684 426860 423603 420407 417859 416012 414675 413907 413897 414721 416496 419410 423271 427312 430776 433553 436080
51669 436080 438940 442847 448537 456116 464626 472691 479510 484849 488281 489107 487201 483467 479270 475744
51655 475744 473747 473929 476422 480716 486188 492550 499387 505459 508901 508248 503112 494042 482121 468720
51641 468720 455168 442349 430611 420102 410998 403443 397508 393340 391139 390803 391761 393345 395256 397513
51627 397513 400002 402222 403557 403696 402813 401367 399782 398311 397107 396268 395732 395219 394425 393275 392000 391072
51611 391072 390990 391852 393050 393666 393443 393092 393448 394683 396733 400049 405235 412052 419530 427130 435159 443975
51595 443975 453374 462784 471213 476798 477399 472380 463403 453075 443298 435207 429682 426934 426125 426433 428306
51580 428306 432892 440507 450592 462924 477644 493896 509544 522956 534509 545893 558340 571878
51568 571878 585768 599073 611055 621689 632106 644386 660708 682397 709505 741279 776978
51557 776978 815955 856662 896035 930558 958073 978199 991166 996917 995430 987103 972278 950824
51545 950824 922744 889112 852002 813493 774880 736745 699586 664276 631954 603456 578917
51534 578917 557957 540036 524427 510197 496751 484441 474164 466236 460026 454779 450439 447445
51522 447445 445956 445499 445207 444414 443221 442532 443231 445180 447263 448517 448973 449287 449792 450106 449484 447424 444011
51505 444011 439809 435450 431360 427854 425166 423167 421324 419308 417448 416190 415260 413863 411614 408849
51491 408849 406096 403751 402146 401315 400647 399316 397133 394535 391772 388738 385573 382690 380088 377348 374517
51476 374517 372268 370863 369654 367963 365836 363566 361172 358830 357169 356523 356332 355927 355503 355814 357189
51461 357189 359296 361525 363203 363940 364271 365543 368546 372651 376813 381040 386184 392686 400265 408594 417586
51446 417586 427124 437222 448254 460334 472488 483044 490760 495115 495872 493389 489295 485816 483919
51433 483919 482617 480202 475530 468086 457821 445637 433439 422947 414635 408197 403652 401281 400672
51420 400672 400651 400472 400608 401941 404400 406864 408458 409514 410965 413072 415175 416588 417276 417584 417814 418283
51404 418283 419322 420870 422436 423812 425489 427881 430425 432024 432356 432342 433366 436345 441384 447945 455426
51389 455426 463918 474356 487705 504273 524161 547977 576454 609568 646649 687304 731558 779207
51377 779207 829733 882757 937574 991856 1041631 1083221 1114921 1136653 1148667 1151124 1144416 1129076
51365 1129076 1105440 1073889 1035361 991319 943264 892620 840960 790006 741350 696293 655686
51354 655686 619651 587610 559015 534045 513302 496788 483485 472028 461619 452183 443817 436316
51342 436316 429269 422543 416505 411572 407600 403919 400131 396563 393662 391084 387872 383647 379240 375893
51328 375893 373983 372870 371861 370962 370562 370739 371186 371708 372514 373933 376005 378449 380948 383429 386154 389525
51312 389525 393749 398644 403737 408470 412314 414869 416038 416024 414990 412880 409754 406069 402285 398323 393809
51297 393809 388784 383717 378879 374263 370177 367285 365797 365137 364739 364775 365788 367988 371249 375337 379769
51282 379769 383860 387371 390763 394391 397763 400069 401045 400869 399658 397771 396273 396251 397742 399963 402493
51267 402493 405494 408853 411905 414156 415585 416081 415181 412682 409065 405120 401545 398919 397438 396451 394824
51252 394824 392122 389077 386654 385068 383992 383272 383003 383133 383406 383634 383806 383951 383959 383497 382218 380250 378350
51235 378350 377220 376704 376059 374925 373536 372038 370257 368318 366854 366244 366156 366222 366681 367914 369702 371423
51219 371423 372810 374072 375463 377068 378932 381109 383673 386848 390884 395486 399633 402423 404055 405640
51205 405640 408018 411030 413941 416202 417583 417807 416493 413643 409941 406207 402556 398546 394330 391131
51191 391131 390067 390784 391865 392425 392626 392714 392370 391367 390220 389766 390374 391811 393555 395054 396040 396804 397798
51174 397798 398909 399513 399379 398992 398832 398945 399450 400726 402704 404619 406045 407538 409632 411744 412852 412852
51158 412852 412447 412015 411438 410866 410705 410859 410750 410259 409909 410026 410301 410355 410070 409196 407334 404654 402057 400180
51140 400180 398654 396719 394269 391859 389986 388739 387997 387579 387268 386950 386719 386681 386817 387244 388419 390752
51124 390752 394030 397521 400685 403520 406145 408362 409951 411244 413012 415624 418523 420803 422214 423380
51110 423380 425097 427642 430788 434150 437333 439959 441771 442706 442777 442050 440841 439782 439450 439911 440680 441057
51094 441057 440509 439004 437121 435669 434969 434578 433838 432558 431097 430013 429770 430518 431853 432989 433424 433326
51078 433326 433029 432439 431399 430466 430753 432857 436347 440441 444830 449661 455084 461092 467695 474991 483182
51063 483182 492614 503671 516437 530555 545499 560819 575958 590046 602296 612740 622385 632552
51051 632552 644212 657884 673662 690752 707170 720604 729981 735865 739039 739084 734835 725927 713273
51038 713273 698231 682165 666883 654323 644846 636205 625112 610026 592161 574081 557842 544341
51026 544341 533648 525479 519614 516141 515248 516731 519885 523965 528626 533885 539891 546788 554566 562854
51012 562854 570952 578274 584822 591162 597896 605127 612498 619776 627309 635778 645481 656078 667065 678278
50998 678278 689766 701373 712684 723335 733207 742322 750675 758119 764406 769421 773400 776717 779449
50985 779449 781522 783397 786183 790621 796244 801992 807551 813688 821427 831420 844086 859759 878499
50972 878499 900217 925277 954586 988749 1027353 1069435 1114495 1162749 1214485 1269506 1327197
50961 1327197 1386723 1446975 1506536 1564005 1618377 1669045 1715512 1757267 1793906 1825209 1851133
50950 1851133 1871949 1888446 1901644 1912091 1919673 1924444 1927412 1930064 1933121 1936064 1937759 1937025 1932682
50937 1932682 1923859 1910719 1894496 1876414 1856709 1834888 1810488 1783246 1752855 1719106 1682139
50926 1682139 1642255 1599610 1554332 1506728 1457123 1405788 1353411 1301449 1251570 1204831 1161646
50915 1161646 1122159 1086189 1053066 1022187 993698 968179 945696 925715 907881 892296 878878
50904 878878 866933 855578 844284 832988 822053 812202 804072 797713 792738 788893 786071 783834 781574
50891 781574 779294 777722 777386 778065 779393 781500 784664 788687 793047 797403 801614 805558 809354 813632 819146
50876 819146 826133 834324 843541 853977 865861 879102 893372 908521 924889 943139 963686 986313
50864 986313 1010635 1037003 1066614 1100542 1138913 1181317 1227780 1279001 1335766 1398557 1467839
50853 1467839 1544341 1628755 1721244 1821347 1928381 2041803 2161195 2285938 2414950 2546728
50843 2546728 2679542 2811556 2940777 3064909 3181230 3286676 3378254 3453623 3511504 3551705
50833 3551705 3575018 3583082 3578039 3562126 3537699 3507601 3475091 3443130 3413943 3389506 3371911 3362503
50821 3362503 3360631 3363763 3368834 3372937 3372785 3364423 3344174 3309775 3260389 3195951 3116992 3024927 2921896
50808 2921896 2810104 2691419 2567704 2441361 2315316 2192367 2074603 1963597 1861058
50799 1861058 1768845 1687962 1617789 1556802 1503987 1459126 1421866 1391244 1366350 1346855 1332478
50788 1332478 1322356 1315418 1311033 1308807 1307848 1306759 1304403 1300469 1295369 1289792 1284171 1278188 1270851 1261409
50774 1261409 1250207 1238303 1226221 1213441 1199194 1183380 1166420 1148529 1129610 1109870 1090144
50763 1090144 1071363 1053903 1037640 1022481 1008623 996339 985845 977473 971724 969003 969371 972634
50751 972634 978502 986640 996799 1009102 1024011 1041921 1063029 1087723 1116645 1150029 1187317 1227957
50739 1227957 1272413 1321809 1376641 1436272 1499579 1565590 1633454 1702444 1772174 1842411 1912513
50728 1912513 1981427 2048350 2112857 2174235 2231167 2282417 2327442 2365988 2397338 2420195 2433095
50717 2433095 2434817 2424897 2404241 2375111 2340293 2302397 2263950 2227606 2195721 2169768 2150352 2137531
50705 2137531 2130821 2129136 2131125 2135463 2140563 2144150 2143521 2136308 2120898 2096302 2061946 2017703 1964138
50692 1964138 1902760 1836012 1766710 1697296 1629612 1565229 1505608 1451807 1404454 1364128 1331453
50681 1331453 1306569 1288936 1277967 1273566 1275711 1283830 1296977 1314417 1335664 1360056 1386661 1414503
50669 1414503 1442611 1469963 1495630 1518986 1539704 1557758 1573592 1587960 1601369 1613939 1625928
50658 1625928 1637991 1650607 1663705 1677232 1691649 1707305 1723850 1741038 1759882 1782126 1808557
50647 1808557 1838599 1871655 1908073 1948523 1993123 2041607 2093815 2149421 2207470 2266677 2326055
50636 2326055 2384839 2441847 2495394 2544037 2587274 2625385 2658724 2687458 2711981 2732952 2749948
50625 2749948 2759741 2756625 2735632 2696076 2642209 2580857 2518679 2460876 2410865 2370091 2338326 2314701
50613 2314701 2298586 2289413 2286012 2286517 2288906 2291370 2292165 2289409 2281196 2265955 2242623 2210484 2168953
50600 2168953 2117805 2057853 1991293 1921042 1849576 1778472 1708938 1642341 1579845 1521781 1467810
50589 1467810 1417839 1372486 1332401 1297314 1266061 1237576 1211564 1188133 1167154 1148364 1131859
50578 1131859 1118016 1106984 1098688 1093325 1091271 1092253 1095169 1099155 1104500 1112086 1122216 1134487 1148572
50565 1148572 1164545 1182443 1202047 1223225 1246114 1270856 1297474 1326061 1356724 1389153 1422456
50554 1422456 1455591 1487800 1518578 1547519 1574394 1599296 1622553 1644609 1666054 1687702 1710559
50543 1710559 1735751 1764435 1797622 1835961 1879738 1929121 1984393 2045998 2114454 2190236 2273715
50532 2273715 2365158 2464730 2572337 2687428 2809080 2936308 3068103 3202975 3338596 3472083
50522 3472083 3600642 3721898 3833697 3933694 4019132 4087091 4135189 4162144 4167504 4150952 4112328
50511 4112328 4052583 3974249 3880669 3774988 3660293 3540401 3419868 3303083 3193700 3094952
50501 3094952 3010075 2942032 2892716 2862454 2850262 2854612 2873907 2906235 2948881 2998397 3050938
50490 3050938 3102008 3146030 3177047 3190312 3182875 3152703 3098401 3020546 2922526 2809113 2684552
50479 2684552 2552759 2418497 2286746 2160665 2041203 1928838 1824738 1730000 1644837 1569050
50469 1569050 1502524 1444712 1394309 1350118 1311856 1279648 1253132 1231650 1215001 1203397 1196689
50458 1196689 1194004 1194167 1196258 1199789 1204520 1210176 1216403 1223029 1230194 1237989 1246216 1254826 1264391 1275557
50444 1275557 1288093 1301038 1313732 1326072 1337696 1347713 1355539 1361424 1365899 1369322 1372244 1375520
50432 1375520 1379578 1384135 1389093 1395161 1402990 1412247 1422215 1432905 1444924 1458572 1473884 1491418 1512225
50419 1512225 1536999 1565794 1598570 1635507 1676754 1722446 1773007 1828885 1889741 1954242 2020766
50408 2020766 2088008 2154764 2219625 2281145 2338171 2389734 2434701 2471628 2498885 2514903 2518539
50397 2518539 2509366 2487590 2453573 2407527 2349826 2281746 2205871 2125651 2044439 1964951 1889541
50386 1889541 1820565 1760069 1709202 1668370 1637935 1618294 1609165 1609322 1617401 1632562 1653988 1679982
50374 1679982 1707947 1735036 1758403 1775107 1782409 1778490 1762790 1735814 1698859 1653802 1602656 1547085
50362 1547085 1488421 1428175 1368336 1311097 1258119 1209791 1165083 1122486 1081440 1042835 1007977
50351 1007977 977322 950528 927456 908573 894418 885140 880632 880693 884839 892304 902462 915103 930107
50338 930107 947004 964971 983065 1000119 1014442 1023940 1026934 1023109 1013785 1001288 987959 975558
50326 975558 965200 957440 952279 949304 947988 947993 949251 951845 955679 960008 963336 964172 962107 958034 953234
50311 953234 948472 944016 940123 937132 935228 934347 934247 934450 934340 933586 932492 931769 932024 933502 936091 939330
50295 939330 942605 945585 948410 951272 953984 956248 958244 960596 963741 967526 971472 975141 978147 980016
50281 980016 980296 978915 976403 973681 971508 970196 969915 971111 974308 979435 985606 991654 996683 1000160 1001847
50266 1001847 1001906 1000783 998843 996296 993571 991345 989952 989071 988283 987671 987623 988364 990054 993066 997789 1004305
50250 1004305 1012583 1022719 1034701 1048262 1063390 1080684 1100611 1122567 1145155 1167302 1188626
50239 1188626 1208936 1228054 1246087 1263232 1279158 1293080 1304498 1313268 1318844 1320089 1316215 1307396
50227 1307396 1294112 1276426 1254456 1229344 1203147 1177688 1153834 1131874 1112222 1095487 1081926
50216 1081926 1070982 1061372 1051477 1039566 1023891 1003187 977570 948899 919881 892641 868078 846233
50204 846233 826867 809714 794595 781396 769787 759033 748418 737913 728132 719524 711908 704850
50192 704850 698194 692006 686277 680965 676208 672184 668698 665125 660929 656269 651914 648447 645660 642932
50178 642932 640121 637724 636105 634987 633930 632947 632312 632103 632297 633042 634320 635593 636358 636954 638317 640950
50162 640950 644621 649050 654340 660641 667829 675654 683842 692093 700345 708967 718128 726993 734191 739188
50148 739188 742572 744864 745821 745240 743741 742195 740930 740202 741000 744668 751826 762273 775886 793043
50134 793043 814066 838650 866008 895447 926851 960661 997242 1036123 1076090 1116197 1156366
50123 1156366 1196694 1236601 1275262 1312670 1349530 1386019 1421143 1453472 1481909 1505395 1522319
50112 1522319 1530806 1529655 1518797 1498925 1471045 1436407 1396575 1353284 1308202 1262858 1218678 1176849
50100 1176849 1138053 1102395 1069738 1040149 1014015 991741 973333 958212 945417 934036 923612
50089 923612 914179 905917 898845 892847 887862 883928 881116 879520 879162 879813 880970 882261 883727 885561 887622
50074 887622 889461 890706 891195 890768 889251 886727 883542 879999 876159 871941 867181 861661 855381 848825 842684
50059 842684 837217 832125 827050 821967 817101 812804 809573 807824 807443 807862 808743 810307 812872 816416 820900
50044 820900 826699 834277 843506 853659 864137 874906 886119 897570 908798 919705 930707 942007
50032 942007 952918 962387 970231 977299 984181 990294 994636 996910 997274 995492 991370 985841 980581 976316
50018 976316 972394 968240 964432 961992 961428 962950 966917 973503 982474 993793 1007870 1024692 1043326
50005 1043326 1062941 1083816 1106574 1130833 1155434 1179748 1203959 1228128 1251607 1273256 1291606
49994 1291606 1304883 1311522 1310710 1302116 1285383 1260494 1228427 1190768 1148772 1103448 1056454 1010064
49982 1010064 966166 925837 889802 858395 830940 806141 783608 764308 749033 736984 726515
49971 726515 716826 708234 700921 694171 687119 679928 673865 670176 668942 669246 670400 672679 676655 682258
49957 682258 689078 697278 707371 719022 730830 741650 751541 761003 769805 777090 782301 785495 786957
49944 786957 787012 786120 784689 782708 779743 775268 768818 759911 748160 733573 716731 698728 680887 664319
49930 664319 649554 636706 625904 617272 610401 604345 598533 593508 590342 589415 590101 591596 593702 596743
49916 596743 601006 606403 612476 618600 624305 629606 635045 641418 649419 659379 671066 683639 696046
49903 696046 707853 719684 732504 746180 758955 768715 774760 777981 779373 778961 776367 771753 765551
49890 765551 757612 747366 734828 720884 706567 692503 679016 666183 653677 641098 628616 616847
49878 616847 606058 596118 587348 580659 576410 573748 571588 569754 568690 568553 569311 571331 575077 580362
49864 580362 586509 593198 600627 608961 618224 628701 640781 654338 668745 683555 698561 713056
49852 713056 725601 734903 740694 743661 744833 745146 745055 744216 741645 736435 728262 717390 704582 691044
49838 691044 677955 665775 654284 643432 633825 626242 620994 617951 616783 616985 617985 619551 621875
49825 621875 625160 629483 635173 642747 652090 662187 672208 682535 694098 706886 719643 730860
49813 730860 739604 745570 749019 750680 751193 750552 748476 745156 741023 735832 728720 719409 708742 697805
49799 697805 687121 676988 667911 660098 652972 645825 638744 632332 626722 621450 616260 611479 607562 604706
49785 604706 603027 602691 603608 605237 606912 608361 609870 611966 614899 618345 621836 625572 630555 637585 646205
49770 646205 655002 662853 669488 674928 678941 681360 682578 683313 683922 684159 683518 681628 678325 673561 667362
49755 667362 659870 651297 641782 631401 620491 609896 600574 592842 586316 580719 576355 573475 571591
49742 571591 569957 568439 567247 566049 564181 561879 560481 560964 562883 565198 567622 570612 574455 579023
49728 579023 584258 590300 597102 604412 612149 620514 629689 639663 650283 661156 671469 680259 686964
49715 686964 691585 694291 695055 693689 690131 684622 677673 669793 661170 651763 641741 631725 622499 614693
49701 614693 608778 604929 602587 600523 597860 594980 593017 592562 593277 594741 597094 600700 605525 611150 617237
49686 617237 623835 631272 639757 649013 658436 667774 677458 687982 699185 710637 722619 736001 750815
49673 750815 765376 777138 784298 786569 784934 781085 776754 773017 770017 767450 765169 763240 761595 759850
49659 759850 757251 752639 744718 732839 717624 700669 683626 667618 653305 641074 631049 623171
49647 623171 617452 614032 612829 613206 614204 615191 616202 617581 619344 621034 622141 622402 621600 619369 615517
49632 615517 610412 604683 598555 591858 584762 578062 572519 568162 564575 561610 559408 557799 556186 554252
49618 554252 552499 551760 552174 552884 552893 552071 551190 551020 551606 552466 553255 553999 554822 555732 556704 557759 558863 559881
49600 559881 560655 561049 561005 560686 560519 560895 561827 563087 564562 566223 567862 569236 570481 571965 573651 575037
49584 575037 575907 576654 577630 578610 579303 580020 581303 583128 585002 586760 588744 591259 594361 598230 603242 609514
49568 609514 616752 624666 633163 642036 650934 659847 669161 678788 687536 693861 697165 698050 697440 695783 693076
49553 693076 689189 684106 678168 672258 667406 664051 661801 659980 658261 656720 655578 655047 655153 655505 655477
49538 655477 654938 654683 655832 658923 663788 670150 677897 686890 697003 708469 721700 736653 752818
49525 752818 770089 789151 810502 833311 855594 875268 890725 900858 905519 906101 904970 903868
49513 903868 903128 902620 902990 905490 910596 917085 922373 923727 919528 909907 896362 880623 863749 846179
49499 846179 828391 811264 795814 782684 771867 762871 755170 748566 743084 738564 734544 730679 727168
49486 727168 724627 723588 724183 726171 729045 732088 734550 735995 736549 736803 737413 738712 740641 743032 745869
49471 745869 749224 753010 756949 760807 764536 768099 771226 773513 774823 775477 775896 775991 775071 772618 769094
49456 769094 765619 762704 759614 755286 749649 743639 738071 732969 727970 722886 717701 712471 707500 703314
49442 703314 700215 698074 696805 696790 698532 702004 706670 712079 718267 725632 734633 745526 758225 772397
49428 772397 787745 804036 820727 836819 851383 864183 875527 885418 892971 896693 895385 889112
49416 889112 879668 870005 862753 859019 858525 860779 865772 873548 883467 894327 905218 916074 927330
49403 927330 939183 951338 963374 975154 986787 998433 1010359 1022999 1036498 1050120 1062461
49392 1062461 1072509 1080294 1086294 1090395 1091777 1089752 1084428 1076556 1066974 1056297 1044900 1032953 1020495
49379 1020495 1007637 994835 982952 972870 964878 958473 952983 948394 945374 944473 945531 947946 951152
49366 951152 954586 957519 959344 959993 959697 958358 955451 950604 944021 936241 927708 918669 909332 900030 891315
49351 891315 883841 877959 873368 869346 865417 861625 858148 854970 852095 849778 848122 846549 844090 840354
49337 840354 835952 831872 828668 826372 824847 823883 823134 822392 821965 822505 824397 827577 831895 837277 843432
49322 843432 849815 856072 862280 868659 875448 883143 892280 902607 913085 923291 934278 947285 962019
49309 962019 977182 992420 1008522 1025614 1042420 1057793 1071832 1084631 1094756 1100013 1099431 1093724
49297 1093724 1084181 1072020 1058623 1045356 1032781 1020603 1008579 997045 986353 976248 966175
49286 966175 956058 946512 938270 931463 925557 920022 915079 911641 910619 912438 917026 923768 931397 938646
49272 938646 945379 952665 961319 970715 979443 986718 992682 997699 1002010 1005963 1009978 1014302 1019202 1025341
49258 1025341 1033646 1044878 1059393 1076839 1095701 1113734 1129436 1142531 1152305 1156151 1151129 1136924
49246 1136924 1116144 1091668 1064902 1036825 1009312 984455 963204 945374 930490 918099 907850
49235 907850 899957 895266 894309 896501 900666 906049 912484 920002 928758 939021 950680 962957 975034
49222 975034 986791 998504 1010034 1020816 1030576 1039575 1048090 1055945 1062576 1067385 1070125 1071281 1072109
49209 1072109 1074115 1078388 1085317 1094709 1106052 1118897 1133106 1148592 1164798 1180816 1196222 1211390
49197 1211390 1226716 1241832 1255969 1268786 1280450 1291092 1300661 1309251 1317143 1324517 1331473 1338404
49185 1338404 1346076 1355183 1365920 1378130 1391891 1407963 1427568 1451560 1479869 1511945 1547613 1587123
49173 1587123 1630379 1676494 1723926 1770172 1811094 1841539 1857817 1859771 1850296 1833330 1812638 1791722
49161 1791722 1773516 1759773 1751110 1747428 1747642 1749231 1749235 1746321 1741557 1736922 1733548 1731567 1730966 1731925 1734562
49146 1734562 1738941 1745281 1753776 1764177 1775758 1787826 1800161 1813043 1826970 1842271 1858833 1876130
49134 1876130 1893562 1910788 1927798 1944745 1961690 1978490 1994938 2011140 2027599 2044764 2062584
49123 2062584 2080721 2099166 2118436 2139172 2161805 2186644 2214040 2244442 2278692 2318409 2365654
49112 2365654 2421719 2486353 2558718 2639327 2730625 2834724 2949432 3066098 3172418 3259790
49102 3259790 3329772 3392748 3457646 3520729 3564416 3568840 3526651 3448247 3353714 3259481 3170533
49091 3170533 3082309 2988327 2886865 2782608 2683393 2595505 2521309 2460245 2410925 2371898 2341296
49080 2341296 2316971 2297310 2281467 2268739 2258192 2249005 2240685 2232795 2224835 2216665 2208754 2201830 2196356
49067 2196356 2192219 2188592 2184253 2178616 2172480 2167148 2162731 2158082 2152615 2147320 2143452 2140967 2139024 2137400
49053 2137400 2136514 2136408 2136710 2137541 2139612 2143331 2148500 2154948 2162813 2172041 2182219 2193117 2204858 2217387
49039 2217387 2230097 2242100 2252350 2259498 2262301 2260684 2256129 2250748 2246150 2243146 2241896 2241902 2242204 2242114 2241682
49024 2241682 2241192 2240429 2238841 2236362 2233720 2231829 2231024 2230937 2231048 2231345 2232477 2235201 2239652 2245184 2250971 2256709
49008 2256709 2262750 2269608 2277347 2285442 2293308 2300892 2308593 2316499 2324022 2330474 2335811 2340492 2344775 2348474
48994 2348474 2351222 2352635 2352361 2350434 2347547 2344501 2341347 2337514 2332796 2327730 2322934 2318580 2314734 2311664
48980 2311664 2309494 2307899 2306508 2305295 2304234 2302865 2300590 2297267 2293222 2288819 2284292 2279859 2275675 2271725
48966 2271725 2267996 2264739 2262341 2261007 2260750 2261656 2264014 2268173 2274324 2282386 2292005 2302716 2314086 2325722
48952 2325722 2337271 2348765 2360956 2374957 2391327 2409664 2429147 2449223 2469722 2490687 2512405
48941 2512405 2535488 2560705 2588783 2620254 2655138 2692730 2732153 2773273 2816623 2862250 2909242
48930 2909242 2956881 3005696 3056693 3109902 3164425 3219656 3275591 3331977 3388111 3443751 3499393
48919 3499393 3555159 3610039 3662726 3712859 3760953 3807554 3853049 3897956 3942533 3986056 4027120
48908 4027120 4064940 4099913 4132789 4163876 4193411 4222193 4251051 4279793 4307321 4333018 4357500
48897 4357500 4381645 4405237 4427068 4446290 4463097 4477912 4490329 4499232 4503879 4504498 4501809 4496221
48885 4496221 4487736 4476469 4462927 4447569 4430216 4410117 4386623 4359599 4329085 4294793 4256142
48874 4256142 4212765 4164758 4112482 4056388 3997163 3935887 3873867 3812211 3751527 3692029 3633962
48863 3633962 3577939 3524718 3474639 3427469 3382901 3340989 3301855 3265194 3230472 3197591 3167048
48852 3167048 3139416 3114972 3093868 3076303 3062394 3052073 3045222 3041663 3040926 3042337 3045473 3050338 3056979
48839 3056979 3065178 3074738 3085843 3098893 3114057 3131103 3149563 3168968 3189033 3209716 3230983 3252504
48827 3252504 3273788 3294689 3315518 3336552 3357694 3378691 3399432 3419891 3440099 3460323 3480970
48816 3480970 3502088 3523262 3544179 3564932 3585584 3605911 3626040 3646904 3669424 3693383 3717726
48805 3717726 3741904 3766384 3791853 3818460 3845923 3873859 3901812 3929365 3956459 3983300 4009765
48794 4009765 4035123 4058503 4079448 4097949 4114274 4128954 4142676 4155886 4168431 4179526 4187881
48783 4187881 4192002 4190732 4183729 4171236 4153444 4130488 4103147 4072960 4041124 4007511 3971215 3931979
48771 3931979 3890607 3847959 3804074 3758551 3711436 3663395 3615039 3566481 3517655 3468894 3420961
48760 3420961 3374563 3329939 3286958 3245484 3205619 3167670 3132005 3098923 3068569 3040894 3015615
48749 3015615 2992182 2969877 2948223 2927454 2908463 2892118 2878658 2867818 2859449 2853769 2851000 2850871
48737 2850871 2852504 2854679 2856253 2856560 2855594 2853873 2852166 2851252 2851713 2853665 2856698 2860240 2863998 2868016 2872367
48722 2872367 2876969 2881629 2886026 2889637 2891938 2892809 2892618 2891859 2890835 2889754 2888931 2888677 2889031 2889717 2890369 2890767
$$ [...]
##END NTUPLES=NMR SPECTRUM
##END=
