##TITLE=AC1467_PERAH13298_8011979_n90bSVSN3g
##JCAMPDX= 6.0         $$ Bruker NMR JCAMP-DX V2.0
##DATA TYPE= NMR SPECTRUM
##DATA CLASS= NTUPLES
##ORIGIN= BRUKER
##OWNER= Administrator
$$ 1.72 TOPSPIN		Version 2.1
$$ 2013-07-05 20:12:03.196 -0700  Administrator@X
$$ Compression mode = diff/dup
##.OBSERVE FREQUENCY= 400.02188249412
##.OBSERVE NUCLEUS= ^1H
##.ACQUISITION MODE= SIMULTANEOUS (DQD)
##.ACQUISITION SCHEME= undefined
##.AVERAGES= 64
##.DIGITISER RES= 22
##SPECTROMETER/DATA SYSTEM= spect
##.PULSE SEQUENCE= noesygpps1d.comp
##.SOLVENT NAME= COFFEE_meoh
##.SHIFT REFERENCE= INTERNAL, COFFEE_meoh, 1, 14.9609
##AUDIT TRAIL= $$ (NUMBER, WHEN, WHO, WHERE, PROCESS, VERSION, WHAT)
$$ ##TITLE= Audit trail, TOPSPIN		Version 2.1
$$ ##JCAMPDX= 5.01
$$ ##ORIGIN= Bruker BioSpin GmbH
$$ ##OWNER= Administrator
$$ $$ E:\/data/COFFEE/nmr/AC1467_PERAH13298_8011979_n90bSVSN3g/12/pdata/1/auditp.txt
$$ ##AUDIT TRAIL=  $$ (NUMBER, WHEN, WHO, WHERE, PROCESS, VERSION, WHAT)
(   1,<2013-07-05 20:11:57.696 -0700>,<Administrator>,<X>,<go>,<TOPSPIN 2.1>,
      <created by zg
	started at 2013-07-05 20:00:28.368 -0700,
	POWCHK enabled, PULCHK disabled,
       configuration hash MD5:
       C8 4E 4E 5D D3 5C D8 9E 9F 52 82 E0 59 8A DE 15
       data hash MD5: 64K
       E1 F5 04 E0 30 FB 4A D2 8A AF 36 FF 8B C1 C5 6E>)
(   2,<2013-07-05 20:12:00.899 -0700>,<Administrator>,<X>,<proc1d>,<TOPSPIN 2.1>,
      <Start of raw data processing
       efp LB = 0.3 FT_mod = 6 PKNL = 1 PHC0 = 0 PHC1 = 0 SI = 128K 
       data hash MD5: 128K
       D3 16 3F B3 07 E2 2D 78 A6 53 67 81 5D 1F FF F8>)
(   3,<2013-07-05 20:12:01.930 -0700>,<Administrator>,<X>,<proc1d>,<TOPSPIN 2.1>,
      <pk PHC0 = -84.49585 PHC1 = 0 
       data hash MD5: 128K
       86 FF 6C 2F 6D 0F 62 CB 8D 90 6C F5 C6 72 98 10>)
(   4,<2013-07-05 20:12:02.508 -0700>,<Administrator>,<X>,<proc1d>,<TOPSPIN 2.1>,
      <abs ABSG = 1 
       data hash MD5: 128K
       5C 93 59 CC 6B 81 4E 69 8C 59 6A 93 FC 07 8D 55>)
(   5,<2013-07-05 20:12:02.712 -0700>,<Administrator>,<X>,<proc1d>,<TOPSPIN 2.1>,
      <abs ABSG = 2 
       data hash MD5: 128K
       41 A4 EA B1 B7 FD 4C DC 34 FD 92 B9 0E 36 6C F5>)
(   6,<2013-07-05 20:12:02.790 -0700>,<Administrator>,<X>,<proc1d>,<TOPSPIN 2.1>,
      <abs ABSG = 3 
       data hash MD5: 128K
       D9 2A 0D 4F DE C2 86 E6 77 3D BC 09 30 FF 23 E2>)
(   7,<2013-07-05 20:12:02.883 -0700>,<Administrator>,<X>,<proc1d>,<TOPSPIN 2.1>,
      <abs ABSG = 4 
       data hash MD5: 128K
       79 FC 86 D4 F4 D2 48 8A F1 87 C1 33 43 85 A6 57>)
(   8,<2013-07-05 20:12:02.977 -0700>,<Administrator>,<X>,<proc1d>,<TOPSPIN 2.1>,
      <abs ABSG = 5 
       data hash MD5: 128K
       BB 1D A5 2F 8D 48 19 43 31 6D 08 FF E9 A7 4C B1>)
$$ ##END=
$$ 
$$ $$ hash MD5
$$ $$ AB F7 48 1B 68 39 B8 3C 5A 7C B1 95 22 A8 15 17
##$RELAX= 
##$RELAX= 
##$RELAX= 
##$RELAX= 
##$RELAX= 
##$RELAX= 
##$RELAX= 
##$RELAX= 
$$ Bruker specific parameters
$$ --------------------------
##$DU= <E:\>
##$EXPNO= 12
$$ [...]
150 150 150 150 150 150 150 150
##$TP07= 0
##$TPNAME0= <>
##$TPNAME1= <>
##$TPNAME2= <>
##$TPNAME3= <>
##$TPNAME4= <>
##$TPNAME5= <>
##$TPNAME6= <>
##$TPNAME7= <>
##$TPOAL= (0..7)
0.5 0.5 0.5 0.5 0.5 0.5 0.5 0.5
##$TPOFFS= (0..7)
0 0 0 0 0 0 0 0
##$TUNHIN= 0
##$TUNHOUT= 0
##$TUNXOUT= 0
##$USERA1= <user>
##$USERA2= <user>
##$USERA3= <user>
##$USERA4= <user>
##$USERA5= <user>
##$V9= 5
##$VALIST= <valist>
##$VCLIST= <CCCCCCCCCCCCCCC>
##$VD= 0
##$VDLIST= <DDDDDDDDDDDDDDD>
##$VPLIST= <PPPPPPPPPPPPPPP>
##$VTLIST= <TTTTTTTTTTTTTTT>
##$WBST= 1024
##$WBSW= 4
##$XGAIN= (0..3)
0 0 0 0
##$XL= 0
##$YL= 0
##$YMAX_a= 6838040
##$YMIN_a= -13075558
##$ZGOPTNS= <>
##$ZL1= 120
##$ZL2= 120
##$ZL3= 120
##$ZL4= 120
##$ABSF1= 14.9609
##$ABSF2= -5.597281
##$ABSG= 5
##$ABSL= 3
##$ALPHA= 0
##$AQORDER= 0
##$ASSFAC= 0
##$ASSFACI= 0
##$ASSFACX= 0
##$ASSWID= 0
##$AUNMP= <proc_prof1d_extract.lims>
##$AXLEFT= 0
##$AXNAME= <>
##$AXNUC= <1H>
##$AXRIGHT= 0
##$AXTYPE= 0
##$AXUNIT= <>
##$AZFE= 0.1
##$AZFW= 0.1
##$BCFW= 0
##$BC_mod= 0
##$BYTORDP= 0
##$COROFFS= 0
##$CY= 15
##$DATMOD= 1
##$DC= 0
##$DFILT= <>
##$DTYPP= 0
##$F1P= 0
##$F2P= 0
##$FCOR= 0.5
##$FTSIZE= 131072
##$FT_mod= 6
##$GAMMA= 0
##$GB= 0
##$INTBC= 1
##$INTSCL= 1
##$ISEN= 128
##$LB= 0.3
##$LEV0= 0
##$LPBIN= 0
##$MAXI= 10000
##$MC2= 0
##$MEAN= 0
##$ME_mod= 0
##$MI= 0
##$NCOEF= 0
##$NC_proc= -2
##$NLEV= 6
##$NOISF1= 0
##$NOISF2= 0
##$NSP= 0
##$NTH_PI= 0
##$NZP= 0
##$OFFSET= 14.9609
##$PC= 1
##$PHC0= -84.49585
##$PHC1= 0
##$PH_mod= 1
##$PKNL= yes
##$PPARMOD= 0
##$PPDIAG= 0
##$PPIPTYP= 0
##$PPMPNUM= 2147483647
##$PPRESOL= 1
##$PSCAL= 4
##$PSIGN= 0
##$PYNMP= <proc.py>
##$REVERSE= no
##$SF= 400.020009678398
##$SI= 131072
##$SIGF1= 0
##$SIGF2= 0
##$SINO= 400
##$SIOLD= 131072
##$SPECTYP= <>
##$SREGLST= <1H.CDCl3>
##$SSB= 0
##$STSI= 131072
##$STSR= 0
##$SW_p= 8223.68421052631
##$SYMM= 0
##$S_DEV= 0
##$TDeff= 65536
##$TDoff= 0
##$TI= <>
##$TILT= no
##$TM1= 0
##$TM2= 0
##$TOPLEV= 0
##$USERP1= <user>
##$USERP2= <user>
##$USERP3= <user>
##$USERP4= <user>
##$USERP5= <user>
##$WDW= 1
##$XDIM= 131072
##$YMAX_p= 316950789
##$YMIN_p= -13157
##$CURPLOT= <Network HP LaserJet P1505>
##$CURPRIN= <$Network HP LaserJet P1505>
##$DFORMAT= <normdp>
##$LAYOUT= <+/1D_H.xwp>
##$LFORMAT= <normlp>
##$PFORMAT= <normpl>
##$SURQMSG= 1
$$ End of Bruker specific parameters
$$ ---------------------------------
##NTUPLES= NMR SPECTRUM
##VAR_NAME=  FREQUENCY,     SPECTRUM/REAL,   SPECTRUM/IMAG
##SYMBOL=    X,             R,               I
##VAR_TYPE=  INDEPENDENT,   DEPENDENT,       DEPENDENT
##VAR_FORM=  AFFN,          ASDF,            ASDF
##VAR_DIM=   131072,        131072,          131072
##UNITS=     HZ,            ARBITRARY UNITS, ARBITRARY UNITS
##FACTOR=    0.0627417313425164, 1,          1
##FIRST=     8223.62146879497, -1520,        -67563
##LAST=      0,             557,             -68154
##MIN=       0,             -13157,          0
##MAX=       8223.62146879497, 316950789,    0
$$ Real data points
##PAGE= N=1
##DATA TABLE= (X++(R..R)), XYDATA
$$ [...]
$$ plain form
63825 1055823 998243 943830 893381 847139 804989 766758 731951 699645 669113 640377 613818
63814 613818 589556 567509 547653 529647 512499 495312 478397 463015 449898 438527 428006
63803 428006 418041 408792 400298 392560 385924 380795 377026 373977 371180 368632 366382 364203 361834 359343
63789 359343 357022 354984 352979 350585 347509 343761 339592 335283 330954 326574 322109 317545 312792 307765
63775 307765 302666 298013 294137 290734 287182 283325 279714 276965 275125 273799 272645 271482 270135 268578
63761 268578 267157 266248 265656 264764 263420 262213 261593 261143 260240 259138 258736 259235 259680 259167 258097 257754 258823
63744 258823 260782 262734 264434 266280 268561 271030 273237 275098 277026 279512 282693 286373 290389 294805
63730 294805 299700 304946 310309 315682 321010 326090 330681 334891 339225 344046 349096 353688 357318 359966
$$ packed form
63825A055823n7580n4413n0449m6242m2150l8231l4807l2306l0532k8736k6559
63814F13818k4262k2047j9856j8006j7148j7187j6915j5382j3117j1371j0521
63803D28006r965r249q494p738o636n129l769l049k797k548k250k179k369k491
63789C59343k321k038k005k394l076l748m169m309m329m380m465m564m753n027
63775C07765n099m653l876l403l552l857l611k749j840j326j154j163j347j557
63761B68578j421r09n92q92j344j207o20m50r03j102m02M99M45n13j070l43J069
63744B58823J959J952J700J846K281K469K207J861J928K486L181L680M016M416
63730B94805M895N246N363N373N328N080M591M210M334M821N050M592L630K648
$$ plain form
63716 359966 361867 363129 363553 362711 360226 356175 351320 346854 343748 342165 341347 340073 337523 333968 330581
63701 330581 328343 327169 326232 325071 324025 323570 323700 324208 325278 327317 330248 333311 335656 336971 337498
63686 337498 337642 337699 337829 338120 338626 339361 340314 341532 343204 345557 348567 351888 355199 358624 362644 367537
63670 367537 372954 378109 382372 385683 388364 390548 391909 392023 390943 389178 387117 384688 381636 377884
63656 377884 373476 368430 362917 357442 352531 348270 344381 340706 337452 334945 333354 332656 332695 333270 334277
63641 334277 335690 337298 338599 339225 339442 340043 341770 345003 349802 355879 362583 369316 376073 383299 391220
63626 391220 399687 408751 418867 430314 442827 456152 470650 486883 504813 523940 544190 566143
63614 566143 590155 615575 641080 665622 688836 710670 730949 749371 765779 780245 792972
$$ packed form
63716C59966J901J262M24q42k485m051m855m466l106j583q18j274k550l555l387
63701C30581k238j174r37j161j046m55J30N08J070K039K931L063K345J315N27
63686C37498J44N7J30K91N06P35R53J218J672K353L010L321L311L425M020M893
63670C67537N417N155M263L311K681K184J361J14j080j765k061k429l052l752
63656C77884m408n046n513n475m911m261l889l675l254k507j591o98L9N75J007
63641C34277J413J608J301O26K17O01J727L233M799O077O704O733O757P226P921
63626C91220Q467R064J0116J1447J2513J3325J4498J6233J7930J9127K0250K1953
63614E66143K4012K5420K5505K4542K3214K1834K0279J8422J6408J4466J2727
$$ plain form
63603 792972 804201 814129 822672 829238 832938 833224 830304 824926 817888 809754 800760 790687 779058 765772
63589 765772 751516 737216 723106 708645 693343 677352 661177 645224 629828 615409 602351
63578 602351 590808 580781 572281 565315 559843 555817 553104 551428 550579 550699 552095 554784 558529 563302
63564 563302 569286 576400 584312 593133 603590 616249 631129 648526 669650 695666 726196 759311
63552 759311 792961 825974 857891 888570 918074 946403 973038 996981 1017285 1033290 1044444
63541 1044444 1050439 1051659 1049078 1043486 1035156 1024385 1011959 998780 985299 971608 957824 944016
63529 944016 929944 915158 899348 882392 864138 844382 823034 800169 775996 750915 725576
63518 725576 700664 676643 653787 632375 612698 594789 578262 562427 546669 530925 515907
$$ packed form
63603G92972J1229R928Q543O566L700K86k920n378p038q134q994j0073j1629j3286
63589G65772j4256j4300j4110j4461j5302j5991j6175j5953j5396j4419j3058
63578F02351j1543j0027q500o966n472m026k713j676q49J20J396K689L745M773
63564E63302N984P114P912Q821J0457J2659J4880J7397K1124K6016L0530L3115
63552G59311L3650L3013L1917L0679K9504K8329K6635K3943K0304J6005J1154
63541A044444N995J220k581n592q330j0771j2426j3179j3481j3691j3784j3808
63529I44016j4072j4786j5810j6956j8254j9756k1348k2865k4173k5081k5339
63518G25576k4912k4021k2856k1412j9677j7909j6527j5835j5758j5744j5018
$$ plain form
63507 515907 502675 491736 482572 474222 466206 458660 451718 445279 439507 435041 432268 430618 429062 427262
63493 427262 425726 424839 424338 423999 424330 425972 428664 431391 433576 435621 438203 441556 445610 450337 455499
63478 455499 460389 464291 467143 469358 471085 472048 472136 471656 470769 468967 465493 460251 454069 448022 442659
63463 442659 437952 433774 430211 427392 425266 423644 422346 421225 420204 419542 419949 422138 426192 431617 438112
63448 438112 446117 456526 470065 487098 507826 532398 560727 592158 625365 658745 691207 722577
63436 722577 752992 781970 808416 831541 851271 867620 880198 888759 893840 896415 897207 896838 896488
63423 896488 897811 902040 909420 919419 931137 943610 956171 968651 981012 992817 1003308 1011988
63411 1011988 1018833 1023929 1027209 1028517 1027568 1023827 1016797 1006656 994388 981148 967531 953371 937938
$$ packed form
63507E15907j3232j0939r164q350q016p546o942o439n772m466k773j650j556j800
63493D27262j536q87n01l39L31J642K692K727K185K045K582L353M054M727N162
63478D55499M890L902K852K215J727R63Q8m80q87j802l474n242o182o047n363
63463D42659m707m178l563k819k126j622j298j121j021o62M07K189M054N425O495
63448D38112Q005J0409J3539J7033K0728K4572K8329L1431L3207L3380L2462L1370
63436G22577L0415K8978K6446K3125J9730J6349J2578Q561N081K575P92l69l50
63423H96488J323M229P380R999J1718J2473J2561J2480J2361J1805J0491Q680
63411A011988O845N096L280J308r49l741p030j0141j2268j3240j3617j4160j5433
$$ plain form
63398 937938 920328 900046 877456 853584 829374 805203 781007 756676 732320 708416 685738
63387 685738 664980 646411 629974 615564 603023 592060 582549 574836 569320 565728 563279 561660 561462
63374 561462 563441 567681 573694 581074 589791 600025 611986 625931 642250 661435 683681 708340
63362 708340 734028 759682 785426 811990 839365 866536 892479 916776 939129 958963 975875
63351 975875 989997 1001520 1010238 1015881 1018499 1018177 1014768 1008363 999641 989310 977478 964070 949510
63338 949510 934422 918842 902297 884641 866334 847999 830313 814302 801140 791305 784190 778558
63326 778558 773133 766850 759181 750556 742027 734110 726030 716284 703806 688508 670947 651802 631563
63313 631563 610423 588463 566092 544299 524279 506682 491299 477493 464835 453231 442623
$$ packed form
63398I37938j7610k0282k2590k3872k4210k4171k4196k4331k4356k3904k2678
63387F85738k0758j8569j6437j4410j2541j0963r511p713n516l592k449j619j98
63374E61462J979M240O013P380Q717J0234J1961J3945J6319J9185K2246K4659
63362G08340K5688K5654K5744K6564K7375K7171K5943K4297K2353J9834J6912
63351I75875J4122J1523Q718N643K618l22l409o405q722j0331j1832j3408j4560
63338I49510j5088j5580j6545j7656j8307j8335j7686j6011j3162r835p115n632
63326G78558n425o283p669q625q529p917q080r746j2478j5298j7561j9145k0239
63313F31563k1140k1960k2371k1793k0020j7597j5383j3806j2658j1604j0608
$$ plain form
63302 442623 432888 424085 416475 410030 404089 397846 391142 384551 378692 373795 369886 366950 364704 362595
63288 362595 360316 358142 356481 355311 354234 352887 351104 348954 346953 346005 346685 348621 350871 352792 354234
63273 354234 355069 355096 354546 354220 354797 356107 357349 357994 358363 359230 360896 362763 363959 364256 364171 364252 364713 365788
63255 365788 367833 370736 373739 376384 379212 382917 387130 390829 393845 397188 401810 407803 414965 423357
63241 423357 432878 442939 453105 463697 475286 487944 501454 515887 531417 547786 564548 581776
63229 581776 599987 619305 639138 658828 678227 697522 716854 736395 756536 777675 799775
63218 799775 822251 844199 864668 882923 898721 912319 923961 933240 939234 941396 940130 936220
63206 936220 929813 920341 907420 891471 873340 853717 833188 812470 792111 772169 752645 734156
$$ packed form
63302D42623r735q803p610o445n941o243o704o591n859m897l909k936k246k109
63288C62595k279k174j661j170j077j347j783k150k001r48O80J936K250J921J442
63273C54234Q35K7n50l26N77J310J242O45L69Q67J666J867J196K97q5Q1M61J075
63255C65788K045K903L003K645K828L705M213L699L016L343M622N993P162Q392
63241D23357R521J0061J0166J0592J1589J2658J3510J4433J5530J6369J6762J7228
63229E81776J8211J9318J9833J9690J9399J9295J9332J9541K0141K1139K2100
63218G99775K2476K1948K0469J8255J5798J3598J1642R279N994K162j266l910
63206I36220o407r472j2921j5949j8131j9623k0529k0718k0359j9942j9524j8489
$$ plain form
63194 734156 717693 703725 692022 682434 675357 671245 670119 671787 676193 683200 692335 703111 715402
63181 715402 729277 744672 761499 779806 799479 820005 840886 862106 883760 905384 926085
63170 926085 945272 962788 978354 991372 1001347 1008070 1011301 1010731 1006420 998773 987880 973349 955099
63157 955099 933873 910568 885461 858576 830498 802203 774290 746938 720466 695222 670932
63146 670932 646936 623356 601407 582152 565429 550396 536679 524456 513800 504561 496725 490245
63134 490245 484533 478680 472362 466216 461235 458072 456853 457217 458355 459359 459721 459414 458596 457585 456996
63119 456996 457291 458011 458032 456881 455429 454898 455562 456786 457988 459057 460026 460896 461773 462776 463792 464585 465100
63102 465100 465391 465375 464964 464387 464032 464010 464204 464680 465652 467008 468280 469181 469894 470705 471646 472640 473798 475438
$$ packed form
63194G34156j6463j3968j1703r588p077m112j126J668M406P007R135J0776J2291
63181G15402J3875J5395J6827J8307J9673K0526K0881K1220K1654K1624K0701
63170I26085J9187J7516J5566J3018R975O723L231n70m311p647j0893j4531j8250
63157I55099k1226k3305k5107k6885k8078k8295k7913k7352k6472k5244k4290
63146F70932k3996k3580k1949j9255j6723j5033j3717j2223j0656r239p836o480
63134D90245n712n853o318o146m981l163j219L64J138J004L62l07q18j011n89
63119D56996K95P20K1j151j452n31O64J224J202J069R69Q70Q77J003J016P93N15
63102D65100K91j6m11n77l55k2J94M76R72J356J272R01P13Q11R41R94J158J640
$$ plain form
63084 475438 477931 481529 486125 491181 496091 500644 504897 508754 512093 515299 519138 523886 529058 534302
63070 534302 540110 547219 555616 564686 574195 584575 596195 608877 622328 636729 652640 670526
63058 670526 690619 713052 737813 764585 792892 822524 853665 886499 920908 956744 994289
63047 994289 1034049 1076024 1119468 1163598 1208295 1253863 1300381 1347720 1396018 1445492 1495598
63036 1495598 1544874 1591977 1636607 1679077 1719198 1755995 1788386 1815666 1837183 1851923 1858772
63025 1858772 1857241 1847781 1831325 1808537 1779520 1744312 1703608 1658912 1611964 1564128 1516385 1469671
63013 1469671 1424926 1382806 1343674 1308146 1277441 1252844 1234682 1222088 1213953 1209988 1210676 1216402
63001 1216402 1227038 1242320 1262102 1285956 1312927 1342053 1373044 1406136 1441400 1478425 1516527
$$ packed form
63084D75438K493L598M596N056M910M553M253L857L339L206L839M748N172N244
63070E34302N808P109Q397R070R509J0380J1620J2682J3451J4401J5911J7886
63058F70526K0093K2433K4761K6772K8307K9632L1141L2834L4409L5836L7545
63047I94289L9760M1975M3444M4130M4697M5568M6518M7339M8298M9474N0106
63036A495598M9276M7103M4630M2470M0121L6797L2391K7280K1517J4740O849
63025A858772j531r460j6456k2788k9017l5208m0704m4696m6948m7836m7743m6714
63013A469671m4745m2120l9132l5528l0705k4597j8162j2594q135l965O88N726
63001A216402J0636J5282J9782K3854K6971K9126L0991L3092L5264L7025L8102
$$ plain form
62990 1516527 1554933 1592801 1629325 1663769 1695207 1722441 1744564 1761513 1773651 1780758 1781799 1775718
62978 1775718 1762159 1741411 1714038 1680610 1641507 1596975 1547750 1495517 1442123 1388187 1333099
62967 1333099 1276681 1220312 1166025 1114956 1067100 1022143 979904 940147 902578 867154 834081
62956 834081 803539 775589 750149 726841 705095 684718 666121 649606 634647 620319 606260
62945 606260 592722 579833 567413 555527 544593 534752 525581 516719 508434 501292 495426 490326 485199
62932 485199 479519 473463 467895 463646 460634 457894 454589 450769 447023 443744 440991 438823 437320 436268
62918 436268 435176 433755 432263 431239 430977 431319 431904 432517 433170 433894 434584 435082 435358 435508 435593 435558 435433 435556
62900 435556 436430 438193 440253 441681 442120 442159 442586 443457 444177 444404 444430 444641 445055 445625 446550 447963 449618 451215
$$ packed form
62990A516527L8406L7868L6524L4444L1438K7234K2123J6949J2138P107J041o081
62978A775718j3559k0748k7373l3428l9103m4532m9225n2233n3394n3936n5088
62967A333099n6418n6369n4287n1069m7856m4957m2239l9757l7569l5424l3073
62956H34081l0542k7950k5440k3308k1746k0377j8597j6515j4959j4328j4059
62945F06260j3538j2889j2420j1886j0934r841r171q862q285p142n866n100n127
62932D85199n680o056n568m249l012k740l305l820l746l279k753k168j503j052
62918D36268j092j421j492j024k62L42N85O13O53P24O90M98K76J50Q5l5j25J23
62900D35556Q74J763K060J428M39L9M27Q71P20K27K6K11M14N70R25J413J655J597
$$ plain form
62882 451215 452825 454640 456544 458311 459927 461310 461918 461235 459520 457539 455554 453221 450526 448155 446592
62867 446592 445413 443862 441798 439698 437979 436685 435625 434508 433079 431411 429907 428847 428131 427723 428077
62852 428077 429697 432383 435309 437832 439881 441507 442459 442439 441594 440491 439682 439398 439567 439935 440138 439882 439223
62835 439223 438641 438623 439140 439710 440135 440948 442802 445527 448224 450404 452617 455613 459236 462545 464925 466580
62819 466580 467908 468927 469604 470397 471975 474443 477296 480223 483578 487762 492477 497074 501503 506361 511910
62804 511910 517617 523043 528668 535264 542715 550156 557285 564972 574418 586177 600178 616219 634081
62791 634081 653524 674558 697610 723211 751646 783115 817970 856593 899157 945710 996315
62780 996315 1050929 1109287 1171038 1235736 1302507 1369997 1436952 1502645 1566510 1627568 1684511
$$ packed form
62882D51215J610J815J904J767J616J383O08o83j715j981j985k333k695k371j563
62867D46592j179j551k064k100j719j294j060j117j429j668j504j060p16m08L54
62852D28077J620K686K926K523K049J626R52k0q45j103q09k84J69L68K03k56o59
62835D39223n82j8N17N70M25Q13J854K725K697K180K213K996L623L309K380J655
62819D66580J328J019O77P93J578K468K853K927L355M184M715M597M429M858N549
62804E11910N707N426N625O596P451P441P129P687R446J1759J4001J6041J7862
62791F34081J9443K1034K3052K5601K8435L1469L4855L8623M2564M6553N0605
62780I96315N4614N8358O1751O4698O6771O7490O6955O5693O3865O1058N6943
$$ plain form
62769 1684511 1736042 1780772 1817076 1843674 1860295 1867285 1864632 1851912 1829206 1797474 1757903 1711459
62757 1711459 1659297 1602969 1543776 1482297 1419037 1355243 1292549 1231972 1173751 1118099 1065599
62746 1065599 1016707 971288 928907 889393 852920 819635 789412 761981 737202 715119 695730
62735 695730 678756 663747 650432 638831 628940 620462 613008 606447 600837 596049 591769 588024 585518
62722 585518 585187 587362 591453 596532 602156 608577 616196 625044 634941 646084 659170 674788 692879
62709 692879 713024 735203 760049 788362 820503 856312 895471 937896 983820 1033546 1087092
62698 1087092 1144125 1204281 1267332 1332750 1399188 1464801 1528174 1588582 1645157 1696244 1740066
62687 1740066 1775804 1803388 1822262 1831064 1828869 1816259 1794641 1764813 1726816 1681134 1629407 1573694
$$ packed form
62769A684511N1531M4730L6304K6598J6621O990k653j2720k2706l1732l9571m6444
62757A711459n2162n6328n9193o1479o3260o3794o2694o0577n8221n5652n2500
62746A065599m8892m5419m2381l9514l6473l3285l0223k7431k4779k2083j9389
62735F95730j6974j5009j3315j1601r891q478p454o561n610m788m280l745k506
62722E85518l31K175M091N079N624O421P619Q848R897J1143J3086J5618J8091
62709F92879K0145K2179K4846K8313L2141L5809L9159M2425M5924M9726N3546
62698A087092N7033O0156O3051O5418O6438O5613O3373O0408N6575N1087M3822
62687A740066L5738K7584J8874Q802k195j2610k1618k9828l7997m5682n1727n5713
$$ plain form
62675 1573694 1515371 1455033 1393165 1330615 1268522 1208088 1150358 1095941 1044843 996733 951434
62664 951434 909166 870338 835174 803436 774413 747318 721872 698448 677461 658780 642005
62653 642005 627176 614662 604121 594069 583041 571117 559895 550880 544220 539052 534627 530730
62641 530730 527199 523598 519643 515721 512634 510759 509637 508478 506926 505189 503558 502030 500469 498909
62627 498909 497546 496511 495744 495069 494358 493710 493467 493846 494488 494604 493791 492602 492048 492612 494033 496010 498739
62610 498739 502559 507361 512653 518238 524610 532564 542438 553871 566371 580040 595507 613113 632502
62597 632502 653304 675959 701399 729878 760518 792088 823855 855556 886910 917415 946310
62586 946310 972539 995062 1013445 1027851 1038163 1043498 1043008 1036878 1026045 1011158 992448 970446
$$ packed form
62675A573694n8323o0338o1868o2550o2093o0434n7730n4417n1098m8110m5299
62664I51434m2268l8828l5164l1738k9023k7095k5446k3424k0987j8681j6775
62653F42005j4829j2514j0541j0052j1028j1924j1222r015o660n168m425l897
62641E30730l531l601l955l922l087j875j122j159j552j737j631j528j561j560
62627D98909j363j035p67o75p11o48k43L79O42J16q13j189n54N64J421J977K729
62610D98739L820M802N292N585O372P954R874J1433J2500J3669J5467J7606J9389
62597F32502K0802K2655K5440K8479L0640L1570L1767L1701L1354L0505K8895
62586I46310K6229K2523J8383J4406J0312N335m90o130j0833j4887j8710k2002
$$ plain form
62574 970446 946119 920095 892387 863119 833091 803279 774141 745757 718428 692783 669364
62563 669364 648242 628994 610988 593905 578040 563895 551460 540195 529783 520466 512444 505352
62551 505352 498694 492490 487148 482913 479782 477675 476303 475049 473461 471801 470713 470449 470792 471652 473211
62536 473211 475398 477701 479692 481496 483552 486177 489533 493844 499482 506823 516017 526853 539017 552566
62522 552566 567960 585386 604384 624560 646466 671163 698925 729018 760877 794785 831053
62511 831053 869042 907470 945286 981773 1016129 1047534 1075526 1099852 1120027 1135448 1145934
62500 1145934 1151793 1153405 1151089 1145332 1136769 1125930 1113355 1099922 1086653 1074089 1062241 1051193
62488 1051193 1041340 1032881 1025515 1018994 1013571 1009507 1006297 1002798 998013 991442 982805 971939 959025
$$ packed form
62574I70446k4327k6024k7708k9268l0028k9812k9138k8384k7329k5645k3419
62563F69364k1122j9248j8006j7083j5865j4145j2435j1265j0412r317q022p092
62551E05352o658o204n342m235l131k107j372j254j588j660j088k64L43Q60J559
62536D73211K187K303J991J804K056K625L356M311N638P341R194J0836J2164J3549
62522E52566J5394J7426J8998K0176K1906K4697K7762L0093L1859L3908L6268
62511H31053L7989L8428L7816L6487L4356L1405K7992K4326K0175J5421J0486
62500A145934N859J612k316n757q563j0839j2575j3433j3269j2564j1848j1048
62488A051193r853q459p366o521n423m064l210l499m785o571q637j0866j2914
$$ plain form
62475 959025 944430 928129 909602 888598 865747 842059 817933 792993 766925 740121 713376
62464 713376 687167 661540 636643 613110 591743 572897 556244 541127 527088 514072 502246
62453 502246 491744 482524 474409 467247 461035 455838 451525 447698 444063 440860 438701 437871 437927 438140 438169
62438 438169 438155 438331 438751 439279 439557 439055 437462 435060 432466 430095 428124 426843 426441 426317 425256 422719
62422 422719 419590 417185 415831 414883 413878 413055 412793 413058 413481 413549 412712 410784 408385 406545 405670 405226 404557
62405 404557 403640 402919 402827 403751 405978 409227 412509 415023 417142 420164 425020 431435 438297 444639 450313
62390 450313 455958 462302 469378 476520 483233 489818 496901 504573 512371 519933 527233 534275 541083 548023
62376 548023 555613 563822 572016 579860 587858 596749 606846 618369 631941 648062 666284 685728 706513
$$ packed form
62475I59025j4595j6301j8527k1004k2851k3688k4126k4940k6068k6804k6745
62464G13376k6209k5627k4897k3533k1367j8846j6653j5117j4039j3016j1826
62453E02246j0502r220q115p162o212n197m313l827l635l203k159q30N6K13K9
62438D38169j4J76M20N28K78n02j593k402k594k371j971j281m02j24j061k537
62422D22719l129k405j354r48j005q23k62K65M23O8q37j928k399j840q75m44o69
62405D04557r17p21r2R24K227L249L282K514K119L022M856O415O862O342N674
62390D50313N645O344P076P142O713O585P083P672P798P562P300P042O808O940
62376E48023P590Q209Q194P844P998Q891J0097J1523J3572J6121J8222J9444K0785
$$ plain form
62363 706513 730031 757567 789163 824135 862027 902461 944400 986415 1027759 1068638 1109255
62352 1109255 1149014 1186810 1221714 1253113 1280463 1303227 1320874 1332795 1338482 1338073 1332508 1322754
62340 1322754 1308999 1290972 1268935 1243811 1216237 1186043 1153098 1118408 1083791 1050356 1017683
62329 1017683 984755 951473 918909 888091 858992 830977 803978 778681 755538 734052 713285
62318 713285 692834 673085 654691 638038 623032 609174 595994 583653 572992 564708 558602 553853
62306 553853 549814 546245 543030 540227 538316 537800 538487 539604 540724 542084 543912 545960 547951 549931 551861
62291 551861 553343 554167 554758 555619 556649 557500 558299 559394 560592 561307 561484 561727 562343 562849 562783 562596 563275 565278
62273 565278 568234 571713 575975 581867 590150 601041 614329 629756 647290 667177 689946 716319
$$ packed form
62363G06513K3518K7536L1596L4972L7892M0434M1939M2015M1344M0879M0617
62352A109255L9759L7796L4904L1399K7350K2764J7647J1921N687m09n565r754
62340A322754j3755j8027k2037k5124k7574l0194l2945l4690l4617l3435l2673
62329A017683l2928l3282l2564l0818k9099k8015k6999k5297k3143k1486k0767
62318G13285k0451j9749j8394j6653j5006j3858j3180j2341j0661q284o106m749
62306E53853m039l569l215k803j911n16O87J117J120J360J828K048J991J980J930
62291E51861J482Q24N91Q61J030Q51P99J095J198P15J77K43O16N06o6j87O79K003
62273E65278K956L479M262N892Q283J0891J3288J5427J7534J9887K2769K6373
$$ plain form
62261 716319 746854 781537 819790 860880 904106 948517 992794 1035795 1077139 1116952 1155002
62250 1155002 1190324 1221610 1247703 1267662 1280780 1286877 1286448 1280287 1268866 1252166 1230062 1202801
62238 1202801 1171121 1136045 1098606 1059686 1019972 980007 940330 901638 864745 830327 798673
62227 798673 769683 742967 717926 693962 670915 649282 629725 612375 596794 582609 569878
62216 569878 558756 549192 541084 534403 528927 524120 519586 515439 511952 509060 506558 504639 503767 503998
62202 503998 504820 505800 507131 509393 512918 517545 522903 528849 535591 543345 551904 560743 569619 578897 589114
62187 589114 600359 612259 624374 636340 647715 657993 666811 674053 679899 684975 690264 696531 703894
62174 703894 712240 721986 734019 748800 765866 784413 804218 825860 850103 877022 905641 934455
$$ packed form
62261G16319L0535L4683L8253M1090M3226M4411M4277M3001M1344L9813L8050
62250A155002L5322L1286K6093J9959J3118O097m29o161j1421j6700k2104k7261
62238A202801l1680l5076l7439l8920l9714l9965l9677l8692l6893l4418l1654
62227G98673k8990k6716k5041k3964k3047k1633j9557j7350j5581j4185j2731
62216E69878j1122r564q108o681n476m807m534m147l487k892k502j919q72K31
62202E03998Q22R80J331K262L525M627N358N946O742P754Q559Q839Q876R278J0217
62187E89114J1245J1900J2115J1966J1375J0278Q818P242N846N076N289O267P363
62174G03894Q346R746J2033J4781J7066J8547J9805K1642K4243K6919K8619K8814
$$ plain form
62162 934455 962431 989430 1015546 1040265 1062483 1081128 1095404 1104679 1108656 1107687 1102463 1093362 1080478
62149 1080478 1064283 1045653 1025149 1002729 978387 952642 926140 899308 872734 847532 824835
62138 824835 805091 788105 773528 761062 750530 742188 736757 734764 736015 740091 747187 757921 772352
62125 772352 789650 808843 829487 851415 874122 896787 918935 940884 963362 986487 1009179
62114 1009179 1029757 1047152 1061312 1072428 1080236 1084444 1085524 1084597 1082695 1080518 1078765 1078136 1078970 1081344
62100 1081344 1085628 1092499 1102272 1114609 1129027 1145267 1163034 1181888 1201703 1222766 1244979 1267323
62088 1267323 1288674 1308890 1328530 1347671 1365709 1382434 1398624 1415309 1432893 1451226 1470096
62077 1470096 1489224 1508139 1526574 1544847 1563422 1582169 1600396 1617598 1633783 1649018 1663018
$$ packed form
62162I34455K7976K6999K6116K4719K2218J8645J4276R275L977r69n224r101j2884
62149A080478j6195j8630k0504k2420k4342k5745k6502k6832k6574k5202k2697
62138H24835j9744j6986j4577j2466j0532q342n431j993J251M076P096J0734J4431
62125G72352J7298J9193K0644K1928K2707K2665K2148K1949K2478K3125K2692
62114A009179K0578J7395J4160J1116P808M208J080r27j902k177j753o29Q34K374
62100A081344M284O871R773J2337J4418J6240J7767J8854J9815K1063K2213K2344
62088A267323K1351K0216J9640J9141J8038J6725J6190J6685J7584J8333J8870
62077A470096J9128J8915J8435J8273J8575J8747J8227J7202J6185J5235J4000
$$ plain form
62066 1663018 1675348 1685819 1694549 1701795 1707801 1712658 1716259 1718518 1719604 1719677 1718361 1714840 1708739 1700735
62052 1700735 1692001 1683061 1673306 1661496 1646602 1628288 1606821 1582565 1555482 1525136 1491169 1453687
62040 1453687 1413167 1370250 1325737 1280542 1235434 1190831 1146948 1104029 1062353 1022215 984060
62029 984060 948450 915722 885750 858174 832647 808763 786048 764355 743992 725172 707608
62018 707608 691020 675765 662383 650699 639955 629864 620938 613767 608588 605655 605266 607075 609956
62005 609956 613125 617005 622474 629588 637537 645540 653124 659648 664314 666835 667575 666824 664310 659661 652961
61990 652961 644633 635065 624670 614024 603547 593188 582768 572498 562743 553351 543780 534036 524981
61977 524981 517403 511160 505594 500431 495788 491621 487827 484750 482866 481870 480800 479274 477983 477620 477947
$$ packed form
62066A663018J2330J0471Q730P246O006M857L601K259J086P3j316l521o101q004
62052A700735q734q940r755j1810j4894j8314k1467k4256k7083l0346l3967l7482
62040A453687m0520m2917m4513m5195m5108m4603m3883m2919m1676m0138l8155
62029I84060l5610l2728k9972k7576k5527k3884k2715k1693k0363j8820j7564
62018G07608j6588j5255j3382j1684j0744j0091q926p171n179k933l89J809K881
62005F09956L169L880N469P114P949Q003P584O524M666K521P40p51k514m649o700
61990F52961q328r568j0395j0646j0477j0359j0420j0270r755r392r571r744r055
61977E24981p578o243n566n163m643m167l794l077j884r96j070j526j291l63L27
$$ plain form
61962 477947 478375 478906 479899 481335 483039 485418 489257 494863 501955 510307 519953 530791 542607 555559
61948 555559 570159 586736 605318 626015 648966 673908 700311 727951 756875 786821 817320
61937 817320 848440 880659 913723 946224 976674 1004531 1029878 1052649 1072562 1089373 1102848
61926 1102848 1112831 1119638 1123954 1126039 1125585 1122756 1118809 1115094 1111866 1108787 1106328 1105890 1108480 1113904
61912 1113904 1121361 1130402 1141088 1153517 1167395 1182038 1196644 1210473 1222635 1231959 1237563 1239533
61900 1239533 1238466 1234152 1225370 1211457 1193528 1173566 1152665 1130787 1107836 1084184 1060200 1035977
61888 1035977 1011634 987417 963437 939698 916471 894288 873594 854601 837315 821355 805937
61877 805937 790569 775687 762160 750293 739786 730568 723024 717391 713491 711265 711107 713458 718437
$$ packed form
61962D77947M28N31R93J436J704K379L839N606P092Q352R646J0838J1816J2952
61948E55559J4600J6577J8582K0697K2951K4942K6403K7640K8924K9946L0499
61937H17320L1120L2219L3064L2501L0450K7857K5347K2771J9913J6811J3475
61926A102848R983O807M316K085m54k829l947l715l228l079k459m38K590N424
61912A113904P457R041J0686J2429J3878J4643J4606J3829J2162R324N604J970
61900A239533j067m314q782j3913j7929j9962k0901k1878k2951k3652k3984k4223
61888A035977k4343k4217k3980k3739k3227k2183k0694j8993j7286j5960j5418
61877H05937j5368j4882j3527j1867j0507r218p544n633l900k226j58K351M979
$$ plain form
61864 718437 726002 736123 748672 763531 780959 801550 825744 853701 885716 922272 963349 1007978
61852 1007978 1054788 1102876 1151992 1201997 1252300 1301679 1348488 1391098 1428328 1459648 1485207
61841 1485207 1505723 1522033 1534390 1542358 1545690 1545167 1542274 1538198 1533566 1529052 1525687 1524442 1525851
61828 1525851 1529990 1536384 1543907 1551214 1557462 1562334 1565360 1565626 1562195 1554289 1541041 1521626 1495991
61815 1495991 1465035 1429804 1390848 1348564 1303690 1257162 1209848 1162787 1117315 1074458 1034331
61804 1034331 996484 960703 927243 896504 868867 844727 824208 806765 791313 776877 763044
61793 763044 749885 737597 726265 715829 706199 697344 689208 681565 674115 666735 659526 652632 646212
61780 646212 640520 635735 631631 627628 623251 618392 613203 608038 603518 600295 598577 598064 598344 599102 600001
$$ packed form
61864G18437P565J0121J2549J4859J7428K0591K4194K7957L2015L6556M1077M4629
61852A007978M6810M8088M9116N0005N0303M9379M6809M2610L7230L1320K5559
61841A485207K0516J6310J2357P968L332n23k893m076m632m514l365j245J409
61828A525851M139O394P523P307O248M872L026K66l431p906j3248j9415k5635
61815A495991l0956l5231l8956m2284m4874m6528m7314m7061m5472m2857m0127
61804A034331l7847l5781l3460l0739k7637k4140k0519j7443j5452j4436j3833
61793G63044j3159j2288j1332j0436r630q855q136p643p450p380p209o894o420
61780F46212n692m785m104m003m377m859n189n165m520l223j718n13K80P58Q99
$$ plain form
61765 600001 600860 602097 604507 608322 612784 616917 620440 623785 627568 632243 637778 643347 647755 650637
61751 650637 652958 655928 659712 663602 667089 670097 672378 673478 673455 673049 672894 672975 673038 673137 673424 673660 673337
61734 673337 672327 671159 670566 670815 671576 672468 673621 675496 678191 681138 683694 685874 688290 691405 695012
61719 695012 698402 700944 702540 703574 704442 705105 705204 704527 703115 700891 697564 693137 688167 683212 678170
61704 678170 672581 666510 660737 655918 651767 647291 641869 636029 631024 627562 625102 622621 619860 617345
61690 617345 615289 613194 610789 608667 607428 606719 605737 604318 602832 601330 599604 597951 596997 596699 596427
61675 596427 596255 597308 600291 604308 607812 610335 612679 615650 619292 623301 627606 632373 637756 643751
61661 643751 650120 656413 662312 667966 673843 680259 687136 694176 701065 707582 713726 719717 725684 731365
$$ packed form
61765F00001Q59J237K410L815M462M133L523L345L783M675N535N569M408K882
61751F50637K321K970L784L890L487L008K281J100k3m06j55Q1O3R9K87K36l23
61734F73337j010j168n93K49P61Q92J153J875K695K947K556K180K416L115L607
61719F95012L390K542J596J034Q68O63R9o77j412k224l327m427m970m955n042
61704F78170n589o071n773m819m151m476n422n840n005l462k460k481k761k515
61690F17345k056k095k405k122j239p09r82j419j486j502j726j653r54k98k72
61675E96427j72J053K983M017L504K523K344K971L642M009M305M767N383N995
61661F43751O369O293N899N654N877O416O877P040O889O517O144N991N967N681
$$ plain form
61647 731365 736325 740415 743664 745750 746000 744201 741090 737719 734529 731342 727996 724447 720320 714957
61633 714957 708181 700594 692846 684967 676755 668513 660936 654397 648758 643841 639684 636308 633568 631289
61619 631289 629235 626950 623977 620298 616245 611936 607099 601535 595407 588996 582575 576586 571453 566921
61605 566921 561985 555786 548352 540331 532424 525287 519430 514671 510054 504844 499372 494446 490268 486459
61591 486459 482860 479554 476276 472587 468642 465004 461623 457804 453452 449541 446784 444451 441209 436828
61577 436828 432357 428744 425857 422964 419730 416554 414147 412931 412687 412679 412177 410991 409535 408403 407815 407441
61561 407441 406790 405837 405113 405052 405435 405716 405768 405919 406317 406737 407138 407889 409171 410550 411573 412502 414124 416952
61543 416952 420898 425478 429958 433515 435787 437299 438918 440807 442297 442912 443139 443879 445286 446377 445842
$$ packed form
61647G31365M960M090L249K086K50j799l111l371l190l187l346l549m127n363
61633G14957o776p587p748p879q212q242p577o539n639m917m157l376k740k279
61619F31289k054k285k973l679m053m309m837n564o128o411o421n989n133m532
61605E66921m936o199p434q021p907p137n857m759m617n210n472m926m178l809
61591D86459l599l306l278l689l945l638l381l819m352l911k757k333l242m381
61577D36828m471l613k887k893l234l176k407j216k44qn02j186j456j132n88l74
61561D07441o51r53p24o1L83K81N2J51L98M20M01P51J282J379J023R29J622K828
61543D16952L946M580M480L557K272J512J619J889J490O15K27P40J407J091n35
$$ plain form
61528 445842 443215 439311 435521 432597 430151 427364 423955 420214 416340 412246 408083 404407 401508 398932
61514 398932 396075 393098 390870 389971 389987 389766 388256 385205 381300 377607 374695 372322 370054 367903 366091
61499 366091 364424 362466 360269 358393 357033 355708 354111 352764 352318 352535 352566 352072 351539 351472 351833 352402 353185
61482 353185 354198 355204 356028 356895 358120 359558 360722 361476 362302 363667 365247 366025 365317 363590 362090 361657
61466 361657 362062 362511 362551 362297 362073 362143 362640 363384 363820 363567 363103 363492 365226 367567 369267 369808 369810 370386 372217
61447 372217 375122 378321 381120 383334 385123 386689 388368 390814 394600 399615 405234 410984 416611 421571
61433 421571 425229 427830 430618 434477 438885 442689 445463 447623 449609 451655 454062 456947 459736 461611
61419 461611 462513 463165 464025 464805 465134 465090 464695 463384 460476 456034 450847 445616 440458 435286 430364 426247
$$ packed form
61528D45842k627l904l790k924k446k787l409l741l874m094m163l676k899k576
61514C98932k857k977k228q99J6k21j510l051l905l693k912k373k268k151j812
61499C66091j667j958k197j876j360j325j597j347m46K17L1m94n33o7L61N69P83
61482C53185J013J006Q24Q67J225J438J164P54Q26J365J580P78p08j727j500m33
61466C61657M05M49M0k54k24P0M97P44M36k53m64L89J734K341J700N41KN76J831
61447C72217K905L199K799K214J789J566J679K446L786N015N619N750N627M960
61433D21571L658K601K788L859M408L804K774K160J986K046K407K885K789J875
61419D61611R02O52Q60P80L29m4l95j311k908m442n187n231n158n172m922m117
$$ plain form
61403 426247 423118 420450 417513 414144 410707 407371 403908 400353 397303 395101 393150 390650 387778 385519
61389 385519 384428 384117 383948 383563 382712 381295 379828 379264 380003 381456 382839 383957 384952 385834 386686 387959
61373 387959 389987 392405 394512 396055 397307 398547 399909 401705 404380 408012 412088 415886 418991 421512
61359 421512 424048 427416 432239 438741 446936 456778 467850 479231 490174 500964 512607 525478 538751
61346 538751 551409 563423 575382 587242 598095 607265 615028 621946 627944 632505 635425 636775 636266
61333 636266 633369 628262 622098 615956 609900 603428 596496 589575 582894 576156 569069 561793 554839 548750
61319 548750 543867 540109 536970 533981 531156 528758 526801 525089 523719 523075 523326 524346 526188 529182 533386
61304 533386 538337 543610 549230 555186 560804 565060 567433 568211 568010 567274 566161 564595 562324 559155 555278
$$ packed form
61403D26247l129k668k937l369l437l336l463l555l050k202j951k500k872k259
61389C85519j091l11j69l85q51j417j467n64P39J453J383J118R95Q82Q52J273
61373C87959K028K418K107J543J252J240J362J796K675L632M076L798L105K521
61359D21512K536L368M823O502Q195R842J1072J1381J0943J0790J1643J2871J3273
61346E38751J2658J2014J1959J1860J0853R170P763O918N998M561K920J350n09
61333F36266k897n107o164o142o056o472o932o921o681o738p087p276o954o089
61319E48750m883l758l139k989k825k398j957j712j370o44K51J020J842K994M204
61304E33386M951N273N620N956N618M256K373P78k01p36j113j566k271l169l877
$$ plain form
61289 555278 551320 547927 545238 542832 540254 537568 535284 533843 533382 534021 535993 539231 543090 546851 550327
61274 550327 553718 557177 560953 565738 572192 580093 588603 597500 607572 619562 633231 647811 662914
61261 662914 678670 695273 712739 730799 748698 765434 780494 794090 806287 816191 822505 824765
61249 824765 823601 819868 813919 805755 795556 783858 771377 758670 745956 733273 720786 708795
61237 708795 697436 686758 677153 669269 663183 658079 653187 648762 645594 643697 642137 640245 638454 637655
61223 637655 638013 638780 639181 639213 639492 640478 642012 643642 645155 646538 647611 648170 648575 649722 652196 655762
61207 655762 659931 664663 670260 676998 685256 695627 708272 722434 737162 752447 769064 787389
61195 787389 806989 827378 848536 870457 892749 914972 936941 958415 978872 997876 1015312
$$ packed form
61289E55278l958l393k689k406k578k686k284j441m61O39J972L238L859L761L476
61274E50327L391L459L776M785O454P901Q510Q897J0072J1990J3669J4580J5103
61261F62914J5756J6603J7466J8060J7899J6736J5060J3596J2197R904O314K260
61249H24765j164l733n949q164j0199j1698j2481j2707j2714j2683j2487j1991
61237G08795j1359j0678r605p884o086n104m892m425l168j897j560j892j791p99
61223F37655L58P67M01L2K79R86J534J630J513J383J073N59M05J147K474L566
61207F55762M169M732N597O738Q258J0371J2645J4162J4728J5285J6617J8325
61195G87389J9600K0389K1158K1921K2292K2223K1969K1474K0457J9004J7436
$$ plain form
61184 1015312 1030985 1044271 1054602 1062124 1067530 1071349 1073649 1074261 1072952 1069419 1063502 1055415 1045558
61171 1045558 1034064 1020797 1005807 989460 972031 953498 933970 914049 894384 875008 855592
61160 855592 836337 818177 801868 787308 774095 762362 752578 744712 738208 732720 728266 724566 720915
61147 720915 717067 713696 711519 710346 709461 708623 708118 708033 708126 708398 709173 710488 711938 713410 715615 719587
61131 719587 725870 734426 745140 758086 773325 790659 809745 830476 853174 878273 905698 934679
61119 934679 964253 993869 1023353 1052465 1080853 1108414 1135364 1161800 1187328 1211163 1232453
61108 1232453 1250512 1265027 1276166 1284324 1289618 1291774 1290578 1286256 1279188 1269386 1256480 1240222 1220775
61095 1220775 1198450 1173404 1145851 1116535 1086640 1057010 1027612 998001 968266 939260 911887
$$ packed form
61184A015312J5673J3286J0331P522N406L819K300O12j309l533n917q087r857
61171A045558j1494j3267j4990j6347j7429j8533j9528j9921j9665j9376j9416
61160H55592j9255j8160j6309j4560j3213j1733r784p866o504n488m454l700l651
61147G20915l848l371k177j173q85q38n05q5R3K72P75J315J450J472K205L972
61131G19587O283Q556J0714J2946J5239J7334J9086K0731K2698K5099K7425K8981
61119I34679K9574K9616K9484K9112K8388K7561K6950K6436K5528K3835K1290
61108A232453J8059J4515J1139Q158N294K156j196m322p068r802j2906j6258j9447
61095A220775k2325k5046k7553k9316k9895k9630k9398k9611k9735k9006k7373
$$ plain form
61084 911887 886503 863092 841651 822112 804143 787411 772008 758308 746402 735891 726269 717355
61072 717355 709325 702478 697000 692853 689872 687964 687130 687314 688384 690376 693532 697960 703446 709797 717150
61057 717150 725722 735458 746282 758524 772654 788628 805940 824460 844813 867643 892754 919209
61045 919209 946129 973117 999972 1026363 1052069 1077468 1103530 1131108 1160299 1190583 1221400
61034 1221400 1252279 1282523 1311318 1338384 1364311 1390061 1416438 1444139 1473889 1506125 1540832
61023 1540832 1578051 1618279 1662028 1709406 1760773 1817665 1882550 1957904 2046232 2150957 2276461
61012 2276461 2427313 2608727 2828803 3100266 3440472 3871625 4421777 5121283 5988765
61003 5988765 7011412 8136611 9288703 10404089 11459926 12476191 13493839 14548352
$$ packed form
61084I11887k5384k3411k1441j9539j7969j6732j5403j3700j1906j0511r622q914
61072G17355q030o847n478m147k981j908q34J84J070J992L156M428N486O351P353
61057G17150Q572R736J0824J2242J4130J5974J7312J8520K0353K2830K5111K6455
61045I19209K6920K6988K6855K6391K5706K5399K6062K7578K9191L0284L0817
61034A221400L0879L0244K8795K7066K5927K5750K6377K7701K9750L2236L4707
61023A540832L7219M0228M3749M7378N1367N6892O4885P5354Q8328J04725J25504
61012B276461J50852J81414K20076K71463L40206M31153N50152O99506Q67482
61003E988765J022647J125199J152092J115386J055837J016265J017648J054513
$$ plain form
60995 14548352 15652779 16789613 17907049 18923816 19749623 20316483 20603191 20637756 20478261
60986 20478261 20185220 19799193 19331389 18768694 18089096 17278719 16341315 15296969 14174502
60977 14174502 13004833 11818854 10647942 9523283 8472530 7515639 6662545 5913761
60969 5913761 5263097 4700971 4216953 3800817 3442600 3132838 2863405 2628029 2421865
60960 2421865 2240855 2081761 1942359 1820944 1715628 1624389 1545526 1477456 1418160 1365414
60950 1365414 1317709 1274516 1235486 1199750 1166063 1133374 1101143 1069349 1038142 1007390 976755
60939 976755 946407 917208 889639 862919 836010 809305 784469 762484 742642 723655 705041
60928 705041 687102 670221 654547 639931 625905 612157 599136 587722 578243 570397 564123 559680
$$ packed form
60995A4548352J104427J136834J117436J016767Q25807N66860K86708L4565j59495
60986B0478261k93041l86027m67804n62695o79598q10377r37404j044346j122467
60977A4174502j169669j185979j170912j124659j050753r56891q53094p48784
60969E913761o50664n62126m84018m16136l58217l09762k69433k35376k06164
60960B421865j81010j59094j39402j21415j05316r1239p8863o8070n9296n2746
60950A365414m7705m3193l9030l5736l3687l2689l2231l1794l1207l0752l0635
60939I76755l0348k9199k7569k6720k6909k6705k4836k1985j9842j8987j8614
60928G05041j7939j6881j5674j4616j4026j3748j3021j1414r479p846o274m443
$$ plain form
60916 559680 556671 553911 550684 547348 544344 541539 539086 537891 538334 539266 539239 538155 536760 535078 532550
60901 532550 529404 526664 524765 523115 521100 518722 516156 513525 511252 509919 509503 509324 508894 508282 507569
60886 507569 506605 505521 504910 505139 505898 506714 507590 508873 510697 512798 514777 516478 518146 520086 522089 523502
60870 523502 524179 524991 526807 529263 531195 532124 532527 532677 532152 530815 529465 528966 529221 529530 529625 529841 530423
60853 530423 531079 531250 530644 529565 528711 528478 528420 527635 525697 522947 519960 517174 515050 514050 514178 514991 516241
60836 516241 518053 520208 521810 522199 521908 522187 523766 526486 529938 533948 538442 543283 548290 553155 557386
60821 557386 560615 563031 565251 567706 570293 572604 574256 575011 574830 573898 572477 570699 568625 566424 564241
60806 564241 561852 558667 554261 548831 543028 537410 532104 526879 521410 515539 509458 503658 498514 493792
$$ packed form
60916E59680l009k760l227l336l004k805k453j195M43R32k7j084j395j682k528
60901E32550l146k740j899j650k015k378k566k631k273j333m16j79m30o12p13
60886E07569r64j084o11K29P59Q16Q76J283J824K101J979J701J668J940K003J413
60870E23502O77Q12J816K456J932R29M03J50n25j337j350m99K55L09R5K16N82
60853E30423O56J71o06j079q54k33n8p85j938k750k987k786k124j000J28Q13J250
60836E16241J812K155J602L89k91K79J579K720L452M010M494M841N007M865M231
60821E57386L229K416K220K455K587K311J652P55j81r32j421j778k074k201k183
60806E64241k389l185m406n430n803n618n306n225n469n871o081n800n144m722
$$ plain form
60792 493792 488738 482890 476784 471584 467857 464939 461736 457995 454444 451733 449611 447319 444504 441474
60778 441474 438681 436258 434109 432226 430834 430281 430879 432738 435655 439208 443081 447288 451988 457083 462193
60763 462193 467148 472312 478197 484845 491833 498838 505870 512958 520013 527135 534652 542586 550385 557564
60749 557564 564360 571300 578266 584450 589250 592798 595521 597528 598634 598707 597793 596022 593512 590286 586247
60734 586247 581405 576154 571134 566707 562650 558418 553627 548221 542308 535945 529155 522128 515261 508796
60720 508796 502454 495781 488951 482865 478125 474313 470697 467294 464599 462444 459951 456761 453643 451588
60706 451588 450835 451047 451913 453149 454360 455412 456697 458623 461061 463675 466569 470160 474571 479578 485022
60691 485022 490859 496833 502565 507953 513083 517718 521303 523595 524938 525735 525965 525458 524330 522851 521050
$$ packed form
60792D93792n054n848o106n200l727k918l203l741l551k711k122k292k815l030
60778D41474k793k423k149j883j392n53N98J859K917L553L873M207M700N095N110
60763D62193M955N164N885O648O988P005P032P088P055P122P517P934P799P179
60749E57564O796O940O966O184M800L548K723K007J106P3r14j771k510l226m039
60734E86247m842n251n020m427m057m232m791n406n913o363o790p027o867o465
60720E08796o342o673o830o086m740l812l616l403k695k155k493l190l118k055
60706D51588p53K12Q66J236J211J052J285J926K438K614K894L591M411N007N444
60691D85022N837N974N732N388N130M635L585K292J343P97K30n07j128j479j801
$$ plain form
60676 521050 518753 515952 512879 509704 506436 503211 500480 498683 497697 496731 494870 491753 487770 483658 479995
60661 479995 477072 475012 473866 473618 474257 475853 478391 481530 484710 487627 490451 493485 496762 500186 503835
60646 503835 507753 511493 514386 516461 518694 522054 526620 532010 538275 545696 553852 561741 569113 577003
60632 577003 586488 597366 608601 619707 631141 643530 657094 671771 687353 703459 719836 736755
60620 736755 754663 773398 792191 810564 828736 846945 864863 882050 898532 914429 929238
60609 929238 942079 952628 961347 968682 974388 977814 978524 976486 971879 965045 956543 946843 935888 923174
60595 923174 908461 892248 875329 858054 840370 822498 805052 788314 771835 755106 738310
60584 738310 721997 706306 691047 676445 663182 651606 641418 632265 624146 617030 610511 604258
$$ packed form
60676E21050k297k801l073l175l268l225k731j797r86r66j861l117l983m112l663
60661D79995k923k060j146k48O39J596K538L139L180K917K824L034L277L424L649
60646E03835L918L740K893K075K233L360M566N390O265P421Q156P889P372P890
60632E77003R485J0878J1235J1106J1434J2389J3564J4677J5582J6106J6377J6919
60620G36755J7908J8735J8793J8373J8172J8209J7918J7187J6482J5897J4809
60609I29238J2841J0549Q719P335N706L426P10k038m607o834q502r700j0955j2714
60595I23174j4713j6213j6919j7275j7684j7872j7446j6738j6479j6729j6796
60584G38310j6313j5691j5259j4602j3263j1576j0188r153q119p116o519o253
$$ plain form
60572 604258 598490 593651 589802 586686 584237 582680 582191 582739 584184 586212 588152 589187 588971 587983 587132
60557 587132 586940 587056 586583 584992 582704 580637 579165 577798 576020 574180 573211 573580 574828 576203 577533
60542 577533 579331 582164 586045 590386 594440 597747 600235 602015 603154 603631 603409 602557 601236 599466 596900
60527 596900 593090 588186 583188 579204 576567 574991 574408 575030 576570 578078 578992 579859 581509 583861 586151
60512 586151 588138 590369 593213 596311 599313 602635 607028 612628 618962 625881 634122 644800 658542 675156
60498 675156 693952 714155 735133 756445 777737 798486 817828 834712 848319 858316 864717 867572
60486 867572 866773 862100 853454 841149 825933 808548 789235 767894 744754 720687 696721 673548
60474 673548 651656 631614 613829 598167 584166 571486 559864 548847 538067 527718 518310 509980
$$ packed form
60572F04258n768m839l849l116k449j557m89N48J445K028J940J035k16r88q51
60557E87132j92J16m73j591k288k067j472j367j778j840r69L69J248J375J330
60542E77533J798K833L881M341M054L307K488J780J139M77k22q52j321j770k566
60527E96900l810m904m998l984k637j576n83O22J540J508R14Q67J650K352K290
60512E86151J987K231K844L098L002L322M393N600O334O919Q241J0678J3742J6614
60498F75156J8796K0203K0978K1312K1292K0749J9342J6884J3607R997O401K855
60486H67572p99m673q646j2305j5216j7385j9313k1341k3140k4067k3966k3173
60474F73548k1892k0042j7785j5662j4001j2680j1622j1017j0780j0349r408q330
$$ plain form
60462 509980 502500 495920 490579 486368 482569 478715 475108 472172 469791 467646 465809 464488 463480 462354
60448 462354 460981 459452 457697 455578 453272 451075 448931 446606 444285 442537 441579 440950 440075 438914 437848
60433 437848 437128 436630 436132 435693 435651 436217 437181 438184 439179 440348 441555 442338 442613 442976 443918 445068 445662 445587
60415 445587 445496 445955 446874 447814 448547 449226 450197 451612 453148 454274 454972 455890 457480 459285 460499 460988 461197
60398 461197 461253 460867 460126 459724 460202 461449 463147 465207 467547 469918 472201 474504 476787 478826 480785 483229
60382 483229 486235 489052 491126 492929 495100 497213 498284 498355 498619 499791 501217 501974 502222 502830 504093 505438
60366 505438 506289 506693 507023 507477 507995 508417 508631 508733 509122 510275 512305 514796 517181 519201 521040 523106
60350 523106 525758 529107 533036 537493 542731 549043 556141 563045 568848 573519 577750 582089 586449 590337
$$ packed form
60462E09980p480o580n341m211l799l854l607k936k381k145j837j321j008j126
60448D62354j373j529j755k119k306k197k144k325k321j748r58o29q75j161j066
60433D37848p20m98m98m39m2N66R64J003R95J169J207P83K75L63R42J150N94p5
60415D45587r1M59R19R40P33O79R71J415J536J126O98R18J590J805J214M89K09
60398D61197N6l86p41m02M78J247J698K060K340K371K283K303K283K039J959K444
60382D83229L006K817K074J803K171K113J071P1K64J172J426P57K48O08J263J345
60366E05438Q51M04L30M54N18M22K14J02L89J153K030K491K385K020J839K066
60350E23106K652L349L929M457N238O312P098O904N803M671M231M339M360L888
$$ plain form
60336 590337 593231 594722 594686 593489 591744 589651 586773 582695 577680 572379 567062 561547 555940 551004 547505
60321 547505 545333 543556 541394 538974 537084 536262 536284 536527 536690 537132 538672 542170 548039 555837 564376 572609
60305 572609 580504 588767 597661 606503 614510 621728 628710 635456 641151 644907 646378 645617 642773 638175
60291 638175 632415 626050 619255 611988 604538 597722 592380 588693 586153 584257 583005 582532 582461 582088 581180
60276 581180 580109 579018 577399 574865 571895 569207 566622 563205 558551 553328 548390 543904 539607 535445
60262 535445 531487 527518 523274 519131 516064 514606 513993 512711 510006 506691 504199 502959 502068 500582 498630
60247 498630 496946 495765 494802 494094 494099 494811 495520 495873 496644 498904 502603 506512 509486 511388 512843 514515
60231 514515 516752 519624 522979 526539 530047 533354 536398 539188 541817 544401 547007 549649 552295 554779
$$ packed form
60336E90337K894J491l6j197j745k093k878m078n015n301n317n515n607m936l499
60321E47505k172j777k162k420j890q22K2K43J63M42J540L498N869P798Q539Q233
60305E72609P895Q263Q894Q842Q007P218O982O746N695L756J471p61k844m598
60291F38175n760o365o795p267p450o816n342l687k540j896j252m73p1l73r08
60276E81180j071j091j619k534k970k688k585l417m654n223m938m486m297m162
60262E35445l958l969m244m143l067j458o13j282k705l315k492j240q91j486j952
60247D98630j684j181r63p08NP12P09L53P71K260L699L909K974J902J455J672
60231E14515K237K872L355L560L508L307L044K790K629K584K606K642K646K484
$$ plain form
60217 554779 556817 558339 559765 561702 564283 567011 569443 571794 574629 578009 581250 583603 584962 585826
60203 585826 586709 587681 588382 588373 587576 586464 585739 585705 586046 586295 586402 586688 587334 588152 588821 589182 589230 589030 588672 588241
60183 588241 587727 587010 585975 584723 583700 583514 584322 585385 585642 584937 584296 584653 585684 586489 587036 588125 589983
60166 589983 591842 593122 594267 595946 598079 600163 602040 603763 605115 605890 606445 607393 608891 610644 612459
60151 612459 614331 616187 618032 620258 623330 627255 631820 637261 644185 652767 662386 672126 681363 689957
60137 689957 698173 706373 714444 721624 727203 731193 733923 735258 734845 733002 730549 727653 723543 717707
60123 717707 710798 703992 697862 692190 686518 680474 673895 667078 660744 655415 650897 646597 642288 638258
60109 638258 634830 631958 629324 626689 624109 621859 620177 619062 618356 617965 617949 618480 619822 622278 626080
$$ packed form
60217E54779K038J522J426J937K581K728K432K351K835L380L241K353J359Q64
60203E85826Q83R72P01rp97j112p25l4L41K49J07K86O46Q18O69L61M8k00l58m31
60183E88241n14p17j035j252j023j86Q08J063K57p05o41L57J031Q05N47J089J858
60166E89983J859J280J145J679K133K084J877J723J352P75N55R48J498J753J815
60151F12459J872J856J845K226L072L925M565N441O924Q582R619R740R237Q594
60137F89957Q216Q200Q071P180N579L990K730J335m13j843k453k896m110n836
60123G17707o909o806o130n672n672o044o579o817o334n329m518m300m309m030
60109F38258l428k872k634k635k580k250j682j115p06l91j6N31J342K456L802
$$ plain form
60094 626080 631390 638423 647295 657594 668465 679423 690805 702993 715513 727430 738396 748626
60082 748626 757931 765551 771101 775014 777750 779146 778840 776806 773065 767344 759515 750104 739945 729520
60068 729520 718958 708464 698302 688477 678794 669266 660180 651773 644064 637043 630904 625891 621855
60055 621855 618085 613869 609334 605415 602755 600974 599303 597615 596270 595304 594501 594117 594701 596181 597893
60040 597893 599541 601279 602716 602871 601527 599668 598004 595958 592815 589074 585695 582572 578801 574182
60026 574182 569509 565456 561835 557880 552627 545319 536236 527016 519429 513766 508977 504257 499818 496163
60012 496163 493404 491377 489776 487996 485443 482216 479082 476668 475079 474235 474019 474026 473873 473913 475103 477906
59996 477906 481813 486133 490641 495179 499257 502552 505447 508576 512047 515489 518644 521538 524230 526635
$$ packed form
60094F26080N310P033Q872J0299J0871J0958J1382J2188J2520J1917J0966J0230
60082G48626R305P620N550L913K736J396l06k034l741n721p829r411j0159j0425
60068G29520j0562j0494j0162r825r683r528r086q407p709p021o139n013m036
60055F21855l770m216m535l919k660j781j671j688j345r66q03l84N84J480J712
60040E97893J648J738J437J55j344j859j664k046l143l741l379l123l771m619
60026E74182m673m053l621l955n253p308r083r220p587n663m789m720m439l655
60012D96163k759k027j601j780k553l227l134k414j589q44k16Pj53M0J190K803
59996D77906L907M320M508M538M078L295K895L129L471L442L155K894K692K405
$$ plain form
59982 526635 528551 529761 530335 530892 532126 533807 534696 533824 531572 529089 526979 525182 523915 523924 525535 528012
59966 528012 530222 531706 532834 534129 535783 537736 539905 542197 544355 545885 546235 545214 543301 541393
59952 541393 540008 538814 537088 534561 531553 528263 524399 519792 515061 511168 508311 505801 503129 500706
59938 500706 499185 498394 497428 495686 493431 491292 489605 488400 487740 487783 488505 489616 490834 492247 494277 497147
59922 497147 500460 503470 505853 508051 510743 514148 517972 521841 525555 529019 532234 535365 538570 541715
59908 541715 544460 546738 548982 551707 554926 558073 560555 562304 563719 565073 566136 566547 566480 566645 567550
59893 567550 569060 570810 572809 575350 578476 581911 585500 589453 594031 599130 604307 609139 613519 617655
59879 617655 621815 626088 630395 634629 638695 642444 645717 648467 650681 652174 652660 652064 650531 648117 644735
$$ packed form
59982E26635J916J210N74N57J234J681Q89q72k252k483k110j797j267RJ611K477
59966E28012K210J484J128J295J654J953K169K292K158J530L50j021j913j908
59952E41393j385j194j726k527l008l290l864m607m731l893k857k510k672k423
59938E00706j521p91r66j742k255k139j687j205o60M3P22J111J218J413K030K870
59922D97147L313L010K383K198K692L405L824L869L714L464L215L131L205L145
59908E41715K745K278K244K725L219L147K482J749J415J354J063M11o7J65R05
59893E67550J510J750J999K541L126L435L589L953M578N099N177M832M380M136
59879F17655M160M273M307M234M066L749L273K750K214J493M86n96j533k414l382
$$ plain form
59864 644735 640523 635956 631389 626758 621975 617377 613556 610928 609672 609816 611018 612475 613471 614062 614962
59849 614962 616808 619759 623672 628318 633367 638398 642950 646592 649113 650772 652055 652965 652843 651250 648782
59834 648782 646536 644899 643294 641034 637960 634232 629985 625275 620009 613888 606779 599133 591666 584563
59820 584563 577393 569898 562464 555670 549723 544536 540049 536254 533119 530654 528826 527341 525726 523847
59806 523847 522103 520904 520098 519101 517492 515324 512944 510654 508551 506619 504917 503562 502533 501632 500709
59791 500709 499733 498557 496922 494979 493440 492747 492338 491364 490030 489547 490650 492814 495162 497526 500196
59776 500196 503108 505860 508339 510876 513823 517293 521235 525505 529881 534235 538632 543148 547615 551695
59762 551695 555202 558322 561513 565110 568953 572536 575731 579169 583584 588948 594742 600954 608115 616129
$$ packed form
59864F44735m212m567m567m631m783m598l821k628j256J44J202J457R96N91R00
59849F14962J846K951L913M646N049N031M552L642K521J659J283R10j22j593k468
59834F48782k246j637j605k260l074l728m247m710n266o121p109p646p467p103
59820E84563p170p495p434o794n947n187m487l795l135k465j828j485j615j879
59806E23847j744j199q06r97j609k168k380k290k103j932j702j355j029r01r23
59791E00709r76j176j635j943j539o93m09r74j334m83J103K164K348K364K670
59776E00196K912K752K479K537K947L470L942M270M376M354M397M516M467M080
59762E51695L507L120L191L597L843L583L195L438M415N364N794O212P161Q014
$$ plain form
59748 616129 623789 629913 634545 638556 642516 646475 650492 654546 658029 660039 660400 659913 659463 659278 659234 659372
59732 659372 659684 659666 658617 656479 654133 652677 652454 652820 652809 651937 650362 648446 646452 644721 643826 644172 645489
59715 645489 647064 648603 650577 653536 657300 661127 664569 667788 671085 674480 677932 681590 685566 689668
59701 689668 693695 697741 701815 705304 707349 707834 707490 706881 705731 703549 700536 697477 694976 693069 691358
59686 691358 689243 686265 682567 678797 675365 672055 668656 665519 663013 660698 657648 653435 648300 642586
59672 642586 636617 631007 626292 622248 618223 614175 610660 607670 604373 600359 596411 593498 591530 589705
59658 589705 587688 585821 584407 583375 582577 581998 581646 581555 581825 582402 582884 582760 581752 579818 577058 573909
59642 573909 571161 569321 567991 566269 563836 561322 559459 558153 556753 555168 554309 555106 557224 559210 560036
$$ packed form
59748F16129P660O124M632M011L960L959M017M054L483K010L61m87m50j85m4J38
59732F59372L12j8j049k138k346j456k23L66j1q72j575j916j994j731q95L46J317
59715F45489J575J539J974K959L764L827L442L219L297L395L452L658L976M102
59701F89668M027M046M074L489K045M85l44o09j150k182l013l059k501j907j711
59686F91358k115k978l698l770l432l310l399l137k506k315l050m213n135n714
59672F42586n969n610m715m044m025m048l515k990l297m014l948k913j968j825
59658E89705k017j867j414j032p98n79l52r1K70N77M82j24j008j934k760l149
59642E73909k748j840j330j722k433k514j863j306j400j585q59P97K118J986Q26
$$ plain form
59627 560036 560109 560439 561124 561236 560065 557931 555645 553669 552066 550879 550229 550175 550604 551191 551467 551128 550318
59610 550318 549462 548909 548957 550017 552211 554925 557286 559092 560733 562203 562941 562856 562765 563383 564491 565531 566527
59593 566527 567890 569692 571644 573482 574927 575602 575427 574837 574197 573292 571840 570145 568758 567742 566757 565629
59577 565629 564286 562372 559601 556387 553577 551500 549731 547764 545477 542941 540231 537576 535369 533896
59563 533896 533239 533401 534286 535647 537297 539242 541370 543216 544424 545329 546649 548667 551101 553764 556959
59548 556959 561238 567085 574868 584736 596436 609380 622868 636169 648669 660348 671937 684210
59536 684210 697129 710027 722420 734173 745003 754486 762719 770453 778329 786377 794390 802318 809966
59523 809966 816658 821641 824729 826222 826233 824335 820008 813370 805256 796440 786831 775728 762973 749464
$$ packed form
59627E60036P3L30O85J12j171k134k286j976j603j187o50n4M29N87K76l39q10
59610E50318q56n53M8J060K194K714K361J806J641J470P38q5r1O18J108J040R96
59593E66527J363J802J952J838J445O75j75n90o40r05j452j695j387j016r85j128
59577E65629j343j914k771l214k810k077j769j967k287k536k710k655k207j473
59563E33896o57J62Q85J361J650J945K128J846J208R05J320K018K434K663L195
59548E56959M279N847P783R868J1700J2944J3488J3301J2500J1679J1589J2273
59536F84210J2919J2898J2393J1753J0830R483Q233P734P876Q048Q013P928P648
59523H09966O692M983L088J493J1j898m327o638q114q816r609j1103j2755j3509
$$ plain form
59509 749464 736203 723203 709851 696236 683437 672414 663161 655202 648341 642526 637374 632434 627817
59496 627817 624073 621384 619259 617188 615315 614199 614105 614796 615941 617431 619329 621880 625640 631121 637971
59481 637971 644942 651199 657372 664656 673058 681322 688602 695279 701808 707685 712172 715369 717829 719666
59467 719666 720897 722348 725298 730256 736746 744242 752701 762237 772934 785094 799114 815027 832511
59454 832511 851206 870401 888551 903911 915904 925344 933143 939286 943149 944191 942063 936589 927984
59441 927984 916707 902940 886654 868462 849861 832198 815769 800258 785730 772763 761883
59430 761883 753358 747397 744138 743418 744941 748699 755042 764304 776508 791479 809024 828762 849625
59417 849625 869630 886556 899256 908293 915058 920335 923917 925392 924785 922403 918529 913381 906967 898858
$$ packed form
59509G49464j3261j3000j3352j3615j2799j1023r253p959o861n815n152m940m617
59496F27817l744k689k125k071j873j116r4O91J145J490J898K551L760N481O850
59481F37971O971O257O173P284Q402Q264P280O677O529N877M487L197K460J837
59467G19666J231J451K950M958O490P496Q459R536J0697J2160J4020J5913J7484
59454H32511J8695J9195J8150J5360J1993R440P799O143L863J042k128n474q605
59441I27984j1277j3767j6286j8192j8601j7663j6429j5511j4528j2967j0880
59430G61883q525n961l259p20J523L758O343R262J2204J4971J7545J9738K0863
59417H49625K0005J6926J2700R037O765N277L582J475o07k382l874n148o414q109
$$ plain form
59403 898858 888522 876127 862758 849659 837469 826184 815326 803943 790916 775777 759084
59392 759084 741740 724212 706670 689525 673352 658429 644777 632603 622275 613844 606917 601060
59380 601060 596077 591875 588340 585444 583229 581553 580041 578499 577260 576876 577436 578381 579120 579738 580935
59365 580935 583306 586857 591280 596497 602760 610289 619090 629167 640765 654241 669667 686668 704766
59352 704766 723931 744613 767036 790532 813852 836116 857188 877078 895290 910952 923346
59341 923346 932175 937592 940056 939819 936417 929103 917943 904023 888274 870708 851291 830938 810869
59328 810869 791403 772315 754108 737951 724255 712219 700974 690485 681119 672985 666036 660252
59316 660252 655495 651606 648811 647450 647136 646831 646149 646082 648024 652471 658927 666589 674658 682373 689252
$$ packed form
59403H98858j0336j2395j3369j3099j2190j1285j0858j1383j3027j5139j6693
59392G59084j7344j7528j7542j7145j6173j4923j3652j2174j0328q431o927n857
59380F01060m983m202l535k896k215j676j512j542j239l84N60R45P39O18J197
59365E80935K371L551M423N217O263P529Q801J0077J1598J3476J5426J7001J8098
59352G04766J9165K0682K2423K3496K3320K2264K1072J9890J8212J5662J2394
59341I23346Q829N417K464k37l402p314j1160j3920j5749j7566j9417k0353k0069
59328H10869j9466j9088j8207j6157j3696j2036j1245j0489r366q134o949n784
59316F60252m757l889k795j361l14l05o82o7J942M447O456P662Q069P715O879
$$ plain form
59301 689252 695241 700456 704998 709136 713211 716992 719471 719693 717628 714020 709608 704716 699420 693909
59287 693909 688811 685170 683810 684697 687336 691744 698486 707584 718112 729183 740778 753297 766869
59274 766869 781529 797351 813730 829096 842215 853550 864558 875709 885819 893278 897299 898044
59262 898044 896171 892455 887328 880612 872000 861833 851065 840423 829900 819146 808093 797160
59250 797160 787096 778657 772206 767548 764245 762041 760840 760489 760858 762026 764132 767076 770582 774415
59236 774415 778217 781227 782501 781486 778212 773047 766482 759026 750959 742148 732284 721235 709093 696075
59222 696075 682687 669793 658129 647766 638349 629735 622041 615127 608516 601934 595566 589669 584283
59209 584283 579453 575476 572689 571194 570930 571779 573422 575178 576285 576457 576174 576436 578069 581115 584837
$$ packed form
59301F89252N989N215M542M138M075L781K479K22k065l608m412m892n296n511
59287F93909n098l641j360Q87K639M408O742R098J0528J1071J1595J2519J3572
59274G66869J4660J5822J6379J5366J3119J1335J1008J1151J0110P459M021P45
59262H98044j873l716n127o716q612j0167j0768j0642j0523j0754j1053j0933
59250G97160j0064q439o451m658l303k204j201l51L69J168K106K944L506L833
59236G74415L802L010J274j015l274n165o565p456q067q811r864j1049j2142j3018
59222F96075j3388j2894j1664j0363r417q614p694o914o611o582o368n897n386
59209E84283m830l977k787j495k64Q49J643J756J107J72k83K62J633L046L722
$$ plain form
59194 584837 588436 591771 595291 599315 603607 607654 611188 614329 617440 620928 625031 629578 634103 638451
59180 638451 643210 649219 656548 664328 671857 679602 688685 699488 711317 723480 736069 749320 762723
59167 762723 775315 786555 796394 804692 811213 816109 819730 821871 821795 819188 814576 808605 801389 792841
59153 792841 783183 772830 762096 751361 741147 731667 722531 713229 703741 694476 685813 677977 671077
59140 671077 665041 659702 655180 651907 649975 648710 647279 645649 644691 645335 647833 651781 656745 662791 670355
59125 670355 679547 689776 700418 711719 724615 739642 756456 774379 792862 811372 829506 847509
59113 847509 866098 885462 904964 924042 942692 960651 976902 990693 1002469 1013088 1022547 1030230
59101 1030230 1035957 1039924 1041938 1041665 1039596 1036814 1033656 1029348 1023152 1015337 1006827 998363 990145 981901
$$ packed form
59194E84837L599L335L520M024M292M047L534L141L111L488M103M547M525M348
59180F38451M759O009P329P780P529P745R083J0803J1829J2163J2589J3251J3403
59167G62723J2592J1240R839Q298O521M896L621K141p6k607m612n971p216q548
59153G92841r658j0353j0734j0735j0214r480r136r302r488r265q663p836o900
59140F71077o036n339m522l273j932j265j431j630r58O44K498L948M964O046P564
59125F70355R192J0229J0642J1301J2896J5027J6814J7923J8483J8510J8134J8003
59113H47509J8589J9364J9502J9078J8650J7959J6251J3791J1776J0619R459P683
59101A030230N727L967K014k73k069k782l158m308o196p815q510q464q218q244
$$ plain form
59087 981901 973165 963760 953954 943871 932989 920771 907662 894746 882403 869958 856842 843430
59075 843430 830442 818035 805964 794284 783411 773521 764171 754623 744505 734224 724672 716461
59063 716461 709481 703244 697382 691568 685272 678098 670440 663412 658023 654517 652383 650694 648531 645470
59049 645470 641829 638334 635662 634334 634672 636405 638582 640392 642085 644672 648791 654247 660574 667501
59035 667501 674854 682583 691150 701515 714464 730035 747620 766451 785993 806144 827065 848623
59023 848623 870085 890559 909641 927301 943320 957173 968460 977067 983020 986536 988152 988409 987458
59010 987458 985370 982708 980381 978992 978782 980004 982689 986045 988855 990752 992505 994780 997169 998826
58996 998826 999491 999362 998233 995366 990225 982994 974333 964778 954363 942711 929545 915182 900524
$$ packed form
59087I81901q736r405r806j0083j0882j2218j3109j2916j2343j2445j3116j3412
59075H43430j2988j2407j2071j1680j0873r890r350r548j0118j0281r552q211
59063G16461o980o237n862n814o296p174p658p028n389l506k134j689k163l061
59049F45470l641l495k672j328L38J733K177J810J693K587M119N456O327O927
59035F67501P353P729Q567J0365J2949J5571J7585J8831J9542K0151K0921K1558
59023H48623K1462K0474J9082J7660J6019J3853J1287Q607N953L516J616K57r51
59010I87458k088k662k327j389k10J222K685L356K810J897J753K275K389J657
58996I98826O65j29j129k867n141p231q661r555j0415j1652j3166j4363j4658
$$ plain form
58983 900524 886570 874028 863187 853910 845719 838232 831676 826842 824433 824539 826715 830400 835205 840980
58969 840980 847665 855144 863329 872436 882833 894363 906035 916751 926177 934512 941581 946663 949275
58956 949275 949675 948410 945691 941390 935489 928343 920605 912964 905984 900224 896322 894623 894587 895041 895252
58941 895252 895416 895813 895968 895179 893509 891556 889392 886277 881295 873830 863659 851308 838182 825614
58927 825614 813665 801404 788379 775177 762512 750468 738876 727883 717824 708915 701263 694874
58915 694874 689546 685129 681954 680655 681512 684317 688861 695047 702486 710478 718650 727305 737041 748237
58901 748237 760871 774589 789039 804452 821669 841217 862553 884727 907412 930703 954210
58890 954210 977301 1000120 1023381 1047003 1069712 1090082 1107244 1120570 1129613 1134601 1136163 1134255
$$ packed form
58983I00524j3954j2542j0841r277q191p487o556m834k409J06K176L685M805N775
58969H40980O685P479Q185R107J0397J1530J1672J0716R426Q335P069N082K612
58956I49275M00j265k719m301n901p146p738p641o980n760l902j699l6M54K11
58941H95252J64L97J55p89j670j953k164l115m982p465j0171j2351j3126j2568
58927H25614j1949j2261j3025j3202j2665j2044j1592j0993j0059q909p652o389
58915F94874n328m417l175j299Q57K805M544O186P439P992Q172Q655R736J1196
58901G48237J2634J3718J4450J5413J7217J9548K1336K2174K2685K3291K3507
58890I54210K3091K2819K3261K3622K2709K0370J7162J3326R043M988J562j908
$$ plain form
58878 1134255 1128174 1117920 1104635 1089275 1071693 1051548 1029444 1006608 984034 962474 942617
58867 942617 924686 908231 892836 878636 865857 854343 843905 834614 826395 818960 812515 807813
58855 807813 804835 802006 797440 790720 782860 774923 767242 759719 752276 745040 738344 732391 726750 720623
58841 720623 713824 706995 700673 694781 689345 684860 681332 677768 673465 669279 666655 665778 665618 665539 665827
58826 665827 666610 667231 667002 665916 664283 662129 659345 656175 653218 650888 648946 646655 643540 639974 636803
58811 636803 634407 632463 630605 628837 627126 625170 622854 620544 618584 616865 615159 613507 611993 610572
58797 610572 609396 608896 609235 610117 611368 613213 615683 618394 621306 625029 629886 635280 640610 646155 652327
58782 652327 658645 664334 669519 674889 680383 685098 688404 690390 691268 691145 690374 689486 688613 687482 686002
$$ packed form
58878A134255o081j0254j3285j5360j7582k0145k2104k2836k2574k1560j9857
58867I42617j7931j6455j5395j4200j2779j1514j0438r291q219p435o445m702
58855H07813k978k829m566o720p860p937p681p523p443p236o696n953n641o127
58841G20623o799o829o322n892n436m485l528l564m303m186k624q77j60p9K88
58826F65827P83O21k29j086j633k154k784l170k957k330j942k291l115l566l171
58811F36803k396j944j858j768j711j956k316k310j960j719j706j652j514j421
58797F10572j176n00L39Q82J251J845K470K711K912L723M857N394N330N545O172
58782F52327O318N689N185N370N494M715L306J986Q78j23p71q88q73j131j480
$$ plain form
58767 686002 684427 682941 681520 680198 679097 678248 677713 677773 678655 680200 682091 684197 686408 688496 690557
58752 690557 693229 696985 701484 706185 711293 717490 724952 733244 742055 751558 762161 774383 788699
58739 788699 804944 822130 839414 856989 875389 894194 912239 928921 944442 958739 971031
58728 971031 980635 987536 991930 993775 993111 990385 986279 981461 976517 971718 966795 961292 955156 948721
58714 948721 942269 935999 930228 925019 919621 912854 904190 893963 882539 869813 855676 840480 824787
58701 824787 808924 792996 777082 761345 746067 731549 717785 704388 691143 678537 667336
58690 667336 657673 648901 640374 632077 624423 617637 611439 605318 599179 593627 589335 586148 583324 580798
58676 580798 579572 580585 583761 588666 595359 603940 613815 624322 635699 648503 662230 675515 687683
$$ packed form
58767F86002j575j486j421j322j101q49n35O0Q82J545J891K106K211K088K061
58752F90557K672L756M499M701N108O197P462Q292Q811R503J0603J2222J4316
58739G88699J6245J7186J7284J7575J8400J8805J8045J6682J5521J4297J2292
58728I71031R604O901M394J845o64k726m106m818m944m799m923n503o136o435
58714I48721o452o270n771n209n398o767q664j0227j1424j2726j4137j5196j5693
58701H24787j5863j5928j5914j5737j5278j4518j3764j3397j3245j2606j1201
58690F67336r663q772q527q297p654o786o198o121o139n552m292l187k824k526
58676E80798j226J013L176M905O693Q581R875J0507J1377J2804J3727J3285J2168
$$ plain form
58663 687683 699231 710581 721085 729550 735295 738476 739754 739798 738845 736661 733022 728024 721827 714578
58649 714578 706976 700322 695307 691132 686580 681676 677481 674470 672063 669689 667442 665506 663709 661777
58635 661777 659501 656598 653055 649608 647183 645751 644377 642530 640732 639755 639861 641085 643685 647938 653794
58620 653794 661006 669394 678904 689568 701311 713620 725627 736867 747695 758534 769072 778714
58608 778714 787365 794991 800748 803522 803363 801527 799146 796631 794392 793082 792814 792934 792964 793177 793959 795258
58592 795258 797120 800243 805535 813265 822896 833554 844512 855427 866210 876688 886570 895831 904784
58579 904784 913468 921390 928254 934511 940706 946788 952702 959157 966947 975961 985766 996851 1010307 1026509
58565 1026509 1045160 1066335 1090219 1115809 1141226 1165546 1189243 1212418 1233694 1251407 1265145
$$ packed form
58663F87683J1548J1350J0504Q465N745L181J278M4r53k184l639m998o197p249
58649G14578p602o654n015m175m552m904m195l011k407k374k247j936j797j932
58635F61777k276k903l543l447k425j432j374j847j798r77J06J224K600M253N856
58620F53794P212Q388R510J0664J1743J2309J2007J1240J0828J0839J0538R642
58608G78714Q651P626N757K774j59j836k381k515k239j310k68J20L0K13P82J299
58592G95258J862L123N292P730R631J0658J0958J0915J0783J0478R882R261Q953
58579I04784Q684P922O864O257O195O082N914O455P790R014R805J1085J3456J6202
58565A026509J8651K1175K3884K5590K5417K4320K3697K3175K1276J7713J3738
$$ plain form
58554 1265145 1275539 1283129 1287797 1288901 1285720 1278168 1267110 1253524 1237515 1218752 1197683 1175463
58542 1175463 1152774 1129604 1106135 1082895 1060062 1037631 1016272 996947 979538 962987 947042
58531 947042 932771 921039 911610 904172 899106 896563 895668 895303 895026 894806 894596 894652 895510 897200 899129 901104
58515 901104 903765 907609 912308 917373 922725 928216 933362 938126 943360 949917 957667 965687 972971 978901
58501 978901 983557 987630 991442 994230 995202 995038 995104 995276 994008 990902 987698 986111 986040 986663 988051 990763
58485 990763 994853 1000212 1007028 1015041 1023116 1030380 1037120 1043798 1049898 1054483 1057185 1057888 1056152 1051703
58471 1051703 1044908 1036119 1025193 1012303 998416 984255 969600 954372 939681 926829 915878 906123
58459 906123 897447 890350 884975 880968 878047 876073 874839 874239 874273 874467 873893 872236 870231 868500 866642
$$ packed form
58554A265145J0394P590M668J104l181p552j1058j3586j6009j8763k1069k2220
58542A175463k2689k3170k3469k3240k2833k2431k1359j9325j7409j6551j5945
58531I47042j4271j1732r429p438n066k543q95l65k77k20k10N6Q58J690J929J975
58515I01104K661L844M699N065N352N491N146M764N234O557P750Q020P284N930
58501I78901M656M073L812K788R72j64O6J72j268l106l204j587p1O23J388K712
58485I90763M090N359O816Q013Q075P264O740O678O100M585K702P03j736m449
58471A051703o795q789j0926j2890j3887j4161j4655j5228j4691j2852j0951r755
58459I06123q676p097n375m007k921j974j234o00L4J94n74j657k005j731j858
$$ plain form
58444 866642 864159 861638 860209 860225 861167 862572 864483 867228 871123 876174 881985 888487 896780 908244 922551
58429 922551 937521 951465 964682 978055 991282 1003392 1014204 1024198 1033378 1041046 1046427 1048985
58417 1048985 1048563 1045647 1041066 1035114 1027581 1018816 1009930 1001635 993830 986659 980917 976912 973985 971779
58403 971779 970850 971380 972354 972866 973261 974201 975502 976718 977861 978670 978043 975135 970344 964506 957907 950716
58387 950716 943424 936148 928444 920496 913505 908268 904445 901841 901066 902137 903839 905507 908151 912739
58373 912739 918697 925220 932731 941722 951386 960712 969790 978785 986856 993538 999950 1007120 1014188 1019836
58359 1019836 1024383 1028924 1033384 1037087 1040304 1043603 1046535 1048538 1050299 1052747 1055651 1058699 1062895 1069163
58345 1069163 1076693 1084463 1093319 1104530 1117237 1129486 1141125 1153556 1167159 1180966 1194476 1207827
$$ packed form
58444H66642k483k521j429J6R42J405J911K745L895N051N811O502Q293J1464J4307
58429I22551J4970J3944J3217J3373J3227J2110J0812R994R180P668N381K558
58417A048985m22k916m581n952p533q765q886q295p805p171n742m005k927k206
58403I71779r29N30R74N12L95R40J301J216J143Q09o27k908m791n838o599p191
58387I50716p292p276p704p948o991n237l823k604p75J071J702J668K644M588
58373I12739N958O523P511Q991R664R326R078Q995Q071O682O412P170P068N648
58359A019836M547M541M460L703L217L299K932K003J761K448K904L048M196O268
58345A069163P530P770Q856J1211J2707J2249J1639J2431J3603J3807J3510J3351
$$ plain form
58333 1207827 1220540 1231895 1242215 1252103 1260903 1267603 1272676 1277272 1281210 1283696 1285458 1288178 1292215
58320 1292215 1296735 1301739 1308022 1315556 1323723 1332758 1343142 1354030 1364271 1374546 1386582 1400529
58308 1400529 1415050 1429649 1444888 1460563 1475645 1489971 1504230 1518470 1532254 1545985 1560413
58297 1560413 1575156 1589330 1603196 1617668 1632824 1648485 1665406 1684092 1703275 1721508 1739417
58286 1739417 1758516 1778835 1799733 1821862 1845916 1870581 1894305 1918156 1944334 1972830 2002290
58275 2002290 2033170 2067110 2104028 2142882 2184564 2230951 2281690 2334888 2390231 2448243 2507283
58264 2507283 2564804 2621103 2678377 2736489 2793115 2847672 2901525 2954684 3005992 3056323 3107922
58253 3107922 3160760 3213219 3266121 3322325 3382613 3445802 3512602 3585254 3663548 3745428 3831497
$$ packed form
58333A207827J2713J1355J0320R888Q800O700N073M596L938K486J762K720M037
58320A292215M520N004O283P534Q167R035J0384J0888J0241J0275J2036J3947
58308A400529J4521J4599J5239J5675J5082J4326J4259J4240J3784J3731J4428
58297A560413J4743J4174J3866J4472J5156J5661J6921J8686J9183J8233J7909
58286A739417J9099K0319K0898K2129K4054K4665K3724K3851K6178K8496K9460
58275B002290L0880L3940L6918L8854M1682M6387N0739N3198N5343N8012N9040
58264B507283N7521N6299N7274N8112N6626N4557N3853N3159N1308N0331N1599
58253C107922N2838N2459N2902N6204O0288O3189O6800P2652P8294Q1880Q6069
$$ plain form
58242 3831497 3924685 4025544 4132208 4244935 4366239 4496558 4634366 4780555 4938011 5106934
58232 5106934 5285383 5474387 5677512 5895622 6127276 6374027 6639831 6925751 7231226
58223 7231226 7559963 7918001 8306559 8724087 9175113 9669420 10212939 10808008 11462628
58214 11462628 12190274 13000428 13899303 14900785 16026713 17296819 18731384 20366037
58206 20366037 22252542 24445893 27007657 30026460 33622837 37939538 43158058 49541959
58198 49541959 57457984 67369153 79836640 95471768 114685983 137259395 162074834
58191 162074834 187378142 211477122 233361032 252810860 270039861 285217200 298163155
58184 298163155 308298281 314810939 316950789 314299310 306880716 295096335 279583205
$$ packed form
58242C831497R3188J00859J06664J12727J21304J30319J37808J46189J57456J68923
58232E106934J78449J89004K03125K18110K31654K46751K65804K85920L05475
58223G231226L28737L58038L88558M17528M51026M94307N43519N95069O54620
58214A1462628P27646Q10154Q98875J001482J125928J270106J434565J634653
58206B0366037J886505K193351K561764L018803L596377M316701N218520O383901
58198D9541959P916025R911169J2467487J5635128J9214215K2573412K4815439
58191A62074834K5303308K4098980K1883910J9449828J7229001J5177339J2945955
58184B98163155J0135126O512658K139850k651479p418594j1784381j5513130
$$ plain form
58177 279583205 261104513 240504910 218696506 196619794 175149605 154976786 136537361
58170 136537361 120026600 105462208 92742129 81687569 72088109 63741088 56464208
58163 56464208 50090411 44472667 39498980 35094231 31204764 27785205 24795488 22197574
58155 22197574 19949419 18005811 16325304 14871684 13609883 12507015 11537932 10684552
58147 10684552 9929663 9256282 8652364 8110321 7621512 7176115 6768392 6396736 6057918
58138 6057918 5745843 5456237 5187871 4938645 4704894 4485093 4279983 4088453 3907305
58129 3907305 3735533 3574841 3425382 3284886 3152517 3029601 2915782 2808324 2706191
58120 2706191 2611249 2524389 2443713 2367520 2295919 2228491 2163436 2100107 2039703 1982549 1927312
$$ packed form
58177B79583205j8478692k0599603k1808404k2076712k1470189k0172819j8439425
58170A36537361j6510761j4564392j2720079j1054560r599460q347021p276880
58163E6464208o373797n617744m973687m404749l889467l419559k989717k597914
58155B2197574k248155j943608j680507j453620j261801j102868r69083q53380
58147A0684552p54889o73381o03918n42043m88809m45397m07723l71656l38818
58138F057918l12075k89606k68366k49226k33751k19801k05110j91530j81148
58129C907305j71772j60692j49459j40496j32369j22916j13819j07458j02133
58120B706191r4942q6860q0676p6193p1601o7428o5055o3329o0404n7154n5237
$$ plain form
58109 1927312 1873622 1822810 1775285 1729739 1685582 1643616 1603666 1564115 1524568 1486512 1450699
58098 1450699 1416342 1383526 1353897 1328075 1304713 1282868 1263052 1245216 1227994 1210821 1194660
58087 1194660 1179837 1165243 1150422 1136361 1123358 1110035 1095200 1078841 1060700 1039989 1017245
58076 1017245 994534 973015 952091 931536 912393 894974 878006 860765 844296 829609 816361
58065 816361 804185 793586 784559 775826 766450 756935 748060 739909 732521 726038 719667 712040 703113 694228
58051 694228 685927 677356 668225 659508 651620 643797 635951 629240 623901 618340 611382 603785 596611 589759
58037 589759 583107 577420 572920 568437 563131 557754 553131 548702 543655 538213 532674 526417 518989 511182
58023 511182 504017 497672 492238 488307 485864 483752 481270 479205 478364 478187 477849 477582 477862 478376 478873 480075
$$ packed form
58109A927312n3690n0812m7525m5546m4157m1966l9950l9551l9547l8056l5813
58098A450699l4357l2816k9629k5822k3362k1845j9816j7836j7222j7173j6161
58087A194660j4823j4594j4821j4061j3003j3323j4835j6359j8141k0711k2744
58076A017245k2711k1519k0924k0555j9143j7419j6968j7241j6469j4687j3248
58065H16361j2176j0599r027q733r376r515q875q151p388o483o371p627q927q885
58051F94228q301q571r131q717p888p823p846o711n339n561o958p597p174o852
58037E89759o652n687m500m483n306n377m623m429n047n442n539o257p428p807
58023E11182p165o345n434l931k443k112k482k065q41j77l38k67K80N14M97J202
$$ plain form
58007 480075 482640 486192 490320 495533 502170 509472 516896 525359 535851 547723 559657 571550 584024
57994 584024 596723 608543 619131 628878 637706 645087 650984 655667 658771 659578 658130 655196 651174 645792
57980 645792 638744 629991 619627 608055 596059 584144 572076 559652 547576 536900 527859 519863
57968 519863 512390 505284 498455 491930 486114 481502 478108 475512 473296 471213 469187 467438 466411 466332 467044
57953 467044 468329 470006 471689 472913 473704 474582 475923 477811 480503 484368 489245 494549 500167 506512 513501
57938 513501 520269 526178 531438 536473 541437 546541 551947 556983 560277 561140 560108 557842 554306 549375
57924 549375 543316 536237 527945 518814 509899 501617 493194 483958 474331 464969 455842 446813 438280 430529
57910 430529 423245 416264 409937 404092 397738 390721 384590 380664 378031 374723 370188 365288 360413 355183
$$ packed form
58007D80075K565L552M128N213O637P302P424Q463J0492J1872J1934J1893J2474
57994E84024J2699J1820J0588R747Q828P381N897M683L104Q07j448k934m022n382
57980F45792p048q753j0364j1572j1996j1915j2068j2424j2076j0676r041p996
57968E19863p473p106o829o525n816m612l394k596k216k083k026j749j027p9P12
57953D67044J285J677J683J224P91Q78J341J888K692L865M877N304N618O345O989
57938E13501O768N909N260N035M964N104N406N036L294Q63j032k266l536m931
57924E49375o059p079q292r131q915q282q423r236r627r362r127r029q533p751
57910D30529p284o981o327n845o354p017o131l926k633l308m535m900m875n230
$$ plain form
57896 355183 349903 345932 344232 344413 345458 346762 348359 350666 354042 358196 362129 365100 367485 370252
57882 370252 373790 377644 381192 384089 386254 387867 389286 390652 391721 392272 392382 392145 391524 390724 390276 390510
57866 390510 391357 392744 394594 396274 396922 396657 396716 397889 399584 400910 401952 403337 405222 407323 409344
57851 409344 410864 411492 411647 412439 414112 415438 415322 414165 412910 411603 409836 407787 405759 403397 400452
57836 400452 397718 395985 394660 392681 390398 389226 389609 390621 391489 392415 393842 395937 398919 403038 408093
57821 408093 413634 419495 425472 430700 434206 435904 436295 435470 433236 429968 426318 422155 416731 409773 401571
57806 401571 392160 381503 370435 360255 351186 342204 332630 323010 314184 306308 299105 292368 285916
57793 285916 279682 274048 269530 266007 262846 259890 257670 256573 256460 257213 258948 261457 264110 266599 269277
$$ packed form
57896C55183n280l971j700J81J045J304J597K307L376M154L933K971K385K767
57882C70252L538L854L548K897K165J613J419J366J069N51J10k37o21q00m48K34
57866C90510Q47J387J850J680O48k65N9J173J695J326J042J385J885K101K021
57851D09344J520O28J55P92J673J326j16j157j255j307j767k049k028k362k945
57836D00452k734j733j325j979k283j172L83J012Q68R26J427K095K982M119N055
57821D08093N541N861N977N228L506J698L91q25k234l268l650m163n424o958q202
57806D01571r411j0657j1068j0180r069q982r574r620q826p876p203o737o452
57793B85916o234n634m518l523l161k956k220j097j13P53J735K509K653K489K678
$$ plain form
57778 269277 272554 276458 280883 285723 290561 294811 298337 301466 304262 306323 307396 307615 306948 305008 301691
57763 301691 297512 292983 288082 282592 276650 270704 265222 260590 256984 254154 251567 248955 246540 244659
57749 244659 243368 242409 241397 240061 238489 237059 235927 234831 233573 232370 231321 229958 227929 225806
57735 225806 224422 223562 222148 219796 217390 215862 215152 214729 214551 214948 215903 216958 217771 218448 219323 220580
57719 220580 222127 223690 224934 225456 224911 223487 222124 221726 222059 221981 220943 219675 219054 218991 218916 218697 218436
57702 218436 217902 216996 216290 216334 216788 217052 217351 218274 219618 220671 221446 222534 223873 224796 225400 226789 229727
57685 229727 233975 239238 245971 254937 266677 281763 301013 325418 356457 396399 447153 508180
57673 508180 575888 645301 712026 773083 827164 874637 916524 952757 981584 1000636 1007993 1002249
$$ packed form
57778B69277L277L904M425M840M838M250L526L129K796K061J073K19o67j940l317
57763C01691m179m529m901n490n942n946n482m632l606k830k587k612k415j881
57749B44659j291r59j012j336j572j430j132j096j258j203j049j363k029k123
57735B25806j384q60j414k352k406j528p10m23j78L97R55J055Q13O77Q75J257
57719B20580J547J563J244N22n45j424j363l98L33p8j038j268o21o3p5k19k61
57702B18436n34r06p06M4M54K64K99R23J344J053P75J088J339R23O04J389K938
57685B29727M248N263O733Q966J1740J5086J9250K4405L1039L9942N0754O1027
57673E08180O7708O9413O6725O1057N4081M7473M1887L6233K8827J9052P357n744
$$ plain form
57661 1002249 982584 949434 904768 851474 792768 732020 672189 615012 561280 511992 468529
57650 468529 431489 400172 373511 350809 331269 313740 297583 283201 271108 260964 252019 244004
57638 244004 237018 230913 225378 220365 215998 212208 208786 205653 202876 200606 199073 198342 198033 197599 196855
57623 196855 195782 193994 191111 187644 184733 182763 180998 178753 176180 173646 171222 169191 168259 168657 169686
57608 169686 170653 171657 172926 174049 174487 174273 173606 172262 170114 167758 165949 164730 163740 163014 162782 162724
57592 162724 162161 160926 159551 158586 158115 157816 157197 155846 153744 151250 148690 146174 143893 142146 140924
57577 140924 139843 138674 137467 136048 134029 131541 129287 127563 125932 124266 123296 123420 123759 123233 122078
57562 122078 121343 121295 121250 120847 120560 120861 121643 122557 123411 124148 124827 125658 126718 127736 128552 129595 131469 134094
$$ packed form
57661A002249j9665l3150m4666n3294n8706o0748n9831n7177n3732m9288m3463
57650D68529l7040l1317k6661k2702j9540j7529j6157j4382j2093j0144q945q015
57638B44004o986o105n535n013m367l790l422l133k777k270j533p31l09m34p44
57623A96855j073j788k883l467k911j970j765k245k573k534k424k031r32L98J029
57608A69686R67J004J269J123M38k14o67j344k148k356j809j219r90p26k32n8
57592A62724n63j235j375r65m71k99o19j351k102k494k560k516k281j747j222
57577A40924j081j169j207j419k019k488k254j724j631j666r70J24L39n26j155
57562A22078p35m8m5m03k87L01P82R14Q54P37O79Q31J060J018Q16J043J874K625
$$ plain form
57544 134094 136693 138590 139668 140055 139755 138718 137133 135564 134685 134630 134652 133778 131898 129756 127849 125910
57528 125910 123673 121492 119812 118624 117848 117605 117599 116871 114905 112559 111214 111306 112243 113329 114121 114289 113889
57511 113889 113569 113822 114263 114220 113738 113333 113098 112782 112534 112748 113326 113802 114102 114473 114773 114506 113466 111778
57493 111778 109515 106990 105200 105011 105904 106401 105838 104965 104682 104967 105256 105203 104832 104456 104640 105708 107129
57476 107129 107910 107689 106952 106177 105423 104823 104802 105585 106998 108862 110962 112532 112556 110887 108519 106496 105130
57459 105130 104441 104612 105552 106667 107579 108615 110129 111785 113003 113725 114255 114706 115044 115367 115666 115575 114876
57442 114876 114036 113715 113878 113891 113428 112847 112683 113193 114400 116101 117664 118218 117365 115618 113940 112900 112361
57425 112361 111872 111200 110494 110062 110049 110213 110007 109035 107573 106490 106387 106886 107104 106822 106742 107401 108294 108458 107639
$$ packed form
57544A34094K599J897J078L87l00j037j585j569q79n5K2q74j880k142j907j939
57528A25910k237k181j680j188p76k43op28j966k346j345R2R37J086P92J68m00
57511A13889l20K53M41m3m82m05k35l16k48K14N78M76L00L71L00k67j040j688
57493A11778k263k525j790j89Q93M97n63q73k83K85K89n3l71l76J84J068J421
57476A07129P81k21p37p75p54o00k1P83J413J864K100J570K4j669k368k023j366
57459A05130o89J71R40J115R12J036J514J656J218P22N30M51L38L23K99r1o99
57442A14876q40l21J63J3m63n81j64N10J207J701J563N54q53j747j678j040n39
57425A12361m89o72p06m32j3J64k06r72j462j083j03M99K18k82q0O59Q93J64q19
$$ plain form
57406 107639 106473 105633 105217 104919 104439 103701 102908 102344 101936 101170 99672 97737 95980 94636 93518 92506
57390 92506 91703 91204 91067 91440 92338 93388 94095 94305 94138 93631 92845 92106 91689 91410 91080 91119 92090 93686 94874
57371 94874 95184 95214 95733 96857 98276 99728 100980 101814 102281 102594 102709 102477 102289 102899 104340 105662 106153
57354 106153 106235 106630 107182 107147 106346 105370 104759 104588 104846 105714 107285 109304 111303 112803 113402 112913 111516 109710
57336 109710 108076 107057 106848 107370 108376 109604 110712 111190 110692 109595 108874 109074 109580 109283 108019 106997
57320 106997 107587 109831 112355 113724 113656 112852 111969 111108 110157 109125 108043 106991 106421 106920 108328 109553
57304 109553 109822 109721 110398 111995 113611 114608 115138 115352 115032 114260 113673 113566 113363 112470 111250 110657 111189 112644
57286 112644 114587 116590 118179 119048 119398 119800 120704 122225 124266 126652 129190 131789 134537 137646 141303
$$ packed form
57406A07639j166q40m16k98m80p38p93n64m08p66j498j935j757j344j118j012
57390I2506q03m99j37L73Q98J050P07K10j67n07p86p39m17k79l30L9R71J596J188
57371I4874L10L0N19J124J419J452J252Q34M67L13J15k32j88O10J441J322M91
57354A06153Q2L95N52l5q01r76o11j71K58Q68J571K019J999J500N99m89j397j806
57336A09710j634j019k09N22J006J228J108M78m98j097p21K00N06k97j264j022
57320A06997N90K244K524J369o8q04q83q61r51j032j082j052n70M99J408J225
57304A09553K69j01O77J597J616R97N30K14l20p72n87j07k03q93j220n93N32J455
57286A12644J943K003J589Q69L50M02R04J521K041K386K538K599K748L109L657
$$ plain form
57271 141303 145557 150174 154598 158278 161159 163775 166743 170162 173455 175799 176889 177332 178093 179404 180520
57256 180520 180765 180393 180049 179826 179482 179231 179514 180160 180563 180691 181037 181481 181151 179708 177991 177002 176876 177242
57238 177242 177921 178809 179633 180365 181419 182946 184422 185366 186079 187180 188825 190820 193089 195517 197710 199472
57222 199472 201193 203282 205532 207578 209644 212262 215440 218725 221917 225203 228721 232515 236812 241854
57208 241854 247505 253485 259967 267497 276290 285987 296067 306153 315924 325053 333329 340703 347316 353614
57194 353614 360263 367723 375984 384822 394006 403138 411755 419979 428707 438702 449759 461209 472919
57181 472919 485292 498522 512429 526866 541658 556261 570090 583266 596545 610507 625231
57170 625231 640643 656564 672363 687240 701161 715068 729879 745613 761779 778318 795871
$$ packed form
57271A41303M254M617M424L680K881K616K968L419L293K344J090M43P61J311J116
57256A80520K45l72l44k23l44k51K83O46M03J28L46M44l30j443j717r89j26L66
57238A77242O79Q88Q24P32J054J527J476R44P13J101J645J995K269K428K193J762
57222A99472J721K089K250K046K066K618L178L285L192L286L518L794M297N042
57208B41854N651N980O482P530Q793R697J0080J0086R771R129Q276P374O613O298
57194C53614O649P460Q261Q838R184R132Q617Q224Q728R995J1057J1450J1710
57181D72919J2373J3230J3907J4437J4792J4603J3829J3176J3279J3962J4724
57170F25231J5412J5921J5799J4877J3921J3907J4811J5734J6166J6539J7553
$$ plain form
57159 795871 815238 836736 859975 884104 908392 932626 956925 981268 1005433 1029375 1053397
57148 1053397 1077886 1103029 1128829 1155182 1181826 1208374 1234543 1260365 1286172 1312343 1339002
57137 1339002 1365949 1392962 1420135 1447795 1476146 1505210 1535207 1566674 1600091 1635579 1673132
57126 1673132 1712910 1755158 1800080 1848004 1899507 1955205 2015589 2081057 2151873 2228029 2309582
57115 2309582 2397355 2492934 2597736 2712435 2837641 2974797 3126176 3294459 3482974 3696554
57105 3696554 3942188 4229199 4569200 4975972 5465601 6057161 6773357 7640244 8686292
57096 8686292 9941395 11434569 13188634 15213556 17502609 20033166 22771534 25683496
57088 25683496 28752914 32002645 35502784 39353533 43640254 48365624 53374442 58310977
$$ packed form
57159G95871J9367K1498K3239K4129K4288K4234K4299K4343K4165K3942K4022
57148A053397K4489K5143K5800K6353K6644K6548K6169K5822K5807K6171K6659
57137A339002K6947K7013K7173K7660K8351K9064K9997L1467L3417L5488L7553
57126A673132L9778M2248M4922M7924N1503N5698O0384O5468P0816P6156Q1553
57115B309582Q7773R5579J04802J14699J25206J37156J51379J68283J88515K13580
57105C696554K45634K87011L40001M06772M89629N91560P16196Q66887J046048
57096H686292J255103J493174J754065K024922K289053K530557K738368K911962
57088B5683496L069418L249731L500139L850749M286721M725370N008818M936535
$$ plain form
57080 58310977 62662880 65906311 67683655 67901252 66692691 64303183 60997164 57034361
57072 57034361 52677768 48182091 43758774 39550519 35635192 32047014 28794319 25868170
57064 25868170 23247939 20907447 18819782 16959533 15303808 13832266 12524783 11358005
57056 11358005 10305260 9342025 8452692 7632431 6883113 6207716 5607265 5080313 4623203
57047 4623203 4230488 3895580 3611287 3370051 3164343 2987419 2833817 2699235 2580326
57038 2580326 2474747 2381115 2298749 2227566 2167935 2120014 2082969 2055155 2034994 2021059 2011259
57027 2011259 2002839 1993858 1984171 1974329 1963629 1949587 1929007 1899309 1859383 1810018 1753578 1692869
57015 1692869 1630143 1567202 1505868 1447701 1393318 1342531 1295199 1251610 1212016 1176195 1143595
$$ packed form
57080E8310977M351903L243431J777344K17597j208561k389508l306019l962803
57072E7034361m356593m495677m423317m208255l915327l588178l252695k926149
57064B5868170k620231k340492k087665j860249j655725j471542j307483j166778
57056A1358005j052745r63235q89333q20261p49318o75397o00451n26952m57110
57047D623203l92715l34908k84293k41236k05708j76924j53602j34582j18909
57038B580326j05579r3632q2366p1183n9631m7921l7045k7814k0161j3935r800
57027B011259q420q981r687r842j0700j4042k0580k9698l9926m9365n6440o0709
57015A692869o2726o2941o1334n8167n4383n0787m7332m3589l9594l5821l2600
$$ plain form
57004 1143595 1113635 1085811 1059687 1034896 1011088 987997 965725 944915 926328 910160 895907
56993 895907 883007 871504 861971 854785 849508 845073 840509 835356 829350 822084 813342 803513 793148
56980 793148 782077 769452 754803 738577 721403 703365 684407 665122 646563 629380 613590
56969 613590 599262 587052 577853 572067 569382 569252 571430 575736 581261 586245 589212 590158 590182 589983 589201
56954 589201 587181 583629 578239 570357 559628 546620 532328 517268 501582 485773 470830 457635
56942 457635 446707 438461 433300 431352 432441 436327 442699 450813 459436 467412 474296 480370 485982 490801
56928 490801 493739 493654 490069 483083 472760 458956 441884 422514 402216 382085 362648 343958 325899
56915 325899 308572 292474 278074 265307 253816 243661 235254 228466 222395 216323 210478 205529 201791
$$ packed form
57004A143595k9960k7824k6124k4791k3808k3091k2272k0810j8587j6168j4253
56993H95907j2900j1503r533p186n277m435m564n153o006p266q742r829j0365
56980G93148j1071j2625j4649j6226j7174j8038j8958j9285j8559j7183j5790
56969F13590j4328j2210r199n786k685j30K178M306N525M984K967R46K4j99p82
56954E89201k020l552n390p882j0729j3008j4292j5060j5686j5809j4943j3195
56942D57635j0928q246n161j948J089L886O372Q114Q623P976O884O074N612M819
56928D90801K938q5l585o986j0323j3804j7072j9370k0298k0131j9437j8690j8059
56915C25899j7327j6098j4400j2767j1491j0155q407o788o071o072n845m949l738
$$ plain form
56902 201791 199302 198217 198576 199995 202121 205273 210191 217321 226739 238614 253190 270279 289079
56889 289079 308552 327849 346535 364534 381681 397176 409857 419251 425934 430489 432609 431732 428183
56876 428183 422983 416846 410163 403894 399648 398670 401309 407638 418125 433444 453919 479108 507502
56863 507502 536627 564083 588858 611444 632578 652140 669184 682504 690975 693833 691044 683253
56851 683253 671218 655516 636967 617145 598269 582709 572548 569387 574329 588195 611601 644499
56839 644499 685446 731500 778958 824402 865552 901791 933926 962818 987813 1006639 1016951
56828 1016951 1017691 1008924 990929 964095 929628 889799 847276 804374 763119 725760 694790 672245
56816 672245 659092 655410 660962 675177 696458 721877 748001 772184 793218 811082 826267 838961
$$ packed form
56902B01791k489j085L59J419K126L152M918P130R418J1875J4576J7089J8800
56889B89079J9473J9297J8686J7999J7147J5495J2681R394O683M555K120q77l549
56876D28183n200o137o683o269m246r78K639O329J0487J5319K0475K5189K8394
56863E07502K9125K7456K4775K2586K1134J9562J7044J3320Q471K858k789p791
56851F83253j2035j5702j8549j9822j8876j5560j0161l161M942J3866K3406L2898
56839F44499M0947M6054M7458M5444M1150L6239L2135K8892K4995J8826J0312
56828A016951P40q767j7995k6834l4467l9829m2523m2902m1255l7359l0970k2545
56816F72245j3153l682N552J4215K1281K5419K6124K4183K1034J7864J5185J2694
$$ plain form
56804 838961 848365 852710 850182 839974 822382 798180 768242 733730 696262 657744 620102 585157
56792 585157 554480 529252 510275 497985 492331 492644 497760 506144 515900 525058 532360 537741 541761
56779 541761 544576 545674 544397 540293 532915 521699 506300 486933 464366 439697 414082 388503
56767 388503 363711 340403 319233 300449 283724 268629 255136 243397 233218 224157 216056 209052
56755 209052 203066 197649 192425 187400 182752 178486 174369 170117 165715 161634 158488 156285 154336 152222
56741 152222 150495 149902 150158 150158 149329 148143 147279 146892 146860 147161 147726 148346 148907 149400 149636 149392 148897 148662 148710
56722 148710 148532 148034 147923 148804 150398 152085 153761 155611 157414 158733 159652 160738 162209 163642 164671
56707 164671 165609 167077 169120 170951 171682 171301 170754 170943 171748 172247 171818 170747 169675 168819 167950 166933 165988
$$ packed form
56804H38961R404M345k528j0208j7592k4202k9938l4512l7468l8518l7642l4945
56792E85157l0677k5228j8977j2290n654L13N116Q384R756R158P302N381M020
56779E41761K815J098j277m104p378j1216j5399j9367k2567k4669k5615k5579
56767C88503k4792k3308k1170j8784j6725j5095j3493j1739j0179r061q101p004
56755B09052n986n417n224n025m648m266m117m252m402m081l146k203j949k114
56741A52222j727n93K56%q29j186q64l87l2L01N65O20N61M93K36k44m95k35M8
56722A48710j78m98j11Q81J594J687J676J850J803J319R19J086J471J433J029
56707A64671R38J468K043J831P31l81n47J89Q05M99m29j071j072q56q69j017r45
$$ plain form
56690 165988 165443 165414 165748 166169 166439 166388 165963 165386 165195 165759 166623 166745 165684 164292 163807 164460 165407 165820 165544
56671 165544 164797 163851 163091 162863 163087 163371 163573 163896 164440 165119 166029 167391 169040 170425 171244 171651 171799 171706
56653 171706 171693 172359 173923 176007 178219 180418 182321 183600 184609 186257 188704 190858 191733 191681 191653 191777
56637 191777 191478 190572 189395 187977 185956 183351 180724 178430 176278 174070 171997 170310 169004 168061 167730
56622 167730 168267 169475 170683 171194 170783 169829 168953 168513 168505 168880 169768 171332 173552 176164 178661 180426 181266
56605 181266 181810 183011 185085 187350 189201 190670 191790 192051 191142 189887 189717 191224 193671 195890 197250
56590 197250 197821 198087 198614 199674 201028 202207 202933 203169 202846 201878 200432 198994 198064 197813 197992 198168 198205
56573 198205 198536 199739 201792 204065 206235 208952 213348 220074 228893 238915 249031 258514 267607 277376
$$ packed form
56690A65988n45k9L34M21K70n1m25n77j91N64Q64J22j061j392m85O53R47M13k76
56671A65544p47r46p60k28K24K84K02L23N44O79R10J362J649J385Q19M07J48r3
56653A71706j3O66J564K084K212K199J903J279J009J648K447K154Q75n2k8J24
56637A91777k99r06j177j418k021k605k627k294k152k208k073j687j306r43l31
56622A67730N37J208J208N11m11r54q76m40qL75Q88J564K220K612K497J765Q40
56605A81266N44J201K074K265J851J469J120K61r09j255j70J507K447K219J360
56590A97250N71K66N27J060J354J179P26K36l23r68j446j438r30k51J79J76L7
56573A98205L31J203K053K273K170K717M396O726Q819J0022J0116R483R093R769
$$ plain form
56559 277376 288656 301191 313982 326300 338149 349958 362063 374340 386107 396539 405337 412812
56547 412812 419281 424757 429337 433380 436893 439121 439238 437210 433648 429062 423604 417278 409937 401336
56533 401336 391614 381515 371715 362088 352119 341821 331768 322289 313086 303702 293991 284196 274814
56520 274814 266313 258728 251662 244916 238869 233986 230215 227223 224874 223049 221270 218991 216132 212985
56506 212985 209924 207594 206857 207804 209108 209154 207751 206107 205230 205073 205093 204811 203774 201804 199488 197713
56490 197713 196532 195173 193364 191840 191214 191098 190815 190387 190219 190282 190228 190092 190317 191171 192501 193984 195294
56473 195294 196201 196747 197236 197843 198389 198740 199169 199958 200842 201249 201130 201106 201669 202556 203148 203283 203359 203710 204240
56454 204240 204824 205709 207175 208939 210317 211011 211337 211623 211800 211807 211932 212391 212837 212731 212050 211268 210761 210555
$$ packed form
56559B77376J1280J2535J2791J2318J1849J1809J2105J2277J1767J0432Q798P475
56547D12812O469N476M580M043L513K228J17k028l562m586n458o326p341q601
56533D01336r722j0099r800r627r969j0298j0053r479r203r384r711r795r382
56520B74814q501p585p066o746o047m883l771k992k349j825j779k279k859l147
56506B12985l061k330p37R47J304M6j403j644q77j57K0k82j037j970k316j775
56490A97713j181j359j809j524o26j16k83m28j68O3n4j36K25Q54J330J483J310
56473A95294R07N46M89O07N46L51M29P89Q84M07j19k4N63Q87N92J35P6L51N30
56454B04240N84Q85J466J764J378O94L26K86J77PJ25M59M46j06o81p82n07k06
$$ plain form
56436 210555 210584 210864 211461 212456 213861 215387 216482 216858 216809 216745 216654 216290 215677 215017 214314 213474 212653 212104 211858
56417 211858 211909 212494 213710 215032 215782 216066 216691 218005 219312 219700 219158 218611 218951 220161 221432 222105 222323
56400 222323 222600 223005 223348 224013 225714 228130 229720 229553 228575 228269 228708 228934 228707 228706 229227 229909 230738 232165
56382 232165 234016 235280 235371 234807 234363 234256 234472 235124 236145 237216 238338 239937 242113 244371 246373 248346
56366 248346 250393 251953 252472 252248 252111 252416 252670 252144 250741 249281 248786 249377 250167 250547 251107 252677 254875
56349 254875 256483 257088 257376 257806 258037 257934 258111 258993 260118 260935 261664 262811 264348 265888 267285 268574
56333 268574 269601 270164 270335 270346 270312 270236 270082 269787 269379 269047 268846 268529 268033 267944 268913 270738 272633 274282 275951
56314 275951 277744 279486 281263 283220 284881 285555 285494 285734 286704 287894 288969 290172 291500 292618 293857
$$ packed form
56436B10555K9K80N97R95J405J526J095L76m9o4r1l64o13o60p03q40q21n49k46
56417B11858N1N85J216J322P50K84O25J314J307L88n42n47L40J210J271O73K18
56400B22323K77M05L43O65J701K416J590j67r78l06M39K26k27jN21O82Q29J427
56382B32165J851J264R1n64m44j07K16O52J021J071J122J599K176K258K002J973
56366B48346K047J560N19k24j37L05K54n26j403j460m95N91P90L80N60J570K198
56349B54875J608O05K88M30K31j03J77Q82J125Q17P29J147J537J540J397J289
56333B68574J027N63J71J1l4p6j54k95m08l32k01l17m96q9R69J825J895J649J669
56314B75951J793J742J777J957J661O74o1K40R70J190J075J203J328J118J239
$$ plain form
56299 293857 296170 299642 303106 305701 307761 309724 311309 312428 313713 315376 316550 316716 316823 318064 320337
56284 320337 322862 325532 328573 331608 334221 336974 340755 345353 349640 352938 355476 357795 360452 364023
56270 364023 368652 373887 379499 385981 393553 401291 408122 414317 421110 429135 438080 447574 457540 467840
56256 467840 478417 489721 502405 516725 532722 550642 570578 592048 614599 638455 663839
56245 663839 690012 715789 740759 765164 788790 810777 830410 847366 861303 871940 879504 884459
56233 884459 886749 885828 881400 873719 863284 850607 836122 820023 802445 783972 765460 747072
56221 747072 728135 708391 688709 670031 652371 635536 620013 606187 593351 580486 567563
56210 567563 555204 543685 533281 524931 519234 515127 510780 505633 500480 495882 491777 488398 486217
$$ packed form
56299B93857K313L472L464K595K060J963J585J119J285J663J174J66J07J241K273
56284C20337K525K670L041L035K613K753L781M598M287L298K538K319K657L571
56270C64023M629N235N612O482P572P738O831O195O793Q025Q945R494R966J0300
56256D67840J0577J1304J2684J4320J5997J7920J9936K1470K2551K3856K5384
56245F63839K6173K5777K4970K4405K3626K1987J9633J6956J3937J0637P564M955
56233H84459K290r21m428p681j0435j2677j4485j6099j7578j8473j8512j8388
56221G47072j8937j9744j9682j8678j7660j6835j5523j3826j2836j2865j2923
56210E67563j2359j1519j0404q350n697m107m347n147n153m598m105l379k181
$$ plain form
56197 486217 484897 483523 481957 480872 480388 479900 479405 479771 481327 483296 485032 486873 489254 491788 493768
56182 493768 495013 495776 496337 496995 497975 499121 500056 500789 501704 502992 504607 506727 509579 512820 515826 518689
56166 518689 522255 526977 532382 537847 543328 549071 555158 561596 568469 575755 583331 591286 600022 609920
56152 609920 621104 633470 646849 661288 677386 696092 718127 744009 774802 812109 856892
56141 856892 908988 968258 1035349 1110402 1191712 1276699 1363930 1453381 1545176 1638967 1733993
56130 1733993 1828616 1920013 2005344 2083142 2152972 2214346 2267080 2312213 2351194 2384094 2409546
56119 2409546 2426220 2433377 2430256 2416145 2391130 2355971 2311434 2258638 2199545 2135811 2067268 1992775
56107 1992775 1912594 1828879 1743979 1659451 1576745 1497555 1423202 1354488 1292233 1237142 1189172
$$ packed form
56197D86217j320j374j566j085m84m88m95L66J556J969J736J841K381K534J980
56182D93768J245P63N61O58R80J146R35P33R15J288J615K120K852L241L006K863
56166E18689L566M722N405N465N481N743O087O438O873P286P576P955Q736R898
56152F09920J1184J2366J3379J4439J6098J8706K2035K5882L0793L7307M4783
56141H56892N2096N9270O7091P5053Q1310Q4987Q7231Q9451R1795R3791R5026
56130A733993R4623R1397Q5331P7798O9830O1374N2734M5133L8981L2900K5452
56119B409546J6674P157l121j4111k5015l5159m4537n2796n9093o3734o8543p4493
56107A992775q0181q3715q4900q4528q2706p9190p4353o8714o2255n5091m7970
$$ plain form
56096 1189172 1147781 1112606 1083125 1058123 1036543 1018565 1004751 994457 986226 979401 974194 970600
56084 970600 968557 968767 971861 976980 982606 988563 995695 1003826 1011784 1019454 1028178 1038954 1051676 1066142
56070 1066142 1082320 1099431 1116202 1132147 1147430 1161641 1174141 1185488 1196962 1208729 1219861
56059 1219861 1230027 1239737 1249140 1258226 1267875 1278999 1290912 1302321 1313578 1326016 1339518 1352971
56047 1352971 1366759 1382360 1399584 1416771 1433778 1452102 1471832 1491209 1509751 1529166 1550512
56036 1550512 1572942 1595928 1620282 1646265 1673087 1700990 1731395 1764225 1797546 1830613 1864854
56025 1864854 1901055 1938166 1975722 2014882 2056133 2098560 2142385 2189563 2240774 2294370 2349312
56014 2349312 2406555 2466532 2528068 2591025 2657308 2728012 2802133 2879164 2960188 3045404 3133491
$$ packed form
56096A189172m1391l5175k9481k5002k1580j7978j3814j0294q231o825n207l594
56084I70600k043K10L094N119N626N957P132Q131P958P670Q724J0776J2722J4466
56070A066142J6178J7111J6771J5945J5283J4211J2500J1347J1474J1767J1132
56059A219861J0166R710R403R086R649J1124J1913J1409J1257J2438J3502J3453
56047A352971J3788J5601J7224J7187J7007J8324J9730J9377J8542J9415K1346
56036A550512K2430K2986K4354K5983K6822K7903L0405L2830L3321L3067L4241
56025A864854L6201L7111L7556L9160M1251M2427M3825M7178N1211N3596N4942
56014B349312N7243N9977O1536O2957O6283P0704P4121P7031Q1024Q5216Q8087
$$ plain form
56003 3133491 3224513 3320463 3421889 3527214 3636457 3752150 3875332 4004263 4138521 4280616
55993 4280616 4432080 4591888 4760370 4940676 5134584 5341019 5560476 5796509 6051074
55984 6051074 6323199 6614281 6929602 7272467 7642391 8041619 8477544 8955915 9478112
55975 9478112 10048520 10678122 11377382 12153040 13016276 13986664 15084111 16326419 17741370
55966 17741370 19373326 21273518 23496268 26114498 29230874 32971212 37489760 43003719
55958 43003719 49821964 58344653 69062774 82538977 99239472 119157864 141467762
55951 141467762 164595216 186806816 206920716 224616333 240180393 253965937 265954454
55944 265954454 275630045 282155389 284710489 282806969 276427920 265966306 252059066 235442077
$$ packed form
56003C133491R1022R5950J01426J05325J09243J15693J23182J28931J34258J42095
55993D280616J51464J59808J68482J80306J93908K06435K19457K36033K54565
55984F051074K72125K91082L15321L42865L69924L99228M35925M78371N22197
55975I478112N70408O29602O99260P75658Q63236R70388J097447J242308J414951
55966A7741370J631956J900192K222750K618230L116376L740338M518548N513959
55958D3003719O818245Q522689J0718121J3476203J6700495J9918392K2309898
55951A41467762K3127454K2211600K0113900J7695617J5564060J3785544J1988517
55944B65954454R675591O525344K555100j903520o379049j0461614j3907240j6616989
$$ plain form
55936 235442077 216887256 197201875 177224915 157764852 139486009 122815295 107933242
55929 107933242 94837197 83414680 73493033 64876287 57377138 50830926 45090927 40026776
55921 40026776 35535450 31547807 28018849 24913518 22199973 19845889 17813562 16060569
55913 16060569 14547309 13240580 12109295 11122588 10255025 9489299 8811298 8206500 7663069
55904 7663069 7173891 6732722 6331843 5965531 5631812 5328255 5049499 4791150 4552520
55895 4552520 4333020 4129235 3938167 3760281 3596648 3445754 3305482 3175510 3055273
55886 3055273 2942046 2833639 2730885 2635203 2545686 2460599 2379610 2302415 2227232 2152860 2080480
55875 2080480 2011478 1945252 1880944 1819362 1761144 1704846 1649045 1594842 1544230 1497269 1452722
$$ packed form
55936B35442077j8554821j9685381j9976960j9460063j8278843j6670714j4882053
55929A07933242j3096045j1422517r921647q616746p499149o546212n739999n064151
55921D0026776m491326l987643l528958l105331k713545k354084k032327j752993
55913A6060569j513260j306729j131285r86707q67563p65726o78001o04798n43431
55904G663069m89178m41169m00879l66312l33719l03557k78756k58349k38630
55895D552520k19500k03785j91068j77886j63633j50894j40272j29972j20237
55886C055273j13227j08407j02754r5682q9517q5087q0989p7195p5183p4372p2380
55875B080480o9002o6226o4308o1582n8218n6298n5801n4203n0612m6961m4547
$$ plain form
55864 1452722 1410167 1369725 1330956 1293727 1259003 1227265 1197277 1167851 1139477 1112849 1087236
55853 1087236 1061917 1037745 1015469 993749 970735 946739 923549 901857 880897 860011 839198
55842 839198 818699 799187 781699 766433 752400 739044 727042 716597 706308 695045 683780
55831 683780 674115 666009 658279 650448 642682 634713 626206 617578 609385 601561 594143 587798 582593 577292
55817 577292 571020 564658 559382 554853 550189 545780 542681 541006 540332 540990 543539 547523 552047 557009 562473
55802 562473 567431 570552 571756 571827 570913 568634 565254 561483 557346 552371 546614 540521 533992 526513 518021
55787 518021 508889 499549 490743 483495 477963 473007 467819 463203 460200 458258 456133 453922 452700 452512
55773 452512 452219 451241 450047 448896 447257 444662 441172 436894 431823 426147 420004 413041 404974 396385 388176
$$ packed form
55864A452722m2555m0442l8769l7229l4724l1738k9988k9426k8374k6628k5613
55853A087236k5319k4172k2276k1720k3014k3996k3190k1692k0960k0886k0813
55842H39198k0499j9512j7488j5266j4033j3356j2002j0445j0289j1263j1265
55831F83780r665q106p730p831p766p969q507q628q193p824p418o345n205n301
55817E77292o272o362n276m529m664m409l099j675o74O58K549L984M524M962N464
55802E62473M958L121J204P1r14k279l380l771m137m975n757o093o529p479q492
55787E18021r132r340q806p248n532m956n188m616l003j942k125k211j222j88
55773D52512k93r78j194j151j639k595l490m278n071n676o143o963q067q589q209
$$ plain form
55758 388176 380419 372569 364645 357335 351011 345442 340453 336117 332339 328847 325583 322490 319158 315257
55744 315257 311165 307482 304057 300170 295595 290969 287165 284727 283646 283205 282333 280583 278526 276786 275191
55729 275191 273398 271764 270824 270271 269250 267374 264808 261681 258181 254966 252697 251313 250298 249474 248965
55714 248965 248735 248803 249596 251411 253769 255921 257753 259542 261128 261924 261542 259903 257130 253867 251196 249441
55698 249441 247497 244099 239454 234868 231204 228537 226938 226548 226942 227331 227414 227442 227623 228109 229312 231443
55682 231443 233904 235838 237139 238307 239559 240853 242450 244576 246691 247930 248224 248210 248189 247914 247379 247014
55666 247014 247063 247406 247993 248853 249802 250738 252068 254184 256680 258779 260363 261879 263450 264820 265996 267038
55650 267038 267332 265955 262872 258986 254968 250686 245825 240353 234326 227875 221428 215403 209733 204241
$$ packed form
55758C88176p757p850p924p310o324n569m989m336l778l492l264l093l332l901
55744C15257m092l683l425l887m575m626l804k438j081m41q72j750k057j740j595
55729B75191j793j634r40n53j021j876k566l127l500l215k269j384j015q24n09
55714B48965k30O8P93J815K358K152J832J789J586P96l82j639k773l263k671j755
55698B49441j944l398m645m586l664k667j599l90L94L89Q3K8J81M86J203K131
55682B31443K461J934J301J168J252J294J597K126K115J239K94j4k1k75n35l65
55666B47014M9L43N87Q60R49R36J330K116K496K099J584J516J571J370J176J042
55650B67038K94j377l083l886m018m282m861n472o027o451o447o025n670n492
$$ plain form
55636 204241 199290 195390 192342 189536 186979 185134 183803 182101 179679 177152 175137 173626 172466 171704
55622 171704 171183 170450 169333 168112 166952 165667 164246 163059 162335 161784 160925 159533 157799 156303 155635 155656
55606 155656 155399 154180 152520 151385 150836 150134 148896 147343 145658 144036 143206 143864 145466 146563 146487 145918
55590 145918 145634 145628 145752 146325 147582 149112 150251 150656 150280 149290 148225 147774 148189 149199 150535 152113 153768
55573 153768 155281 156674 158008 159061 159702 160397 161669 163263 164557 165565 166663 167508 167313 166147 164915
55558 164915 163890 162361 159978 157371 155055 152736 150195 147926 146308 144943 143437 142170 141703 141952 142469
55543 142469 143068 143718 144350 145122 146381 147982 149212 149747 150148 151007 152163 153157 153877 154378 154543 154386 154236
55526 154236 154165 153685 152359 150363 148127 145864 143677 141677 139729 137614 135696 134791 134990 135220 134433 132794
$$ packed form
55636B04241m951l900l048k806k557j845j331j702k422k527k015j511j160p62
55622A71704n21p33j117j221j160j285j421j187p24n51q59j392j734j496o68K1
55606A55656k57j219j660j135n49p02j238j553j685j622q30O58J602J097p6n69
55590A45918k84oJ24N73J257J530J139M05l76r90j065m51M15J010J336J578J655
55573A53768J513J393J334J053O41O95J272J594J294J008J098Q45j95j166j232
55558A64915j025j529k383k607k316k319k541k269j618j365j506j267m67K49N17
55543A42469N99O50O32P72J259J601J230N35M01Q59J156R94P20N01J65j57j50
55526A54236p1m80j326j996k236k263k187k000j948k115j918r05J99K30p87j639
$$ plain form
55510 132794 131265 130478 130433 130880 131580 132423 133468 134506 134656 133167 130684 128843 128250 127875 126887 125998 126147
55493 126147 126815 126791 126018 125500 125668 125952 125867 125521 124994 124067 122749 121483 120687 120479 120837 121554 122075 121870 121039
55474 121039 120198 119831 120013 120628 121397 121856 121803 121765 122554 124292 126242 127680 128578 129302 129928 130139 129676 128719
55456 128719 127715 126926 126320 125905 125900 126323 126702 126645 126495 126806 127252 126771 125004 122905 121590 121117 120792 120179
55438 120179 119396 118765 118617 119141 120117 121073 121897 122877 123930 124346 123743 122790 122463 122957 123823 124810 126004 127382
55420 127382 128805 130340 132103 133846 135119 135804 136204 136650 137258 137979 138630 138993 139040 138924 138684 138190 137473
55403 137473 136729 135922 134763 133235 131721 130415 129086 127634 126346 125302 124129 122751 121853 122045 122974
55388 122974 123751 123885 123374 122336 121154 120570 120960 121701 121828 121139 120210 119542 119239 119288 119613 119914 119975 120027 120425
$$ packed form
55510A32794j529p87m5M47P00Q43J045J038J50j489k483j841n93l75r88q89J49
55493A26147O68k4p73n18J68K84q5l46n27r27j318j266p96k08L58P17N21k05q31
55474A21039q41l67J82O15P69M59n3l8P89J738J950J438Q98P24O26K11m63r57
55456A28719j004p89o06m15nM23L79n7j50L11M46m81j767k099j315m73l25o13
55438A20179p83o31j48N24R76R56Q24R80J053M16o03r53l27M94Q66R87J194J378
55420A27382J423J535J763J743J273O85M00M46O08P21O51L63M7j16k40m94p17
55403A37473p44q07j159j528j514j306j329j452j288j044j173j378q98J92R29
55388A22974P77J34n11j038j182n84L90P41J27o89r29o68l03M9L25L01O1N2L98
$$ plain form
55369 120425 121106 121766 122431 123343 124386 125036 124910 124135 123232 122818 123188 123981 124502 124566 124722 125427 126340 126769 126473
55350 126473 125766 125114 124889 125170 125505 125261 124421 123618 123194 122827 122343 122137 122372 122504 122197 121940 122153 122407 122277
55331 122277 122179 122438 122267 120839 118870 117933 118465 119574 120572 121573 122674 123658 124549 125527 126273 126299 125883 125743
55313 125743 125859 125574 124768 123946 123173 122082 121006 120897 121807 122567 122430 122058 122400 123427 124468 125065 125027 124319
55295 124319 123370 122897 123107 123585 124167 125125 126228 126500 125429 123676 122071 120600 119028 117822 117669 118461
55279 118461 119452 120203 120857 121661 122628 123562 124173 124385 124564 125066 125481 124939 123349 121676 120714 120286 120047 120304
55261 120304 121419 122946 124068 124500 124407 123894 123190 122889 123267 123658 123237 122193 121405 121132 120838 120302 120122 120858
55243 120858 122232 123443 123948 123750 123248 122979 123223 123720 123852 123250 122158 121232 121041 121718 122883 123913 124413
$$ packed form
55369A20425O81O60O65R12J043O50j26p75r03m14L70P93N21O4J56P05R13M29k96
55350A26473p07o52k25K81L35k44q40q03m24l67m84k06K35J32l07k57K13K54j30
55331A22277r8K59j71j428j969r37N32J109R98J001J101R84Q91R78P46K6m16j40
55313A25743J16k85q06q22p73j091j076j09R10P60j37l72L42J027J041N97l8p08
55295A24319r49m73K10M78N82R58J103K72j071j753j605j471j572j206j53P92
55279A18461R91P51O54Q04R67R34O11K12J79N02M15n42j590j673r62m28k39K57
55261A20304J115J527J122M32r3n13p04l01L78L91m21j044p88k73k94n36j80P36
55243A20858J374J211N05j98n02k69K44M97J32o02j092r26j91O77J165J030N00
$$ plain form
55226 124413 124485 124513 124753 125143 125442 125483 125296 124986 124513 123746 122855 122349 122484 122889 123156 123544 124559 125985 127031
55207 127031 127390 127398 127131 126277 125217 125178 126649 128400 128956 128486 128287 128768 129058 128611 128126 128508 129610 130561
55189 130561 130964 131239 131893 132825 133471 133493 133057 132441 131596 130451 129496 129514 130652 132241 133732 135261 136961
55172 136961 138308 138809 138930 139652 141225 142980 144268 145028 145503 145968 146822 148338 150160 151449 151700 151110
55156 151110 150129 149066 148191 147726 147571 147383 147113 147058 147197 146912 145712 143938 142408 141519 141005 140393 139450 138269
55138 138269 137182 136531 136312 136134 135681 135127 134884 135048 135376 135662 135816 135580 134632 133121 131775 131171 131148 131227
55120 131227 131423 132201 133675 135251 136224 136418 136133 135758 135644 136082 137026 137932 138205 137816 137287 137083 137207 137385
55102 137385 137459 137535 137866 138599 139610 140617 141453 142101 142481 142514 142496 142969 143935 144529 143959 142559 141405 141041 141091
$$ packed form
55226A24413P2K8K40L90K99M1j87l10m73p67q91n06J35M05K67L88J015J426J046
55207A27031L59Qk67q54j060l9J471J751N56m70j99M81K90m47m85L82J102R51
55189A30561M03K75O54R32O46K2m36o16q45j145r55J8J138J589J491J529J700
55172A36961J347N01J21P22J573J755J288P60M75M65Q54J516J822J289K51n90
55156A51110r81j063q75m65j55j88k70n5J39k85j200j774j530q89n14o12r43j181
55138A38269j087o51k19j78m53n54k43J64L28K86J54k36r48j511j346o04k3P9
55120A31227J96P78J474J576R73J94k85l75j14M38R44R06K73l89n29k04J24J78
55102A37385P4P6L31P33J011J007Q36O48L80L3j8M73R66N94n70j400j154l64N0
$$ plain form
55083 141091 141048 140867 140715 140749 141220 142267 143431 143868 143320 142422 141797 141286 140390 139097 137877 137125 136923 137150
55065 137150 137555 137879 138078 138282 138501 138688 139061 139833 140506 140117 138609 137336 137623 139301 141228 142810 144220
55048 144220 145444 146017 145781 145207 144799 144688 144895 145488 146324 147110 147874 148939 150246 151143 151125 150465 149856 149617
55030 149617 149492 149050 148074 146705 145371 144526 144344 144691 145309 145882 145997 145407 144455 143902 144074 144408 144118 143198
55012 143198 142447 142531 143301 144152 144802 145475 146418 147483 148278 148601 148586 148520 148625 148975 149502 150095 150801 151868 153459
54993 153459 155331 157034 158411 159701 161049 162063 162038 160613 158176 155688 154060 153597 153967 154722 155686 156746
54977 156746 157576 157924 158002 158143 158175 157733 157204 157596 159168 160802 161305 160856 160613 161199 162235 163151 163829 164371
54959 164371 164820 165261 165866 166670 167558 168479 169397 170019 169939 169183 168386 168211 168725 169440 169864 169933 170024 170672 172218
$$ packed form
55083A41091m3j81j52L4M71J047J164M37n48q98o25n11q96j293j220p52k02K27
55065A37150M05L24J99K04K19J87L73P72O73l89j508j273K87J678J927J582J410
55048A44220J224N73k36n74m08j11K07N93Q36P86P64J065J307Q97j8o60o09k39
55030A49617j25m42r76j369j334q45j82L47O18N73J15n90r52n53J72L34k90r20
55012A43198p51Q4P70Q51O50O73R43J065P95L23j5o6J05L50N27N93P06J067J591
54993A53459J872J703J377J290J348J014k5j425k437k488j628m63L70P55R64J060
54977A56746Q30L48P8J41L2m42n29L92J572J634N03m49k43N86J036R16O78N42
54959A64371M49M41O05Q04Q88R21R18O22q0p56p97j75N14P15M24O9R1O48J546
$$ plain form
54940 172218 174586 177271 179535 180850 181381 182042 183894 187442 192615 199212 206977 215298 223410 231102 238819
54925 238819 246787 254432 260910 265830 269166 270868 271005 269984 268162 265441 261552 256482 250348 243269
54911 243269 235804 229058 223719 219273 214789 210198 206030 202198 198021 193490 189632 187312 186377 186169 186235
54896 186235 186237 185885 185447 185879 187943 191467 195718 200194 204851 209959 216019 223426 231832 240151 247512 253957
54880 253957 259910 265296 269533 272153 273080 272501 270825 268564 265908 262492 257804 251692 244308 235942 227260
54865 227260 219421 213355 208902 205054 201037 196838 192756 188943 185558 182915 181109 179635 177671 174814
54851 174814 171405 168162 165625 163972 163171 163048 163164 162912 161996 160759 159807 159289 158814 158061 157165 156335 155455
54834 155455 154365 153320 152844 153184 154212 155752 157601 159217 159911 159638 159309 159867 161166 162210 162508 162645
$$ packed form
54940A72218K368K685K264J315N31O61J852L548N173O597P765Q321Q112P692P717
54925B38819P968P645O478M920L336J702J37j021j822k721l889n070o134p079
54911B43269p465o746n339m446m484m591m168l832m177m531l858k320r35k08O6
54896A86235Kl52m38M32K064L524M251M476M657N108O060P407Q406Q319P361O445
54880B53957N953N386M237K620R27n79j676k261k656l416m688o112p384q366q682
54865B27260p839o066m453l848m017m199m082l813l385k643j806j474j964k857
54851A74814l409l243k537j653q01j23J16k52r16j237r52n18m75p53q96q30q80
54834A55455j090j045m76L40J028J540J849J616O94k73l29N58J299J044K98J37
$$ plain form
54818 162645 163270 163966 163769 162634 161691 161842 162675 163118 162858 162564 162897 163752 164535 164867 164940 165299 166241 167328
54800 167328 167691 167010 165958 165374 165288 165208 165163 165768 167252 169101 170886 172816 175090 177178 178310 178473 178483
54783 178483 179146 180660 182801 185371 188464 192435 197619 203967 211004 218265 225715 233619 242079 250726
54769 250726 258836 265725 271137 275293 278445 280489 281156 280464 278601 275355 270173 263058 255115 247915 242393
54754 242393 238436 235237 231810 227458 222142 216456 211118 206552 202898 200095 197852 195877 194323 193687
54740 193687 194075 194971 196075 197898 201019 205103 209360 213779 219163 225907 233372 240636 247263 253155 258186
54725 258186 262368 265958 269057 271314 272341 272137 270872 268533 265111 260904 256261 251208 245615 239565
54711 239565 233218 226552 219707 213441 208625 205179 202051 198481 194794 191681 189196 186950 184932 183489
$$ packed form
54818A62645O25O96j97j135r43J51Q33M43k60k94L33Q55P83L32P3L59R42J087
54800A67328L63o81j052n84q6q0m5O05J484J849J785J930K274K088J132J63J0
54783A78483O63J514K141K570L093L971N184O348P037P261P450P904Q460Q647
54769B50726Q110O889N412M156L152K044O67o92j863l246n182p115p943p200n522
54754B42393l957l199l427m352n316n686n338m566l654k803k243j975j554o36
54740A93687L88Q96J104J823L121M084M257M419N384O744P465P264O627N892N031
54725B58186M182L590L099K257J027k04j265k339l422m207m643n053n593o050
54711B39565o347o666o845o266m816l446l128l570l687l113k485k246k018j443
$$ plain form
54697 183489 182589 181736 180703 179800 179225 178681 177870 176957 176144 175226 174066 173211 173372 174349 175174 175405 175593 176165
54679 176165 176508 175837 174604 174235 175402 177207 178289 178246 177589 176763 175784 174716 173852 173239 172502 171445 170526
54662 170526 170317 170699 170986 170787 170368 170076 169821 169285 168451 167733 167670 168480 169715 170480 170321 169921 170428 171989
54644 171989 173493 174045 174077 174528 175443 176090 176173 176129 176348 176826 177610 178795 179960 180291 179535 178297 177147 176034
54626 176034 174898 174270 174680 175832 176809 176903 175961 174264 172526 171717 172299 173688 174837 175256 175167 174844 174307
54609 174307 173637 173157 173171 173763 174845 176176 177364 178112 178506 178882 179400 179894 180097 179859 179274 178711 178587 178937
54591 178937 179398 179844 180678 182056 183147 182864 181320 179861 179455 179651 179513 178990 178779 179128 179448 179104 178054
54574 178054 176565 174782 172937 171698 171869 173565 175908 177665 178263 178104 177996 178401 179280 180444 181771 183081
$$ packed form
54697A83489r00q53j033r03n75n44q11r13q13r18j160q55J61R77Q25K31J88N72
54679A76165L43o71j233l69J167J805J082m3o57q26r79j068q64o13p37j057r19
54662A70526k09L82K87j99m19k92k55n36q34p18o3Q10J235P65j59m00N07J561
54644A71989J504N52L2M51R15O47Q3m4K19M78P84J185J165L31p56j238j150j113
54626A76034j136o28M10J152R77R4r42j697j738q09N82J389J149M19q9l23n37
54609A74307o70m80J4N92J082J331J188P48L94L76N18M94K03k38n85n63j24L50
54591A78937M61M46Q34J378J091k83j544j459m06J96j38n23k11L49L20l44j050
54574A78054j489j783j845j239J71J696K343J757N98j59j08M05Q79J164J327J310
$$ plain form
54558 183081 184073 184563 184692 184700 184591 184179 183437 182612 181995 181735 181917 182543 183348 183918 184208 184668 185547 186356 186510
54539 186510 186340 186763 187895 188782 188873 188988 190075 191580 192090 191437 191105 192287 194399 196018 196595 196639 196662 196680
54521 196680 196648 196759 197182 197816 198398 198701 198626 198292 198016 198113 198730 199803 201011 201764 201581 200651 199753 199384 199286
54502 199286 199034 198767 198900 199376 199690 199595 199308 199002 198509 197675 196661 195741 195044 194635 194671 195287 196405 197723
54484 197723 198897 199751 200458 201425 202857 204432 205571 206057 206258 206713 207618 208779 209944 211095 212388 213831
54468 213831 215047 215458 214770 213278 211688 210659 210429 210706 210942 210894 210932 211595 212844 214049 214739 215055 215337
54451 215337 215640 215862 215985 215903 215325 214192 212922 211863 210769 209256 207547 206324 205946 206202 206688 207054 207035
54434 207035 206751 206828 207714 208970 209768 210007 210311 210905 211189 210688 209793 209227 209249 209686 210335 210921 211040 210570 209937
$$ packed form
54558A83081R92M90J29Qj09m12p42q25o17k60J82O26Q05N70K90M60Q79Q09J54
54539A86510j70M23J132Q87R1J15J087J505N10o53l32J182K112J619N77M4K3J8
54521A96680l2J11M23O34N82L03p5l34k76R7O17J073J208P53j83r30q98l69r8
54502A99286k52k67J33M76L14r5k87l06m93q34j014r20o97m09L6O16J118J318
54484A97723J174Q54P07R67J432J575J139M86K01M55R05J161J165J151J293J443
54468B13831J216M11o88j492j590j029k30K77K36m8L8O63J249J205O90L16K82
54451B15337L03K22J23q2n78j133j270j059j094j513j709j223l78K56M86L66j9
54434B07035k84P7Q86J256P98K39L04N94K84n01q95n66K2M37O49N86J19m70o33
$$ plain form
54415 209937 209626 209586 209365 208690 207718 206903 206813 207799 209541 211125 211856 211887 211846 212030 212265 212366 212397 212513 212837 213459
54395 213459 214341 215244 215942 216505 217205 218152 219139 219835 220050 219853 219517 219250 218983 218502 217822 217198 216765 216425 216212
54376 216212 216408 217061 217639 217513 216621 215385 214141 212979 212042 211587 211719 212271 212984 213621 214011 214215 214617 215588
54358 215588 217019 218338 218963 218652 217593 216447 216094 216967 218599 220084 220915 221073 220493 219078 217337 216369
54342 216369 216793 217992 218803 218722 218027 216996 215546 213676 211799 210366 209383 208527 207676 207097 207044 207311 207362 206986
54324 206986 206605 206736 207309 207803 208014 208257 208699 208979 208842 208756 209299 210141 210262 209380 208566 209105 211002 212985
54306 212985 213838 213494 212867 212880 213663 214559 214870 214608 214424 214778 215324 215291 214338 212851 211442 210411 209767 209598
54288 209598 210166 211512 213070 213962 213849 213338 213242 213534 213465 212790 212284 212691 213613 214005 213585 213048 212937 212971 212720
$$ packed form
54415B09937l11m0k21o75r72q15r0R86J742J584P31L1m1J84K35J01L1J16L24O22
54395B13459Q82R03O98N63P00R47R87O96K15j97l36k67k67m81o80o24m33l40k13
54376B16212J96O53N78j26q92j236j244j162r37m55J32N52P13O37L90K04M02R71
54358B15588J431J319O25l11j059j146l53Q73J632J485Q31J58n80j415j741r68
54342B16369M24J199Q11q1o95j031j450j870j877j433r83q56q51n79n3K67N1l76
54324B06986l81J31N73M94K11K43M42K80j37q6N43Q42J21q82q14N39J897J983
54306B12985Q53l44o27J3P83Q96L11k62j84L54N46l3r53j487j409j031o44j69
54288B09598N68J346J558Q92j13n11r6K92o9o75n06M07R22L92m20n37j11L4k51
$$ plain form
54269 212720 212360 212336 212622 212791 212663 212480 212448 212419 212128 211557 210990 210726 210740 210675 210248 209674 209451 209718 210039 209990 209701
54248 209701 209583 209715 209804 209647 209339 209002 208616 208210 207993 208080 208168 207673 206313 204509 203121 202722 203167 203885 204436
54229 204436 204686 204617 204296 204019 204121 204526 204741 204465 203968 203675 203612 203448 202942 202144 201289 200644 200335 200150 199639
54210 199639 198599 197344 196363 195859 195770 196028 196574 197258 197910 198392 198440 197781 196638 195871 196195 197384 198606 199366
54192 199366 199768 199949 199779 199224 198620 198444 198901 199709 200176 199632 198095 196449 195695 196067 197084 198190 198961
54175 198961 198947 197990 196734 196227 196747 197468 197455 196617 195464 194371 193479 193066 193522 194841 196374 197268 197250 196869
54157 196869 196800 196869 196197 194497 192797 192323 192969 193563 193470 193102 192824 192304 191358 190683 191095 192510 194222 195838
54139 195838 197423 198955 200237 201249 202198 203270 204565 206096 207575 208468 208596 208467 208636 208983 209086 209125
$$ packed form
54269B12720l60k4K86J69j28j83l2k9k91n71n67k64J4o5m27n74k23K67L21m9k89
54248B09701j18J32Q9j57l08l37l86m06k17Q7Q8m95j360j804j388l99M45P18N51
54229B04436K50o9l21k77J02M05K15k76m97k93o3j64n06p98q55o45l09j85n11
54210A99639j040j255r81n04q9K58N46O84O52M82M8o59j143p67L24J189J222P60
54192A99366M02J81j70n55o04j76M57Q08M67n44j537j646p54L72J017J106P71
54175A98961j4r57j256n07N20P21j3q38j153j093q92m13M56J319J533Q94j8l81
54157A96869o9O9o72j700j700m74O46N94r3l68k78n20r46o75M12J415J712J616
54139A95838J585J532J282J012R49J072J295J531J479Q93J28j29J69L47J03L9
$$ plain form
54123 209125 209827 211473 213446 214928 215714 216230 217027 218413 220385 222735 225242 227715 229837 231108 231211
54108 231211 230359 229105 227840 226655 225553 224503 223308 221782 220113 218750 217807 216839 215450 213918 212932
54093 212932 212745 212847 212600 211951 211335 210946 210462 209581 208570 207993 208007 208212 208212 208054 208044 208319 208652 208646 208151 207652
54073 207652 207976 209305 210674 210966 210326 209940 210328 210655 210131 209342 209490 210718 212020 212623 212723 212783 212842 212758
54055 212758 212642 212713 213005 213498 214392 215979 218276 220904 223350 225377 227180 229102 231226 233397 235667 238404
54039 238404 241768 245315 248409 250928 253299 255955 258993 262237 265370 268069 270327 272510 274886 277141
54025 277141 278678 279288 279308 279242 279500 280322 281508 282294 281916 280390 278424 276546 274626 272307 269572 266890
54009 266890 264978 264287 264332 263674 261144 257141 253230 250392 248201 245824 243108 240340 237650 235215 233643
$$ packed form
54123B09125P02J646J973J482P86N16P97J386J972K350K507K473K122J271J03
54108B31211q52j254j265j185j102j050j195j526j669j363r43r68j389j532r86
54093B12932j87J02k47o49o16l89m84q81j011n77J4K05%j58j0K75L33om95m99
54073B07652L24J329J369K92o40l86L88L27n24p89J48J228J302O03J00O0N9q4
54055B12758j16P1K92M93Q94J587K297K628K446K027J803J922K124K171K270K737
54039B38404L364L547L094K519K371K656L038L244L133K699K258K183K376K255
54025B77141J537O10K0o6K58Q22J186P86l78j526j966j878j920k319k735k682
54009B66890j912o91M5o58k530m003l911k838k191k377k716k768k690k435j572
$$ plain form
53994 233643 233405 234058 234611 234615 234361 234084 233567 232692 231861 231519 231523 231313 230578 229555 228686 228161 227816 227374 226752 226085
53974 226085 225497 224936 224356 223987 224256 225368 227003 228506 229370 229545 229329 229022 228723 228477 228494 229042 230107 231295
53956 231295 232225 232851 233291 233496 233359 233136 233435 234666 236690 239148 241934 245167 248818 252654 256513 260381
53940 260381 264215 267941 271715 275943 280912 286603 292950 299958 307326 314262 320109 325053 329852 334907
53926 334907 340015 345033 350270 356066 362418 369332 377243 386744 398124 411413 426629 443540 461256
53913 461256 478513 494521 509319 523271 536353 547967 557272 563581 566533 565933 561567 553360 541776
53900 541776 527822 512442 496044 478785 461122 443787 427325 411959 397816 384974 373247
53889 373247 362338 352240 343184 335060 327251 319324 311643 304893 299139 293797 288653 284408 281812 280464
$$ packed form
53994B33643k38O53N53Mk54k77n17q75q31l42Mk10p35j023q69n25l45m42o22o67
53974B26085n88n61n80l69K69J112J635J503Q64J75k16l07k99k46J7N48J065J188
53956B31295R30O26M40K05j37k23K99J231K024K458K786L233L651L836L859L868
53940B60381L834L726L774M228M969N691O347P008P368O936N847M944M799N055
53926C34907N108N018N237N796O352O914P911R501J1380J3289J5216J6911J7716
53913D61256J7257J6008J4798J3952J3082J1614R305O309K952o00m366q207j1584
53900E41776j3954j5380j6398j7259j7663j7335j6462j5366j4143j2842j1727
53889C73247j0909j0098r056q124p809p927p681o750n754n342n144m245k596j348
$$ plain form
53875 280464 278973 276332 272715 268819 264980 261297 258147 255908 254331 252836 251406 250545 250302 249978 249024
53860 249024 247622 246162 244778 243751 243642 244445 245177 245021 244450 244489 245247 245949 246168 246087 245665 244533 242895
53843 242895 241662 241348 241504 241601 241841 242615 243678 244423 244691 244788 244828 244506 243587 242375 241563 241638 242450 243408 244128
53824 244128 244729 245425 246100 246631 247341 248623 250237 251580 252642 254068 256102 258073 259199 259486 259533 259853
53808 259853 260677 262063 263868 265798 267702 269632 271588 273575 275984 279357 283514 287405 290213 292176
53794 292176 293976 295800 297486 299180 301123 302981 304052 304180 303978 304063 304467 304866 304995 304707 303935 302772
53778 302772 301497 300338 299224 297831 295906 293550 291112 288650 285737 282090 278336 275634 274445 274117
53764 274117 273823 273352 272713 271624 269973 268344 267371 266783 265750 264120 262659 262034 262048 261982 261264 259821 258217
$$ packed form
53875B80464j491k641l617l896l839l683l150k239j577j495j430q61k43l24r54
53860B49024j402j460j384j027j09Q03P32j56n71L9P58P02K19q1m22j132j638
53843B42895j233l14J56R7K40P74J063P45K68R7M0l22r19j212q12P5Q12R58P20
53824B44128O01O96O75N31P10J282J614J343J062J426K034J971J126K87M7L20
53808B59853Q24J386J805J930J904J930J956J987K409L373M157L891K808J963
53794B92176J800J824J686J694J943J858J071J28k02Q5M04L99J29k88p72j163
53778C02772j275j159j114j393j925k356k438k462k913l647l754k702j189l28
53764B74117k94m71o39j089j651j629r73n88j033j630j461o25J4o6p18j443j604
$$ plain form
53747 258217 257534 258620 261246 264244 266614 268228 269473 270611 271711 272817 273968 275222 276895 279568
53733 279568 283611 288798 294550 300648 307671 316757 328802 343750 360607 378202 395750 412624 427992
53720 427992 441233 452712 463568 474506 484998 493734 499499 501499 499390 493471 484775 474497 463281
53707 463281 451277 438834 426760 415740 405830 396843 389120 383410 379860 377567 375522 373719 372782
53694 372782 372664 372494 371924 371778 372851 374677 376242 377521 379384 382083 384710 386289 386596 385729 383755 381218
53678 381218 379206 378186 377239 375227 372495 370646 370705 372108 373626 374652 375323 375849 376167 376227 376259 376607 377232
53661 377232 377497 376673 374826 372965 372045 371967 371862 371251 370458 369890 369386 368547 367317 365939 364544 363123 361769
53644 361769 360620 359614 358593 357631 357008 356841 356923 356993 356959 356789 356401 355831 355406 355592 356668 358598 361135 363970
$$ packed form
53747B58217o83J086K626K998K370J614J245J138J100J106J151J254J673K673
53733B79568M043N187N752O098P023R086J2045J4948J6857J7595J7548J6874J5368
53720D27992J3241J1479J0856J0938J0492Q736N765K000k109n919q696j0278j1216
53707D63281j2004j2443j2074j1020r910q987p723n710l550k293k045j803r37
53694C72782j18j70n70j46J073J826J565J279J863K699K627J579L07q67j974k537
53678C81218k012j020r47k012k732j849N9J403J518J026O71N26L18O0L2L48O25
53661C77232K65q24j847j861r20p8j05o11p93n68n04q39j230j378j395j421j354
53644C61769j149j006j021r62o23j67Q2P0l4j70l88n70m25J86J076J930K537K835
$$ plain form
53626 363970 366818 369455 371713 373521 375085 377017 380072 384539 389962 395595 401133 406878 413217 420131
53612 420131 427340 434743 442485 450545 458506 465897 472686 479224 485777 492384 499108 505938 512214 516662
53598 516662 518600 518889 519103 519795 520199 519586 518128 516166 513491 509947 506104 502613 499346 495943 492826
53583 492826 490761 489478 487687 484633 480876 477364 474431 471979 469874 467707 464779 460973 457258 454739
53569 454739 453381 452145 450254 447951 445998 444743 443697 441986 439317 436491 434647 433937 433440 432526 431675
53554 431675 431516 431661 431285 430519 430369 431225 432294 432805 433105 434057 435783 437572 438874 439876 441095 442870
53538 442870 445384 448813 453145 458083 463470 469689 477193 485599 493816 501321 508829 517303 526704 536387
53524 536387 546416 557658 570514 584371 598601 613490 629763 647596 666458 685613 704570
$$ packed form
53626C63970K848K637K258J808J564J932L055M467N423N633N538N745O339O914
53612D20131P209P403P742Q060P961P391O789O538O553O607O724O830O276M448
53598E16662J938K89K14O92M04o13j458j962k675l544l843l491l267l403l117
53583D92826k065j283j791l054l757l512k933k452k105k167k928l806l715k519
53569D54739j358j236j891k303j953j255j046j711k669k826j844p10m97r14q51
53554D31675j59J45l76p66j50Q56J069N11L00R52J726J789J302J002J219J775
53538D42870K514L429M332M938N387O219P504Q406Q217P505P508Q474R401R683
53524E36387J0029J1242J2856J3857J4230J4889J6273J7833J8862J9155J8957
$$ plain form
53513 704570 723424 743032 764422 787698 811900 836244 861079 887313 915256 944372 973740
53502 973740 1002421 1029880 1056590 1083817 1112276 1141343 1170063 1198465 1227249 1256614 1286201
53491 1286201 1315904 1345831 1375581 1404388 1432030 1458815 1484707 1509353 1533100 1557070 1581813
53480 1581813 1606614 1630589 1653797 1676706 1698997 1719714 1738576 1756556 1774874 1793601 1811478
53469 1811478 1827153 1840362 1851604 1860804 1866936 1869231 1868136 1864437 1857952 1847943 1834591 1819024
53457 1819024 1801845 1782588 1760975 1737764 1713858 1689198 1663195 1635795 1607517 1578714 1549349
53446 1549349 1519446 1489306 1459331 1429920 1401498 1374431 1348860 1324733 1301949 1280454 1260275
53435 1260275 1241481 1224063 1207990 1193519 1181250 1171529 1163935 1157799 1153172 1150883 1151675 1155639 1162372
$$ packed form
53513G04570J8854J9608K1390K3276K4202K4344K4835K6234K7943K9116K9368
53502I73740K8681K7459K6710K7227K8459K9067K8720K8402K8784K9365K9587
53491A286201K9703K9927K9750K8807K7642K6785K5892K4646K3747K3970K4743
53480A581813K4801K3975K3208K2909K2291K0717J8862J7980J8318J8727J7877
53469A811478J5675J3209J1242R200O132K295j095l699o485j0009j3352j5567
53457A819024j7179j9257k1613k3211k3906k4660k6003k7400k8278k8803k9365
53446A549349k9903l0140k9975k9411k8422k7067k5571k4127k2784k1495k0179
53435A260275j8794j7418j6073j4471j2269r721p594o136m627k289P92L964O733
$$ plain form
53422 1162372 1171172 1181135 1191722 1203420 1217296 1233744 1252114 1271655 1292298 1314399 1338270 1364172
53410 1364172 1392137 1421561 1451603 1482342 1514979 1550530 1588805 1629094 1671312 1715957 1763345
53399 1763345 1813399 1865937 1920759 1977698 2036874 2098613 2162876 2229134 2296994 2366406 2436989
53388 2436989 2507752 2577936 2647528 2716485 2784128 2849921 2914225 2977441 3038867 3097336 3152665
53377 3152665 3205541 3256135 3303724 3347691 3388047 3424860 3457931 3487118 3512264 3532528 3546432
53366 3546432 3552939 3552144 3544729 3531078 3511060 3484327 3450700 3410535 3364741 3314158 3258967 3199116
53354 3199116 3135259 3068882 3001420 2933589 2865476 2796853 2727423 2657297 2587351 2518670 2451536
53343 2451536 2385401 2319881 2255302 2192144 2130513 2070424 2012147 1955924 1901636 1849043 1798178
$$ packed form
53422A162372Q800R963J0587J1698J3876J6448J8370J9541K0643K2101K3871K5902
53410A364172K7965K9424L0042L0739L2637L5551L8275M0289M2218M4645M7388
53399A763345N0054N2538N4822N6939N9176O1739O4263O6258O7860O9412P0583
53388B436989P0763P0184O9592O8957O7643O5793O4304O3216O1426N8469N5329
53377C152665N2876N0594M7589M3967M0356L6813L3071K9187K5146K0264J3904
53366C546432O507p95p415j3651k0018k6733l3627m0165m5794n0583n5191n9851
53354C199116o3857o6377o7462o7831o8113o8623o9430p0126o9946o8681o7134
53343B451536o6135o5520o4579o3158o1631o0089n8277n6223n4288n2593n0865
$$ plain form
53332 1798178 1749352 1703055 1659987 1620872 1585913 1554564 1526006 1499691 1475351 1452730 1431559
53321 1431559 1411672 1393056 1375836 1360232 1346322 1333840 1322387 1311820 1302221 1293517 1285496 1278273
53309 1278273 1272403 1268428 1266534 1266734 1269031 1273295 1279263 1286888 1296450 1308175 1321926 1337377 1354324
53296 1354324 1372761 1392870 1415009 1439392 1465695 1493194 1521403 1550272 1579696 1609229 1638535
53285 1638535 1667744 1697069 1726297 1754941 1782714 1809587 1835584 1860709 1884891 1907693 1928307
53274 1928307 1946157 1961390 1974417 1985097 1992703 1996702 1997201 1994579 1988944 1980110 1967900 1952305 1933441
53261 1933441 1911502 1886808 1859812 1830935 1800247 1767430 1732227 1695004 1656658 1617939 1579095
53250 1579095 1540227 1501633 1463522 1425689 1387891 1350420 1313898 1278497 1243722 1209029 1174388
$$ packed form
53332A798178m8826m6297m3068l9115l4959l1349k8558k6315k4340k2621k1171
53321A431559j9887j8616j7220j5604j3910j2482j1453j0567r599q704q021p223
53309A278273n870l975j894K00K297M264N968P625R562J1725J3751J5451J6947
53296A354324J8437K0109K2139K4383K6303K7499K8209K8869K9424K9533K9306
53285A638535K9209K9325K9228K8644K7773K6873K5997K5125K4182K2802K0614
53274A928307J7850J5233J3027J0680P606L999M99k622n635q834j2210j5595j8864
53261A933441k1939k4694k6996k8877l0688l2817l5203l7223l8346l8719l8844
53250A579095l8868l8594l8111l7833l7798l7471l6522l5401l4775l4693l4641
$$ plain form
53239 1174388 1140146 1106660 1074103 1042332 1010813 979081 947552 917588 890324 865608 842430
53228 842430 820214 799162 779415 760596 742523 725751 710849 697375 684143 670446 656555
53217 656555 643034 630015 617158 603979 590176 576019 562457 550400 539767 529650 519472
53206 519472 509495 500072 491087 482492 474711 467903 461377 454461 447556 441482 436008 430028 423203 416515
53192 416515 410905 406153 401532 396885 392501 388322 383901 379012 373873 368880 364343 360395 356912 353656
53178 353656 350670 348345 346928 346103 345298 344221 342910 341438 339835 338143 336364 334437 332450 330741 329579
53163 329579 328909 328600 328808 329695 330846 331378 330879 329985 329774 330631 331939 332894 333361 333730 334143 334271 333885 333275
53145 333275 332857 332668 332530 332494 332755 333320 334106 335209 336707 338373 340036 342019 344576 347047 348396 348666
$$ packed form
53239A174388l4242l3486l2557l1771l1519l1732l1529k9964k7264k4716k3178
53228H42430k2216k1052j9747j8819j8073j6772j4902j3474j3232j3697j3891
53217F56555j3521j3019j2857j3179j3803j4157j3562j2057j0633j0117j0178
53206E19472r977r423q985q595p781o808o526o916o905o074n474n980o825o688
53192D16515n610m752m621m647m384m179m421m889n139m993m537l948l483l256
53178C53656k986k325j417q25q05j077j311j472j603j692j779j927j987j709j162
53163C29579o70l09K08Q87J151N32m99q94k11Q57J308R55M67L69M13J28l86o10
53145C33275m18j89j38l6K61N65P86J103J498J666J663J983K557K471J349K70
$$ plain form
53129 348666 349042 350186 351375 351798 351919 352760 354402 356006 356971 357192 356463 354570 352033 349882 348504 347309
53113 347309 345720 343847 341970 340000 337826 335713 333942 332381 330798 329260 327843 326259 324201 321902
53099 321902 319904 318408 317207 316170 315330 314513 313344 311821 310484 309781 309510 309238 309076 309587 310902 312317
53083 312317 312964 312664 311866 310930 309864 308757 308090 308322 309320 310497 311451 312287 313242 314208 314763 314601 313831 312839
53065 312839 311925 311091 310165 309071 307930 306947 306263 305966 306130 306721 307498 308142 308552 308965 309695 310768 311883
53048 311883 312727 313207 313334 313030 312267 311291 310472 309845 309082 308069 307293 307401 308463 309889 311102 312063 313136
53031 313136 314571 316172 317389 317794 317541 317234 317232 317251 316881 316238 315825 315834 316057 316422 317130 318160 319057 319472 319597
53012 319597 319845 320335 320941 321625 322463 323411 324259 324786 324938 324944 325211 325886 326593 326913 327098 327872 329400 330992 332091
$$ packed form
53129C48666L76J144J189M23J21Q41J642J604R65K21p29j893k537k151j378j195
53113C47309j589j873j877j970k174k113j771j561j583j538j417j584k058k299
53099C21902j998j496j201j037q40q17j169j523j337p03k71k72j62N11J315J415
53083C12317O47l00p98r36j066j107o67K32R98J177R54Q36R55R66N55j62p70r92
53065C12839r14q34r26j094j141r83o84k97J64N91P77O44M10M13P30J073J115
53048C11883Q44M80J27l04p63r76q19o27p63j013p76J08J062J426J213R61J073
53031C13136J435J601J217M05k53l07kJ9l70o43m13RK23L65P08J030Q97M15J25
53012C19597K48M90O06O84Q38R48Q48N27J52OK67O75P07L20J85P74J528J592J099
$$ plain form
52993 332091 333034 334426 336138 337494 338262 338925 339965 341318 342578 343393 343579 343094 342033 340631 339274 338473
52977 338473 338629 339711 341338 343243 345403 347649 349554 350911 351936 352736 352998 352617 352172 352252 352619 352618 352178
52960 352178 351739 351390 350810 349959 349125 348197 346684 344649 342935 342108 341640 340607 338867 337187 336353 336371 336462
52943 336462 335742 334056 332088 330514 329274 328033 327064 326950 327492 327767 327439 327239 327779 328611 328941 328693 328301
52926 328301 327956 327664 327657 328075 328533 328561 328287 328139 328083 327753 327185 326814 326848 327164 327770 328780 329935 330706 330952 331008
52906 331008 331039 330778 330032 329027 328123 327576 327612 328329 329398 330327 331111 332172 333478 334287 334132 333612 333731 334705
52888 334705 335887 336673 337015 337030 336570 335291 333012 329900 326436 323186 320516 318523 317215 316583 316437 316358
52872 316358 316022 315491 315065 314912 314952 314950 314588 313599 312033 310334 309019 308323 308196 308438 308709 308676 308386 308317 308817
$$ packed form
52993C32091R43J392J712J356P68O63J040J353J260Q15J86m85j061j402j357q01
52977C38473J56J082J627J905K160K246J905J357J025Q00K62l81m45Q0L67jm40
52960C52178m39l49n80q51q34r28j513k035j714q27m68j033j740j680q34J8R1
52943C36462p20j686j968j574j240j241r69j14N42K75l28k00N40Q32L30k48l92
52926C28301l45k92pM18M58K8k74j48n6l30n68l71L4L16O06J010J155P71K46N6
52906C31008L1k61p46j005r04n47L6P17J069R29P84J061J306Q09j55n20J19R74
52888C34705J182P86L42J5m60j279k279l112l464l250k670j993j308o32j46p9
52872C16358l36n31m26j53M0kl62r89j566j699j315o96j27K42K71l3k90o9N00
$$ plain form
52853 308817 309655 310420 311141 312048 312831 312719 311466 309798 308703 308596 309371 310793 312481 313763 314058 313370 312116
52836 312116 310562 308730 306765 305012 303656 302571 301620 300826 300118 299169 297716 295908 294179 292870 292196
52821 292196 292464 294080 297220 301645 306833 312192 317136 321184 324205 326535 328670 330814 332720 333906
52807 333906 333935 332577 329943 326461 322530 318152 313123 307657 302492 298133 294269 290297 286224 282672 280033
52792 280033 278165 276897 276313 276266 276106 275320 274193 273459 273431 273786 274098 274295 274660 275601 277281 279308 281012
52775 281012 282261 283737 285978 288403 289828 289879 289311 288909 288631 288045 287087 286102 285472 285447 286045 286830 287100 286618
52757 286618 285957 285849 286347 286896 287052 286844 286536 286314 286227 286268 286490 287047 288020 289147 290020 290637 291514 293038 294962
52738 294962 296757 298219 299420 300331 300856 301100 301203 300985 300153 298783 297218 295552 293671 291912 291093 291578
$$ packed form
52853C08817Q38P65P21R07P83j12j253j668j095j07P75J422J688J282K95o88j254
52836C12116j554j832j965j753j356j085r51p94p08r49j453j808j729j309o74
52821B92196K68J616L140M425N188N359M944M048L021K330K135K144J906J186
52807C33906K9j358k634l482l931m378n029n466n165m359l864l972m073l552k639
52792B80033j868j268n84m7j60p86j127p34k8L55L12J97L65R41J680K027J704
52775B81012J249J476K241K425J425N1n68m02k78n86r58r85o30k5N98P85K70m82
52757B86618o61j08M98N49J56k08l08k22q7M1K22N57R73J127Q73O17Q77J524J924
52738B94962J795J462J201R11N25K44J03k18q32j370j565j666j881j759q19M85
$$ plain form
52722 291578 292616 293032 292450 291460 290619 289724 288313 286560 285237 284754 284689 284503 284385 284948 286268 287756 288986
52705 288986 290082 291120 291768 291881 291957 292535 293472 294319 295043 295829 296511 296925 297655 299532 302292 304519 305247
52688 305247 305021 305027 305716 306700 307576 308298 308918 309409 309752 309985 310262 310941 312346 314269 315933 316724 316762 316619 316734
52669 316734 317326 318559 320327 322101 323402 324370 325522 326974 328326 329308 330144 331146 332264 333214 333845 334148
52653 334148 334084 333617 332871 332106 331452 330703 329415 327320 324735 322519 321402 321246 321075 319964 317903 315723
52637 315723 314228 313534 313263 313152 313283 313791 314639 315703 316896 318074 318993 319544 319937 320440 321009 321341 321271 320947
52619 320947 320616 320374 320097 319574 318759 318022 317944 318650 319494 319723 319327 318877 318641 318337 317768 317155 316705 316357 316224
52600 316224 316820 318401 320422 322060 323063 323732 324277 324618 324731 324806 325063 325654 326651 327883 328912 329447 329711
$$ packed form
52722B91578J038M16n82r90q41q95j411j753j323m83o5j86j18N63J320J488J230
52705B88986J096J038O48J13P6N78R37Q47P24P86O82M14P30J877K760K227P28
52688C05247k26OO89R84Q76P22O20M91L43K33K77O79J405J923J664P91L8j43J15
52669C16734N92J233J768J774J301R68J152J452J352R82Q36J002J118R50O31L03
52653C34148o4m67p46p65o54p49j288k095k585k216j117j56j71j111k061k180
52637C15723j495o94k71j11J31N08Q48J064J193J178R19N51L93N03N69L32p0l24
52619C20947l31k42k77n23q15p37p8P06Q44K29l96m50k36l04n69o13m50l48j33
52600C16224N96J581K021J638J003O69N45L41J13P5K57N91R97J232J029N35K64
$$ plain form
52583 329711 330161 331039 332462 334635 337494 340278 342051 342694 342872 343078 343263 343425 343826 344292 344008 342510 340452
52566 340452 338832 337835 336998 336221 335858 335930 335968 335769 335680 335930 336220 336275 336285 336421 336348 335738 334967 334712 334984 335134
52546 335134 334799 334295 333904 333343 332263 330913 329900 329504 329558 329852 330293 330764 331163 331602 332268 333062 333637 333845
52528 333845 333951 334275 334821 335335 335641 335835 336183 336839 337627 338237 338733 339615 341092 342468 342734 341815 340768 340582
52510 340582 341177 341818 342046 341804 340964 339333 337138 335017 333345 331838 330061 328112 326517 325478 324506 323034
52494 323034 321284 320139 320070 320450 320318 319593 319119 319551 320710 322141 323784 325763 327923 329931 331665 333167
52478 333167 334427 335431 336268 336965 337489 338113 339419 341610 344136 346406 348432 350320 351568 351652 351079 350963
52462 350963 351531 351918 351562 350930 350487 349770 348112 345696 343193 340796 338308 336006 334629 334458 334885 335042
$$ packed form
52583C29711M50Q78J423K173K859K784J773O43J78K06J85J62M01M66k84j498k058
52566C40452j620r97q37p77l63P2L8j99q9K50K90N5J0J36p3o10p71k55K72J50
52546C35134l35n04l91n61j080j350j013l96N4K94M41M71L99M39O66P94N75K08
52528C33845J06L24N46N14L06J94L48O56P88O10M96Q82J477J376K66r19j047j86
52510C40582N95O41K28k42q40j631k195k121j672j507j777j949j595j039r72j472
52494C23034j750j145o9L80j32p25m74M32J159J431J643J979K160K008J734J502
52478C33167J260J004Q37O97N24O24J306K191K526K270K026J888J248Q4n73j16
52462C50963N68L87l56o32m43p17j658k416k503k397k488k302j377j71M27J57
$$ plain form
52446 335042 334538 333560 332552 331867 331573 331556 331823 332468 333220 333410 332780 331959 331613 331396 330442 328824 327660 327583
52428 327583 327861 327498 326562 325827 325613 325692 326076 327088 328619 330080 331288 332842 335285 338371 341531 344770
52412 344770 348677 353708 359801 366558 373412 379674 384817 388827 392042 394612 396424 397597 398665 399971
52398 399971 401069 401074 399502 396513 392426 387373 381603 375808 370777 366766 363502 360780 358802 357762 357401
52383 357401 357275 357347 357987 359366 361213 363264 365634 368479 371548 374366 376757 378904 380965 382890 384571
52368 384571 385909 386811 387399 388146 389433 390927 391758 391464 390496 389721 389751 390836 392985 395832 398614 400649
52352 400649 401865 402776 404019 405923 408273 410394 411756 412587 413661 415397 417551 419916 422797 426449 430600
52337 430600 435090 440540 447658 456043 464441 472231 480017 488724 498673 509732 521729 534371 547177
$$ packed form
52446C35042n04r78j008o85k94j7K67O45P52J90o30q21l46k17r54j618j164p7
52428C27583K78l63r36p35k14P9L84J012J531J461J208J554K443L086L160L239
52412C44770L907N031O093O757O854O262N143M010L215K570J812J173J068J306
52398C99971J098Nj572k989m087n053n770n795n031m011l264k722j978j040l61
52383C57401j26P2O40J379J847K051K370K845L069K818K391K147K061J925J681
52368C84571J338R02N88P47J287J494Q31k94r68p75L0J085K149K847K782K035
52352D00649J216R11J243J904K350K121J362Q31J074J736K154K365K881L652M151
52337D30600M490N450P118Q385Q398P790P786Q707R949J1059J1997J2642J2806
$$ plain form
52324 547177 559835 572440 585245 598450 612315 627101 642714 658686 674715 690906 707289
52313 707289 723533 739402 755237 771655 788939 806900 825089 842860 859538 874878 889247
52302 889247 903128 916595 929509 941912 953819 964743 973929 981088 986553 990663 993345 994526 994695
52289 994695 994769 995309 995978 995887 994489 992078 989334 986603 983893 981431 979694 978707 977765 976249 974425 973158
52273 973158 973049 974216 976686 980477 985362 990977 997249 1004473 1012968 1022861 1034068 1046204 1058641 1070981
52259 1070981 1083339 1095855 1108166 1119895 1131464 1143748 1156843 1169822 1181878 1193034 1203496
52248 1203496 1213021 1221374 1228806 1235555 1241307 1245752 1249197 1251957 1253536 1253286 1251607 1249575 1247358 1244098
52234 1244098 1239589 1235093 1231835 1229444 1226661 1223081 1219364 1216040 1212993 1210126 1207687 1205692 1203681 1201365
$$ packed form
52324E47177J2658J2605J2805J3205J3865J4786J5613J5972J6029J6191J6383
52313G07289J6244J5869J5835J6418J7284J7961J8189J7771J6678J5340J4369
52302H89247J3881J3467J2914J2403J1907J0924R186P159N465M110K682J181J69
52289I94695P4N40O69r1j398k411k744k731k710k462j737r87r42j516j824j267
52273I73158j09J167K470L791M885N615O272P224Q495R893J1207J2136J2437J2340
52259A070981J2358J2516J2311J1729J1569J2284J3095J2979J2056J1156J0462
52248A203496R525Q353P432O749N752M445L445K760J579k50j679k032k217l260
52234A244098m509m496l258k391k783l580l717l324l047k867k439j995k011k316
$$ plain form
52220 1201365 1199098 1197402 1196437 1196271 1197266 1199699 1203185 1206937 1210567 1214290 1218431 1223101 1228330 1234081 1240023
52205 1240023 1245693 1251085 1256731 1262914 1269115 1274688 1279925 1285965 1293517 1302051 1310432 1318010 1324785 1330732
52191 1330732 1335489 1338802 1340922 1342310 1343066 1342790 1340926 1337215 1332026 1326411 1321546 1317714 1313893 1308748
52177 1308748 1302121 1295250 1289413 1284681 1280211 1275399 1270367 1265526 1261138 1257380 1254458 1252462 1251196 1250309
52163 1250309 1249532 1248793 1248227 1248037 1248299 1248884 1249675 1250690 1251904 1253058 1253912 1254603 1255480 1256637 1257823 1258818 1259562
52146 1259562 1259903 1259565 1258531 1257154 1255719 1254102 1252037 1249512 1246804 1244333 1242594 1241946 1242250 1242937 1243677
52131 1243677 1244751 1246579 1249213 1252644 1257309 1263820 1272283 1282291 1293522 1305890 1319168 1332990 1347364
52118 1347364 1362735 1379351 1396936 1415173 1434188 1454259 1475312 1496990 1518997 1541069 1562806
$$ packed form
52220A201365k267j696r65j66R95K433L486L752L630L723M141M670N229N751N942
52205A240023N670N392N646O183O201N573N237O040P552Q534Q381P578O775N947
52191A330732M757L313K120J388P56k76j864l711n189n615m865l832l821n145
52177A308748o627o871n837m732m470m812n032m841m388l758k922j996j266q87
52163A250309p77p39n66j90K62N85P91J015J214J154Q54O91Q77J157J186R95P44
52146A259562L41l38j034j377j435j617k065k525k708k471j739o48L04O87P40
52131A243677J074J828K634L431M665O511Q463J0008J1231J2368J3278J3822J4374
52118A347364J5371J6616J7585J8237J9015K0071K1053K1678K2007K2072K1737
$$ plain form
52107 1562806 1583912 1604528 1624984 1645189 1664566 1682587 1699132 1714216 1727598 1738880 1747877
52096 1747877 1754748 1759718 1762765 1763600 1761994 1758154 1752756 1746555 1740028 1733375 1726733 1720204 1713812 1707644
52082 1707644 1701952 1696855 1691982 1686833 1681719 1677890 1676367 1676846 1678132 1679547 1681528 1684915 1690160 1697283
52068 1697283 1706077 1716046 1726568 1737474 1749241 1762233 1775964 1789475 1802253 1814416 1826152 1837458
52056 1837458 1848317 1858619 1867867 1875433 1881206 1885556 1888585 1889954 1889606 1888043 1885555 1881702 1876107 1869296
52042 1869296 1862094 1854477 1845798 1836022 1825989 1816301 1806601 1796266 1785300 1774186 1763217 1752368
52030 1752368 1741610 1730936 1720211 1709272 1698227 1687455 1677355 1668182 1660042 1652882 1646526 1640800
52018 1640800 1635598 1630788 1626099 1621138 1615433 1608498 1600002 1589886 1578208 1564958 1550225 1534448 1518013
$$ packed form
52107A562806K1106K0616K0456K0205J9377J8021J6545J5084J3382J1282Q997
52096A747877O871M970L047Q35j606l840n398o201o527o653o642o529o392o168
52082A707644n692n097m873n149n114l829j523M79J286J415J981L387N245P123
52068A697283Q794R969J0522J0906J1767J2992J3731J3511J2778J2163J1736J1306
52056A837458J0859J0302R248P566N773M350L029J369l48j563k488l853n595o811
52042A869296p202p617q679r776j0033r688r700j0335j0966j1114j0969j0849
52030A752368j0758j0674j0725j0939j1045j0772j0100r173q140p160o356n726
52018A640800n202m810m689m961n705o935q496j0116j1678j3250j4733j5777j6435
$$ [...]
##END NTUPLES=NMR SPECTRUM
##END=
