##TITLE=AC1469_13FE002651_8026970_5drCmvS8Dh
##JCAMPDX= 6.0         $$ Bruker NMR JCAMP-DX V2.0
##DATA TYPE= NMR SPECTRUM
##DATA CLASS= NTUPLES
##ORIGIN= BRUKER
##OWNER= Administrator
$$ 1.72 TOPSPIN		Version 2.1
$$ 2013-07-11 20:01:27.426 -0700  Administrator@X
$$ Compression mode = diff/dup
##.OBSERVE FREQUENCY= 400.02188249412
##.OBSERVE NUCLEUS= ^1H
##.ACQUISITION MODE= SIMULTANEOUS (DQD)
##.ACQUISITION SCHEME= undefined
##.AVERAGES= 8
##.DIGITISER RES= 22
##SPECTROMETER/DATA SYSTEM= spect
##.PULSE SEQUENCE= zg30
##.SOLVENT NAME= COFFEE_meoh
##.SHIFT REFERENCE= INTERNAL, COFFEE_meoh, 1, 14.98509
##AUDIT TRAIL= $$ (NUMBER, WHEN, WHO, WHERE, PROCESS, VERSION, WHAT)
$$ ##TITLE= Audit trail, TOPSPIN		Version 2.1
$$ ##JCAMPDX= 5.01
$$ ##ORIGIN= Bruker BioSpin GmbH
$$ ##OWNER= Administrator
$$ $$ E:\/data/COFFEE/nmr/AC1469_13FE002651_8026970_5drCmvS8Dh/10/pdata/1/auditp.txt
$$ ##AUDIT TRAIL=  $$ (NUMBER, WHEN, WHO, WHERE, PROCESS, VERSION, WHAT)
(   1,<2013-07-11 20:01:20.519 -0700>,<Administrator>,<X>,<go>,<TOPSPIN 2.1>,
      <created by zg
	started at 2013-07-11 20:00:14.379 -0700,
	POWCHK enabled, PULCHK disabled,
       configuration hash MD5:
       C8 4E 4E 5D D3 5C D8 9E 9F 52 82 E0 59 8A DE 15
       data hash MD5: 64K
       84 3B A6 7F 58 EB BE E2 52 86 5B 6F 86 FF 2E 3F>)
(   2,<2013-07-11 20:01:23.410 -0700>,<Administrator>,<X>,<proc1d>,<TOPSPIN 2.1>,
      <Start of raw data processing
       efp LB = 0 FT_mod = 6 PKNL = 1 PHC0 = 0 PHC1 = 0 SI = 32K 
       data hash MD5: 32K
       F4 B9 28 34 6A B6 3F 46 2D 8C A2 FC 10 8B AA DE>)
(   3,<2013-07-11 20:01:23.738 -0700>,<Administrator>,<X>,<proc1d>,<TOPSPIN 2.1>,
      <pk PHC0 = 95.87769 PHC1 = 0 
       data hash MD5: 32K
       93 01 0D F8 DC 40 44 3F F9 29 8E 37 C6 86 B0 29>)
(   4,<2013-07-11 20:01:23.894 -0700>,<Administrator>,<X>,<proc1d>,<TOPSPIN 2.1>,
      <abs ABSG = 1 
       data hash MD5: 32K
       EA 6A 4B 7B 4E 91 09 F0 93 12 17 9D 4C 19 99 E3>)
(   5,<2013-07-11 20:01:24.019 -0700>,<Administrator>,<X>,<proc1d>,<TOPSPIN 2.1>,
      <abs ABSG = 2 
       data hash MD5: 32K
       C9 9E 2D 0B 22 8C 48 1F 96 1D 89 0A 6C 87 05 68>)
(   6,<2013-07-11 20:01:24.097 -0700>,<Administrator>,<X>,<proc1d>,<TOPSPIN 2.1>,
      <abs ABSG = 3 
       data hash MD5: 32K
       17 AA FB DA 5D F9 B0 16 84 DF 64 36 FE C4 2C DB>)
(   7,<2013-07-11 20:01:24.176 -0700>,<Administrator>,<X>,<proc1d>,<TOPSPIN 2.1>,
      <abs ABSG = 4 
       data hash MD5: 32K
       DE B0 B4 A3 F4 56 91 AC 7E 42 C5 31 ED B8 39 8B>)
(   8,<2013-07-11 20:01:24.254 -0700>,<Administrator>,<X>,<proc1d>,<TOPSPIN 2.1>,
      <abs ABSG = 5 
       data hash MD5: 32K
       59 27 C3 1F 5A 91 B9 FC C6 96 9C 75 43 D5 7C 96>)
$$ ##END=
$$ 
$$ $$ hash MD5
$$ $$ 6D 3F 57 DE 2D BB FA EB 50 DF 99 DF 22 A9 4A 02
##$RELAX= 
##$RELAX= 
##$RELAX= 
##$RELAX= 
##$RELAX= 
##$RELAX= 
##$RELAX= 
$$ Bruker specific parameters
$$ --------------------------
##$DU= <E:\>
##$EXPNO= 10
##$NAME= <AC1469_13FE002651_8026970_5drCmvS8Dh>
$$ [...]
##$TP= (0..7)
150 150 150 150 150 150 150 150
##$TP07= 0
##$TPNAME0= <>
##$TPNAME1= <>
##$TPNAME2= <>
##$TPNAME3= <>
##$TPNAME4= <>
##$TPNAME5= <>
##$TPNAME6= <>
##$TPNAME7= <>
##$TPOAL= (0..7)
0.5 0.5 0.5 0.5 0.5 0.5 0.5 0.5
##$TPOFFS= (0..7)
0 0 0 0 0 0 0 0
##$TUNHIN= 0
##$TUNHOUT= 0
##$TUNXOUT= 0
##$USERA1= <user>
##$USERA2= <user>
##$USERA3= <user>
##$USERA4= <user>
##$USERA5= <user>
##$V9= 5
##$VALIST= <valist>
##$VCLIST= <CCCCCCCCCCCCCCC>
##$VD= 0
##$VDLIST= <DDDDDDDDDDDDDDD>
##$VPLIST= <PPPPPPPPPPPPPPP>
##$VTLIST= <TTTTTTTTTTTTTTT>
##$WBST= 1024
##$WBSW= 4
##$XGAIN= (0..3)
0 0 0 0
##$XL= 0
##$YL= 0
##$YMAX_a= 648436
##$YMIN_a= -549991
##$ZGOPTNS= <>
##$ZL1= 120
##$ZL2= 120
##$ZL3= 120
##$ZL4= 120
##$ABSF1= 14.98509
##$ABSF2= -5.573092
##$ABSG= 5
##$ABSL= 3
##$ALPHA= 0
##$AQORDER= 0
##$ASSFAC= 0
##$ASSFACI= 0
##$ASSFACX= 0
##$ASSWID= 0
##$AUNMP= <proc_prof1d_extract_pilot.lims>
##$AXLEFT= 0
##$AXNAME= <>
##$AXNUC= <1H>
##$AXRIGHT= 0
##$AXTYPE= 0
##$AXUNIT= <>
##$AZFE= 0.1
##$AZFW= 0.1
##$BCFW= 0
##$BC_mod= 0
##$BYTORDP= 0
##$COROFFS= 0
##$CY= 15
##$DATMOD= 1
##$DC= 0
##$DFILT= <>
##$DTYPP= 0
##$F1P= 0
##$F2P= 0
##$FCOR= 0.5
##$FTSIZE= 32768
##$FT_mod= 6
##$GAMMA= 0
##$GB= 0
##$INTBC= 1
##$INTSCL= 1
##$ISEN= 128
##$LB= 0
##$LEV0= 0
##$LPBIN= 0
##$MAXI= 10000
##$MC2= 0
##$MEAN= 0
##$ME_mod= 0
##$MI= 0
##$NCOEF= 0
##$NC_proc= -8
##$NLEV= 6
##$NOISF1= 0
##$NOISF2= 0
##$NSP= 0
##$NTH_PI= 0
##$NZP= 0
##$OFFSET= 14.98509
##$PC= 1
##$PHC0= 95.87769
##$PHC1= 0
##$PH_mod= 1
##$PKNL= yes
##$PPARMOD= 0
##$PPDIAG= 0
##$PPIPTYP= 0
##$PPMPNUM= 2147483647
##$PPRESOL= 1
##$PSCAL= 4
##$PSIGN= 0
##$PYNMP= <proc.py>
##$REVERSE= no
##$SF= 400.02
##$SI= 32768
##$SIGF1= 0
##$SIGF2= 0
##$SINO= 400
##$SIOLD= 32768
##$SPECTYP= <>
##$SREGLST= <1H.CDCl3>
##$SSB= 0
##$STSI= 32768
##$STSR= 0
##$SW_p= 8223.68421052631
##$SYMM= 0
##$S_DEV= 0
##$TDeff= 65536
##$TDoff= 0
##$TI= <>
##$TILT= no
##$TM1= 0
##$TM2= 0
##$TOPLEV= 0
##$USERP1= <user>
##$USERP2= <user>
##$USERP3= <user>
##$USERP4= <user>
##$USERP5= <user>
##$WDW= 1
##$XDIM= 32768
##$YMAX_p= 448771177
##$YMIN_p= -661831
##$CURPLOT= <Network HP LaserJet P1505>
##$CURPRIN= <$Network HP LaserJet P1505>
##$DFORMAT= <normdp>
##$LAYOUT= <+/1D_H.xwp>
##$LFORMAT= <normlp>
##$PFORMAT= <normpl>
##$SURQMSG= 1
$$ End of Bruker specific parameters
$$ ---------------------------------
##NTUPLES= NMR SPECTRUM
##VAR_NAME=  FREQUENCY,     SPECTRUM/REAL,   SPECTRUM/IMAG
##SYMBOL=    X,             R,               I
##VAR_TYPE=  INDEPENDENT,   DEPENDENT,       DEPENDENT
##VAR_FORM=  AFFN,          ASDF,            ASDF
##VAR_DIM=   32768,         32768,           32768
##UNITS=     HZ,            ARBITRARY UNITS, ARBITRARY UNITS
##FACTOR=    0.250966925370066, 1,           1
##FIRST=     8223.43324360094, 24808,        12471
##LAST=      0,             -51075,          17706
##MIN=       0,             -661831,         0
##MAX=       8223.43324360094, 448771177,    0
$$ Real data points
##PAGE= N=1
##DATA TABLE= (X++(R..R)), XYDATA
$$ [...]
23833 -103618 11299 -44279 78788 100135 199876 -19249 -303428 214285 81771 -175437 -4306
23821 57393 -70898 -129617 18610 151434 119342 52306 -7362 -220539 -48310 -112523 -73733
23810 -73733 -286307 66422 -4685 21707 -237513 -87001 70930 -390561 -52919 -192866 109726
23798 -136034 -175567 -102127 201735 -49483 -18521 47396 -15117 -174893 -150822 -70142 -99558
23787 -99558 -233132 -119951 84083 -62741 -299277 75693 6742 -274019 -21748 214004 -198884
23775 77112 80497 94641 -67856 -151428 -309524 -3467 -149168 11723 9559 -26368 -17186 -164431
23763 -164431 151184 37465 210048 -49520 88311 -195397 42907 -178823 32491 140867
23753 140867 -74093 -191687 -6699 258422 -124860 -99248 15538 44956 307408 -234092 -75553
23741 -303029 -46010 82933 3216 -16205 -69743 -153734 -216083 -82684 69316 63244 43719 -4322
23728 127011 -19484 83659 -165516 -394254 91746 -49633 112080 -218994 -12691 -43242 -335770
23717 -335770 -607890 -356838 340322 -238709 -8012 39531 100747 -164764 115450 -52267
23706 -4261 89969 -124066 161687 -115356 -168997 62480 -13703 -80647 150767 32807 -55391
23694 166657 157369 -210 -3634 -270465 44388 58854 -76831 31912 236403 -179101 243586
23682 -16482 -105923 15786 201831 370875 -75762 153263 -85015 -339695 210939 232943 161126
23671 161126 79407 -115132 140269 -64469 -428430 -2892 93106 52614 51778 89605 -89008
23659 206689 88926 63173 23451 25814 28310 -48962 -173667 -13536 -175767 -169453 183509
23647 1729 -178763 -532 57805 -275644 -25561 89416 -4952 219684 167784 184103 -155207 -169189
23635 -169189 30161 -74737 -3768 -162147 -81922 95652 62423 257450 24599 60076 15808
23623 -105829 -116467 -275817 -29438 -228527 -138070 380040 73620 132739 -128906 -316367
23613 -316367 241151 194885 -219779 161637 85587 -23997 124168 43963 293513 -43182
23602 166294 24283 -2727 -192723 111661 -141498 -341829 -135265 76707 -208431 107621
23591 -77483 217595 56560 162036 -219943 197535 265695 -247297 141278 -85367 48823
23580 10930 -97319 71050 -180236 286855 -195684 -138843 -100315 -163416 -4022 110536 -153719
23568 95200 34204 -96873 44810 54226 57247 45489 -129045 668781 -145826 -55301 -132846
23557 -132846 -384803 1122 74656 -13992 -119121 89260 124917 157532 -10255 126999 -82759
23545 -135439 -148364 -14403 -182858 276120 207830 43575 123805 63729 -96837 -139952 -19556
23533 106077 -60912 86679 -15559 169956 16180 34349 -126490 -82887 47260 -161486 158069
23521 -174552 -15647 -84160 198527 -199743 375372 46227 -58760 -64400 -79828 45597 69270
23510 69270 -23052 139797 -162975 123770 87086 140027 175885 -153569 219009 -117264
23499 -50893 103561 -269687 73475 32951 36826 -6717 -630855 -99436 -339691 370445 -113631
23487 -488724 187046 -275751 269182 340870 -103669 57729 154781 -195167 -137624 -237392
23477 -237392 393051 -267132 -158656 83058 -98434 -6723 120029 276458 117505 -280595
23466 135607 -48930 -154105 -16638 -529187 -16274 -16903 -32567 -26379 453781 -53630 16414
23454 309522 -21805 239965 -177731 -112448 75057 -185855 -249113 -358994 158647 250186
23444 250186 -291815 118318 -27969 -44880 -73560 258736 176054 -54048 -11610 244211 -31865
23432 -289259 3935 171295 -416377 -65500 49442 73002 17632 198670 79586 317350 226522
23421 226522 -361775 226976 -201719 -429607 -204931 109165 -73706 -164539 -261083 -11936
23410 73085 -122850 -335909 8628 173220 -234686 113192 -41522 110043 404373 16937
23399 123514 -22652 -188763 -184701 -21858 -313617 -225637 -80612 -185849 229449 -69450 -140222
23388 -140222 151684 -3173 -123497 -151004 21029 -45929 -307961 -68494 16310 284922 243971
23377 243971 -27260 130964 7554 -343409 -44450 -59198 -435752 275077 -12390 23189 -124946
23365 7032 -237442 -117823 -209771 368929 -250822 -74727 -206400 -132199 -197132 -264491 220467
23353 112993 -65141 206980 -185875 -2105 -172067 118080 269909 307636 398733 31317 -51683
23341 212125 75018 35269 266465 136712 18608 26959 202565 -80447 32520 -44141 113118
23329 300428 -231105 108625 -220619 37943 189404 178640 47156 79497 101422 -214149
23318 -259646 -54755 -51482 -263705 -206163 -142903 13789 -266042 229401 20620 -329112 108707
23306 -300926 65833 -239747 -121966 274338 136600 -73478 -131459 36940 121730 66921 31526
23294 -186200 252047 20171 204325 -54906 132746 112484 13381 -130848 82150 -33968 67522
23282 -196464 148596 315701 157738 6247 -10569 162169 -13359 -124974 -24573 -304660
23272 -304660 -380891 -32539 11667 -30225 -14083 -196119 -102178 -94978 -435829 12025 -9989
23260 -159515 123348 -57873 126539 -197126 -158858 -29882 -359752 -233306 138035 19378
23249 -119382 -84509 -31359 132139 -23366 132720 194034 -63992 -83969 -216281 227825 230426
23238 230426 50550 -11643 78854 305524 -9029 -21061 -33176 -138086 -302735 -544232 26279
23226 94292 -36408 -32523 245311 -91663 47048 148468 -67487 -176349 -33686 226424 36796
23214 26947 97996 59792 -284464 -133047 86784 179670 -183074 91407 -44407 107986 21374
23202 -24505 -150339 -256201 -143232 209210 -4697 107545 203065 -548596 125956 -92356
23191 78135 51211 -216403 -54015 128589 299972 337654 -62505 295456 -358089 215986
23180 148135 -44048 -116215 -88886 -75079 -141076 253054 103733 -96333 210114 111825 -150448
23168 50372 -381101 -277364 -94923 -35849 -155073 -197410 176729 219901 -109052 87745 -48354
23156 -287673 155649 -191015 87087 -159073 -66257 220063 -33989 160372 -150200 -65174
23145 -220739 -342994 186319 -108961 87566 252861 -185418 244379 106916 53336 -97271
23134 -45836 -177813 141167 -366932 86882 138994 28351 51368 184789 402373 -15185 399156
23122 -409048 13800 113361 395561 -95131 26209 -156746 260841 -149234 28114 33929 -28094
23110 -288977 394288 279916 220134 128106 -151815 189730 340721 -84743 -56588 1508 -5761
23098 13678 -14711 -246992 -3019 13400 -202581 534883 354928 -341241 148626 -405654
23087 -121940 -201697 323048 -10254 -86032 91071 -193020 -203097 -139930 109166 1910 252643
23076 252643 -80135 909 -79577 -25896 -89058 -229577 -66257 -171414 102534 -101288 -143818
23065 -143818 -298777 -173637 33713 -89455 -305260 -40232 -125845 58483 -362885 12402 129783
23054 129783 4749 -201508 -119098 22359 -22156 273461 82886 224724 -80571 50185 -147307
23042 -83802 -42244 -15944 -109430 -146751 -92781 47969 -414259 -57024 320286 -108617 79394
23030 90237 117511 -33013 -362130 129890 -44392 110990 2714 -49410 -120474 75608 78462
23019 78462 18856 147065 -1609 205966 -34926 -44765 202598 -131712 -59624 -46951 -28594
23008 -28594 123051 480781 -27174 148097 -210132 -43145 -136541 250439 -190569 -35631
22997 393435 20007 39039 -30199 34056 -26090 125358 95408 126012 32550 217747 -110924
22985 -314975 -21240 -55928 77163 115689 -152904 -118184 -13052 198478 159032 -129864 28493
22973 102398 -210304 -225338 112504 121677 56701 -314926 -244584 -202869 -31582 -89429 107695
22961 4323 155801 238769 -89489 62827 -91742 46141 -150961 -150069 -20173 -63748 257391 -242425
22948 -231179 -57497 -39086 130020 41075 -226716 75344 -114447 -48855 40390 58824 -8604
22936 -142295 252212 -177308 -73969 -131455 -79543 144966 -205517 11533 -110138 -49032
22925 34057 13837 -14951 -94297 -191755 119755 -556384 -249477 -121510 -233548 46848 309649
22914 309649 -332621 -185044 -167651 -218063 80464 -305770 -44155 165526 46140 19958 -486747
22902 54212 18954 -261003 -131476 11245 119487 -255026 -216667 294702 70742 50779 -67656
22890 -107463 205652 -293344 -65964 -46682 201475 108333 -351615 162275 39138 -63358
22879 -403242 -221842 -98046 -58154 70236 262699 355770 -27396 161853 -84506 78340 39590
22868 39590 120909 18235 93161 -110273 59799 -236092 137903 92201 -63567 -71467 -305583
22857 -305583 -435254 -70904 -65681 292465 -127592 -78503 -188268 -100377 55667 -72122 86049
22845 -11924 -165692 30496 183573 195007 -195008 -36234 53356 256683 37265 -282914 -13002
22833 -99501 205040 -105412 -284863 56288 -104454 -113398 -144937 -347985 -186941 -503028
22823 -503028 -277613 -19268 -57908 -88518 -51776 -5316 -259368 -353045 107357 -307437 131486
22811 -106088 -14072 290676 288845 342202 -60507 -199450 -175233 223758 121018 -17161 -77112
22800 -77112 -249433 -341422 -24340 -101542 21470 310854 -102066 150449 -94527 153746 -229324
22788 -168275 110553 214972 -188059 134197 275194 18703 228698 -296353 -155839 378889
22777 -18214 65621 76491 267535 48976 -103673 135768 259702 5399 18124 86737 233442
22766 233442 231329 192912 -228662 -132595 -186330 -332786 60541 9609 79981 -25907 73075
22754 -198879 -59034 -99532 116866 -177474 -108568 -318999 226839 164056 -196248 28136
22743 104567 555632 54908 127389 -231591 -144439 108533 62159 162494 -288425 -67982
22732 2869 308113 -54494 -95718 -258159 302428 61642 -179403 115595 -132601 390080
22721 153934 -11526 164035 -110655 2988 -11441 -213949 -267274 -205973 -41082 51483 -60257
22709 -221580 -136121 -210938 -213359 -124220 93375 -229343 -179957 164263 -241502 -126795 111944
22697 -120163 -90254 27447 -4855 -49032 89069 -49441 -100125 -75044 9851 26736 46118 -341386
22684 257407 89317 -107753 117771 -79526 32175 -140212 22342 108970 -57554 -135768 177891
22672 -271761 206739 -325538 8207 -59915 66849 -118027 -257290 102268 27934 170991
22662 170991 12489 301277 -277886 -82232 33528 -34223 -88840 137226 -138229 -73542 -3672
22650 133856 -78987 164126 -99772 -2822 -123955 121337 -515011 317760 -18857 -232928
22640 -232928 -136303 -201811 -17356 -190153 214324 -206100 114842 -221137 -285031 150869
22629 -250890 -68839 75130 60004 10864 110347 141887 -30501 158758 44946 141744 84977
22618 84977 150324 -49305 -49675 30000 7350 -198957 306583 -198799 150258 -389021 100396
22606 -300741 -86739 -56624 -182012 16044 22986 -163444 -147474 136200 -159974 -351912 140970
22594 -193390 -126520 -14342 72497 -281740 106563 -135412 61688 -2459 24633 160324 149966
22583 149966 65149 -254587 59542 196847 -176232 -28070 61325 -235612 237464 -177549
22572 304308 -98136 99842 -42624 214916 107407 -172163 -111725 306629 -324736 -374385
22562 -374385 101256 108652 39420 113506 239626 -272957 24414 -41960 266193 140527 209401
22551 209401 -217499 323581 -79735 120093 176345 -200886 -273260 -77219 290663 -264025
22540 54387 262399 18143 326533 -79181 66165 -177103 2451 -92930 73838 -212872 38417
22528 64357 -575835 -118991 -23497 -174941 -306412 30723 173317 86355 150276 -75210 146100
22516 -168034 -87028 -98962 -57280 -158096 22268 183693 -294285 29379 3610 94735 66441
22505 66441 -273416 93653 -40285 -78120 -69789 -321691 -223938 -291637 155792 -174920 -30002
22493 32359 64958 -228510 -177414 -366505 -412580 211741 -139644 41774 -1660 -64568 -23193
22481 -56121 -227579 -83848 -40856 -313442 25031 38547 -125236 -244969 -1655 111962 114035
22470 114035 -245130 -280243 -51156 -3320 -33555 41769 309952 96361 -220527 91575 -106312
22458 -148950 -143653 -75250 246951 66001 -209899 122734 129120 165753 -8082 253807 -39666
22446 159809 -100511 -285572 -87766 -10169 133776 228062 -74248 7057 -272960 -55375 -27181
22434 75161 -109186 -282011 30332 -245687 48194 65757 10136 -38761 -133506 133213 -151763
22422 10044 10598 -152230 -359585 -35432 127718 204723 -164131 -76128 145791 140657 -62694
22410 134590 -201915 9880 -9229 231562 -240892 -153949 -268954 37217 -34375 261591 -47505
22398 155144 -423665 239045 68978 90311 -206734 -71097 34219 -307178 256008 -66752
22387 -322593 -117757 -17035 38442 116232 -71258 127588 73582 28922 237508 -85811 -38587
22375 -103863 56514 -5374 -85489 -165523 -30251 -27072 78 99890 -62528 -129551 -42566 -98592
22363 -98592 226035 -41910 -7688 166643 68773 189710 19746 161434 63783 78356 62086
22352 62086 -316873 -70668 67037 -190364 -19899 -63162 64142 -133507 44873 110377 -122595
22340 5574 200060 59786 242310 286646 -303810 173380 -147890 -278138 -205461 33365 -194310
22328 22004 -139764 43322 -97780 -72545 -152721 30021 -10330 -78601 332040 245177 -95114
22316 -187026 -197433 132119 46155 -22797 -151299 189603 -40075 112564 83463 -72160 -190979
22305 -190979 -119676 -114422 -178216 -177759 -182006 -124636 -627 -21030 2503 161091 -113118 -195539
22293 -195539 2889 74121 1490 -83894 48156 -26892 416027 -284541 -38116 -169065 -136123
22282 -136123 -116210 -236242 294460 -36131 -138333 65452 292508 246819 -644530 218169
22271 -237088 83364 -90551 -53936 70990 -219888 -219386 222835 79121 -141373 -74972 -277573
22260 -277573 -216031 -136686 -109891 -214284 -77477 26458 -84181 406683 66576 -2258 -213700
22249 -213700 113981 -202600 237449 -314775 -205906 149204 -219116 72142 -166603 -93125
22239 -93125 -234527 48581 55788 41988 -393547 74327 -25704 50034 -48658 127468 -178336
22227 169123 -135421 -457978 126036 -166278 -145565 -442430 73269 52703 -10478 -28126
22217 -28126 -50830 93472 -107865 -243840 292964 27667 -75235 33203 -162063 -21931 -74274
22206 -74274 39439 43171 -148665 237715 -156410 -117400 -152602 -98621 -245679 28671 292712
22195 292712 50159 224384 -41632 -59241 90891 -141810 -99342 37948 -15185 98275 96253
22184 96253 -437127 77593 96839 -35469 -132396 -248615 36791 -147957 267921 119499 -94483
22172 -1611 -101843 45692 -132311 -379319 283640 -145038 11894 210760 -34412 116334
22161 -31454 -274849 90380 1967 21654 335215 24222 15348 142427 -25460 258323 -31219
22149 134637 -8153 -207495 -237434 153104 -247212 6859 -144117 -127891 232146 -5991 253935
22137 -155449 -71133 -18560 -16718 185470 -106169 63901 -423502 -71377 -212628 -13079 -139534
22126 -139534 -281930 71525 -174921 154809 -33046 5304 -243405 7761 -30005 -157845 127064
22114 88253 165554 10137 -16353 -55506 -10919 855 26564 157651 76703 -394886 -177206
22102 15994 -113246 -178063 115999 49531 -43805 4233 -143297 -112627 79203 90346 -37667
22090 55370 -230773 58166 468752 -12413 -40879 84431 -203896 -225969 -200580 -104526 233944
22078 -51919 150294 -264765 -48789 301336 -92861 4943 381979 83208 -118596 -300706 74008
22066 108423 98786 175381 -203097 -216510 -149257 124260 92382 -236125 -173451 18093 -25472
22054 -162293 -176652 362041 55359 218066 -146126 152961 -48853 -553993 24424 59833
22044 59833 -102842 -267112 -94116 -139773 -183813 -65429 -276873 284597 169118 -151349
22033 127382 -149156 -148663 -258743 -203639 109289 -153343 -63632 134767 -170696 50552 -228698
22021 143544 236953 -133670 82087 -161604 -138695 329880 -278222 240960 -57580 -110475
22011 -110475 -156392 103966 -111123 -157619 -165629 229448 -161472 64056 -34970 -249372 -386758
22000 -386758 -80377 -249118 -56496 -313936 -114556 -421802 222337 237583 -205837 -78544
21989 109987 228121 146326 -259461 -108771 -14300 105135 -207394 -151387 -331557 137233
21978 302941 -112437 -140638 157146 -50830 290151 299583 -164723 84118 99671 -11952 71492
21966 189701 112176 -36283 82418 -241263 -95347 -130116 284715 -160298 -237287 154917 137651
21955 137651 221918 -184665 -330963 -150493 253083 243319 48419 -57273 9707 -32945 -213702
21944 -213702 -53689 -154647 -65718 -500331 -253032 -59890 129421 -122045 221804 -270013
21933 -22745 -107412 -197842 -84758 73689 72513 -147395 -188814 -255438 -350213 -238338 86520
21921 -39180 -137448 176655 -79702 -285454 -218037 -358089 -89841 -366110 33020 -189484 -72862
21909 -100900 124283 -171434 -87125 -78026 -218338 247499 -51245 -342527 152667 94098
21899 94098 120494 35740 -357230 114701 100518 -45609 -47189 -129330 -212263 81725 64765
21888 64765 145826 -4677 -93445 119064 133175 -256976 176447 26155 23048 43960 -183847
21876 -79464 -160133 -260195 -31798 -199105 78314 -104267 92977 -239720 -367551 150499
21865 148125 -14718 760 8127 28321 -192439 -543206 -60433 29268 20728 101557 113942 -246319
21852 -231387 -30542 -16010 -192034 -147461 -137534 -295780 291477 -18985 -313610 -61186 -210684
21841 -210684 367611 -112087 -234660 193852 -159364 226970 96438 63368 -366202 252880
21830 -155766 -119288 12073 127137 58700 80093 -317580 43301 171923 -243317 -91944 -85592
21819 -85592 283 -175865 -25284 123596 -127488 191946 -42525 23924 -69389 -39320 207400
21807 162072 99612 -108726 -145522 -42097 -137266 -312025 -208901 -287990 -77067 123502 -98587
21795 26214 -272980 -142721 -21796 229606 194266 -196122 -175247 -64163 65262 82151 -210579
21783 -61421 -50698 19580 73977 98608 -79219 -2093 146123 -334945 -161473 203257 -61502
21771 -4460 181784 -130651 -136575 55247 -12955 -235032 -43555 225548 197950 -207862 -264234
21760 -264234 163207 33726 57970 122744 -195728 177699 306549 -110079 -91444 166414
21749 87884 113380 165611 227161 -55330 -301305 -494965 -143184 205547 127486 -88935 46561
21737 43311 -63198 -186193 -254471 140424 126447 -66888 157513 -138459 -363809 113098
21726 -39723 30576 -444444 -236703 -196424 -141671 302549 -147985 165623 212606 -89178 357633
21714 67822 139507 -277789 58209 -237935 -141209 -264511 192635 -99398 190658 -162223
21703 -176409 -10883 197792 -121508 -59154 85033 -117448 -193533 -153137 -312547 -225078 -260008
21692 -260008 -511657 5101 75408 -307454 -239765 227778 -99559 -138013 -29173 -133255 32301
21680 262206 -128441 219441 -410257 -71138 -29025 92794 58047 59585 280608 -63617 -272358
21669 -272358 -158043 -56559 -135271 -65774 -84555 -86337 -84763 89696 225380 -85050 21371
21657 -261125 162418 -33187 45358 -202567 113220 9187 173483 -6712 35959 -65792 67803
21645 -198171 21287 -247578 -149975 29717 -111732 -312685 -547454 -20510 -8754 -2048 -62998
21634 -62998 120546 253118 -212259 158382 88274 79713 -277404 -661831 -199941 164694
21623 36050 169976 -103330 -195507 53341 92450 -27763 -4729 -104932 -295343 134709 346247
21612 346247 58388 29954 389110 -66415 -95346 29879 1774 -301672 79804 287904 -375
21600 -398466 -199035 17613 71894 -305248 -82744 -191613 75709 19362 -45124 -152387 -22665
21588 285755 64711 120037 -108385 93694 -33929 114195 -85005 80331 -174304 -150501 -121291
21577 -121291 110240 -55882 2375 48312 3694 107043 297530 11341 40441 156896 153507
21566 153507 -198957 -116592 73603 57015 -118390 62728 -117649 55411 50043 -75489 14664
21554 331641 5671 -327045 -445849 -38084 17700 -133258 -240792 87558 -174500 20370 -276711
21542 -8404 120613 82129 204537 95964 67786 -70273 45724 252037 -114816 -52477 -66915
21531 -66915 -424873 -140224 123591 -19504 135815 -252791 -37920 -32938 184973 -93149 180578
21519 33760 291127 -250975 -83529 -172899 -31329 166187 16868 -57398 -137539 -196424 -204216
21508 -204216 -1563 -350876 -37120 -30884 -473734 -255385 -299920 -38606 -167192 -92893 176017
21496 292605 -73213 36706 -24436 207802 -115590 16724 -155765 -80800 -270408 300392
21485 -64006 -193870 -324234 135807 -320486 -15433 -95331 -218211 56343 116195 -368862
21474 23817 -105807 21094 45123 24759 -7423 -105743 175603 -191081 87794 -69019 -415386
21463 -415386 -278963 -277064 -120786 152061 9599 -23260 94209 -210906 -111731 -236146 221335
21451 992 119747 -48317 -75912 -102049 -120282 -208173 5694 2976 -327390 62358 27707 309671
21439 309671 -142657 -26486 95168 124405 -152300 40800 -458307 -69935 105724 -158011
21428 133386 10006 -227721 237148 123862 3753 -176482 -148878 29766 408139 192739
21417 -287457 -106995 -307917 -65960 -175988 -259305 -431082 -29657 -70705 -348889 11678
21406 38103 173306 104282 -178972 -168039 -106648 -304620 338885 20037 -86757 -207556 120550
21394 133316 314955 -340268 -165303 -342864 -357505 76488 7531 185561 44754 -256646
21383 -52887 99638 -133115 193128 269946 -215867 10537 425181 -302729 -128003 -69143
21373 -69143 14832 -105073 -86029 141329 -297344 -46390 -63363 136117 -286045 -72279 -3633
21361 -49753 -468198 21640 6805 -154136 -4104 -235124 10911 -3035 -177889 133617 512825
21350 512825 43478 -177846 -122888 108151 -60279 -43620 -209633 75632 -385266 -295013 148859
21338 -74500 -172554 164163 -21597 -230695 297999 -11986 -146425 47780 -286078 -12900 -93392
21327 -93392 112375 -163822 -421646 -35159 -15776 19365 146831 -284697 201487 -51775
21316 -213689 77354 -73522 -82820 -172199 131923 322170 -197494 -46719 -50932 30126 49297
21305 49297 196451 -251047 9558 194634 120671 8581 -136293 -238312 6461 -269157 -57129
21293 -398540 -169534 -52684 -205739 136119 -151024 32163 115769 -165295 213143 -82666
21282 -7072 79244 248329 110237 -10963 114193 51300 -53101 17124 -126202 93901 121288
21271 121288 -33739 117459 -191401 -103140 18708 -128672 -157654 -128618 -428281 -58477 -106824
21260 -106824 -19418 -194023 95952 -166129 -102701 -420477 -113014 101943 -129769 -14764
21249 -243372 -97180 85633 -84165 -139749 167319 5458 48291 -126007 161091 -20542 17740
21237 293573 -92124 -3643 -313090 -38491 408975 473 -230302 -48062 53364 -142151 -218687
21226 -218687 5416 34774 -236808 7229 -219468 -5513 192712 20092 -375689 -81582 124163
21214 -138866 -108542 -63863 35839 -309637 35040 -87919 -244577 162609 26905 -404966 -144639
21202 111212 7784 167838 149592 107492 82680 -250553 95609 -976 133723 -34980 -381584
21191 -381584 -170138 -252822 -27602 -3366 -151906 14961 -120681 -34033 26267 -97206 156306
21179 -434745 192792 43878 -23643 10494 303551 42205 -201073 48355 13162 -90526 15487
21167 -468985 -151294 -406633 -221713 176398 -296314 -216242 170234 -202045 29380 -279267
21156 -234030 -156663 -72050 -481135 -103926 -141069 397548 29068 34370 -36472 -117800 -177569
21145 -177569 38198 -186547 -159003 -39029 -50778 -368190 98579 233705 -163734 -152623 -238893
21134 -238893 63003 -56588 12624 -360856 54 -287124 51829 -28279 155930 77435 125023
21123 125023 -254065 1251 -3899 -67693 -73211 -101196 -94072 -272520 -168540 -233207 95663 -136741
21110 51888 -43997 150697 -2482 43425 43029 -16592 -1571 -4069 104124 -15725 12033 -178120
21097 -6336 -74167 94486 -47682 310088 336004 -277111 -194051 61636 16701 -208978 91278
21085 23396 -366489 179199 402882 -207441 -357510 15375 24057 -99108 122855 -66334 -74141
21074 -74141 -156166 -4888 189503 192727 428864 -94432 -35532 243021 66068 -336089 185902
21062 11865 -112616 179248 -411331 -110621 -361584 133981 -187397 -262548 -48536 -26670
21052 -26670 48472 21979 246268 -132445 -272088 -84865 -291380 17182 -194317 -363144
21042 -363144 -97444 106408 -77586 -279754 -35455 -128669 -2658 205602 140812 209296 21356
21030 -120934 -122517 83461 -90701 -156765 -41242 205616 -229392 -39610 -318826 -309191 66735
21018 -150549 189041 182527 53306 -43598 -240151 -31957 291647 -176921 691 -104124 -93623
21007 -93623 164405 61444 42775 24585 -126766 -61213 -274535 -158841 55918 -169320 -357004
20996 -357004 145343 -173698 -166656 -27672 96212 -123538 -42352 230492 -192884 -80003 87749
20984 -49162 137745 -100170 -141139 10433 -53260 -129538 -45068 -56978 -61745 162448 -53823
20972 -118689 128507 -106313 86309 -210110 -70601 -155507 -195614 -16294 146819 -308608
20961 -38857 -380501 -43731 114931 -133959 -30553 124788 105920 55047 165863 -284362
20950 -95311 -193022 144289 179471 -78995 -49127 93252 -399223 88401 127081 21155 -112537
20938 -114752 51073 100186 -16772 -190815 -294374 48693 -246316 -323561 -229690 10677 -228667
20926 -44013 53825 -40794 -261903 44535 -208753 40764 -49048 178310 -140454 -211412 -343713
20915 -343713 -196657 188689 28806 6271 -181277 -208335 83888 -364256 -152268 -301539
20905 -301539 -42417 258328 12944 -163582 97373 -136992 -5435 11781 -25706 53847 197245
20894 197245 -105328 -93993 -88142 96573 -9907 -86067 61276 131315 -75335 -217354 44823
20882 -117495 -117810 -241805 168396 157569 49531 -295641 168058 -31632 431175 -92753 -144176
20871 -144176 342817 -211438 17289 113683 113148 26703 -15217 -133714 6841 -127208 254482
20859 -63721 -503871 -174367 289890 -325945 -55007 -94625 -204116 109628 50795 -42441
20848 -53854 28054 -81118 -149840 1958 -249054 59033 -358430 145552 374845 220073 -201947
20836 192726 -207115 -90528 -169080 39507 153145 117977 55309 7726 -247237 199023 124295
20825 124295 15170 71083 69579 6707 -125864 -305605 -143701 -196151 -196123 234854 154025 90877
20813 90877 122215 -45955 -254678 -115136 206142 125289 75775 -234017 113077 59223 -5769
20801 -76660 76349 -48768 -15151 -246771 190363 -89313 76635 176104 146524 -270041 110222
20789 -15174 -62759 15095 166652 110382 21553 -16152 -181935 -248548 96113 -436807 -118320
20777 -218631 102981 75402 136664 -38243 231223 -19277 -80225 86264 24852 39657 -177857
20765 -309650 -125289 31201 -53516 -128760 214561 -82868 -323731 238412 -245648 185001
20754 -311780 118128 208453 89247 77111 231597 -78849 -399737 -41448 -143529 53894 -105534
20742 452758 -50723 -40283 -164216 -92395 -14579 -226131 -106386 -223435 2443 204658 -35721
20730 -174987 -38615 -110007 46774 -104770 -91116 -226449 -140996 -198608 -46382 86902 -315313
20718 -294108 232074 15475 -52097 -120280 -104487 -66700 -161366 60554 -118878 -289775 33632
20706 -48168 196172 -75045 -322575 -69907 52447 356481 -429042 -228430 308243 -57220
20695 92008 -332061 223834 -255106 -287215 -216376 -68800 84921 -27869 -139715 -42515 -72934
20684 -72934 220760 -34465 11688 132799 4280 267605 -169928 -235859 -76208 111733 -101537
20672 -194058 -210668 312334 -44118 -262020 37864 130409 45852 -248653 -104267 -248390
20662 -248390 26211 52131 -70537 108066 -138014 -70772 -250731 -547754 92014 -57541 -12775
20650 -202311 -38340 -282732 56336 202550 75111 -9012 160413 -225503 -204928 -213500 -306584
20639 -306584 254892 -322017 -95252 175160 -267211 -59334 -20042 107589 -68438 2301 -22348
20627 26441 -95196 -220209 -186982 4843 103918 68293 -138344 -111777 256615 -26998 -105152
20616 -105152 -70860 150289 -247942 -147521 -38105 216322 152570 -181881 -119061 -50855
20605 25702 73542 -106318 102948 -180739 -270342 -81003 196455 105907 -102595 -150823 -113128
20594 -113128 37718 -91857 -163355 398082 -319418 46852 24212 105848 186816 -13577 -319513
20583 -319513 97954 304105 268686 54397 1742 75939 -180017 -79659 -91466 379231 -378122
20571 -16678 -159756 -132165 68961 202451 -81436 -131062 -404168 151322 -123366 58194 113977
20560 113977 -285989 -176762 74201 79210 -197019 -131545 -128976 108628 -168265 -72397 -6492
20548 96884 -162 80375 -48344 -97012 21421 -58146 -170396 -293824 -116811 59730 -79956
20536 -284956 -46385 -234190 -83486 26040 -441563 52534 -169360 211582 1875 -40263 135347
20524 40893 127380 134703 194158 -7696 104893 -69418 -72081 -166736 8852 -178985 203249 -90348
20511 44147 -142426 -127319 -223508 65669 -122681 -79957 -84710 -325885 142150 -135984 -59062
20499 -48041 -152886 110454 -11714 62531 -199185 -6129 19634 -218518 69444 -122412 -215601
20488 -215601 -247081 237388 80930 -268911 -57408 86776 -131583 70984 5144 -283892 -292889
20477 -292889 51203 -278875 -247569 90038 76612 67480 -14608 200477 153623 -27462 115949
20465 157719 -182385 -45871 132032 -59725 -235312 -29873 141011 -16412 63932 179070
20455 179070 -92137 329770 227760 36116 -343849 -5797 -190052 177456 42865 -259688
20444 -153582 -133237 226992 -29915 -130697 150580 92905 -76732 181998 -119042 31459
20433 -313451 -89875 29835 -73162 -74583 -360855 -181760 200782 -175535 -171003 -205320 63608
20421 -257830 155955 150534 -118053 -286540 -209868 84022 -87886 61442 -75343 -91776 -175320
20410 -175320 -12896 -59653 137615 -82093 142339 -199089 184548 20287 -280155 259825
20399 13045 -188316 -92132 150677 60506 156563 -168145 -338380 321808 -56967 -94605 19144
20387 -301976 -235709 2933 -316544 -106926 -255695 34656 61879 99379 -151511 -127556 -117358
20376 -117358 90452 44899 -256224 239393 -192725 -282915 34982 -194245 -241969 -281887 -126224
20364 109980 11722 -53791 -12771 -40277 -77818 49851 166276 10591 280977 257184 -64128
20352 -328504 -192823 -22047 181992 112397 -472563 -429879 -52910 -125630 -125800 -197561 -72659
20340 190860 4823 10382 -294798 -254312 -378002 -21923 -260872 -135323 113493 160889 -438664
20328 93034 -302105 130574 -54017 -70568 -121840 -355126 -75840 -56385 -162742 235081 -317818
20316 -280658 -193870 74005 35692 28484 102646 135998 -85951 107878 -85272 -52776 -218389
20305 -218389 -84491 212729 -404386 -99062 -130132 77669 -83204 156466 -289180 -13526 -78787
20294 -78787 -156880 416752 -118601 58266 -165691 -353954 -312860 -179618 200910 -58687
20283 -103625 177172 15172 -92240 96543 -94579 -320382 409358 -198510 -80444 -121706 -182028
20272 -182028 22322 -300471 -22611 -177483 -140994 163634 114798 -82457 70605 -304292 54752
20260 32380 8278 -261282 -224420 -261158 -226788 -44176 6133 -8719 -240479 106019 -242027
20248 74984 96138 -111135 -273881 -60880 -101321 194303 -106244 -264241 71184 58696 -147146
20236 88665 -188434 205448 163671 31684 -787 -10616 23174 -59380 -186590 -24012 14274 112300
20224 112300 57030 89137 -53257 -269408 -295265 -364359 37556 -168326 -5145 99211 -39420
20212 101416 70734 -15410 300380 50230 -204590 -160939 36061 88351 -123646 73638 -30470
20200 27936 -161837 -133611 138152 -18277 -187428 -102636 129659 60623 -134150 -139723 37548
20188 -207551 113750 -80866 49887 1070 -293014 85599 107046 37818 -19968 205735 -81649
20176 109954 -145113 30642 -102362 -70315 -155820 -297399 -225242 -120366 -38417 -322719
20166 -322719 -153899 -12922 -345159 -16273 2858 -40777 -41683 117397 -285229 33558 292923
20155 292923 -59858 5474 -470702 -166004 103571 -263507 -58638 150099 -153411 239747
20144 -477983 -73400 -1730 84598 11031 -5281 -327644 -123642 -108321 -80577 76510 254674
20133 254674 -333927 -71614 95952 136210 -233938 85036 104382 -278753 8532 97883 16306
20121 -36999 -199360 60379 147827 -42300 -58024 -230137 272244 -140915 -57832 -103986 77827
20109 117342 -238657 147040 -146918 -142812 -182213 -216319 7916 -174433 -189221 -255244 -84865
20097 36195 -120321 17682 204053 272907 -78737 -322852 -155303 -298773 -165217 -510010
20087 -510010 -84147 27337 178858 119103 13718 -208397 -136019 73184 -83156 -79683 229838
20075 -99915 3058 -334952 234363 195679 -93522 -152181 -275323 36311 -40209 -115936 -366865
20064 -366865 -83296 7743 116961 -296255 32783 263838 -29367 367146 24826 -125038 135243
20052 43188 -109840 -274504 -8610 -109724 216425 -141939 -174175 441324 243178 -11888
20041 -134977 -1365 -73613 20386 -33325 126444 -407492 160073 -87261 -298192 -434721 -82763
20029 351769 -209910 -80192 -257255 98780 145813 61940 29242 -140862 5015 -126623 -361105
20018 -361105 -35324 -112201 -185944 -307148 -144276 -237780 -144670 -334732 -85176 133423 -15899
20006 102030 -39248 -80156 -242843 -118310 278064 -147269 -36077 87341 271565 -27527
19995 67005 -104330 -69336 -1636 -214462 -1281 73177 -415780 74221 -45452 -257616 1144
19983 -244874 44397 -178194 137977 68417 -319511 21095 -71940 79252 -186425 -42587 246894
19971 107431 119917 -239797 14642 51049 107900 -55580 -72734 -145029 -90947 -39005 320243
19959 -156475 1716 71630 40784 -112795 -242411 -192375 78724 36332 -163720 -277258 -74401
19947 142681 215442 -162471 139052 -95964 13395 189398 122711 -126003 -120905 -111333 48338
19935 -32121 156589 66864 -29928 184156 -289526 -222356 -294281 -96600 -143314 -65844 -38277
19924 -38277 48827 -104765 -77358 -267922 -197484 -22896 -273171 145704 -82121 -314174 -139398
19912 213345 200954 -203645 -332494 41047 413092 -45979 30504 -102329 113690 -65910
19901 -422 -156895 -11994 -100697 54186 -125616 -485811 136425 -111605 -406899 292 118065
19890 118065 -393552 279840 87278 38138 42426 -277847 124858 241468 7649 26576 -32202
19878 -46561 -23858 -350707 -18968 -108598 -223826 -65997 -485471 -349262 97572 137308 -124601
19866 -68111 -349524 187405 68939 -208147 256971 87632 114523 -261173 63876 -41494 123806
19854 163547 -246960 203678 148914 -57442 -129380 -139731 284047 -346625 -178586 26622
19843 31214 224727 -232668 -15941 -156194 -35140 255893 -151849 -16788 151411 -173706
19832 -48696 329901 -214138 -67779 -6793 -177354 330862 -139727 -191166 133330 -350612
19821 297840 -296771 4414 -376061 188815 45511 -10074 -107683 -350799 -50702 -245694 33588
19809 -144822 -150918 11500 -192591 29543 21272 -161557 138264 -117873 -224846 -34842 -281611
19798 -281611 -343371 -80095 -264732 -41187 -168237 -47227 -349872 -252497 -364638 -98437 -124100
19787 -124100 -537231 -78216 -188198 74315 217908 -203953 -20111 82911 -136467 -64526
19776 -153485 33342 -88362 254930 -150339 -118404 -11586 -19570 -233370 -225466 -46802 -267338
19765 -267338 125159 -267248 121148 134346 -169268 -228767 -87510 -225726 -80233 -195402
19755 -195402 -84947 -223378 67847 -161707 -390680 -119979 -490950 -152676 -250433 14401
19744 -141278 -117854 -392608 -91319 148544 89258 -279725 -1033 230514 -14744 241548 -84300
19732 -245815 -62228 -162698 159975 -132267 17521 -43045 -14600 343038 -329411 3758 45046
19721 45046 -18055 65348 -127269 -115936 104380 156009 86247 -180295 -39253 73290 86721
19710 86721 132953 -201434 63230 -97047 133147 69432 125496 -184024 37337 151148 -245372
19698 95886 165118 52525 281535 -29040 -61840 63024 -240446 176693 -25088 -87375 -178754
19687 -178754 -182355 255567 -318223 -190570 252287 -14698 -523561 -2357 -61724 -68001 178597
19675 217773 -66578 75875 -247826 -35078 -3601 -85651 -51052 -126019 29836 -172109 -74313
19663 -207822 -77000 199451 -17263 115049 251719 211181 147920 -120787 -187408 161707
19652 -193107 -97445 -194835 -223698 -212064 -47333 -170934 -236127 -96569 -278531 81484 -121207
19640 -8611 -188094 -284436 131336 -45617 -8459 -276494 -307010 148663 -89872 -86457 -192313
19629 -192313 -89463 -203146 -375045 145982 -283972 -166362 -156933 115030 257674 191186
19619 191186 13353 -4107 -240570 256408 -214482 115139 -316734 -331472 -152085 77841
19608 197796 -154195 -215198 -252722 -2785 142857 280859 237982 -154868 -219530 -130408 -41058
19596 -211134 -68831 -210469 498025 53011 72890 -236538 -87045 24417 -283058 144035
19585 -146161 30848 -280526 178626 -254305 -24849 25375 -242674 266894 -231928 179480
19574 -54050 -95774 201284 73730 -279010 -108830 81335 197784 -54466 -319744 -109661
19563 -57232 -276797 -280397 -51484 -86225 -71600 -103268 -70527 -261079 160553 -102681 -218082
19552 -218082 -353270 -22715 299530 -98533 -418650 -279770 203662 -42765 -120998 -314966
19542 -314966 -211547 111876 61775 -125774 104764 -266177 -164014 -213098 -128478 -107700
19532 -107700 113958 -155984 -260435 72767 -143587 118655 172975 -73034 -242299 -197911
19522 -197911 -31754 79981 -80792 -253947 -130272 7279 -194859 -31103 257752 -296521 293215
19510 2943 -474841 -51851 231002 119383 78170 136241 2233 412558 172729 -521377 63389
19498 -20423 -142735 148565 -74532 -156179 -187234 116396 -108151 -308517 -318854 170337
19487 -314194 -100677 -12386 67498 -286597 -91190 -32073 -402397 240226 -97855 -313614
19477 -313614 -178067 106276 -281869 -134122 -181277 -238084 -6618 145878 -117012 -61978
19467 -61978 -85521 -278607 -209451 -200238 -176479 -188307 150850 -348727 220733 128270 -198566
19455 22018 -122589 -13364 -134745 -99299 -167804 -102940 -131765 -28938 -16916 -332765 -271177
19444 -271177 -18434 -3726 38798 -124724 107839 114763 243543 -323849 30808 -103436 -116343
19433 -116343 49701 -14835 -177528 168845 -158124 -43488 -185900 -113255 53873 -41020 -90800
19422 -90800 350855 76417 250935 -124055 185533 -70536 -182274 100152 -109835 -176375
19412 -176375 -20983 -86263 -248586 295851 -291817 -145264 65443 248492 -145550 -3594
19401 -79146 175310 -299229 -167229 72077 -94564 -66295 -181490 21153 -243143 -109586
19390 34453 -57676 -131697 231705 -190478 32383 -166676 43815 -178677 -146991 -267061 -270332
19379 -270332 -285916 -259139 94066 -250798 -61497 -185802 189487 24866 -34277 -5310 -182597
19368 -182597 -160651 -56319 -279249 -103236 -172747 -278486 -76449 154738 -165827 -66277
19357 -283335 2019 -10278 -231057 -112039 269607 394776 86615 -165165 -130871 164136
19346 135936 -9503 79031 -183214 126420 -149558 99051 203459 92328 -83944 -35864 -43751
19335 -43751 -238267 -14832 10075 -153701 -277827 50189 -113426 -336107 -7317 54745 197737
19324 197737 -16061 -207851 10001 -330961 82995 -305479 -21971 -292968 164573 -370894
19313 2084 102464 226600 -167074 -33696 242503 159636 11026 -116413 -930 -173270 62199
19301 -233113 -15520 33984 -244742 -38287 -165821 -194239 -119701 75572 -107260 81324 399992
19290 399992 -72592 -304336 -356506 380019 -138400 -28827 13181 -117939 -81821 -168306 12143
19278 -23608 302809 -133301 -200625 -188814 -245891 -155381 34483 124820 154863 48965 27296
19267 27296 -335239 112726 -205513 -12138 36640 -57197 -199800 -275107 4377 113337 -177335
19255 -21341 -120675 -13974 -54458 -48419 150448 -97983 -328384 268330 148822 -40810 -144787
19244 -144787 -521401 -374324 -191193 -59379 -120298 155911 -192490 -125475 -270604 -92587
19233 -39937 -88869 2651 196818 121123 56132 -171612 142977 -47035 -187265 119959 -252102
19221 30458 -381818 -292073 27949 -142684 -159897 333893 -56315 -122907 -251226 -164150 -332434
19210 -332434 -157015 -144991 -48410 328847 -397362 -189315 -88071 -41916 43212 -223002
19199 18892 -141379 -28214 72393 -41867 106894 -328020 64177 -56076 -96936 67159 -62479
19187 123151 -455859 -231511 -226325 -148957 63623 295263 -532751 223180 67640 -93791 -155127
19176 -155127 117455 -357249 -188943 -9016 -86744 17328 191210 14783 -263623 128673
19165 -57187 -468740 247291 -220934 148038 -40999 -45433 164609 -117044 157805 249358
19155 249358 143862 -194415 -169498 297640 87042 82397 -202665 394039 -160251 119727
19144 -169485 -1809 -166736 -128512 -320715 -77995 -95172 261161 -107284 17409 83966 -249713
19132 -39829 -10604 191289 -275179 -315641 4847 -149680 259153 271526 -422796 138543 132507
19121 132507 230291 -183621 -78956 -162026 6497 -259526 -391364 -221405 -169943 -122515 -88792
19110 -88792 -221076 -33694 -86724 221400 -207473 73270 111559 76679 -206496 112110 -334619
19098 -208134 31231 -192631 -54018 266008 -3724 -68257 -38292 -47490 329748 -376580 -72799
19086 -114275 -61307 -206189 -84693 38319 -74717 56108 -324327 195595 -267527 -240850 116742
19074 -34240 -313671 -182358 95422 -121468 159632 253492 -35324 -49285 -177779 -108013 -126185
19063 -126185 41051 -158128 -433381 254437 -223856 28370 -190466 -225953 -244082 -292354
19053 -292354 142256 42212 -330537 -69078 -105896 -149131 -131800 -112860 98318 -128856 -226685
19042 -226685 95866 -115089 -190998 187170 -263774 172251 40753 -197274 51659 80314
19032 80314 64874 356394 119601 -15245 157151 294072 57645 110187 -30564 34981 30722
19021 30722 36446 -100256 -40685 -176996 365900 -77135 194963 257227 -212064 306515 -194958
19009 -288007 72795 9175 -83382 9477 -248788 323232 124562 -336922 281177 -73243 -151195
18998 -151195 331759 -61987 -205589 -7347 -110985 20762 249541 94450 -256089 274734
18987 -125346 259365 -329334 203656 193720 378157 54670 -59102 -139793 145774 85578 21872
18975 -273036 254258 3988 -12112 -253398 286415 -4610 -263646 183859 102672 110226 280490
18964 280490 -111867 -151584 -120807 -142288 188435 28198 29166 -15537 59964 -40809 -135437
18953 -135437 -315127 -233749 -174645 -89685 90183 231098 -112359 78036 -2961 -180732 -297492
18942 -297492 -259173 309610 -65714 45477 244542 -218540 169796 -164270 57991 -59664
18931 -6997 -37496 342619 245151 -131647 105018 26087 -235986 -51094 -82583 -171383 -132333
18920 -132333 -271710 -177001 -154883 80923 34491 -252156 -281704 -107469 121126 -102274
18909 -103059 -104660 -276287 -263610 129128 -276181 -253875 -317220 -162772 90424 -185498 -108566
18898 -108566 -206836 55814 -81232 110785 -2908 112381 -323959 262500 -240177 -39026 152328
18886 53622 -100719 -327742 88317 29972 115773 -192585 108502 61464 -152439 12059 12489
18875 12489 -253223 -89520 -2478 -197544 -91420 -264849 144970 -290052 -258835 -77637 -374378
18864 -374378 -52687 29390 -184036 181337 -79576 -40390 -5136 -154085 -103595 251470 237060
18853 237060 -124800 -231144 125220 -54215 11868 -40339 -79876 -382923 171945 948 -19279
18841 -122568 -213836 287661 -183577 -310604 -111116 -321664 -356067 -548 14914 -108631 18816
18829 -161923 6543 -4768 -344546 68687 200453 -51571 -112830 237941 342956 -96426 -35666
18817 121066 65099 160011 324084 310144 280137 79227 272747 -92839 161805 70962 215114
18806 215114 -23526 -226047 -159254 -11476 15547 -93488 367084 -236082 -195696 -306948 -364933
18795 -364933 19415 -115060 169846 -109314 -294399 126763 75097 -7293 -146584 236011
18784 99335 -222595 -167949 -62255 123732 -147517 12934 -34239 -279062 174660 100873 88560
18773 88560 108675 -14629 -206372 -137325 -281347 87319 -152064 128269 201475 -111488 -2599
18761 -235258 -163726 -121543 -170310 60744 -66218 52879 -26820 -276904 -202070 -4942 205458
18749 -345433 -152579 -170964 101601 -78337 151350 -438221 160518 453765 -185720 -410311
18739 -410311 130816 -277292 -105818 -37528 -81236 -26675 -160803 155486 -145232 -261286
18729 -261286 138851 41759 -50382 -217343 -110873 236323 -168614 -112841 76701 -295476
18718 -82895 -262096 -26440 -241109 32802 225914 -107305 41175 -67259 -157158 -57904 -152249
18707 -152249 12137 -481152 -41003 7123 110056 -104199 193793 -10074 166685 -102599
18696 75781 52059 -217858 -2068 -99888 -15690 -236390 167687 -157058 153913 102394 -40070
18684 -204530 -186871 -200036 -173157 -109643 140986 -412163 -81063 -91649 -281450 129953 -301016
18672 -206863 179261 -73332 63995 60684 -174007 -11795 -98463 172189 -227690 -232440 98750
18660 124424 -154291 -160809 -6076 -99245 -187010 -190165 81028 97396 -15794 -47570 -78417 -199739
18648 -199739 -262825 -192915 30091 -133265 165335 268380 -59340 -48334 59174 -282608 -409473
18637 -409473 190064 -242380 -259462 -202949 99480 -29008 -114377 1998 172985 -11590 -209515
18626 -209515 26799 -112876 -426443 -341738 -90797 -438115 105271 364235 176227 -24093
18615 47019 -45326 -120713 -235840 -64064 -171904 -360007 138755 162400 -15075 183703 -46932
18603 15554 79427 39868 16271 131608 -123984 -71752 -235785 8296 -78108 -9831 -261314
18592 -261314 239930 -215758 -236031 107516 230092 -146339 -75028 163350 -147724 -283543
18582 -283543 -293795 -99035 57363 -117569 -105801 161280 -141110 -273823 -134208 25065
18571 246356 -375685 -165248 -82670 -320994 -71055 60167 -206765 -69707 -47923 -331246
18561 -331246 -138899 -278534 -139675 -72104 -185995 -334449 -90870 -245845 270526 22229
18550 92350 -149096 216932 62221 48834 203255 96392 -13227 75603 245030 -310543 -151919
18538 -7179 71007 -13306 3807 86379 236378 76896 -61845 40305 -46397 -341700 17454 127490
18526 127490 68578 196001 -83227 -3670 196672 -43735 64940 -207011 -3969 12139 50300
18515 50300 -110187 -594356 -205849 -97731 -251552 67788 -57999 15948 -13530 45678 3280
18503 -229960 -130682 362049 -164765 -396477 -79349 -296475 43843 214925 -112424 -34520
18492 84633 286279 79743 -39976 115183 -110978 3074 -256345 -183402 -81203 343203 15096
18480 -19190 -43301 -31983 -131447 -172091 -106926 -184313 11302 -381123 -253694 78261 -87972
18468 -302518 -65788 -43291 83190 36852 -365235 281431 172712 -192396 99086 -121489
18457 37753 -77033 -57262 18257 -54333 75457 146219 186046 -40261 -107309 154091 158707 -99052
18444 168440 -122672 -67654 1837 -276861 -29550 -184100 -346358 93028 -144236 -88539 8411
18432 362894 -1289 -189996 -295273 -740 -141582 -142645 -85460 66641 -212567 2815 205348
18421 205348 -41575 -75545 -157655 -37311 -128745 -127042 36198 -235700 73514 -11011 -207937
18410 -207937 124990 52529 75162 -363237 -186782 -353479 -27963 -305315 127962 -105726
18399 -122460 102002 -102253 -264636 92691 246946 -97189 -219476 109962 -249354 52842
18388 -274515 -66360 7537 -363135 -109907 -70899 243106 -26145 -193098 -352238 -59962 33904
18376 11504 337865 106033 -40061 -126458 -60676 166642 53513 35360 29730 -12326 -110495
18365 -110495 64820 -326187 93899 357871 246707 284850 217677 128825 19979 37026 -4354
18353 -164305 171170 -155833 -93714 42222 264182 -239656 71958 160859 -205006 107491
18342 -39951 -26576 -73993 -48909 132 -77702 121546 -453016 169778 -97391 -195397 158900
18330 -201592 -73527 258143 250760 -71240 -134945 -21376 -33880 -111016 137698 36600 -54270
18318 -271510 -274726 -161531 -227587 -146139 73030 -66573 -77519 -32934 -345351 -56318 -66797
18307 -66797 132571 -201058 -222464 319640 -176882 -209545 -24255 112283 -215847 -143671
18297 -143671 -35663 -356511 76662 12393 99552 52958 -34833 -19461 -239094 -45957 -259453
18286 -259453 -190456 203969 -57930 -73667 -181992 41410 -176870 -76205 158687 -39736 -160356
18275 -160356 325616 -31788 -220220 1328 -19716 -229321 -219222 -173899 -115708 18633 -343803
18263 -58967 -57223 102206 -265308 -40932 -103140 -199991 131695 -133106 120680 -120255 -324425
18252 -324425 148933 -60966 -87202 -7214 136837 -256530 -156418 -306241 -17876 -112716 -46691
18240 -64342 -145191 -25892 -40851 -38347 -95936 -53861 -249157 -77391 132047 -191710 -58431
18228 -107652 -100025 41340 56308 27790 -256728 -214933 149913 187269 -91426 -58093 27704
18216 -238543 -229222 52019 -239189 167898 158583 125796 -82859 59786 -415839 64111 93587
18205 93587 73526 -129048 119714 169171 -442401 -193364 -53364 -129719 -321974 -218190
18195 -218190 -105027 -201454 45255 -16362 -99667 -60816 -161052 -91794 10360 -146556 -37218
18183 207352 72673 27143 -376488 -72550 -61402 -205039 -295545 -163635 177857 35047 -88936
18171 248203 236132 22492 225138 -529868 -67684 197885 -45682 120559 -149879 18130
18160 -16396 -446982 -266036 76644 -298857 189437 -167180 255267 281946 -204404 114195
18149 -128337 -97399 -210883 -44645 -89697 80996 -235709 35126 39128 -190067 -234278 45773
18137 77683 70015 -105113 241168 105988 -110030 -107651 11274 18922 -177297 78952 -45497
18125 -43055 -125177 -166541 125024 124875 -56864 168881 23358 -32059 16147 16257 66004 106060
18113 106060 -132491 -332484 129151 256198 335191 118713 -115107 -33359 -54843 -28738
18103 -28738 -22295 -248670 -196872 5831 305580 74538 225991 230738 6601 188673 -169430
18091 -95242 193119 307231 -132281 237375 -65745 276634 174979 -23769 -121210 89065
18080 -158109 -205257 -66679 -211167 -110702 -37696 -47905 -188446 -16998 121091 -283142
18069 66343 -201111 48967 36597 103088 -167012 -54209 -52282 67985 189434 -294609 230089
18057 171350 25573 64338 53117 59422 40730 -277287 -330880 -76853 -128491 -100009 -162833
18046 -162833 118812 63868 -51550 -250557 302403 -14144 199263 267719 -38742 -128703 73577
18034 195087 -55182 -251231 25120 -288653 -410399 135006 30547 -167555 220088 105875
18023 24941 235766 -5230 59185 -29546 5106 321212 -162766 102170 -88571 21189 80433
18012 80433 -14058 363075 13477 30192 -233881 -43919 98657 -211670 -56574 -177912 263453
18000 -53888 31167 -34044 -214223 126026 -118643 179965 -237792 68385 314887 -178863
17989 -285285 181929 98813 -156627 -286549 75774 68928 154507 93693 189806 -191590 -170069
17978 -170069 -217624 -101018 -72477 130363 84270 190915 362351 -476452 -135724 -151774
17968 -151774 -47908 84199 -93554 -137936 90307 30871 -130408 -183899 79122 -320706 -18924
17956 -134328 -118729 35745 -360213 -290662 -253716 -89485 -79481 -51428 -153567 11277 -153605
17944 -155521 -306365 -25205 8562 -235628 178156 40395 132750 -178822 -332296 -160810
17933 -22605 -203747 274932 -40981 231629 -6753 -124270 -543959 -158961 -162699 -132284 139569
17921 397912 102717 -300186 197310 24699 -503990 -190754 -90534 504017 98853 92885
17911 92885 -105140 -305626 -95297 -42747 -89430 63278 -82878 -67059 -57054 281467 143389
17900 143389 38900 -32267 -75869 115678 188309 377783 -131050 188483 -206211 110500
17889 -92764 111453 130876 195235 -417415 26327 279833 -217786 -424499 -12339 -158998
17879 -158998 73068 75689 -293356 -72747 80796 218249 -263540 -301240 60600 7128 -428564
17867 167452 209458 61120 -40218 -193829 -191174 122473 -275442 92988 -12818 117974 -49930
17855 319839 96609 214124 -56823 -170985 -132671 239434 -205807 -41824 90898 -17887 -19364
17844 -19364 131862 -127840 -69111 -63249 285584 -180692 8975 -161653 2179 57361 13636
17832 -165210 247401 -91956 45033 110419 101265 -176803 -6298 -84877 -213366 191488 101513
17821 101513 -53250 135734 34664 -85540 -367266 243772 194914 -174543 -300214 176884
17810 -128911 -36598 -13575 -203099 -391596 92798 -182990 89151 -276611 -41118 -62285 318411
17798 -158412 -190076 87427 69528 97443 105108 55063 -337098 85159 -72339 316987 -119625
17786 -87634 84520 -226218 -135050 5817 -219967 -60474 -177618 -150603 -86531 95478 68308
17775 68308 126968 -198826 307369 -234247 14862 51108 -126663 9170 -16288 51178 -48960
17763 81339 261490 -7680 214801 -134098 132654 -22398 -124637 -265560 16009 -91489 39665
17751 -46603 -145233 140407 113181 -75989 -58271 53457 155463 11070 246485 13970 -215065
17739 71103 158707 106902 171212 -392978 156743 15221 -174057 34405 49091 -287453 99014
17727 145621 69450 -501073 -52764 -95256 -485038 82119 -192333 -74141 -452 -61920 84541
17715 217636 285308 -101050 27303 -56146 -191673 -101660 -239137 -140972 -60789 271679 287840
17704 287840 -345845 -100358 -363213 303083 -69607 264145 95905 116519 231539 -219766
17693 233934 -172596 181245 194186 416742 186035 -188522 140588 -60469 249076 -154357
17682 -8666 -26684 43459 25376 -59206 -160803 -124767 -134741 310353 -128611 -260765 159026
17670 61787 -42975 -164656 -14194 164419 -20437 146363 154077 161118 191577 -27361 102781
17658 -35416 100380 95636 221534 124018 52193 82304 -155983 217933 -42238 33298 -179346
17646 -101033 258126 -206750 60107 30342 -32064 -80875 49919 -30016 46097 -295428 -64473
17634 110051 -174121 -129009 24031 250528 136798 -118678 64461 59062 190905 5583 -345896
17622 202881 -118866 41410 -134038 129335 -72765 347191 -106981 12145 -6428 -78639 321683
17610 204434 -31265 144248 -77602 149036 -343379 -66794 -10254 -8689 62841 171582 115048
17599 115048 21893 65674 -161707 455617 -151613 -179410 -202719 -100941 41873 -12209 31276
17587 -149943 -44416 -141460 10439 137698 -125898 97950 13098 -111262 70971 46982 48997
17576 48997 72161 154269 410538 182855 -126787 57437 -73244 -37744 94729 295419 -211728
17564 8221 -93479 163630 -349212 209076 369848 62229 60629 98982 -473307 1364 -123161
17552 132842 26126 313122 -170160 -39683 11942 95172 325099 -40274 274219 32047 57441
17541 57441 376846 -16940 250461 262497 -169002 -92866 98452 182606 -177985 392555 -46447
17529 92335 -114616 -84604 125344 -191053 51758 184228 54065 205824 102312 157850
17519 157850 438574 254003 115020 228899 -55998 -90951 59221 207282 130711 -19008
17508 26351 -142141 -260913 -20656 186943 312158 -29096 271691 176403 -267698 -78413
17497 191760 131657 84681 243341 240595 178076 267616 258991 488879 -27774 -186346 318337
17485 196973 -17496 92104 86241 -95546 50280 108093 179116 89776 90207 -18437 381180 690147
17473 690147 207326 22325 336308 50169 13049 60800 186358 -49035 85009 236525 280945
17462 280945 -180966 75855 206264 99171 163943 146237 -56127 288405 76000 124255 151262
17451 151262 218075 -28716 48817 318075 487824 416656 237678 375638 84818 577144
17441 577144 494419 288834 266756 266692 124305 543763 -13140 75562 222044 76552 316134
17430 316134 282856 209178 88770 237431 317906 249977 307521 249074 181215 305344 48073
17418 -164124 418720 255742 396419 -51415 366267 -292710 371570 245350 -19130 12402
17407 145931 143189 232602 281742 85639 157620 187500 150510 83499 -127708 76312 -138758
17395 372741 20626 -50288 102301 230272 146887 258225 81253 -47336 347492 -89398 509593
17383 -130813 290939 -42328 -38737 -168911 259079 516775 216204 80226 348590 -345218
17372 263429 98135 51234 160649 211990 102291 36571 -164342 363044 1035 -6854 165099
17360 122822 -66443 384053 -5435 119012 -107781 141683 140036 -8219 376329 365371 118595
17348 154386 -175108 231607 -65989 -97459 279864 -56733 -77111 409737 -220928 -79958
17337 -278611 30569 185745 58956 120903 1721 88097 77838 188250 27274 233924 151205
17326 151205 87968 126270 89137 114800 267387 51753 128488 133061 51881 156946 33342
17314 -62163 -73603 305839 -67184 259443 -34161 379662 86989 112501 537672 148633 300727
17303 300727 298840 296515 213769 209474 383478 164253 147338 184083 120038 220949 125865
17292 125865 169114 114275 -124370 341902 -15611 -223823 221542 -308126 313692 668590
17282 668590 357125 -117774 79063 160057 430930 168367 132767 58356 -212755 1839 60068
17271 60068 144102 -266224 19247 -58128 58425 463533 189907 223052 111028 48503 -196239
17259 202792 143187 196338 83347 299999 113974 184240 -168948 151241 234834 299730 366253
17248 366253 139985 219330 120082 372712 154833 302852 49035 241027 286871 49295
17237 183568 15095 66297 225769 158557 370627 248377 137812 541199 369210 51528
17226 187420 84997 105421 181637 -151290 54584 103881 230874 411226 -166456 123873
17215 219024 420750 65794 265183 58872 76458 40492 139545 63504 250348 251854 41764
17203 198000 490269 275110 460863 79273 -306260 81105 247958 -101901 290024 310792
17193 310792 38384 -81653 309063 111394 431131 -320908 245740 -54422 150263 172149
17183 172149 -99855 189781 -26494 -90122 206640 2908 107996 408566 323574 310427 426212
17172 426212 395321 281214 390121 48613 8427 248109 88776 379660 461274 -82953 185583
17160 244779 150156 274401 329017 415466 447972 290204 440950 60652 589563 62797 -15980
17148 392752 109470 292336 173648 126251 201778 277067 502044 61602 302916 10978
17137 161289 131979 254257 506838 109511 426966 428433 495360 126655 150675 74844 490912
17126 490912 480597 170448 270921 277689 168099 34387 524343 438932 431132 238231 414538
17115 414538 421307 385184 597369 291979 293383 389105 204838 470549 256899 257443 424897
17104 424897 414351 357096 346518 78796 224191 341296 623484 330415 424330 163921
17093 295132 677643 489516 516324 329502 426722 225941 336103 457336 579304 432085
17083 432085 261276 235850 425303 157323 143884 419596 453771 386411 435447 492539 264304
17072 264304 229185 366839 490460 349677 495137 405088 619120 279549 569592 455038
17062 455038 490324 556234 276714 276499 322056 339659 15421 494550 521700 596534 555456
17051 555456 373646 871668 520989 551099 183495 285992 580451 420076 660732 747773
17041 747773 493526 368958 609109 408772 270527 569717 579590 404661 259356 528520
17031 528520 859053 579155 471081 457323 503716 668501 1004495 445140 597962 519703
17021 519703 726355 636550 661741 908793 977913 588338 740449 753738 462238 544738
17011 544738 717177 225385 656091 759979 770497 849888 643252 849281 466637 726177
17001 726177 581262 528989 604141 578019 642138 755881 1063263 759640 615270 711221
16991 711221 221748 857876 722820 532967 862649 583928 736340 576914 909395 676505
16981 676505 659985 944109 882894 968658 873398 570553 869810 809508 978021 613490
16971 613490 879174 1035231 963302 934732 1003804 964196 815566 1006663 979689 789744
16961 789744 1301479 1014338 873670 1046933 1331380 853012 888703 1175021 1212463 1211399
16951 1211399 899883 1023140 1228745 886415 1369350 1128362 1054851 1218661 1141920 1138476
16941 1138476 836851 923175 1431160 1134041 1118412 985642 1211908 780428 1234698 1350028
16931 1350028 1076854 1350996 1495627 1350826 1208919 1587575 1461926 1399983 1523841 1287142
16921 1287142 1503998 1538738 1475778 1255695 1384102 1488999 1607383 1461354 1418866 1714703
16911 1714703 1485883 1774080 1690642 1688912 1642576 1682270 1271083 1864666 1709865 1538813
16901 1538813 1782797 1743397 1786883 1771660 1946344 1605660 1892309 1749851 1987936 1841089
16891 1841089 1828640 1854761 2015205 2107292 1787432 2141845 1998021 2103222 1856158 2128127
16881 2128127 2233895 2105079 1961509 2193917 2165409 2341051 2444594 2283097 2517181 2368000
16871 2368000 2555541 2810758 2624732 2582400 2498475 2423059 2784246 2569338 2652549 2707389
16861 2707389 2673311 3135660 2957402 2916009 2990493 3047648 3175391 3155030 3197379 3021433
16851 3021433 3133522 3031138 3347306 3377354 3420304 3479712 3627566 3862670 3692465 3624358
16841 3624358 4037027 4111226 4252107 4188281 4210039 3869053 4514304 4444264 4508970 4584679
16831 4584679 4511153 4526795 4985608 5101188 5149344 5115806 5178041 5030703 5312072 5617369
16821 5617369 5836874 5730442 5770979 5911267 6049284 6541853 6068979 6425616 6609567 6589951
16811 6589951 7069456 7246501 7059930 7307726 7784442 7742160 7884281 7860359 7936760 8187216
16801 8187216 8769114 8988769 8974670 9256981 9477242 9803765 9985716 10248952 10611803 10633889
16791 10633889 11223355 11371522 11544402 11954584 12140627 13175919 13195337 13741362 13857969
16782 13857969 14584490 14383357 15027569 15399789 16349201 16478197 16615959 17556486 18095078
16773 18095078 18885718 19495147 20367427 20879877 21888796 22986111 24030521 23823240 25104543
16764 25104543 26443483 27183018 28245973 29765994 30545989 31851850 33221378 34588440
16756 34588440 36474196 38526975 39836614 41636360 43768886 46038245 48465661 50776118
16748 50776118 52912961 56048773 58924942 61886163 65264782 68553380 72526680 76719988
16740 76719988 80375763 84875397 89949084 94809254 99977529 105467206 111436121 117487567
16732 117487567 123135401 129283389 135585346 142156873 148067485 153615148 159009723 164077086
16724 164077086 168493891 172128134 174832659 176529135 177763199 177849449 176722864 174553947
16716 174553947 172030508 167626044 163554360 158747531 153426175 147404686 141422614 135051403
16708 135051403 128710956 122516309 116761278 110741910 105073414 99202159 94351412 89242916
16700 89242916 84681422 79847649 75713654 71749838 68143644 64715646 61246654 58379277
16692 58379277 55536423 52629188 50181263 47663236 45376392 43643608 41493163 39576906
16684 39576906 37936295 36391939 34734403 33106458 32226971 30387221 29118628 28023470
16676 28023470 27150087 25800534 25068781 24202343 23212260 22520376 21596271 20808643 20194564
16667 20194564 19262421 18794904 18152535 17548524 17263035 16249372 16002116 15241621 15275663
16658 15275663 14473956 14043722 13613981 13565666 13180078 12316273 12127347 11861128 11523757
16649 11523757 11555779 10883795 10770061 10507749 10004486 9828928 9627722 9417200 9278596
16640 9278596 9386789 8744756 8771293 8345980 8388593 8002088 7777614 7529306 7900981 7433169
16630 7433169 6871708 6983866 6896261 7026481 6720439 6385911 6431226 5936582 6023707 5917569
16620 5917569 5934729 5703696 5624299 5552407 5354961 5513528 5492768 5227103 5205005 4963841
16610 4963841 5040076 4692824 4581863 4716813 4651276 4315459 4250853 4288566 4384046 4063339
16600 4063339 4164550 4227923 3939706 3768579 3920697 3697529 3402631 3643211 3354077 3809138
16590 3809138 3618091 3470885 3475558 3219415 3245024 3059106 3307209 3300546 2871163 3122051
16580 3122051 2884866 2810271 3017689 2998742 2851525 2478437 2898619 2653552 2848680 3009811
16570 3009811 2662704 2455340 2613422 2481242 2622479 2297582 2296080 2212751 2405232 2284188
16560 2284188 2285320 2499534 2380105 2408850 2512300 2431935 2156732 1762206 2124251 2137771
16550 2137771 2037458 2311141 1861367 2145501 2001308 2329249 1735991 2007254 1873710
16541 1873710 1635251 1921832 1761200 1882948 1993825 1867981 1691608 1811493 1440850
16532 1440850 1460851 1648684 1880534 1430080 1563781 1541931 1516740 1757642 1781866 1384403
16522 1384403 1302602 1552974 1292794 1388238 1348343 1386100 1359336 1453043 1342415 1264590 1554279
16511 1554279 946565 1612228 1469748 1630655 1320820 1623817 1077650 1167212 1031170 1189067
16501 1189067 1326394 1250563 877611 1113510 1286563 1212522 1011300 1400896 1420678 1016186
16491 1016186 1056789 998798 962165 1224747 1327828 1094756 971094 968752 940158 914208 939300
16480 939300 1097656 866050 1420564 1588060 945288 716016 1127413 899905 996073 1242610
16470 1242610 809105 1108136 684623 1080692 909523 986324 1158987 593841 755492 1025290
16460 1025290 848065 699553 1053409 1112401 676395 500778 603175 837710 924279 740937
16450 740937 872319 661235 659548 884111 850696 850497 989582 766944 945193 998467 688726
16439 688726 999270 673189 898669 945002 453318 513762 732678 493313 561125 740496
16429 740496 821845 1084556 553415 563162 395616 964465 693627 232583 1010546 326958
16418 429546 455097 721879 810234 559653 498506 777846 297068 1002375 749576 898793
16408 898793 645543 699826 789016 609695 566861 705871 348500 328631 657507 677049
16398 677049 700693 611151 597638 792093 572392 548309 1080618 483816 732028 594200
16388 594200 367180 609900 472086 450085 590623 961350 514064 816931 394764 875666
16378 875666 348027 530946 308691 459864 461085 328862 799027 684199 675044 469600
16368 469600 535160 648039 332569 310284 592778 530568 694000 395047 114713 576940
16358 576940 325173 405755 606366 157197 615324 302539 491932 132289 540550 632917
16348 632917 565432 393594 467013 542191 322146 746378 470178 189312 569831 484799
16338 484799 330531 336106 503420 466925 557149 285316 440358 402032 361144 463379 385858
16327 385858 388932 369838 496695 198594 433476 606638 637480 305504 288558 534687
16317 534687 220398 752037 178312 331579 218621 449673 551810 209405 411986 755714
16307 755714 297869 236972 315294 291280 68750 159474 270314 313851 154957 453753 178941
16295 567284 266659 558728 325017 220421 701794 294706 221271 191170 286551 279153
16285 279153 217403 172593 225652 454160 344598 263043 221133 509412 612591 469777
16275 469777 220806 600917 383684 -205723 11524 508641 424982 351063 69927 77494 133272
16264 133272 56177 262506 506549 -94635 339833 133622 516644 617682 81859 504527
16254 504527 577900 477295 139975 171944 209438 484655 374063 323276 246619 145271
16244 145271 204065 218138 237034 215443 481675 -103765 372516 194322 121953 -31898 303923
16232 184643 386415 283154 296618 81957 245465 333725 244348 267502 -106537 112463
16221 267093 149451 20567 -73475 235813 199787 154283 404340 -152884 121133 306683
16211 306683 -78880 120632 137527 430651 360660 12261 241684 -27398 187206 64606 360530
16200 360530 169711 163654 147735 26071 179215 -77190 307599 137520 65186 96136 -106742
16188 90487 262281 232908 108009 250045 218746 146825 453884 3404 14393 299863 -55226
16176 337376 -175219 32243 -321204 316427 367089 221833 137334 320565 102548 262001
16166 262001 297253 132335 61253 158682 303068 46128 140413 145774 199928 416381 128281
16154 1913 343161 185778 179697 354024 351661 -4131 126353 176099 476287 275789 388671
16143 388671 -101429 342271 215213 276311 457732 101660 125765 195598 259032 -182946
16132 159925 121358 173132 -138944 246305 80772 -150468 -205174 -30971 -277330 134914
16121 -14645 -77855 55499 326116 576211 51381 241486 191869 -267585 272286 -13126 182986
16109 -13473 505262 -141278 245574 163462 447844 294892 -34838 321023 358794 195882
16099 195882 63589 -137328 148559 -1744 112484 309040 107448 216002 258671 56064
16088 16358 -70621 132132 -106150 33822 75601 73073 33541 124456 223319 102118 196785
16077 196785 -167643 -99274 390466 89194 250406 -140752 164689 198678 173245 -333965
16066 -79697 224532 130312 30895 -233859 187908 40190 60948 275260 -89835 -238734 -121643
16055 -121643 64754 53709 82405 220323 347817 -22342 -102023 -228755 -339983 122933
16044 92556 240123 420977 -89107 263404 12881 -31663 187732 194887 -178976 -11115 -301
16032 -100340 -149584 114883 105999 -1898 239325 138454 85911 -22003 -122234 -126077 -26717
16020 151259 -312787 -131175 -22912 -164671 159789 -26989 157448 108738 -1776 -91149 26772
16008 -173530 142256 -193316 -88974 27118 129668 -77020 -270865 -159119 -123067 68956
15997 215629 -8703 230868 -16260 -154154 -35239 17904 284237 42589 229723 -281591 -189999
15986 -189999 -41001 139838 277388 348414 -145652 606715 104558 -65354 22118 199250
15976 199250 -78186 240689 -98212 -3741 -113549 -92259 -37635 -71444 78192 -180357 -129410
15965 -129410 103539 -46525 141453 -131174 398436 -10628 -125453 121098 -322637 3689
15954 -413377 193061 -148597 82619 -149148 -219085 96821 -6058 8190 -78414 -75002 -174599
15943 -174599 -318749 -49695 17041 167417 -14650 -147601 -28978 316828 -296162 -131631
15932 107465 -207298 -229255 -217817 73942 -221469 191055 105648 -1204 -21219 -7488 -130461
15921 -130461 -217326 149585 280286 35828 -284567 50919 -201023 76571 -323523 66294
15910 -3512 -251985 -55729 302334 30192 -227733 43703 -50165 -364162 87111 168337 -193090
15898 -47704 273577 167824 -353576 278 -199508 173137 50283 35423 23992 -87080 341031
15886 360817 114402 278929 -65169 35637 31050 -87312 22423 -233854 -264172 -208311 -80392
15874 102254 -171832 4646 -60746 -215598 50466 18501 56812 -215322 -260923 225098 -24359
15862 -198226 16703 73761 16412 38916 90236 262650 211175 -32135 -124276 -99880 -67304
15851 -67304 1751 -10984 -183679 -316891 -20685 108832 41628 -262276 149102 -59726 -246939
15840 -246939 -119834 21545 -1586 -37000 37419 55900 17261 -183675 -50440 352209 230840
15829 230840 -89657 -400158 49759 -416613 -76407 -183757 31236 -115245 121141 299550
15819 299550 -330044 -94703 -85357 66800 -206653 219246 71279 -14121 -44585 10307 -104919
15807 61876 -175002 138573 108029 -38297 -156395 202750 29955 -60983 -52068 197686 225658
15796 225658 -162073 -216799 -260284 -140488 65535 -198593 -286094 4154 -105805 45062 149499
15785 149499 299751 -153189 -137278 -261799 -233711 48214 -233989 97270 87910 107892 2020
15773 -237542 -262296 55156 -19449 -187784 74290 116776 -84135 -306239 322247 323719 63015
15761 18681 64758 94869 -122788 -78991 -174215 29061 -69026 -169119 -118820 -75247 -82243
15750 -82243 215324 -233383 403536 -59494 -92883 -199552 -8528 -120024 -225889 -83064 -62006
15739 -62006 -62185 -239171 4345 133060 -101974 315416 149027 187232 120765 82410 -94845
15727 181021 -34481 -113141 186952 -469248 292655 230221 -116083 133045 -132326 -254384
15717 -254384 134091 -396172 139337 -180077 343947 -35928 73617 -43160 -87676 -380336
15707 -380336 -168388 -346548 183116 -109415 -97690 -30382 62938 -156974 -112810 211078
15696 201158 -196749 -28611 -98196 -31446 -96475 3051 -133082 -233063 -36584 -219631 -402961
15685 -402961 -59701 78237 -190286 118448 -230509 14479 -21578 -127769 -146409 -341577
15675 -341577 -115227 -1319 110404 -206011 -134381 -107573 -19896 17797 42987 57516 -291660
15663 54328 12753 -277490 188044 -43833 115431 92026 126004 -148911 -81894 -13862 -57540
15652 -57540 -25004 -339818 -256307 140269 156519 -220023 127822 -68394 23296 -120282 -1493
15640 -361075 66723 -166872 -227131 122707 -285149 18019 80081 56805 109585 2793 21592
15629 21592 324566 -91368 -9930 -98780 -244099 23185 190681 187477 -88721 -23183 48792
15617 -242285 64047 -231152 -249960 -54419 59709 -224065 -269170 -119762 61549 -103213 -196079
15606 -196079 -385012 -519672 -249546 -16791 122035 -22144 55852 -151377 -176743 154328
15595 38788 -220424 -77463 -103262 -128185 -326814 -68442 -67387 -317673 218291 36106 53146
15584 53146 -119123 -386760 -283922 13416 -140336 -80684 -194679 13504 -98550 117755
15573 168162 -523634 -218295 -93152 111142 55656 -37965 173232 -251410 20609 185212
15563 185212 -69169 -94298 107868 -34182 272348 -287796 82504 -354259 59734 70481 88823
15552 88823 61569 -33240 -51572 -97561 -10938 403889 181633 -291035 170752 -47370 87769
15540 271986 112912 -409156 32789 -86973 22670 184063 173557 -157386 -44780 -1048 -195474
15529 -195474 11860 183154 153141 -166099 -250197 -37275 -451128 -47494 12601 247842 129581
15518 129581 -74901 -83493 116259 -139177 -31646 93837 14628 -39089 62054 70574 -166436
15506 -250252 -11105 -53869 -63320 93272 -75979 -31824 109257 -66735 -104328 25384 -514922
15494 26111 80601 237052 45714 85487 66071 71438 21498 -1605 93178 50808 -119818 32044
15481 65017 204044 132838 -13431 46856 25037 -65774 -63268 -246975 -178099 -2638 13679 -51231
15468 -137262 -112790 -115384 39024 -288563 121056 41180 -88665 192055 -124465 -170712 -191357
15457 -191357 14434 151487 -209895 -233956 -200496 -54015 -90480 203106 310912 -15595 -205084
15446 -205084 114620 -314505 -39302 271965 63629 -47906 -129699 -251497 -83365 24694 59223
15435 59223 77356 -80279 -227495 -12264 55403 232383 98429 32393 6708 -34680 122491
15423 -92822 -65679 199346 90573 96294 -63860 -94237 -73593 67269 55851 -138744 -231789
15412 -231789 32974 51030 -28949 186025 50533 22251 -147673 -98223 41672 -80148 -242801
15401 -242801 -281718 -101462 30356 122899 141081 -102104 30092 -95236 164967 32060 143170
15390 143170 107171 48875 -133268 -73844 -96759 -256445 44878 26432 174546 -240488 5911
15378 236808 108611 -132645 -124178 98347 165869 28977 93409 79521 -318442 -92178 26407
15366 -84440 -168127 140839 107734 -74438 251341 -13643 7406 71828 -10342 -21125 63241
15354 -98661 -65206 502433 147826 -61070 266274 -129988 105850 -16959 14505 90539 -231282
15342 27525 100628 -47018 195949 -68843 -74077 148999 66895 236517 -392856 -98050 -148401
15331 -148401 88166 195525 -9836 -184828 440645 83577 56256 -5461 197843 135696 134830
15320 134830 -370208 99631 -260012 346273 -370177 2381 140045 27330 -155795 152746
15309 13459 30822 72329 -181542 -189163 -341220 -128959 13 133939 81217 -116365 113858
15297 480644 70571 424987 -128996 69648 215062 76770 -135385 134161 33849 -213790
15286 -18422 -98116 233906 -163628 154410 9132 14984 -75014 -300412 -190711 260764 -221215
15274 -195436 40425 -210291 144632 270430 -6372 -50217 59296 119549 -141515 74871 90055
15263 90055 32970 -149427 410498 52120 207920 126855 -238636 222627 250577 54833 -49446
15251 250132 439436 251266 88196 111096 312904 113662 -31309 42749 265338 283770
15241 283770 -91675 126441 250942 -50838 247205 148453 -263058 -79269 151382 -262172
15230 -34478 19108 203599 57984 55374 -37081 368482 -26000 143476 215084 -44876 55122
15218 -26426 -213101 -513480 139116 224012 170426 -98202 138094 -13294 165457 8253 150316
15207 150316 317682 245505 139445 248425 -252302 95015 174569 238082 -66876 -30977 35386
15195 73777 216648 -107238 -73690 139172 361094 263596 139705 333865 -338070 -103890
15184 86614 17813 -29710 -8912 89470 8821 -26474 371695 153655 65861 259189 112373
15172 237280 23428 -212230 -89567 -223796 132044 75530 77812 -29886 373091 197038 272277
15161 272277 250984 3719 52428 62995 -54406 26623 -157213 154228 261358 223963 161275
15150 161275 108279 88117 97002 376802 193364 829 -12741 33911 -129642 -123602 293759
15138 36182 187961 216003 151137 19365 278626 184677 228015 -64893 107199 50682 -89019
15126 4675 186224 163208 -19808 48981 -71519 149685 210789 -172410 62192 288643 -242392
15114 -26571 85639 160670 456823 -39315 3772 105959 118143 222652 88068 240149 -208282
15102 84864 -18066 14596 -23349 154925 -137068 -101805 453452 51179 96637 145758 148103
15091 148103 221388 397559 338652 85812 24472 -16353 28167 92040 -125711 5767 -49912
15079 8741 67217 62231 -90659 135467 -48416 6627 -42001 179327 289570 -28141 65880 86959
15067 86959 200200 -71039 -110726 255008 68334 98418 46340 360987 -2570 153412 52439
15055 -54635 17303 -135809 341489 -11040 388179 182641 310157 -1767 -11534 211677 77527
15043 264946 -24432 147703 449006 191412 22579 -21918 32404 -13487 256040 33730 -22625
15031 334559 261269 71364 247546 116053 242336 -92120 183078 248074 -84830 294742
15020 -84367 118838 1845 206016 449703 538636 69211 352651 211332 38700 125435 228810
15009 228810 264468 488056 81486 67569 133456 33546 15015 287000 421430 137008 25120
14997 404443 477850 262841 166757 371059 376689 325308 -9971 213190 116133 447550 121748
14985 311426 383924 390178 302682 304269 -32938 321459 331749 345517 235904 -174896 387149
14973 526772 331267 81198 414401 268108 380306 230306 200053 262845 36982 310882
14963 310882 211455 447260 285119 17711 278398 691881 237422 -14111 40791 -84402
14952 251632 154071 135171 343736 93229 199447 138361 296221 73593 153803 401186 109810
14940 182297 252446 466145 44723 74980 309438 274060 69202 449063 151491 421158
14930 421158 401620 375975 106154 114193 95394 444725 114982 -277200 280537 324675 324163
14919 324163 222268 343255 307055 416190 129839 450275 240870 245251 186485 63444
14908 449951 248924 45923 -66107 492274 620743 72489 -159284 413794 379498 152298
14897 204242 191099 354684 57222 243145 184641 241758 108561 135747 398888 486583 110477
14885 306827 493705 522332 732295 290064 31996 577335 202239 634967 201473 196286
14875 196286 286028 406284 485618 456398 228944 538791 436018 242241 260778 353433
14865 353433 359885 248610 328756 420675 553402 264720 507699 113911 230761 289282
14855 289282 263540 214878 858467 636088 267117 622182 465052 418777 497627 587568
14845 587568 281950 76236 151227 249059 182777 716356 472500 452237 167660 410005
14835 410005 165381 258787 238303 499773 548613 520116 261220 585160 383474 382769 252660
14824 252660 460355 488318 411696 790323 329336 239523 266345 177673 386279 788370
14814 788370 267151 530754 432110 632324 463379 375622 263016 574468 456827 357943
14804 357943 936455 647933 578399 434268 428866 480820 319912 361261 342962 372802 635652
14793 635652 660348 508174 378975 592555 371378 659789 528129 368768 760800 505942
14783 505942 442444 464725 615628 656522 446643 287840 537179 438697 552770 571449
14773 571449 732881 822643 469528 480699 455648 834147 913346 768046 449796 532559
14763 532559 855163 537808 620587 514312 389834 499828 841726 705645 704096 716498
14753 716498 551472 788436 557462 1001882 770269 896979 683641 953308 630159 486796
14743 486796 938170 543909 492266 842028 818470 551555 622753 823063 369297 366155
14733 366155 564810 625636 738956 821646 803617 791838 732511 675523 870256 800078 847582
14722 847582 795721 595981 997052 592901 928918 1015314 664500 565993 1139563 915682
14712 915682 1061795 752126 753810 777271 1131272 607361 552372 549886 923294 678903 790769
14701 790769 843079 792215 850833 996192 888086 1259498 836053 792554 810001 553858
14691 553858 628694 1060080 1237044 817221 1108845 924975 817212 1016401 1029351 808907
14681 808907 1127415 855980 1118849 1000133 1003072 1155616 909769 1079737 897552 1025777
14671 1025777 926133 601799 975803 1106880 974314 958482 1113909 900396 1298108 926544
14661 926544 1014016 929001 1171164 1026870 1043754 875502 1096071 1277749 1002252 866370
14651 866370 936601 1231393 1197430 812645 1149652 789262 1029286 1135776 1191902 1188821
14641 1188821 1010356 1138904 1204260 1112499 800545 1442874 1544405 1155055 1231828 1262458
14631 1262458 1034491 1158208 1590196 1063005 1209666 1672276 1237285 1457772 1488790 1507005
14621 1507005 1515455 1418013 1508465 1380918 1396758 1439439 1359937 1528511 1404275 1655864 1001079
14610 1001079 1436018 1176600 1662476 1907798 1804759 1946255 1647093 1497600 1458503 1524218
14600 1524218 1958608 1564870 1392359 1640326 1556392 1326008 1791246 1802461 1694373 1716301
14590 1716301 1777843 1781361 1774280 1479914 1552008 1820653 1784154 2012215 1879451 2137270 1752758
14579 1752758 1575316 1980797 2148624 2269511 1956255 2085840 2250068 2204581 2308103 2297982
14569 2297982 2149174 2494663 2199747 2234414 2442192 2560264 2517920 2788790 2673230 2777208
14559 2777208 2840101 2704707 3244997 3042896 3365517 3585115 4042326 4636619 5142865 6305083
14549 6305083 8200090 12448883 21261802 37318620 40516753 19845269 8869716 4731641
14541 4731641 3570128 2427399 2336808 1864810 1940132 2056210 1895176 2139406 2064076 1964822
14531 1964822 2233015 2258221 2114768 2603420 2110293 2209609 2546967 2252309 2305780 2413441
14521 2413441 2650298 2499455 2500700 2471605 2483260 2425447 2519725 3090538 2537546 2694680
14511 2694680 2677387 2911574 2855362 2933587 2862302 2667035 3011520 3085019 3069855 3108793 3171730
14500 3171730 3155717 3061130 3096579 3407396 3471456 3535765 3071882 3379825 3388263 3673628 3461958
14489 3461958 3533385 3617888 3370014 3807020 3600248 4167361 4059276 3841000 3877501 3860196
14479 3860196 4134500 3942058 4082164 4180934 3760708 4126012 4211715 4412392 4306351 4241856
14469 4241856 4698205 4156876 4553139 4479733 4670617 5016380 4429231 4800318 4876075 5042211
14459 5042211 4688244 4986753 5117432 5204279 5226094 5156134 5300871 5345766 5667044 5450103
14449 5450103 5514972 5570093 5775775 5707937 5492005 5607219 5876873 5943752 5946804 6229784
14439 6229784 6179834 6217798 6534975 6827759 6587909 6188299 6811895 7008662 6841009 7185762
14429 7185762 7066750 7022081 7394854 7251567 7532210 7754162 7642199 7913642 7991335 8265933
14419 8265933 8316482 8338226 8121722 8697223 8691300 8898861 8679691 8676562 8960820 9041207 9352106
14408 9352106 9246489 9096004 9512519 9617514 10092860 10162753 10351345 10514671 10561749 11031482
14398 11031482 11259653 11222775 11700475 11522405 12008542 11758868 12058710 12479314 12531215 12956796
14388 12956796 13038020 13290355 13420802 13927035 14047032 14602042 14261296 14492222 14842538
14379 14842538 15332142 15632226 15903776 16215718 16290934 16654316 17404867 17583884 17774852
14370 17774852 17966745 18589602 19059078 19417104 19671261 19870984 20604112 20638783 21367594
14361 21367594 21891423 22170755 23349497 23645879 24136344 24424791 25132158 25727879 26131870
14352 26131870 26554402 27491848 28152895 28840499 29340736 30332060 30889471 31822353 32637770
14343 32637770 33543843 34257145 35109462 36471510 37299002 38250880 39479049 40095981 41614229
14334 41614229 43085634 44140137 45346744 47012412 48465924 49781759 51816010 53259232
14326 53259232 54667052 56321665 58610775 60702028 62591387 64334104 66838647 69558900
14318 69558900 71957587 74549887 77161422 80338206 83504415 86505303 89913349 93617430
14310 93617430 97081143 101578952 105486556 109978762 114657803 119951816 125184215 131570624
14302 131570624 136919166 143435621 150381378 157327614 164665970 173003342 181289619 190124918
14294 190124918 199309500 209139660 219775866 230588263 242582930 254442935 266892769
14287 266892769 279888100 293238842 307428526 321719183 336075215 350555224 365087831
14280 365087831 379009026 392598075 405486616 417334913 428021349 436963118 443453960
14273 443453960 447425423 448340796 448771177 448462297 447017180 444138425 440569671 434997285
14265 434997285 426667568 416887076 405504547 393398076 379953228 365617994 351081280
14258 351081280 336281463 322012880 307444681 293509685 279740432 266644630 254018119
14251 254018119 242061869 230168483 219259867 208481848 198985723 189327254 180521235
14244 180521235 172393030 164591610 156966875 149819490 143153019 137050797 130956872 125995421
14236 125995421 120472750 114950188 110248965 105755675 101665415 97991161 94227633 90646277
14228 90646277 86917995 83510915 80647362 77206226 74670855 72309407 69642485 67085034
14220 67085034 65102854 62965175 60892437 58766358 56922428 55158451 53699943 52175769
14212 52175769 50820418 48972253 47394258 46319484 44767141 44313340 43119547 41363847
14204 41363847 40016057 39051463 38078885 36989474 36720067 35583679 34529226 33565372 32313000
14195 32313000 31620627 31088970 30383845 29618015 29130338 27975566 27373124 26903866 26179470
14186 26179470 25923110 25134366 24336154 23895108 23430757 22519178 22250547 21938142 21316493
14177 21316493 20991471 20948831 20082964 19374348 19532588 19112581 18917973 18592638 18457375
14168 18457375 17577600 17071428 17282580 16770028 16395961 16325464 15813144 15609825 15340827
14159 15340827 15366922 14707547 14708863 14021375 13914366 13857171 13332407 13211764 13247755 12897397
14149 12897397 12730060 12708903 12302866 12051133 11826482 11872092 11748358 11241937 11133383 10988843
14139 10988843 10972996 10888380 10609633 10249056 9782030 9774907 10118827 9846159 9825787 9536786
14129 9536786 9535273 9149188 9054100 9052950 8987548 8397022 8736355 8857834 8433724 8486447 8277148
14118 8277148 8119611 8137972 7752787 7619834 7411540 7583977 7762132 7781143 7393208 7512551
14108 7512551 7005790 7160362 7219405 6868013 6839155 6855758 6560551 6698450 6683717 6409401
14098 6409401 6401394 6105908 6211102 6061033 5982228 5915404 5832862 5915946 5664474 5476686
14088 5476686 5699217 5636875 5565714 5397551 5358012 5350264 5065337 5075881 4888403 5253896
14078 5253896 5088430 4971845 4936078 4819269 4880833 4859070 4678417 4884126 4885045 4622474
14068 4622474 4606607 4725794 4699550 4214671 4309454 4793962 4241786 4167474 4370982 4024923
14058 4024923 4192061 4352233 4016753 4059979 4148625 3815660 3958191 3901326 4032324 3898759
14048 3898759 3653315 3567182 3674768 3821366 3630461 3749200 3454210 3582060 3417498 3456196
14038 3456196 3231857 3338804 3200239 3372077 3234405 3513305 3245076 3177796 3101936 3122796
14028 3122796 3052152 2963029 3091588 3241318 2822040 3172539 2924074 2935433 2975622 2808366
14018 2808366 2946047 2450422 2711728 2696070 2985637 2647261 2535351 2592448 2479676 2495171
14008 2495171 2591472 2254655 2283603 2670911 2153961 2487499 2266601 2311074 2318600 2351295
13998 2351295 2267207 2551869 2182219 2337690 2229586 2582157 2730191 2556093 3514093 4136649
13988 4136649 7330878 14949888 31177606 43090210 26177369 14413807 9032752 6385987
13980 6385987 5235876 4176212 4109420 3478509 3423326 3320062 3313750 3002712 2550802 2809216
13970 2809216 2615358 2532395 2482866 2262251 2203035 2489517 2356700 2202590 2600739 2144250
13960 2144250 1926933 2222375 2266950 2464962 2115153 1632211 2230195 2384174 2059682 1839151
13950 1839151 2395483 1741643 1945828 1965994 1899643 2044750 1855572 1910152 1865126 2323855
13940 2323855 1765019 2042026 1847196 1877879 1766646 1792102 1757124 1823990 1472642 2036087
13930 2036087 1589846 1766596 1605517 1889611 1519243 1847192 1488563 1619845 1882394
13921 1882394 1855400 1458181 1726371 1609981 1488045 1654535 1687986 1594108 1437372 1476422
13911 1476422 1369144 1795640 1743738 1475706 1396478 1499712 1602183 1346106 1642499 1330238
13901 1330238 1795803 1287828 1563356 1414607 1397612 1424759 1445646 1660805 1209820 1440943
13891 1440943 1407195 1451757 1206040 1248629 1221969 1574347 1372577 1437992 1591026 1624804
13881 1624804 1107140 1416739 1205874 1252667 1531919 1480669 1240241 1581153 763758 1289228
13871 1289228 1075656 1486886 1216529 863476 1373416 1120662 1498220 1378216 1177193
13862 1177193 801713 769267 1159990 1197924 1540229 1072952 943447 962877 929782 1061253
13852 1061253 1390360 1105671 983195 1194895 944627 1166800 691363 1336629 949395
13843 949395 888330 859277 997379 1425451 898310 996550 1169576 1097914 903430 1210021
13833 1210021 1045709 1119476 1057225 629080 678092 726555 1017321 976165 1228145 1153701
13823 1153701 1028011 1154478 961561 595867 851099 970786 754249 974482 741924
13814 741924 1027591 826495 975069 850878 1182229 889597 906744 719175 623798 789293
13804 789293 839333 992978 897865 800338 916151 784891 1081383 1414661 975080 1017720
13794 1017720 563756 1081961 792610 829281 668586 883307 1219422 714383 746091 822222
13784 822222 732771 1180763 750181 895103 996967 994966 900071 1167951 860117 1087333
13774 1087333 725491 815831 735420 856065 513949 431680 548765 836937 463625 959169
13764 959169 660908 902279 631538 771780 730351 818972 702803 723162 975047 711887
13754 711887 1030426 736009 949951 948220 1012003 593833 687029 794478 896274 620217
13744 620217 789718 699092 702376 903463 758608 713328 682166 711445 647101 763704 881159
13733 881159 447285 520582 766745 789909 444816 301886 634847 841012 571594 564888
13723 564888 736962 439192 620181 513180 544784 297931 663762 772277 388763 895171
13713 895171 437906 607005 298085 704110 632861 658651 804506 762047 714310 610770
13703 610770 727927 494785 421459 352798 302431 446273 207243 808478 934150 672432
13693 672432 533291 579403 523201 439910 295302 498767 635183 570675 632837 456837
13683 456837 414248 327288 557568 488982 727979 669932 484201 324156 442887 511237
13673 511237 382880 934397 197765 345849 512572 321470 598079 685028 194466 73287
13662 336530 626424 420415 794405 544858 481805 391994 574909 789828 584418 425568
13652 425568 486608 646179 466549 470612 416027 794510 471911 304191 413771 241183
13642 241183 337734 260945 390501 329301 370021 644540 487276 463180 530733 230049 170583
13631 170583 632619 816587 550790 524299 341344 773855 216960 394968 98125 304577
13621 304577 478390 596018 503616 490145 519025 263154 -68824 631467 265272 643282
13611 643282 468727 733241 463466 494571 232672 445833 377333 360898 490820 430786
13601 430786 261702 607366 384521 533209 126060 346729 190775 224944 401133 619458
13591 619458 670097 224178 391847 280835 496457 651896 512439 312235 175904 369474
13581 369474 434026 320435 423315 451545 45036 412799 518750 253673 364722 553770
13571 553770 361256 539568 93387 116090 92668 246687 231480 320085 274479 289244 272213
13560 272213 525196 268193 239997 300668 353042 299210 279174 492873 287934 -90481 440686
13548 420747 495151 547284 348700 323125 530895 446826 703793 469735 438672 550036
13538 550036 321993 269287 498233 34524 -149349 490965 429309 64064 57734 298745 59763
13526 412604 296315 344365 621140 188777 209625 462624 475305 50353 -5999 252231 166081
13515 166081 406661 207710 435495 185673 156123 240593 382759 327348 284959 -137598
13504 282306 259711 343424 425017 375054 664509 390104 592628 533159 352963 65562 579766
13493 579766 296547 239041 263174 152109 473953 184298 425750 395819 546775 454456
13483 454456 540681 161902 265085 330924 92083 168425 307915 260003 288031 -49800 84104
13471 192407 387032 334555 199205 288935 279446 -18096 450888 251125 322365 350634 303539
13460 303539 206584 196319 475514 401997 197145 -47637 247986 14702 -205175 466194
13449 106065 238311 -12690 82138 411336 165972 564417 120734 132524 279805 335735
13439 335735 74699 283036 346684 469466 -145996 58804 435792 -34705 275595 452253
13429 452253 83729 -107971 323304 318340 41198 97575 166299 -91686 168956 432919 287875
13418 287875 55925 453363 80536 226740 235944 245989 -225481 142410 346785 340484 283035
13407 283035 118085 227357 470771 222928 182214 187369 347011 199939 125364 189013
13397 189013 285321 400037 515155 286117 12731 375101 106249 255274 -148077 382205
13386 123303 228671 83159 38624 353715 358266 384859 87022 272225 200899 -127446 83423
13374 186496 225209 141094 -79166 262777 209155 525797 373787 319841 77911 19424 431057
13363 431057 262948 330429 242158 143085 54000 281235 206309 291254 221772 290200 106402
13351 126134 379125 415464 264120 348644 194804 478549 537326 283587 334297 363684
13341 363684 -23536 -87540 211423 382350 435149 311015 10755 489896 234766 116091
13330 -222696 60682 -122591 63191 17211 342707 507005 346708 610819 471117 44363
13319 383766 180500 295055 252695 276193 -37769 622759 318362 337683 274650 8823 327893
13308 327893 107876 451966 62930 326288 183815 181289 278682 260059 393009 -29559 308062
13296 -2106 274687 449896 368094 270609 -43174 -8734 92532 62800 363495 91467 127039
13285 127039 405832 -87086 189860 30013 123094 114614 360159 75174 256639 326708 103027
13273 217031 -3488 178927 89208 123375 -32006 256682 422962 142402 -54314 410030 91996
13261 256299 9282 -278187 7052 355862 122633 167380 156240 388975 75735 229563 56968
13249 58818 107103 -103454 7877 313139 331933 261819 292996 -77009 -95222 -26372 417403
13237 97814 120069 -27476 90487 -302718 -96425 225398 514132 102658 434021 194080
13226 295433 328561 402963 278493 354557 403083 22065 -120292 233289 73964 152919 -149393
13214 -11290 355340 348365 -112846 231502 135773 369305 143439 73214 138723 124618 454450
13203 454450 -101875 111300 162775 -33984 109885 194855 137990 -107900 278889 29390
13192 -28124 187652 -12150 272661 -185299 82213 165975 366437 443144 -60888 -37150 114931
13180 -177235 142827 519222 117132 -98388 69066 -257485 327566 50789 -38408 18332
13169 -39271 183204 -45614 -278360 21122 -109522 180715 -106345 82277 -92896 303147
13158 263841 382450 -63009 -41758 -77544 187185 48060 164746 208081 282120 400890 100876
13146 -87485 -75990 159003 -49438 -169306 -173967 -114191 116087 314357 112354 341604 213443
13135 213443 -6118 53471 166342 190659 329640 73135 -64610 573491 93871 241845 18196
13123 362377 -184791 -63801 135979 259582 -30205 73799 89261 -136731 84072 47628 56228
13112 56228 36633 -103167 84682 236318 112579 -151673 41627 -72953 72563 -157401 52588
13100 -82005 -54992 -46410 -6380 151992 256948 -49985 -92277 -99776 -55997 -79680 -47059 158979
13087 -192893 139974 244813 -128753 126370 257252 19643 -354474 187509 -32871 65884
13076 -49414 91711 98723 123683 184939 122694 -12894 -133153 184309 472688 -46775 182362
13064 -84865 -4906 62184 -37537 -100775 100075 -92827 295894 315476 -17866 25571 -85578
13052 461768 194013 29342 -186928 139466 -49662 110286 305206 -30655 31340 280834
13042 280834 124625 99138 60538 5962 230972 165678 10040 22295 -4900 160326 543918
13031 543918 42375 314591 -848 356172 57135 30969 222765 275323 63167 13104 192771
13020 192771 -32275 -231775 265062 -259739 269883 232485 312856 156753 206156 168428
13010 168428 -3434 181632 228359 242511 126102 34654 90251 -185724 179969 -165853 49206
12998 206691 279912 7427 132738 24610 -126409 348118 -19576 68735 6749 226718 -168567
12986 262978 15348 154775 488207 156977 50925 145206 367733 -96106 -108504 21960 130091
12975 130091 23319 84598 114634 43322 146363 -66344 2221 184000 16919 107995 74007
12964 74007 177983 460979 4304 -34088 -75795 219755 124833 -92356 409480 107220 47355
12952 243118 229330 201003 38818 252421 -29210 151073 394399 230037 -24367 117294
12941 132765 -60116 33821 48933 236044 83922 28486 302709 -33467 -55690 -109109 55253
12929 164857 113288 -93975 -186547 87766 44714 -35058 -62780 55257 89165 -78576 196470
12917 -7163 61079 326835 129110 -59611 64490 120279 167849 584605 239779 -118880 -156504
12906 -156504 -135835 149126 180637 135412 68894 -177779 338717 -165799 234140 84732
12895 176563 153970 21429 -3171 295161 107426 24876 67468 257246 182626 -20767 77744
12883 219720 248245 -81831 -55641 -249845 -180430 161031 -80454 -62074 10368 294227 13820
12871 25804 -388147 12156 -271055 187010 -228922 -113616 75007 1336 8004 97091 -220763
12859 226489 -170876 266526 -159840 46252 -133523 263757 -98569 159675 373109 261201
12849 261201 -269912 -66617 455383 -189612 183704 -283174 49475 -147229 103838 274605
12839 274605 166707 -59963 187846 76811 8514 -160515 41015 28289 127590 265631 -173097
12827 353417 -47590 -241141 -346 105154 -25600 474 -217979 -428519 -137595 91710 98562
12816 98562 137769 251746 24942 161200 123897 -293582 -125533 -43324 -183080 25497 -82141
12804 170972 134970 -55681 -28728 -105382 -7906 89491 -8451 119286 309324 370578 229241
12793 229241 32975 30635 -439620 135685 174269 127618 228666 -18010 -265 229065 -43973
12781 59925 -89830 209766 154533 -136076 106339 -113729 221624 104291 -31231 -236470
12771 -236470 187510 69548 113943 69411 136777 293012 -116831 -98999 245997 67766 -147606
12759 -59738 -10885 88629 -132525 -67778 -110476 -53080 2875 122025 -116384 96553 -237393
12747 332654 -205204 91185 120373 -129414 295658 287642 55045 365189 174420 -92770 143084
12735 63235 -43351 38500 -133913 147184 55533 -296726 52128 130806 20101 -147753 -119016
12724 -119016 187977 -12769 238447 -51390 -26761 -61902 -141543 181383 112122 -7399 -129084
12713 -129084 -187654 8116 217260 133437 41379 230683 365576 88460 184298 365361 407929
12702 407929 71514 -32054 -140742 -23039 131981 14762 9861 -493976 133789 -72238 33299
12690 123386 -46726 -92414 -171700 148186 9946 219785 238733 12594 7032 185968 346471
12679 346471 192000 -106463 456659 88923 242375 177508 149703 47093 59423 141516 319860
12668 319860 -54054 134457 97367 11534 152268 40669 -46284 64281 -98252 139850 376572
12657 376572 30437 -124845 171051 318922 -64603 149373 -33468 62715 209031 144420
12647 144420 77466 -186941 263358 248235 34710 -26696 196032 -49242 301093 40895 -326296
12635 336694 19953 296237 116856 84233 328889 194121 426241 427495 82516 129866 63004
12623 187648 496035 351684 -147277 3182 140877 156208 114150 -47012 -111589 -177748 69655
12611 -323414 34594 35767 -80505 -156628 561378 134866 83076 -55365 65581 154105 162905
12600 162905 242344 280390 -342648 251244 169152 105738 -107464 -28429 33124 408349 83251
12588 -31941 -61759 68246 322516 -100397 96843 111224 450014 -258076 -231405 -202766 -472549
12577 -472549 120567 93433 442494 226199 171675 -44117 -18878 -183299 37171 313581
12567 313581 -115998 42197 -93932 -462344 441333 -61231 142314 118133 74022 -174564
12556 -12606 23310 -14664 165995 136736 -22182 -185886 100927 -84794 -198217 -5966 160404
12544 86647 -118766 -4277 335296 -84959 257325 -135559 137603 -36711 -69447 102635 -326
12532 162703 -50562 88746 113788 92988 210929 -171282 489721 -245037 13256 356548
12522 356548 120879 192613 69422 188517 31104 48688 152029 -138919 -38204 -81196 72941
12510 119240 164306 212911 235791 -327705 -60348 199435 37706 36572 -47371 174594 -87994
12498 279409 96025 -19591 -98792 42802 -86190 345090 -205089 156097 61590 147010 200329
12487 200329 -42357 297223 -97322 -141730 177131 223464 -118417 -18885 -498403 -3840 416503
12475 3439 -229126 -153006 243080 276206 80999 -243935 13690 -218127 69968 -190585 -118852
12464 -118852 26638 38841 -282892 288073 219107 107240 111103 45736 -266007 -65559 28272
12452 -104568 256406 212492 112913 -45079 214476 -11330 94574 -156178 -147715 141443 48092
12440 90472 191120 149367 -51064 -255330 140394 78512 -73779 152440 -44232 42639 158506
12429 158506 -79446 -143171 -132518 94790 139241 190605 -224330 -27837 2776 -141905 -11229
12417 -83446 104504 -606239 -165489 -74651 -127181 -84928 -97875 158694 -337149 -174018
12407 -174018 147586 92034 -118399 43983 -9026 -145101 9096 -93128 102214 -12402 -107286
12396 -107286 -175989 572 -259067 12753 187012 -173130 -155839 -270487 12015 131133 255659
12385 255659 226934 175160 -42840 160459 -131740 45781 91346 -180551 -384918 268293
12374 12352 -86456 -97911 219141 -109043 -78330 -76392 195229 -31231 92081 -82501 100250
12362 174307 -96032 287156 -262154 250058 55744 56874 341389 71053 20003 -221950 -23853
12350 199390 20346 -128241 -182385 13218 -65382 -168395 65921 -115849 -210016 73136 -88059
12338 -74572 -113509 -325316 130180 -108340 105859 240913 37188 -76856 377033 -6708 -79495
12327 -79495 -154810 287178 -121070 241220 -41506 -169626 -363508 34131 36780 186862 -154245
12315 -26118 3877 190319 55435 -44169 148755 74358 83546 316407 -38736 -164420 -152211
12304 -152211 -211322 -385537 -136139 -59441 327126 -60010 94055 -445961 -28810 -110680 -58405
12293 -58405 -178544 179213 -144755 89371 247905 36796 -219834 20300 195310 74670
12282 387037 311514 96979 184795 -154905 -179073 321157 127773 -72184 405354 -126989
12271 -27756 136988 184896 233826 48414 157605 -62206 215382 -48187 20347 -208665 -255373
12260 -255373 162011 -113105 210535 266593 229599 -182362 44690 166148 -6195 156317
12249 169476 35555 116172 19117 81317 250873 -133685 46725 92367 151934 -12366 -230653
12238 -230653 241393 346352 386404 255619 -31113 152361 200589 198698 402810 -43093 423994
12226 436959 230636 242348 292936 336092 472167 9468 241241 272151 -62993 343279 538134
12215 538134 135579 364420 -129621 217249 277177 147121 200026 19822 282378 -10502
12204 138473 191055 425082 229765 114860 396016 183047 -56944 208532 44082 -2990
12193 -3069 322596 103200 451088 42823 67353 272577 97287 178702 21010 200611 288203
12182 288203 78409 38267 92797 48312 52662 -68492 81621 175567 20404 120507 130374 12513
12169 -47440 41977 280743 107165 -220772 -210053 -82569 350548 131488 -66612 273313
12158 98466 250943 21755 134673 160640 55512 41399 -92255 -34758 -37134 -142226 -21770
12146 130007 -28699 237312 -107283 131024 -195747 56871 267752 204813 51934 -95352
12135 -101028 -60530 -274028 -331514 83248 -3475 206157 58694 231478 -7557 19096 -143293
12123 16486 -128262 -96560 156320 315258 -128181 -104290 66399 264853 -112663 -311586
12113 -311586 125638 255228 -9594 -132307 -29342 321595 -81863 -45044 -268093 126206
12102 218223 -207116 190136 197614 142296 509983 96525 -151359 122047 48456 -42764 -324784
12091 -324784 19095 119513 -85591 -164308 -84556 591335 134990 -14298 -213301 -168423 117818
12079 -174862 -184296 181660 307073 201893 238449 -53266 -332020 99560 379828 85554 -307422
12067 -142639 60832 180658 -241183 -93232 107111 116756 29806 216899 971872 1840457
12057 1840457 751938 184556 312570 205889 -135271 251241 78697 -51299 -71311 80065
12046 -180510 -108212 -329282 -114290 -144826 58552 -117917 -11323 360267 -308923 300391
12035 -283115 -189159 90118 34971 -171813 -148543 -239740 -43380 -87658 -50771 -95682 -49739
12024 -49739 -88174 73862 -1111 -41076 -138065 26132 187906 66517 -235624 -71602 -83050
12013 -83050 51621 105769 -102411 -316253 258224 -77491 288017 23240 -1249 -99255 125992
12001 -161066 -115346 -262685 -98762 -281967 -4545 219924 -95683 -80523 283592 -125176 -26374
11989 -288399 -400606 -359727 -723 423 175245 -183004 450170 218041 -176554 -153109 101820
11977 -30353 -324052 -183832 -93736 197567 64865 64158 230675 -195539 103461 263541 -67930
11965 277980 193377 -102527 171128 113122 -14764 -46251 -69933 -371918 -68692 -254984 -114052
11953 -100756 -173700 47547 -25184 -108578 110149 41076 131625 397546 -414575 -56197 -89956
11942 -89956 -265126 -167147 -98661 77937 -49275 -184326 -48714 -93814 4860 -193139 204898
11930 69465 294935 54478 -42503 -102676 -176033 35349 -368465 -227823 -215892 99191 238355
11919 238355 -77728 -160694 158119 -129200 4696 38940 109336 171484 70907 1407 -101381
11907 -100453 -630253 39547 -264965 359225 12798 20919 67522 117899 190166 -102066 -144692
11896 -144692 57654 139501 151018 -289787 -146499 -333265 6960 -80308 48270 -128372 -182854
11885 -182854 -156314 -152347 -296393 209368 -118068 -153283 108204 -398445 -11442 -420518
11875 -420518 -73149 432941 85627 140865 324968 -395449 109836 206344 182645 -186959
11864 -79770 26258 15349 141319 -15981 -272252 11084 -316708 63760 11913 -54964 97503
11852 -197369 123533 -190875 67270 -124218 149241 -148595 5851 -62776 -247732 14834
11841 57665 -175259 -171870 -140079 -17314 293294 148923 197946 -187801 -157215 -113347 -38540
11829 239634 105617 -179552 2504 -91733 -266294 -57319 160020 -31852 54917 -5017 -34094
11818 -34094 185267 -89970 -20080 193366 6404 -374221 179483 -203619 55602 -628918 24064
11806 -88302 -27866 74771 136112 -92122 106055 -174400 168206 -163489 95069 -16949 -11840
11795 -11840 120755 87186 5591 -355415 45830 166747 -260687 -369017 174006 -202311
11784 96146 -125711 -253153 28968 35346 370652 96537 116437 59459 -183159 96301 202194
11773 202194 264652 -125034 264370 -243399 15863 -19045 -158890 159787 10268 101532
11763 101532 -174880 213830 151410 253408 53903 -190885 -49473 298123 423628 -179471
11752 195188 64772 35761 -22229 144062 -313615 -150205 53271 -248861 61339 7233 -176887
11740 -46218 -138410 -162517 -178537 -164192 19505 304183 -26848 8816 403865 -109352 -82141
11729 -82141 -30595 183012 162918 -79909 151862 138684 131491 -21658 -112569 -67117 229581
11717 -103017 354662 -110704 169616 306085 -8588 43229 -214492 -128537 -62342 -24273 214326
11705 -87524 268211 -1742 37907 364060 -323720 169104 391275 73524 287963 94832 179857
11694 179857 63334 -65101 -65279 174385 75747 197293 294135 447322 55581 40645 206379
11683 206379 249208 -69416 145527 -679 -73664 -312833 70755 207837 81763 -7487 -329266
11672 -329266 128562 -97947 112005 48747 326071 -85854 320028 -25620 -130449 -2290 -123414
11661 -123414 221777 -387893 209098 48881 -38257 49242 153257 17673 48074 -16329 91429
11649 82684 -30663 -142168 257292 339598 77591 49711 332885 178924 447441 66670 -4604
11637 32594 -132120 41568 115868 149676 -104778 137078 228122 -105860 219879 46718 118659
11626 118659 89552 370631 -16895 6919 42948 195268 -131890 -26467 52511 70763 -192984
11614 209037 167122 30656 196445 134190 59427 -153076 206190 179849 108661 170431 -69632
11602 104376 -157572 -146861 -237535 -47785 85744 61950 121217 -405044 -52255 311096 92382
11590 40660 16528 73638 76378 274404 379827 320307 256621 -56953 131308 401686 119043
11578 -157906 -70038 62344 60414 88094 72316 -138295 194850 -9567 -101420 -38080 -290445
11567 -290445 -36427 256124 18207 117980 -151711 438951 26937 -37552 18806 394024 359828
11556 359828 121721 128273 -3374 96111 78679 -114757 35984 67798 -25119 230552 350265
11545 350265 -266275 -72284 181715 209033 -187130 -306775 17089 -376456 -190191 112521
11534 -6153 145522 127752 180340 24257 288958 174586 117497 1467 14516 32266 55566
11523 55566 -121777 78855 -69243 -137203 1064 -171111 249385 -26915 14894 367309 166565
11511 -89040 121380 91826 111325 76866 310486 -111304 72918 -185115 230883 283279 134355
11499 109799 244007 284437 130125 399091 140796 256679 192193 -64612 151296 -165151
11488 304400 311775 -5112 87453 206120 131430 -55887 176345 184160 414675 189441 588169
11477 588169 29157 34119 387725 315250 81525 -23508 287486 -14279 109046 82612 454309
11466 454309 318066 61316 232681 153948 100941 -28471 -240667 267155 -16306 166189
11455 243218 100611 322950 -81526 -85469 14235 77206 246608 12124 -115758 498983 -75869
11443 324110 26231 77909 254947 54042 -24681 190651 173023 234372 75049 -74181 294490
11431 122670 41035 61829 -130487 51330 227377 284309 151943 129395 -65008 84946 2641
11419 -61620 40856 59113 93043 -50337 -243652 93843 38201 -161291 179294 -467911 279143
11407 -400990 -127800 157068 -213320 -118674 53397 -84229 249730 233060 -63908 79538 153525
11396 153525 53904 -57152 126468 -15178 -236061 -154138 -38827 262911 153346 118929 90374
11385 90374 -89212 -85917 22074 203307 5240 20165 197309 -8008 -158406 330355 345803
11374 345803 101499 87498 -198462 39343 -179472 -136291 134441 57807 78332 129411 -157691
11362 -210777 -8807 -76766 68801 337013 28164 -73065 -254019 -50970 -42324 79196 10015
11350 21969 -166464 -58539 -65652 -186518 13862 -92885 270513 257639 124340 -97718 -2174
11338 -40651 -193977 17128 7578 41611 295465 -161920 -55232 -92102 -11565 198946 218496
11327 218496 110442 -366947 129919 -154142 -110633 61745 62005 -229926 380402 -236785
11316 38117 139914 -120020 -65650 -213443 29680 539071 -121417 217166 80852 -151673
11305 -7315 7175 118257 153756 103845 92580 189441 -158241 -58854 -388139 -113926 176075
11293 -62873 -57822 59638 79114 84867 -27825 24337 97851 -256699 325903 124213 158802
11282 158802 -262627 -129788 135977 -173657 -184229 -250503 -101170 -285774 126622 323394
11272 323394 -55391 -15491 -209881 -210875 -328821 -63726 -23079 -345341 -106574 15423 -140069
11260 -129760 27332 -28668 -308163 -283199 -291340 63484 -31338 101008 167002 260202 71289
11248 220092 133785 -133160 55900 201199 -147309 142219 21287 -58736 9366 93446 -438138
11236 202116 137113 16779 344114 121797 -27050 30812 -136652 -143736 -148100 500330 -129493
11224 175702 47723 -51153 348107 -49887 -4796 62285 -76807 -52217 10668 246935 -229550
11212 -189415 26315 50168 -178522 -101452 -276208 -74840 199029 252789 -236950 360940
11201 368385 -79032 -161886 88901 -162938 -5436 -105086 40819 -20488 95959 -106366 85172
11189 -219121 -37408 81081 80858 -206899 76370 165081 -183443 155213 -158917 -106943 -145160
11178 -145160 122973 58101 176038 -98265 -3467 285913 -56853 -8329 182287 72836 -220618
11166 321140 -253688 -100907 302687 -85668 -100365 -33118 -148477 -374943 89392 -280642
11155 -94813 -159266 14384 -68419 -148532 -139075 248255 36283 -93021 57897 -22929 124617
11143 2264 27973 -97733 -128866 54042 149549 -258936 144749 -87608 266582 91772 -286081
11131 -180240 1 -202978 135977 -152483 -251895 41671 29577 43002 13474 62680 65492 173067
11119 173067 233186 -14590 16110 504142 334080 67343 143330 355301 201087 313384
11109 313384 541048 -278537 31112 191187 83710 140286 224612 150707 -110643 187400
11098 -91552 18981 371093 50927 263991 152996 257427 135938 23330 188886 449437
11088 449437 212241 -70762 387567 142820 155821 103373 410889 291100 429091 392801
11078 392801 441958 343798 281937 183606 276699 246408 321741 601416 593834 358164 70743
11066 267871 486733 612995 334854 542356 693641 279908 647009 697325 736591 633319
11056 633319 311682 963575 1199066 800554 841182 690260 987984 1039928 677185 1026304
11046 1026304 836333 737877 1186730 986221 1064902 788492 773416 1139763 1164765 899370
11036 899370 890486 1035381 674468 1147846 915171 1323577 910165 861653 906115 1114343
11026 1114343 812301 864944 755999 733914 590043 1021252 573773 439382 900793 588146
11016 588146 580813 761590 560602 679874 719982 696292 656812 665726 769223 897307 698694
11005 698694 785455 1043691 763121 1067440 945069 757391 922312 793480 621396 514160
10995 514160 692596 559259 1022495 603869 842189 752188 1083382 770292 999184 1180063
10985 1180063 1277873 1455858 942608 1148946 1358071 1435826 1577741 1847927 2020531 2566876
10975 2566876 2995834 3114451 3322681 3541359 3319286 3639402 3428304 3122700 2612158
10966 2612158 1816104 2214276 1880212 1792964 1820968 1649155 1792676 1963960 1888924 1558684
10956 1558684 1397368 1219099 1054513 1336576 793295 1090591 791410 728373 544454 426293
10946 426293 406008 390245 367955 411669 290903 353968 28838 81239 270898 115270 22783
10934 310995 87723 80548 252631 282678 48270 74558 -373349 -47695 1784 -272869 -19196
10922 250395 -24065 50651 255923 -188763 76163 59943 -240264 -97696 132547 -56953 -27959
10910 244710 -172687 -381134 169079 -90703 -233853 -145116 240011 25799 -143074 42893
10899 -55843 246211 178249 29840 -235741 -23777 367439 176201 158984 -19895 -114553 294631
10887 -217377 237953 55165 90230 -203883 280143 40769 120591 -60944 94656 -5088 144514
10875 -278217 137429 172190 88027 81971 -115052 -114974 183775 37045 -252180 49716 1355 -14609
10862 -18231 -54588 144863 -24323 -6826 -3276 81691 39717 -191137 246977 -86986 127573
10850 -17178 116512 44954 -127987 -50657 136837 -101895 282765 327198 -146652 -124360
10840 -124360 28355 -226286 -51973 68348 302024 -247628 120857 -78886 2356 105683 -307794
10828 188577 -34375 347266 22327 -38973 92476 68600 -7643 -145745 -47739 -37801 171003
10816 -43565 32362 -254303 -217136 -152068 -342420 17178 -99447 -102208 -138761 -157141 -125052
10805 -125052 105391 -157128 -74207 49014 -248414 286734 117282 -11595 -23579 60602
10794 -173577 94691 -3057 -231972 201760 91683 -260061 -13194 -77466 -129745 -249120 -546465
10783 -546465 -251898 254178 67546 205497 -284412 -83706 56209 -47716 110655 -133978
10772 -467461 61866 -142920 121941 -195189 -119439 -157463 -70698 -182682 -100721 -132830 -87155
10761 -87155 8486 141885 -139141 44569 116707 -139941 -195337 36301 107867 -173876 -16009
10749 58615 73690 -34312 -115721 138562 -144265 94359 -259316 185190 -325137 41919 -356836
10737 -112110 15768 138785 192661 140587 -169086 91158 -49422 -181473 166461 -162419
10726 15474 7704 -80361 200668 338267 108038 28767 223634 -72061 172586 -10774 -294268
10715 -294268 -111920 -52291 -133597 20015 -265009 60550 -157503 267292 -39449 386809
10704 7643 10333 -106688 -269218 -167430 -133278 30842 232857 43507 186635 -62862 -38425
10693 -38425 -91198 147393 -268529 138400 -92774 117806 -84810 -68758 -196122 -276774 -314549
10682 -314549 49729 -444565 -194708 265828 -29838 44875 -32941 109506 55824 -8205 159431
10670 -113629 -191405 158361 -126382 -161449 -149418 -187662 -105206 -373734 -67262 -324808 -75902
10658 -219053 -117379 79714 -111635 257553 91908 111178 208392 -318561 110234 -65233
10647 -228176 -252504 -347624 -116569 22043 -221488 84174 48624 -150972 124716 13193 -291282
10635 -79394 -319568 -273626 -187332 -81156 -264186 -299490 -170744 -60484 164463 175281 36534
10623 342437 -275981 -26800 -80889 42893 -127186 288427 91752 -157619 33093 -56143 52919
10611 -61542 -65845 138313 -232498 55858 -246153 -50224 -193347 -273221 105653 -55887 -238453
10600 -238453 -137886 87374 146724 -185272 -23096 53838 -50010 139587 -63486 348768 -175051
10588 83333 93501 -28816 65428 -152597 -221595 3332 115145 -256082 215696 -49631 -278386
10577 -278386 -22232 -239869 40557 -180122 135306 -54157 31916 -70486 -293428 20593 -227455
10565 -61308 -380339 92755 -276796 -28808 -20122 -13321 28265 -189280 154324 343142 -171751
10553 -159573 -12316 -255330 -57753 -80039 286143 -144869 52738 28480 38279 -84982 137800
10541 -154150 125370 45333 -46956 -315117 263246 -33836 -79717 -246596 -310502 -11055 -96855
10530 -96855 -92967 274636 -242842 -17965 -126147 147135 225859 -71434 107243 -392178 61188
10518 -137951 82850 174834 -139221 -27187 -52435 -197401 -13486 -42682 -82307 -231886 8678
10506 -42381 -45540 -71011 -181295 -5667 19954 -253846 256131 233939 -17703 -229591 -191220
10495 -191220 -88970 267883 270037 232661 144849 45104 -203690 -222359 9761 118752 341887
10484 341887 462619 616584 346106 44493 106235 48676 380110 -474798 -153127 -24943
10473 164768 354565 142674 42618 -5769 -40481 135078 263646 -6920 -85887 -110976 -199604
10462 -199604 -156466 -187597 10994 12972 323943 -245422 -79589 -211649 -86042 -212129 -113800
10451 -113800 -330887 -11753 -185936 -371546 -164148 -38247 9240 235549 222119 334811
10441 334811 -112523 175185 138737 -292660 145968 -138898 -31994 86044 133336 -150335
10430 -113017 34696 460171 111898 96994 161656 316625 -371228 38830 -18596 -312532
10420 -312532 9104 -76479 -246704 -49197 173483 -214342 -88702 -195798 212830 -143477
10409 89261 8490 -79872 -335758 -230220 205065 156145 -226613 -54558 -266630 30835 -139472
10397 -90838 -85458 31328 -128729 -146537 94912 255592 -265513 -8583 -41695 148347 -16755
10385 50848 277009 301878 -220198 247059 -193435 161131 281964 500919 533171 167521
10374 348966 389396 185396 346418 473086 148910 344394 638214 346883 679000 550145
10364 550145 149674 269278 654101 140580 386808 261541 -81228 46865 163174 369199
10354 369199 454452 578738 474870 621375 744943 733884 258100 -3953 141238 303355
10344 303355 664423 488799 502331 363381 417149 181427 305077 212316 213831 241418 39190
10332 -85994 135272 370435 265720 303688 50932 -216023 -16269 139574 185062 73189 288479
10321 288479 129825 -150518 401656 445219 85843 94692 -81368 123235 131482 -25829 55363
10309 -30583 118275 -15460 -148606 -126058 -63941 134602 -96287 -9982 97692 -43198 -330353
10298 -330353 213836 -59804 -157945 3151 -338271 -137771 -80465 -245035 -52280 81674 -224632
10286 218810 95337 -94619 37950 106463 65987 -236288 123573 60975 136445 -62262 -139157
10275 -139157 100064 -213370 76334 -6921 88428 128224 166822 -141714 -102932 71135 296882
10264 296882 -63411 426723 297831 384216 452209 517358 641810 335786 -39858 223972
10253 176000 82144 -66941 -143223 333194 -422318 -352362 -136753 -337895 156317 -94459
10242 -75603 2877 -363615 145941 204821 208633 42955 -379282 75402 -130310 -198147 -46114
10230 285936 -163519 142976 208167 46516 -148083 -100185 145498 -79474 242391 172267
10220 172267 -190171 -85039 -299255 -391630 -159265 -12351 94556 -242026 -54687 52770 45319
10209 45319 86699 -203663 324482 -165057 -89907 -18894 -101296 5304 -325382 108531 228104
10198 228104 -34841 113537 97647 50100 -347400 -235732 212354 -108874 94485 -185092
10187 -120275 -396692 -177322 119220 32439 -79948 -36564 -420669 -172956 -8810 418626
10176 39954 98933 -82130 -233534 -242418 297669 -183646 137927 317461 -301137 -318906 -6585
10164 280728 -158375 -13718 -107923 -43884 165940 95785 208059 -83219 -276883 56166 92861
10153 92861 -241910 95716 267865 8628 212748 93231 38530 -49675 -142017 33077 -470317
10141 92678 -228996 68767 89470 238523 -323772 -219123 -207850 5735 93389 189359 -17917
10129 -46578 -106917 -41051 -189249 -69261 -121539 -48518 -205157 256556 -49145 219989 -128579
10117 21215 -221540 -33196 -2346 19581 -93321 29546 86311 146328 -144803 152090 61263
10105 -163769 -31778 29642 -333568 -145340 -441189 339495 183806 -85401 -86076 -201622 193631
10093 -180139 155679 -207803 235720 -342967 126624 68628 2329 -79681 133988 -110250
10082 -4411 -177774 146598 27789 74567 187346 -53493 -133550 43139 62273 -216124 -84789
10070 76786 -171032 -96306 -32474 -50802 162747 -327379 -355921 -126512 -17528 118661 -132813
10058 -4023 -34526 -138733 -578236 215704 75178 -539954 -18306 -104935 -205303 -96830 181921
10046 171576 -102599 40763 6740 -194003 -279248 -13538 -176058 -259164 -189580 -190455 197085
10034 110322 -165032 -477038 164917 86310 7390 -189703 -221750 -71931 301174 -323750
10023 283676 -155106 -257311 -87898 -433475 119309 -164833 57491 27289 -61945 -194044
10013 -194044 57179 -95818 206824 5917 -312578 64724 -84422 190940 -252465 -316933 44473
10001 206815 68258 -49652 -199828 -115191 84821 42680 345691 105654 121524 8651 50265
9990 50265 104450 17421 -194304 276464 -142085 -41720 44377 -113712 2663 -47073 -253105
9979 -253105 -161487 -18623 164082 163773 -120942 41618 -18698 -91453 -143072 -231576 109296
9967 87025 297773 36662 -259829 -244921 -185126 -505266 -93258 -158904 -57298 -207291 -36363
9955 36649 -223581 47824 -328217 -408606 84767 29081 -207442 -258050 -154524 96802 -64232
9943 -370445 -168637 -21099 86103 -186736 -61782 -22655 -127059 -503113 38875 -4219 252421
9931 -304684 95566 -318394 -109030 -246622 35820 -359188 247071 -96433 105187 -226298
9920 25593 61144 75994 -139482 81755 -393410 115635 -221539 -260811 -134979 -95416 39178
9908 -43279 -136628 58797 92684 82944 -46609 -238913 -80357 -436829 -342788 218681 -339076
9896 -253726 27128 -47788 -146406 78937 22951 -51358 -121457 -174567 16652 -314719 -345886
9885 -345886 -209240 -93552 -37133 -410051 -167738 -80704 -232351 -433139 108703 -170618
9874 62346 -282989 -354547 189741 -156289 199691 -313440 -188068 -296060 -168024 -47217
9863 -116815 135199 28189 -258627 -119170 -275109 21600 -56956 27620 -42936 -10402 -91127
9852 -91127 -139758 -496392 -362024 148873 -137667 -189153 89829 29594 80237 -232919 -60425
9840 -268066 35877 -281638 -409047 -58575 1362 36316 -41921 -69989 77000 -103353 258585
9828 4384 122129 13587 -143635 -310045 -101238 -214291 -100229 -153943 204611 -167462
9817 -138596 26040 -304729 -69016 -295714 -236743 -344194 -26470 434989 -215771 36298 -106372
9805 -2054 47253 -262033 49931 -144068 409456 -120983 208092 -59563 34974 58911 175847
9794 175847 56592 -159288 23265 -415218 70854 -462230 15489 91405 -28309 -150509 -293313
9783 -293313 -16648 -252402 271645 -193586 245322 43583 -96315 -104154 -66565 190378 -232268
9771 -160609 106805 -217809 -169858 161981 -122481 253950 204319 258022 -253766 -29035
9760 -246124 -11733 -82466 -84593 5231 -85155 21823 -246532 48597 147671 97446 378162 116965
9747 119002 -142372 -23856 -230794 40583 49308 -237323 -146428 -391552 -980 -34567 -170338
9736 -170338 75932 69460 152733 -21364 -308453 -143449 177094 -108582 -355106 126974 -159321
9724 -204878 62723 46593 220081 -116281 -179719 248967 135441 -283281 215935 -212329
9713 211488 -336087 -149194 19337 30450 149287 -159464 156586 -35806 -230567 -301364
9703 -301364 144788 22621 -229502 -242735 -295390 -117554 -10323 -477340 -89942 29808 -241858
9691 -447711 105567 -71851 -165623 -63110 -327976 -142131 64793 -31593 -110160 89414 167941
9680 167941 -136168 -16320 -248694 144999 -297604 -290863 -202691 43565 -55558 -332372 150956
9668 75740 -163903 -259837 46300 12432 -62806 272219 -44993 277871 185797 -161885 -35921
9656 -41892 -8138 -80287 -212356 -159123 -129099 -29014 -60969 -135778 -97366 145706 -5318 194484
9643 -37215 -192689 -104419 39906 -48272 -170872 -30283 -65360 -3008 -447754 -93200 280738
9631 -127059 -339767 -148578 -294366 -366280 -193090 -57979 -274704 -332447 26564 -133642
9620 -142922 -185573 -61557 225215 -10597 -274021 79982 -221658 161836 194185 -153707 -177032
9609 -177032 -257490 205498 -69996 -88613 -288733 -176918 303042 -73675 -154667 -291493 -273999
9598 -273999 28330 303320 99287 -33633 -37351 183851 -69127 -25904 26462 49432 -318434
9586 106088 4858 -268494 162034 146980 -234923 -27485 126723 -243616 -251143 52279 -21623
9574 186511 -47824 169478 282021 -301308 -74506 -111362 -166766 43536 -114916 -337272 351186
9562 18801 301351 -475104 -7697 -120312 160443 23907 -358717 -41716 -99317 -43431 -333443
9551 -333443 -177515 213857 -6307 108312 -179921 165539 80257 181748 155886 -263084
9540 49248 282760 39081 -18203 55818 -164975 -26227 -26196 -48789 -110863 131012 -484517 -67123
9527 -389621 -178898 -67607 -29939 -325009 376844 -30043 -107707 131415 69436 -104206 -141698
9516 -141698 -165267 -150307 157300 57123 51944 -53979 -148629 -137432 -529178 24211 -229360
9504 -115139 186803 -118612 -252794 -114143 -362759 -28806 -397767 -74793 -276684 -115303
9493 51166 35253 64446 -137776 -221211 -384096 -16554 -97688 -23042 -89228 250014 122327
9481 -30564 118110 -217777 -332257 -144553 107053 -24094 -118936 -182331 100892 -423101
9470 97720 -51475 -292982 33130 -358793 -322355 -114413 126909 -57777 -192741 -353744 229488
9458 -315200 188227 -149168 108541 -207059 -123169 -141779 -332516 -28630 172135 -32928
9447 126758 -295293 236681 303733 -108189 -69000 324371 -171122 -137909 -127392 -128870 -37959
9435 -56529 -18052 56269 -217409 -104970 -172010 -34430 -41891 153177 -48770 -116083 -182205
9424 -182205 -29767 271444 126606 -178253 -33230 16107 59105 -134704 -185413 -267862 -133441
9412 -253638 -391838 141545 157777 -224153 -86548 -173037 -54718 183664 -94267 -277639 -406106
9401 -406106 -165201 76671 192627 183377 -75608 -178710 -130952 227113 266321 -176362 -148768
9390 -148768 -106968 -320026 144057 86381 200861 154517 140240 -176157 -230172 -84677 -168440
9379 -168440 -262750 5656 34878 -125078 -188115 38457 -232040 -18843 -69539 -128097 107093
9367 168003 -130694 -133003 -420933 64896 62680 -185614 41318 113071 -47744 121576 -70472
9355 -28793 270605 -49950 -53282 41811 52486 -240807 -251413 -193841 -249023 141016 97452
9344 97452 229880 -91361 -125399 32084 78773 -359609 11845 -178752 -28829 -132158 24740
9332 63547 -30877 -218626 -83913 105497 -286971 -328542 -40233 172677 -21250 -177838 -134192
9321 -134192 93174 101744 61784 -163329 -313161 -75733 -83863 -167099 -158639 -85545 75527 -193389
9308 11548 8650 -172204 -253009 -35102 -390317 -173375 46039 59146 8692 -177090 138843
9296 -74790 -211066 93434 -118299 57927 -33858 -31046 53145 11503 -27154 -100527 -13064 -41172
9284 -41172 42478 -245265 57277 51283 -187653 -182944 -163990 -322820 -146002 -331712 -260729
9273 -260729 -46994 134218 30451 -242337 -215008 -60676 -68193 -12672 263915 -239399 5647
9261 77778 -161683 -227671 -49414 -68634 127412 -221385 274856 32268 -40934 -453049 -315222
9250 -315222 -46800 -18261 -162873 -53543 87946 139933 -33885 -112693 -346146 142406 -272063
9238 -122493 176560 193381 27984 -18727 -92463 -168429 -243610 -339347 -202958 -381915 -94816
9226 -14283 225296 -35120 12564 -14078 -154162 -138842 -9787 -424431 -88709 -43859 -155991
9215 -155991 169057 223768 60118 30190 68998 -149659 -201170 -505200 -24662 -63854 -171372
9204 -171372 -15657 -246760 -260572 -166975 22182 -35685 -320626 53403 397645 -102727 -56433
9193 -56433 350640 -162874 110982 -18873 16453 -109990 30759 109247 -30002 -236833 -142167
9182 -142167 -72613 -305157 -354526 182653 136609 -408587 29587 -87252 -438948 -65852 -84571
9171 -84571 -122338 -75496 192215 -188671 46876 228888 -65172 -172182 -86017 -108944 20542
9159 -152956 10271 -308747 -125127 -130906 104705 229358 81187 -117763 -72141 440170 -5355
9147 70930 179199 17543 -24620 -41213 -43104 -312706 -87522 -47629 -243074 23262 50813
9136 50813 -129403 -248255 -91274 -19540 63005 -141365 140576 -184484 -150258 248376 -300600
9124 -45450 -199837 -295812 -65313 -135976 -217273 -58800 -140127 140579 -84824 -47136 -82321
9113 -82321 -114576 -206578 -6655 -143834 23825 -3327 41009 -291502 213582 -310286 -570759
9102 -570759 224355 -45697 -101880 -103597 -299650 -276802 -153397 78511 -185407 -120517 256344
9090 -216521 183121 -230383 -48605 -367577 -333166 -165292 -99653 -262694 -43920 77566 96719
9079 96719 -175299 -103959 -157770 56891 100689 -278442 -321713 -177077 -15461 -32849 -66601
9068 -66601 -12278 -46835 -28737 -301853 179616 23138 67659 46981 34120 134154 -212667
9056 49021 -218576 -268274 -9430 -251056 154761 15039 41234 -120770 -65738 203113 176681
9045 176681 -91541 -235765 176431 -43986 -39183 -262221 -51449 130537 -99290 -50401 -159904
9034 -159904 -262309 -62369 -202396 94068 66545 230633 -45307 -274364 -63486 -2446 209750
9022 -55653 -157141 -240488 -208275 -75436 -198736 -155211 -139446 -308205 -44733 -168637 -262628
9011 -262628 -341073 219028 113092 142885 -174649 -46360 142739 -93120 -46490 -256365 40073
8999 -71934 -50387 -145320 -8576 -148456 -135809 154844 10107 -195786 -38266 -220349 -225630
8988 -225630 -306443 -275501 -287677 -373659 -241275 -169039 -7722 53594 -315760 -295932 130184
8976 -243450 118786 -67231 -166950 -285840 379032 7710 -145101 26212 122817 141088 -25438
8964 -313607 155768 -45278 259312 -266743 -247294 29106 94172 -31761 -60272 63672 379639
8953 379639 -279041 139825 111388 -306199 30581 155256 -120328 273136 -258926 11440
8942 4449 -51100 -154290 -426615 -104540 -192551 115532 -304126 -102048 50156 -174871 -57908
8930 -26782 -58250 -9148 14496 -133218 103187 -148084 159518 179199 1306819 -59680 64895
8918 130013 401963 22588 440609 225401 60105 -10187 -90517 -36448 229561 35521 111161
8907 111161 153931 200787 278796 274111 -3978 219742 -28102 81858 -155350 -157317 183242 10807
8894 -70591 -74613 44384 -28358 -23991 64522 -284846 -204084 -102526 -207304 90881 20690 113696
8882 113696 55146 -102367 -160440 -27468 -392318 -20530 171676 -226803 106319 41004 167407
8871 167407 145852 -106949 151147 -78441 -142403 158330 -42659 -78687 -160597 -120082 -200568
8860 -200568 107715 -212299 -26255 -47874 -271737 -143677 -109914 -190807 -287382 -45565 -19421
8848 19296 -3736 288514 15571 -116024 -179021 -20981 25668 214904 111767 -144067 -113767
8837 -113767 -359908 -109615 -50804 -81652 -57992 28660 91300 -36358 113509 144811 -12124
8825 14468 -88541 -67032 -165324 -335954 -325182 202102 -19360 -30032 -42286 38324 -383911
8813 114047 91696 94564 150410 70724 -158986 11245 -66462 -180085 27495 144861 9956
8801 102070 -209890 -173274 -96840 -264261 137940 -226535 -275123 -197058 45508 -54380 -203392
8790 -203392 83160 290734 69054 333067 -55109 -36780 -195410 -20129 96615 -157889 -211230
8779 -211230 -362098 -45029 94387 -18761 -362490 45943 -197882 -127339 86740 -174923 95539
8767 -229032 -149685 -138770 -20010 -63972 -361470 -181399 -48576 -117451 -218781 33771 38650
8756 38650 133107 -73951 189663 -27622 -107186 -129308 -310430 42692 -137952 84219 -299896
8744 220778 113516 -200421 -128364 -225669 -290140 -196881 84469 -7046 -41870 148491 -58418
8732 -166722 -77911 261387 -41175 -179303 -190885 -39351 -105509 -167142 101118 -49668 27437
8720 -208263 -141893 170705 -22917 -158701 -278437 -64379 68243 294603 64673 77558 16871
8708 21489 -185816 223510 -289918 161984 169992 -1349 -420740 145288 233855 293538 -62451
8696 11986 -3994 -225939 162620 -269335 -70648 189279 -143338 -253214 -514369 -331327
8686 -331327 -228934 9925 56650 76091 -58881 -37906 -144293 -139854 51476 -205376 64674
8674 -125970 -163522 -6444 -234967 124154 -102953 224120 -540099 12080 -248601 -45712 -37224
8663 -37224 141298 18975 73313 -344612 -242472 -405963 133380 -83270 164672 112445 -27661
8651 108681 -96559 99136 -487799 -70809 -263119 -206246 -138561 -83381 234019 132806 -6129
8639 -166261 115612 -82951 -102659 175056 -301144 -231841 -190000 -77888 -133355 -6951 16654
8627 -184231 100487 -66479 -324820 -246013 -39306 -39212 -111063 -72839 9613 -48892 -33873 -84403
8615 -84403 52761 -166485 73995 -11572 -57076 -136684 91735 -101610 -236771 164259 -67188
8603 76033 -329826 -395509 -207055 -3301 120326 -97435 8490 -301664 -339903 -65096 38419
8591 295697 -327566 -99166 -45360 -100182 70873 -66802 -105617 -227092 -208272 -85857 -259767
8580 -259767 51243 -154304 58090 -29594 13093 124592 -238309 -161037 -112429 -298759 77861
8568 -10941 -131183 147391 153425 62964 -317161 257729 -93848 335705 -589231 -159431 16318
8556 268308 156130 234167 18242 2947 140624 203684 -21791 -11694 21041 118159 89221
8545 89221 289239 -143309 -482080 62351 150432 91993 -134640 -144041 203362 63570 204498
8534 204498 68402 -196562 142358 -246299 73476 -54678 24099 -573045 -81665 100008 -48360
8522 -144641 -119554 -166460 -68055 -279613 -331725 -267907 98747 98958 93600 42928 31139 15131
8509 195534 11328 -76866 -133947 200321 96529 -399332 73365 -51603 355238 -116010 34741
8497 27325 -54388 -74155 -139651 -31040 63167 57195 -50595 -116173 205223 141075 -23394 -91465
8485 -91465 -54253 -78247 163371 -45636 -105321 -146274 124316 -118503 -15159 -255775 -67897
8473 -118922 -9804 -4931 -63017 -13522 -125403 -183910 263408 150866 -141483 -191900 -345130
8462 -345130 267572 -105129 47984 -304439 170060 -319647 -255796 -186181 151283 -228571
8451 54747 -130251 -1504 20785 67160 34112 -145282 216886 -343302 154361 -200506 -11140
8439 -310873 -261135 -154135 -110517 -78941 -261314 140168 -171299 -35645 84832 260641 227195
8428 227195 130588 7780 9689 -22966 -203091 -99736 163011 -15119 -241438 68968 -34209
8416 123981 121561 27202 -297982 150886 122058 34424 -410692 275851 -29480 -178949 -91184
8405 -91184 -200399 155404 -325647 152780 -174113 -208023 26332 -230193 -168211 -111967 315120
8393 -40873 172211 12677 -129893 12612 -16046 63123 -136624 -147199 67954 97414 -284643
8381 246455 3836 105102 210667 64686 -89833 -262537 -32379 -430909 132984 75621 -228116
8369 21864 -25210 83751 155028 -108100 222008 -110750 -89562 -262323 22119 -2082 155565
8357 306612 12850 -72326 -5005 -193096 -172813 -188348 89281 -350505 201750 182535 -135178
8345 -3592 -99085 -45475 -192645 -92356 -81178 -590 231326 132713 -90174 -231098 67954 224287
8333 224287 -49883 8569 122863 -95281 -84835 -7536 109572 -44950 -187664 -219395 -224034 -12873
8320 102747 -40618 -296760 193967 170332 -232092 -35467 121635 26969 159889 158830 8873
8308 -108694 -458170 -320220 -140112 12250 101402 -18084 11655 252546 256944 -177445 -146296
8297 -146296 -291148 11404 226559 62867 -328199 -211948 128865 -46466 -46897 51585 9323
8285 -195755 17971 230466 -142474 470593 -246830 -30183 91551 54985 61518 237877 -172264
8273 -3389 67956 -129386 -60257 -14156 -11777 222761 -185251 35212 25046 -44108 133171
8261 12545 -153280 -51824 97608 -131339 -144961 -104027 -399147 -14431 -116185 -181072 68552
8249 -79257 31224 -107813 130211 74912 -101552 95047 -295506 145535 -196753 -104675 -232902
8238 -232902 -128687 -150103 -246619 281805 21446 -349715 58321 -35962 -144862 44658 -28105
8226 179713 -107317 334172 -235827 -43219 -252276 332864 -360698 -107593 96662 -100832
8215 -168543 -110701 73479 -18496 90022 -293189 -30270 83173 -234501 -390321 77945 -314194
8203 26829 -21836 70230 -69835 173954 -32222 -34901 -353501 -289167 -314430 -141647 -68709
8191 -96326 46264 -211379 -141444 87479 -149619 -27443 184541 -245759 -97937 -209220 47948
8179 -61654 -55422 -141997 93901 -107323 -68764 18116 -109226 63101 196147 142994 -169240
8167 -3008 -72875 -152086 7873 -163757 -55956 161260 -17967 -148821 -322660 -95082 -218122
8156 -218122 150112 -79516 213388 -43615 -473022 -126076 140436 30002 -140217 -95363
8146 -95363 117734 -87669 26649 -403138 -415445 49665 65915 49479 -130614 -289031 -196317
8135 -196317 69984 164103 240603 76720 -5339 -93993 22839 -242820 2138 165930 18206 -224959
8122 264698 -13090 -246007 16791 -468283 222405 241510 136393 -336355 -68205 194937
8111 -70880 -9192 -260157 -48872 -305363 -35508 -66151 -31269 -77209 209849 4390 6063 18540
8099 18540 25436 -66144 50141 -31570 119623 100862 24652 253755 -365345 179435 195953
8088 195953 -137499 -102568 -221839 -153739 182007 -308634 -158604 -145882 -331549 -99493
8077 -220251 234926 -341430 -218655 135089 -182033 31964 -411050 -34217 -169067 -237914
8067 -237914 -21291 70985 -208400 -200658 214904 -267325 -254686 137612 -276777 -50299 -96048
8056 -96048 92569 -153600 -68798 279422 137055 190105 -23746 -215626 -46399 212325 -83440
8044 -404527 -235722 181060 12137 -393131 79093 -126036 195171 -4578 -77446 1338 69340
8033 69340 -129812 -54549 -57306 -100394 110304 277443 -314332 -19444 -141217 -459448 175936
8021 338958 -12233 -272 199669 -265730 154416 -44495 172060 -286148 234666 35102 131378
8010 131378 120414 -317218 237658 7812 -53133 221020 134452 -43194 -150347 -106014 -73917
7999 -73917 -1661 -170509 176779 -14270 168129 -29327 -233922 -74965 322893 -148447 -66758
7987 225513 143889 -96317 23022 152962 79650 -330630 -276287 12019 38608 294739 -345991
7975 -235817 -191919 -267233 -319503 -87643 -7778 45683 -31337 -249255 -274418 29784 -1097 121913
7962 -266941 -110791 182532 -26436 -58645 179202 -39820 179465 36813 100441 15752 19515
7951 19515 -57115 -91694 87651 -102734 -108912 -175255 -142266 -109430 129772 34602 -57200 -2121
7938 -244201 -194899 293573 32696 50687 -183256 79079 -179141 160676 141036 -44820 -169851
7927 -169851 -105783 -47500 -30404 -87548 -104760 -162884 -300931 -296214 -84843 -289487 -674 7272
7914 -6414 -52041 226905 150606 -8790 -156371 -335115 -176823 209285 -199455 -186084 258563
7902 14487 -11450 -326200 117837 66804 -60308 -131039 269926 284206 -16144 108949 26290
7890 -74472 10774 87284 -89946 56448 -227427 8424 -272799 -334995 63764 111411 -310701
7878 5549 -6224 -299134 -149865 2542 283419 -176845 21524 80457 -265810 -343345 60349
7866 -317543 9056 -414373 -137515 251440 145973 82785 -278645 -159671 110996 171780
7856 171780 -96605 -330209 -22556 -14132 -3485 -61937 5566 -445273 -256161 -9310 -64624 52504
7843 -25479 165207 42692 134799 131635 -391759 -53037 41033 -77654 -199132 48497 -170793
7831 82285 -166086 -228238 -36619 -128018 -10190 -113006 -206710 -327561 35554 40451 -216267
7819 -240443 72626 -21781 -257610 -135789 -14952 335443 -343272 -192413 -298457 -26184
7808 -98648 163014 22648 -184903 120121 349602 -158554 -237336 -91624 -22834 -262069 -67583
7796 109557 38636 -278008 289840 -328304 -157695 -48703 -233293 -136929 -34802 168569
7785 -9921 -21330 59805 -15983 -395016 -181108 141063 -165017 102972 240533 -197900 -644595
7774 -644595 -15445 -209987 -149347 -276836 -15681 -55248 -136104 2909 67459 275301 -315449
7762 303409 247734 312049 146798 -160565 -291304 -60805 -71147 10681 49360 -42244 -323116
7751 -323116 -47210 19529 13865 98288 -420498 21523 -225041 -72085 159746 -155883 206487
7739 -189705 -181925 -127788 93181 -69016 -50912 -252580 -99450 162440 176943 -30486 -561284
7728 -561284 -232706 109003 17716 115055 -74614 -335623 52545 32005 33848 -40867 -66050
7717 -66050 281403 161091 115702 -68320 -206380 -36465 -324730 -423685 225986 -79819 -9930
7705 39273 -276882 209685 -20639 133652 -45009 -170034 -133450 63178 -30091 -59289 -3066
7693 113638 -66640 -158568 -12769 -171319 -373343 -228763 155540 -4124 -141788 -62387 -153840
7682 -153840 119348 102420 -38720 406636 -28065 19382 -422802 -28748 -109353 -79679 93131
7670 -177020 88566 -135037 296383 -291454 -131413 -235581 203309 -128796 268706 -356951
7659 13970 143920 138570 -6646 116523 -32391 -186455 120467 -19252 -176223 -66804 -442173
7648 -442173 -222560 -102849 -246946 -99176 -33437 -308 -126522 277864 -278611 29217 -226439
7636 1232 -16025 53063 -58461 289548 19520 -256084 48471 -103584 392347 8204 -100488
7624 63141 -47 142884 -334664 33539 -70449 51302 -123122 36184 -458722 -460029 -51240 -174955
7612 -174955 48323 -39570 53602 10339 14143 302690 136394 19935 99121 225441 -310916
7600 282130 -141529 52854 -65463 -11295 -40113 -41852 -247405 -464618 -179232 137703 46918
7588 202795 128542 -358639 -85907 -140308 -124885 -187575 154850 -47732 -305798 20515 -14084
7576 153368 263225 -403479 -328035 126177 -301680 129369 -37380 182581 -78157 357034
7565 129509 -43960 -269206 -83924 -73870 67175 -186277 -144994 -274921 -137264 -86849 156630
7553 64941 49822 -64051 360556 -212654 -195569 166713 131493 -517487 37941 -194870 122309
7541 -24842 13119 232101 -100732 -82252 -27529 -38218 273721 -44538 176708 -160898 -201181
7530 -201181 -470722 -79943 -118829 345341 93417 151966 97516 308635 -14415 -78964 216418
7518 -366698 187931 62461 303806 -197262 -231196 193457 -30192 49418 61357 -64146 97675
7506 36341 118932 33669 53666 -300214 26566 -205444 -340865 -37785 -85091 22105 -73641
7494 151535 -36198 -330577 -544380 -103149 309132 -160864 128205 -103587 97378 52065
7484 52065 -119075 -43206 -165411 278315 -212483 -279143 158537 -225319 -54630 65033 -375158
7472 -108111 133455 -37056 5110 125327 -202177 -145862 -123887 12651 -77321 -159447 -25362
7460 -148484 -118165 140655 -2804 -105394 61119 54190 -362305 124904 -255003 56341 -59775
7448 -191543 -13434 -720 -43594 -104416 102826 -83972 94831 94523 -227790 -94028 -119036 200788
7435 -394125 -295274 -71549 125339 -3078 24704 97444 51519 -45453 229320 10810 -250155
7423 -213842 26602 76437 187898 46132 -16872 -23117 -801 -143041 -113224 -30229 55006 94200
7411 94200 -87019 16989 -158189 -151080 210049 35986 -125590 -233708 284470 61268 116609
7400 116609 -69409 -87086 30559 15901 103693 150598 -284579 165880 -2882 -121352 68453
7388 -277225 -133185 -135558 99622 25452 -237188 169766 9582 -124633 -46206 -314912 -173451
7377 -173451 -74281 -109224 26610 -140357 62206 -51114 -31653 -34636 54008 -30968 382454
7365 208257 -10619 -370438 -155276 -67961 228917 178724 400834 25640 1339 36763 -247917
7353 305990 50391 -39683 -11516 -335796 -152617 -60879 -312039 -87872 73043 -221091 40929
7341 86534 104894 -7665 82656 -229230 47223 -245340 553216 3707 -213318 2425 -65458 14721
7328 336348 10545 -217629 93159 -98279 182280 -77510 -19454 144988 -183672 166747 -62295
7316 65662 137 175692 58037 165690 303521 -184705 -326796 -66486 -431178 -215769 4144
7304 93580 -223610 20742 154482 -58128 89910 -44641 -184737 -203702 167819 174028 390367
7293 390367 -268264 -234640 -86317 326052 -18854 141434 -320163 51787 -103312 234736
7282 -156388 96008 -200156 -114106 -137657 344373 -211189 250261 -76116 -62395 -193468 224015
7270 -142320 -92326 62420 -238137 -23957 -51501 136052 73781 33586 202220 -274937 -109144
7258 141137 97908 -180479 -132033 164467 -52750 -27730 91321 -287347 -129495 11914 110314
7247 110314 -16951 371710 -115632 -354919 -48350 -411949 29224 -117750 -5146 -41188 -30871
7236 -30871 -211659 -169412 167353 193704 -61252 -224734 -44234 10292 75667 -146971 -200262
7225 -200262 -71610 -39149 148891 -216761 259271 169249 214703 -540269 200818 -163009
7214 187610 6915 -70508 -125788 -54192 136225 221026 43332 303291 -114987 68053 24403
7202 93973 160515 -128566 -200490 93720 153566 185190 107615 -155545 357785 -124948 -82893
7191 -82893 261132 -68001 -61767 121525 -118606 759 123791 -94607 -150816 -312576 121533
7179 -65900 -107534 -47815 249320 -95290 35893 -22621 -40390 -116318 -28414 156806 21117
7167 53036 47046 -367180 -130310 -201194 12396 -132522 139725 119510 -203003 20805 253943
7156 253943 -67658 -81159 -264543 22105 105903 267656 -387128 -137710 38417 -174546 126617
7144 -190542 -116629 -37342 -202414 48313 189289 224114 -24666 -150009 47136 132343 238661
7133 238661 -369263 5637 77506 -383304 57373 -120416 -205007 -63793 105267 -284703 -79363
7121 -16112 35795 -210809 182888 24492 125542 284910 -28268 73570 -132196 134530 -141416
7109 -25826 150275 -174615 -113164 34506 -166130 -200574 -20131 107768 9710 45317 -380090
7097 174022 -138048 -271101 -409484 -98715 -49659 -140227 51542 -139960 -321591 41872 -140988
7085 -31339 -145489 -85173 130057 -214542 -145231 121342 -211157 -83944 76943 93828 184379
7074 184379 -330387 50048 54262 -235054 53542 -177078 -44729 -232018 -1866 -193260 200902
7062 -90399 -54411 -40620 -53373 20897 21374 75841 31924 1566 -314684 94190 304900 49339
7049 -6666 271701 53282 -17830 147557 19825 273607 15537 -4070 -149023 -76652 25561
7037 24658 99263 216704 -292592 -89839 -153651 57715 -56248 288290 -70428 181885 -94569
7025 -80402 250002 155461 49675 130026 103253 24462 -229580 -86013 -220595 -129486 -297628
7014 -297628 -254043 184876 16979 -127383 122761 -222487 -34856 -39018 -17972 204314 -580386
7002 -186510 107190 187322 175426 -30631 297017 46673 -51365 314549 -78574 -33722 -40778
6991 -40778 -104025 104081 12944 -43792 -340484 -42846 539739 120257 -169332 -117280 527096
6979 124099 396629 35957 -50939 -578124 300987 -450 -153299 -168353 -80837 -133413 120736
6967 2035 -157996 -76111 -129979 60077 -63068 -86175 103469 -93310 -23318 184410 -83362
6955 100016 -128865 -236773 340231 -82827 4379 -59906 117441 76032 67111 -277406 -69735
6943 -43068 98933 -63652 177967 7805 179805 -73172 -20578 -380647 60953 -136119 -232358
6932 -232358 -143773 165069 -214692 -36043 10363 58274 39782 -279991 22252 -102799 59831
6920 75875 -115673 15642 -147541 -54219 -261126 -186748 -193771 -287957 -122827 48815 105523
6909 105523 -302542 315648 -95964 -6124 -269002 -103575 18212 39632 36874 41903 45418 59250
6897 59250 -138028 -126814 -33059 -187281 -246673 -203567 13965 -28212 -112240 -265542 77799
6885 87796 -202449 188233 -84217 -294646 30797 116561 256824 -187743 -59222 -319731 299916
6873 77866 -189059 141528 258349 94945 197729 150297 112139 -30327 386307 200022 -106952
6861 -174822 -115758 -10190 -104458 -277073 168671 -81559 141661 144808 104405 -262549 -45220
6849 -165810 -155886 250987 132149 -66700 55729 99285 90619 15940 -350337 258775 -206689
6837 -322946 75330 311596 240607 180412 17149 15745 273467 -67397 223723 -87854 -141812
6826 -141812 -58724 -247207 -90969 158639 8066 82675 204061 496848 158998 243538 -146925
6814 -165484 -119926 -467676 119763 -179704 148487 -311973 48330 122169 -12693 -155375
6804 -155375 -121345 38844 -41111 151618 -205509 271829 -119431 -150647 -241881 -134895 -2171
6792 11090 -229406 -125147 -199601 -45038 -6924 320676 -149133 1044 -51243 -174238 -107807
6781 -107807 161731 -37590 -279089 103684 -84156 -378046 -95765 -115317 155017 191053 21201
6769 160358 53214 -245703 142689 206563 -227006 -230860 -139025 82438 -187361 54103 -43251
6757 386446 -250651 -216894 206279 -188304 247873 -301946 -305121 106106 120617 -133130
6746 -220438 82711 -343839 -213372 165189 259424 107428 196205 29506 -97121 -117217 27595
6734 -67138 -77616 -16476 -36448 115756 -150854 55421 211641 19287 39774 138755 -59775
6722 -110575 -134157 -309593 100550 62925 125183 -217521 24515 -131511 -38727 294302 45132
6710 -158257 75755 -147593 10294 -58513 165351 -200432 -68433 -115357 -32548 -93666 125052
6698 53384 32208 115538 -102821 -111558 204293 -134996 38268 42031 65557 -48994 -30405 173929
6685 79528 55672 14054 -46819 -212489 -254875 -42466 -110305 -134138 -121328 251969 -121705
6673 -588268 -158277 -229689 73846 -126790 160893 270518 -55190 -160085 198880 -138852
6662 -30562 119049 127217 194536 160598 84288 25766 277157 -116162 332922 153076 11179
6650 -354595 60936 -19419 -14519 -88678 34471 22237 85474 -246179 -74251 -28795 57520 12424
6637 106238 -161562 -44918 159198 -337012 24938 -48087 18866 -108242 172054 32326 -257995
6625 -202332 -67434 154857 178463 -170519 131021 -286406 181957 -163711 -221100 -38550
6614 374948 -11648 -225310 -12929 -74013 -264701 -338756 -181884 -51929 355192 -105943 -156522
6603 -156522 312460 -94959 169822 -15554 29001 -17652 -135020 -318451 -58797 -44248 210644
6591 -61716 -59186 -4508 227164 -74639 -260827 22586 -48196 -175117 110294 -160943 105326
6579 -62294 -19649 -189050 18857 31411 -46931 212995 -112335 232483 -34449 134775 -145165
6567 -319408 -243458 107005 24091 154038 23726 236483 392469 -207925 -7529 165033 -237055
6555 -124281 -457473 248310 -63060 -139582 38985 98719 148180 196729 172663 -184994 -9877
6543 -275540 -65926 48704 -219537 -129714 -94085 -8995 -52121 -120934 268206 -141921 164993
6531 -485204 -175958 -69503 -3178 87952 164637 -161654 -181526 150339 118697 303981 45313
6519 252912 13479 63147 126371 81500 -289390 168655 175811 3698 -191095 -36403 -43071 -458242
6507 -458242 -45232 96446 54465 -166935 -31283 26134 -40763 -68262 85383 -194217 246584
6495 188637 -125302 -158808 -180623 20239 139944 311898 91833 -20766 -369776 64071 -240777
6483 480416 -243190 -133005 -64409 -162898 59085 159214 -361187 128964 -89265 -305118
6473 -305118 287888 224366 41065 -103722 -10232 13246 265498 -99441 195592 37333 9690
6461 149486 51473 -167089 91603 -34965 5714 -179187 -325946 -315025 200591 -316980 289521
6449 -196268 -119193 141313 -277199 99873 30557 217410 -79866 -8699 -52857 -68566 118196
6437 -175186 -160118 -167762 -356304 53677 -73299 16559 -240360 -8407 -200157 57216 315773
6426 315773 199098 -257253 -181124 -41103 267587 -206302 -100746 63700 -105866 -302114
6416 -302114 -95195 30392 -539921 -57440 36532 284202 107352 -109050 176455 -146765
6405 -88791 -264808 -43565 -71951 -162042 75896 -92133 -27586 -83259 -150383 -21646 90333 -279965
6392 -149236 -239484 39641 40402 -140721 -575 18940 -144093 -180264 35661 -53079 -46019 -305000
6380 -305000 -107197 55814 -313568 -19795 -66404 116 -108083 52417 -103275 50351 -171324
6368 -81513 224504 48714 -210775 280920 28906 20722 105815 258129 -194949 -24488 223521
6356 -90127 -22499 42547 -188535 367371 -162648 292507 272014 -53280 -25677 -106009 39167
6344 148652 213708 -279510 -106510 271223 -71810 38018 67552 75625 -108627 32359 -110659
6332 -177715 181837 4877 313180 -42414 -25499 8091 -124799 -123874 -115903 -88289 74561 344347
6320 344347 -198510 81185 -67244 -355225 -1122 58566 -105263 82809 50723 163676 -240258
6308 224757 204222 119820 331195 333163 -123567 -263855 152633 -82907 51520 49947 311067
6297 311067 243210 -185182 -203849 -315076 -226213 216970 138491 18810 31205 -59485 -129347
6286 -129347 -35074 -68484 389337 86194 1847 86170 229718 303021 -326396 95001 -128684
6274 -12826 27308 88177 -2494 -314122 88490 -194258 -479581 -14782 49101 161662 -205922
6262 -327826 64268 115313 66396 -93211 -160607 151311 106795 234529 -139228 -31047 301916
6250 220011 143703 93471 5435 -75610 90300 88825 56955 183594 11367 -72091 -180376 41071
6237 101260 114083 42204 -334165 -265295 -2545 49828 62037 -271603 -10487 499249 113596
6225 -55373 -233205 -175888 -49272 -114413 -142141 -118312 138352 180227 150864 183712 -169806
6213 -96838 153085 -185205 -27217 252938 56503 39364 194712 -77967 308684 180891 -451341
6201 45380 -235831 -76863 -12021 -407362 57424 -106296 301673 -301090 126820 76237 -63531
6189 -128045 -73697 -152516 -379591 175137 -268079 5744 -421950 -19952 -130789 -2682 47057
6177 157402 -11777 4604 -33706 26015 135909 -126875 -74120 -150355 -80653 -100162 250455
6165 -209685 -166187 -191153 35230 212070 -101225 -395600 128682 183141 5758 94973 18562
6153 -151109 217599 -31317 51391 -64895 44663 -397618 -55869 -180925 71011 -335588 -63779
6141 -442376 -121141 -68826 -19932 129969 -123871 -334352 136662 76847 326866 -140906
6130 -18238 -209770 -171939 -66219 -5137 62 -40740 47671 32327 154423 -269851 -35422 175366
6117 -232028 -12164 15445 156040 -71882 -4214 -229729 126975 -109445 -140339 23557 -28868
6105 2230 188250 170821 205125 -192347 -47231 319342 -62342 -89206 48585 -42550 61686
6093 165239 152629 195751 -591208 -62704 -177798 -241867 -76777 -175473 23899 13324 274906
6082 274906 84215 91919 -158066 260252 -39178 -90974 63548 62618 -44278 33795 61505 -186428
6069 176597 -65807 -142666 -117650 429637 41973 -251320 -37419 317380 362953 -80113 29950
6057 -1716 -134419 39568 -169683 -85811 262261 -216510 -89883 -291528 164279 -22362 47432
6045 -356534 8509 -145516 40878 123469 -97493 10661 -233681 28237 -33001 -271238 -5078
6033 95055 83614 142095 64639 -203183 41371 271185 128274 -73942 99029 -76646 61121
6021 -50299 -107195 102322 199031 122776 306300 -144705 -548604 92243 7065 -64054 165592
6009 -142444 -165437 -56615 160488 -204931 -184345 335983 237144 193489 481137 -214068 -43521
5997 -44441 111998 191861 -153174 -73094 -38789 -68678 62011 -74044 -99065 -44367 -87576
5986 -87576 2426 -635 -36204 41196 133642 21473 45967 -18279 -86442 -53753 -35658 -50720
5974 -50720 -1039 -28204 -193874 -121156 215225 -115765 -356755 -164009 -113727 -80293 -46706
5963 -46706 196284 -94083 262811 137728 -347125 -175509 -65849 -3514 -16920 49624 33506
5952 33506 -125303 18925 -40154 47075 5994 184496 16982 -223456 279542 11525 -433741
5940 149436 -136830 85399 -21782 -9020 73363 87191 -81897 50971 -112799 -115670 72480 152586
5928 152586 224043 332131 -49559 -390170 -46436 -267946 105243 -25795 -136520 130347
5917 177463 184894 -170804 15269 -256451 -244764 224302 131518 197362 50691 240945 91121
5905 85183 -128391 429732 -201904 -160611 16492 77399 66867 -271981 13274 -133568 197484
5893 -152705 69353 -11922 335247 142502 -186858 -7563 36981 -122961 -18480 -48646 -124604
5882 -124604 300447 146637 -104357 -19103 -114853 -150606 -384707 -108920 199466 57989
5871 76455 102964 -55981 -36061 20150 3546 108873 -7627 313248 36223 -103412 109516
5859 -206974 44881 -212488 329932 -181653 -180913 148855 -127782 349936 -83338 -98198 36439
5847 133465 174079 -13451 -314858 -122689 -59129 217465 151406 -33790 -207265 113519 121049
5836 121049 285868 116216 -142986 -96039 -354307 97171 253521 -77478 -183996 -174979 355690
5824 243556 -154825 -48 399217 -367836 -187728 58020 155287 59144 -107383 4819 -285098
5812 -336670 -291175 95045 43478 -173574 170938 40516 -31546 -57006 49118 -273688 -283874
5801 -283874 -124619 -62174 35426 -138314 48040 104531 -150603 123519 -68630 -267997 166271
5789 -78269 233601 -15209 -80383 202099 76225 78920 101593 -236513 156977 238933 -260701
5777 -205084 -202311 -46910 190428 19225 197432 31812 -92396 99105 -126625 132559 196807
5766 196807 123204 109857 -129063 -182547 -224327 168602 -68500 -164540 36432 -44476 -223026
5755 -223026 -146075 -15991 201581 -271289 226611 -337014 -16339 88826 -94510 -7217 -90922
5744 -90922 112243 353998 412047 -54282 215035 -133822 -167861 -75499 137284 -80136 -61056
5733 -61056 -142096 -282276 87988 56397 -323048 -53808 196302 95485 519652 64389 -25228
5721 350341 -26215 -433714 295436 52856 -180853 216301 -105413 -353381 51856 265706
5711 265706 -100463 307230 -257044 108961 -305577 -283056 -15669 -65383 147835 -248403
5700 18902 -129476 42802 -296624 130968 -79548 312218 147896 -116112 147019 -15984
5689 142710 -373918 124855 19357 67285 -126666 286915 152407 31417 148893 -107583
5678 11207 4185 87704 -267197 -133183 42461 -138902 20186 16062 98022 208722 -174148
5666 -92363 -226175 -23176 124966 -438081 -170119 15884 -125786 99132 293254 -55067 -31991
5655 -31991 337688 -227312 -104242 -11975 82294 -42226 167996 -308792 -57250 -75100 -190840
5644 -190840 59366 -98562 -161661 174966 -159862 -198386 116130 -219267 89289 -115727 80902
5632 -19941 217528 -17555 104252 224321 75396 50162 -21294 3579 -19931 36542 -231490
5620 103159 133867 132136 -184133 -38536 54948 12479 9375 293212 -179668 -7356 -10999 289889
5607 -67567 -204709 -74543 -43832 -118655 193360 -240624 258132 322894 -220458 184007 -94911
5595 -281888 136795 136414 82750 312995 286756 -69374 227010 -240061 -188011 177253 -223442
5583 24901 99246 -189090 58691 -148182 127440 -66833 -177304 -280802 -224810 61206 50207
5572 50207 -321793 -59920 183428 -156089 66427 -94066 -62352 -230831 -249605 993 -43953
5560 -12795 -178135 -124762 198726 120536 55038 -19136 -52137 298030 -82479 -148572 -198854
5549 -198854 139555 95331 -41016 77603 12698 -92228 90776 -48739 87600 221769 180427
5538 180427 -9566 -330700 -168869 -171709 -87615 202473 -29991 54406 -196261 -159193 -66997
5526 47179 102789 -34112 24985 2463 -303496 280977 -45844 236615 -63698 224767 -17442
5514 82781 82433 -282534 91983 142251 15355 -167206 179515 -53258 158300 89756 -80132
5502 133124 139661 -104692 -70817 99669 187552 -357527 -169552 7190 15120 -248365 -36992
5490 168934 -212849 -188649 111774 29553 311953 -47768 3190 -65895 284126 65428 -111240
5478 -233961 33975 -53302 -162421 -337648 185627 -538 -49452 -24237 47471 -57487 -46938
5467 -46938 207762 54515 114922 38934 -72683 -25887 42691 -151730 -34857 42882 -43067
5455 59309 295002 122470 73646 -21481 109357 -109176 143341 -191744 116911 -194969
5444 47862 75274 89754 148342 -67745 -125046 120762 -54029 -276437 89536 -246965 21503
5432 -41026 59714 -43694 45193 -142335 -88279 -158837 -24178 37089 -26301 -47209 -329619
5421 -329619 52845 -95018 -73330 -167195 -204423 -212492 -22869 -306591 348006 -80290 123985
5409 129507 1994 -345798 -147329 296499 125054 -148307 161777 130821 191180 79674 188890
5398 188890 -65970 31709 124222 -48293 -53977 -184572 -337717 -24326 -11530 52266 -238847
5386 -51303 -294318 27885 171977 -315520 -171448 128955 -108576 -163290 268992 -295091
5375 -11593 35167 -251269 -34942 101507 -31194 -96421 35329 -51016 -149297 -153582 27383 -36843
5362 -1747 -15160 -44288 178695 -66344 55894 -120748 11455 -275976 354746 148220 -130669
5350 -8336 202980 -291579 -103240 74291 169138 -131105 99945 -162861 231477 -192466 184012
5338 87433 -105995 193494 77535 -160153 -136163 -78174 -56755 -296344 -211879 -70577 -111250
5327 -111250 61714 -102719 -124931 58579 -227069 24030 -203097 51685 -233142 -90499 -149547
5316 -149547 -173930 185892 275785 8949 -145300 -110226 24363 26332 17368 137782 185492 -201936
5303 340082 106210 -163871 255991 102206 251613 47819 75742 134575 302169 -226325
5292 -88520 174483 -58113 -77307 -257109 49309 157402 -23943 -28245 -2791 61275 40009 -485170
5279 66754 -255976 162433 72948 -323229 -48799 52737 -112335 28824 31167 178681 84644
5267 -151616 197356 55613 -181447 166023 21541 -67027 103438 1532 -233477 -348053 102265
5255 35201 258117 302218 36342 137635 58406 -331658 119140 -201264 -115804 -131491 198093
5243 394427 207870 161150 103843 -136599 59597 -59631 -388850 30866 -169951 -63722 -279960
5232 -279960 28473 19064 -255224 -36877 -77330 -267687 49775 -144533 253938 155226 174104
5221 174104 -122058 244092 250695 -15938 -5078 107871 -28554 91637 -37102 -197189 102869
5209 -145989 -183364 230802 7952 135125 36477 166101 118242 -2626 188484 -100870 184671
5197 -35553 -33814 -79149 29971 96486 -170397 -248450 177975 -60308 60107 -224918 53827
5185 121315 222022 318785 -220001 -138206 115886 -368223 238597 190622 30778 -47144 19212
5173 -140307 -156617 386163 -30464 93234 42885 -264824 271873 -53978 -123786 -170037 -209050
5162 -209050 247862 -304495 -30177 -189004 -112874 -99602 83462 225632 319808 195434 -21535
5150 -38814 -164423 219571 -446142 323001 13013 -107114 46478 89058 -330983 176823
5139 75805 77243 173425 -1793 -96058 -42517 185081 108803 -55189 -9429 -131456 -71032 -235451
5127 -235451 -33863 -26637 -100143 210045 77727 -109969 201371 202975 215766 168304 -83449
5115 -203537 40854 -211128 53761 293975 -14763 267605 424366 54956 208740 19045 -19498
5103 79782 172644 2528 -26392 80875 28095 -101099 -112068 88568 133520 -46605 246904 -38859
5090 -20823 76029 118536 -283584 128392 116503 -22195 76346 -24783 30135 218650 -119786
5078 -90322 -12030 -156904 193100 9840 187162 37623 11057 31675 -80521 40410 129320
5067 129320 33597 254988 47783 -66715 -124962 104516 -162302 8628 228954 36251 113287
5056 113287 -164423 318778 439249 32166 242761 208477 -122112 377765 -118325 7985
5045 -67418 -75252 315050 231108 -488 -117997 -92648 -160077 -26024 138996 288137 -78071 36498
5032 -28641 -156659 -75626 181173 -16841 321364 228758 97683 -14305 2285 18147 -326586
5020 -45993 86028 -38468 -39694 70131 209175 107326 -319767 160189 -132667 113583 190213
5009 190213 10725 25583 205000 51767 89676 -170617 93234 -124683 340039 -192792 -25994
4997 42782 -28807 119595 134207 -538674 -433406 -245730 22234 111975 145854 316103 -43561
4985 -326267 27121 92437 72636 94943 -245652 16694 198729 -45401 84216 103961 97471
4974 97471 105343 57531 14557 183291 26152 -80465 -231780 41287 152904 -178089 -210676
4963 -210676 -29381 91637 -218901 194695 -53386 119705 -376985 156797 -137802 -343124
4953 -343124 -109348 372014 3800 12550 24389 -284020 277149 -39309 243172 -192009 102309
4941 72860 33580 68203 -365006 -238838 111396 53150 54156 -38566 324464 -13342 -218760
4930 -218760 53281 2889 194551 -137088 173700 -165909 303317 -5579 -207084 -178667 -97800
4919 -97800 121350 -31856 82473 281025 -97219 254561 42918 -121889 -34095 -157762 213773
4907 -73149 -147293 88758 -304659 -162382 268130 -906 312256 -18848 -117464 217426 -176013
4895 185051 -232997 241018 -38704 153466 118688 179463 -435222 -58001 193771 141694 92886
4884 92886 -39577 -80737 -65576 -17323 209419 35167 164816 5107 29048 65451 -115226
4872 -328787 129681 -183920 -131611 -116917 -98545 -15128 -71721 54768 -332759 -33457 567342
4860 -97623 -32907 -403519 -122932 -177581 -51313 -163947 -232360 -64330 113477 -162858 -64530
4848 -242905 -68408 -32519 509894 70442 169251 -80969 -350085 372883 -28057 -356457 -419115
4837 -419115 50611 -184221 98513 -172789 -60465 -44742 329988 -148957 -252234 -136736
4827 -136736 173266 -112371 370483 -129716 216505 11869 321931 -77134 221722 235742
4817 235742 -169981 162466 19717 132388 76036 137076 106456 -138195 107946 203195 18387
4805 -207684 352282 102844 -87987 99409 -153784 -263336 -137332 -217189 167232 -72613
4794 -256544 -99921 67539 -82705 38539 -15515 -21270 -182796 -287562 -10987 25043 -181111
4782 98458 -49798 -119787 79140 -87788 241129 -161333 -30814 -269334 76419 56172 342308
4771 342308 185081 -180981 178170 20982 156227 108449 -201399 -25812 -132586 -4226 326057
4759 -35497 21068 126117 150447 -233557 296397 -171139 57510 19781 -161781 243883 -118350
4747 -1359 -49026 -78955 -61291 -200117 87315 125519 -115109 -270660 123291 66408 -43369
4735 152915 -27755 -106384 -54143 91596 170182 197600 116016 -93008 -211106 285393 2108
4723 -85661 -177333 -95561 181791 65484 -142529 110744 71582 172521 273290 -26286 -99819
4712 -99819 235652 -176763 -257753 90125 147419 16907 145556 -158339 346460 91447 -185363
4700 585244 121076 67155 165482 37300 -15533 205765 318185 53726 65846 205624 -156374
4688 -23058 -29547 -49061 46432 9868 75863 98010 207766 134954 -406850 -35273 57167 15979
4675 40019 185548 -47092 285137 82693 196721 -52220 -92390 306937 -106441 17329 1629
4663 108844 12255 338423 -18165 544752 95441 164141 -98411 -10571 186598 102275 -273003
4651 -21851 127768 -21721 4920 -115002 -83100 -195404 -209361 162407 116902 68136 -232471
4639 -152778 -192986 4273 -134323 244118 -370206 -93896 112972 -44477 169479 -14778 126754
4627 -153870 28566 -182766 75546 274421 -171691 -65219 -93243 -118105 -123063 117470 -141908
4615 -122851 53514 15686 204009 -239792 64981 -81755 -177747 205433 -491085 -212092 142615
4603 -28597 100165 -62868 143028 165688 -202569 -244294 -91366 -94852 -190953 208519 -84145
4591 -5615 -96896 397221 -120995 14110 -121070 226551 -77604 55043 307000 -130999 105175
4579 94159 243557 -3955 49134 151029 -308150 172102 105253 102555 -171077 196545 131446
4568 131446 24089 -234803 114095 -9125 -64794 -232001 -213000 -32947 214298 161654 9852
4556 183526 -252748 -140229 -242191 121868 -185936 274685 8749 -367518 -301995 21152
4545 121108 -160394 -114261 -324791 159522 160432 -20100 263106 249956 114454 234420 -39463
4533 133809 57208 200189 -6606 -3554 -176082 -333477 -107438 67272 159620 -94254 -102370
4522 -102370 -130235 -191366 260169 -26743 -180436 -252518 -298188 124291 -54607 -66279 -53824
4511 -53824 322045 138273 -31496 -188460 157266 -242812 188945 -212419 46948 309526
4501 309526 -5872 9743 92818 192591 -63432 -189278 169805 -71945 -49724 40566 -339534
4489 131186 258311 60368 237549 -148832 -219575 -416910 181778 294847 -131975 -33400
$$ [...]
##END NTUPLES=NMR SPECTRUM
##END=
