##TITLE=AC1469_13FE002651_8026970_5drCmvS8Dh
##JCAMPDX= 6.0         $$ Bruker NMR JCAMP-DX V2.0
##DATA TYPE= NMR SPECTRUM
##DATA CLASS= NTUPLES
##ORIGIN= BRUKER
##OWNER= Administrator
$$ 1.72 TOPSPIN		Version 2.1
$$ 2013-07-11 22:50:14.395 -0700  Administrator@X
$$ Compression mode = diff/dup
##.OBSERVE FREQUENCY= 400.02188249412
##.OBSERVE NUCLEUS= ^1H
##.ACQUISITION MODE= SIMULTANEOUS (DQD)
##.ACQUISITION SCHEME= undefined
##.AVERAGES= 8
##.DIGITISER RES= 22
##SPECTROMETER/DATA SYSTEM= spect
##.PULSE SEQUENCE= zg30
##.SOLVENT NAME= COFFEE_meoh
##.SHIFT REFERENCE= INTERNAL, COFFEE_meoh, 1, 14.98509
##AUDIT TRAIL= $$ (NUMBER, WHEN, WHO, WHERE, PROCESS, VERSION, WHAT)
$$ ##TITLE= Audit trail, TOPSPIN		Version 2.1
$$ ##JCAMPDX= 5.01
$$ ##ORIGIN= Bruker BioSpin GmbH
$$ ##OWNER= Administrator
$$ $$ E:\/data/COFFEE/nmr/AC1469_13FE002651_8026970_5drCmvS8Dh/20/pdata/1/auditp.txt
$$ ##AUDIT TRAIL=  $$ (NUMBER, WHEN, WHO, WHERE, PROCESS, VERSION, WHAT)
(   1,<2013-07-11 22:50:07.317 -0700>,<Administrator>,<X>,<go>,<TOPSPIN 2.1>,
      <created by zg
	started at 2013-07-11 22:49:01.411 -0700,
	POWCHK enabled, PULCHK disabled,
       configuration hash MD5:
       C8 4E 4E 5D D3 5C D8 9E 9F 52 82 E0 59 8A DE 15
       data hash MD5: 64K
       9F 59 56 7B 86 69 1F CF 24 FF F8 49 A3 89 9D 86>)
(   2,<2013-07-11 22:50:10.176 -0700>,<Administrator>,<X>,<proc1d>,<TOPSPIN 2.1>,
      <Start of raw data processing
       efp LB = 0 FT_mod = 6 PKNL = 1 PHC0 = 0 PHC1 = 0 SI = 32K 
       data hash MD5: 32K
       5A 0F A0 64 B3 F9 BD 24 BA 98 CE D6 77 7B E0 8F>)
(   3,<2013-07-11 22:50:10.567 -0700>,<Administrator>,<X>,<proc1d>,<TOPSPIN 2.1>,
      <pk PHC0 = 96.51489 PHC1 = 0 
       data hash MD5: 32K
       B7 69 25 0F DA 62 F7 2B 1D 52 37 13 0E EF E8 F1>)
(   4,<2013-07-11 22:50:10.676 -0700>,<Administrator>,<X>,<proc1d>,<TOPSPIN 2.1>,
      <abs ABSG = 1 
       data hash MD5: 32K
       1B AD 0A 60 93 06 D5 E0 2A 96 2A BC 8E 70 BC 9D>)
(   5,<2013-07-11 22:50:10.817 -0700>,<Administrator>,<X>,<proc1d>,<TOPSPIN 2.1>,
      <abs ABSG = 2 
       data hash MD5: 32K
       FA FC FA 91 BA 36 AC F5 EF E0 FD 51 0A 8A B4 A3>)
(   6,<2013-07-11 22:50:10.864 -0700>,<Administrator>,<X>,<proc1d>,<TOPSPIN 2.1>,
      <abs ABSG = 3 
       data hash MD5: 32K
       88 D3 11 E4 9E 1A 5D 87 F6 0B 19 94 94 73 FB 62>)
(   7,<2013-07-11 22:50:11.004 -0700>,<Administrator>,<X>,<proc1d>,<TOPSPIN 2.1>,
      <abs ABSG = 4 
       data hash MD5: 32K
       83 23 DF E9 44 EC B8 0B A1 6E F0 EC 7A 21 80 B6>)
(   8,<2013-07-11 22:50:11.051 -0700>,<Administrator>,<X>,<proc1d>,<TOPSPIN 2.1>,
      <abs ABSG = 5 
       data hash MD5: 32K
       8D 8A 59 CF 9D 7B E0 85 D3 EE F9 8B D2 B3 4E CD>)
$$ ##END=
$$ 
$$ $$ hash MD5
$$ $$ F0 DE 80 68 AD 22 0E 7F 50 60 21 E5 FC A7 9E 09
##$RELAX= 
##$RELAX= 
##$RELAX= 
##$RELAX= 
##$RELAX= 
##$RELAX= 
##$RELAX= 
$$ Bruker specific parameters
$$ --------------------------
##$DU= <E:\>
##$EXPNO= 20
##$NAME= <AC1469_13FE002651_8026970_5drCmvS8Dh>
$$ [...]
##$TP= (0..7)
150 150 150 150 150 150 150 150
##$TP07= 0
##$TPNAME0= <>
##$TPNAME1= <>
##$TPNAME2= <>
##$TPNAME3= <>
##$TPNAME4= <>
##$TPNAME5= <>
##$TPNAME6= <>
##$TPNAME7= <>
##$TPOAL= (0..7)
0.5 0.5 0.5 0.5 0.5 0.5 0.5 0.5
##$TPOFFS= (0..7)
0 0 0 0 0 0 0 0
##$TUNHIN= 0
##$TUNHOUT= 0
##$TUNXOUT= 0
##$USERA1= <user>
##$USERA2= <user>
##$USERA3= <user>
##$USERA4= <user>
##$USERA5= <user>
##$V9= 5
##$VALIST= <valist>
##$VCLIST= <CCCCCCCCCCCCCCC>
##$VD= 0
##$VDLIST= <DDDDDDDDDDDDDDD>
##$VPLIST= <PPPPPPPPPPPPPPP>
##$VTLIST= <TTTTTTTTTTTTTTT>
##$WBST= 1024
##$WBSW= 4
##$XGAIN= (0..3)
0 0 0 0
##$XL= 0
##$YL= 0
##$YMAX_a= 635916
##$YMIN_a= -539772
##$ZGOPTNS= <>
##$ZL1= 120
##$ZL2= 120
##$ZL3= 120
##$ZL4= 120
##$ABSF1= 14.98509
##$ABSF2= -5.573092
##$ABSG= 5
##$ABSL= 3
##$ALPHA= 0
##$AQORDER= 0
##$ASSFAC= 0
##$ASSFACI= 0
##$ASSFACX= 0
##$ASSWID= 0
##$AUNMP= <proc_prof1d_extract_pilot.lims>
##$AXLEFT= 0
##$AXNAME= <>
##$AXNUC= <1H>
##$AXRIGHT= 0
##$AXTYPE= 0
##$AXUNIT= <>
##$AZFE= 0.1
##$AZFW= 0.1
##$BCFW= 0
##$BC_mod= 0
##$BYTORDP= 0
##$COROFFS= 0
##$CY= 15
##$DATMOD= 1
##$DC= 0
##$DFILT= <>
##$DTYPP= 0
##$F1P= 0
##$F2P= 0
##$FCOR= 0.5
##$FTSIZE= 32768
##$FT_mod= 6
##$GAMMA= 0
##$GB= 0
##$INTBC= 1
##$INTSCL= 1
##$ISEN= 128
##$LB= 0
##$LEV0= 0
##$LPBIN= 0
##$MAXI= 10000
##$MC2= 0
##$MEAN= 0
##$ME_mod= 0
##$MI= 0
##$NCOEF= 0
##$NC_proc= -8
##$NLEV= 6
##$NOISF1= 0
##$NOISF2= 0
##$NSP= 0
##$NTH_PI= 0
##$NZP= 0
##$OFFSET= 14.98509
##$PC= 1
##$PHC0= 96.51489
##$PHC1= 0
##$PH_mod= 1
##$PKNL= yes
##$PPARMOD= 0
##$PPDIAG= 0
##$PPIPTYP= 0
##$PPMPNUM= 2147483647
##$PPRESOL= 1
##$PSCAL= 4
##$PSIGN= 0
##$PYNMP= <proc.py>
##$REVERSE= no
##$SF= 400.02
##$SI= 32768
##$SIGF1= 0
##$SIGF2= 0
##$SINO= 400
##$SIOLD= 32768
##$SPECTYP= <>
##$SREGLST= <1H.CDCl3>
##$SSB= 0
##$STSI= 32768
##$STSR= 0
##$SW_p= 8223.68421052631
##$SYMM= 0
##$S_DEV= 0
##$TDeff= 65536
##$TDoff= 0
##$TI= <>
##$TILT= no
##$TM1= 0
##$TM2= 0
##$TOPLEV= 0
##$USERP1= <user>
##$USERP2= <user>
##$USERP3= <user>
##$USERP4= <user>
##$USERP5= <user>
##$WDW= 1
##$XDIM= 32768
##$YMAX_p= 433737555
##$YMIN_p= -678701
##$CURPLOT= <Network HP LaserJet P1505>
##$CURPRIN= <$Network HP LaserJet P1505>
##$DFORMAT= <normdp>
##$LAYOUT= <+/1D_H.xwp>
##$LFORMAT= <normlp>
##$PFORMAT= <normpl>
##$SURQMSG= 1
$$ End of Bruker specific parameters
$$ ---------------------------------
##NTUPLES= NMR SPECTRUM
##VAR_NAME=  FREQUENCY,     SPECTRUM/REAL,   SPECTRUM/IMAG
##SYMBOL=    X,             R,               I
##VAR_TYPE=  INDEPENDENT,   DEPENDENT,       DEPENDENT
##VAR_FORM=  AFFN,          ASDF,            ASDF
##VAR_DIM=   32768,         32768,           32768
##UNITS=     HZ,            ARBITRARY UNITS, ARBITRARY UNITS
##FACTOR=    0.250966925370066, 1,           1
##FIRST=     8223.43324360094, 191027,       -115927
##LAST=      0,             -162685,         69344
##MIN=       0,             -678701,         0
##MAX=       8223.43324360094, 433737555,    0
$$ Real data points
##PAGE= N=1
##DATA TABLE= (X++(R..R)), XYDATA
$$ [...]
$$ plain form
19520 -218441 -42977 88822 -115523 128997 161479 -266652 59645 -44160 -13373 -29024 -103085
19509 -103085 124366 90815 -57773 -216587 -211367 -155629 -88511 136294 -179897 78538 14294
19497 103801 13236 93880 -71288 16595 60801 -21882 -264982 -211734 -286291 102207 -20942
19485 186929 16584 -245077 -325230 1478 16182 -20081 -398140 -77717 -200746 -489427 -19419
19473 -43471 271051 21754 -356651 -300569 147553 58848 91983 117730 153286 -205325 -133151
19462 -133151 -64534 -86322 -164695 -9327 -290740 -94101 -285871 -53721 -114876 -33444 58749
19450 113073 -165796 78827 -72539 85222 61543 -63927 -94152 -83768 -259635 -123593 -78921
19439 -78921 176658 518497 23259 -32240 -91582 108113 168835 -38357 -180870 173251 68700
$$ packed form
19520b18441d2977H8822a15523A28997L2482b66652E9645d4160a3373j5651p4061
19509a03085A24366l3551e7773j58814N220N5738O7118A36294a79897G8538A4294
19497A03801A3236Q0644g1288A6595M4206b1882k43100N3248p4557A02207b0942
19485A86929A6584b45077q0153A478J4704b0081l78059g7717j23029k88681a9419
19473d3471B71051B1754c56651N6082A47553E8848L3135K5747L5556b05325P2174
19462a33151f4534k1788p8373i327k81413i4101j91770e3721o1155c3444E8749
19450A13073a65796G8827g2539H5222k3679f3927l0225J0384j75867a23593M4672
19439g8921A76658L41839B3259c2240n9342A08113O0722c8357j42513A73251F8700
$$ plain form
19427 -178403 -343902 126351 -363903 139542 70136 -187998 -56626 -12481 9007 -2068 112664
19415 192766 -197988 -429005 57467 37407 -199363 -185671 -187611 -270293 -483108 -76138 122788
19403 -47044 -94243 69252 127868 -202683 -363046 -212781 105695 -135320 -134135 -93592 112418
19391 -139807 -18533 105913 35786 -65623 -267393 -489325 -117681 68516 -215083 -334126
19381 -334126 -231163 -409615 113437 -206510 -115794 74966 118865 166684 720 188664 -337655
19369 -279440 23582 58538 -183790 -4786 -118256 22742 112259 -4877 -475001 -214658 37271
19357 -241894 -289231 -135590 -113710 43828 -136364 -90889 320407 302969 -257725 34727 77625
19346 77625 12245 -117710 32742 -200609 -169014 172432 225532 -136841 -678701 -167686
$$ packed form
19427a78403j65499A26351c63903A39542o9406a87998e6626a2481I007b068A12664
19415A92766a97988k31017E7467k0060a99363J3692j940q2682k12815g6138A22788
19403d7044m7199F9252N8616b02683j60363J50265A05695a35320J185M0543A12418
19391a39807a8533A05913C5786f5623k01770k21932a17681F8516b15083j19043
19381c34126J02963j78452A13437b06510R0716G4966M3899M7819G20J87944c37655
19369b79440B3582L4956a83790d786j13470B2742Q9517d877m70124b14658C7271
19357b41894m7337a35590K1880D3828a36364M5475C20407j7438b57725C4727M2898
19346G7625A2245a17710C2742b00609L1595A72432N3100a36841n41860a67686
$$ plain form
19335 -314417 179105 -184594 120458 -34216 71804 228015 95410 -288234 74177 -103050
19324 -10671 -105906 -38030 -389773 -42578 -233228 -76425 -240224 -166219 -70897 -168209 46462
19312 -40823 -190224 -81723 -153176 -201318 -90688 148792 -258181 -24788 191693 -219627 97206
19300 -226144 -246085 -177210 -29304 -77068 36533 -395702 -513166 166 55866 1869 -210772
19288 87330 92290 -280545 -142751 -310606 -231914 -316264 107952 141083 -202381 -143950 299615
19276 8960 174965 -52983 -108969 162151 -128000 -122394 127188 -17297 -78308 -284623 -184299
19265 -184299 -144166 -234683 217031 -110423 57941 -44520 -128127 -359695 -9613 -91799 266390
19253 31876 135120 103159 129043 159516 203283 -120271 834 -105281 -68973 -39717 57116
$$ packed form
19335c14417A79105a84594A20458c4216G1804J56211I5410b88234G4177a03050
19324a0671r5235c8030l51743d2578j90650g6425j63799P4005g0897r7312D6462
19312d0823j49401h1723p1453m8142i0688A48792b58181b4788A91693b19627I7206
19300b26144j9941O8875b9304m7764C6533c95702j17464A66N5700A869b10772
19288H7330M960b80545J37794j67855P8692q4350A07952L3131b02381N8431B99615
19276H960J66005e2983n5986A62151a28000N606A27188a7297o1011k06315J00324
19265a84299M0133r0517B17031a10423E7941d4520q3607k31568i613q2186B66390
19253C1876J03244l1961K5884L0473M3767a20271H34a05281L6308K9256E7116
$$ plain form
19241 -322746 -199752 182763 -333638 -22870 -363295 371009 -17327 169480 -166853 207972
19230 -39552 -119729 -42729 249705 -375441 76056 185008 15332 -250548 -60893 -36875 -185639
19219 -185639 240847 -124002 -60457 56607 58474 -21203 -237961 -90822 140174 -119787 28741
19207 63993 99778 -296096 -352394 61824 25688 -5775 -130806 104033 59402 47817 204749
19196 204749 -108104 91431 93884 6796 303522 -45480 19306 -22538 -379525 -352335 -166468
19184 -22997 -252014 -383369 -174733 -108710 66801 8665 -149420 -312664 -111682 -308294
19174 -308294 -87060 -186786 -85834 -42406 -217640 38389 -68184 -144288 -68431 324789 -80822
19162 -91523 110250 -18870 -314594 -249265 258919 -306623 -175154 -16023 271036 -174463
$$ packed form
19241c22746J22994A82763c33638b2870l40425C71009a7327A69480a66853B07972
19230c9552q0177d2729B49705c75441G6056J08952A5332b50548f0893K4018j48764
19219a85639B40847a24002f0457E6607J867b1203k16758i0822A40174a19787B8741
19207F3993L5785b96096n6298F1824B5688e775j25031A04033m4631j1585J56932
19196B04749a08104I1431K453F796K96726d5480A9306b2538l56987K7190a66468
19184b2997k29017j31355a74733O6023F6801H665a49420j63244a11682j96612
19174c08294h7060r9726h5834d2406j75234C8389f8184p6104f8431C24789h0822
19162i1523A10250a8870k95724O5329B58919c06623J31469a6023B71036a74463
$$ plain form
19151 -337765 -60007 -81169 318538 -182977 -372828 -85377 304575 298354 -25205 -108369 -90105
19140 -90105 -132579 -105208 54974 -248465 -302412 194272 90517 -183175 -278238 51561 -207583
19128 -305392 191055 -38657 -89401 -88847 -183859 -48274 -313214 112147 -57646 371665 -120242
19116 348763 -364893 327600 -22021 -110182 -32655 -49624 -166375 -118304 146766 -138413
19105 -280251 34041 6009 -162619 -238440 -90937 -335919 -8980 253400 -211862 76978 -70982
19093 -1701 -348053 -186958 293488 36456 70504 -202059 312066 -120815 -261715 -135574
19083 -135574 -335432 -181316 208823 -10311 -57108 -174953 264823 -44448 -424766 -139809
19072 -75979 -248621 61406 -127687 -65935 -117257 -15914 230258 229739 -165451 -17378 109619
$$ packed form
19151c37765f0007k1162C18538a82977j89851h5377C04575o221b5205q3164J8264
19140i0105m2474K7371E4974b48465n3947A94272I0517a83175r5063E1561b07583
19128c05392A91055c8657n0744N54r5012d8274k64940A12147e7646C71665a20242
19116C48763c64893C27600b2021q8161c2655j6969j16751M8071A46766a38413
19105b80251C4041F009a62619p5821i0937k44982h980B53400b11862G6978g0982
19093a701l46352J61095B93488C6456L4048b02059C12066a20815j40900J26141
19083a35574j99858J54116B08823a0311m6797j17845B64823d4448l80318a39809
19072g5979j72642F1406a27687O1752n1322a5914B30258n19a65451a7378A09619
$$ plain form
19060 -50659 -62930 -28561 -151313 -279282 45346 -213298 -117855 203123 -104931 -631037
19050 -631037 284117 228955 -210711 -10117 93946 141507 -260710 -254623 114505 -89099 -321703
19039 -321703 -106240 -149911 -176995 146391 262223 85091 233061 191816 62876 334907
19029 334907 -90550 192110 -114010 -122353 -116340 389184 18178 -179779 -46895 46754 -44202
19017 131350 49869 37956 -148496 -152290 -27090 -10181 -137095 -139687 -159511 147800 -157691
19005 84121 237775 -29384 -112588 -89808 -245992 -26223 -65459 180857 4867 11902 134997
18994 134997 44308 -181937 4311 23357 78978 13868 85444 -204604 -215610 -225222 -124830
18983 -124830 209371 -15271 -2612 29042 146096 -105838 -222388 19363 -44101 -72167 -99291
$$ packed form
19060e0659j2271b8561j22752j27969D5346b13298R5443B03123a04931n26106
19050f31037B84117n5162b10711a0117I3946M7561b60710O087A14505h9099k32604
19039c21703a06240m3671k7084A46391J15832H5091J47970m1245F2876K72031
19029C34907i0550A92110a14010q343O013C89184A8178a79779d6895D6754d4202
19017A31350D9869j1913a48496l794b7090a0181j26914k592j9824A47800a57691
19005H4121J53654b9384q3204K2780j56184b6223l9236A80857D867P035J23095
18994A34997D4308a81937D311J9046N5621A3868P1576b04604j1006r612J00392
18983a24830B09371a5271b612B9042J17054a05838j16550A9363d4101k8066k7124
$$ plain form
18972 -99291 -197415 -129434 -121555 -152496 -154153 -173637 48693 -223393 48741 151288 -152599
18960 146258 122031 -177423 -29259 -27479 -42595 384116 144902 -1342 -164463 -49006 -165907
18949 -165907 -38840 193706 -100119 -121101 251022 -133755 236832 -6054 593 -260873 -92989
18937 -151298 95391 281370 -126797 27307 -69753 299807 69614 -62338 -117967 871 -40495
18925 -161239 -97737 -245207 72729 -157174 -324244 39752 -185575 -20971 -131320 105220
18914 -181674 91582 -223944 -113608 408940 5391 -74831 -83088 -162520 -267323 47770 -95929
18902 -317137 -30249 -130795 -124106 -100626 -241485 -199562 -73837 137189 23971 537325 48185
18890 90231 -19719 -11991 142133 -355608 69545 211719 -374419 -225697 -266940 -101555 -148042
$$ packed form
18972i9291r8124O7981P879l0941j657j9484D8693b23393D8741J02547a52599
18960A46258k4227a77423b9259J780j5116C84116A44902a342j63121d9006j16901
18949a65907c8840A93706a00119k0982B51022a33755B36832f054E93b60873i2989
18937a51298I5391J85979a26797B7307f9753B99807F9614f2338n5629H71d0495
18925a61239O3502j47470G2729a57174j67070C9752a85575b0971j10349A05220
18914a81674I1582b23944J10336D08940E391g4831q257p9432j04803D7770i5929
18902c17137c0249j00546O689K3480j40859M1923g3837A37189B3971N13354D8185
18890I0231a9719P728A42133c55608F9545J42174c74419J48722m1243a01555m6487
$$ plain form
18879 -148042 -312867 -20227 -31549 -343307 -28778 -169718 50973 -271002 -139969 -329491
18869 -329491 -169246 118760 65956 82278 -119045 -202138 -270719 -17940 -153222 -44219 69966
18857 -107234 130621 200874 -123311 360291 -396593 -111090 26963 168154 67846 390952
18847 390952 -362817 24226 111584 -84397 -124538 295840 -153545 -53583 -105593 -177434 -116369
18836 -116369 -123330 111380 -72972 13478 -287126 -79631 108563 -198272 -84559 145372 7004
18824 108588 -129237 -254468 -87206 119220 164610 259084 195117 147094 -34183 158285 150741
18813 150741 53346 62518 68288 -137731 -158953 42156 -174194 343792 -219038 16143 -232589
18801 -41029 -474864 -164421 289363 -22826 -124788 -180484 193427 -80518 203555 53249
$$ packed form
18879a48042j64825b0227j1322l11758b8778j40940E0973b71002J31033j89522
18869c29491J60245A18760n2804J6322a19045q3093o8581a7940j35282d4219F9966
18857a07234A30621P0253a23311C60291c96593a11090B6963J41191F7846L23106
18847C90952c62817B4226Q7358h4397m0141B95840a53545e3583n2010p1841O1065
18836a16369o961A11380g2972A3478b87126g9631A08563a98272h4559A45372G004
18824A08588a29237j25231h7206A19220M5390R4474o3967m8023c4183A58285p544
18813A50741E3346R172N770a37731k1222D2156a74194C43792b19038A6143b32589
18801d1029m33835a64421B89363b2826j01962n5696A93427h0518B03555E3249
$$ plain form
18790 195326 154971 -15795 -112278 127801 -97370 107535 -254899 -102778 -130306 188931
18779 74191 44303 -182117 146347 219296 47203 29757 -99357 -348289 -219732 80787 -120901
18767 5536 -160613 -86744 526 132589 -302226 -224899 -36034 37330 77252 -142550 -190620
18756 -190620 -103225 -114830 -223236 163697 9470 -117192 38728 -86310 19703 30059 -250742
18744 136024 -321979 4059 -282321 -373411 -45231 67039 93991 157047 -66312 -176439 42256
18732 69692 -122811 2154 -34317 -111497 195503 62211 236703 273474 -85999 -216981 198527
18720 -263256 183635 -115239 -313836 -100686 83689 96486 8684 -228755 98695 -15994 -40482
18709 -40482 14471 -198155 -210990 34360 -112159 -192411 120996 3199 199432 -178703 -272695
$$ packed form
18790A95326m0355a5795r6483A27801i7370A07535b54899a02778k7528A88931
18779G4191k9888a82117A46347P2949D7203j7446i9357k48932J28557H0787a20901
18767E536a60613P3869E26J32063c02226P7327c6034C7330L9922a42550m8070
18756a90620Q7395j1605j08406A63697I470a17192C8728h6310A9703J0356b50742
18744A36024c21979D059b82321r1090d5231F7039K6952O3056f6312j10127D2256
18732F9692a22811B154c4317p7180A95503F2211J74492L6771h5999j30982A98527
18720b63256A83635a15239j98597a00686H3689J2797H684b28755I8695a5994k4488
18709d0482A4471a98155j2835C4360a12159q0252A20996C199J96233a78703r3992
$$ plain form
18698 -272695 -206279 -299380 -184097 123997 -251165 130487 -22857 -159443 -70703 -198984
18688 -198984 -260121 -287389 -181168 -97795 214953 176685 -197861 -5261 223266 17668 -144800
18676 143500 -275579 -157328 -296123 -130284 -134472 -205937 -69194 -56016 95907 -145053 -165460
18665 -165460 -110596 -233268 192999 89294 11065 9692 11587 -43762 2834 11132 119502 -515630
18652 -257136 -67302 -37520 -153381 12942 -381987 45640 -11908 -180412 -20975 -238217 -200563
18641 -200563 -321421 114824 355220 -92399 93452 -54838 158262 -319994 -76555 -15307
18630 -43567 -251614 -15113 183193 -39586 -309765 24555 170901 -175967 -238816 -547140
18620 -547140 64426 -73965 38161 68078 151440 -446876 -195798 -128200 164207 -295904 -2859
$$ packed form
18698b72695O6416r3101J15283A23997b51165A30487b2857j36586g0703j28281
18688a98984o1137k7268J06221Q3373B14953l8268a97861e261B23266A7668a44800
18676A43500b75579J18251j38795a30284m188p1465f9194J3178I5907a45053k0407
18665a65460N4864j22672A92999H9294A1065j373J895d3762B834Q298J08370e15630
18652b57136f7302K9782j15861A2942c81987D5640a1908j68504b0975k17242L7654
18641b00563j20858A14824K40396i2399I3452e4838A58262c19994g6555a5307
18630d3567k08047a5113A83193c9586k70179B4555J46346a75967o2849l08324
18620e47140F4426g3965C8161K9917Q3362d46876a95798O7598A64207b95904b859
$$ plain form
18608 31665 153885 -206457 91096 -335359 -67700 -64679 -117499 -210994 -10630 -41472 127406
18596 45838 -92689 -106818 277760 -175733 -348590 13676 -9975 -116505 97479 -56826 -299027
18585 -299027 8794 278430 268367 76499 -140047 -190953 -105692 -179677 -168855 238917 -162056
18573 -4049 -126384 269620 -1338 -236837 -139774 94459 26972 222915 -104072 83084 -247305
18561 8473 -169669 -341595 -115707 -103521 -339468 -293335 -110132 -202216 -141824 -15392 -388544
18550 -388544 -233356 -154155 -13958 -368120 -82863 60571 -15651 110613 -65527 120286 -10883
18538 179594 -88322 -141189 -235744 197766 -28180 -38875 213754 58108 -248229 -265482 -260304
18527 -260304 -127895 -256678 -177176 264647 366770 -318544 -371199 -339148 -124709 -21211
$$ packed form
18608C1665J22220b06457I1096c35359f7700L021n2820r3495a0630l0842A27406
18596D5838i2689j4129B77760a75733j72857A3676i975j06530I7479e6826k42201
18585b99027H794K69636j0063G6499a40047n0906Q5261p3985J0822B38917a62056
18573d049j22335B69620a338k35499R7063I4459B6972J95943a04072H3084b47305
18561H473a69669j71926a15707J2186k35947M6133a10132r2084O0392a5392l73152
18550c88544J55188P9201a3958l54162h2863F0571a5651A10613f5527A20286a0883
18538A79594h8322n2867r4555A97766b8180j0695B13754E8108b48229j7253N178
18527b60304a27895j28783P9502B64647J02123c18544n2655L2051a24709b1211
$$ plain form
18516 799 -222605 237472 80757 -15940 362718 172834 -463870 80114 -214722 46789 -35796
18504 148796 -184895 -352109 -108745 38125 -235013 31257 42693 -14924 -215716 356558
18493 -47104 -89222 308215 -351869 -301565 74421 -194980 -181657 -17241 54848 -18963 -97370
18482 -97370 -25740 -139231 -58120 -3074 169450 -37636 -42867 -29000 117241 -113747 -29743
18470 -432788 -307355 -200486 -246775 126024 -30946 -32206 44532 -30546 -13804 -62880 -352056
18459 -352056 86 -147880 -249614 -208441 245609 -106954 -400520 121585 -97469 -261392 -68976
18447 -52882 -196470 250180 -376433 -85812 19220 -201190 280833 -43214 -70854 -322664
18437 -322664 10067 -339368 -135394 -406949 -66262 106539 -89816 148580 -90625 -212152
$$ packed form
18516G99b22605B37472H0757a5940C62718A72834d63870H0114b14722D6789c5796
18504A48796a84895j67214a08745C8125b35013C1257J1436a4924k00792C56558
18493d7104m2118C08215c51869N0304G4421a94980J3323a7241E4848a8963p8407
18482i7370b5740j13491e8120c074A69450c7636n231J3867A17241a13747b9743
18470d32788J25433J06869m6289A26024c0946j260D4532c0546a3804m9076k89176
18459c52056H6a47880j01734M1173B45609a06954k93566A21585i7469j63923f8976
18447e2882j43588B50180c76433h5812A9220b01190B80833d3214k7640k51810
18437c22664A0067c39368a35394k71555f6262A06539h9816A48580i0625j21527
$$ plain form
18427 -212152 -50310 -66771 9304 176485 -113971 53669 54758 62317 65529 127682 -34210 -120966
18415 -120966 48592 107521 -146401 217458 15758 158139 149155 -318642 29127 -52624 222178
18403 -134281 -81314 136515 -227506 -182311 229949 -75190 57134 14945 206272 163599 -301441
18391 -15048 32564 -108785 -42063 -65859 -80346 -145529 213809 -326448 123164 101968 -231895
18379 32867 170004 56316 88689 -320573 -13929 194869 -204764 36879 -124347 -11632 99420
18367 -191122 -86200 321707 4193 -93319 -52838 201198 -67823 -148721 67354 -270457 -138080
18356 -138080 85947 99361 259493 -36965 -107434 -29863 -75778 -317694 -503108 59912 -151020
18344 -64231 9466 30044 -173582 -479576 -158944 256493 25294 96199 66198 -121950 -260482
$$ packed form
18427b12152e0310j6461I304J67181a13971E3669J089P559L212O2153c4210q6756
18415a20966D8592N8929a46401B17458A5758J42381q984c18642B9127e2624B22178
18403a34281N2967A36515b27506M5195B29949g5190E7134A4945J91327m2673c01441
18391a5048C2564a08785d2063k3796j4487o5183B13809c26448A23164k1196b31895
18379C2867J37137E6316L2373c20573a3929A94869b04764C6879a24347a1632I9420
18367a91122h6200C21707D193i3319M0481B01198f7823q0898F7354b70457J32377
18356a38080H5947J3414J60132c6965p0469b9863m5915k41916j85414E9912a51020
18344f4231I466K0578a73582l05994a58944B56493B5294P0905l0001a21950j38532
$$ plain form
18333 -260482 -39509 -208446 213459 40276 -281822 -65129 -236098 -56895 -105410 -27261 -74289
18322 -74289 -157963 109773 -367447 78865 -240384 75552 110479 236160 -166530 -100418 -46418
18310 -161434 -363698 40257 -24321 78064 -141327 -12286 12025 37181 124013 -13995 84931
18298 -185318 139264 -39297 -428366 231861 79681 -160547 20110 243656 138309 17464
18287 140893 115391 97811 42184 70226 -68759 -1741 -52015 -52584 -87720 -245322 -427799 -88483
18274 34079 -109697 -335769 34530 -59994 30168 26337 197201 109399 188150 -5434 35640
18262 -203582 80134 90392 -152528 -307713 -279868 -155634 -155841 14804 -83118 68307 -212012
18250 -168794 -93451 -296490 -264007 -387703 222758 -207834 -267350 -5058 230875 216541 -340337
$$ packed form
18333b60482c9509j68937B13459D0276b81822f5129j70969e6895m8515b7261m7028
18322g4289q3674A09773c67447G8865b40384G5552L4927J25681a66530O6112d6418
18310a61434k02264D0257b4321G8064a41327a2286A2025K5156Q6832a3995H4931
18298a85318A39264c9297l89069B31861G9681a60547B0110K23546j05347A7464
18287A40893k5502j7580D2184K8042f8759a741n0274n69l5136j57602j82477h8483
18274C4079a09697k26072C4530e9994C0168l831J70864q7802P8751e434C5640
18262b03582H0134J0258a52528j55185K7845J24234k07A4804h3118F8307b12012
18250a68794P5343k03039L2483j23696B22758b07834n9516e058B30875j4334c40337
$$ plain form
18238 -155906 -242652 -15844 -60189 -48122 -70382 -193249 -57117 192310 -226646 -56748 189906
18226 -212053 298685 247985 143583 264486 58367 -127168 -108999 -101892 -65401 -215427 -149552
18215 -149552 -335322 -281790 -15707 171187 -465633 125593 -143575 -150913 -108085 -7994 290150
18203 -283898 16401 156269 -221234 -73948 -290099 9522 -208722 53027 -108020 -173913 309401
18191 140635 -333304 -127154 -309753 -16607 310453 -307881 19141 101881 14358 40689
18181 40689 -262450 33237 43895 -122467 -49510 -554853 -34873 -16319 -182411 -67179 135993
18169 -200860 -35260 -76260 -165120 -144639 -55780 -56216 90742 242852 103683 79437 37232
18157 27079 -296965 211783 -411150 161844 -89023 -116396 -728 155831 -70432 -205056 -40673
$$ packed form
18238a55906q6746a5844m4345J2067k2260j22867e7117A92310b26646e6748A89906
18226b12053B98685n0700j04402J20903E8367a27168J8169P107L6491j50026O5875
18215a49552j85770N3532a5707A71187d65633A25593a43575p338M2828g994B90150
18203b83898A6401J39868b21234g3948k16151I522b08722E3027a08020o5893C09401
18191A40635c33304a27154j82599a6607C10453c07881A9141Q2740A4358K6331
18181D0689b62450C3237J0658a22467d9510n05343c4873a6319j66092f7179A35993
18169b00860c5260m1000q8860K0481e5780m36I0742J52110A03683k4246C7232
18157B7079b96965B11783d11150A61844h9023k7373g28A55831g0432j34624d0673
$$ plain form
18145 -125405 -153204 -320457 -110321 4542 -125597 -35658 196869 -318490 36312 79136 -182715
18133 39268 14540 259895 212836 -138069 66635 412298 205343 -36979 105796 -465364
18122 -359994 -161527 263804 92788 -142907 -11518 302010 -305000 -87972 168215 -263318
18111 275040 -297938 -273605 124073 47245 -176770 89124 12745 -166369 -213039 -132552 -331790
18100 -331790 -263546 86896 -85420 -65316 -123858 344991 17833 56127 -17564 -138862 -188017
18089 -188017 -103855 124362 226202 -11142 -212409 208414 -12132 338996 -265911 71923
18078 -409752 -248969 -289976 320279 203847 -160009 -95845 -8733 43321 -40694 -185977 -123455
18067 -123455 -37359 -287689 12608 -103811 -11838 63588 -30705 -82791 -265955 285164 -94963
$$ packed form
18145a25405k7799j67253a10321D542a25597c5658A96869c18490C6312M2824a82715
18133C9268A4540K45355m7059a38069F6635L45663B05343c6979A05796d65364
18122c59994a61527B63804I2788a42907a1518C02010c05000h7972A68215b63318
18111B75040b97938K4333A24073D7245a76770H9124A2745a66369m6670Q0487j99238
18100c31790O8244H6896h5420K0104n8542C44991A7833L8294a7564j21298m9155
18089a88017Q4162A24362J01840a1142k01267B08414a2132C38996b65911G1923
18078d09752J60783m1007C20279j16432a60009O4164h733D3321d0694j45283O2522
18067a23455c7359k50330A2608a03811a1838F3588c0705n2086j83164B85164i4963
$$ plain form
18055 182109 112790 28413 309272 38088 -58953 -259589 102386 -303890 -375252 -205786
18045 -205786 100748 123914 5091 -52818 -98522 143000 61628 -69744 -133676 -324496 202948
18033 -12472 -31709 206397 -5844 -180624 -83195 51743 109623 -350301 -470197 -161184 178713
18021 -6310 105779 -213849 174056 -54136 -260816 -61770 230436 178079 42876 -117882 -181529
18010 -181529 -134064 -86772 264342 -6625 -12538 -125699 -179305 161005 213440 -8982 5258 -170536
17997 -219908 -9698 -13733 159166 107178 17079 -498139 144900 -142857 26561 -6883 -255726
17986 -255726 -33892 71263 -144961 132662 -316075 161826 -32443 -89488 -348837 -143918
17975 -16875 -199374 -121384 67490 98496 138241 171321 -111523 -109323 -65237 55215 180683
$$ packed form
18055A82109o9319B8413K80859C8088e8953k00636A02386c03890p1362J69466
18045b05786A00748K3166E091e2818m5704A43000F1628f9744o3932j90820B02948
18033a2472j9237B06397e844j74780h3195E1743N7880c50301j19896a61184A78713
18021f310A05779b13849A74056e4136k06680f1770B30436n2357D2876a17882o3647
18010a81529M7465M7292B64342f625n913j13161n3606A61005N2435h982E258a70536
17997b19908i698m035A59166n1988A7079d98139A44900a42857B6561f883k48843
17986b55726c3892G1263a44961A32662c16075A61826c2443n7045k59349a43918
17975a6875j82499P7990F7490L1006L9745L3080a11523K200M4086E5215J25468
$$ plain form
17964 180683 -64041 127495 -261832 43227 206300 -97931 -154861 -385595 191992 -145247
17953 11789 111411 -198539 47582 -310463 127260 79538 247941 96954 -30440 253990 -191824
17941 -199531 121334 124636 -90139 146071 -105089 -73628 202253 21848 100216 7587 234555
17930 234555 132422 -122203 84367 -36090 87086 217299 -292654 -148763 -30659 -301251
17920 -301251 33619 127904 19653 203197 271599 -26985 -52287 -165907 9109 -185452 126960
17908 193133 -56341 -100702 30615 203303 -93958 -150680 -150284 150777 -49652 54698 -169774
17896 -21419 -41518 -111936 -65697 -118540 325796 225614 2135 135046 -39473 134166 -46628
17884 66702 70500 231560 -9998 -435706 81697 -174616 -83528 77382 308341 -183563 -161993
$$ packed form
17964A80683f4041A27495b61832D3227J63073i7931n6930k30734A91992a45247
17953A1789R9622a98539D7582c10463A27260m7722J68403I6954c0440B53990a91824
17941a99531A21334L302i0139A46071a05089L1461B02253B1848P8368G587K26968
17930B34555j02133a22203H4367c6090H7086J30213b92654J43891c0659k70592
17920c01251C3619R4285A9653J83544O8402b6985k5302j13620I109a85452A26960
17908A93133e6341m4361C0615J72688i3958n6722L96A50777d9652E4698a69774
17896b1419k0099p0418M6239n2843C25796j00182B135J32911c9473A34166d6628
17884F6702L798J61060i998m25708H1697a74616h3528G7382K30959a83563K1570
$$ plain form
17873 -161993 -31721 -398198 -273755 59553 155915 -173220 -414334 -73097 -61258 125209
17862 -141721 -272000 -214269 -42908 143554 -258578 -46986 177107 107098 -318659 -43368
17851 74547 118350 142079 121983 -145389 -280903 -17598 184847 284104 -24792 43613 20782
17839 201891 -50805 -173731 93951 -152636 -256345 -173560 -59712 -144273 75977 133856 111523
17828 111523 236955 67809 -33580 -186463 472604 75521 -239834 -326148 -105801 -220019
17818 -220019 -57238 129952 -218456 -53988 95677 -67741 -164802 -79260 55359 19250 20965
17807 20965 -5798 22655 -218530 -79967 73601 146698 -124430 -88100 329119 -52996 52400
17795 -221777 124547 -174536 -179976 -138352 93821 -138371 -107784 -75656 201712 -223 -196139
$$ packed form
17873a61993c1721l66477J24443E9553R6362a73220k41114g3097J1839A25209
17862a41721j30279N7731d2908A43554b58578d6986A77107p0009c18659d3368
17851G4547M3803K3729k0096a45389j35514a7598A84847R9257b4792D3613B0782
17839B01891e0805j22926I3951a52636j03709Q2785e9712q4561G5977N7879k2333
17828A11523J25432F7809c3580j52883D72604G5521b39834q6314a05801j14218
17818b20019e7238A29952b18456e3988I5677f7741r7061g9260E5359A9250J715
17807B0965e798B2655b18530g9967G3601P3097a24430L6330C29119e2996E2400
17795b21777A24547a74536n440M1624I3821a38371L0587L2128B01712b23j95916
$$ plain form
17784 -196139 -385223 70734 53727 527624 -137502 -37054 107328 312995 68943 -66699
17773 -165579 41769 -148569 -117813 -189166 21849 110766 -116080 132223 -102960 -58601 -63950
17762 -63950 70259 -114057 -33772 -201391 -242958 -372570 -214104 -180663 -62113 56698 233115
17751 233115 89585 49860 -194108 155025 168734 -12691 285673 -34351 -183477 -375106
17741 -375106 -106008 52402 168995 -156633 -174431 -201979 -201065 -1826 84705 54634 212241
17730 212241 1954 -18040 16639 386841 121414 50616 -308301 -130079 9338 -229590 9354
17718 -356057 -23426 -23881 158010 410745 113538 -28621 371008 -177492 195673 143153 -208690
17706 164875 -4549 32781 11911 -235706 -64402 77955 90969 181414 -90618 -235428 -190987
$$ packed form
17784a96139j89084G0734j7007M73897a37502c7054A07328K05667F8943f6699
17773a65579D1769a48569L0756p1353B1849Q8917a16080A32223a02960M4359n349
17762f3950G0259a14057c3772j67619m1567j29612J58466L3441f2113E6698J76417
17751B33115H9585l9725a94108A55025J3709a2691B85673c4351j49126j91629
17741c75106a06008E2402J16593a56633j7798k7548R14a826H4705l0071J57607
17730B12241A954a8040A6639L70202A21414E0616c08301a30079I338b29590I354
17718c56057b3426m55A58010K52735A13538b8621C71008a77492A95673n2520b08690
17706A64875d549C2781A1911b35706f4402G7955J3014R0445i0618j44810M4441
$$ plain form
17695 -190987 -385286 -212735 -419022 -251259 89316 307994 5356 -275635 -262908 37888
17684 -90585 192960 98463 221279 -11857 -2265 188946 -23847 -46611 374290 257285 214040
17673 214040 -104326 -195420 65752 -135984 -18075 102204 90949 -324363 -44014 278872
17662 -345222 112165 -35388 117648 -90952 36142 154027 81881 110825 -198082 -88914 -82473
17651 -82473 160994 -6292 157078 252593 110741 61176 -219993 218082 -65732 -45041 -109760
17640 -109760 34974 -99253 -105154 558821 -57637 -10050 -78186 -302134 -311429 -183577 131237
17628 235005 57258 -208633 -3694 -120125 -129525 -81157 -86462 -146127 -74858 35694 94548 -25762
17615 203352 -236411 173385 -101183 27161 91201 -118567 205738 105203 18437 -31461
$$ packed form
17695a90987j94299J72551k06287J67763H9316K18678E356b75635J2727C7888
17684i0585A92960r4497J22816a1857b265A88946b3847k2764C74290j17005m3245
17673B14040a04326r1094F5752a35984a8075A02204j1255c24363d4014B78872
17662c45222A12165c5388A17648i0952C6142J17885p2146K8944a98082h8914O441
17651h2473A60994f292A57078R5515A10741m9565b19993B18082f5732K0691o4719
17640a09760C4974i9253n901E58821e7637a0050o8136k23948r295J27852A31237
17628B35005E7258b08633c694j16431r400M8368n305n9665P1269C5694N8854b5762
17615B03352b36411A73385a01183B7161O4040a18567B05738j00535A8437c1461
$$ plain form
17604 -123711 -92279 245279 -144104 124462 295276 -123500 -96718 -74831 72118 121563
17594 121563 -32771 -133933 3396 -296306 47487 21292 218339 134663 107478 -128170 177503
17582 -63650 138163 -141056 -68273 -180135 229470 10481 -21722 252189 -13428 256643
17571 273832 321687 166724 -238371 -76489 -11453 123462 104213 -66528 -15333 -78983 -78477
17560 -78477 253066 -62571 193189 356933 -160412 -88394 50770 200356 -54873 133407
17549 134455 176832 -258122 120735 -136043 45174 -113483 355716 37786 374652 359539
17539 359539 210745 -30589 -339255 75446 33977 80633 -188413 -236373 71583 -36810 -384349
17528 -384349 257263 136755 -21751 189495 257453 68870 -228104 -127472 -85389 209187
$$ packed form
17604a23711L1432B45279a44104A24462J70814a23500K6782K1887G2118M9445
17594A21563c2771j01162C396b96306D7487B1292J97047q3676k7185a28170A77503
17582f3650A38163a41056f8273j11862B29470A0481b1722B52189a3428B56643
17571B73832M7855j54963b38371g6489a1453A23462j9249f6528a5333o3650N06
17560g8477B53066f2571A93189J63744a60412P2018E0770J49586e4873A33407
17549A34455M2377b58122A20735a36043D5174a13483C55716C7786L36866j5113
17539C59539j48794c0589l08666G5446C3977M6656a88413m7960G1583c6810l47539
17528c84349B57263j20508b1751A89495O7958F8870b28104J00632M2083B09187
$$ plain form
17517 147840 146932 237967 37890 183400 270347 -175446 80928 -161245 324792 325954 -137374
17505 83634 -234096 -177491 133715 -230743 -134167 5994 -30373 -138616 -9715 -174482 193353
17493 116778 78358 235168 -48842 213774 -175400 168949 220985 133316 318568 245421
17483 245421 -53411 153149 -66922 174968 202117 62899 380049 -159026 -26815 -57117 -87013
17472 -87013 81911 507035 323681 131589 516562 175380 -306431 168412 -201486 262314
17461 102162 -44884 283618 197428 -169135 369550 484721 245175 174001 166423 375258
17451 375258 172659 110768 166678 477439 231377 172220 166281 575913 80896 280162 277911
17440 277911 22676 540688 138348 168937 192103 258758 47308 -183278 401053 313081 77794
$$ packed form
17517A47840r08R1035C7890J45510Q6947a75446H0928a61245C24792J162a37374
17505H3634b34096N6605A33715b30743R6576E994c0373j08243i715j64767A93353
17493A16778l8420J56810d8842B13774a75400A68949N2036q7669J85252p3147
17483B45421e3411A53149f6922A74968K7149F2899L17150a59026b6815l0302k9896
17472h7013H1911M25124j83354A31589L84973A75380c06431A68412b01486B62314
17461A02162d4884B83618q6190a69135C69550J15171k39546p1174p578K08835
17451C75258A72659o1891N5910L10761B31377n9157n939M09632H0896J99266k251
17440B77911B2676N18012A38348L0589K3166O6655D7308a83278D01053q7972G7794
$$ plain form
17428 195807 191902 408502 332356 101180 183085 431944 468015 72889 250517 25405 473343
17417 473343 587933 79235 145022 294667 145895 260079 253089 163838 114584 241114 101183
17405 203142 473836 -36068 158243 205844 114959 203595 324060 114452 408222 -19874
17394 142406 -167386 324729 105127 149516 38696 -75027 245216 370926 -54101 348200
17383 149549 139398 252011 80808 -44915 452393 154422 249200 543188 369300 -167266
17372 254017 145561 -7652 212609 103340 65711 4645 -95353 318128 -1341 264241 37039
17360 131598 -37630 -96716 1678 80427 -68313 244615 163812 308737 -1236 342083 298178
17349 298178 -139827 -120254 460825 441900 -204210 123237 164221 -84701 13558 -11335 -155586
$$ packed form
17428A95807l905K16600p6146A01180Q1905K48859L6071G2889J77628B5405M47938
17417D73343J14590G9235O5787J49645A45895J14184o990q9251m9254J26530A01183
17405B03142K70694c6068A58243M7601r0885Q8636J20465A14452K93770a9874
17394A42406a67386C24729A05127M4389C8696g5027B45216J25710e4101C48200
17383A49549j0151J12613H0808d4915D52393A54422R4778K93988j73888a67266
17372B54017j08456g652B12609A03340l7629D645i5353C18128a341B64241C7039
17360A31598c7630n9086A678P8749f8313B44615q0803J44925a236C42083m3905
17349B98178a39827J9573D60825j8925b04210A23237M0984h4701A3558a1335j44251
$$ plain form
17338 -155586 383884 271822 556701 184624 225740 108623 -214186 162411 170405 -38966
17327 -9014 150063 49672 102740 288002 327881 -103983 345823 194592 376723 297847 274064
17316 274064 329235 67936 75421 -244911 172807 85005 365632 196663 37945 -181705 -6586
17304 345694 120432 214685 -113270 -17833 -254185 253499 59794 -79865 -30010 479281
17293 292445 99213 -143597 283311 62135 419547 177759 109993 463730 107326 332461
17283 332461 -51397 102951 98226 205230 -7579 -133059 170625 160076 83229 153853 -142650
17271 394493 340401 32616 291305 230272 330758 245663 -229412 86062 55404 -39816 253735
17259 274842 88334 -122450 282845 186420 -13421 -105497 -137833 199001 202538 540659 -204100
$$ packed form
17338a55586C83884j12062K84879A84624M1116A08623b14186A62411P994c8966
17327i014A50063D9672N3068J85262L9879a03983C45823j51231J82131p8876k3783
17316B74064N5171F7936P485b44911A72807H5005K80627j68969C7945a81705f586
17304C45694A20432R4253a13270a7833k36352B53499E9794g9865c0010D79281
17293B92445I9213a43597B83311F2135L57412A77759o7766L53737A07326K25135
17283C32461e1397A02951m725J07004g579j25480A70625j0549p6847P0624a42650
17271C94493n4092C2616K58689o1033J00486q5095b29412H6062l0658c9816B53735
17259B74842H8334a22450B82845r6425a3421r2076l2336A99001L537L38121b04100
$$ plain form
17247 292998 172170 148718 71149 47448 262595 528436 358592 23610 477253 346981
17237 346981 25993 219086 117566 92108 848183 457112 180362 100046 -18923 141881
17226 351963 526720 352599 309809 221672 445538 248945 366348 367905 282695 317914 227594
17215 227594 347835 178419 288947 323086 276628 260990 351630 574996 189925 33614
17204 18044 415710 304968 198511 253582 291961 129179 161774 46099 -68680 356012 300692
17193 300692 -13524 -113823 404997 356878 175183 237250 75246 179460 255247 324185 190688
17182 190688 181512 167527 173757 246645 177260 407336 236213 159115 307367 219453 145563
17171 145563 429709 403977 147818 262431 -41111 72535 310424 34726 209935 338711
$$ packed form
17247B92998j20828k3452G1149k3701K15147K65841j69844B3610M53643j30272
17237C46981B5993J93093j01520k5458P56075l91071A80362q0316a8923A41881
17226C51963J74757j74121m2790q8137K23866j96593J17403J557q5210L5219r0320
17215B27594J20241j69416J10528L4139m6458j5638R0640K23366A89925C3614
17204A8044L97666j10742j06457N5071L8379A29179L2595D6099f8680C56012n5320
17193C00692a3524j00299D04997m8119A75183O2067G5246J04214P5787O8938j33497
17182A90688r176j3985O230P2888o9385K30076j71123p7098J48252q7914p3890
17171A45563K84146k5732A47818J14613d1111G2535K37889C4726J75209J28776
$$ plain form
17161 338711 108964 320362 369827 289464 384481 291507 370872 139338 473291 199168
17150 -64828 224203 84516 389281 376876 309988 342160 196442 201042 195154 258569 239760
17139 239760 293179 272948 200332 83737 92407 305766 323590 217022 302280 205369 134469
17128 134469 359687 175128 316799 165938 248389 465845 324158 573993 519771 333186
17118 333186 547299 260326 387572 189000 57959 588622 493443 372059 271128 582445
17108 582445 669966 14219 442194 669516 698009 147701 210631 -4530 412660 207889 122651
17097 122651 459862 293228 765202 155370 781172 170804 28963 362050 633321 343033
17087 343033 460916 125908 458607 202873 771620 252393 146536 315464 305180 368994
$$ packed form
17161C38711A08964K11398M9465q0363R5017r2974P9365A39338L33953A99168
17150f4828B24203H4516L04765j2405o6888L2172j45718M600n888O3415j8809
17139B39760N3419k0231p2616H3737Q670K13359J7824j06568Q5258r6911p0900
17128A34469K25218A75128J41671j50861Q2451K17456j41687K49835n4222j86585
17118C33186K14113B60326J27246A89000E7959N30663r5179j21384j00931L11317
17108E82445Q7521A4219M27975K27322K8493A47701O2930d530D12660k04771q5238
17097A22651L37211j66634M71974A55370O25802A70804B8963L33087K71271k90288
17087C43033J17883A25908L32699B02873N68747B52393j05857J68928j0284O3814
$$ plain form
17077 368994 278988 318604 631038 497342 221486 -18090 581068 396718 533058 361824
17067 361824 648554 318816 540793 290332 707654 458330 413752 187038 690883 454122
17057 454122 359387 610641 434451 779215 632951 382861 559707 842980 797754 461027
17047 461027 778269 538850 310336 371660 592660 533290 578594 322205 799244 525173
17037 525173 352227 408151 656638 624011 499460 513936 535019 759612 95997 541163
17027 541163 375227 644820 769289 747068 482718 649822 742509 565745 735797 466500
17017 466500 838937 580785 735625 430772 905902 511973 718060 692539 639501 462944
17007 462944 854127 748035 635139 582433 808419 810330 813332 469917 778986 695179 714489
$$ packed form
17077C68994r0006L9616L12434j33696B21486a8090E81068j84350J36340j71234
17067C61824K86730C18816K21977k50461M17322k49324m4578A87038N03845k36761
17057D54122r4735K51254j76190L44764j46264k50090J76846K83273m5226l36727
17047D61027L17242k39419k28514O1324K21000n9370M5304k56389M77039k74071
17037E25173j72946N5924K48487l2627j24551J4476K1083K24593I5997M45166
17027E41163j65936K69593J24469k2221k64350J67104R2687j76764J70052k69297
17017D66500L72437k58152J54840l04853M75130l93929K06087k5521n3038j76557
17007D62944L91183j06092j12896n2706K25986J911L002l43415L09069q3807J9310
$$ plain form
16996 714489 898491 848824 933679 862860 640364 861379 950327 478720 585553 743305
16986 743305 975598 1004068 1078646 953983 676382 828576 1027689 677365 880722 1039732
16976 1039732 969877 897917 853836 913771 1085585 855867 771011 975526 695389 1010857
16966 1010857 822552 850071 783921 544753 745533 1031433 944871 1015428 912421 1118784
16956 1118784 853593 1005904 927287 1079677 1205587 958207 881093 1010957 1184542 1048944
16946 1048944 1188142 1187560 1144489 1098165 1375313 1066248 1017821 1166162 1026172 1231163
16936 1231163 974744 1356976 1458998 1027378 1178112 1329170 1213811 1269220 1251516 1357301
16926 1357301 1234000 1033885 1612311 1411381 1487011 1137855 1566349 1195032 1117144 1841994
$$ packed form
16996G14489J84002m9667Q4855p0819k22496K21015Q8948m71607J06833J57752
16986G43305K32293K8470P4578j24663k77601J52194J99113l50324K03357J59010
16976A039732o9855p1960m4081N9935J71814k29718q4856K04515k80137L15468
16966A010857j88305K7519o6150k39168K00780K85900q6562P0557j03007K06363
16956A118784k65191J52311p8617J52390J25910k47380p7114J29864J73585j35598
16946A048944J39198n82m3071m6324K77148l09065m8427J48341j39990K04991
16936A231163k56419L82232J02022m31620J50734J51058j15359N5409j7704J05785
16926A357301j23301k00115N78426k00930P5630l49156M28494l71317p7888P24850
$$ plain form
16916 1841994 1401693 1613489 1616816 1445098 1454403 1724187 1812574 1585342 1342101 1695145
16906 1695145 1924097 1768337 1533456 1709135 1847064 1401659 1413411 1725753 1861779 1764677
16896 1764677 1607618 2084366 1987094 2189061 1806283 1761409 1901923 1874475 1971975 1928966
16886 1928966 2126747 2491924 2102535 2340624 2076461 2382725 2172737 2271727 2351291 2502215
16876 2502215 2528406 2112090 2430105 2484199 2473905 2398043 3007212 2328335 2666549 2620001
16866 2620001 2703404 2729156 2988861 2417826 2947463 3074229 2813679 3543200 3088597 3066713
16856 3066713 3510707 3424299 3063261 2969270 3325599 3390865 3490734 3461996 3315031 3538908
16846 3538908 3708279 4009856 3885580 3836975 3973994 3836399 4139799 4237088 4194226 4218860
$$ packed form
16916A841994m40301K11796L327j71718R305K69784Q8387k27232k43241L53044
16906A695145K28952j55760k34881J75679J37929m45405J1752L12342J36026r7102
16896A764677j57059M76748r7272K01967l82778m4874J40514k7448R7500m3009
16886A928966J97781L65177l89389K38089k64163L06264k09988R8990P9564J50924
16876B502215K6191m16316L18015N4094j0294p5862O09169o78877L38214m6548
16866B620001Q3403K5752K59705n71035N29637J26766k60550P29521m54603k1884
16856C066713M43994q6408l61038r3991L56329O5266R9869k8738j46965K23877
16846C538908J69371L01577j24276m8605J37019j37595L03400R7289m2862K4634
$$ plain form
16836 4218860 4722479 4514088 4725451 4422789 4910522 4897380 4786006 4874911 5181685 5369278
16826 5369278 5006265 5266601 5414477 5396276 5654566 5774376 5568599 5743908 6333478 6124543
16816 6124543 6241060 6523640 6235651 6707823 6724907 7253601 7286837 7309541 7495289 7967926
16806 7967926 7798152 8100783 8262780 8453715 8496468 9052567 9041168 9159726 9641852 9640678
16796 9640678 10097330 10304260 10646809 11203373 11269716 11445574 11783664 12215231 12552052 12442288
16786 12442288 13108236 13855050 13912302 14070066 14874935 14743422 15580782 16192143 16668745
16777 16668745 17046250 17991983 18619469 18940675 19755033 20277433 21073402 21710790 22450567
16768 22450567 23389172 24237480 25422996 26241495 27608345 28516607 29843311 30609620 32082408
$$ packed form
16836D218860N03619k08391K11363l02662M87733j3142j11374Q8905L06774J87593
16826E369278l63013K60336J47876j8201K58290J19810k05777J75309N89570k08935
16816F124543J16517K82580k87989M72172J7084N28694L3236K2704J85748M72637
16806G967926j69774L02631J61997J90935M2753N56099j1399J18558M82126j174
16796I640678M56652K06930L42549N56564O6343J75858L38090M31567L36821j09764
16786A2442288O65948P46814N7252J57764Q04869j31513Q37360O11361M76602
16777A6668745L77505R45733O27486L21206Q14358N22400P95969O37388P39777
16768B2450567R38605Q48308J185516Q18499J366850R08262J326704P66309J472788
$$ plain form
16759 32082408 33631413 34571391 36229011 37956814 39854619 41617915 43580126 45465404
16751 45465404 47806072 50023899 52328436 55036635 57749623 60798663 64305038 67461686
16743 67461686 71072361 74750591 78660919 83301066 87578757 92194210 97277027 102461983
16735 102461983 107589045 113458280 119165994 124943085 130605910 136522248 142158962 147828375
16727 147828375 152934050 157698894 161980357 165311133 168121827 169820571 171219477 171681130
16719 171681130 170697251 168809108 166484771 162778846 159037483 154004613 149275556 143559769
16711 143559769 137673427 131842813 126167205 119903213 114323104 108835773 102954786 97446509
16703 97446509 92470547 87642007 82891783 78669064 74522847 70889151 67282736 63393167
$$ packed form
16759C2082408J549005R39978J657620J727803J897805J763296J962211J885278
16751D5465404K340668K217827K304537K708199K712988L049040L506375L156648
16743F7461686L610675L678230L910328M640147M277691M615453N082817N184956
16735A02461983N127062N869235N707714N777091N662825N916338N636714N669413
16727A47828375N105675M764844M281463L330776K810694J698744J398906M61653
16719A71681130r83879j888143k324337l705925l741363n032870m729057n715787
16711A43559769n886342n830614n675608o263992n580109n487331n880987n508277
16703I7446509m975962m828540m750224m222719m146217l633696l606415l889569
$$ plain form
16695 63393167 60462298 57564248 54617787 51726892 49256841 47148734 44832448 42940160
16687 42940160 40808751 39163152 37365399 35666446 34243211 32951266 31266812 30299143
16679 30299143 29064089 27806408 27051967 25933815 25027049 23804686 23000306 22226411 21088644
16670 21088644 20790768 19936605 19132942 18687600 17919552 17296258 16950790 16107073 16064025
16661 16064025 15188374 14487952 14489580 13864655 13502859 13014931 12440484 12374905 12254283 11718984
16651 11718984 11353111 10858817 10908471 10472713 10783819 10232786 9778746 9311122 9416066
16642 9416066 8823439 8998312 8524170 8342880 8260302 7939243 8069028 7683195 7411752 7393835
16632 7393835 7315343 7023151 6755597 6616627 6707752 6488461 6106425 6164699 6207893 6188536
$$ packed form
16695F3393167k930869k898050k946461k890895k470051k108107k316286j892288
16687D2940160k131409j645599j797753j698953j423235j291945j684454r67669
16679C0299143j235054j257681p54441j118152r06766j222363q04380p73895j137767
16670B1088644k97876q54163q03663m45342p68048o23294l45468q43717m3048
16661A6064025q75651p00422J628o24925l61796m87928n74447o5579j20622n35299
16651A1718984l65873m94294M9654m35758L11106n51033m54040m67624J04944
16642I416066n92627J74873m74142j81290q2578l21059J29785l85833k71443j7917
16632G393835p8492k92192k67554j38970R1125k19291l82036N8274M3194j9357
$$ plain form
16622 6188536 5789990 5733729 5346231 5538842 5203440 5213417 5111840 5318807 5134296 4908027
16612 4908027 5082782 4861978 4827533 4667134 4756657 4701389 4362100 4262459 4356421 4141644
16602 4141644 4041704 4021208 3979665 3854703 3801774 3713246 3747679 3865594 3636089 3558050 3196386
16591 3196386 3298825 3342110 3326064 3581874 3319658 3157899 2985944 2831828 3157314 2601539
16581 2601539 3120474 2894144 2782770 2845018 2908163 2662608 2948341 2734766 2129631 2422448
16571 2422448 2642741 2556025 2559828 2473434 2589725 2813045 2289095 2310054 2385840 1967194
16561 1967194 2762930 2136173 2296929 2614085 2244256 2174648 2274571 2189815 2141836 2288039
16551 2288039 2179776 2176206 2201645 2072023 1790286 1965108 1991518 1592389 1932097 1893230
$$ packed form
16622F188536l98546n6261l87498J92611l35402R977j01577K06967j84511k26269
16612D908027J74755k20804l4445j60399Q9523n5268l39289r9641R3962k14777
16602D141644r9940k0496m1543j24962n2929q8528L4433J17915k29505p8039l61664
16591C196386J02439M3285j6046K55810k62216j61759j71955j54116L25486n55775
16581B601539N18935k26330j11374O2248O3145k45555K85733k13575o05135K92817
16571B422448K20293q6716L803q6394J16291K23320n23950K0959P5786m18646
16561A967194P95736o26757J60756L17156l69829o9608R9923q4756m7979J46203
16551B288039j08263l570K5439j29622k81737J74822K6410l99129L39708l8867
$$ plain form
16541 1893230 1665659 1471211 1579249 1874810 1843171 1653010 1649479 1609343 1349763 1734873
16531 1734873 1644693 1466950 1360944 1661480 1549306 1666424 1421401 1507144 1564061 1471242
16521 1471242 1471729 1510734 1193373 1254152 1411848 1146725 1568318 1385348 1259601 1286038
16511 1286038 1369785 1336062 1254461 1141717 1296970 1612621 1061049 1086249 1153293 1309201
16501 1309201 1287503 1343341 1263850 1025291 1319344 987696 1073802 1016664 1160201 1158579 979763
16490 979763 1098692 850082 1044309 1027630 944472 995855 1073896 1056209 1152338 1164657 1238441
16479 1238441 960387 1092824 594749 1039557 1097547 1175560 1119612 1055893 1068893 732508
16469 732508 748898 967551 615938 861206 667740 703406 969392 899442 676728 831124
$$ packed form
16541A893230k27571j94448J08038K95561l1639j90161l531m0136k59580L85110
16531A734873r0180j77743j06006L00536j12174J17118k45023Q5743N6917r2819
16521A471242M87L9005l17361O0779J57696k65123M21593j82970j25747K6437
16511A286038Q3747l3723q1601j12744J55253L15651n51572K5200O7044J55908
16501A309201k1698N5838p9491k38559K94053l31648Q6106n7138J43537j622j78816
16490I79763J18929k48610J94227j6679q3158N1383P8041j7687R6129J2319P3784
16479A238441k78054J32437m98075M44808N7990P8013n5948o3719J3000l36385
16469G32508J6390K18653l51613K45268j93466L5666K65986o9950k22714J54396
$$ plain form
16459 831124 859894 754340 747337 854750 808542 688706 888306 870436 1239956 736749
16449 736749 676695 942480 999343 945716 762740 1157675 951609 1001379 1022746 497845
16438 562217 847550 606695 824840 354963 672545 575053 631763 802655 764100 797953
16428 797953 816582 680195 648502 545726 798639 433521 819438 578190 418966 1034987
16418 1034987 645886 605390 935306 679820 592748 640428 824519 746080 528791 768155
16408 768155 696536 460300 763958 465187 364126 699160 374111 553865 448949 771119
16398 771119 373214 480372 827322 527507 518121 839416 568896 533370 608617 519384
16388 519384 413827 713165 612193 670961 704201 697747 838325 272643 502429 552795
$$ packed form
16459H31124K8770j05554p003J07413m6208j19836J99600j7870L69520n03207
16449G36749o0054K65785N6863n3627j82976L94935k06066M9770K1367D97845
16438E62217K85333k40855K18145C54963L17582r7492N6710J70892l8555L3853
16428G97953J8629j36387l1693j02776K52913l65118L85917k41248j59224O16021
16418A034987l89101m0496L29916k55486q7072M7680J84091p8439k17289K39364
16408G68155p1619k36236L03658k98771j01061L35034l25049J79754j04916L22170
16398G71119C73214J07158L46950k99815r386L21295k70520l5526P5247q9233
16388E19384j05557K99338j00972N8768L3240o454J40578B72643K29786N0366
$$ plain form
16378 552795 590495 772630 618436 898158 599179 639991 1018468 688763 387604 320933
16368 320933 484953 351824 282673 685056 281624 481594 498574 302689 723888 401678
16358 401678 719243 165998 536963 424620 353339 524885 334829 328331 369097 399900
16348 399900 342100 499196 375926 531220 304941 664736 141867 523553 331472 294017
16338 294017 295049 812399 379849 339239 531504 234071 466264 172291 626423 288878
16327 195593 115420 321079 373667 481144 189029 470588 816228 300654 661674 422853
16317 422853 487058 356619 200873 123281 163148 489115 478900 281060 432223 667340
16307 667340 544834 317479 228317 71102 667356 109999 550270 503180 264681 216885
$$ packed form
16378E52795L7700J82135j54194K79722k98979M0812L78477l29705l01159o6671
16368C20933J64020j33129o9151M02383B81624J99970J6980j95885M21199l22210
16358D01678L17565A65998L70965j12343p1281J71546j90056o498M0766L0803
16348C99900n7800J57096j23270J55294k26279L59795A41867L81686j92081l7455
16338B94017J032N17350C79849m0610J92265B34071K32193A72291M54132B88878
16327A95593q0173K05659N2588J07477A89029K81559L45640C00654L61020k38821
16317D22853O4205j30439j55746p7592L9867L25967j0215j97840J51163K35117
16307F67340j22506k27355q9162G1102N96254A09999M40271m7090k38499m7796
$$ plain form
16297 216885 202354 34843 494154 80178 303474 307596 552808 189907 313488 318008 443219
16286 443219 -59836 346824 654801 441524 312267 263033 238288 173432 436689 567455
16276 567455 376883 324257 482666 98905 391221 618850 462165 3414 386833 303915
16266 303915 524667 320638 348127 489741 185529 401342 79545 90768 389611 427331
16256 427331 73336 196132 320278 -16015 64975 144821 134697 343408 185295 -29130 378478
16244 44783 524960 335401 135826 173564 120795 235871 297054 92612 236317 121569
16234 121569 484094 348574 532302 280622 312910 307633 337390 246545 251915 -101605 181061
16222 428411 327103 426191 221849 202722 35388 -45176 436668 245038 66474 281236
$$ packed form
16297B16885j4531C4843M59311H0178K23296M122K45212A89907J23581M520J25211
16286D43219e9836C46824L07977k13277j29257m9234k4745o4856K63257J30766
16276E67455j90572n2626J58409I8905K92316K27629j56685C414L83419q2918
16266C03915K20752k04029K7489J41614A85529K15813G9545J1223K98843L7720
16256D27331G3336J22796J24146a6015F4975P9846j0124K08711j58113b9130C78478
16244D4783M80177j89559A35826L7738n2769J15076O1183I2612J43705j14748
16234A21569L62525j35520J83728k51680L2288n277K9757r0845N370a01605A81061
16222D28411j01308R9088k04342j9127C5388d5176D36668j91630F6474K14762
$$ plain form
16212 281236 158755 251278 419376 437963 419182 50047 -101247 -207777 112279 167826
16202 167826 153843 319852 -122565 201139 459398 227185 161538 177621 11680 77372
16192 77372 216751 184402 -11054 -239714 608741 303161 -183062 285471 145373 182925
16182 182925 122982 48331 147630 170314 -101302 257696 -49630 129927 65788 246084 185891
16171 185891 180892 -152138 291523 535873 183373 120945 191051 387530 304877 126789
16160 246586 414817 -104695 3331 342883 300696 297809 -15490 136326 -174220 62031 209935
16149 209935 48067 400821 -167845 186301 -153135 37700 154288 75494 1585 -296421
16138 261817 71480 9233 248899 58303 238156 118652 -193854 123501 -293609 371777
$$ packed form
16212B81236j22481R2523J68098J8587j8781E0047a01247j06530A12279N5547
16202A67826j3983J66009a22565B01139K58259B27185o5647J6083A1680O5692
16192G7372J39379l2349a1054k28660F08741C03161a83062B85471j40098L7552
16182A82925n9943D8331R9299K2684a01302B57696d9630A29927o4139J80296o0193
16171A85891m999a52138B91523K44350A83373o2428P0106J96479q2653A26789
16160B46586J68231a04695C331L39552m2187k887a5490A36326a74220F2031J47904
16149B09935D8067L52754a67845A86301a53135C7700J16588G5494A585b96421
16138B61817G1480I233K39666E8303J79853A18652a93854A23501b93609C71777
$$ plain form
16127 94645 -128369 -154039 152756 -187633 -18323 -9390 1328 -53434 357626 -33424 69848
16115 168696 150937 126927 13848 -42856 361410 249975 -104283 229832 55304 360879
16105 360879 228447 9153 293970 221227 -245150 322234 -202362 113190 260951 -100203
16094 21627 -36544 -58650 460477 -27639 128701 384437 414035 -97407 -79687 61248 -97753
16082 226881 -144517 -135389 317060 342290 272230 -162799 156430 131689 306076 -66353 275699
16070 150480 -233887 -123705 225900 -162100 7352 -9066 -70699 266605 -147195 263409
16059 49106 119716 -40093 41011 272132 154778 24633 -82978 230593 -9435 -79333 -66497
16048 -66497 137737 -216193 100611 137095 244162 204695 112774 -97391 125844 94957 -187049
$$ packed form
16127I4645a28369k5670A52756a87633a8323Q933A328e3434C57626c3424F9848
16115A68696j7759k4010A3848d2856C61410j11435a04283B29832E5304L05575
16105C60879j32432I153K84817p2743b45150C22234b02362A13190J47761a00203
16094B1627c6544k2106D60477b7639A28701K55736K9598i7407J7720F1248i7753
16082B26881a44517R128C17060K5230p0060a62799A56430k4741J74387f6353B75699
16070A50480b33887J10182B25900a62100G352i066o1633B66605a47195B63409
16059D9106P0610d0093D1011K31121j17354B4633h2978B30593i435o9898J2836
16048f6497A37737b16193A00611L6484J07067l9467r1921i7391A25844l0887a87049
$$ plain form
16036 -28548 -316772 5716 17505 -463910 -40362 -119151 -112149 -48544 -146142 -59908 -102782 -214258
16024 -214258 59856 -318687 156675 203141 -255112 -199517 -192701 -389601 7962 -11897 96719
16012 -497157 207162 -77706 197604 -216275 194864 53331 75623 119109 -51516 -43392 225648
16000 135243 -186219 423815 -39292 82717 8206 -84254 -154773 -107386 -263049 -72386 -85261
15989 -85261 -171857 -46595 38338 -11732 -47599 172829 -67481 306189 262240 271133 133305
15977 68867 6048 3574 98793 -146095 -439201 -81132 169684 265647 -79032 -130645 10584
15965 -107319 186440 -14998 -110203 -40192 237127 38617 126545 19274 138423 59971 -149949
15953 -168429 -18819 38318 -254456 87567 114052 131167 -102859 19906 269112 -184352 53040
$$ packed form
16036b8548k88224E716J1789d63910d0362p8789P002d8544r7598e9908m2874j11476
16024b14258E9856c18687A56675M6466b55112N5595O816j96900G962a1897I6719
16012d97157B07162g7706A97604b16275A94864E3331K2292M3486e1516Q124B25648
16000A35243a86219D23815c9292H2717H206h4254p0519M7387j55663g2386j2875
15989h5261q6596d6595C8338a1732l5867A72829f7481C06189m3949Q893A33305
15977F8867F048k474R5219a46095k93106h1132A69684R5963g9032n1613A0584
15965a07319A86440a4998r5205d0192B37127C8617Q7928A9274J19149E9971a49949
15953a68429a8819C8318b54456H7567K6485J7115a02859A9906K49206a84352E3040
$$ plain form
15941 -14185 -175308 1269 -77625 61369 -411792 -129400 -151599 178711 -13011 166605 -27158
15929 187614 -219655 -200081 5098 -56813 19679 -77286 -80152 -6797 -3658 -293842 157433 -56054
15916 194219 322584 -159016 161126 -105016 -7419 429660 -159884 -6481 -244936 -92067
15905 46504 85700 -48614 13250 -142184 -29815 189402 194528 144598 175404 101326 -192301
15893 144874 -144879 -58342 78340 276331 95461 -13160 -252125 93940 190115 299172 -166845
15881 460319 -329475 -166048 242281 111001 93844 118737 -159309 158229 -135570 21877
15870 -133399 188 158320 -79755 -92518 -165186 103762 -252141 395475 29158 -440 234395
15858 -62277 -1525 -94389 -304104 58953 33310 86562 133240 -114658 -19920 -67786 -369475
$$ packed form
15941a4185j61123A269g7625F1369d11792a29400k2199A78711a3011A66605b7158
15929A87614b19655J9574E098e6813A9679g7286k866f797L139k90184A57433e6054
15916A94219J28365a59016A61126a05016g419D29660a59884f481k38455i2067
15905D6504L9196d8614A3250a42184b9815A89402N126m9930L0806p4078a92301
15893A44874a44879e8342G8340J97991I5461a3160k38965I3940R6175J09057a66845
15881D60319c29475J63427B42281A11001j7157K4893a59309A58229a35570B1877
15870a33399A88J58132g9755j2763p2668A03762b52141C95475B9158d40B34395
15858f2277a525r2864k09715E8953k5643N3252M6678a14658a9920m7866l01689
$$ plain form
15847 -369475 37052 -264004 -44722 62188 -139221 -39952 -214082 -71819 4998 -168016 -67430
15835 -135829 -84439 -249324 -89657 -141107 -144049 112104 -63813 -48152 -497774 -20096 -109569
15824 -109569 -120083 222010 -145943 -136403 106617 156502 173496 31349 -73972 43880 134819
15813 134819 303684 -5188 -71771 -105301 -36269 -178897 28050 -58092 161269 -500135 -235546
15801 -5181 -7762 -287833 192145 4364 89409 -270182 -42720 233975 23538 -339873 12340
15789 137424 -163855 112531 131129 -337120 -25459 433083 -12105 15931 -136406 -122019
15779 -122019 125074 16377 -3401 -57984 -288752 120262 -344738 187868 230707 -133884
15768 203812 -46839 -111136 298926 64122 -213440 31770 -34877 -222228 196454 -319047
$$ packed form
15847c69475C7052b64004d4722F2188a39221c9952j74130g1819D998a68016f7430
15835a35829N1390j64885h9657n1450k942A12104f3813J5661m49622b0096q9473
15824a09569j0514B22010a45943R540A06617M9885J6994C1349g3972D3880R0939
15813A34819J68865e188o6583l3530c6269j42628B8050e8092A61269e00135b35546
15801e181k581k80071A92145D364Q5045b70182d2720B33975B3538c39873A2340
15789A37424a63855A12531J8598c37120b5459D33083a2105A5931a36406J4387
15779a22019A25074A6377c401n4583k30768A20262c44738A87868M2839a33884
15768B03812d6839o4297B98926F4122b13440C1770c4877j87351A96454c19047
$$ plain form
15757 59877 -94096 -1812 -351259 110798 -50858 147111 -211204 281929 -236476 77989 -50101
15745 85319 -8415 -404684 420522 264128 78831 187451 -52627 177911 -1313 236367 257700
15734 257700 -84238 -46359 157537 -19923 994 -209008 114624 -215623 -505996 -21323 -196044
15723 -196044 198926 -32780 -54814 -13835 -32149 -191514 313573 -238916 53981 302993
15713 302993 -214831 -29287 52593 162048 182247 -322407 44468 -139847 -114053 -308591
15703 -308591 -419100 255930 -115516 -132292 -35439 26230 141616 -75068 -258575 9402 278688
15692 278688 -339085 48435 26204 -236619 308236 134195 -166745 -34858 107921 -298818
15681 328117 92650 39176 69458 -59067 -21230 -430980 -99581 138203 -164139 350813 -189100
$$ packed form
15757E9877i4096a812l49447A10798e0858A47111b11204B81929b36476G7989e0101
15745H5319h415l96269D20522j56394G8831J08620e2627A77911a313B36367K1333
15734B57700h4238L7879A57537a9923I94b09008A14624b15623k90373b1323j74721
15723a96044A98926c2780k2034a3835j8314j59365C13573b38916E3981K49012
15713C02993b14831b9287E2593J09455K0199c22407D4468a39847K5794j94538
15703c08591j10509B55930a15516j6776c5439B6230J15386g5068j83507I402K69286
15692B78688c39085D8435k2231b36619C08236A34195a66745c4858A07921b98818
15681C28117I2650C9176L0282e9067b1230m09750i9581A38203a64139C50813a89100
$$ plain form
15669 -63207 -35702 375021 247966 -311295 328697 -146535 69759 216781 -240934 -120371
15658 156840 -60379 103479 -147856 -138148 176349 86019 121921 75440 -280792 -24606 47022
15646 -226354 -194846 -61875 272021 99632 153773 -10747 -120191 42344 -71446 -55092 -55887
15635 -55887 -100931 129852 -253871 -257187 56003 -289986 -138499 41349 -105355 -55747 -240276
15624 -240276 -90884 -17123 34564 -67443 66031 215348 161760 -13356 151841 -277041 73251
15612 -126805 127498 -143231 84229 -214476 57505 -212404 -274336 -190017 -17013 -226618
15602 -226618 -169625 28688 -145777 116880 -34665 276569 87698 -67629 -22525 -107134 125330
15590 -263347 99224 161697 -69010 -62386 -169345 317390 -140846 -228675 192730 4638 -68112
$$ packed form
15669f3207K7505C75021j27055c11295C28697a46535F9759J47022b40934a20371
15658A56840f0379A03479a47856R708A76349H6019L5902m6481b80792b4606D7022
15646b26354L1508f1875B72021I9632N4141a0747j09444D2344g1446J6354p95
15635e5887m5044A29852b53871l316E6003b89986a38499D1349a05355M9608j84529
15624b40276i0884a7123C4564f7443F6031J49317n3588a3356A51841b77041G3251
15612a26805A27498a43231H4229b14476E7505b12404o1932Q4319a7013k09605
15602b26618N6993B8688a45777A16880c4665B76569H7698f7629b2525q4609A25330
15590b63347I9224O2473f9010O624j06959C17390a40846q7829A92730D638f8112
$$ plain form
15578 -18393 -853 -200865 55272 181183 188223 -41990 193193 -162466 21365 21849 -235257 -149498
15566 -149498 -307855 91787 -8857 -28637 286458 124135 15313 234042 25564 70480 -34252
15554 46813 -190438 85503 -10861 -318464 49499 39673 -392837 -96567 -283896 -233695 -221605
15543 -221605 26915 -304267 -22237 96033 61283 20395 48511 277932 -254103 132596 21149
15531 -537779 54074 -84850 -221129 -131093 -8462 125293 159240 -49854 69123 -101147 80919
15519 -243461 119621 -5666 -32215 126135 72212 45665 -277234 -44964 55374 -23833 254170
15507 122375 144350 -258876 -388592 -50623 117057 -122839 -232524 -202570 134970 71010
15497 71010 134669 59449 8044 51777 54248 159240 -51115 -122731 -122757 -265899 66544 -2961
$$ packed form
15578a8393h53k00012E5272J25911P040d1990A93193a62466B1365M84b35257Q5759
15566a49498j58357I1787h857j9780B86458A24135A5313K18729B5564M4916c4252
15554D6813a90438H5503a0861l07603D9499r826c92837i6567j87329N0201J2090
15543b21605B6915c04267b2237I6033l4750B0395K8116K29421b54103A32596B1149
15531e37779E4074h4850j36279R0036h462A25293L3947d9854F9123a01147H0919
15519b43461A19621e666k6549A26135n3923k6547b77234d4964E5374b3833B54170
15507A22375K1975b58876j29716e0623A17057a22839j09685K9954A34970o3960
15497G1010O3659E9449H044M3733K471J04992e1115p1616k6j43142F6544b961
$$ plain form
15484 92756 32861 -78855 377400 248980 140913 -341859 -157758 -307345 222012 -215912
15473 -78395 -219685 -2561 181425 -333142 -99055 241971 -100111 -28965 -50487 78421 99626
15462 99626 73597 -236208 -216650 91602 97042 -107503 230257 -13601 -132615 -105142 -74559
15451 -74559 179333 -286784 -177676 2163 130408 -478543 -257978 41346 57226 -361031
15440 -59919 310131 -170294 -118010 -94151 -447061 47579 -280998 46027 -40066 152625 388100
15429 388100 -94848 251077 -124785 23478 46483 45765 220950 -371128 225044 -61078 -351543
15418 -351543 30313 -176698 19758 -89967 -60144 23688 117020 79675 29586 248910 290874
15407 290874 51268 522337 -170094 175333 -14451 16927 -93252 -366199 238822 151395
$$ packed form
15484I2756C2861g8855C77400j28420j08067c41859a57758j49587B22012b15912
15473g8395j41290b561A81425c33142i9055B41971a00111b8965k1522G8421K1205
15462I9626k6029b36208J9558I1602N440a07503B30257a3601j19014K7473L0583
15451g4559A79333b86784J09108B163J28245d78543K20565D1346J5880c61031
15440e9919C10131a70294N2284K3859l52910D7579b80998D6027d0066A52625K35475
15429C88100i4848B51077a24785B3478K3005p18J75185c71128B25044f1078k90465
15418c51543C0313a76698A9758h9967K9823B3688R3332l7345B9586K19324M1964
15407B90874E1268M71069a70094A75333a4451A6927i3252k72947B38822q7427
$$ plain form
15397 151395 -482284 88353 57867 126817 26370 86798 -109173 205932 74440 -74721 -9557
15385 375068 144325 488 -139420 235917 -66738 -165826 -110452 -75949 177286 -98806 -215913
15374 -215913 -157128 -187614 63321 13411 32623 159275 -52727 112895 125748 46510 -76899
15362 81798 83542 45571 641 102378 229020 -193860 -135897 60059 -36952 -136449 140235
15350 137171 -19454 47886 -81616 -59138 -361633 80559 -201816 -57193 230111 8601 47873
15339 47873 210335 -115231 -163260 -380959 -271889 -84956 -266731 -93372 125788 207012
15329 207012 101294 -117531 274985 -97068 122667 -42571 335996 259592 -6037 245479
15318 45259 14086 184765 81458 242435 140925 -17418 4435 -213737 85754 -210428 4580
$$ packed form
15397A51395d82284H8353l0486O8950B6370O0428a09173B05932G4440g4721i557
15385C75068A44325D88a39420B35917f6738r9088N5374L4503A77286i8806j17107
15374b15913N8785l0486F3321A3411J9212J26652e2727A12895J2853D6510g6899
15362H1798J744l7971F41J01737J26642a93860N7963F0059c6952r9497A40235
15350A37171a9454D7886h1616K2478l02495H0559b01816e7193B30111H601L9272
15339D7873J62462a15231m8029k17699J09070h4956j81775i3372A25788Q1224
15329B07012A01294a17531B74985i7068A22667d2571C35996p6404f037B45479
15318D5259A4086J70679H1458J60977j01510a7418D435b13737H5754b10428D580
$$ plain form
15306 -38286 -222073 90318 965 286965 -305836 -191185 -170136 327302 307329 -4365 76992
15294 -94204 90036 349511 -76042 118646 -206067 409156 -110133 -138190 90562 97258 -17784
15282 -161431 52099 -94712 127182 55044 -293657 -238611 154469 -119825 282741 141364
15271 -97990 -140431 -152853 10629 550603 -213933 49409 -100099 267156 -45476 -205661 -78148
15259 9038 -142052 -25335 -75482 167254 -158068 19642 -107856 348725 -511 139460 211804
15248 211804 47373 -94504 -36365 108664 365668 -12139 -52796 -36462 -100046 49835 17731
15236 -173339 54380 -303112 -72843 246997 -1317 314808 109175 -4321 24046 -60599 -28516
15224 7556 -101940 -203466 64682 190507 -151327 -17686 -108226 88943 40876 -94772 166695
$$ packed form
15306c8286j83787I0318I65K86000c05836J14651K1049C27302j9973d365G6992
15294i4204I0036K59475g6042A18646b06067D09156a10133k8057I0562O696a7784
15282a61431E2099i4712A27182E5044b93657N5046A54469a19825B82741A41364
15271i7990m2441j2422A0629N39974b13933D9409a00099B67156d5476j60185g8148
15259I038a42052b5335n0147A67254a58068A9642a07856C48725e11A39460P2344
15248B11804D7373i4504c6365A08664K57004a2139m0657J6334o3584D9835A7731
15236a73339E4380c03112g2843B46997a317C14808A09175d321B4046f0599b8516
15224G556a01940j01526F4682J25825a51327a7686r0540H8943D0876i4772A66695
$$ plain form
15212 -159674 -98112 -108491 64455 177777 72041 83106 -78586 -180949 252198 84449 -198997
15200 -119261 -12386 -78190 337018 -2899 139502 258653 25318 32299 -117222 -71532 63714
15188 -55348 -59731 155409 52944 57118 410823 180113 89963 -103862 -28487 -19060 329060
15176 -123081 145475 260101 64193 19169 288110 314662 48587 -265258 183302 -10233
15165 -141574 143131 299323 -42963 -41411 -166974 -186390 -7719 188756 41258 49395 391739
15154 391739 131659 38404 103241 281754 265389 21086 291223 286307 -46339 361677 -103859
15142 6151 56804 92580 17792 189842 327842 238682 107578 -390527 622960 328865 -63729
15130 401461 -69759 199628 188675 92089 395053 297894 201250 -5513 43891 -168488 -66679
$$ packed form
15212a59674O1562j0379F4455J13322G2041J1065g8586j02363B52198H4449a98997
15200a19261a2386o5804C37018b899A39502J19151B5318O981a17222M5690F3714
15188e5348m383A55409E2944M174L53705A80113H9963a03862b8487R427C29060
15176a23081A45475J14626F4193A9169K68941K6552D8587b65258A83302a0233
15165a41574A43131J56192d2963J552j25563j9416g719A88756D1258Q137L42344
15154C91739A31659C8404O4837J78513j6365B1086K70137m916d6339C61677a03859
15142F151N0653L5776A7792J72050J38000q9160A07578c90527F22960k94095f3729
15130D01461f9759A99628j0953I2089L02964r7159r6644e513D3891a68488f6679
$$ plain form
15118 76337 311319 360839 207465 31390 -113836 169170 182282 293250 -35979 -90667 120104
15106 112518 55361 -197966 164990 452124 -74256 148174 38360 99844 249619 217147
15096 217147 -29885 133901 236065 -198824 -142452 55050 -109708 118582 344972 182065
15086 182065 225102 177206 304341 -170724 192769 186554 11738 78034 393368 5370 16941
15075 16941 48420 5966 366323 44179 394507 66228 84713 214389 94049 -3529 -145528
15064 -145528 -29947 144774 263064 172441 67904 71025 291448 -252581 629826 101766
15053 145590 277782 170601 -110452 244438 -35009 -229619 -130432 168905 140616 376623
15043 376623 31063 135788 141067 88453 42671 99162 144181 166668 238770 343024 72094
$$ packed form
15118G6337K34982M9520j53374C1390a13836A69170J3112J10968c5979n4688A20104
15106A12518E5361a97966A64990K87134g4256A48174C8360O1484J49775l2472
15096B17147b9885A33901J02164a98824N6372E5050a09708A18582K26390j62907
15086A82065M3037m7896J27135a70724A92769o215A1738O6296L15334E370J1571
15075A6941L1479E966L60357D4179L50328F6228J8485J29676I4049c529j41999
15064a45528b9947A44774J18290r0623F7904L121K20423b52581F29826A01766
15053A45590J32192j07181a10452B44438c5009j94610R9187A68905k8289K36007
15043C76623C1063J04725N279n2614D2671N6491M5019K2487P2102J04254G2094
$$ plain form
15031 -54486 -216551 81148 210031 51728 433986 66987 289826 193683 70582 111827 508852
15020 508852 52376 317351 102621 362222 163327 34997 344356 226329 212376 346930
15010 346930 258101 473672 279260 227466 189763 105965 77868 171622 22584 242384 74319
14998 111032 -261205 317020 129977 152749 443064 310138 74375 205302 214102 87641
14987 685714 111375 324027 53728 264925 281844 320628 203909 164773 462045 99173
14976 51302 11827 585667 111000 112411 187982 182472 295602 139887 275495 495806 413285
14965 413285 178847 195030 126618 260383 21469 128041 326298 282366 135877 75161
14955 75161 445537 404609 74471 143939 195528 153933 213117 414536 9150 24945 230559
$$ packed form
15031e4486j62065H1148J28883E1728L82258F6987K22839r6143G0582M1245L97025
15020E08852E2376K64975A02621K59601A63327C4997L09359j18027j3953J34554
15010C46930q8829K15571j94412n1794l7703q3798k8097R3754B2584K19800G4319
14998A11032b61205C17020A29977K2772K90315j32926G4375J30927Q800H7641
14987F85714A11375K12652E3728K11197J6919L8784j16719l9136K97272I9173
14976E1302A1827N73840A11000J411P5571n510J13130A39887J35608K20311q2521
14965D13285A78847J6183o8412J33765B1469J06572J98257m3932A35877o0716
14955G5161L70376m0928G4471O9468N1589m1595N9184K01419I150J5795K05614
$$ plain form
14944 230559 290196 259008 269879 386949 52373 86740 196339 448158 -75254 278600 315342
14933 315342 380767 262492 572309 683756 72342 243591 248287 483932 498701 297553
14923 297553 258963 340140 138558 548062 15204 168079 407076 237065 53189 169678
14913 169678 302807 144719 -63819 153191 78535 312412 286502 241511 110375 513474
14903 513474 -55651 422072 251282 427684 328153 248077 445787 247309 346328 438993
14893 438993 329830 470954 -21335 304800 361715 628355 193434 171779 326811 474178
14883 474178 201745 359347 497604 497606 395907 165697 251495 290490 390222 549593 275846
14872 275846 440293 2373 363987 64117 249286 436979 194019 322969 285115 343409
$$ packed form
14944B30559N9637l1188J0871J17070E2373L4367J09599K51819g5254B78600L6742
14933C15342O5425j18275L09817J11447G2342J71249M696K35645J4769k01148
14923B97553l8590Q1177A38558M09504A5204J52875K38997j70011E3189J16489
14913A69678J33129A44719f3819A53191p4656K33877k5910m4991A10375M03099
14903E13474e5651D22072j70790J76402r9531q0076J97710j98478R9019R2665
14893D38993j09163J41124b1335C04800N6915K66640A93434k1655J55032J47367
14883D74178B01745J57602J38257Kj01699A65697Q5798L8995R9732J59371k73747
14872B75846J64447B373L61614F4117J85169J87693A94019J28950l7854N8294
$$ plain form
14862 343409 112627 163234 612847 300947 344059 330557 368353 593862 625853 652353 64878
14850 529723 736271 400368 579410 293172 530849 530374 288886 391983 489587 430576
14840 430576 361078 187336 554812 586736 730925 243869 542774 427015 161307 550473
14830 550473 350817 330417 244348 432505 356400 57294 459451 421325 446607 395941 504368
14819 504368 457276 204590 484364 461567 388452 577114 358180 318448 345512 579802
14809 579802 511659 192377 730765 536565 929428 479936 527220 486548 458082 538680
14799 538680 448186 606913 290888 337721 688586 428302 788340 710580 272473 510593
14789 510593 406669 499516 608304 307680 654064 641182 343561 408745 503699 771767
$$ packed form
14862C43409A12627N0607M49613C00947M3112j3502L7796K25509L1991K6500F4878
14850E29723K06548l35903J79042k86238K37677m75k41488J03097R7604n9011
14840D30576o9498j73742L67476L1924J44189B43869K98905j15759A61307L89166
14830E50473j99656k0400q6069J88157p6105E7294M02157l8126K5282n0666J08427
14819E04368m7092B04590K79774k2797p3115J88662k18934l9732K7064K34290
14809E79802o8143A92377N38388j94200L92863m49492M7284m0672k8466Q0598
14799E38680r0494J58727B90888M6833L50865k60284L60038p7760B72473K38120
14789E10593j03924R2847J08788l00624L46384j2882k97621O5184R4954K68068
$$ plain form
14779 771767 608004 347466 736739 390689 632472 301030 608768 668487 277498 418378
14769 418378 75490 727361 736161 566941 509420 675767 506609 589325 859407 350630
14758 438239 786102 618889 712044 767904 531330 390131 691681 791452 372862 619372
14748 619372 395535 968932 474823 645493 955670 904025 612350 1008233 496245 655370
14738 655370 475265 756606 815914 613760 558017 602204 1010554 634322 696635 640593
14728 640593 478142 572292 501293 757137 761050 953434 858383 600727 710559 672599 851706
14717 851706 1006115 1073492 834049 539542 768100 954567 806090 703575 852906 829088
14707 829088 775375 589750 667425 1060114 771531 863211 1249702 794628 553961 850438
$$ packed form
14779G71767j63763k60538L89273l46050K41783C01030L07738N9719B77498J40880
14769D18378G5490O51871Q800j69220n7521J66347j69158Q2716K70082C50630
14758D38239L47863j67213R3155N5860k36574j41199L01550R9771C72862K46510
14748F19372k23837N73397D74823J70670L10177n1645k91675L95883D96245J59125
14738F55370j80105K81341N9308k02154n5743M4187M08350l76232O2313n6042
14728F40593j62451R4150p0999K55844L913J92384r5051k57656J09832l7960J79107
14717H51706J54409O7377k39443k94507K28558J86467j48477j02515J49331k3818
14707H29088n3713j85625P7675L92689k88583R1680L86491m55074k40667K96477
$$ plain form
14697 850438 637336 1104971 946067 655340 1057063 791678 1110040 468929 711114 1076001
14687 1076001 871160 427623 907467 913021 711561 1083119 734594 858050 1012379 1190751
14677 1190751 922153 984402 994371 976219 917782 1202239 991262 885209 978725 1244668
14667 1244668 1112448 934645 1065431 742553 1014160 1140721 787874 1038781 1219151
14658 1219151 1061243 1202566 912964 1191852 1027398 1245465 1482324 973107 1060736 1081815
14648 1081815 1013339 1104886 1257026 1266577 1340324 1228476 1132413 1000579 1276092 1288628 1337255
14637 1337255 1351754 1596731 1400658 1681472 1356084 1107623 1103878 1113134 1357541 1206006
14627 1206006 1038321 1214224 1047941 1207110 1293254 1296875 1467378 1507489 1355390 1187379
$$ packed form
14697H50438k13102M67635j58904k90727M01723k65385L18362D68929K42185L64887
14687A076001k04841D27623M79844N554k01460L71558l48525J23456J54329J78372
14677A190751k68598O2249R969j8152n8437K84457k10977j06053R3516K65943
14667A244668j32220j77803J30786l22878K71607J26561l52847K50907J80370
14658A219151j57908J41323k89602K78888j64454K18067K36859n09217Q7629K1079
14648A081815o8476R1547J52140R551P3747j11848r6063j31834K75513J2536M8627
14637A337255J4499K44977j96073K80814l25388k48461l745R256K44407j51535
14627A206006j67685J75903j66283J59169Q6144L621J70503M0111j52099j68011
$$ plain form
14617 1187379 1659213 967564 1566499 1299718 1625323 1686418 1420120 1688745 1726198 1644185
14607 1644185 1460293 1402096 1295447 1358916 1518702 1529495 1855884 1742645 1766819 1745770
14597 1745770 1727295 1640175 1785118 1840444 1777662 1849671 1762283 1677899 1779716 1575530 1706567
14586 1706567 1749963 1758011 1777878 1691116 1794342 2069628 2000107 1686433 1936364 1821952
14576 1821952 2143731 1902308 2026169 2181092 2252544 2476802 2075981 2349469 2359147 2011755
14566 2011755 2659764 2612016 2637156 2604375 2345017 2643291 2214994 3111930 3193467 3011324
14556 3011324 3304852 3371538 3630648 3779155 4226475 4815501 5972258 8047578 11947612
14547 11947612 19842245 33551419 37747801 20119057 9610819 5520828 3651482 2542582
$$ packed form
14617A187379M71834o91649N98935k66781L25605O1095k66298K68625L7453q2013
14607A644185j83892n8197j06649O3469J59786J0793L26389j13239K4174k1049
14597A745770j8475q7120J44943N5326o2782P2009q7388q4384J01817k04186J31037
14586A706567M3396Q048J9867q6762J03226K75286o9521l13674K49931j14412
14576A821952L21779k41423J23861J54923P1452K24258m00821K73488R678l47392
14566B011755O48009m7748K5140l2781k59358K98274m28297Q96936Q1537j82143
14556C011324K93528O6686K59110J48507M47320N89026J156757K075320L900034
14547A1947612P894633J3709174M196382j7628744I610819m089991j869346j108900
$$ plain form
14539 2542582 2153484 2342863 2243197 1997747 2264575 2150761 2002613 2162683 1961653 2057793
14529 2057793 2573511 2490954 2261647 2417649 2176801 2335659 2396879 2359202 2576300 2289047
14519 2289047 2696348 2606823 2746698 2586796 2524088 2740530 2823636 2734362 2716452 2886765
14509 2886765 3020020 2947949 2884186 2932366 2910714 3287197 2980759 3225809 3019488 3066802
14499 3066802 3234525 3321011 3191897 3136302 3268038 3589744 3415979 3422855 3531207 3399050
14489 3399050 3417089 3714106 3543559 3642270 3663260 3605212 4007980 3610165 3729329 4028163
14479 4028163 3872468 3725981 3910569 3981167 3901627 4545455 4153833 4284935 4434346 3776423
14469 3776423 4897868 4107441 4693014 4290751 4533395 4841645 4480403 4674336 5015883
$$ packed form
14539B542582l89098J89379r9666k45450K66828j13814j48148J60070k01030R6140
14529B057793N15718q2557k29307J56002k40848J58858O1220l7677K17098k87253
14519B289047M07301q9525J39875j59902o2708K16442Q3106q9274j7910J70313
14509B886765J33255p2071o3763M8180k1652L76483l06438K45050k06321M7314
14499C066802J67723Q6486j29114n5595J31736L21706j73765O876J08352j32157
14489C399050J8039K97017j70547R8711K0990n8048M02768l97815J19164K98834
14479D028163j55695j46487J84588P0598p9540O43828l91622J31102J49411o57923
14469C776423J121445p90427N85573m02263K42644L08250l61242J93933L41547
$$ plain form
14460 5015883 4847919 4924699 4897782 5396179 5038804 5284211 5317483 5416677 5169635 5307398
14450 5307398 5069759 5407029 5684153 5373998 5802112 5643662 6046110 6056772 6208628 6353909
14440 6353909 5768145 6229705 6554147 6624531 6481896 6294719 6659108 6404483 6739935 6784190
14430 6784190 7118602 6893096 7559761 7109649 7352082 7246631 7608971 7649441 7606092 8177851
14420 8177851 8022849 7794734 8418925 8816862 8351444 8709874 8719440 8830735 8905128 9146950
14410 9146950 8905396 9215079 9486080 9771685 9703719 9998212 9958213 10042421 10423541 10652776
14400 10652776 10769539 10829521 10881020 11043861 11361346 11393536 11579611 11998809 12494460 12397398
14390 12397398 12626011 12759941 12611655 13342510 13355391 13673366 14043551 14592049 14447463
$$ packed form
14460E015883j67964P6780k6917M98397l57375K45407L3272R9194k47042J37763
14450E307398k37639L37270K77124l10155M28114j58450M02448J0662J51856J45281
14440F353909n85764M61560L24442P0384j42635j87177L64389k54625L35452M4255
14430F784190L34412k25506O66665m50112K42433j05451L62340M0470m3349N71759
14420H177851j55002k28115O24191L97937m65418L58430R566J11295P4393K41822
14410I146950k41554L09683K71001K85605o7966K94493l9999Q4208L81120K29235
14400A0652776J16763N9982N1499J62841L17485L2190J86075M19198M95651r7062
14390A2397398K28613J33930j48286P30855J2881L17975L70185N48498j44586
$$ plain form
14381 14447463 14787360 15267035 15558069 15586182 15608552 16187789 16672693 16862273 16876617 17290642
14371 17290642 17762160 18043590 18631834 19171757 19460477 19875027 20117935 20593387 20786624
14362 20786624 21950457 22093131 22504791 22701218 23775193 23893742 24246697 25099956 25481006
14353 25481006 26386042 26716881 27528324 28174436 28877803 29571713 30398147 31151287 31735661
14344 31735661 32943212 33478988 34396797 35622927 35904627 36940153 38258927 39634855
14336 39634855 40388606 41337169 43163072 44022066 45146675 46335615 48136455 49751426
14328 49751426 51101201 52828870 54673992 56222569 57724456 59996274 61806613 64140040
14320 64140040 66112419 68604774 71280249 73528547 76324858 79020928 82395803 85088490
$$ packed form
14381A4447463L39897M79675K91034K8113K2370N79237M84904J89580J4344M14025
14371A7290642M71518K81430N88244N39923K88720M14550K42908M75452J93237
14362B0786624J163833J42674M11660J96427J073975J18549L52955Q53259L81050
14353B5481006R05036L30839Q11443O46112P03367O93910Q26434P53140N84374
14344C1735661J207551N35776R17809J226130K81700J035526J318774J375928
14336C9634855P53751R48563J825903Q58994J124609J188940J800840J614971
14328D9751426J349775J727669J845122J548577J501887K271818J810339K333427
14320F4140040J972379K492355K675475K248298K796311K696070L374875K692687
$$ plain form
14312 85088490 88827854 92288319 95638976 99761113 103805866 108186426 112532149 117466782
14304 117466782 122660358 127796845 133392315 139273614 145724692 152176161 158951708 166438786
14296 166438786 174437778 182469636 191254798 199940031 209356998 219981988 230180191 241028208
14288 241028208 252345429 264537202 276342051 289102441 302110059 315456210 328447918
14281 328447918 342300165 355486973 368669453 381514192 393635802 405042903 415239903
14274 415239903 423497500 428635769 431390819 432412832 432985677 433737555 432110843 429202325
14266 429202325 425847480 419880931 411965522 401733390 390284717 377537078 364293022
14259 364293022 350392951 336236822 321887829 307921582 293976640 280655243 267664286
$$ packed form
14312H5088490L739364L460465L350657M122137M044753M380560M345723M934633
14304A17466782N193576N136487N595470N881299O451078O451469O775547P487078
14296A66438786P998992Q031858Q785162Q685233R416967J0624990J0198203J0848017
14288B41028208J1317221J2191773J1804849J2760390J3007618J3346151J2991708
14281C28447918J3852247J3186808J3182480J2844739J2121610J1407101J0197000
14274D15239903Q257597N138269K755050J022013N72845P51878j626712k908518
14266D29202325l354845n966549p915409j0232132j1448673j2747639j3244056
14259C64293022j3900071j4156129j4348993j3966247j3944942j3321397j2990957
$$ plain form
14252 267664286 255279128 243035697 231480302 220567751 209882907 199978608 190602889
14245 190602889 181976014 173719285 165449353 158108477 150701316 144099661 137813866 131861986
14237 131861986 126334645 121150864 115655844 110862056 106307252 102412486 98621584 94334809
14229 94334809 91029431 87130291 84052629 80733075 77917114 75175844 71972233 70182745
14221 70182745 67599497 65077417 62955442 60912927 59106599 57027094 55223529 53458990
14213 53458990 51773109 50182555 48886171 47259902 45988323 44436423 43748022 42130064
14205 42130064 41030116 39801401 38709301 37544101 37254015 36063412 35031013 33670624
14197 33670624 33126561 32214178 31384374 30562319 30215006 29276550 28545919 27749423 27226103
$$ packed form
14252B67664286j2385158j2243431j1555395j0912551j0684844r904299r375719
14245A90602889q626875q256729q269932p340876p407161o601655o285795n951880
14237A31861986n527341n183781n495020m793788m554804l894766l790902m286775
14229I4334809l305378l899140l077662l319554k815961k741270l203611j789488
14221G0182745k583248k522080k121975k042515j806328k079505j803565j764539
14213E3458990j685881j590554j296384j626269j271579j551900o88401j617958
14205D2130064j099948j228715j092100j165200k90086j190603j032399j360389
14197C3670624n44063r12383q29804q22055l47313r38456p30631p96496n23320
$$ plain form
14188 27226103 26724602 25738585 25868678 24722586 24348717 23860014 23263179 22724177 22292878
14179 22292878 21817377 21327967 21369481 20366531 20145855 19639199 19313996 18896899 18206046
14170 18206046 17821868 17729395 17530704 17019372 17007484 16700006 16157770 15792599 15810883 15367560
14160 15367560 15390173 14802011 14358040 14423864 14167428 14011288 13501089 13687684 13348185 13122642
14150 13122642 12871984 12449905 12118643 12240872 12046278 11867632 11730880 11325423 11049976
14141 11049976 11468335 10710096 10874614 10301973 10567676 10223278 10065739 9944429 9609531
14132 9609531 9896620 9592002 9400147 9225276 9236434 9017088 8687951 8718849 8463713 8321771
14122 8321771 8145624 8215942 8188899 8128662 8112479 7766006 7783187 7569964 7579921 7590843 7715603
$$ packed form
14188B7226103n01501r86017J30093j146092l73869m88703n96835n39002m31299
14179B2292878m75501m89410M1514j002950k20676n06656l25203m17097o90853
14170A8206046l84178r2473j98691n11332j1888l07478n42236l65171J8284m43323
14160A5367560K2613n88162m43971O5824k56436j56140n10199J86595l39499k25543
14150A3122642k50658m22079l31262J22229j94594j78646j36752m05457k75447
14141A1049976M18359p58239J64518n72641K65703l44398j57539j21310l34898
14132I609531K87089l04618j91855j74871J1158k19346l29137L0898k55136j41942
14122H321771j76147P0318k7043o0237j6183l46473J7181k13223R957J0922J24760
$$ plain form
14111 7715603 7121750 7175869 7565265 6992686 7033809 6789937 6671777 7020761 6555083 6558746
14101 6558746 6098580 6307798 6425751 6257148 6078332 6097860 6030841 5932015 5746337 5798646
14091 5798646 5767415 5747991 5737639 5151329 5632558 5584450 5362372 5486024 5275175 5123660
14081 5123660 5170019 4977975 4796272 4712648 4727401 4956789 4612428 4704653 4488731 4703137
14071 4703137 4530016 4173583 4420695 4218762 4328835 4467787 4480218 4079107 4199650 4271421
14061 4271421 4288419 4209645 4356925 4217071 4009525 3991787 4239054 3844006 3869353 4045946
14051 4045946 3657750 4144395 3431392 3744886 3676934 3740247 3779057 3567971 3368858 3784799
14041 3784799 3325203 3273063 3395433 3565716 3222019 3122479 3306396 3022051 3048688 3404098
$$ packed form
14111G715603n93853N4119L89396n72579M1123k43872j18160L48984m65678L663
14101F558746m60166K09218J17953j68603j78816J9528o7019r8826j85678N2309
14091E798646l1231j9424j0352n86310M81229m8108k22078J23652k10849j51515
14081E123660M6359j92044j81703q3624J4753K29388l44361R2225k15922K14406
14071D703137j73121l56433K47112k01933J10073J38952J2431m01111J20543P1771
14061D271421J6998p8774J47280j39854k07546j7738K47267l95048K5347J76593
14051D045946l88196M86645p13003L13494o7952O3313L8810k11086j99113M15941
14041C784799m59596n2140J22370J70283l43697r9540J83917k84345K6637L55410
$$ plain form
14031 3404098 3626330 3404415 2911455 3258305 3012096 2951635 3147753 2941284 2740449 3153263
14021 3153263 2991579 2944099 2826745 2832357 2859339 2896625 2702030 2727116 2829976 2456833
14011 2456833 2771742 2739881 2480880 2983699 2451045 2118106 2170312 2274070 2392339 2228652
14001 2228652 2122308 2643822 2424871 2329017 2199730 2553085 2305240 2389442 2416801 2547030
13991 2547030 3065679 3446163 4337919 7717292 14174548 28457885 40120425 26101769
13983 26101769 15266193 9501189 6300293 5172815 4467476 3841727 3836974 3571157 2895647
13974 2895647 2888680 2620278 2570794 2666553 2762010 2961452 2517171 2565772 2504677 2595422 2514802
13963 2514802 2433823 2214379 2312212 2317389 2405444 2223256 2379937 1971972 2279313 2428812
$$ packed form
14031C404098K22232k21915m92960L46850k46209o0461J96118k06469k00835M12814
14021C153263j61684m7480j17354N612K6982L7286j94595K5086J02860l73143
14011B456833L14909l1861k59001N02819n32654l32939N2206J03758J18269j63687
14001B228652j06344N21514k18951r5854j29287L53355k47845Q4202K7359J30229
13991B547030N18649L80484Q91756L379373O457256J4283337J1662540j4018656
13983B6101769j0835576n765004l200896j127478p05339o25749m753k65817o75510
13974B895647o967k68402m9484R5759R5457J99442m44281M8601o1095R0745q0620
13963B514802q0979k19444R7833N177Q8055j82188J56681m07965L07341J49499
$$ plain form
13953 2428812 2293417 2019114 2036829 1926867 2102118 2148567 2137519 1771082 1883509 2034848
13943 2034848 1893949 2185681 1805656 1830836 1970076 1841148 1480307 1637037 1978984 1865923
13933 1865923 1700228 1691813 1833820 1615884 1504049 1826910 1533985 1704640 1804416 1754792
13923 1754792 1679574 1549190 1539387 1597939 1447153 1632503 1519982 1673469 1575121 1582722 1382713
13912 1382713 1372261 1540787 1714893 1584826 1392928 1687645 1604765 1626655 1763199 1270433
13902 1270433 1447818 1386769 1693687 1302279 1619201 1386474 1730096 917495 1443794 1313646
13892 1313646 1070714 1172856 1399500 1497427 1408938 1186084 1293006 1330901 1436586 1379628
13882 1379628 1214655 1365889 1263865 1421028 1269792 1202738 1501763 1473404 1226199 1059771
$$ packed form
13953B428812j35395k74303J7715j09962J75251M6449j1048l66437J12427J51339
13943B034848j40899K91732l80025K5180J39240j28928l60841J56730L41947j13061
13933A865923j65695q415J42007k17936j11835L22861k92925J70655R9776m9624
13923A754792p5218j30384r803N8552j50786J85350j12521J53487r8348P601k00009
13912A382713j0452J68526J74106j30067j91898K94717q2880K1890J36544m92766
13902A270433J77385o1049L06918l91408L16922k32727L43622q12601N26299j30148
13892A313646k42932J02142K26644R7927q8489k22854J06922L7895J05685n6958
13882A379628j64973J51234j02024J57163j51236o7054K99025k8359k47205j66428
$$ plain form
13872 1059771 1386243 1549777 838132 1136474 1176020 1122181 1074318 1017826 1219392 1215933
13862 1215933 1413311 1523193 1360804 1266605 1222738 980125 1164597 1750915 1338687 927401
13852 927401 1097828 763209 759933 1270184 891174 1120526 1066516 1044796 1243334 776146
13842 776146 1054842 1400415 1076544 980402 851226 872939 876229 1075394 1337259 1035682
13832 1035682 1136438 1028653 981754 1053226 790065 1083051 934485 925491 762153 809054
13822 809054 896738 987146 872971 1234985 1267282 1015165 941922 776016 765738 660815
13812 660815 968025 946024 924454 1068213 928527 669564 1004183 946586 1263751 761905
13802 761905 744653 863567 1047717 949764 703739 602080 1200808 833007 755252 811205
$$ packed form
13872A059771L26472J63534p11645K98342L9546n3839m7863n6492K01566l459
13862A215933J97378J09882j62389r4199m3867k42613J84472N86318m12228m11286
13852I27401J70427l34619l276N10251l79010K29352n4010k1720J98538m67188
13842G76146K78696L45573l23871r6142j29176K1713L290J99165K61865l01577
13832A035682J00756j07785m6899P1472k63161K92986j48566q994j63338M6901
13822H09054Q7684R0408j14175L62014L2297k52117p3243j65906j0278j04923
13812F60815L07210k2001k1570J43759j39686k58963L34619n7597L17165n01846
13802G61905j7252J18914J84150r7953k46025j01659N98728l67801p7755N5953
$$ plain form
13792 811205 854691 682954 752715 653001 739766 824971 822528 623175 690472 1120426 692671
13781 692671 490254 1083002 942677 779675 939019 556221 694892 731400 465163 1038209
13771 1038209 769335 645484 1070116 479891 560892 518179 856037 1133172 543429 660900
13761 660900 776143 659769 672206 394657 655839 561205 347018 720389 659947 683181
13751 683181 756154 568767 433899 752466 636609 786491 502375 987197 603935 737458
13741 737458 921370 698524 770850 978596 819268 770325 896866 661901 632083 540715
13731 540715 509963 388173 605337 342545 568681 748565 561423 340412 659465 519235
13721 519235 366062 403639 518547 763319 502145 408020 868363 708730 515633 614382
$$ packed form
13792H11205M3486j71737O9761r9714Q6765Q5205k443j99353O7297M29954m27755
13781F92671k02417N92748j40325j63002J59344l82798J38671L6508k66237N73046
13771A038209k68874j23851M24632D79891Q1001m2713L37858K77135E43429J17471
13761F60900J15243j16374J2437k77549K61182r4634k14187L73371o0442K3234
13751F83181P2973j87387j34868L18567j15857J49882k84116M84822l83262J33523
13741G37458J83912k22846P2326K07746j59328m8943J26541k34965k9818r1368
13731E40715l0752j21790K17164k62792K26136J79884j87142k21011L19053j40230
13721E19235j53173L7577J14908K44772k61174r4125M60343j59633j93097R8749
$$ plain form
13711 614382 689337 865924 602910 463905 402014 767569 601838 765935 457806 685374
13701 685374 597794 350127 623902 544354 654745 622389 302602 622001 498232 661126
13691 661126 882660 439995 660699 634432 328900 584558 413601 339417 141184 639826
13681 639826 488850 508401 857975 531609 789435 849382 669245 772698 436767 479268
13671 479268 928048 370917 298658 138850 333483 509583 524329 414612 176569 499970
13661 499970 414564 748789 299003 372956 657801 300565 362684 502148 572229 489907
13651 489907 460619 499211 202045 235662 583660 280005 623903 295912 479383 670942
13641 670942 621894 462914 580988 949931 194837 728978 320795 366705 506468 303605
$$ packed form
13711F14382P4955J76587k63014j39005o1891L65555j65731J64097l08129K27568
13701F85374q7580k47667K73775p9548J10391l2356C02602L19399j23769J62894
13691F61126K21534D39995K20704k6267l05532K55658j70957p4184A41184M98642
13681F39826j50976J9551L49574l26366K57826N9947j80137J03453l35931M2501
13671D79268M48780C70917p2259A38850J94633J76100J4746j09717A76569L23401
13661D99970q5406L34225B99003P3953K84845C00565O2119J39464P0081q2322
13651D89907k9288L8592B02045L3617L47998B80005L43898B95912J83471J91559
13641F70942m9048j58980J18074L68943A94837N34141C20795M5910J39763k02863
$$ plain form
13631 303605 329298 229205 342103 556846 426160 407140 662888 651626 248817 281193
13621 281193 114791 436686 307739 627886 457943 518596 277591 323648 150804 40474
13610 463374 449880 620939 572392 505798 678648 442150 372308 583278 26485 433605
13600 433605 648378 240831 493504 402774 390052 647321 183054 502511 195402 376449
13590 376449 314017 -168 545871 291102 28433 93528 289880 79410 521788 389298 633607
13579 633607 363101 448005 133659 277501 548094 584726 431027 553659 279777 289894
13569 289894 702181 189938 536842 462791 296328 618885 219166 268230 255291 6548
13558 739363 427824 397282 198679 561706 654617 217999 118010 314230 497905 215580
$$ packed form
13631C03605K5693j00093J12898K14743j30686j9020K55748j1262B48817L2376
13621B81193A14791L21895j28947L20147j69943O0653k41005M6057A50804D0474
13610D63374j3494J71059m8547o6594J72850k36498o9842K10970B6485M07120
13600D33605K14773B40831K52673r0730j2722K57269A83054L19457A95402J81047
13590C76449o2432a68E45871k54769B8433O5095J96352G9410M42378j32490K44309
13579F33607k70506Q4904A33659J43842K70593L6632j53699J22632k73882J0117
13569B89894M12287A89938L46904p4051j66463L22557B19166M9064j2939F548
13558G39363l11539l0542j98603L63027R2911B17999r9989J96220J83675B15580
$$ plain form
13547 396984 106125 190725 508452 333634 251237 249058 280432 266789 256874 363669 321449
13536 321449 526877 377694 334036 350985 438065 153904 474025 182975 353369 560252
13526 560252 248594 239221 172132 345307 416636 -32124 -34663 104119 280527 29648 362942
13515 362942 233416 379915 306094 477276 208159 91211 382372 418964 236153 148434
13505 148434 289036 312188 44453 60740 430697 362089 -122662 177109 435725 130647
13494 261048 234277 206099 349377 340973 426105 282367 461335 253585 128416 471676
13484 471676 43468 319707 232598 337812 198522 154293 40415 263047 356361 196070
13474 196070 220853 119786 303951 391461 81830 268375 9501 379562 431147 8694 127122
$$ packed form
13547C96984A06125Q4600L17727j74818q2397k179L1374j3643r915J06795m2220
13536C21449K05428j49183m3658J6949Q7080A53904L20121A82975J70394K06883
13526E60252B48594r373o7089J73175P1329c2124k539A04119J76408B9648L33294
13515C62942j29526J46499p3821J71182B08159I1211K91161L6592j82811q7719
13505A48434J40602K3152D4453J6287L69957o8608a22662A77109K58616A30647
13494B61048k6771k8178J43278q404Q5132j43738J78968k07750j25169L43260
13484D71676D3468K76239q7109J05214j39290m4229D0415K22632R3314j60291
13474A96070K4783j01067J84165Q7510H1830J86545I501L70061N1585H694J18428
$$ plain form
13463 127122 133097 311086 121584 -44664 289567 158354 396481 494434 372789 -168568
13452 620237 229472 277567 493828 358032 336673 597284 425548 592846 558878 246326
13441 423047 336580 91027 290145 516635 163334 559888 187910 257284 217816 98464
13430 -42847 372999 135666 112702 -15196 524558 360711 114076 318470 179434 211204
13420 211204 284889 297840 111005 165803 -106551 401366 571490 40599 258814 127825
13409 161887 307909 82994 402190 381595 -27388 106290 105707 96524 514671 50472 222198
13398 222198 335837 405685 142951 59955 187007 264911 104872 241649 176448 126699
13388 126699 29411 112371 -23349 181211 471957 -34139 90163 177938 283720 433223 246082
$$ packed form
13463A27122N975J77989A21584d4664B89567j31213K38127R7953j21645a68568
13452F20237B29472M8095K16261j35796k1359K60611j71736J67298l3968B46326
13441D23047q6467I1027J99118K26490A63334L96554A87910O9374l9468I8464
13430d2847C72999A35666k2964a5196E24558j63847A14076K04394j39036L1770
13420B11204P3685J2951A11005N4798a06551D01366J70124D0599K18215A27825
13409A61887J46022H2994L19196k0595b7388A06290n83r183M18147E0472J71726
13398B22198J13639O9848A42951E9955J27052P7904A04872J36777o5201m9749
13388A26699B9411Q2960b3349A81211K90746c4139I0163Q7775J05782J49503j87141
$$ plain form
13377 246082 -136122 81494 321173 -7661 -24806 284729 562963 18855 328043 176656
13367 176656 279329 463344 173262 271872 49344 135643 285740 -3519 257899 133224
13357 133224 253531 425344 111013 187195 222970 -90559 280073 317987 223535 78487 299026
13346 299026 456283 266346 331458 291522 73711 33522 194559 445655 437580 -1530 199182
13334 202681 810522 241860 21842 222329 24106 322492 -71347 56915 585289 281636
13323 -197550 371275 203397 236334 81677 403064 211922 58543 368111 81158 -22085
13312 312982 342776 -194114 290158 -166574 -24142 216698 212791 325737 172738 119506
13302 119506 209558 -323020 291592 -9176 66307 397906 283331 234188 128899 69005 273188
$$ packed form
13377B46082a36122H1494K39679g661j7145B84729K78234A8855L09188j51387
13367A76656J02673J84015A73262R8610D9344Q6299J50097c519B57899j24675
13357A33224J20307J71813A11013P6182L5775i0559B80073L7914r4452G8487K20539
13346B99026J57257j89937O5112l9936G3711C3522J61037K51096q075a530A99182
13334B02681O07841B41860B1842K00487B4106K98386g1347E6915N28374B81636
13323a97550C71275j67878L2937H1677L21387j91142E8543L09568H1158b2085
13312C12982K9794a94114B90158a66574b4142B16698l907J12946j52999n3232
13302A19506R0052c23020B91592i176F6307L31599j14575m9143j05289n9894K04183
$$ plain form
13291 273188 -89242 44887 -118416 65602 243854 -49282 112688 -44577 -268755 107717
13280 199400 298362 26784 378091 49733 295169 207490 232819 188463 -205327 231480 397665
13269 397665 97704 156355 156161 122314 385893 -18936 78991 123962 106360 -243131 359847
13257 335984 670247 309939 173432 -60958 230533 399773 312553 314322 112573 129564
13247 129564 292604 204878 30468 -6525 308986 -38811 -47062 16885 192189 225827 260365
13236 260365 334609 50993 394269 104977 14392 148348 191685 -44937 -290915 275135
13225 28361 -49182 5023 246231 68476 -21199 270931 49727 242215 -213916 183775 222274
13214 222274 121626 144518 228439 100999 -172626 -3587 183308 485170 491768 -19172 1413
$$ packed form
13291B73188h9242D4887a18416F5602J78252d9282A12688d4577k24178A07717
13280A99400R8962B6784L51307D9733K45436q7679K5329m4356b05327B31480J66185
13269C97665I7704N8651j94l3847K63579a8936G8991M4971j7602b43131C59847
13257C35984L34263C09939j36507f0958B30533J69240q7220J769A12573J6991
13247A29564J63040q7726C0468f525C08986c8811q251A6885J75304L3638L4538
13236B60365P4244E0993L43276A04977A4392J33956M3337d4937k45978B75135
13225B8361d9182E023K41208F8476b1199B70931D9727J92488b13916A83775L8499
13214B22274j00648K2892Q3921A00999a72626c587A83308L01862O598a9172A413
$$ plain form
13202 168548 -150091 -212379 79906 497922 2673 -212685 -70615 -15165 44129 -80882 292976
13190 257091 88528 -219909 269573 428407 -129567 248900 21996 371428 120780 -87670
13179 190350 264667 210391 412383 380362 -62660 -56273 97478 298516 170937 -141636 65820
13167 146628 -78192 -40088 9955 -219672 143481 11611 190002 44092 235043 -280177 -14217
13155 159070 300137 426625 347040 162102 21175 113559 -194638 134355 244488 -473032
13144 393472 83543 26458 36351 101424 -42088 288254 84852 227934 -108369 6280 -8869
13132 375459 -154858 83399 -191513 146570 -128086 279480 143224 -39283 241369 44593
13121 92397 -190634 250613 90695 74130 68838 248610 -253065 218858 -95158 28196 22688
$$ packed form
13202A68548a50091o2288G9906M18016B673b12685g0615a5165D4129h0882B92976
13190B57091H8528b19909B69573J58834a29567B48900B1996L49432A20780h7670
13179A90350P4317n4276K01992l2021f2660O387I7478K01038j27579a41636F5820
13167A46628g8192L8104I955b19672A43481A1611J78391D4092J90951b80177a4217
13155A59070J41067J26488p9585A62102B1175R2384a94638A34355J10133d73032
13144C93472H3543B6458R893O5073d2088B88254H4852J43082a08369F280h869
13132C75459a54858H3399a91513A46570a28086B79480j36256c9283B41369D4593
13121I2397a90634B50613I0695j6565n292J79772b53065B18858i5158B8196n508
$$ plain form
13110 22688 40868 110630 99263 219998 249453 -34263 365427 124075 305824 -48194 16625
13098 265336 302520 -50819 80330 -47459 -146308 -70937 127334 -129787 139979 -42072 39565
13086 100497 151331 68514 125490 203856 107301 240606 351995 309293 -26413 71833 86385
13075 86385 253019 190673 64191 85566 247869 43580 215373 213447 1731 39505 63479
13064 63479 241173 17347 139132 43470 286424 235303 218430 56086 8575 30833 -211964
13052 57131 -41827 -71928 494973 153755 208938 151154 220843 7369 333578 333485 344686 -87
13039 37205 404398 154343 17657 79794 97885 93382 176797 48284 172525 170740 20070
13027 188591 -65426 60216 -136465 53424 -38431 355942 64008 185629 101417 395813 110314
$$ packed form
13110B2688J8180O9762j1367J20735K9455c4263C65427A24075J81749d8194A6625
13098B65336L7184e0819H0330d7459r8849g0937A27334a29787A39979d2072C9565
13086A00497N0834F8514N6976P8366r6555J33305J11389m2702b6413G1833J4552
13075H6385J66634o2346F4191K1375J62303D3580J71793j926A731L7774K3974
13064F3479J77694A7347J21785D3470K42954n1121j6873E6086H575K2258b11964
13052E7131d1827l0101D94973A53755N5183n7784O9689G369L26209r3J1201h7
13039C7205L67193A54343A7657O2137J8091m503Q3415D8284J24241j785B0070
13027A88591f5426F0216a36465E3424c8431C55942F4008J21621q4212K94396A10314
$$ plain form
13015 45789 -164858 235824 207449 -67170 183524 121815 -10809 100750 225541 41777 -91371
13003 -97440 -113551 54664 136801 36313 370608 170291 104604 77404 344825 315174 -106593
12991 166834 296248 -23409 351387 -80097 -170755 259126 112034 254989 -128794 191596
12980 263827 -66410 205605 -161697 350871 336198 100600 304286 34268 60783 4383 -106144
12968 92991 26102 83164 357203 172835 51289 118450 -271312 179238 8113 14781 140462
12957 140462 95160 -274895 -38412 219518 -15827 173881 8981 82195 4474 364633 149854
12945 -60746 107321 135022 -195298 115191 292058 -44374 433442 -213704 -124208 -147878
12935 -147878 -36818 8614 -175961 107495 356725 199269 184995 -289219 237219 52782
$$ packed form
13015D5789a64858B35824k8375f7170A83524o1709a0809A00750J24791D1777i1371
13003i7440j6111E4664Q2137C6313L34295A70291o5687k7200K67421k9651a06593
12991A66834J29414b3409C51387h0097r0658B59126A12034J42955a28794A91596
12980B63827f6410B05605a61697C50871j4673A00600K03686C4268K6515D383a06144
12968I2991B6102N7062K74039A72835E1289O7161b71312A79238H113O668J25681
12957A40462m5302b74895c8412B19518a5827A73881H981P3214D474L60159A49854
12945f0746A07321K7701a95298A15191J76867d4374D33442b13704Q9496k3670
12935a47878c6818H614a75961A07495K49230j57456j4274b89219B37219E2782
$$ plain form
12924 -156666 -161896 67913 435652 93802 231889 124666 172551 160630 -300573 -56873 78037
12912 46909 71767 -28800 -26082 130518 142160 -240933 -120642 -134538 -257055 -415984 276626
12900 -86467 -230593 281391 155286 -72664 55184 75689 140960 323145 212828 220691 224104
12889 224104 250468 8246 -91564 87810 -84154 295254 -401276 -99560 -8570 -51396 -147267
12878 -147267 -296410 -210432 112654 51524 55198 146749 -100598 141575 -100909 -48532 79418
12866 45986 154860 -181873 63652 132035 46011 -48202 156847 195167 103576 91096 -210801
12854 -96226 -160540 205270 23825 -371557 -171992 -194986 200151 -290293 -9535 216629 -52225
12842 110630 321254 462029 359805 79692 -168246 -176361 -103327 99332 -132851 341228
$$ packed form
12924a56666n230F7913L67739I3802J38087j07223M7885j1921c00573e6873G8037
12912D6909K4858b8800K718A30518J1642b40933J20291j3896j22517j58929B76626
12900h6467j44126B81391j26105g2664E5184K0505O5271J82185j10317P863L413
12889B24104K6364H246i1564H7810h4154B95254d01276i9560h570m2826r5871
12878a47267j49143Q5978A12654E1524L674R1551a00598A41575a00909d8532G9418
12866D5986J08874a81873F3652O8383D6011d8202A56847L8320r1591j2480b10801
12854i6226o4314B05270B3825c71557a71992k2994B00151b90293i535B16629e2225
12842A10630K10624J40775j02224G9692a68246q115P3034I9332a32851C41228
$$ plain form
12831 -46209 -50659 -104149 -41486 19178 -41547 -210286 61390 -421533 -157967 -341080 -150250
12819 320083 190923 88088 59895 -249505 228510 40548 40267 138353 -88849 -4239 -120977
12808 -120977 12907 -13500 146313 41993 -185380 190721 -172272 104026 142640 185027
12798 185027 369967 64760 141528 204351 -268829 -32335 -159988 89404 68779 80 -103750
12786 -19071 -113428 181187 -23432 -237019 -60480 -417 48226 5393 10895 109052 4926 255136
12774 255136 292596 133840 -134989 -203030 157049 -84040 -275419 160604 -97270 -271456
12764 -271456 -291628 38175 56671 173136 -228603 -109843 -158797 -133839 -179541 -254353 -101253
12752 28746 361596 -3990 -53058 154156 183072 84016 -190892 217969 109253 97311 204517
$$ packed form
12831d6209m450n3490d1486A9178d1547j68739F1390d21533a57967j83113a50250
12819C20083j29160H8088k8193b49505B28510D0548k81R8086h8849d239j16738
12808a20977A2907a3500A46313D1993a85380A90721a72272A04026L8614M2387
12798A85027J84940F4760P6768O2823b68829c2335j27653H9404k0625H0a03750
12786a9071r4357A81187b3432k13587f0480d17D8226E393N502R8157D926K50210
12774B55136L7460A33840a34989o8041A57049h4040j91379A60604i7270j74186
12764b71456k0172C8175J8496J16465b28603a09843m8954K4958m5702p4812a01253
12752B8746L32850c990m9068A54156K8916H4016a90892B17969j08716j1942J07206
$$ plain form
12741 204517 139463 239993 10898 -27314 259267 135777 90999 90053 64732 -201201 433514
12729 383636 326902 212848 -128693 -128883 -59460 14020 -102184 -4983 -278469 68516 239953
12718 239953 310514 55483 -215432 386834 -149527 -88149 -69591 163476 160003 616533 381274
12707 381274 311617 216591 46188 -27053 473645 222375 -182314 32276 177665 -129586
12696 -199444 371120 69972 71176 103574 -69174 114547 163451 71257 57531 -51613 315187
12684 -105388 177007 396305 173699 -289612 327193 -25524 135312 71153 -105582 121889
12673 91720 218931 302779 -22820 101140 2580 -123307 104646 -93570 56488 9445 -175930
12661 144823 -249926 89171 160460 313918 259092 184871 205108 89513 82437 297563 398184
$$ packed form
12741B04517o5054J00530A0898b7314B59267j23490m4778r46k5321b01201D33514
12729C83636n6734j14054a28693j90e9460A4020a02184d983k73486F8516J71437
12718B39953P0561E5483b15432C86834a49527O1378J8558A63476l473M56530k35259
12707C81274o9657r5026D6188b7053D73645B22375a82314C2276J45389a29586
12696a99444C71120F9972J204L2398f9174A14547M8904G1257j3726e1613C15187
12684a05388A77007K19298A73699b89612C27193b5524A35312o4159a05582A21889
12673I1720J27211Q3848b2820A01140B580a23307A04646i3570E6488I445a75930
12661A44823b49926H9171P1289J53458n4826p4221K0237H9513p076K15126J00621
$$ plain form
12650 398184 313873 -284550 14825 -29926 -52050 265895 -67615 -139224 -37847 187202 386630
12639 386630 170637 -52367 -188464 -2165 140455 147631 257328 288623 -56794 106586 482337
12628 482337 283932 268325 35677 306717 72011 188421 -133245 137715 90459 -184098
12617 -36938 150147 -143384 157341 256343 178914 86059 214882 188307 -186861 211205
12606 5041 -233880 2032 -102030 138173 209876 213097 138909 640865 -43890 80528 51478
12595 51478 115067 -77869 83261 141010 37539 -167268 56498 123844 58132 381942 148666
12583 22521 57278 117807 202668 -68719 129508 -107797 180376 109131 409037 116137 -77723
12571 12070 223330 95986 155378 227138 49562 -4451 61976 -59686 -110604 -237428 301563
$$ packed form
12650C98184q4311b84550A4825b9926k2124B65895f7615p1609c7847A87202J99428
12639C86630A70637e2367j36097b165A40455P176J09697L1295e6794A06586L75751
12628D82337j98405j5607C5677K71040G2011J16410a33245A37715m7256a84098
12617c6938A50147a43384A57341R9002p7429H6059J28823k6575a86861B11205
12606E041b33880B032a02030A38173P1703L221p4188N01956d3890H0528k9050
12595E1478O3589g7869H3261N7749C7539a67268E6498O7346E8132L23810A48666
12583B2521L4757O0529Q4861f8719A29508a07797A80376p1245K99906A16137g7723
12571A2070K11260I5986N9392P1760D9562d451F1976e9686n0918j26824C01563
$$ plain form
12559 141810 -31498 191237 -243400 207140 -46727 100716 -95997 -228919 -61144 42727
12548 100494 16106 112834 302528 4100 -9896 170446 -162411 -81073 42548 189633 -40093
12536 390374 382655 167563 117010 131702 -280271 79594 48582 -97034 88411 126638 144779
12525 144779 91567 249945 -413042 339270 -10647 -125598 131520 -51617 110006 -64286
12514 149076 7670 36941 194201 -155771 -140593 56425 57922 192236 -40655 -161829 -57087
12502 -144260 -133324 355517 59276 -133365 46135 171057 372821 -51851 -147101 -170315 283658
12490 105165 345416 46220 -16872 121471 116916 266717 -42503 112589 130886 -262092 118438
12478 -281267 -112129 -439340 66800 65829 -177660 428259 -34874 65825 -89371 -92188 -195588
$$ packed form
12559A41810c1498A91237b43400B07140d6727A00716i5997j32922f1144D2727
12548A00494A6106R6728J89694D100i896A70446a62411h1073D2548J47085d0093
12536C90374p719A67563n0553J4692b80271G9594l1012i7034H8411L8227J8141
12525A44779n3212J58378d13042C39270a0647j14951A31520e1617A10006f4286
12514A49076G670K9271J57260a55771J5178E6425J497J34314d0655j21174e7087
12502a44260J0936C55517E9276a33365D6135J24922K01764e1851r5250k3214B83658
12490A05165K40251D6220a6872A21471m555J49801d2503A12589J8297b62092A18438
12478b81267a12129l27211F6800r71a77660D28259c4874F5825h9371k817j03400
$$ plain form
12467 -195588 369364 254044 446240 -110380 -312645 -129088 33310 -277928 92905 324525
12457 324525 -94232 -139798 -22002 100463 180011 4466 -167797 -71158 57185 -43615 182265
12445 303997 -110570 -45318 398190 85934 -69758 -6018 -299047 -74561 -47605 -99989 193620
12433 -297228 216130 -184868 152667 146716 204006 90224 -47077 -53833 149155 65354 96330
12422 96330 -69808 160806 -96263 197774 143817 -147287 478966 -90264 32975 -211482 -109366
12411 -109366 162020 -23773 -39873 -203363 -319795 54862 66299 163584 153839 94911 99769
12400 99769 98838 2173 -85301 -192333 -74052 -18997 178758 -228326 -221788 -480888 92311 3830
12387 156195 117493 259656 -70003 -151556 -113133 -196087 -87813 263485 -129494 -108940 -422869
$$ packed form
12467a95588C69364j15320J92196a10380k02265a29088C3310b77928I2905K31620
12457C24525i4232m5566b2002A00463P9548D466a67797g1158E7185d3615A82265
12445C03997a10570d5318C98190H5934f9758f018k93029g4561K6956n2384A93620
12433b97228B16130a84868A52667n951N7290I0224d7077o756A49155F5354L0976
12422I6330f9808A60806i6263A97774n3957a47287D78966i0264C2975b11482J02116
12411a09366A62020b3773j6100j63490j16432E4862J1437R7285r745n8928M858
12400I9769r31B173h5301j07032g4052a8997A78758b28326O538k59100I2311C830
12387A56195l8702J42163g0003q1553L8423q2954h7813B63485a29494K0554l13929
$$ plain form
12376 -422869 106733 406922 24160 -48255 71753 115097 28750 -56000 -465153 7592 194161
12365 194161 48133 -312733 276425 219357 -80452 100488 -64351 178081 145837 -66823 192176
12353 -157105 276362 -62077 200560 -145991 -31558 168358 -45900 190010 -14305 114126
12342 37594 -104725 -82814 -15473 13057 162688 -178519 50621 161740 91430 -246228 98809
12330 150660 102894 195190 177857 -66131 -124534 19132 -95367 183937 199450 75693 -376907
12318 -105070 -37587 101832 132263 -361697 220078 3351 -21870 -20894 -451388 -331070 -131545
12306 85681 292593 83824 -41635 94573 -52969 130461 -32131 169047 -122521 128967 -44118
12294 -184180 -103600 -83520 -242542 -37647 -88318 -185124 -50719 154560 218834 -51399 143253
$$ packed form
12376d22869A06733L00189B4160d8255G1753M3344B8750e6000m09153G592J86569
12365A94161D8133c12733B76425n7068h0452A00488f4351A78081l2244f6823A92176
12353a57105B76362f2077B00560a45991c1558A68358d5900A90010a4305A14126
12342C7594a04725K1911a5473A3057J49631a78519E0621J11119p0310b46228I8809
12330A50660m7766R2296j7333f6131n8403A9132i5367A83937J5513G5693c76907
12318a05070c7587A01832L0431c61697B20078C351b1870R76m30494J20318a31545
12306H5681K06912H3824d1635I4573e2969A30461c2131A69047a22521A28967d4118
12294a84180Q0580K0080j59022c7647n0671r6806e0719A54560O4274e1399A43253
$$ plain form
12282 154078 30410 -31945 -3657 283647 77956 110384 -77641 347072 204380 140144 -71463
12270 143277 -49596 275135 108446 93360 -126207 -152043 -34524 120614 -117979 -104617
12260 -104617 -149142 -70760 -176752 279836 -227651 308405 -174830 115685 -171889 -209385
12250 -209385 155623 385406 -387197 208182 260779 104594 137836 72562 90096 -4744 287452
12238 169051 102661 -92205 -356745 -46910 283237 28689 402334 32331 165546 252781 121591
12226 47438 311432 58682 111572 443164 205992 353686 356813 108352 268553 115895
12215 176862 187083 325337 179850 185273 66650 232314 -7158 205108 52544 102693 634665
12204 634665 -7495 295076 112645 135997 51132 260 326994 291537 359282 208646 -148422
$$ packed form
12282A54078C0410c1945c657B83647G7956L2428g7641C47072j42692o4236g1463
12270A43277d9596B75135A08446j5086a26207k5836c4524A20614a17979J3362
12260a04617m4525g0760j05992B79836b27651C08405a74830A15685a71889l7496
12250b09385A55623K29783c87197B08182N2597A04594L3242o5274J7534d744B87452
12238A69051o6390i2205k64540d6910B83237B8689L73645C2331J33215Q7235A21591
12226D7438K63994E8682N2890L31592B05992J47694L127A08352J60201A15895
12215A76862J0221J38254j45487N423F6650J65664g158B05108E2544N0149N31972
12204F34665g495B95076A12645K3352E1132B60L26734l5457O7745j50636a48422
$$ plain form
12192 383627 63209 336583 82121 348454 251809 113865 49915 19851 60054 82236 232648
12181 232648 180297 71060 83719 383349 -23179 445195 187212 174039 -77622 448384 284829
12170 284829 135065 163699 315676 126529 -24171 -174978 -144644 156417 -231184 -115363
12159 12212 -19315 283436 171778 44488 268384 41274 15060 211407 -31130 -51181 -111723
12148 -111723 184991 308553 157101 -77385 -80498 -244206 270244 19234 -113747 32316
12137 213781 -106074 17290 63343 52457 47780 -136675 174824 76364 -44767 -151751 -42588
12125 -34980 194841 114025 12012 57312 -236801 21598 286832 149335 43251 -280853 -81451
12113 16328 -268782 -14886 -231733 45304 -11504 -85445 110288 -226714 38644 -50000 95719
$$ packed form
12192C83627F3209K73374H2121K66333r6645A13865D9915A9851M0203K2182J50412
12181B32648n2351G1060J2659K99630b3179D45195A87212j3173g7622D48384j63555
12170B84829A35065K8634J51977A26529b4171j50807L0334A56417b31184a15363
12159A2212a9315B83436j11658D4488K23896D1274A5060J96347c1130k0051o0542
12148a11723A84991J23562j51452g7385l113j63708B70244A9234a13747C2316
12137B13781a06074A7290M6053j0886m677a36675A74824G6364d4767j06984d2588
12125c4980A94841q0816A2012M5300b36801B1598K65234j37497D3251b80853h1451
12113A6328b68782a4886k16847D5304a1504p3941A10288b26714C8644e0000I5719
$$ plain form
12101 246310 -146052 -106349 27943 -112116 21064 -228372 111921 -3364 -116795 183863
12090 -72792 -18942 205797 -212032 196707 -76824 25361 140261 80848 137350 -413313 223350
12078 -111417 -60422 86078 -172834 -90711 -156471 17678 -141399 334853 205548 148885 -60122
12066 -80661 193042 158726 76778 406717 -95430 271690 382470 1182097 1569069 502367
12055 17305 -4806 -142262 257161 -312791 -101213 -13880 -205133 93920 174127 -252713 -171677
12044 -171677 76452 -27959 -195051 -104221 -303044 -115966 41855 -298815 -59065 34369 -68256
12032 -201255 -230583 44104 -301148 -113492 108924 49746 -60401 -61618 -78613 97650 -23172
12020 -99447 68201 -16943 141598 15083 -186008 -28814 -73112 -123377 -157615 -119062 62311
$$ packed form
12101B46310a46052L9703B7943a12116B1064b28372A11921c364j13431A83863
12090g2792a8942B05797b12032A96707g6824B5361J14900n9413N6502d13313B23350
12078a11417N0995H6078a72834Q2123o5760A7678a41399C34853j29305n6663f0122
12066h0661A93042l4316G6778L29939i5430B71690J10780P99627L86972E02367
12055A7305d806j37456B57161c12791a01213a3880j91253I3920Q0207b52713Q1036
12044a71677G6452b7959j67092R0830j98823a15966D1855b98815e9065C4369f8256
12032b01255k9328D4104c01148a13492A08924D9746f0401j217j6995I7650b3172
12020i9447F8201a6943A41598A5083a86008b8814m4298n0265l4238L8553F2311
$$ plain form
12008 161997 160831 16564 -100668 -138957 -28149 -54981 -72183 79077 230052 34946 145084
11997 145084 -87096 182372 30484 -248630 204924 -264059 -137210 -185240 -221579 -352482
11987 -352482 110550 28944 -84530 480891 102567 -276040 -288894 -24232 156045 -180014
11976 -12362 -107339 185612 -206301 -66794 36944 145550 4551 241392 -27423 -109795 -104949
11965 -104949 365159 72027 273753 68600 47942 49066 250531 223871 29799 -219254 130508
11953 -443330 74315 -190704 -332382 359251 124067 5794 40378 -157229 -170239 3727 70520
11942 70520 -146709 -132858 -203361 7529 -191161 -163781 246887 281104 -190961 -53289 144272
11930 71330 -79422 -133207 98353 -8999 206181 17442 114451 -234820 -44232 119549 -192588
$$ packed form
12008A61997j166A6564a00668l8289b8149k6832j7202G9077J50975C4946J10138
11997A45084h7096A82372C0484b48630B04924b64059J26849m8030l6339j30903
11987c52482A10550B8944h4530D80891A02567b76040j2854b4232A56045a80014
11976a2362r4977A85612b06301f6794C6944J08606D551K36841b7423q2372M846
11965a04949C65159G2027K01726F8600k0658J124K01465k6660B9799b19254A30508
11953d43330G4315a90704j41678C59251A24067E794L4584a57229j3010C727O6793
11942G0520a46709J3851p0503G529a91161K7380B46887L4217a90961e3289A44272
11930G1330g9422n3785I8353h999B06181A7442R7009b34820d4232A19549a92588
$$ plain form
11918 -85883 444713 172636 -265442 -81993 106150 -178164 -125856 -113596 313514 -89218
11907 -196904 -25088 242316 279684 177849 -101786 213050 182602 -74404 -26862 -7761 -242013
11896 -242013 384516 -4612 -286117 -176705 -721 47734 -191091 29837 74929 -121786 -261718
11885 -261718 192700 -84864 -87209 -16903 -63570 -184803 -247673 -209615 -97555 -100191 -27741
11873 -197532 133996 -42375 67442 -145791 -213343 -167459 65128 -194538 -153596 88698 177380
11862 177380 323991 283292 -138827 166686 -143450 166082 253778 -8991 184716 -51624
11851 -265432 -69148 -51192 -521019 37235 56287 -70671 56064 -97016 -77978 68942 34000
11839 -124340 -117749 -179611 -176101 -45076 221722 -209689 10682 128992 -176680 -151766 -133767
$$ packed form
11918h5883D44713A72636b65442h1993A06150a78164N2308J2260C13514h9218
11907a96904b5088B42316L7368j01835a01786B13050l0448g4404b6862g761k34252
11896b42013C84516d612k81505J09412g21D7734a91091B9837M5092a21786j39932
11885b61718A92700h4864k345a6903m6667j21233o2870L8058i7555k636b7741
11873a97532A33996d2375F7442a45791o7552M5884F5128a94538M0942H8698Q8682
11862A77380J46611m0699a38827A66686a43450A66082Q7696h991A84716e1624
11851b65432f9148J7956m69827C7235J9052g0671E6064i7016J9038F8942C4000
11839a24340O591o1862L510d5076B21722b09689A0682J18310a76680K4914J7999
$$ plain form
11828 -133767 -51270 25354 15679 159666 44283 -329704 71067 417313 117874 407693 -222670
11816 -123899 -67804 -216937 -300016 -137398 -111374 10406 -45925 3823 -60282 -10604 169349
11804 -66169 -155072 -11452 -22163 29592 -77892 -208647 -87389 97150 -213292 -45745 254379
11792 125418 -163674 -33834 -33312 63473 143496 -105148 -107977 102056 -180277 -113392 228699
11780 17798 -185423 -24538 -246816 200738 -427635 550672 -64243 13431 -42892 -293690
11770 -293690 -328600 144626 369644 -117709 168532 262350 -138981 273584 87929 -8262
11759 36760 361116 132335 22946 -97844 -133631 -258197 184712 -156710 20404 -262937
11748 -147485 130565 -74934 206437 -150985 -7969 68299 18351 -297838 88229 -196266 -12129
$$ packed form
11828a33767e1270B5354r675J43987D4283c29704G1067L46246A17874K89819b22670
11816a23899N6095j49133q3079a37398K6024A0406d5925C823f0282a0604A69349
11804f6169q8903a1452j0711B9592g7892j30755h7389I7150b13292d5745B54379
11792A25418a63674c3834N22F3473Q0023a05148k829A02056a80277O6885B28699
11780A7798a85423b4538k22278B00738d27635E50672f4243A3431d2892k50798
11770b93690l4910A44626K25018a17709A68532R3818a38981B73584H7929h262
11759C6760L24356A32335B2946i7844l5787j24566A84712a56710B0404b62937
11748a47485A30565g4934B06437a50985g969F8299A8351b97838H8229a96266a2129
$$ plain form
11736 -228860 221882 70434 -534106 239072 476154 3387 -23909 -50573 141962 23632 -330750
11724 103353 26707 -15795 58760 499654 269602 -56319 -252479 -256259 227409 256317 -240328
11712 32394 44505 81469 -40312 -131641 185408 149261 169768 -232871 145224 -100019 82418
11700 -107043 -151884 -96560 243774 -299388 119120 92255 -145927 47996 219067 67495
11689 313761 102585 152078 87070 194486 -246164 -115565 241786 -69482 116756 156175
11679 156175 -26539 -267860 -129571 50295 -212065 -61546 137141 219437 -69673 -4534 -209472
11668 -209472 88643 -40998 241780 10597 328889 28818 204559 168290 250169 -190743 68836
11656 10853 169050 166141 -94608 49905 -182016 134243 67598 -92798 104421 73350 205851
$$ packed form
11736b28860B21882G0434e34106B39072K37082C387b3909k6664A41962B3632c30750
11724A03353B6707a5795E8760M40894k30052e6319j96160l780B27409K8908b40328
11712C2394J2111L6964d0312r1329A85408l6147K0507b32871A45224a00019H2418
11700a07043m4841N5324B43774b99388A19120k6865a45927D7996J71071F7495
11689C13761A02585M9493o5008J07416b46164a15565B41786f9482A16756L9419
11679A56175b6539k41321a29571E0295b12065f1546A37141Q2296f9673d534k04938
11668b09472H8643d0998B41780A0597L18292B8818J75741l6269Q1879a90743F8836
11656A0853J58197k909i4608D9905a82016A34243o6645i2798A04421l1071J32501
$$ plain form
11645 205851 -88079 10698 29925 37732 386899 -147152 289546 -88610 238236 296797 160433
11634 160433 70391 39867 -404395 -224259 222717 -104588 233125 35152 99341 -157911
11623 59795 7697 -88368 -236016 -151037 16860 101981 40883 42547 130381 -222316 -140145 126741
11610 244179 10757 -236093 -184901 387504 6613 80576 -217142 -185102 85299 32674 100024
11599 100024 -48960 278885 79165 -77934 -222164 64789 -218705 4354 256861 -82428 36771
11587 321369 31918 -28384 -25335 164934 94426 433365 119146 -31056 37296 222180 175455
11576 175455 -103754 -2857 91982 302756 231385 355279 42553 64941 284302 378360 123380
11564 298209 -50036 21266 24929 116847 -130546 20678 -34455 116529 179092 -209956 148053
$$ packed form
11645B05851h8079A0698J9227P807L49167a47152B89546h8610B38236N8561j36364
11634A60433G0391l0524d04395J80136B22717a04588B33125C5152O4189a57911
11623E9795G697h8368j47648Q4979A6860Q5121D0883J664Q7834b22316Q2171A26741
11610B44179A0757b36093N1192C87504F613P3963b17142L2040H5299C2674O7350
11599A00024d8960B78885G9165g7934j44230F4789b18705D354K52507h2428C6771
11587C21369C1918b8384L049A64934p0508L38939A19146c1056C7296J84884m6725
11576A75455a03754b857I1982K10774p1371J23894D2553K2388K19361R4058A23380
11564B98209e0036B1266L663R1918a30546B0678c4455A16529O2563b09956A48053
$$ plain form
11552 -281860 4818 185365 -175027 56351 69281 122164 -33217 211200 82837 249091 76407
11540 245676 -58117 58652 -178330 81557 176275 91549 149389 28924 32299 441995 320885
11529 320885 200460 186768 -123439 -36367 -35371 -158816 127366 202363 24290 340923 -33001
11517 330406 23893 55105 287301 44150 -62767 -72444 -65358 163234 336484 403553 102308
11505 125048 49571 184463 67228 11830 -200061 249014 262158 490984 294479 359705
11495 359705 129133 371321 293420 152911 -77874 199186 -71490 263681 345328 332590
11485 332590 103586 427299 344433 290262 347189 -107675 198319 -13829 279388 -36612
11474 119453 -171604 31879 562825 151822 -86539 257108 444432 307197 370672 239040
$$ packed form
11552b81860D818J80547a75027E6351J2930N2883c3217B11200H2837J66254G6407
11540B45676e8117E8652a78330H1557R4718q4726N7840B8924L375M09696j21110
11529C20885j20425j3692a23439c6367R96j23445A27366P4997B4290L16633c3001
11517C30406B3893L1212K32196D4150f2767r677P086A63234J73250O7069A02308
11505A25048D9571J34892F7228A1830b00061B49014J3144K28826j96505O5226
11495C59705A29133K42188p7901j40509g7874A99186g1490B63681Q1647j2738
11485C32590A03586L23713q2866n4171N6927a07675A98319a3829B79388c6612
11474A19453a71604C1879N30946A51822h6539B57108J87324j37235O3475j31632
$$ plain form
11464 239040 29874 -43717 -17541 -26651 221476 19369 269556 -140977 242995 98432 304486
11453 304486 81282 118072 404289 42260 158978 160027 106441 -86520 82287 40337 -33084
11441 400185 -16726 238939 118700 90268 215599 354366 -292351 163847 409303 -54695
11430 107940 24410 -169268 35295 193791 127529 141478 -242205 -4310 -89968 117095 141567
11419 141567 -6083 -137188 -412738 25903 385240 151677 189125 202496 -65358 -121854 59301
11407 157241 -158477 -23008 29815 240209 -9275 37213 15311 140915 206309 -54035 182612
11395 127012 -328584 -81479 66648 -271527 158470 417803 228809 53626 -4787 -79517 759
11383 116615 47608 -28030 328855 -381 -207669 33805 64168 151617 102514 79220 -97086
$$ packed form
11464B39040B9874d3717a7541r110B21476A9369K50187a40977B42995I8432K06054
11453C04486H1282L6790K86217D2260J16718J049n3586h6520H2287D0337c3084
11441D00185a6726B38939A18700k8432J25331J38767b92351A63847K45456e4695
11430A07940B4410a69268C5295J58496o6262J3949b42205d310q5658A17095K4472
11419A41567f083j31105k75550B5903L59337A51677L7448J3371f5358n6496E9301
11407A57241a58477b3008B9815K10394i275C7213A5311J25604O5394e4035A82612
11395A27012c28584h1479F6648b71527A58470K59333j88994E3626d787p4730G59
11383A16615D7608b8030C28855c81k07288C3805L0363Q7449m9103k3294i7086
$$ plain form
11371 -225216 -61938 18098 240838 216632 113636 -53637 -53049 148294 -97413 -87919 270885
11359 138433 -62642 -289581 -174608 -18050 -122608 -82885 28752 249967 95171 -56928 -12248
11347 -194740 351122 -391302 -225662 -289269 109080 -167 -175543 -7731 406244 -150061 4132
11335 -25057 -130565 410609 -205021 -181355 -12473 -360101 -30959 -68900 -117153 44213 -112978
11323 101185 -228684 8737 289457 -85198 -61951 110450 -96943 -97937 79054 -186659 -46192
11311 -68330 185475 -106524 180832 -142498 -37282 126103 118618 20684 354955 -38307 -24132
11300 -24132 65089 324851 -63922 -27250 194476 113977 -97614 -180583 138830 215828 47208
11288 -386183 -178771 62348 183817 -100612 44654 -167840 7378 218928 -52236 -217124
$$ packed form
11371b25216f1938A8098K22740k4206j02996e3637N88A48294i7413R494B70885
11359A38433f2642k26939J14973a8050j04558L9723B8752K21215I5171e6928a2248
11347a94740C51122c91302J65640o3607A09080a67j75376g731D06244a50061D132
11335b5057j05508D10609b05021K3666a2473l47628c0959l7941m8253D4213a12978
11323A01185b28684H737K80720h5198K3247A10450i6943r94G9054a86659d6192
11311f8330A85475a06524A80832a42498c7282A26103p485B0684L34271c8307J4175
11300b4132F5089K59762f3922b7250A94476q0499i7614q2969A38830P6998D7208
11288c86183a78771F2348J21469a00612D4654a67840G378K11550e2236j64888
$$ plain form
11278 -217124 -87690 187555 -74734 -355993 238751 169903 29836 322004 -36774 -167731
11268 -167731 -128213 -104083 -212137 110846 -69427 -129855 -36879 -76926 19794 169275 60057
11256 -179916 252255 10186 -122760 60445 488895 -55289 -111632 -2042 -178162 129013 5359
11244 44350 -88096 -51477 -44144 143919 -232451 -158185 34798 127156 -277373 -112439 67988
11232 12397 -121716 125676 -137798 -89539 -177633 109390 -44227 -191314 -246711 148427
11221 -169599 -25102 -461612 -38103 -178808 153947 -96018 -300869 -74084 -266708 5417 16829
11210 16829 -64718 -201060 141766 46808 -185802 -429707 -160262 52966 -110975 34556
11199 125991 -216957 86850 -48325 111271 -136187 -265110 -151172 -160976 -154534 -221774 52789
$$ packed form
11278b17124h7690A87555g4734k81259B38751o8848B9836K92168c6774j30957
11268a67731L9518K4130j08054A10846f9427o0428c6879m0047A9794J49481F0057
11256a79916B52255A0186a22760F0445M28450e5289n6343b042j76120A29013E359
11244D4350h8096L6619P333A43919b32451P4266C4798R2358b77373a12439F7988
11232A2397a21716A25676a37798M8259q8094A09390d4227j47087n5397A48427
11221a69599b5102m36510c8103j40705A53947i6018k04851g4084j92624E417J1412
11210A6829f4718j36342A41766D6808a85802k43905a60262E2966a10975C4556
11199A25991b16957H6850d8325A11271a36187j28923J13938r804O442o7240E2789
$$ plain form
11187 -147844 1577 -69172 21370 49030 -328710 -257326 -49078 220901 335561 -72221 211074
11175 -54414 44284 146041 12311 6257 -184852 -17914 95571 -167814 -441822 -409574 44842
11163 271465 -4824 -151459 131053 -89434 55530 209338 -171622 338585 -47647 33115 -340521
11151 47152 84759 125692 -345717 -26846 -13461 305124 151276 231542 208525 60406 102461
11140 102461 -187968 -79430 39196 -249149 -75363 -89314 73684 206205 -100367 -135870 71738
11128 -164090 174632 71856 36797 37071 271881 487163 -4999 91848 -41439 129590 -26701
11116 300508 -84392 148075 58297 -93363 225890 -23832 87341 13484 382159 41308 191962
11105 191962 -17093 356601 321123 491774 160969 545552 398104 14722 272764 317138
$$ packed form
11187a47844A577f9172B1370K7660c28710P1384d9078B20901J14660g2221B11074
11175e4414D4284J01757A2311o054a84852a7914I5571a67814k74008L2248D4842
11163B71465d824j46635A31053h9434E5530J53808a71622C38585d7647C3115c40521
11151D7152L7607M0933c45717b6846J3385C05124A51276Q0266k3017F0406M2055
11140A02461a87968g9430C9196b49149g5363j3951G3684J32521a00367l5503G1738
11128a64090A74632G1856l5059K74K34810K15282d999I1848d1439A29590b6701
11116C00508h4392A48075E8297i3363B25890b3832H7341A3484L68675D1308J50654
11105A91962a7093C56601l5478J70651A60969L84583j47448A4722K58042M4374
$$ plain form
11095 317138 -387500 351877 136799 136771 356318 450256 -992 342600 279775 196743 169287
11084 169287 753600 187788 130704 243409 365996 258219 477247 285369 82196 483005
11074 483005 313003 228266 144330 264921 128 382201 377980 412428 319788 540786 238721
11062 412670 547017 263258 547749 670564 528736 871493 549244 845897 516645 592005
11052 592005 818155 782932 776816 659559 1051786 533826 881728 1148173 367219 790257
11042 790257 841923 944768 485773 632419 697360 901277 1071815 677585 855611 822236
11032 822236 914749 842395 1076529 1077154 828147 1064450 940813 981470 797575 550133 705289
11021 705289 744795 709660 658961 380610 723000 879726 484181 692349 855127 545800
$$ packed form
11095C17138c87500C51877A36799k8K19547R3938i92C42600o2825q3032k7456
11084A69287N84313A87788n7084J12705J22587j07777K19028j91878H2196M00809
11074D83005j70002q4737q3936J20591A28L82073m221L4448r2640K20998B38721
11062D12670J34347B63258K84491J22815j41828L42757l22249K96653l29252P5360
11052E92005K26150l5223o116j17257L92227n17960L47902K66445C67219M23038
11042G90257N1666J02845m58995J46646O4941K03917J70538l94230J78026l3375
11032H22236R2513p2354K34134O25k49007K36303j23637M0657j83895k47442J55156
11021G05289L9506l5135n0699k78351L42390J56726l95545K08168J62778l09327
$$ plain form
11011 545800 684415 873635 200884 480599 814969 694942 604697 744043 912428 909990
11001 909990 811718 682557 1063190 846357 672413 722569 524434 750686 667235 898597
10991 898597 660522 900995 714894 864176 1215759 1153580 1009349 1031466 1239159 1189592
10981 1189592 1494145 1500741 1633189 1920644 2228433 2297914 2543032 2917225 3454878 3315748
10971 3315748 3716411 3397617 3350266 2901887 2541004 2430801 1921517 1854264 2001622 1687328
10961 1687328 1438523 1850905 1699211 1493084 1648426 1352125 1429509 1332685 1209298 899604
10951 899604 848541 486863 724878 362073 171229 66022 694644 294288 356172 223100
10941 223100 216558 238796 343916 86807 554302 316249 159083 105700 -11295 359396 281039
$$ packed form
11011E45800J38615J89220B00884K79715L34370j20027r0245J39346J68385k438
11001I09990r8272j29161L80633k16833j73944N0156j98135K26252q3451K31362
10991H98597k38075K40473j86101J49282L51583o2179j44231K2117K07693m9567
10981A189592L04553O596J32448K87455L07789O9481K45118L74193N37653j39130
10971C315748M00663l18794m7351m48379l60883j10203n09284o7253J47358l14294
10961A687328k48805M12382j51694k06127J55342k96301P7384r6824j23387l09694
10951H99604n1063l61678K38015C62073A71229F6022O28622B94288O1884j33072
10941B23100o542K2238J05120H6807M67495k38053j57166n3383a1295C59396p8357
$$ plain form
10930 281039 131247 59750 -152526 222157 155270 -245061 -298419 36846 92216 232869
10920 232869 -93282 149614 -2400 -135483 235537 57405 -106022 289497 47441 -96708 52548
10908 20614 17980 -128517 -8732 -217416 78620 103389 -16038 64318 259036 173813 145541
10897 145541 -58049 -126836 52731 -139181 78595 -300914 107187 -133418 46104 84623 -17992
10885 -91242 -117098 -74431 -170083 -12418 -89881 -179884 -114167 -189063 -95515 201719 210264 293797
10873 293797 157230 68151 -109042 121765 -193939 479251 271386 273521 -16452 151510
10862 75001 -50075 150290 195432 18674 83330 -126348 -266607 -220418 -69207 161156 50132
10850 63116 -35696 -139431 -100528 175033 107979 -234518 14977 186965 -184531 -318926
$$ packed form
10930B81039A31247E9750a52526B22157o6887b45061n3358C6846N5370J40653
10920B32869i3282A49614b400j33083B35537E7405a06022B89497D7441i6708E2548
10908B0614k634a28517h732k08684G8620K4769a6038F4318J94718q5223k8272
10897A45541e8049o8787E2731a39181G8595c00914A07187a33418D6104L8519a7992
10885i1242k5856M2667r5652a2418p7463r0003O5717p4896R3548B01719Q545Q3533
10873B93797j36567F8151a09042A21765a93939D79251k07865K135a6452A51510
10862G5001e0075A50290M5142A8674O4656a26348j40259M6189f9207A61156E0132
10850F3116c5696j03735L8903A75033o7054b34518A4977J71988a84531j34395
$$ plain form
10840 -318926 -249866 128470 -153177 66400 -147033 4389 63731 105565 -243739 -15288 -133669
10829 -133669 142807 315646 -341498 -145148 253864 86488 -23163 12234 -5749 -35242 -128127
10818 -128127 -87631 228870 177426 63402 -29910 141165 65169 -126003 -221756 72913 215459
10807 215459 -103785 -218551 -48064 69648 2969 191044 -137271 -13487 -232890 -280452 -377019
10796 -377019 -540313 -32736 -133463 178143 -110049 -93418 -111576 -97895 -341619 -13367
10785 14126 37653 -61600 -196860 -30557 -80218 100454 -308789 -242896 -248441 98083 135638
10774 135638 65322 -47699 -206638 -30338 -20076 -388631 17287 -240030 126024 156438 154259
10763 154259 -10847 343308 -79121 -255159 149426 31736 -2361 -170682 9913 153012 311643
$$ packed form
10840c18926O9060A28470a53177F6400a47033D389N9342M1834b43739a5288j18381
10829a33669A42807J72839c41498a45148B53864H6488b3163A2234e749k9493r2885
10818a28127M0496B28870n1444F3402b9910A41165F5169a26003r5753G2913J42546
10807B15459a03785j14766d8064F9648B969J88075a37271a3487k19403m7562r6567
10796c77019j63294c2736j00727A78143a10049J6631j8158J3681k43724a3367
10785A4126K3527f1600j35260c0557m9661A00454c08789O5893n545I8083L7555
10774A35638F5322d7699j58939c0338J0262l68555A7287b40030A26024L0414k179
10763A54259a0847C43308g9121j76038A49426C1736b361j68321I913J43099J58631
$$ plain form
10752 311643 49685 -120374 -71549 -292657 158795 -63091 -18644 75889 62746 118337 -157164
10740 42502 -37180 -21972 -200235 -165763 91796 -110117 165855 342093 26374 31395 -211600
10728 -140327 -49306 -19397 -150395 341355 -79445 -219199 76186 128052 -50323 33418 -222988
10716 -70281 132291 -144522 25951 -407773 -178583 40736 -101417 -316927 -152370 -297004
10706 -297004 79193 -85665 -130352 -388515 51122 129315 -72273 199527 154476 76668 375339
10695 375339 -266943 -280690 60511 -82386 -149273 16766 42951 20125 -113419 307482 11032
10683 -88988 227359 -91122 83157 -48740 77342 -294340 201136 24948 232359 -48332 148710
10671 162103 231904 85152 -30205 -263660 165467 39622 81128 112703 290936 -266501 -59293
$$ packed form
10752C11643D9685a20374M8825k21108A58795f3091a8644G5889j3143N5591a57164
10740D2502c7180J5208j78263L4472I1796a10117A65855J76238B6374N021b11600
10728a40327d9306a9397j30998C41355g9445j39754G6186N1866e0323C3418b22988
10716g0281A32291a44522B5951d07773a78583D0736a01417k15510a52370j44634
10706b97004G9193h5665m4687k58163E1122P8193g2273A99527m5051G6668K98671
10695C75339b66943j3747F0511h2386o6887A6766K6185B0125a13419C07482A1032
10683h8988B27359i1122H3157d8740G7342b94340B01136B4948K07411d8332A48710
10671A62103O9801H5152c0205k33455A65467C9622M1506L1575J78233b66501e9293
$$ plain form
10659 2224 125679 77750 -131370 410228 -391335 -245957 294638 67225 -463705 -55174
10648 -222520 -155614 245644 -154224 -32040 123950 113542 29808 -58531 -108653 -118135 -45169
10636 -123876 144863 -21674 -301465 -24233 105075 -13996 -310240 -388939 50977 -186464
10625 22454 -115324 124815 -158279 -105881 169381 14639 -270171 105200 -164250 73024
10614 101932 267605 227097 -149156 -55786 -152390 -2562 -140764 -380464 42253 52378 32611
10603 32611 -91135 -178844 -33081 -101396 -142636 -10622 -246424 -3697 -118009 224223 51031
10591 -180310 -9959 40817 59630 -248212 -66542 2292 -76543 -224873 -292256 -107602 -228145
10580 -228145 -63353 -24308 -22661 -182233 91802 51252 322972 -206911 -158500 112253 -371703
$$ packed form
10659B224J23455m7929a31370D10228c91335J45378B94638F7225d63705e5174
10648b22520O6906B45644a54224c2040A23950j0408B9808e8531n0122r482d5169
10636a23876A44863b1674k79791b4233A05075a3996k96244p8699E0977a86464
10625B2454a15324A24815a58279N2398A69381A4639b70171A05200a64250G3024
10614A01932J65673m0508a49156e5786r6604b562j38202k39700D2253J0125j9767
10603C2611i1135q7709c3081o8315m1240a0622k35802c697j14312B24223E1031
10591a80310i959D0817J8813b48212f6542B292g6543j48330o7383a07602j20543
10580b28145f3353b4308J647j59572I1802m0550K71720b06911M8411A12253c71703
$$ plain form
10568 -133722 104114 126912 -171452 163822 97607 -119314 -107402 27605 81833 -178833
10557 -60403 122909 -125192 -340090 -162814 -25623 -63130 103788 115845 131060 10333 129893
10546 129893 243105 16902 16700 -145800 -251250 -145997 -65579 -169218 78923 -15550 -344639
10535 -344639 186289 -173885 129299 -295944 -91397 -43973 8733 -270812 208807 -25776
10524 -190712 -227841 -86339 -152835 -318913 187933 -154811 16824 -121709 9675 -256586 -148095
10513 -148095 -146901 -129000 -6331 -22860 -114978 -297054 138901 -171995 74946 298412 319040
10502 319040 109666 363036 115472 -97238 129769 -416651 -233955 -39065 -56571 56844
10491 -41418 -65028 42587 -68855 -179745 101889 -121396 568027 88737 422452 370535 275064
$$ packed form
10568a33722A04114K2798a71452A63822o6215a19314J1912B7605N4228a78833
10557f0403A22909a25192k14898a62814b5623l7507A03788J2057J5215A0333J19560
10546A29893J13212A6902k02a45800j05450J05253f5579j03639G8923a5550l29089
10535c44639A86289a73885A29299b95944i1397d3973H733b70812B08807b5776
10524a90712l7129h6339o6496j66078A87933a54811A6824a21709I675b56586J08491
10513a48095J194J7901f331j6529r2118j82076A38901a71995G4946K23466K0628
10502C19040A09666K53370A15472i7238A29769d16651J82696c9065j7506E6844
10491d1418k3610D2587f8855j10890A01889a21396E68027H8737L33715n1917r5471
$$ plain form
10480 275064 272750 83857 88630 328695 8617 153106 -26079 -343167 337266 -139091 -225931
10469 -225931 -240969 19488 -33330 171423 72990 97647 -239396 -100010 -88427 -64598 102522
10457 16874 27891 27551 145472 179114 -62299 -87416 -128303 305344 -265673 19668 175376
10446 175376 -126180 -1665 -364020 -239697 -88104 -42213 -170113 5659 -116417 339296 -39681
10434 -241621 -300672 -167861 345 -114197 -161430 -164276 -83420 -129078 -108333 64279 -21408 168946
10421 -72570 -290158 367505 173020 243930 15373 -133516 -204744 -245248 34659 132876 212501
10410 212501 27212 -142039 -25097 39124 188147 206816 53843 -206692 272314 118699
10399 -97336 -150235 42088 -269113 103757 -86887 -44676 -159377 -32006 41488 54539 -266399
$$ packed form
10480B75064k314H3857M773K40065H617J44489b6079l17088C37266a39091q6840
10469b25931j5038A9488c3330A71423G2990K4657b39396a00010J1583K3829A02522
10457A6874J1017l40J17921L3642f2299k5117m0887C05344b65673A9668J55708
10446A75376a26180a665l62355J24323h8104d2213j27900E659a16417C39296c9681
10434b41621n9051J32811C45a14197m7233k846Q0856m5658K0745F4279b1408A68946
10421g2570k17588C67505A73020P0910A5373a33516p1228m0504C4659R8217P9625
10410B12501B7212a42039b5097C9124J49023J8669E3843b06692B72314A18699
10399i7336n2899D2088b69113A03757h6887M2211j14701c2006D1488J3051b66399
$$ plain form
10387 -86998 -104163 -9815 -95472 -32862 57863 186690 315419 167669 198661 84239 246415
10376 246415 259709 257615 234659 -144466 553750 -18655 258031 671959 449339 436091 378758
10365 378758 406883 269784 112560 151431 353679 385318 690549 14967 159515 380341
10355 380341 175082 261753 418744 614182 589525 626068 189498 404011 431160 124082
10344 211256 412165 620095 85296 734661 297075 11991 -2795 177283 333683 205675
10334 205675 164861 44380 357921 72833 394365 43600 213042 133966 -265862 265533
10323 52639 146850 -121774 135481 445620 311868 71111 323568 496885 334941 243924
10313 243924 45331 203863 298079 -77977 115252 -258045 -62024 115065 9570 -248208 49273
$$ packed form
10387h6998j7165i815q5657c2862E7863J28827J28729j47750L0992H4239J62176
10376B46415J3294k094k2956a44466E53750a8655B58031M13928k22620j3248n7333
10365C78758K8125j37099A12560L8871K02248L1639L05231A4967J44548K20826
10355C80341A75082Q6671J56991J95438k4657L6543A89498K14513K7149A24082
10344B11256K00909K07930H5296O49365B97075A1991b795A77283J56400j28008
10334B05675m0814D4380L13541G2833L21532D3600J69442p9076b65862B65533
10323E2639R4211a21774A35481L10139j33752G1111K52457J73317j61944r1017
10313B43924D5331J58532R4216g7977A15252b58045f2024A15065I570b48208D9273
$$ plain form
10301 -310045 307706 -92655 161069 257462 107327 -262890 24971 -232249 -90690 203579
10290 67888 -87012 50522 -136531 -143297 -108106 -107774 -120734 59426 -214961 81865 29891 -1940
10277 -169852 9347 -64657 150255 97105 -255807 -214002 -151763 322214 322942 -214678 -89374
10265 -115926 182266 -232173 91574 234999 477790 646066 539370 193854 -90231 146922
10254 204218 478575 134041 -100910 -80880 162988 -341573 -137484 25308 108519 68358
10244 68358 -29000 -33480 -186537 397587 41252 -357252 -91844 92971 -479999 58409 51757
10233 51757 -22810 -163531 -11446 -58813 6619 -20360 -267067 112911 -217397 67031 -87070
10221 182420 -194240 75743 -111490 -448984 124218 5880 200783 255483 14128 -196626
$$ packed form
10301c10045C07706i2655A61069R6393A07327b62890B4971b32249i0690B03579
10290F7888h7012E0522a36531o766L5191L32j2960E9426b14961H1865B9891a940
10277a69852I347f4657A50255n3150b55807M1805O2239C22214P28b14678h9374
10265a15926A82266b32173I1574J43425K42791J68276j06696A93854i0231A46922
10254B04218K74357A34041a00910K0030A62988c41573a37484B5308Q3211m0161
10244F8358b9000m480j53057C97587D1252c57252i1844I2971d79999E8409o652
10233E1757b2810j40721a1446m7367F619b0360k46707A12911b17397F7031h7070
10221A82420a94240G5743a11490l37494A24218E880J94903N4700A4128a96626
$$ plain form
10210 439204 78608 40606 -4719 -151467 -97430 -262005 -262614 8805 34756 -209170 172343
10198 108520 -179463 -163867 -50941 -76122 120128 -219892 -205337 -347790 -251391 -408768
10188 -408768 198867 -179356 -265153 93402 -123130 8113 -34420 90358 119839 -152017 -32521
10176 19977 -243953 -34722 7859 -165840 268111 -267053 40913 32635 -151052 -234297 31316
10164 8670 -151921 -135336 173896 -114616 25304 -123132 -306392 -97841 195889 -38494 -31855
10153 -31855 -363925 -31799 240838 203559 -133751 -60523 -146229 -228914 75850 43745 262429
10142 262429 43912 -44932 -22630 192335 -58561 -181623 77305 136192 -173928 176004 -5127
10130 -177839 -202296 2339 -131966 63611 -219643 -123451 -130483 -106676 -74346 -58618 36455
$$ packed form
10210D39204G8608l8002d719j46748N4037j64575o09H805K5951b09170A72343
10198A08520a79463J5596e0941k5181A20128b19892J4555j42453R6399j57377
10188d08768A98867a79356q5797I3402a23130H113c4420I0358K9481a52017c2521
10176A9977b43953c4722G859a65840B68111b67053D0913q278a51052q3245C1316
10164H670a51921J6585A73896a14616B5304a23132j83260i7841A95889c8494O639
10153c1855l32070c1799B40838l7279a33751f0523q5706q2685G5850l2105K18684
10142B62429D3912d4932K2302A92335e8561j23062G7305N8887a73928A76004e127
10130a77839k4457B339a31966F3611b19643R6192p032K3807L2330J5728C6455
$$ plain form
10118 -125167 -42087 232980 118486 -164289 81261 -206547 218800 144731 -123486 -94807
10108 -94807 34255 95140 86882 -218384 -367780 -5161 -27537 -197161 -212227 62692 -388272
10096 -34121 -200216 21163 -34246 -95944 -116520 -38060 -268441 -195012 -143463 34420 122564
10085 122564 -8630 -282171 7784 -154891 -65656 -348383 1349 -14853 129631 140459 19499
10073 61687 103839 -145250 -15574 110014 -88882 91172 187343 98936 -23974 -302226 261496
10061 141545 -93498 146257 -48420 -48632 -236117 -290788 -173287 114698 -213680 94234 -27983
10049 -15299 -355486 20940 6980 -415618 183569 209834 -34962 -94411 -51141 262258 133895
10038 133895 -117129 92843 -72661 -277391 -232617 -124039 157840 -261486 -74535 -149908
$$ packed form
10118a25167d2087B32980j14494a64289H1261b06547B18800p4069a23486K8679
10108i4807C4255O0885q258b18384j49396e161k2376j69624j5066F2692c88272
10096c4121j66095B1163c4246o1698k0576c8060k30381P3429N1549C4420Q8144
10085A22564h630k73541G784a54891f5656k82727A349a4853A29631J0828A9499
10073F1687M2152a45250a5574A10014h8882I1172R6171q8407b3974k78252B61496
10061A41545i3498A46257d8420k12j87485n4671J17501A14698b13680I4234b7983
10049a5299l40187B0940F980d15618A83569K6265c4962n9449M3270B62258j28363
10038A33895a17129I2843g2661k04730M4774J08578A57840b61486g4535p5373
$$ plain form
10028 -149908 -97913 147611 -156483 13445 -140899 -378150 -221793 196526 -102207 -144817
10018 -144817 146266 9317 -50460 392759 -165318 156765 134931 93263 110707 179594 -141326
10006 -38745 -175124 181239 -149165 -184080 -165156 -327810 -225967 2212 -42828 97768 114668
9995 114668 -109713 -243569 367765 -122391 -79055 98218 233456 195934 -434604 -274813
9985 -274813 75517 -94560 43969 -54909 -122888 102800 47831 13786 -206207 -50832 -238369
9974 -238369 -212999 -36540 188038 223988 154851 -64259 -337522 313798 -60383 -282202 124506
9962 25227 -4330 -103092 -98515 126827 -7101 100704 -49549 -160996 -105385 -391240 142260
9950 -153307 -88073 -206656 -69125 149331 -117246 -263264 152513 108001 58518 -204069
$$ packed form
10028a49908N1995A47611a56483A3445a40899k37251J56357A96526a02207m2610
10018a44817A46266I317e0460C92759a65318A56765k1834m1668J7444O8887a41326
10006c8745j36379A81239a49165l4915J8924j62654J01843B212d2828I7768J6900
9995A14668a09713j33856C67765a22391M3336I8218J35238l7522d34604J59791
9985b74813G5517i4560D3969e4909o7979A02800D7831A3786b06207e0832j87537
9974b38369K5370c6540A88038L5950o9137f4259k73263C13798f0383k21819A24506
9962B5227d330r8762M577A26827g101A00704d9549j11447N5611k85855A42260
9950a53307O5234j18583f9125A49331a17246j46018A52513m4512m9483b04069
$$ plain form
9939 -37390 -145801 -342180 -255136 19839 -169141 137908 72417 354560 -176303 -244045 30271
9927 -122401 -242075 -329428 -422728 -35999 329655 -50004 222529 -289721 176861 -168659
9916 -431680 -118284 130068 -50127 -243046 -195521 300422 -16475 81912 -104697 43700 110937
9905 110937 -139087 -122182 -75648 -84823 -58346 -58523 -115092 63905 -96391 -269503 243251 -28033
9892 -49201 125478 206808 -69495 130964 3795 68673 60291 -49227 39857 -312738 61301 199112
9880 199112 208908 -352622 -96783 -239429 -299872 -87492 143667 110551 -23068 10067 -12824
9868 -242680 57622 -190945 -156771 -94856 -147366 32887 189608 -252238 112891 44137 -309761
9856 -51249 -91902 234042 91733 50786 169392 164495 -174264 125294 237395 -245 -533974
$$ packed form
9939c7390j08411j96379Q7044A9839a69141A37908o5491K82143a76303o7742C0271
9927a22401j19674q7353r3300c5999C29655e0004B22529b89721A76861a68659
9916d31680a18284A30068e0127j92919M7525C00422a6475H1912a04697D3700O7237
9905A10937a39087J6905M6534r175K6477j77n6569F3905i6391j73112B43251b8033
9892d9201A25478Q1330f9495A30964C795O4878q382d9227C9857c12738F1301J37811
9880A99112R796c52622i6783j42646o0443h7492A43667l3116b3068A0067a2824
9868b42680E7622a90945L4174O1915n2510C2887J56721b52238A12891D4137c09761
9856e1249m0653B34042I1733m0947J18606m897a74264A25294J12101b45n33729
$$ plain form
9845 -533974 -30733 -267789 -344408 -47811 -284950 -367852 -27608 38317 126106 210923 136730
9834 136730 78450 -222925 -185208 -154324 -221653 -122126 -44893 -283205 19794 -45090 -148108
9823 -148108 15063 -148701 49602 205373 -235098 -150636 91 -396007 -9834 -54676 -76300 -169776
9811 -169776 -127037 -126835 -100756 -196554 76336 205404 72843 -8591 -272893 -210245 2192 52378
9799 52378 -18245 -55193 -190934 235327 -96813 -78416 -149580 -100974 247968 51159 83025
9788 83025 -127117 -252582 -321095 174403 5098 -375964 -123294 -184061 -185049 -319440 -284288
9777 -284288 137211 32833 -5835 -41455 -39374 -19102 -21816 41112 333463 -62106 -34308 -37201
9765 -37201 -175138 -233610 111605 -217292 323551 -73958 -183457 -240669 -24994 -83901 -129560
$$ packed form
9845e33974c0733k37056p6619d7811k37139q2902b7608C8317Q7789Q4817p4193
9834A36730n8280b22925L7717L0884o7329R9527d4893k38312A9794d5090j03018
9823a48108A5063a48701D9602J55771b35098Q4462I1c96007i834m4842k1624r3476
9811a69776M2739K02K6079r5798G6336J29068G2843h591k64302O2648B192N0186
9799E2378a8245l6948j35741B35327i6813J8397p1164M8606B47968E1159L1866
9788H3025a27117j25465o8513A74403E098c75964a23294o0767r88j34391L5152
9777b84288A37211C2833e835l5620K081a9102k714D1112K92351f2106K7798k893
9765c7201j37937n8472A11605b17292C23551g3958j09499n7212b4994n8907m5659
$$ plain form
9754 -129560 20240 229728 -208351 -275099 6044 -111312 88250 -140251 38337 151343 -456971
9742 -204928 -330710 -114168 -18690 -5059 -99083 72958 145610 83608 -274840 -293463 48833
9730 -261478 -217186 146568 81471 -184723 -285686 -301184 122816 -36339 -79442 -263205 127674
9718 183314 5369 -75695 212190 -261500 -314111 -54593 79569 156113 177745 251964 -255495
9706 -57766 -126683 338977 -72176 -10644 -234026 116944 124841 67058 106386 244430 -599968
9694 -277357 69796 20052 -398382 -68607 -299871 -40295 -237 -86709 -194592 257995 -95389
9682 -43838 -276262 80298 238426 174411 -62722 -219460 149357 88780 207654 -84404 -29707
9670 -9324 119382 137436 -124552 194348 69175 -175820 -306896 342394 -163892 103395
$$ packed form
9754a29560B0240K09488b08351o6748F044a11312H8250a40251C8337J13006d56971
9742b04928j25782a14168a8690e059r4024G2958P2652o2002b74840j8623D8833
9730b61478M4292A46568o5097a84723j00963j5498A22816c6339m3103j83763A27674
9718A83314E369g5695B12190b61500n2611e4593G9569P6544K1632P4219b55495
9706e7766o8917C38977g2176a0644k23382A16944P897n7783L9328J38044e99968
9694b77357F9796B0052c98382f8607k31264d0295b37q6472j07883B57995i5389
9682d3838k32424H0298J58128o4015f2722j56738A49357o0577J18874h4404b9707
9670i324A19382J8054a24552A94348F9175a75820j31076C42394a63892A03395
$$ plain form
9659 -118727 -85719 119144 -245986 -55944 -58186 70910 7942 -101554 -157044 -12769 -358527
9648 -358527 98392 -278896 -196811 -297564 -92650 -58664 -182235 82541 -161036 -108735 -70302
9637 -70302 -65128 89824 5892 117015 -151612 141853 90552 11415 149092 -164955 6740
9625 139450 177320 -236548 -104924 -1784 -103816 -324715 95720 -228988 92179 -59942 -9601
9613 -296896 -171171 -480330 -24717 -366923 -232855 -24415 -258282 -84793 145243 11566
9602 123232 -67205 -95485 50891 254056 -42366 177012 -286394 -393156 -66851 132927 177529
9591 177529 -89082 114893 -120165 -233983 -160830 296838 -171136 -240076 -350007 288851
9580 -194501 -182530 -38963 -91107 -285433 -12274 -52373 -69368 139196 -162418 -54437 -169621
$$ packed form
9659a18727L3008A19144b45986e5944k242G0910G942a01554n5490a2769l45758
9648c58527I8392b78896Q2085j00753i2650L3986j23571H2541a61036N2301L8433
9637g0302N174H9824E892J11123a51612A41853n1301A1415J37677a64955F740
9625A39450L7870b36548a04924a784j02032k20899I5720b28988I2179e9942i601
9613b96896J25725l09159b4717l42206J34068b4415k33867h4793A45243A1566
9602A23232f7205k8280E0891K03165d2366A77012b86394j06762f6851A32927M4602
9591A77529h9082A14893a20165j13818P3153B96838a71136o8940j09931B88851
9580a94501J1971c8963n2144j94326a2274m0099j6995A39196a62418e4437j15184
$$ plain form
9569 -169621 -199908 97198 -101725 87433 118517 -49577 -519975 -122227 203538 -105229 -357878
9558 -357878 -176602 -89241 -253034 232299 -183711 224494 177681 97477 -13121 37181 35282
9547 35282 -227732 -19675 -307566 -84312 307364 -222508 11572 33502 119056 150296 -180525
9535 -95470 -128836 -82062 -79450 -373318 -105526 -44111 151 -187282 100531 274137 72247
9523 -299678 -298510 -292393 -406353 -43617 -345175 -249130 -70391 -210880 -61465 -259986 -159473
9512 -159473 -245351 137254 -227640 -16254 -206390 186886 -120938 -54562 104694 -165110
9501 -125750 -17482 -31093 -178852 -105251 -73250 8979 -195031 102827 -15093 -109442 207071
9489 112343 -297265 113481 98031 -11276 -102959 11505 21944 -25734 -90925 142618 -393389
$$ packed form
9569a69621l0287I7198a01725H7433L1084d9577m70398a22227B03538a05229k52649
9558c57878a76602Q7361j63793B32299a83711B24494m6813q0204a3121C7181j899
9547C5282b27732a9675k87891h4312C07364b22508A1572K1930Q5554L1240a80525
9535i5470l3366M6774K612k93868a05526d4111A51a87282A00531J73606G2247
9523b99678J168O117j13960d3617l01558R6045g0391j40489f1465j98521J00513
9512a59473q5878A37254b27640a6254j90136A86886a20938e4562A04694a65110
9501a25750a7482j3611j47759P3601L2001H979a95031A02827a5093r4349B07071
9489A12343b97265A13481j5450a1276r1683A1505J0439b5734o5191A42618c93389
$$ plain form
9477 19630 -35436 -81368 34801 18672 63407 -94555 -93061 -141756 -112868 -346642 105695 -192801
9464 137940 125457 -108486 -61607 15190 147881 74563 -211817 23945 -179334 -306119 99512
9452 252837 -221281 -195592 -194151 -240265 -288570 -25671 -95186 11272 -132357 -339340 -268325
9441 -268325 20128 -284618 -25551 -88659 137517 -10215 109236 -55234 -290740 -362676 177264
9429 119419 27337 183088 -292906 -123783 -306077 5256 86368 -101365 3013 100911 23803
9417 102248 100190 218789 -60881 -304147 150546 123182 297109 -124035 42524 -173528 -96552
9406 -96552 90804 -13700 -107004 -202304 -353974 85331 -131695 97960 -350109 -178750 -133394
9395 -133394 -59897 97116 -272832 -301411 -47476 -15196 141418 71164 -171107 217246 128250
$$ packed form
9477A9630c5436m5932C4801j6129M4735i4555J494m8695K8888k33774A05695a92801
9464A37940j2483a08486M6879A5190J32691p3318b11817B3945a79334j26785I9512
9452B52837b21281K5689J441m6114m8305b5671o9515A1272a32357k06983P1015
9441b68325B0128b84618b5551o3108A37517a0215A09236e5234k35506p1936A77264
9429A19419B7337J55751b92906a23783j82294E256Q1112a01365C013R7898B3803
9417A02248k058J18599f0881k43266A50546k7364J73927a24035D2524a73528P6976
9406i6552I0804a3700r3304r5300j51670H5331a31695I7960c50109J71359M5356
9395a33394e9897I7116b72832k8579d7476a5196A41418p0254a71107B17246q8996
$$ plain form
9384 128250 -142034 44981 -20016 -160107 -105420 261956 -71406 -224638 -136707 173490 -146518
9372 -93005 -112502 -95753 77430 -211079 -109537 -166331 -101330 -333640 -21433 52243 -153864
9360 164058 219386 67997 -268697 -349684 2933 -105012 -212536 40441 269252 -84829 -438501
9349 -438501 -103802 40558 -147992 -182062 -471164 41381 141257 -61813 -56254 139783 -33074
9337 10467 -182148 -54095 -16381 -228129 -232660 380340 -138876 -60135 323210 -304521 -131232
9325 -367969 -72709 93956 -158112 131727 -95815 -30943 -53571 3890 -172631 -256482 -35405
9313 -26316 -28503 145879 -90040 281800 307422 -272281 207717 73547 -6161 -137337 -147400
9302 -147400 -15724 -20545 -59727 -92983 -49991 -149532 213459 49360 -285754 -12549 -60470
$$ packed form
9384A28250a42034D4981b0016j40091N4687B61956g1406j53232Q7931A73490a46518
9372i3005j9497J6749G7430b11079J01542n6794O5001k32310b1433E2243a53864
9360A64058N5328F7997b68697q0987B933a05012j07524D0441K28811h4829l53672
9349d38501a03802D0558a47992l4070k89102D1381R9876f1813N559A39783c3074
9337A0467a82148e4095a6381k11748m531C80340a38876f0135C23210c04521a31232
9325c67969g2709I3956a58112A31727i5815c0943k2628C890a72631q3851c5405
9313b6316k187A45879i0040B81800K5622b72281B07717G3547f161j31176j0063
9302a47400a5724m821l9182l3256M2992r9541B13459D9360b85754a2549m7921
$$ plain form
9291 -60470 106657 -17077 -423667 52026 -311217 3679 -65471 -209771 57552 -166974 -179728
9280 -179728 -6883 -122007 -27107 -107383 -392163 -85045 -93298 63797 -196933 35125 -308072
9268 -13139 -108435 119657 237026 -283305 -168400 167278 -115868 -1557 125787 -88438 -51732
9257 -51732 46331 -281314 149033 172938 -160853 -257535 -2496 -103990 121484 231186 -285612
9245 -74667 58492 89817 255581 -80435 -66189 6159 -212838 -535085 -104077 469346 -5809
9233 -238959 22038 48994 -314971 -499817 150549 -82144 -332059 344249 -163409 -184683
9223 -184683 90732 19409 46429 -93345 70175 33262 202862 -202981 -193763 -42840 81435
9211 -153233 -175667 52744 -77675 -187921 64932 -261999 193684 76720 22407 -161489 -241406
$$ packed form
9291f0470A06657a7077m06590E2026c11217C679f5471j44300E7552a66974j2754
9280a79728f883j15124b7107q0276k84780h5045q253F3797a96933C5125c08072
9268a3139r5296A19657J17369b83305J14905A67278a15868a557A25787h8438L6706
9257e1732D6331b81314A49033K3905a60853r6682b496j01494A21484J09702b85612
9245g4667E8492L1325J65764h0435J4246F159b12838l22247a04077D69346e809
9233b38959B2038K6956c14971j84846A50549h2144k49915C44249a63409k1274
9223a84683I0732A9409K7020i3345G0175C3262J69600b02981R218d2840H1435
9211a53233k2434E2744g7675j10246F4932b61999A93684G6720B2407a61489p9917
$$ plain form
9200 -241406 -162253 140306 57180 -114079 -157196 5711 -5422 -25859 -291571 64093 -58454
9188 -124531 -183939 150044 -178899 -355929 -72355 -168644 317440 76759 -134880 -217424 -167901
9177 -167901 -142043 97300 -513625 40387 -172165 -54456 54385 75453 -122803 -47885 62304
9165 324698 205286 -214822 353014 -137335 239851 -214524 -5724 185771 -32660 -72278
9155 -72278 187749 74319 -286459 -137839 129161 -137401 20392 152097 -19002 -71221 -168002
9144 -168002 -320175 47632 -215229 -109953 -752 -143093 -400847 218496 25097 308123 78154
9132 -432246 76347 -57604 141948 -58863 -121748 -181752 -140398 194087 -146703 -348742 -189442
9121 -189442 -281799 -128963 -122403 -56009 -116426 128974 149531 -190996 -218989 156398 -233892
$$ packed form
9200b41406P9153A40306E7180a14079m3117E711e422k0437k65712F4093e8454
9188a24531n9408A50044a78899j77030g2355r6289C17440G6759a34880q2544M9523
9177a67901K5858I7300e13625D0387a72165e4456E4385K1068a22803d7885F2304
9165C24698j19412b14822C53014a37335B39851b14524e724A85771c2660l9618
9155g2278A87749G4319b86459a37839A29161a37401B0392J31705a9002n2219r6781
9144a68002j52173D7632b15229J05276g52j42341k57754B18496B5097K83026G8154
9132d32246G6347e7604A41948e8863o2885o0004M1354A94087a46703k02039J59300
9121a89442r2357a28963O560e6009o0417A28974K0557a90996k7993A56398b33892
$$ plain form
9109 -112781 99014 137959 -124295 -155047 32415 155146 -160361 269004 -202526 128548
9098 -14532 -84837 195129 405598 -103999 -179216 -183075 240271 35348 -51315 -72729 22673
9086 -59976 115114 -32643 -23515 357020 290106 -90766 -28611 56162 98349 -204097 -35959
9074 314447 133035 -109139 99856 -293867 26191 114787 -249259 -183155 141591 -156421
9063 -40397 -65395 66445 -156804 -134207 -147544 -50392 22982 -143467 -145525 220665 41053
9051 -144881 -90359 2879 -366560 -304785 -30517 -42108 36462 -3610 -165982 80617 -54148 -116773
9039 -116773 -167985 -138053 -120417 -49469 -166556 -155004 -39354 208652 -170490 -42203 252712
9027 113011 -90840 -93827 -8712 -152238 -320217 -63186 -43910 -1944 21621 14081 33846 -216754
$$ packed form
9109a12781I9014L8945a24295l0752C2415J22731a60361B69004b02526A28548
9098a4532p0305A95129K10469a03999p5217l859B40271C5348e1315k1414B2673
9086e9976A15114c2643R128C57020o6914i0766b8611E6162M2187b04097c5959
9074C14447A33035a09139I9856b93867B6191Q8596b49259O6104A41591a56421
9063d0397k4998F6445a56804K2597j3337e0392B2982a43467k058B20665D1053
9051a44881N4522B879c66560O1775c0517j1591C6462c610j62372H0617e4148o2625
9039a16773n1212K9932J7636d9469j17087J1552c9354B08652a70490d2203B52712
9027A13011i0840k987h712j43526j67979f3186J9276a944B1621p540J9765b16754
$$ plain form
9014 72799 -159464 -24655 -97564 -208633 -336829 -199367 -85887 127633 -142503 -64946 139862
9002 -532519 15654 98040 67602 -152430 -315691 -3913 -213095 -158188 -181252 -357737 -415260
8991 -415260 -431028 -46910 -76007 -139406 -250017 -73881 -149267 109736 39265 -124505 159930
8979 159250 354999 6742 -40795 -36336 -163180 -313697 -170832 -2320 85886 119095 -215318
8967 22640 153139 -109222 109942 -35444 -54874 -216538 7979 -327515 -242204 -111767 -156311
8956 -156311 301869 134640 55585 -100553 -225500 -113617 35272 -79290 244199 175606
8946 175606 -223187 -20417 99345 -520087 -97773 135086 326704 -44847 -166466 19973 -371669
8934 -28887 -263689 -399886 13496 -248660 -133242 220223 69263 -57370 -178877 75137 195294
$$ packed form
9014G2799a59464b4655p2909j11069j28196J37462h5887A27633a42503f4946A39862
9002e32519A5654Q2386l0438a52430j63261c913k09182N4907k3064j76485n7523
8991d15260j5768d6910k9097o3399j10611g3881p5386A09736C9265a24505A59930
8979A59250J95749F742d0795M459j26844j50517J42865b320H5886L3209b15318
8967B2640J30499a09222A09942c5444j9430j61664G979c27515Q5311a11767m4544
8956a56311C01869A34640E5585a00553j24947J11883C5272g9290B44199o8593
8946A75606b23187b0417I9345e20087i7773A35086J91618d4847j21619A9973c71669
8934b8887k34802j36197A3496b48660J15418B20223F9263e7370j21507G5137J20157
$$ plain form
8923 195294 446398 952724 579532 311784 149064 25921 -30165 -7087 -218296 10568 178038
8912 178038 28436 -332777 203915 -149004 -84277 26619 141876 129020 -110604 110061
8901 -251795 -463163 -93855 -82637 -223813 151001 -87548 32545 9847 217004 -95863 -169829
8890 -169829 -183125 -427178 -31415 -366213 45030 187680 195137 88268 46148 -23666 271698
8878 -106461 -165653 120433 89689 -101069 182788 -99730 -178765 -270882 15730 -45768 -94793
$$ packed form
8923A95294K51104N06326l73192k67748A49064B5921c0165g087k11209A0568J67470
8912A78038B8436c32777B03915a49004O4727B6619J15257j2856a10604A10061
8901b51795k11368i3855J1218j41176A51001h7548C2545I847K07157i5863p3966
8890a69829j3296k44053c1415l34798D5030J42650P457H8268m2120b3666B71698
8878a06461n9192A20433l0744a01069A82788i9730p9035r2117A5730d5768m9025
$$ [...]
##END NTUPLES=NMR SPECTRUM
##END=
