##TITLE=AC1469_13FE002651_8026970_5drCmvS8Dh
##JCAMPDX= 6.0         $$ Bruker NMR JCAMP-DX V2.0
##DATA TYPE= NMR SPECTRUM
##DATA CLASS= NTUPLES
##ORIGIN= BRUKER
##OWNER= Administrator
$$ 1.72 TOPSPIN		Version 2.1
$$ 2013-07-18 16:25:18.391 -0700  Administrator@X
$$ Compression mode = diff/dup
##.OBSERVE FREQUENCY= 400.02188249412
##.OBSERVE NUCLEUS= ^1H
##.ACQUISITION MODE= SIMULTANEOUS (DQD)
##.ACQUISITION SCHEME= undefined
##.AVERAGES= 64
##.DIGITISER RES= 22
##SPECTROMETER/DATA SYSTEM= spect
##.PULSE SEQUENCE= noesygpps1d.comp
##.SOLVENT NAME= COFFEE_meoh
##.SHIFT REFERENCE= INTERNAL, COFFEE_meoh, 1, 14.96076
##AUDIT TRAIL= $$ (NUMBER, WHEN, WHO, WHERE, PROCESS, VERSION, WHAT)
$$ ##TITLE= Audit trail, TOPSPIN		Version 2.1
$$ ##JCAMPDX= 5.01
$$ ##ORIGIN= Bruker BioSpin GmbH
$$ ##OWNER= Administrator
$$ $$ E:\/data/COFFEE/nmr/AC1469_13FE002651_8026970_5drCmvS8Dh/32/pdata/1/auditp.txt
$$ ##AUDIT TRAIL=  $$ (NUMBER, WHEN, WHO, WHERE, PROCESS, VERSION, WHAT)
(   1,<2013-07-18 16:25:13.532 -0700>,<Administrator>,<X>,<go>,<TOPSPIN 2.1>,
      <created by zg
	started at 2013-07-18 16:13:44.015 -0700,
	POWCHK enabled, PULCHK disabled,
       configuration hash MD5:
       C8 4E 4E 5D D3 5C D8 9E 9F 52 82 E0 59 8A DE 15
       data hash MD5: 64K
       7A 4E AA 67 E2 1F E6 99 0B AD E9 14 D9 34 45 33>)
(   2,<2013-07-18 16:25:16.469 -0700>,<Administrator>,<X>,<proc1d>,<TOPSPIN 2.1>,
      <Start of raw data processing
       efp LB = 0.3 FT_mod = 6 PKNL = 1 PHC0 = 0 PHC1 = 0 SI = 128K 
       data hash MD5: 128K
       16 E4 21 E1 4D 36 5E 1E 81 63 3E BD A0 6D FD 11>)
(   3,<2013-07-18 16:25:17.391 -0700>,<Administrator>,<X>,<proc1d>,<TOPSPIN 2.1>,
      <pk PHC0 = -79.96948 PHC1 = 0 
       data hash MD5: 128K
       81 1B 97 A1 EA 8E B5 92 0B 9F D6 C0 67 17 7D D9>)
(   4,<2013-07-18 16:25:17.844 -0700>,<Administrator>,<X>,<proc1d>,<TOPSPIN 2.1>,
      <abs ABSG = 1 
       data hash MD5: 128K
       E8 F7 92 8A 7F 2E 5B 46 0D C4 E6 1B AF 39 98 7F>)
(   5,<2013-07-18 16:25:17.969 -0700>,<Administrator>,<X>,<proc1d>,<TOPSPIN 2.1>,
      <abs ABSG = 2 
       data hash MD5: 128K
       DD 63 F9 38 A8 1A F2 CA 8C 86 A1 17 35 7E 0B 44>)
(   6,<2013-07-18 16:25:18.048 -0700>,<Administrator>,<X>,<proc1d>,<TOPSPIN 2.1>,
      <abs ABSG = 3 
       data hash MD5: 128K
       AD 14 D1 A3 DC 1A 53 00 30 A7 33 85 70 D8 E4 3C>)
(   7,<2013-07-18 16:25:18.126 -0700>,<Administrator>,<X>,<proc1d>,<TOPSPIN 2.1>,
      <abs ABSG = 4 
       data hash MD5: 128K
       5E F5 3E 5C 59 DC 0B C0 5A 20 B0 47 76 F6 7B F1>)
(   8,<2013-07-18 16:25:18.235 -0700>,<Administrator>,<X>,<proc1d>,<TOPSPIN 2.1>,
      <abs ABSG = 5 
       data hash MD5: 128K
       3F 72 DA 04 96 6B CD A4 3A 8E 5A 0A 45 9A 5C 16>)
$$ ##END=
$$ 
$$ $$ hash MD5
$$ $$ BB 76 D4 A4 E1 22 26 F4 65 41 28 C8 97 59 02 5E
##$RELAX= 
##$RELAX= 
##$RELAX= 
##$RELAX= 
##$RELAX= 
##$RELAX= 
##$RELAX= 
##$RELAX= 
$$ Bruker specific parameters
$$ --------------------------
##$DU= <E:\>
##$EXPNO= 32
$$ [...]
##$TP07= 0
##$TPNAME0= <>
##$TPNAME1= <>
##$TPNAME2= <>
##$TPNAME3= <>
##$TPNAME4= <>
##$TPNAME5= <>
##$TPNAME6= <>
##$TPNAME7= <>
##$TPOAL= (0..7)
0.5 0.5 0.5 0.5 0.5 0.5 0.5 0.5
##$TPOFFS= (0..7)
0 0 0 0 0 0 0 0
##$TUNHIN= 0
##$TUNHOUT= 0
##$TUNXOUT= 0
##$USERA1= <user>
##$USERA2= <user>
##$USERA3= <user>
##$USERA4= <user>
##$USERA5= <user>
##$V9= 5
##$VALIST= <valist>
##$VCLIST= <CCCCCCCCCCCCCCC>
##$VD= 0
##$VDLIST= <DDDDDDDDDDDDDDD>
##$VPLIST= <PPPPPPPPPPPPPPP>
##$VTLIST= <TTTTTTTTTTTTTTT>
##$WBST= 1024
##$WBSW= 4
##$XGAIN= (0..3)
0 0 0 0
##$XL= 0
##$YL= 0
##$YMAX_a= 6607565
##$YMIN_a= -13082593
##$ZGOPTNS= <>
##$ZL1= 120
##$ZL2= 120
##$ZL3= 120
##$ZL4= 120
##$ABSF1= 14.96076
##$ABSF2= -5.597422
##$ABSG= 5
##$ABSL= 3
##$ALPHA= 0
##$AQORDER= 0
##$ASSFAC= 0
##$ASSFACI= 0
##$ASSFACX= 0
##$ASSWID= 0
##$AUNMP= <proc_prof1d_extract.lims>
##$AXLEFT= 0
##$AXNAME= <>
##$AXNUC= <1H>
##$AXRIGHT= 0
##$AXTYPE= 0
##$AXUNIT= <>
##$AZFE= 0.1
##$AZFW= 0.1
##$BCFW= 0
##$BC_mod= 0
##$BYTORDP= 0
##$COROFFS= 0
##$CY= 15
##$DATMOD= 1
##$DC= 0
##$DFILT= <>
##$DTYPP= 0
##$F1P= 0
##$F2P= 0
##$FCOR= 0.5
##$FTSIZE= 131072
##$FT_mod= 6
##$GAMMA= 0
##$GB= 0
##$INTBC= 1
##$INTSCL= 1
##$ISEN= 128
##$LB= 0.3
##$LEV0= 0
##$LPBIN= 0
##$MAXI= 10000
##$MC2= 0
##$MEAN= 0
##$ME_mod= 0
##$MI= 0
##$NCOEF= 0
##$NC_proc= -2
##$NLEV= 6
##$NOISF1= 0
##$NOISF2= 0
##$NSP= 0
##$NTH_PI= 0
##$NZP= 0
##$OFFSET= 14.96076
##$PC= 1
##$PHC0= -79.96948
##$PHC1= 0
##$PH_mod= 1
##$PKNL= yes
##$PPARMOD= 0
##$PPDIAG= 0
##$PPIPTYP= 0
##$PPMPNUM= 2147483647
##$PPRESOL= 1
##$PSCAL= 4
##$PSIGN= 0
##$PYNMP= <proc.py>
##$REVERSE= no
##$SF= 400.020009732317
##$SI= 131072
##$SIGF1= 0
##$SIGF2= 0
##$SINO= 400
##$SIOLD= 131072
##$SPECTYP= <>
##$SREGLST= <1H.CDCl3>
##$SSB= 0
##$STSI= 131072
##$STSR= 0
##$SW_p= 8223.68421052631
##$SYMM= 0
##$S_DEV= 0
##$TDeff= 65536
##$TDoff= 0
##$TI= <>
##$TILT= no
##$TM1= 0
##$TM2= 0
##$TOPLEV= 0
##$USERP1= <user>
##$USERP2= <user>
##$USERP3= <user>
##$USERP4= <user>
##$USERP5= <user>
##$WDW= 1
##$XDIM= 131072
##$YMAX_p= 379621725
##$YMIN_p= -10738
##$CURPLOT= <Network HP LaserJet P1505>
##$CURPRIN= <$Network HP LaserJet P1505>
##$DFORMAT= <normdp>
##$LAYOUT= <+/1D_H.xwp>
##$LFORMAT= <normlp>
##$PFORMAT= <normpl>
##$SURQMSG= 1
$$ End of Bruker specific parameters
$$ ---------------------------------
##NTUPLES= NMR SPECTRUM
##VAR_NAME=  FREQUENCY,     SPECTRUM/REAL,   SPECTRUM/IMAG
##SYMBOL=    X,             R,               I
##VAR_TYPE=  INDEPENDENT,   DEPENDENT,       DEPENDENT
##VAR_FORM=  AFFN,          ASDF,            ASDF
##VAR_DIM=   131072,        131072,          131072
##UNITS=     HZ,            ARBITRARY UNITS, ARBITRARY UNITS
##FACTOR=    0.0627417313425164, 1,          1
##FIRST=     8223.62146879497, 1337,         -68974
##LAST=      0,             3131,            -69740
##MIN=       0,             -10738,          0
##MAX=       8223.62146879497, 379621725,    0
$$ Real data points
##PAGE= N=1
##DATA TABLE= (X++(R..R)), XYDATA
$$ [...]
$$ plain form
61694 444984 440687 436589 432785 429272 425781 422176 418673 415526 412847 410860 409820 409422 408774 407378 405778
61679 405778 404749 404166 403226 401587 399673 397927 396422 395273 394790 394934 395116 394953 394913 395770 397545 399409
61663 399409 400687 401636 403033 405226 407849 410449 413022 415810 418904 422359 426444 431258 436127 440034
61649 440034 442865 445755 449867 455203 460959 466699 472671 479168 486045 492788 498696 503124 505981 507905
61635 507905 509528 510557 509953 506997 501855 495099 487158 478426 469557 461354 454369 448632 443708 439132
61621 439132 435010 432170 431486 433040 435995 439201 441767 443342 444155 444692 445016 444434 442133 438004 432613
61606 432613 426526 420037 413319 406325 398611 389830 380445 371481 363551 356616 350659 345923 342239 338774
61592 338774 334839 330557 326417 322577 318963 315683 312912 310571 308450 306461 304529 302442 300105 297702
$$ packed form
61694D44984m297m098l804l513l491l605l503l147k679j987j040l98o48j396j600
61679D05778j029n83r40j639j914j746j505j149m83J44J82j63m0Q57J775J864
61663C99409J278R49J397K193K623K600K573K788L094L455M085M814M869L907
61649D40034K831K890M112N336N756N740N972O497O877O743N908M428K857J924
61635E07905J623J029o04k956n142o756p941q732q869q203o985n737m924m576
61621D39132m122k840o84J554K955L206K566J575Q13N37L24n82k301m129n391
61606D32613o087o489o718o994p714q781r385q964p930o935n957m736l684l465
61592C38774l935m282m140l840l614l280k771k341k121j989j932k087k337k403
$$ plain form
61578 297702 295382 293014 290524 288200 286346 284823 283282 281637 279960 278057 275559 272457 269244 266507
61564 266507 264549 263314 262394 261229 259584 257874 256795 256622 257046 257604 258073 258486 259003 259828 261060 262593
61548 262593 264235 265905 267620 269391 271201 272998 274547 275496 275837 276228 277514 279885 282724 285292 287391
61533 287391 289284 291244 293306 295338 297135 298473 299199 299286 298747 297454 295186 291942 288173 284506 281171
61518 281171 277882 274387 270939 267945 265390 262954 260614 258634 256934 255022 252790 250915 250100 250230 250620
61503 250620 250799 250637 249979 248736 247295 246334 246128 246358 246659 247049 247732 248793 250225 251959 253663 254700
61487 254700 254519 253146 251210 249486 248377 247784 247429 247246 247335 247568 247537 247051 246436 246112 246060 245987 245836 245776 245814
61468 245814 245819 245914 246394 247178 247780 247976 248130 248613 249197 249375 249110 248948 249430 250604 252084 253418 254398 255158 256020
$$ packed form
61578B97702k320k368k490k324j854j523j541j645j677j903k498l102l213k737
61564B66507j958j235r20j165j645j710j079j73M24N58M69M13N17Q25J232J533
61548B62593J642J670J715J771J810J797J549R49L41L91J286K371K839K568K099
61533B87391J893J960K062K032J797J338P26Q7n39j293k268l244l769l667l335
61518B81171l289l495l448k994k555k436k340j980j700j912k232j875q15J30L90
61503B50620J79j62o58j243j441r61k06K30L01L90O83J061J432J734J704J037
61487B54700j81j373j936j724j109n93l55j83Q9K33l1m86o15l24n2p3j51o0L8
61468B45814NR5M80P84O02J96J54M83N84J78k65j62M82J174J480J334R80P60Q62
$$ plain form
61449 256020 257162 258444 259591 260530 261496 262777 264406 266152 267913 270102 273461 278271 283864 289173 293799
61434 293799 298281 303219 308409 313096 316926 320309 323769 327172 329774 331015 331103 330749 330454 330247 330130 330478
61418 330478 331781 334052 336760 339333 341587 343600 345337 346476 346546 345296 342974 340133 337002 333188 328233
61403 328233 322408 316605 311497 307151 303471 300534 298250 296121 293684 290971 288246 285605 283216 281623
61389 281623 281297 281980 282958 283916 284976 285956 286285 285881 285543 286048 287276 288599 289740 290793 291748 292599 293775
61372 293775 295783 298399 300780 302479 303891 305532 307401 309330 311480 314103 317098 320169 323204 326230
61358 326230 329262 332535 336612 341785 347605 353514 359809 367421 376714 387043 397581 408007 418246
61345 418246 428017 437041 445320 452990 460175 467200 474529 482204 489665 496440 502643 508410 513273 516661
$$ packed form
61449B56020J142J282J147R39R66J281J629J746J761K189L359M810N593N309M626
61434B93799M482M938N190M687L830L383L460L403K602J241Q8l54k95k07j17L48
61418C30478J303K271K708K573K254K013J737J139P0j250k322k841l131l814m955
61403C28233n825n803n108m346l680k937k284k129k437k713k725k641k389j593
61389B81623l26O83R78R58J060R80L29m04l38N05J228J323J141J053R55Q51J176
61372B93775K008K616K381J699J412J641J869J929K150K623K995L071L035L026
61358C26230L032L273M077N173N820N909O295P612R293J0329J0538J0426J0239
61345D18246R771R024Q279P670P185P025P329P675P461O775O203N767M863L388
$$ plain form
61331 516661 518699 519809 519636 517203 512275 505906 499255 492454 485132 477612 470893 465502 460962 456575
61317 456575 452332 448760 446074 443894 441785 439851 438598 438352 439000 440292 442266 445324 449934 456203 463538
61302 463538 470725 476501 480167 481677 481273 479277 476174 472467 468305 463510 458141 452735 447825 443515
61288 443515 439772 436760 434520 432622 430707 429186 428839 429705 430890 431607 432013 432929 435173 439247 445229
61273 445229 452602 460388 467758 474449 480618 486540 492532 498862 505561 512524 519905 528187 537779 548719
61259 548719 560843 573970 587869 602255 616853 631118 643975 654460 662830 670446 678133 685092
61247 685092 689864 691889 691532 689022 684243 677476 669565 661198 652607 644044 635865 627941 619576 610434
61233 610434 601068 592176 583790 575694 568232 562078 557288 553206 549309 545618 542152 538487 534233 529662
$$ packed form
61331E16661K038J110j73k433m928o369o651o801p322p520o719n391m540m387
61317D56575m243l572k686k180k109j934j253k46O48J292J974L058M610O269P335
61302D63538P187N776L666J510m04j996l103l707m162m795n369n406m910m310
61288D43515l743l012k240j898j915j521l47Q66J185P17M06R16K244M074N982
61273D45229P373P786P370O691O169N922N992O330O699O963P381Q282R592J0940
61259E48719J2124J3127J3899J4386J4598J4265J2857J0485Q370P616P687O959
61247F85092M772K025l57k510m779o767p911q367q591q563q179p924q365r142
61233F10434r366q892q386q096p462o154m790m082l897l691l466l665m254m571
$$ plain form
61219 529662 525496 522177 519648 517753 516589 516358 517100 518604 520449 522043 522769 522236 520413 517554 514239
61204 514239 511562 510918 513136 517723 523295 528948 535120 543026 553469 566425 581576 598772 617812
61191 617812 637995 658139 676980 693502 707059 717581 725825 733192 740934 749315 757585 764833 770809
61178 770809 775924 780531 784370 786755 787262 786213 784460 782631 780528 777333 772484 766292 759600 752893
61164 752893 745870 737901 728715 718602 708088 697471 686612 675096 662714 649930 637824 627447
61152 627447 619183 612741 607705 603937 601422 599834 598423 596324 592917 587844 580836 571709 560600 548152
61138 548152 535403 523446 513023 504226 496637 489980 484635 481247 479809 479516 479810 481234 484919 491388
61124 491388 500203 510630 522246 534919 548635 563439 579350 596291 614319 633739 654621 676310
$$ packed form
61219E29662m166l319k529j895j164k31P42J504J845J594P26n33j823k859l315
61204E14239k677o44K218M587N572N653O172P906J0443J2956J5151J7196J9040
61191F17812K0183K0144J8841J6522J3557J0522Q244P367P742Q381Q270P248N976
61178G70809N115M607L839K385N07j049j753j829k103l195m849o192o692o707
61164G52893p023p969r186j0113j0514j0617j0859j1516j2382j2784j2106j0377
61152F27447q264o442n036l768k515j588j411k099l407n073p008r127j1109j2448
61138E48152j2749j1957j0423q797p589o657n345l388j438k93K94J424L685O469
61124D91388Q815J0427J1616J2673J3716J4804J5911J6941J8028J9420K0882K1689
$$ plain form
61112 676310 697877 719052 740277 761803 783237 804057 823989 842661 859446 873969 886243
61101 886243 895989 902381 904948 904220 900856 894550 884555 871057 855243 838017 819354 799076 777594
61088 777594 755603 733461 711192 688848 666659 644994 624236 604555 585824 567908 550975
61077 550975 535190 520283 505862 492111 479705 468912 459295 450412 442303 435035 428364 422225 417136
61064 417136 413569 411138 408989 406874 405315 404657 404492 404250 404059 404655 406523 409372 412554 415899 419984
61049 419984 425540 432750 441305 451021 462100 474684 488438 502831 517677 533118 549086 565036
61037 565036 580358 594975 609484 624685 640955 658004 675228 692308 709472 727193 745675
61026 745675 764715 784161 804549 827202 853585 884615 920849 963467 1014738 1077340 1153508
$$ packed form
61112F76310K1567K1175K1225K1526K1434K0820J9932J8672J6785J4523J2274
61101H86243R746O392K567p28l364o306r995j3498j5814j7226j8663k0278k1482
61088G77594k1991k2142k2269k2344k2189k1665k0758j9681j8731j7916j6933
61077E50975j5785j4907j4421j3751j2406j0793r617q883q109p268o671o139n089
61064D17136l567k431k149k115j559o58j65k42j91N96J868K849L182L345M085
61049D19984N556P210Q555R716J1079J2584J3754J4393J4846J5441J5968J5950
61037E65036J5322J4617J4509J5201J6270J7049J7224J7080J7164J7721J8482
61026G45675J9040J9446K0388K2653K6383L1030L6234M2618N1271O2602P6168
$$ plain form
61015 1153508 1245298 1355634 1488570 1648102 1836175 2050355 2281290 2511224 2716133 2872485
61005 2872485 2966055 2997891 2984053 2949361 2918458 2908047 2922465 2952494 2977215 2969833 2907427
60994 2907427 2780631 2597077 2376442 2141499 1911319 1698731 1510420 1348092 1210408
60985 1210408 1094853 998457 917809 849719 792233 744434 705045 671923 643203 618259 596963
60974 596963 578529 561790 546371 532818 521492 511906 503344 495639 489026 483454 478441 473564 468857
60961 468857 464615 460942 457567 454096 450293 446150 441793 437439 433376 429843 426916 424572 422776 421426
60947 421426 420282 419160 418139 417381 416828 416304 415861 415632 415322 414292 412324 409848 407077 403366 397989 391354
60931 391354 384843 379462 375098 371071 366888 362323 357296 352000 346793 341750 336641 331589 327352 324572
$$ packed form
61015A153508R1790J10336J32936J59532J88073K14180K30935K29934K04909J56352
61005B872485R3570L1836j3838l4692l0903j0411J4418L0029K4721p382o2406
60994B907427j26796j83554k20635k34943k30180k12588j88311j62328j37684
60985A210408j15555r6396q0648o8090n7486m7799l9389l3122k8720k4944k1296
60974E96963j8434j6739j5419j3553j1326r586q562p705o613n572n013m877m707
60961D68857m242l673l375l471l803m143m357m354m063l533k927k344j796j350
60947D21426j144j122j021p58n53n24m43k29l10j030j968k476k771l711n377o635
60931C91354o511n381m364m027m183m565n027n296n207n043n109n052m237k780
$$ plain form
60917 324572 322995 321830 320728 320000 320030 320872 322347 324167 326027 327954 330461 333924 337883 341442 344427
60902 344427 347594 351590 356212 360994 365925 371181 376600 381918 387222 392611 397565 401232 403328 404279
60888 404279 404458 403697 401613 397986 392771 386105 378482 370632 363086 356036 349609 343956 339032 334614 330663
60873 330663 327361 324690 322370 320360 319039 318640 318873 319408 320386 322021 323938 325398 326168 326776 327916 329946
60857 329946 332970 336996 341732 346427 350234 352868 354938 357585 361650 367032 372890 378503 383850 389295
60843 389295 394990 400754 406361 411607 416108 419308 420809 420618 419146 417095 415231 413974 413157 412370 411548
60828 411548 411014 410883 410722 409943 408421 406461 404158 401032 396482 390577 384140 378006 372342 366878 361503
60813 361503 356284 351047 345531 340057 335453 332036 329139 326038 322871 320100 317546 314657 311558 309073
$$ packed form
60917C24572j577j165j102p28L0Q42J475J820J860J927K507L463L959L559K985
60902C44427L167L996M622M782M931N256N419N318N304N389M954L667K096R51
60888D04279J79p61k084l627n215o666p623p850p546p050o427n653m924m418l951
60873C30663l302k671k320k010j321l99K33N35R78J635J917J460P70O08J140K030
60857C29946L024M026M736M695L807K634K070K647M065N382N858N613N347N445
60843C89295N695N764N607N246M501L200J501j91j472k051j864j257q17p87q22
60828D11548n34j31j61p79j522j960k303l126m550n905o437o134n664n464n375
60813C61503n219n237n516n474m604l417k897l101l167k771k554k889l099k485
$$ plain form
60799 309073 307729 307395 307882 309168 310857 312111 312463 312246 311978 311886 312256 313602 315984 318586 320526 321816
60783 321816 323130 324993 327630 331284 336022 341373 346729 352070 357877 364409 371504 379076 387263 395958
60769 395958 404615 412633 419747 426035 431829 437563 443302 448400 452060 454314 456064 458018 459944 461164
60755 461164 461397 460879 460065 459623 460470 463235 467596 472435 476734 480156 482826 484945 486781 488714 490947
60740 490947 493232 495147 496625 497971 499381 500805 502435 504892 508594 513228 518358 524387 532348 542693
60726 542693 554875 568263 582876 598965 616503 635555 656641 680035 705001 730330 755393
60715 755393 780036 803658 825243 844314 861086 875430 886432 893368 896607 897008 894709 888896 878672
60702 878672 863945 845550 824696 802270 778697 754525 730707 707814 685217 661870 637980
$$ packed form
60799C09073j344l34M87J286J689J254L52k17k68r2L70J346K382K602J940J290
60783C21816J314J863K637L654M738N351N356N341N807O532P095P572Q187Q695
60769C95958Q657Q018P114O288N794N734N739N098L660K254J750J954J926J220
60755D61164K33n18q14m42Q47K765M361M839M299L422K670K119J836J933K233
60740D90947K285J915J478J346J410J424J630K457L702M634N130O029P961J0345
60726E42693J2182J3388J4613J6089J7538J9052K1086K3394K4966K5329K5063
60715G55393K4643K3622K1585J9071J6772J4344J1002O936L239M01k299n813j0224
60702H78672j4727j8395k0854k2426k3573k4172k3818k2893k2597k3347k3890
$$ plain form
60691 637980 615109 594340 575148 556538 538514 521656 505846 490402 475303 461450 449560
60680 449560 439425 430305 421610 413078 404735 396808 389498 382800 376701 371352 366785 362675 358733 355103
60666 355103 351959 348978 345771 342626 340190 338462 336785 334812 332822 331008 329238 327785 327575 329223
60652 329223 332242 335598 338638 341193 343258 345023 346877 348963 351016 352927 355030 357384 359200 359673
60638 359673 359129 358676 358865 359328 359735 360351 361434 362658 363560 364244 365303 367197 369891 372951 375811 378067
60622 378067 379629 380532 380621 379664 377835 375748 373740 371350 367884 363462 359144 355862 353458 351013 347989
60607 347989 344789 342132 340146 338249 335800 332671 329238 326048 323474 321457 319488 317038 314114 311292
60593 311292 309129 307691 306721 306020 305484 304976 304436 304056 304154 304839 305882 306847 307324 307276 307313 308441 311244 315394
$$ packed form
60691F37980k2871k0769j9192j8610j8024j6858j5810j5444j5099j3853j1890
60680D49560j0135r120q695q532q343p927p310o698o099n349m567m110l942l630
60666C55103l144k981l207l145k436j728j677j973j990j814j770j453k10J648
60652C29223L019L356L040K555K065J765J854K086K053J911K103K354J816M73
60638C59673n44m53J89M63M07O16J083J224R02O84J059J894K694L060K860K256
60622C78067J562R03Q9r57j829k087k008k390l466m422m318l282k404k445l024
60607C47989l200k657j986j897k449l129l433l190k574k017j969k450k924k822
60593C11292k163j438r70p01n36n08n40l80R8O85J043R65M77m8L7J128K803M150
$$ plain form
60575 315394 320176 325323 331036 337373 344094 351105 358595 366545 374436 381655 387880 392903 396376 398038
60561 398038 398043 396708 394071 390033 385000 380037 376228 373955 372944 372930 374114 376915 381410 387216 393972
60546 393972 401781 411007 421614 432901 443831 453418 460786 465185 466313 464596 460963 456259 450951
60533 450951 445334 439823 434962 431140 428355 426240 424420 422902 422047 422083 422653 423045 422884 422451 422323 422879
60517 422879 424251 426492 429502 432915 436417 440233 444978 450928 457771 465272 473908 484525 497644 513464
60503 513464 532341 554698 580387 608614 638646 670169 702686 734873 764808 790600 810605
60492 810605 823358 827728 823131 809490 787278 757872 723588 686928 649769 613388 578939 547457
60480 547457 519497 495135 474230 456381 440798 426721 413963 402691 392831 384117 376586 370393
$$ packed form
60575C15394M782N147N713O337O721P011P490P950P891P219O225N023L473J662
60561C98038Nj335k637m038n033m963l809k273j011j4J184K801M495N806O756
60546C93972P809R226J0607J1287J0930R587P368M399J128j717l633m704n308
60533D50951n617n511m861l822k785k115j820j518q55L6N70L92j61m33j28N56
60517D22879J372K241L010L413L502L816M745N950O843P501Q636J0617J3119J5820
60503E13464J8877K2357K5689K8227L0032L1523L2517L2187K9935K5792K0005
60492H10605J2753M370m597j3641k2212k9406l4284l6660l7159l6381l4449l1482
60480E47457k7960k4362k0905j7849j5583j4077j2758j1272r860q714p531o193
$$ plain form
60468 370393 365146 360055 354903 350225 346338 342789 339128 335607 332647 330044 327281 324331 321649 319577
60454 319577 318201 317551 317415 317108 315994 314235 312563 311268 309925 308219 306625 305896 306089 306384 305916 304617
60438 304617 303175 302148 301323 300081 298271 296356 294721 293323 292185 291752 292289 293344 294274 295034 295925 296756
60422 296756 296908 296187 295098 294242 293961 294484 295842 297505 298703 299325 300017 301199 302500 303366 303701 303606 303041
60405 303041 302208 301779 302209 303145 304074 305221 307111 309434 311162 311896 312426 313667 315538 317283 318504 319484
60389 319484 320684 322322 324349 326500 328330 329453 329860 329929 330130 330823 332249 334443 337058 339436 341099
60374 341099 342156 343132 344427 346009 347569 348777 349409 349468 349350 349666 350673 351977 353018 353750 354572 355658
60358 355658 356763 357784 359108 361124 363609 365918 367710 369231 370969 373194 375794 378345 380367 381755
$$ packed form
60468C70393n247n091n152m678l887l549l661l521k960k603k763k950k682k072
60454C19577j376o50j36l07j114j759j672j295j343j706j594p29J93K95m68j299
60438C04617j442j027q25j242j810j915j635j398j138m33N37J055R30P60Q91Q31
60422B96756J52p21j089q56k81N23J358J663J198O22O92J182J301Q66L35r5n65
60405C03041q33m29M30R36R29J147J890K323J728P34N30J241J871J745J221R80
60389C19484J200J638K027K151J830J123M07O9K01O93J426K194K615K378J663
60374C41099J057R76J295J582J560J208O32N9j18L16J007J304J041P32Q22J086
60358C55658J105J021J324K016K485K309J792J521J738K225K600K551K022J388
$$ plain form
60344 381755 382891 384160 385369 385938 385665 385039 384666 384590 384356 383540 382084 380242 378412 376883 375534 373856
60328 373856 371541 369039 367236 366462 366043 365023 363220 361380 360386 360518 361502 363026 365022 367514 370370
60313 370370 373395 376735 381105 387402 395927 406142 417370 429626 443479 459009 475124 489968
60301 489968 501800 509501 512644 511494 506829 499467 489999 479061 467677 456976 447623 439715 433140
60288 433140 427685 422862 418082 413180 408535 404532 401171 398344 396145 394595 393222 391245 388217 384359
60274 384359 380298 376665 373824 371762 370146 368618 367105 365787 364729 363590 361790 359021 355639 352489
60260 352489 350268 349025 348331 347861 347635 347726 347968 348090 348043 348046 348325 348831 349202 349051 348381 347675 347439 347696 348128
60241 348128 348666 349616 351174 353081 354964 356766 358645 360653 362741 364962 367457 370249 373124 375625 377194
$$ packed form
60344C81755J136J269J209N69k73o26l73p6k34q16j456j842j830j529j349j678
60328C73856k315k502j803p74m19j020j803j840r94J32R84J524J996K492K856
60313C70370L025L340M370O297Q525J0215J1228J2256J3853J5530J6115J4844
60301D89968J1832P701L143j150m665p362r468j0938j1384j0701r353p908o575
60288D33140n455m823m780m902m645m003l361k827k199j550j373j977l028l858
60274C84359m061l633k841k062j616j528j513j318j058j139j800k769l382l150
60260C52489k221j243o94m70k26R1K42J22m7LK79N06L71j51o70p06k36K57M32
60241C48128N38R50J558J907J883J802J879K008K088K221K495K792K875K501J569
$$ plain form
60226 377194 377629 377581 378280 380469 383728 387078 390025 392772 395613 398548 401455 404304 407181 410317 414068
60211 414068 418549 423253 427300 430186 432221 434222 436847 440119 443515 446581 449527 452958 457003 461080
60197 461080 464743 468272 471973 475403 477927 479716 481336 482552 482485 481069 479339 477966 476461 474354 472269
60182 472269 471000 470103 468390 465548 462385 459543 456836 453964 451134 448649 446462 444513 443163 442865 443513
60167 443513 444358 444601 443992 442941 442086 441739 441753 441918 442253 442803 443402 443959 444788 446191 447818 448965 449617 450677
60149 450677 452848 455677 458134 459907 461675 464132 467170 470269 473350 476940 481537 487068 493047 499008
60135 499008 504610 509456 513165 515641 517067 517583 517273 516505 515966 516096 516685 517279 517722 518055 518123 517726 517007
60118 517007 516263 515434 514282 513026 512252 512031 511627 510378 508462 506570 505193 504525 504637 505214 505373 504328
$$ packed form
60226C77194M35m8O99K189L259L350K947K747K841K935K907K849K877L136L751
60211D14068M481M704M047K886K035K001K625L272L396L066K946L431M045M077
60197D61080L663L529L701L430K524J789J620J216o7j416j730j373j505k107k085
60182D72269j269q97j713k842l163k842k707k872k830k485k187j949j350k98O48
60167D43513Q45K43o09j051q55l47J4J65L35N50N99N57Q29J403J627J147O52J060
60149D50677K171K829K457J773J768K457L038L099L081L590M597N531N979N961
60135D99008N602M846L709K476J426N16l10p68n39J30N89N94M43L33O8l97p19
60118E17007p44q29j152j256p74k21m04j249j916j892j377o68J12N77J59j045
$$ plain form
60102 504328 502264 500155 498697 497747 496842 495838 494921 494298 494140 494616 495793 497564 499826 502580 505733 508839
60086 508839 511270 512777 513832 515304 517740 520982 524533 528164 531897 535364 537548 537615 535920 533829 532364
60071 532364 531285 529619 526882 523497 520098 516725 512827 507918 502100 495882 489643 483357 476855 470197
60057 470197 463694 457679 452401 448064 444704 441983 439404 436825 434604 433102 432311 432167 432929 434874 437697
60042 437697 440662 443374 446084 449106 452309 455342 458072 460559 462793 464701 466223 467121 466894 465213 462309
60027 462309 458647 454335 449217 443409 437306 431072 424610 418076 411933 406265 400586 394697 389288 385177
60013 385177 382214 379447 376201 372542 368817 365321 362456 360635 359770 359240 358616 358162 358454 359737 361836
59998 361836 364456 367338 370286 373277 376497 380101 384022 388046 392033 395975 399915 403781 407152 409336
$$ packed form
60102E04328k064k109j458r50r05j004r17o23j58M76J177J771K262K754L153L106
60086E08839K431J507J055J472K436L242L551L631L733L467K184O7j695k091j465
60071E32364j079j666k737l385l399l373l898m909n818o218o239o286o502o658
60057D70197o503o015n278m337l360k721k579k579k221j502p91j44P62J945K823
60042D37697K965K712K710L022L203L033K730K487K234J908J522Q98k27j681k904
60027D62309l662m312n118n808o103o234o462o534o143n668n679n889n409m111
60013C85177k963k767l246l659l725l496k865j821q65n30o24m54K92J283K099
59998C61836K620K882K948K991L220L604L921M024L987L942L940L866L371K184
$$ plain form
59984 409336 410078 410222 411246 413909 417702 421755 425712 429299 431612 431741 430096 428256 427275 426707 425607
59969 425607 423900 422185 420603 418700 416392 414323 412975 411870 410180 407888 405902 404965 404855 404759 404132
59954 404132 402995 401711 400801 400785 401796 403326 404649 405529 406299 407202 407997 408329 408170 407694 406896 405607 403824
59937 403824 401814 399927 398376 397201 396358 395848 395694 395732 395549 394856 393834 392792 391578 389821 387814 386594
59921 386594 386851 388175 389712 391127 392549 394056 395801 398238 401504 404763 406987 408355 410124 412950
59907 412950 416029 418220 419466 420728 422876 425966 429299 431871 433057 433142 433053 433449 434328 435590 437540 440542
59891 440542 444511 449005 453566 457730 461060 463540 465706 468077 470679 473393 476457 480116 483960 487134
59877 487134 489225 490555 491612 492590 493539 494506 495282 495220 493577 490094 485253 480011 475215 471107 467358 463647
$$ packed form
59984D09336P42J44J024K663L793M053L957L587K313J29j645j840r81n68j100
59969D25607j707j715j582j903k308k069j348j105j690k292j986r37j10r6o27
59954D04132j137j284r10j6J011J530J323Q80P70R03P95L32j59m76p98j289j783
59937D03824k010j887j551j175q43n10j54L8j83o93j022j042j214j757k007j220
59921C86594K57J324J537J415J422J507J745K437L266L259K224J368J769K826
59907D12950L079K191J246J262K148L090L333K572J186Q5q9L96Q79J262J950L002
59891D40542L969M494M561M164L330K480K166K371K602K714L064L659L844L174
59877D87134K091J330J057R78R49R67P76o2j643l483m841n242m796m108l749l711
$$ plain form
59861 463647 460133 457265 455247 453790 452294 450158 447082 443327 439617 436582 434336 432686 431593 431114
59847 431114 430976 430538 429257 427055 424230 421225 418474 416249 414564 413344 412685 412799 413684 415001 416331
59832 416331 417453 418353 419099 419766 420443 421266 422335 423497 424220 423918 422523 420528 418380 416049 413348 410338
59816 410338 407173 403857 400508 397631 395604 394041 392209 390087 388463 387892 387992 387974 387480 386663 385771 384975
59800 384975 384397 384029 383637 382919 381755 380259 378671 377143 375548 373663 371725 370596 370929 372211 373098 372821
59784 372821 371829 370891 370072 368914 367284 365578 364300 363771 364175 365465 367208 368752 369689 370126 370597 371687
59768 371687 373601 375941 378015 379448 380440 381473 382945 385146 388281 392319 396878 401396 405395 408698
59754 408698 411610 414823 418783 423177 427383 431401 435807 440701 445354 449258 452906 456954 461065 464308
$$ packed form
59861D63647l514k868k018j457j496k136l076l755l710l035k246j650j093m79
59847D31114j38m38j281k202k825l005k751k225j685j220o59J14Q85J317J330
59832D16331J122R00P46O67O77Q23J069J162P23l02j395j995k148k331k701l010
59816D10338l165l316l349k877k027j563j832k122j624n71J00j8m94q17q92p96
59800C84975n78l68l92p18j164j496j588j528j595j885j938j129L33J282Q87k77
59784C72821r92r38q19j158j630j706j278n29M04J290J743J544R37M37M71J090
59768C71687J914K340K074J433R92J033J472K201L135M038M559M518L999L303
59754D08698K912L213L960M394M206M018M406M894M653L904L648M048M111L243
$$ plain form
59740 464308 466477 468239 469907 470819 470291 468770 467565 467545 468388 469163 469458 469674 470264 471030 471515 471771 472160
59723 472160 472522 472312 471692 471616 472356 472764 471797 470160 469509 470388 471919 473314 474644 476114 477632 479347 481701
59706 481701 484639 487554 490348 493685 497768 501651 504427 506447 508641 511158 513463 515498 517853 520799
59692 520799 523817 526151 527407 527632 527238 526872 526956 527272 527265 526706 525788 524663 523260 521538 519516 517039 513907
59675 513907 510301 506695 503190 499263 494414 488874 483449 478793 475033 472021 469735 468293 467677 467641 468031
59660 468031 469064 471018 473638 476148 478115 479980 482413 485315 487919 489822 491498 493616 496196 498586
59646 498586 500041 500136 498854 496537 493645 490364 486514 481987 477139 472520 468278 464105 459801 455599 451790
59631 451790 448231 444568 440881 437798 435818 434682 433568 431775 429123 425884 422589 419785 417617 415576
$$ packed form
59740D64308K169J762J668R12n28j521j205k0Q43P75K95K16N90P66M85K56L89
59723D72160L62k10o20p6P40M08r67j637o51Q79J531J395J330J470J518J715K354
59706D81701K938K915K794L337M083L883K776K020K194K517K305K035K355K946
59692E20799L018K334J256K25l94l66Q4L16pn59r18j125j403j722k022k477l132
59675E13907l606l606l505l927m849n540n425m656l760l012k286j442o16l6L90
59660D68031J033J954K620K510J967J865K433K902K604J903J676K118K580K390
59646D98586J455R5j282k317k892l281l850m527m848m619m242m173m304m202l809
59631D51790l559l663l687l083j980j136j114j793k652l239l295k804k168k041
$$ plain form
59617 415576 412881 409227 405046 401031 397611 394866 392696 391041 390162 390653 392765 395655 397823 398555 398554 398834
59601 398834 399433 399679 399314 398729 398248 397814 397381 397066 396855 396680 396847 397840 399522 401003 401566 401333 400798 400109
59583 400109 399152 397973 396666 395030 392738 389858 386925 384443 382450 380582 378512 376326 374438 372994
59569 372994 371489 369270 366450 363933 362393 361646 361194 360966 361138 361611 362168 362984 364496 366799 369509 372169
59553 372169 374521 376538 378532 381114 384643 388788 393046 397518 402730 408789 415353 422516 431055 441620
59539 441620 454267 469047 486284 505482 524292 539377 548533 551779 550615 546787 541771 536896 533404
59526 533404 532233 533622 536892 540826 544543 547896 550903 553028 553457 551941 548887 544578 538813 531449
59512 531449 522868 513611 503919 493951 484197 475279 467430 460493 454322 448889 444000 439277 434460 429560
$$ packed form
59617D15576k695l654m181m015l420k745k170j655q79M91K112K890K168P32jK80
59601C98834N99K46l65n85m81m34m33l15k11j75J67R93J682J481N63k33n35o89
59583D00109r57j179j307j636k292k880k933k482j993j868k070k186j888j444
59569C72994j505k219k820k517j540p47m52k28J72M73N57Q16J512K303K710K660
59553C72169K352K017J994K582L529M145M258M472N212O059O564P163Q539J0565
59539D41620J2647J4780J7237J9198J8810J5085R156L246j164l828n016m875l492
59526E33404j171J389L270L934L717L353L007K125M29j516l054m309n765p364
59512E31449q581r257r692r968r754q918p849o937o171n433m889m723m817m900
$$ plain form
59498 429560 424702 420030 415781 412160 409064 406209 403684 402124 402052 403200 404773 406323 407995 409906 411649
59483 411649 412781 413624 415215 418370 422997 428395 434019 439724 445475 451119 456532 461737 466646 470792
59469 470792 473484 474332 473651 472379 471601 471981 473467 475516 477710 480195 483549 488286 494520 502012 510378
59454 510378 519233 528300 537449 546586 555444 563581 570640 576574 581555 585647 588612 589982 589280 586244
59440 586244 580954 573811 565369 556202 546935 538327 531096 525491 521043 516893 512499 508008 503973 500838
59426 500838 498857 498383 499926 503728 509453 516453 524323 533081 542983 554379 567626 582851 599767
59413 599767 617967 637358 657770 677772 694138 703088 702391 692478 675943 656370 637342 621620
59401 621620 610541 604094 601706 602806 606355 610036 610438 604533 591264 571957 549420 526542 505311
$$ packed form
59498D29560m858m672m249l621l096k855k525j560p2J148J573J550J672J911J743
59483D11649J132Q43J591L155M627N398N624N705N751N644N413N205M909M146
59469D70792K692Q48o81j272p78L80J486K049K194K485L354M737O234P492Q366
59454E10378Q855R067R149R137Q858Q137P059N934M981M092K965J370p02l036
59440E86244n290p143q442r167r267q608p231n605m448m150m394m491m035l135
59426E00838j981m74J543L802N725P000P870Q758R902J1396J3247J5225J6916
59413E99767J8200J9391K0412K0002J6366Q950o97r913j6535j9573j9028j5722
59401F21620j1079o447k388J100L549L681M02n905j3269j9307k2537k2878k1231
$$ plain form
59388 505311 486600 470494 456691 444762 434432 425848 419453 415334 412755 410731 409076 408538 409644
59375 409644 411750 413589 414574 415125 415774 416514 417180 418012 419445 421566 424105 426859 429879 433310 437262 441748
59359 441748 446507 451079 455426 460401 467160 476020 486290 497361 509484 523174 538177 553571 568821
59346 568821 584302 600671 617940 635263 651421 665486 677160 686585 693821 698603 700714 700468 698534
59333 698534 695233 690237 683088 673805 662903 651052 638939 627287 616644 607051 598012 588921 579554
59320 579554 570300 562022 555545 550981 547456 543734 539249 534437 529971 525885 521634 516881 511896 507177
59306 507177 503001 499474 496723 494781 493425 492361 491479 490692 489657 487979 485713 483320 481072 478867 476753
59291 476753 475242 474772 475146 475906 477111 479264 482426 485865 488821 491329 494083 497680 502219 507535 513555
$$ packed form
59388E05311j8711j6106j3803j1929j0330q584o395m119k579k024j655n38J106
59375D09644K106J839R85N51O49P40O66Q32J433K121K539K754L020L431L952M486
59359D41748M759M572M347M975O759Q860J0270J1071J2123J3690J5003J5394J5250
59346E68821J5481J6369J7269J7323J6158J4065J1674R425P236M782K111k46j934
59333F98534l301m996p149r283j0902j1851j2113j1652j0643r593r039r091r367
59320E79554r254q278o477m564l525l722m485m812m466m086m251m753m985m719
59306E07177m176l527k751j942j356j064q82p87j035j678k266k393k248k205k114
59291D76753j511m70L74P60J205K153L162L439K956K508K754L597M539N316O020
$$ plain form
59276 513555 520438 528560 538349 549956 562950 576414 589488 601897 613923 625823 637252 647345
59264 647345 655366 661230 665323 667860 668551 666858 662521 655861 647696 638956 630158 621150 611462 600987
59250 600987 590292 580214 571274 563535 556935 551525 547327 544162 541748 540007 539126 539253 540233 541784
59236 541784 543866 546661 550097 553621 556544 558385 558749 557121 553230 547556 541045 534223 526866 518625
59222 518625 509674 500619 492027 484179 477002 470077 463013 456068 450141 445854 442822 440130 437285 434343
59208 434343 431350 428242 425319 423272 422468 422514 422739 422850 422935 423040 423068 423034 423198 423901 425343 427542 430466 434173
59190 434173 438743 444020 449523 454802 459875 465166 471055 477609 484708 492138 499532 506447 512631 518032
59176 518032 522556 526130 529067 532105 535840 540377 545666 551894 559240 567435 575944 584480 592999 601232
$$ packed form
59276E13555O883Q122R789J1607J2994J3464J3074J2409J2026J1900J1429J0093
59264F47345Q021N864M093K537O91j693m337o660q165q740q798r008r688j0475
59250F00987j0695j0078q940p739o600n410m198l165k414j741q81J27R80J551
59236E41784K082K795L436L524K923J841L64j628l891n674o511o822p357q241
59222E18625q951r055q592p848p177o925p064o945n927m287l032k692k845k942
59208D34343k993l108k923k047q04M6K25J11Q5J05K8l4J64P03J442K199K924L707
59190D34173M570N277N503N279N073N291N889O554P099P430P394O915O184N401
59176E18032M524L574K937L038L735M537N289O228P346Q195Q509Q536Q519Q233
$$ plain form
59162 601232 608599 614645 619313 622679 624690 625266 624463 622402 619171 614937 609959 604343 597896 590495 582554
59147 582554 574828 567590 560236 552041 543234 534913 527765 521270 514550 507651 501411 496209 491584 487302
59133 487302 484045 482490 482219 482249 482379 483301 485475 488613 492338 496692 501722 507205 513196 520410 529553
59118 529553 540509 552612 565514 579356 594148 609450 624783 640067 655486 671017 686303
59107 686303 700924 714764 727932 740277 751167 760052 767212 773571 779579 784622 787778 788854 788339
59094 788339 786595 783636 779632 775163 770743 766415 761953 757237 752282 747070 741539 735672 729453 722776
59080 722776 715398 706961 697109 685750 673244 660230 647208 634402 622024 610475 600107 590807
59068 590807 581930 572726 562935 553011 543805 536004 529807 524980 521002 517177 512970 508498 504472 501335
$$ packed form
59162F01232P367O046M668L366K011N76q03k061l231m234m978n616o447p401p941
59147E82554p726p238p354q195q807q321p148o495o720o899o240n202m625m282
59133D87302l257j555k71L0J30R22K174L138L725M354N030N483N991P214R143
59118E29553J0956J2103J2902J3842J4792J5302J5333J5284J5419J5531J5286
59107F86303J4621J3840J3168J2345J0890Q885P160O359O008N043L156J076n15
59094G88339j744k959m004m469m420m328m462m716m955n212n531n867o219o677
59080G22776p378q437r852j1359j2506j3014j3022j2806j2378j1549j0368r300
59068E90807q877r204r791r924r206p801o197m827l978l825m207m472m026l137
$$ plain form
59054 501335 498576 495270 491309 487626 485070 483432 481892 480106 478446 477282 476541 476075 476100 476925 478396
59039 478396 479950 481263 482608 484440 486843 489650 492949 497135 502328 508050 513722 519301 525276 532173
59025 532173 540297 549797 560643 572557 585168 598296 611928 626001 640373 654807 668687 680838
59013 680838 690128 696337 700135 702157 702472 701040 698209 694517 690376 686287 683035 681272 681085 682252 684734
58998 684734 688491 693004 697442 701332 704680 707408 708994 708856 706843 703245 698435 692564 685533 677210
58984 677210 667806 657926 648105 638433 628839 619644 611421 604337 598059 592551 588513 586676 586878 588259
58970 588259 590289 593209 597433 602902 609202 616038 623280 630723 638136 645616 653570 662187 670980 678892
58956 678892 684779 687812 687749 685090 680782 675450 668922 660692 650765 639782 628491 617499 607496 599122
$$ packed form
59054E01335k759l306l961l683k556j638j540j786j660j164p41m66K5Q25J471
59039D78396J554J313J345J832K403K807L299M186N193N722N672N579N975O897
59025E32173Q124R500J0846J1914J2611J3128J3632J4073J4372J4434J3880J2151
59013F80838R290O209L798K022L15j432k831l692m141m089l252j763j87J167K482
58998F84734L757M513M438L890L348K728J586j38k013l598m810n871p031q323
58984F77210r404r880r821r672r594r195q223p084o278n508m038j837K02J381
58970E88259K030K920M224N469O300O836P242P443P413P480P954Q617Q793P912
58956F78892N887L033o3k659m308n332o528q230r927j0983j1291j0992j0003q374
$$ plain form
58942 599122 592365 586564 581334 577038 573948 571355 568124 563890 559105 554045 548472 542348 536195 530501
58928 530501 525305 520641 516887 514186 511904 509192 505956 502866 500491 498747 497154 495345 493313 491467
58914 491467 490426 490520 491435 492557 493674 495163 497481 500771 505098 510788 518182 527063 536563 545826 554712
58899 554712 563724 573231 582961 592390 601484 610739 620415 630099 639329 648520 658949 671749 687063
58886 687063 704138 721990 739917 757539 774505 790158 803547 813878 820932 824934 826052 824254
58874 824254 819630 812517 803148 791436 777325 761258 744100 726779 710202 695255 682463 671704
58862 671704 662597 655110 649311 644458 639006 631943 623767 615641 607842 599620 590527 581242 572839 565680
58848 565680 559338 553306 547400 541647 536192 531332 527286 523825 520323 516367 512169 508233 504643 500898
$$ packed form
58942E99122o757n801n230m296l090k593l231m234m785n060n573o124o153n694
58928E30501n196m664l754k701k282k712l236l090k375j744j593j809k032j846
58914D91467j041R4R15J122J117J489K318L290M327N690P394Q881R500R263Q886
58899E54712R012R507R730R429R094R255R676R684R230R191J0429J2800J5314
58886F87063J7075J7852J7927J7622J6966J5653J3389J0331P054M002J118j798
58874H24254m624p113r369j1712j4111j6067j7158j7321j6577j4947j2792j0759
58862F71704r107p487n799m853n452p063q176q126p799q222r093r285q403p159
58848E65680o342o032n906n753n455m860m046l461l502l956m198l936l590l745
$$ plain form
58834 500898 496560 491969 488099 485615 484191 482876 481050 478863 476774 474950 473243 471594 470223 469381
58820 469381 469037 468917 468791 468681 468723 468935 469299 470072 471756 474511 477769 480697 483017 485041 486987 488667
58804 488667 489971 491219 492699 494074 494627 494075 492903 491867 491292 490886 490161 489028 487929 487289 486956 486473
58788 486473 485902 486013 487444 489984 492978 496162 499803 504188 509331 515042 521040 527019 532809 538326 543213
58773 543213 546839 548971 550090 550557 549762 546824 542084 537130 533075 529494 525453 521020 517146 514330 512094
58758 512094 509821 507597 506037 505530 505909 506738 507713 508794 510102 511765 513789 515980 518059 519990 522123
58743 522123 524781 527788 530724 533764 537798 543411 550156 557202 564340 571783 579259 586136 592484 599218
58729 599218 606919 615037 622595 629155 634749 639290 642549 644417 644803 643525 640719 637192 633986 631684
$$ packed form
58834E00898m338m591l870k484j424j315j826k187k089j824j707j649j371q42
58820D69381l44j20j26j10M2K12L64P73J684K755L258K928K320K024J946J680
58804D88667J304J248J480J375N53n52j172j036n75m06p25j133j099o40l33m83
58788D86473n71J11J431K540K994L184L641M385N143N711N998N979N790N517M887
58773E43213L626K132J119M67p95k938m740m954m055l581m041m433l874k816k236
58758E12094k273k224j560n07L79Q29R75J081J308J663K024K191K079J931K133
58743E22123K658L007K936L040M034N613O745P046P138P443P476O877O348O734
58729E99218P701Q118P558O560N594M541L259J868L86j278k806l527l206k302
$$ plain form
58715 631684 630471 630648 632580 636122 640519 645028 649395 653596 657376 660202 661593 661358 659519 656059 650837
58700 650837 643771 635055 624986 613549 600430 585659 570133 555210 541733 529578 518208 507525
58688 507525 498080 490457 484599 479820 475418 471113 466905 462816 458982 455735 453209 451000 448623 446279
58674 446279 444742 444432 445033 446147 447832 450273 453379 457066 461548 466960 472978 479259 485971 493330 500739
58659 500739 507042 511720 515282 518234 520155 520253 518557 516058 513610 511133 508108 504543 501106 498392 496457
58644 496457 495077 494003 492763 490705 487746 484828 483055 482454 482129 481613 481382 481900 482824 483610 484340 485358
58628 485358 486383 486610 485711 484249 483038 482373 482006 481695 481642 482440 484617 488264 493139 498999 505636 512740
58612 512740 520082 527783 535969 544112 551191 556713 561136 565046 568369 570661 571735 571613 570287 567995
$$ packed form
58715F31684j213J77J932L542M397M509M367M201L780K826J391k35j839l460n222
58700F50837p066q716j0069j1437j3119j4771j5526j4923j3477j2155j1370j0683
58688E07525r445p623n858m779m402m305m208m089l834l247k526k209k377k344
58674D46279j537l10O01J114J685K441L106L687M482N412O018O281O712P359P409
58659E00739O303M678L562K952J921R8j696k499k448k477l025l565l437k714j935
58644D96457j380j074j240k058k959k918j773o01l25n16k31N18R24P86P30J018
58628D85358J025K27q99j462j211o65l67l11n3P98K177L647M875N860O637P104
58612E12740P342P701Q186Q143P079N522M423L910L323K292J074j22j326k292
$$ plain form
58598 567995 565458 563330 561548 559577 557148 554413 551625 549073 547230 546558 547205 549067 552019 555911 560618
58583 560618 566349 573609 582537 592575 603002 613442 623579 632864 640979 648181 654725 660437 665404
58570 665404 670577 676907 684276 692122 700790 711281 723799 737528 751937 767385 784267 802415
58558 802415 821516 841317 861078 879474 895431 908613 919016 926707 932087 935689 937421 936672 933435
58545 933435 928615 922857 915772 906818 896235 884480 871258 855859 838262 819358 800251 781740
58533 781740 764218 747635 731770 716940 704201 694426 687333 681747 676671 671772 667134 663034 659936
58520 659936 658222 657799 658094 658422 658313 657700 656995 656808 657444 658798 660828 663749 667571 671826 676044 680210
58504 680210 684327 687886 690212 691223 691350 690861 689735 688115 686312 684232 681370 677675 674017 671388 669781
$$ packed form
58598E67995k537k128j782j971k429k735k788k552j843o72O47J862K952L892M707
58583E60618N731P260Q928J0038J0427J0440J0137R285Q115P202O544N712M967
58570F65404N173O330P369P846Q668J0491J2518J3729J4409J5448J6882J8148
58558H02415J9101J9801J9761J8396J5957J3182J0403P691N380L602J732p49l237
58545I33435m820n758p085q954j0583j1755j3222j5399j7597j8904j9107j8511
58533G81740j7522j6583j5865j4830j2739r775p093n586n076m899m638m100l098
58520F59936j714m23K95L28j09o13p05j87O36J354K030K921L822M255M218M166
58504F80210M117L559K326J011J27m89j126j620j803k080k862l695l658k629j607
$$ plain form
58489 669781 668282 666310 664373 663418 663749 665000 667119 670839 676922 685248 695030 705719 717269 729575
58475 729575 742105 754123 764966 774030 780818 785098 786853 786135 783211 778686 773048 766207 758081 749592
58461 749592 742370 737256 733721 731064 729545 729865 732034 735406 739572 744653 750741 757392 763577 767909
58447 767909 769179 767104 762520 756692 750531 744531 739093 734495 730746 727771 725625 724308 723659 723730 725018
58432 725018 727955 732339 737633 743696 750812 759060 768117 777754 788216 799890 812660 825688 837850
58419 837850 848468 857574 865331 871323 874814 875738 874981 873406 870977 867211 862175 856594 851105 845779
58405 845779 840390 834834 829347 824503 820929 818832 817883 817751 818603 820872 824626 829396 834516 839413 843590
58390 843590 846638 848336 848706 847974 846504 844656 842624 840418 837996 835339 832539 829968 828258 827830 828524
$$ packed form
58489F69781j499j972j937r55L31J251K119L720O083Q326R782J0689J1550J2306
58475G29575J2530J2018J0843R064O788M280J755p18k924m525n638o841q126q489
58461G49592p222n114l535k657j519L20K169L372M166N081O088O651O185M332
58447G67909J270k075m584n828o161o000n438m598l749k975k146j317o49P1J288
58432G25018K937M384N294O063P116Q248R057R637J0462J1674J2770J3028J2162
58419H37850J0618R106P757N992L491R24p57j575k429l766n036n581n489n326
58405H45779n389n556n487m844l574k097r49j32Q52K269L754M770N120M897M177
58390H43590L048J698L70p32j470j848k032k206k422k657k800k571j710m28O94
$$ plain form
58375 828524 829961 832171 835413 839483 843752 848012 852780 858607 865511 873251 881627 890335 899047 907949
58361 907949 917798 929087 941518 954444 967344 979607 990455 999614 1007610 1014983 1021574 1026976 1031361
58348 1031361 1035325 1039217 1043064 1046987 1051313 1056433 1062778 1070676 1080002 1090307 1101502 1114031 1128168
58335 1128168 1143624 1160127 1177761 1196233 1214393 1231129 1246423 1260938 1274820 1287421 1298020
58324 1298020 1306407 1312940 1318363 1323291 1327721 1331402 1334823 1339171 1344945 1351402 1357921 1365203 1374309 1385147
58310 1385147 1396837 1409213 1423016 1438735 1455999 1474106 1492590 1511361 1530703 1550939 1571777
58299 1571777 1592315 1611994 1631023 1649529 1667075 1683604 1700069 1717274 1734722 1751567 1768180
58288 1768180 1785795 1805035 1825767 1848028 1872044 1897593 1924230 1951948 1980820 2010452 2040724
$$ packed form
58375H28524J437K210L242M070M269M260M768N827O904P740Q376Q708Q712Q902
58361I07949R849J1289J2431J2926J2900J2263J0848R159P996P373O591N402M385
58348A031361L964L892L847L923M326N120O345P898R326J0305J1195J2529J4137
58335A128168J5456J6503J7634J8472J8160J6736J5294J4515J3882J2601J0599
58324A298020Q387O533N423M928M430L681L421M348N774O457O519P282R106J0838
58310A385147J1690J2376J3803J5719J7264J8107J8484J8771J9342K0236K0838
58299A571777K0538J9679J9029J8506J7546J6529J6465J7205J7448J6845J6613
58288A768180J7615J9240K0732K2261K4016K5549K6637K7718K8872K9632L0272
$$ plain form
58277 2040724 2072592 2107033 2143478 2180477 2217739 2256389 2297306 2340351 2385238 2432099 2481072
58266 2481072 2532191 2585724 2641910 2700449 2760956 2823673 2888984 2956586 3025957 3097134 3170059
58255 3170059 3243680 3316919 3390136 3464451 3540099 3616757 3695117 3776650 3862107 3951720 4046605
58244 4046605 4148264 4256809 4371332 4492014 4620259 4756674 4900696 5052439 5213254
58235 5213254 5384135 5565153 5756873 5960843 6178279 6409616 6655701 6918145 7198341
58226 7198341 7497527 7817967 8162604 8533414 8931586 9359489 9820984 10319936 10860221
58217 10860221 11447447 12088991 12792421 13565844 14420078 15368716 16426259 17608631 18936318
58208 18936318 20435751 22138595 24082925 26316146 28895460 31886278 35362462 39405937
$$ packed form
58277B040724L1868L4441L6445L6999L7262L8650M0917M3045M4887M6861M8973
58266B481072N1119N3533N6186N8539O0507O2717O5311O7602O9371P1177P2925
58255C170059P3621P3239P3217P4315P5648P6658P8360Q1533Q5457Q9613R4885
58244D046605J01659J08545J14523J20682J28245J36415J44022J51743J60815
58235E213254J70881J81018J91720K03970K17436K31337K46085K62444K80196
58226G198341K99186L20440L44637L70810L98172M27903M61495M98952N40285
58217A0860221N87226O41544P03430P73423Q54234R48638J057543J182372J327687
58208A8936318J499433J702844J944330K233221K579314K990818L476184M043475
$$ plain form
58200 39405937 44100729 49527245 55769769 62937747 71187088 80732109 91848948 104868102
58192 104868102 120150215 138050974 158883852 182859850 209956502 239698073 270903972
58185 270903972 301525250 328711166 349220213 360168408 359884721 348469530 327740771
58178 327740771 300602137 270193294 239215234 209604763 182509079 158432693 137446359
58171 137446359 119378368 103944292 90818074 79672841 70207318 62156485 55289990
58164 55289990 49409769 44350072 39974180 36167933 32836383 29903335 27307964 24999455
58156 24999455 22935694 21084982 19423894 17931512 16587100 15372567 14273750 13278284
58148 13278284 12374254 11551342 10801156 10115841 9487918 8911567 8382254 7894804 7443526
$$ packed form
58200C9405937M694792N426516O242524P167978Q249341R545021J1116839J3019154
58192A04868102J5282113J7900759K0832878K3975998K7096652K9741571L1205899
58185B70903972L0621278K7185916K0509047J0948195k83687j1415191k0728759
58178C27740771k7138634l0408843l0978060k9610471k7095684k4076386k0986334
58171A37446359j8067991j5434076j3126218j1145233r465523q050833o866495
58164E5289990n880221n059697m375892l806247l331550k933048k595371k308509
58156B4999455k063761j850712j661088j492382j344412j214533j098817r95466
58148A3278284r04030q22912p50186o85315o27923n76351n29313m87450m51278
$$ plain form
58139 7443526 7024502 6636086 6276750 5943778 5634337 5346427 5078399 4828685 4596311
58130 4596311 4380699 4180765 3994996 3822253 3661461 3510783 3368343 3233690 3107390
58121 3107390 2989256 2878170 2773548 2675598 2583905 2497016 2413781 2334167 2258510 2186817 2119028
58110 2119028 2055100 1994601 1936866 1881622 1828847 1778158 1729025 1681420 1635375 1590050 1544269
58099 1544269 1498046 1452774 1409840 1369770 1332599 1298221 1266326 1236727 1209794 1185844 1164268
58088 1164268 1144001 1124732 1106855 1090380 1074809 1059958 1045916 1032146 1017490 1001226 983457
58077 983457 964550 945004 925687 907208 889009 870038 850382 831342 813815 797470 781652
58066 781652 766147 750914 735975 721840 709319 698692 689716 682308 676291 670547 663599 655286 646783
$$ packed form
58139G443526m19024l88416l59336l32972l09441k87910k68028k49714k32374
58130D596311k15612j99934j85769j72743j60792j50678j42440j34653j26300
58121C107390j18134j11086j04622r7950r1693q6889q3235p9614p5657p1693o7789
58110B119028o3928o0499n7735n5244n2775n0689m9133m7605m6045m5325m5781
58099A544269m6223m5272m2934m0070l7171l4378l1895k9599k6933k3950k1576
58088A164268k0267j9269j7877j6475j5571j4851j4042j3770j4656j6264j7769
58077I83457j8907j9546j9317j8479j8199j8971j9656j9040j7527j6345j5818
58066G81652j5505j5233j4939j4135j2521j0627q976p408o017n744o948q313q503
$$ plain form
58053 646783 638672 630227 621072 612236 604660 597627 589791 581161 573003 566056 559820 553591 547361 541471
58039 541471 535831 529878 523232 516243 509673 503815 498190 492351 486638 481649 477253 472707 467577 461847
58025 461847 455327 447802 439743 431986 424579 416842 408781 401504 395877 391525 387623 383899 380438 377192
58011 377192 374243 371957 370319 368672 366665 364923 364180 364209 364205 363814 363164 362220 360838 359301 358202 357770 357725
57994 357725 357709 357515 357007 356182 355326 354919 355446 357267 360348 363959 367044 369230 371167 373593 376314 378459
57978 378459 379484 379594 379313 378948 378384 377241 375432 373604 372716 373000 373694 374076 374362 375222 376735 378281 379302
57961 379302 379683 379466 378606 377110 375175 373101 371092 369104 366856 364122 361071 358127 355418 352579 349234
57946 349234 345526 342103 339669 338578 338681 339571 341159 343933 348451 354726 362390 371234 381087 391382
$$ packed form
58053F46783q111q445r155q836p576p033p836q630q158o947o236o229o230n890
58039E41471n640n953o646o989o570n858n625n839n713m989m396m546n130n730
58025D61847o520p525q059p757p407p737q061p277n627m352l902l724l461l246
58011C77192k949k286j638j647k007j742p43K9ml91o50r44j382j537j099m32m5
57994C57725j6j94n08q25q56m07N27J821L081L611L085K186J937K426K721K145
57978C78459J025J10k81l65n64j143j809j828q88K84O94L82K86Q60J513J546J021
57961C79302L81k17q60j496j935k074k009j988k248k734l051k944k709k839l345
57946C49234l708l423k434j091J03Q90J588K774M518O275P664Q844R853J0295
$$ plain form
57932 391382 401517 411529 421635 431092 438403 442920 445335 446269 445306 441992 436868 430650 423164 414093
57918 414093 404259 395051 386784 378651 370230 362091 354840 348438 342683 337617 333169 329011 325087 321798
57904 321798 319310 317053 314242 310619 306449 302082 297746 293623 289794 286150 282479 278714 275144 272408
57890 272408 271167 271617 273376 275899 278793 281567 283474 284095 283931 283879 284117 283985 283049 281704 280403 278756
57874 278756 275943 271863 267410 263556 260510 257924 255640 253892 252844 252272 251923 252058 253343 256151 260163
57859 260163 264770 269729 275311 281786 288892 295870 302099 307612 312817 317755 321952 325206 328028 330820
57845 330820 332966 333475 332435 331019 329885 328352 325472 321196 316070 310484 304875 300094 296764 294554
57831 294554 292764 291358 290746 290839 291124 291529 292375 293432 293903 293545 293074 293018 292811 291518 289072 286271 283744
$$ packed form
57932C91382J0135J0012J0106R457P311M517K415R34r63l314n124o218p486r071
57918D14093r834r208q267q133q421q139p251o402n755n066m448m158l924l289
57904C21798k488k257k811l623m170m367m336m123l829l644l671l765l570k736
57890B72408j241M50J759K523K894K774J907O21j64n2K38j32r36j345j301j647
57874B78756k813m080m453l854l046k586k284j748j048n72l49J35J285K808M012
57859B60163M607M959N582O475P106O978O229N513N205M938M197L254K822K792
57845C30820K146N09j040j416j134j533k880m276n126n586n609m781l330k210
57831B94554j790j406o12R3K85M05Q46J057M71l58m71n6k07j293k446k801k527
$$ plain form
57814 283744 281383 278750 275683 272337 268765 264673 259797 254527 249856 246433 243866 241305 238511 235921
57800 235921 233812 232043 230715 230432 231584 233736 236075 238106 239679 240699 241247 241765 242685 243977 245377
57785 245377 246998 249312 252453 255891 258979 261620 264269 267366 270929 274645 278118 280983 282980 284179
57771 284179 285025 285875 286465 286090 284436 281830 278489 273952 267752 260455 253381 247279 241780 236248 230649
57756 230649 225333 220417 215788 211449 207517 204050 201146 199074 197947 197382 196796 196031 195428 195259 195333 195190
57740 195190 194457 192964 190753 188153 185734 183943 182728 181598 180095 178165 176133 174432 173421 173279 173892
57725 173892 174827 175628 176201 176805 177594 178353 178748 178731 178552 178526 178841 179425 179850 179601 178731 178103 178583 180018 181281
57706 181281 181419 180531 179495 179075 179372 179966 180492 181115 182365 184339 186221 186930 186234 184962 184113 184100 184853
$$ packed form
57814B83744k361k633l067l346l572m092m876n270m671l423k567k561k794k590
57800B35921k109j769j328k83J152K152K339K031J573J020N48N18R20J292J400
57785B45377J621K314L141L438L088K641K649L097L563L716L473K865J997J199
57771B84179Q46Q50N90l75j654k606l341m537o200p297p074o102n499n532n599
57756B30649n316m916m629m339l932l467k904k072j127n65n86p65o03j69P4j43
57740A95190p33j493k211k600k419j791j215j130j503j930k032j701j011j42O13
57725A73892R35Q01N73O04P89P59L95j7j79k6L15N84M25k49q70o28M80J435J263
57706A81281J38q88j036m20K97N94N26O23J250J974J882P09o96j272q49j3P53
$$ plain form
57689 184853 186273 188338 191045 194406 198292 202231 205734 209045 213197 219060 226666 235703 246345 259136
57675 259136 274429 292590 314632 341960 375340 414663 459919 511776 570605 634863 700429
57664 700429 761077 809398 838221 842779 822702 782140 727717 666094 602820 542302 487739 440699
57652 440699 401118 368123 340926 318985 301594 287695 276250 266694 258852 252471 246989 241889
57640 241889 237146 233066 229662 226432 222980 219613 217012 215352 214096 212658 210909 208907 206578 203984
57626 203984 201593 199827 198504 197096 195458 193933 192734 191668 190506 189268 187981 186546 185041 183860
57612 183860 183232 182844 182296 181824 182185 183706 185734 187218 187724 187737 188019 188883 190132 191513 193024 194752 196611
57595 196611 198313 199529 200089 200141 200160 200557 201223 201701 201927 202466 203693 205007 205346 204444 203191 202725 203501 205198
$$ packed form
57689A84853J420K065K707L361L886L939L503L311M152N863P606R037J0642J2791
57675B59136J5293J8161K2042K7328L3380L9323M5256N1857N8829O4258O5566
57664G00429O0648M8321K8823M558k0077m0562n4423o1623o3274o0518n4563m7040
57652D40699l9581l2995k7197k1941j7391j3899j1445r556p842o381n482n100
57640B41889m743m080l404l230l452l367k601j660j256j438j749k002k329k594
57626B03984k391j766j323j408j638j525j199j066j162j238j287j435j505j181
57612A83860o28l88n48m72L61J521K028J484N06J3K82Q64J249J381J511J728J859
57595A96611J702J216N60N2J9L97O66M78K26N39J227J314L39r02j253m66P76J697
$$ plain form
57577 205198 207048 208199 208217 207555 207188 207567 208170 208199 207462 206374 205449 205012 205103 205343 205174 204535 204081 204353 205035
57558 205035 205443 205531 205904 206945 208422 209986 211553 213162 214840 216714 218846 220872 222224 222858 223312 223854
57542 223854 224034 223503 222857 223131 224647 226848 229193 231692 234419 236965 238628 238976 238104 236549 235060 234236
57526 234236 234208 234779 235915 237836 240494 243257 245469 247178 248984 251227 253675 256069 258500 261024 263212
57511 263212 264522 265047 265551 266672 268339 270077 271677 273281 274897 276129 276600 276523 276628 277427 278756 280107
57495 280107 281214 282072 282526 282290 281533 281079 281713 283399 285415 287159 288621 290180 292234 294984 298249 301430
57479 301430 303922 305677 307169 308761 310291 311369 311889 312065 312191 312574 313545 315275 317571 320034 322450
57464 322450 324894 327480 330224 333141 336303 339693 343104 346265 349003 351241 353029 354656 356557 358818
$$ packed form
57577B05198J850J151J8o62l67L79O03K9p37j088r25m37R1K40j69o39m54K72O82
57558B05035M08Q8L73J041J477J564J567J609J678J874K132K026J352O34M54N42
57542B23854J80n31o46K74J516K201K345K499K727K546J663L48q72j555j489q24
57526B34236k8N71J136J921K658K763K212J709J806K243K448K394K431K524K188
57511B63212J310N25N04J121J667J738J600J604J616J232M71p7J05P99J329J351
57495B80107J107Q58M54k36p57m54O34J686K016J744J462J559K054K750L265L181
57479C01430K492J755J492J592J530J078N20J76J26L83R71J730K296K463K416
57464C22450K444K586K744K917L162L390L411L161K738K238J788J627J901K261
$$ plain form
57450 358818 360859 361981 362329 363022 365032 368134 371222 373533 375249 376998 379241 382171 385779 389741 393487
57435 393487 396603 399051 400935 402455 404210 407045 411151 415645 419501 422653 425713 428899 431956 434999
57421 434999 438606 442829 446837 449899 452267 454678 457393 460130 462642 464932 467096 469341 472016 475278
57407 475278 478840 482345 485844 489592 493465 497002 500006 502744 505525 508371 511268 514428 518089 522169
57393 522169 526287 530129 533730 537388 541353 545625 550070 554693 559719 565389 571691 578279 584639 590402
57379 590402 595638 600766 606020 611125 615658 619622 623399 627226 631103 635172 639672 644477 649194 653912
57365 653912 659257 665393 671614 677424 683441 690464 698007 704674 709942 714731 720138 726360 733068 740043
57351 740043 747044 753651 759789 765990 772702 779646 786329 792851 799668 806772 813743 820565 827739 835431
$$ packed form
57450C58818K041J122L48O93K010L102L088K311J716J749K243K930L608L962L746
57435C93487L116K448J884J520J755K835M106M494L856L152L060L186L057L043
57421D34999L607M223M008L062K368K411K715K737K512K290K164K245K675L262
57407D75278L562L505L499L748L873L537L004K738K781K846K897L160L661M080
57393E22169M118L842L601L658L965M272M445M623N026N670O302O588O360N763
57379E90402N236N128N254N105M533L964L777L827L877M069M500M805M717M718
57365F53912N345O136O221N810O017P023P543O667N268M789N407O222O708O975
57351G40043P001O607O138O201O712O944O683O522O817P104O971O822P174P692
$$ plain form
57337 835431 843075 850142 856918 864058 871626 879041 885969 892815 900170 908094 916210 924270 932316 940384
57323 940384 948390 956334 964333 972421 980593 989068 998152 1007684 1016991 1025752 1034566 1044221 1054537 1064446
57309 1064446 1073216 1081201 1089275 1097931 1107116 1116607 1126249 1135984 1145867 1156051 1166597 1177373 1188227
57296 1188227 1199221 1210505 1221967 1233056 1243128 1252066 1260529 1269405 1279000 1288949 1298946 1309193
57284 1309193 1319920 1330835 1341512 1352073 1362955 1374101 1384957 1395310 1405588 1416207 1427175
57273 1427175 1438526 1450512 1462992 1475116 1486175 1496480 1506874 1517560 1527960 1537693 1547172 1557064
57261 1557064 1567560 1578410 1589472 1600876 1612639 1624387 1635672 1646555 1657621 1669318 1681505
57250 1681505 1693875 1706499 1719464 1732137 1743497 1753375 1762812 1772874 1783611 1794501 1805374 1816349
$$ packed form
57337H35431P644P067O776P140P568P415O928O846P355P924Q116Q060Q046Q068
57323I40384Q006P944P999Q088Q172Q475R084R532R307Q761Q814R655J0316R909
57309A064446Q770P985Q074Q656R185R491R642R735R883J0184J0546J0776J0854
57296A188227J0994J1284J1462J1089J0072Q938Q463Q876R595R949R997J0247
57284A309193J0727J0915J0677J0561J0882J1146J0856J0353J0278J0619J0968
57273A427175J1351J1986J2480J2124J1059J0305J0394J0686J0400R733R479R892
57261A557064J0496J0850J1062J1404J1763J1748J1285J0883J1066J1697J2187
57250A681505J2370J2624J2965J2673J1360R878R437J0062J0737J0890J0873J0975
$$ plain form
57238 1816349 1827259 1837809 1848119 1858579 1869293 1880159 1891334 1903077 1915145 1926954 1938337
57227 1938337 1949637 1961013 1972177 1982961 1993639 2004490 2015447 2026412 2037576 2049171 2061122
57216 2061122 2073157 2085076 2096817 2108425 2119994 2131468 2142602 2153427 2164668 2177196 2191010
57205 2191010 2205158 2218681 2231158 2242332 2251884 2259873 2266848 2273225 2279081 2284903 2291854 2300715 2311016
57192 2311016 2321850 2333069 2344927 2356905 2367944 2377902 2387904 2398881 2410370 2421101 2430286 2438005
57180 2438005 2444691 2450754 2456593 2462615 2469141 2476400 2484597 2493944 2504539 2516113 2527919 2539083 2549296
57167 2549296 2558991 2568708 2578474 2588055 2597557 2607368 2617703 2628677 2640695 2654126 2668564 2682957
57155 2682957 2696703 2710123 2723691 2737305 2750562 2763267 2775294 2786398 2796728 2807230 2818921
$$ packed form
57238A816349J0910J0550J0310J0460J0714J0866J1175J1743J2068J1809J1383
57227A938337J1300J1376J1164J0784J0678J0851J0957J0965J1164J1595J1951
57216B061122J2035J1919J1741J1608J1569J1474J1134J0825J1241J2528J3814
57205B191010J4148J3523J2477J1174R552P989O975O377N856N822O951Q861J0301
57192B311016J0834J1219J1858J1978J1039R958J0002J0977J1489J0731R185P719
57180B438005O686O063N839O022O526P259Q197R347J0595J1574J1806J1164J0213
57167B549296R695R717R766R581R502R811J0335J0974J2018J3431J4438J4393
57155B682957J3746J3420J3568J3614J3257J2705J2027J1104J0330J0502J1691
$$ plain form
57144 2818921 2831752 2844631 2856666 2868054 2879642 2891876 2904351 2916330 2927548 2938507 2949989
57133 2949989 2962447 2975967 2990716 3007065 3025242 3045265 3067436 3092611 3121657 3154883 3192309
57122 3192309 3234292 3281525 3334500 3393421 3458627 3530730 3610238 3697475 3793096 3898518 4015669
57111 4015669 4146618 4293848 4460766 4651582 4870695 5122747 5413743 5751959 6147587
57102 6147587 6611945 7157925 7801428 8561849 9460915 10521631 11768897 13230778 14938520
57093 14938520 16924990 19222401 21859408 24857737 28229460 31975544 36084272 40528528
57085 40528528 45263037 50220784 55303824 60367960 65214577 69607881 73317878 76164607
57077 76164607 78037207 78885413 78702839 77519016 75400669 72453629 68819195 64663409
$$ packed form
57144B818921J2831J2879J2035J1388J1588J2234J2475J1979J1218J0959J1482
57133B949989J2458J3520J4749J6349J8177K0023K2171K5175K9046L3226L7426
57122C192309M1983M7233N2975N8921O5206P2103P9508Q7237R5621J05422J17151
57111D015669J30949J47230J66918J90816K19113K52052K90996L38216L95628
57102F147587M64358N45980O43503P60421Q99066J060716J247266J461881J707742
57093A4938520J986470K297411K637007K998329L371723L746084M108728M444256
57085D0528528M734509M957747N083040N064136M846617M393304L709997K846729
57077G6164607J872600Q48206j82574j183823k118347k947040l634434m155786
$$ plain form
57069 64663409 60160695 55476703 50756666 46121404 41667501 37468165 33574717 30019202
57061 30019202 26816501 23965402 21450863 19248763 17330536 15665189 14220157 12963398
57053 12963398 11865819 10901848 10048869 9287766 8604123 7987751 7430720 6926293 6469304
57044 6469304 6055946 5682152 5342489 5030982 4742695 4474191 4222877 3986429 3762882
57035 3762882 3550955 3350025 3159639 2979025 2807162 2643331 2487371 2339458 2199873
57026 2199873 2069066 1947525 1835284 1731810 1636465 1548715 1467752 1392523 1322641 1258792
57016 1258792 1201618 1150451 1103695 1060219 1019814 982554 948420 917458 889600 864257 840619
57005 840619 818409 797843 778825 760704 742888 725223 707755 690592 674035 658352 643349
$$ packed form
57069F4663409m502714m683992m720037m635262m453903m199336l893448l555515
57061C0019202l202701k851099k514539k202100j918227j665347j445032j256759
57053A2963398j097579r63971q52979p61103o83643o16372n57031n04427m56989
57044F469304m13358l73794l39663l11507k88287k68504k51314k36448k23547
57035C762882k11927k00930j90386j80614j71863j63831j55960j47913j39585
57026B199873j30807j21541j12241j03474r5345q7750q0963p5229o9882o3849
57016A258792n7174n1167m6756m3476m0405l7260l4134l0962k7858k5343k3638
57005H40619k2210k0566j9018j8121j7816j7665j7468j7163j6557j5683j5003
$$ plain form
56994 643349 628613 614208 600678 588294 576855 566335 557215 550049 545157 542839 543287 546039 549965
56981 549965 553907 556839 557314 553594 544837 531770 515816 498055 479402 461169 444695 430581 418777
56968 418777 409225 401956 396746 393245 391420 391531 393800 398403 405679 415891 428800 443686 459615
56955 459615 475318 488970 498612 502887 501200 493398 479872 462010 442017 421932 402951 385796
56943 385796 371346 360537 353755 350580 350182 351832 355108 359957 366772 376334 389346 405870 425239
56930 425239 446427 468099 488113 503430 511208 510143 500573 483541 460371 433178 404952 378452
56918 378452 355100 335066 318047 303592 291059 279794 269371 259502 249974 240969 233185 227162
56906 227162 222576 218528 214475 210567 207169 204472 202534 201356 200858 201014 202036 204167 207337 211321 216272
$$ packed form
56994F43349j4736j4405j3530j2384j1439j0520r120p166m892k318M48K752L926
56981E49965L942K932M75l720q757j3067j5954j7761j8653j8233j6474j4114j1804
56968D18777r552p269n210l501j825J11K269M603P276J0212J2909J4886J5929
56955D59615J5703J3652R642M275j687p802j3526j7862j9993k0085j8981j7155
56943C85796j4450j0809o782l175l98J650L276M849O815R562J3012J6524J9369
56930D25239K1188K1672K0014J5317P778j065r570j7032k3170k7193k8226k6500
56918C78452k3352k0034j7019j4455j2533j1265j0423r869r528r005p784o023
56906B27162m586m048m053l908l398k697j938j178m98J56J022K131L170L984M951
$$ plain form
56891 216272 222795 231390 242038 254403 268236 283426 299726 316375 331934 344550 352720 355980
56879 355980 354868 350287 343037 333924 324097 315021 307977 303489 301310 301134 303315 308701 317865 330881
56865 330881 347932 369560 396024 426808 461229 499099 540101 582467 622690 656514 680005
56854 680005 690332 686680 670876 646669 617974 587847 558740 532819 511615 495829 485824 481956
56842 481956 484310 492692 507351 529231 558998 596224 640151 691014 749630 815245 883984 949500
56830 949500 1004882 1044063 1062447 1057585 1030178 984483 927193 865186 803707 746126 694660 650683
56818 650683 614429 585193 562489 546986 539954 541882 551978 569066 592678 623127 660618 704182
56806 704182 751110 797056 836748 865021 877860 873213 851416 815108 768637 717109 665238 616307
$$ packed form
56891B16272O523Q595J0648J2365J3833J5190J6300J6649J5559J2616Q170L260
56879C55980j112m581p250r113r827r076p044m488k179j76K181N386R164J3016
56865C30881J7051K1628K6464L0784L4421L7870M1002M2366M0223L3824K3491
56854F80005J0327l652j5804k4207k8695l0127k9107k5921k1204j5786j0005l868
56842D81956K354Q382J4659K1880K9767L7226M3927N0863N8616O5615O8739O5516
56830I49500N5382L9181J8384m862k7407m5695n7290o2007o1479n7581n1466m3977
56818F50683l6254k9236k2704j5503p032J928J0096J7088K3612L0449L7491M3564
56806G04182M6928M5946L9692K8273J2839m647k1797l6308m6471n1528n1871m8931
$$ plain form
56794 616307 571795 532083 497599 469160 447232 431299 420400 414123 412689 416139 423971 435702
56782 435702 451312 470750 493101 516370 537783 554123 562206 559870 546857 524731 495959 463222
56770 463222 429255 396544 366660 340019 316439 295699 277406 260862 245606 231958 220507
56759 220507 211119 202932 195340 188422 182338 176901 172047 168142 165344 163015 160370 157485 155098 153446
56745 153446 151838 149523 146535 143487 140781 138299 135730 133087 130883 129741 129744 130242 130472 130306 130184 130401
56729 130401 130740 130821 130589 130363 130565 131388 132611 133747 134499 134986 135368 135429 134839 133712 132544 131658 131090 131020
56711 131020 131814 133410 135057 135961 136046 135911 136160 136897 137682 137920 137468 136888 136876 137411 137773 137486 136864 136450 136253
56692 136253 135788 134685 133092 131662 131240 132209 133960 135299 135628 135455 135611 136287 137044 137410 137131 136216 135104
$$ packed form
56794F16307m4512l9712l4484k8439k1928j5933j0899o277j434L450P832J1731
56782D35702J5610J9438K2351K3269K1413J6340Q083k336j3013k2126k8772l2737
56770D63222l3967l2711k9884k6641k3580k0740j8293j6544j5256j3648j1451
56759B20507r388q187p592o918o084n437m854l905k798k329k645k885k387j652
56745A53446j608k315k988l048k706k482k569k643k204j142LM98K30j66j22K17
56729A30401L39Q1k32k26K02Q23J223J136P52M87L82O1n90j127j168q86n68p0
56711A31020P94J596J647R04Q5j35K49P37P85K38m52n80j2N35L62k87o22m14j97
56692A36253m65j103j593j430m22R69J751J339L29j73J56O76P57L66k79r15j112
$$ plain form
56675 135104 134486 134524 134518 133786 132601 131805 131747 132128 132707 133488 134273 134681 134690 134631 134586 134360 134166 134647 135943 137324
56655 137324 138162 138809 140010 141798 143500 144685 145549 146398 147183 147717 148058 148500 149307 150592 152397 154751
56639 154751 157516 160149 161811 162007 161190 160509 160837 162164 163914 165598 167029 168237 169426 170843 172393
56624 172393 173544 173905 173827 174095 174955 175747 175599 174277 172268 170228 168561 167424 166873 166880 167282 167844 168426 168990
56606 168990 169390 169314 168684 168083 168358 169531 170405 169677 167360 164688 162678 161295 160153 159333 159053 158965 158508
56589 158508 157779 157416 157582 157740 157571 157477 157829 158339 158687 159245 160466 161863 162443 162088 161728 162046 162786 163589
56571 163589 164707 166357 168033 169149 170019 171538 174124 177598 181889 187152 193243 199838 207146 215765
56557 215765 225505 235017 243025 249486 255075 259956 263719 266312 268326 270215 271750 272483 272381 271688 270451
$$ packed form
56675A35104o18L8op32j185p96n8L81N79P81P85M08Rn9m5k26j94M81J296J381
56655A37324Q38O47J201J788J702J185Q64Q49P85N34L41M42Q07J285J805K354
56639A54751K765K633J662J96q17o81L28J327J750J684J431J208J189J417J550
56624A72393J151L61p8K68Q60P92j48j322k009k040j667j137n51PM02N62N82N64
56606A68990M00p6o30o01K75J173Q74p28k317k672k010j383j142q20k80q8m57
56589A58508p29l63J66J58j69r4L52N10L48N58J221J397N80l55l60L18P40Q03
56571A63589J118J650J676J116Q70J519K586L474M291N263O091O595P308Q619
56557B15765R740R512Q008O461N589M881L763K593K014J889J535P33j02o93j237
$$ plain form
56542 270451 268557 266158 263707 261495 259431 257379 255420 253534 251244 248043 244113 240232 236837 233599
56528 233599 230101 226511 223188 220007 216648 213378 210965 209697 208972 207986 206420 204334 201817 199030 196279
56513 196279 193795 191601 189728 188306 187335 186669 186373 186734 187664 188483 188650 188430 188439 188758 188910 188533 187649 186368
56495 186368 184775 183102 181641 180480 179609 179178 179260 179477 179342 178983 178981 179446 179817 179756 179647 179849 180047 179869 179696
56476 179696 180152 181011 181383 181002 180674 181235 182644 184358 186137 188016 189804 191174 192153 193112 194234 195351
56460 195351 196355 197403 198542 199422 199660 199349 198893 198363 197291 195262 192606 190330 189348 189754 190820 191627
56444 191627 191729 191275 190660 190229 190296 191128 192639 194194 195086 195247 195255 195522 195789 195630 195132 194725 194522 194329 194296
56425 194296 195020 196723 198733 200191 201029 201817 202728 203174 202644 201507 200733 200946 202002 203368 204655 205764
$$ packed form
56542B70451j894k399k451k212k064k052j959j886k290l201l930l881l395l238
56528B33599l498l590l323l181l359l270k413j268p25r86j566k086k517k787k751
56513A96279k484k194j873j422r71o66k96L61R30Q19J67k20RL19J52l77q84j281
56495A86368j593j673j461j161q71m31Q2K17j35l59kM65L71o1j09K02J98j78j73
56476A79696M56Q59L72l81l28N61J409J714J779J879J788J370R79R59J122J117
56460A95351J004J048J139Q80K38l11m56n30j072k029k656k276r82M06J066Q07
56444A91627J02m54o15m31O7Q32J511J555Q92J61QK67K67j59m98m07k03j93l3
56425A94296P24J703K010J458Q38P88R11M46n30j137p74K13J056J366J287J109
$$ plain form
56409 205764 206708 207428 207818 207961 208271 209166 210501 211523 211647 211156 210899 211350 212264 213213 214087 214909 215524 215735
56391 215735 215636 215578 215854 216561 217625 218822 219922 220967 222271 223947 225588 226709 227373 228105 229214 230483
56375 230483 231479 231915 231728 231128 230585 230509 230941 231794 233246 235417 237680 238967 239084 239148 240250 242079 243438
56358 243438 243878 244139 245092 246847 249021 251224 253019 253867 253633 252929 252582 252815 253177 253281 253281 253576 254277 255137
56340 255137 255965 256914 258288 260079 261807 262895 263233 263343 263976 265516 267718 269989 271938 273669 275567
56325 275567 277875 280549 283467 286492 289281 291269 292082 291847 290994 289855 288683 287853 287718 288215 288894 289374
56309 289374 289640 289934 290636 292212 294833 297913 300396 301833 302947 304843 307819 311253 314431 317042 318917
56294 318917 319845 319898 319620 319608 320034 320809 322050 324082 326963 330258 333355 335943 338146 340331 342840 345836
$$ packed form
56409B05764R44P20L90J43L10Q95J335J022J24m91k57M51R14R49Q74Q22O15K11
56391B15735r9n8K76P07J064J197J100J045J304J676J641J121O64P32J109J269
56375B30483R96M36j87o00n43p6M32Q53J452K171K263J287J17O4J102J829J359
56358B43438M40K61R53J755K174K203J795Q48k34p04l47K33L62J04%K95P01Q60
56340B55137Q28R49J374J791J728J088L38J10O33J540K202K271J949J731J898
56325B75567K308K674K918L025K789J988Q13k35q53j139j172q30j35M97O79M80
56309B89374K66K94P02J576K621L080K483J437J114J896K976L434L178K611J875
56294C18917R28N3k78j2M26P75J241K032K881L295L097K588K203K185K509K996
$$ plain form
56278 345836 349316 353215 357455 361884 366282 370531 374752 379143 383728 388368 392957 397460 401835 406239
56264 406239 411329 417969 426370 435796 445454 455492 466772 479770 494173 509597 526226 544556
56252 544556 564854 587187 611775 638966 668897 701441 736459 773923 813770 855729 899296
56241 899296 943794 988456 1032507 1075141 1115363 1151941 1183616 1209343 1228404 1240438 1245503 1244101
56229 1244101 1237023 1225079 1208802 1188228 1163077 1133413 1100262 1065404 1030451 996232 962929
56218 962929 930453 898585 867200 836682 807882 781370 756908 733973 712561 693061 675489
56207 675489 659287 643901 629206 615369 602630 591282 581565 573391 566386 560228 554808 550065 545932
56194 545932 542514 540074 538754 538436 538866 539685 540384 540599 540530 540758 541476 542228 542574 542722 543148 543921 544794 545932
$$ packed form
56278C45836L480L899M240M429M398M249M221M391M585M640M589M503M375M404
56264D06239N090O640Q401R426R658J0038J1280J2998J4403J5424J6629J8330
56252E44556K0298K2333K4588K7191K9931L2544L5018L7464L9847M1959M3567
56241H99296M4498M4662M4051M2634M0222L6578L1675K5727J9061J2034N065j402
56229A244101p078j1944j6277k0574k5151k9664l3151l4858l4953l4219l3303
56218I62929l2476l1868l1385l0518k8800k6512k4462k2935k1412j9500j7572
56207F75489j6202j5386j4695j3837j2739j1348r717q174p005o158n420m743m133
56194E45932l418k440j320l18M30Q19O99K15o9K28P18P52L46J48M26P73Q73J138
$$ plain form
56176 545932 547994 551333 555464 559631 563676 567968 572560 576913 580662 584271 588507 593563 599180 605523
56162 605523 613192 622234 631850 641465 651543 662837 675327 688552 702673 718479 736558 757165
56150 757165 780775 808012 839032 873837 913376 959531 1013689 1076045 1146791 1227265 1319214
56139 1319214 1423151 1537778 1660454 1787392 1913552 2033227 2141386 2234820 2312643 2376371
56129 2376371 2429450 2475885 2518448 2557581 2591495 2617153 2631623 2633371 2622954 2602818 2576359
56118 2576359 2546524 2514228 2477402 2431687 2372625 2297756 2207264 2103586 1990940 1874883 1761284
56107 1761284 1654899 1558491 1473074 1398828 1335811 1283815 1241716 1207379 1178649 1154488 1134846
56096 1134846 1119527 1107598 1097989 1090166 1084007 1079405 1076275 1074621 1074312 1075033 1076628 1079271 1083140 1088205
$$ packed form
56176E45932K062L339M131M167M045M292M592M353L749L609M236N056N617O343
56162F05523P669R042R616R615J0078J1294J2490J3225J4121J5806J8079K0607
56150G57165K3610K7237L1020L4805L9539M6155N4158O2356P0746Q0474R1949
56139A319214J03937J14627J22676J26938J26160J19675J08159R3434P7823O3728
56129B376371N3079M6435M2563L9133L3914K5658J4470J748j0417k0136k6459
56118B576359k9835l2296l6826m5715n9062p4869r0492j03678j12646j16057j13599
56107A761284j06385r6408q5417p4246o3017n1996m2099l4337k8730k4161j9642
56096A134846j5319j1929r609p823o159m602l130j654l09P21J595K643L869N065
$$ plain form
56082 1088205 1094431 1101771 1109879 1118321 1127268 1137436 1149018 1161239 1173340 1185416 1197790 1210193
56070 1210193 1222321 1234766 1248546 1263882 1280194 1297151 1314999 1333838 1353330 1373276 1393898
56059 1393898 1415369 1437526 1460199 1483390 1506934 1530298 1552976 1574850 1596109 1616950 1637470
56048 1637470 1657732 1677947 1698597 1720219 1742920 1766359 1790397 1815556 1842534 1871475 1901979
56037 1901979 1933710 1966734 2001348 2037728 2075593 2114150 2152647 2191103 2230202 2270449 2311995
56026 2311995 2355357 2401502 2450724 2502045 2554323 2607570 2662691 2720468 2781309 2845481 2912940
56015 2912940 2983250 3056161 3131926 3210745 3292527 3377638 3467107 3561490 3660274 3763059 3870450
56004 3870450 3983027 4100439 4222559 4350637 4486049 4628739 4778209 4935315 5101610
$$ packed form
56082A088205O226P340Q108Q442Q947J0168J1582J2221J2101J2076J2374J2403
56070A210193J2128J2445J3780J5336J6312J6957J7848J8839J9492J9946K0622
56059A393898K1471K2157K2673K3191K3544K3364K2678K1874K1259K0841K0520
56048A637470K0262K0215K0650K1622K2701K3439K4038K5159K6978K8941L0504
56037A901979L1731L3024L4614L6380L7865L8557L8497L8456L9099M0247M1546
56026B311995M3362M6145M9222N1321N2278N3247N5121N7777O0841O4172O7459
56015B912940P0310P2911P5765P8819Q1782Q5111Q9469R4383R8784J02785J07391
56004C870450J12577J17412J22120J28078J35412J42690J49470J57106J66295
$$ plain form
55995 5101610 5277607 5463218 5659359 5867470 6087940 6320704 6567021 6828960 7107548
55986 7107548 7403351 7718704 8057389 8422215 8814758 9237449 9693979 10187731 10722016
55977 10722016 11302080 11934914 12627052 13384839 14217225 15136292 16155043 17287438 18551553
55968 18551553 19971093 21574219 23394204 25472718 27861163 30619735 33818979 37543357
55960 37543357 41891385 46974238 52921550 59893454 68086983 77733444 89096763 102476122
55952 102476122 118201207 136612705 158031657 182705949 210693983 241655675 274582277
55945 274582277 307571214 337803446 361877869 376542456 379621725 370723280 351343831
55938 351343831 324327121 292992615 260357045 228691217 199415794 173220000 150277756
$$ packed form
55995E101610J75997J85611J96141K08111K20470K32764K46317K61939K78588
55986G107548K95803L15353L38685L64826L92543M22691M56530M93752N34285
55977A0722016N80064O32834O92138P57787Q32386R19067J018751J132395J264115
55968A8551553J419540J603126J819985K078514K388445K758572L199244L724378
55960C7543357M348028N082853N947312O971904Q193529R646461J1363319J3379359
55952A02476122J5725085J8411498K1418952K4674292K7988034L0961692L2926602
55945B74582277L2988937L0232232K4074423J4664587L079269q898445j9379449
55938C51343831k7016710l1334506l2635570l1665828k9275423k6195794k2942244
$$ plain form
55931 150277756 130461951 113498185 99052599 86781419 76362003 67506697 59962901
55924 59962901 53511421 47967879 43180836 39024633 35393885 32202669 29383035 26880331
55916 26880331 24649602 22654895 20867698 19263494 17820233 16519371 15345543 14284255
55908 14284255 13321439 12445424 11647228 10918419 10250376 9635896 9069625 8546508 8061524
55899 8061524 7611202 7193537 6805877 6444528 6106835 5791907 5498796 5225560 4970592
55890 4970592 4733215 4512359 4306180 4113564 3934443 3768001 3612156 3465612 3328880
55881 3328880 3202319 3084519 2973600 2868874 2770209 2676844 2587916 2503254 2422632 2344939
55871 2344939 2269057 2194975 2123293 2054245 1987924 1924730 1864811 1807541 1752231 1698935 1648070
$$ packed form
55931A50277756j9815805j6963766j4445586j2271180j0419416q855306p543796
55924E9962901o451480n543542m787043m156203l630748l191216k819634k502704
55916B6880331k230729j994707j787197j604204j443261j300862j173828j061288
55908A4284255r62816q76015p98196p28809o68043o14480n66271n23117m84984
55899H061524m50322m17665l87660l61349l37693l14928k93111k73236k54968
55890D970592k37377k20856k06179j92616j79121j66442j55845j46544j36732
55881C328880j26561j17800j10919j04726r8665r3365q8928q4662q0622p7693
55871B344939p5882p4082p1682o9048o6321o3194n9919n7270n5310n3296n0865
$$ plain form
55860 1648070 1599830 1554405 1512155 1473010 1436308 1401648 1369237 1338995 1310163 1282359 1256066
55849 1256066 1231297 1206678 1180887 1154355 1128429 1103333 1078109 1052404 1027169 1003449 981305
55838 981305 960168 939639 919702 900530 882340 865267 849351 834638 821114 808424 795913
55827 795913 783222 770616 758560 747231 736570 726480 716686 706703 696157 684942 673025 660523
55815 660523 648100 636693 626509 616746 606701 596733 587752 580108 573423 567274 561667 556999 553807
55802 553807 552378 552504 553804 556234 559838 564052 567960 571372 574861 578445 581118 582198 582289 582136 581278
55787 581278 578777 574794 570357 565715 559847 551576 540495 526879 511475 495523 480390 466931 455496
55774 455496 446418 440061 436440 435206 435840 437437 438518 437716 434694 430022 424292 417933 411689 406476 402585
$$ packed form
55860A648070m8240m5425m2250l9145l6702l4660l2411l0242k8832k7804k6293
55849A256066k4769k4619k5791k6532k5926k5096k5224k5705k5235k3720k2144
55838I81305k1137k0529j9937j9172j8190j7073j5916j4713j3524j2690j2511
55827G95913j2691j2606j2056j1329j0661j0090r794r983j0546j1215j1917j2502
55815F60523j2423j1407j0184r763j0045r968q981p644o685o149n607m668l192
55802E53807j429J26J300K430L604M214L908L412L489L584K673J080R1j53q58
55787E81278k501l983m437m642n868q271j1081j3616j5404j5952j5133j3459j1435
55774D55496r078o357l621j234O34J597J081q02l022m672n730o359o244n213l891
$$ plain form
55759 402585 399513 396698 393864 390587 386214 380496 373871 366763 359076 350692 342099 334097 327059 320825
55745 320825 315162 310011 305332 301006 296967 293335 290300 287856 285596 282867 279261 275015 270842 267389
55731 267389 264893 263235 262083 260944 259328 257033 254197 251030 247507 243417 238713 233832 229558 226433
55717 226433 224305 222612 221178 220509 221196 223189 225817 228277 229962 230594 230425 230165 230322 230615 230344 229338
55701 229338 228180 227339 226398 224391 220784 216010 211099 206910 203641 200888 198127 195192 192362 190030 188343
55686 188343 187247 186847 187502 189372 191946 194420 196640 199342 203138 207518 211251 213588 214694 215010 214750
55671 214750 213991 212714 210649 207560 203901 200686 198500 196987 195533 193987 192499 191188 190328 190373 191285
55656 191285 192242 192533 192414 192603 193248 194018 194963 196566 198927 201465 203493 204660 204857 204158 202875 201214
$$ packed form
55759D02585l072k815k834l277m373n718o625p108p687q384q593q002p038o234
55745C20825n663n151m679m326m039l632l035k444k260k729l606m246m173l453
55731B67389k496j658j152j139j616k295k836l167l523m090m704m881m274l125
55717B26433k128j693j434o69O87J993K628K460J685O32j69k60J57K93k71j006
55701B29338j158q41r41k007l607m774m911m189l269k753k761k935k830k332j687
55686A88343j096m00O55J870K574K474K220K702L796M380L733K337J106L16k60
55671B14750p59j277k065l089l659l215k186j513j454j546j488j311q60M5R12
55656A91285R57K91j19J89O45P70R45J603K361K538K028J167J97o99j283j661
$$ plain form
55640 201214 198792 195003 189973 184711 180121 176167 172228 167928 163361 158766 154392 150625 147903 146316
55626 146316 145415 144620 143821 143371 143416 143476 143011 142217 141762 141714 141310 139973 138010 135923 133591 130713 127686 125377
55608 125377 124039 123052 121762 120148 118583 117252 115897 114002 111313 108327 106011 104813 104218 103618 103212
55593 103212 103558 104493 105221 105367 105295 105340 105311 104969 104464 104088 103886 103757 103699 103869 104464 105430 106164 105842 104418 102985
55573 102985 102599 103003 103193 103043 103421 104667 105899 106219 105793 105239 104579 103440 101902 100542 99823 99866 100603
55556 100603 101726 102585 102549 101514 99864 98059 96418 95177 94541 94643 95479 96744 97788 98015 97420 96546
55540 96546 95869 95552 95791 96939 98971 101158 102637 103207 103376 103773 104723 106221 108059 109961 111704 113123
55524 113123 114043 114317 113947 113066 111889 110774 110135 109974 109613 108283 105959 103275 100743 98447 96446 94896
$$ packed form
55640B01214k422l789n030n262m590l954l939m300m567m595m374l767k722j587
55626A46316r01p95p99m50M5O0m65p94m55m8m04j337j963k087k332k878l027k309
55608A25377j338r87j290j614j565j331j355j895k689k986k316j198n95o00m06
55593A03212L46R35P28J46p2M5k9l42n05l76k02j29n8J70N95R66P34l22j424j433
55573A02985l86M04J90j50L78J246J232L20m26n54o60j139j538j360p19M3P37
55556A00603J123Q59l6j035j650j805j641j241o36J02Q36J265J044K27n95q74
55540I6546o77l17K39J148K032K187J479N70J69L97R50J498J838J902J743J419
55524A13123R20K74l70q81j177j115o39j61l61j330k324k684k532k296k001j550
$$ plain form
55508 94896 93701 92534 91329 90314 89529 88818 88334 88391 88637 88124 86572 84902 84075 83973 83928 83746 83554 83140
55490 83140 82233 81191 80671 80709 80772 80626 80556 80730 80952 81116 81490 82355 83610 84806 85446 85412 85252 85741 86846
55471 86846 87444 86552 84571 82796 81911 81575 81328 81079 80680 79837 78793 78435 79212 80347 80651 79890 78917 78501
55453 78501 78494 78206 77358 76442 76234 77064 78594 80226 81592 82645 83458 84065 84387 84255 83608 82691 81840 80968
55435 80968 79586 77560 75554 74398 74260 74816 75924 77530 79084 79701 79110 77926 76878 76185 75800 75730
55419 75730 75855 75876 75780 76012 76919 78272 79605 80722 81538 81708 80903 79298 77426 75659 74148 73090 72589
55402 72589 72282 71623 70635 69941 69863 69932 69594 69044 68937 69409 69863 69778 69369 69289 69893 70897 71653 71632 70817 69729
55382 69729 69044 69110 69823 70873 71901 72476 72357 71943 72127 73342 74984 76099 76460 76542 76594 76311 75483 74393
$$ packed form
55508I4896j195j167j205j015p85p11m84N7K46n13j552j670q27j02m5j82j92m14
55490H3140r07j042n20L8O3j46p0J74K22J64L74Q65J255J196O40l4j60M89J105
55471H6846N98q92j981j775q85l36k47k49l99q43j044l58P77J135L04p61r73m16
55453G8501pk88q48r16k08Q30J530J632J366J053Q13O07L22j32o47r17q51q72
55435H0968j382k026k006j156j38N56J108J606J554O17n91j184j048o93l85p0
55419G5730J25K1r6K32R07J353J333J117Q16J70q05j605j872j767j511j058n01
55402G2589l07o59r88o94p8O9l38n50j07M72M54q5m09q0O04J004P56k1q15j088
55382F9729o85O6P13J050J028N75j19m14J84J215J642J115L61Q2N2k83q28j090
$$ plain form
55364 74393 73339 72180 70771 69513 69034 69377 69870 69819 69110 68157 67445 67208 67399 67868 68532 69362 70231 70928
55346 70928 71329 71473 71478 71517 71836 72555 73433 74051 74325 74597 75120 75698 75985 75937 75797 75813 76134 76798 77635 78234 78222
55325 78222 77583 76710 76200 76475 77359 78111 78199 77986 78181 78627 78265 76574 74473 73318 73404 73957 74244 74191 74085
55306 74085 74197 74600 75049 75155 74930 74859 75066 74894 73918 72986 73451 75455 77745 79253 80071 80734 81265 81346 80896
55287 80896 80103 79170 78331 77816 77595 77451 77469 78080 79361 80635 81122 80828 80471 80655 81317 81957 82243 82379 82894
55268 82894 83982 85123 85529 84874 83478 81916 80744 80432 81066 82042 82494 82140 81421 80818 80463 80452 80924 81593
55250 81593 81729 81016 80039 79531 79405 78932 77691 76026 74711 74369 74996 75834 75983 75382 74905 75263 76241 77379
55232 77379 78874 81102 83559 85113 85291 84598 83457 81683 79342 77399 76875 77712 78997 80072 80888 81462
$$ packed form
55364G4393j054j159j409j258m79L43M93n1p09r53p12k37J91M69O64Q30Q69O97
55346G0928M01J44NL9L19P19Q78O18K74K72N23N78K87m8j40J6L21O64Q37N99j2
55325G8222o39q73n10K75Q84P52Q8k13J95M46l62j691k101j155Q6N53K87n3j06
55306G4085J12M03M49J06k25p1K07j72r76r32M65K004K290J508Q18O63N31Q1m50
55287H0896p93r33q39n15k21j44J8O11J281J274M87k94l57J84O62O40K86J36N15
55268H2894J088J141M06o55j396j562j172l12O34R76M52l54p19o03l55j1M72O69
55250H1593J36p13r77n08j26m73j241j665j315l42O27Q38J49o01m77L58R78J138
55232G7379J495K228K457J554J78o93j141j774k341j943n24Q37J285J075Q16N74
$$ plain form
55216 81462 81662 81612 81717 82043 82087 81498 80707 80419 80702 81024 81155 81520 82492 83739 84572 84725 84488 84193 83935
55197 83935 83768 83901 84532 85562 86501 86688 85775 84131 82638 81893 81706 81573 81474 81869 82950 84262 85194 85553
55179 85553 85497 85198 84775 84415 84321 84557 85045 85682 86386 87045 87499 87603 87355 86990 86862 87114 87584 88076 88575 88966
55159 88966 88824 87909 86817 86579 87464 88562 88844 88267 87510 86952 86422 85902 85875 86669 87774 88209 87586 86510
55141 86510 85813 85626 85461 85062 84748 84872 85296 85599 85542 85159 84669 84541 85234 86483 87192 86579 85219 84372 84400
55122 84400 84593 84489 84508 85027 85600 85670 85509 85800 86595 87294 87537 87621 88013 88802 89681 90228 90195 89705 89194 89029
55102 89029 89176 89285 89053 88495 87936 87681 87619 87248 86348 85483 85482 86474 87810 88970 89957 90717 90732 89626 87839
55083 87839 86378 86068 87095 88903 90428 90913 90707 90756 91162 90964 89734 88554 88651 89658 90191 89800 89317
$$ packed form
55216H1462K00n0J05L26M4n89p91k88K83L22J31L65R72J247Q33J53k37k95k58
55197H3935j67J33O31J030R39J87r13j644j493p45j87j33r9L95J081J312R32L59
55179H5553n6k99m23l60r4K36M88O37P04O59M54J04k48l65j28K52M70M92M99L91
55159H8966j42r15j092k38Q85J098K82n77p57n58n30n20k7P94J105M35o23j076
55141H6510o97j87j65l99l14J24M24L03n7l83m90j28O93J249P09o13j360q47K8
55122H4400J93j04J9N19N73P0j61K91P95O99K43Q4L92P89Q79N47l3m90n11j65
55102H9029J47J09k32n58n59k55o2l71r00q65jR92J336J160R87P60J5j106j787
55083H7839j461l10J027J808J525M85k06M9M06j98j230j180R7J007N33l91m83
$$ plain form
55066 89317 89398 89728 89859 89947 90315 90882 91354 91585 91531 91264 91149 91565 92271 92514 92047 91601 92002 93143 94205
55047 94205 94709 94935 95351 95923 96118 95514 94301 93106 92299 91642 90760 89740 88996 88682 88627 88760 89209 89911
55029 89911 90565 91009 91322 91457 91147 90331 89343 88461 87625 86875 86768 87876 89908 91746 92517 92480 92700 93898
55011 93898 95777 97491 98525 98869 98534 97436 95945 95031 95399 96716 98095 99092 99813 100327 100633 101101 102179
54994 102179 103525 104120 103501 102353 101579 101320 101237 101269 101569 101998 102229 102234 102263 102386 102359 101965 101287 100714 100796 101913
54974 101913 103882 105956 107399 107943 107719 107016 106269 105946 106141 106469 106580 106555 106558 106448 106114 105918 106348 107363
54956 107363 108529 109692 110995 112287 113078 113216 113091 112976 112630 111883 111220 111252 111802 111989 111261 110019 109108
54939 109108 108998 109566 110410 111132 111434 111254 110847 110583 110601 110810 111267 112297 114052 116114 117820 118981 120080
$$ packed form
55066H9317Q1L30J31Q8L68N67M72K31n4k67j15M16P06K43m67m46M01J141J062
55047I4205N04K26M16N72J95o04j213j195q07o57q82j020p44l14n5J33M49P02
55029H9911O54M44L13J35l10q16r88q82q36p50j07J108K032J838P71l7K20J198
55011I3898J879J714J034L44l35j098j491r14L68J317J379R97P21N14L06M68J078
54994A02179J346N95o19j148p74k59q3L2L00M29K31NK9J23k7l94o78n73Q2J117
54974A01913J969K074J443N44k24p03p47l23J95L28J11k5Lj10l34j96M30J015
54956A07363J166J163J303J292P91J38j25j15l46p47o63L2N50J87p28j242r11
54939A09108j10N68Q44P22L02j80m07k64J8K09M57J030J755K062J706J161J099
$$ plain form
54922 120080 121784 124477 128246 133044 138701 144966 151686 158819 166172 173269 179603 184814 188538 190286
54908 190286 189721 186922 182201 175786 167998 159639 151834 145326 140109 135809 132214 129277 126871 124837
54894 124837 123243 122317 122001 121742 120979 119764 118718 118304 118378 118543 118756 119317 120387 121867 123784 126506 130354
54877 130354 135199 140633 146443 152700 159380 166098 172326 177827 182758 187231 190838 192708 192122 189013
54863 189013 183804 176960 168894 160139 151349 143086 135814 130010 125959 123355 121372 119261 116747 113906
54849 113906 110939 108157 105876 104164 102876 101974 101512 101245 100676 99711 98913 98752 98926 98726 97835 96460 94945
54832 94945 93676 93125 93502 94426 95356 96279 97558 99141 100446 101044 101081 100899 100644 100336 99993 99556 99065 98954
54814 98954 99729 101160 102272 102469 102377 103117 104945 106960 108048 107814 106680 105429 104676 104524 104637 104721 104848
$$ packed form
54922A20080J704K693L769M798N657O265O720P133P353P097O334N211L724J748
54908A90286n65k799m721o415p788q359p805o508n217m300l595k937k406k034
54894A24837j594r26l16k59p63j215j046m14P4J65K13N61J070J480J917K722L848
54877A30354M845N434N810O257O680O718O228N501M931M473L607J870n86l109
54863A89013n209o844q066q755q790q263p272n804m051k604j983k111k514k841
54849A13906k967k782k281j712j288r02m62k67n69r65p98j61J74k00q91j375j515
54832I4945j269n51L77R24R30R23J279J583J305N98L7j82k55l08l43m37m91j11
54814I8954P75J431J112J97r2P40J828K015J088k34j134j251p53j52J13Q4J27
$$ plain form
54797 104848 105182 105559 105620 105305 104899 104549 104041 103203 102264 101602 101299 101205 101358 102038 103344 104917 106240 107140
54779 107140 107842 108600 109457 110396 111538 113048 114971 117285 120061 123354 126962 130537 134007 137750 142236
54764 142236 147603 153734 160537 167936 175581 182822 189051 193982 197528 199449 199245 196424 190982 183681
54750 183681 175747 168127 161018 154251 148032 142976 139290 136301 133147 129785 126982 125342 124767 124823 125182
54735 125182 125488 125257 124379 123482 123388 124249 125602 127155 129121 131698 134677 137733 140829 144141 147887 152357
54719 152357 157871 164396 171392 178188 184346 189462 192944 194337 193755 191623 188054 182905 176448 169580
54705 169580 163165 157403 152067 147107 142747 139049 135716 132454 129383 126892 125119 123785 122584 121511
54691 121511 120579 119513 118132 116901 116482 116644 116338 115205 114322 114759 115939 116390 115852 115529 116143 116859 116650
$$ packed form
54797A04848L34L77O1l15m06l50n08q38r39o62l03r4J53O80J306J573J323R00
54779A07140P02P58Q57R39J142J510J923K314K776L293L608L575L470L743M486
54764A42236N367O131O803P399P645P241O229M931L546J921k04k821n442p301
54750A83681p934p620p109o767o219n056l686k989l154l362k803j640n75N6L59
54735A25182L06k31q78q97r4Q61J353J553J966K577K979L056L096L312L746M470
54719A52357N514O525O996O796O158N116L482J393n82k132l569n149o457o868
54705A69580o415n762n336m960m360l698l333l262l071k491j773j334j201j073
54691A21511r32j066j381j231m19J62l06j133q83M37J180M51n38l23O14P16k09
$$ plain form
54674 116650 115782 115200 115055 114728 113955 113071 112233 111218 110089 109451 109794 110963 112352 113285 113222 112096 110587
54657 110587 109686 109778 110459 111272 112182 113160 113830 113924 113774 113972 114679 115523 116000 115722 114575 112940 111586 110976
54639 110976 110841 110681 110412 110140 109592 108406 106943 106138 106390 107118 107593 107737 107792 107696 107266 106677 106289 106085 105698
54620 105698 104985 104237 103795 103754 104054 104620 105315 105919 106251 106284 106162 106183 106657 107655 108910 110088 111084 111936 112623
54601 112623 113117 113545 114026 114405 114367 113796 112848 111713 110519 109427 108577 107952 107535 107502 107978 108645 109018 109116 109425
54582 109425 110109 110703 110793 110605 110638 111044 111672 112403 113109 113535 113587 113563 113744 113958 113908 113741 113854 114328 114962 115764
54562 115764 116906 118240 119381 120268 121099 121735 121736 121192 120886 121323 122122 122745 123288 124013 124520 124182 123260 122876
54544 122876 123720 125279 126594 127333 127896 128776 130081 131543 132735 133414 133830 134563 135879 137309 138057 137813
$$ packed form
54674A16650q68n82j45l27p73q84q38j015j129o38L43J169J389R33o3j126j509
54657A10587r01R2O81Q13R10R78O70R4j50J98P07Q44M77k78j147j635j354o10
54639A10976j35j60k69k72n48j186j463q05K52P28M75J44N5r6m30n89l88k04l87
54620A05698p13p48m42m1L00N66O95O04L32L3j22K1M74R98J255J178R96Q52O87
54601A12623M94M28M81L79l8n71r48j135j194j092q50o25m17l3M76O67L73R8L09
54582A09425O84N94R0j88L3M06O28P31P06M26N2k4J81K14n0j67J13M74O34Q02
54562A15764J142J334J141Q87Q31O36Jn44l06M37P99O23N43P25N07l38r22l84
54544A22876Q44J559J315P39N63Q80J305J462J192O79M16P33J316J430P48k44
$$ plain form
54528 137813 137036 136464 136462 136855 137251 137389 137254 136976 136752 136811 137283 138003 138528 138539 138169 137787 137464 136891 135896 134763
54508 134763 133898 133355 132932 132600 132472 132430 132142 131561 131097 131095 131372 131456 131137 130553 129935 129535 129655 130331 130992 130895
54488 130895 130061 129474 130078 131825 133928 135804 137404 138787 139863 140650 141387 142183 142839 143241 143728 144754
54472 144754 146293 147822 148881 149415 149600 149640 149805 150400 151436 152486 153075 153169 153103 153106 153170 153344 153791 154426 154799
54453 154799 154631 154251 154167 154275 153907 152741 151332 150485 150328 150247 149689 148770 148021 147724 147622 147282 146629 146004 145642
54434 145642 145299 144563 143473 142555 142177 142139 142055 141883 141851 142014 142212 142394 142670 143014 143184 143089 143042 143417 144136 144616
54414 144616 144319 143262 141954 140835 139959 139251 138857 138934 139244 139411 139636 140563 142141 143213 142890 141935 141982 143543
54396 143543 145636 147453 149358 151811 154258 155828 156596 157283 158075 158544 158547 158328 157776 156482 154706 153494
$$ packed form
54528A37813p77n72kL93L96J38j35k78k24N9M72P20N25J1l70l82l23n73r95j133
54508A34763q65n43m23l32j28m2k88n81m64kK77Q4l19n84o18m00J20O76O61r7
54488A30895q34n87O04J747K103J876J600J383J076P87P37P96O56M02M87J026
54472A44754J539J529J059N34J85M0J65N95J036J050N89R4o6LO4J74M47O35L73
54453A54799j68l80q4J08l68j166j409q47j57q1n58r19p49k97j02l40o53o25l62
54434A45642l43p36j090r18l78l8q4j72l2J63J98J82K76L44J70r5m7L75P19M80
54414A44616k97j057j308j119q76p08l94P7L10J67K25R27J578J072l23r55M7J561
54396A43543K093J817J905K453K447J570P68O87P92M69Lk19n52j294j776j212
$$ plain form
54380 153494 153375 153616 153272 152453 151954 151968 151865 151190 150294 149826 150045 150798 151883 153182 154511 155564 156079 156080
54362 156080 155876 155742 155593 155109 154215 153244 152607 152433 152582 152754 152526 151624 150348 149424 149180 149194 149051 149047 149606
54343 149606 150328 150290 149252 147890 146803 145903 144923 143872 142769 141504 140310 139805 140108 140383 139793 138588
54327 138588 137776 137998 139196 141056 143147 144770 145346 145093 144906 145485 146846 148579 150170 151196 151630 151968
54311 151968 152626 153294 153331 152733 152138 151823 151288 150052 148379 146898 145886 145156 144344 143095 141326 139526 138465
54294 138465 138386 138742 138844 138491 137855 137202 136890 137153 137630 137575 136816 136000 135613 135308 134718 134267 134478 134875 134476
54275 134476 133216 132056 131672 131794 131925 132059 132422 133069 134037 135491 137421 139419 141024 142157 143135 144386
54259 144386 146065 147860 149321 150548 152189 154420 156280 156698 155957 155349 155422 155429 154623 153195 151584 149741
$$ packed form
54380A53494j19K41l44q19m99J4j03o75q96m68K19P53J085J299J329J053N15J
54362A56080k04j34j49m84q94r71o37j74J49J72k28r02j276r24k44J4j43mN59
54343A49606P22l8j038j362j087r00r80j051j103j265j194n05L03K75n90j205
54327A38588q12K22J198J860K091J623N76k53j87N79J361J733J591J026M34L38
54311A51968O58O68L7n98n95l15n35j236j673j481j012p30q12j249j769j800j061
54294A38465p9L56J02l53o36o53l12K63M77n5p59q16l87l05n90m51K11L97l99
54275A34476j260j160l84J22J31J34L63O47R68J454J930J998J605J133R78J251
54259A44386J679J795J461J227J641K231J860M18p41o08P3Pq06j428j611j843
$$ plain form
54243 149741 147645 145855 144816 144119 143119 141943 141193 140969 140929 141083 141718 142528 142620 141587 140065 138981 138676
54226 138676 138902 139236 139262 138751 137952 137435 137420 137443 136932 135903 134894 134331 134188 134197 134218 134419 135082 136158 137026 136989
54206 136989 136067 135060 134669 134847 135219 135750 136535 137165 136941 135853 134842 134837 135880 137369 138747 139549 139266
54189 139266 137846 136265 135920 137223 139159 140368 140284 139113 137294 135352 133862 133042 132606 132398 132867 134382
54173 134382 136336 137622 137953 138000 138146 137910 136942 135918 135781 136477 137077 136992 136504 136136 136030 136060 136119 136077 135704
54154 135704 134898 133913 133212 133065 133300 133456 133209 132692 132361 132526 133064 133653 134176 134830 135879 137333 138815 139747
54136 139747 139880 139697 140074 141353 142893 143737 143607 143102 142993 143561 144555 145488 145918 145647 144777 143511 141932
54119 141932 140066 138232 137172 137592 139501 142036 144075 145127 145553 145908 146240 146220 145772 145187 144616 143867 142880
$$ packed form
54243A49741k096j790j039o97j000j176p50k24m0J54O35Q10R2j033j522j084l05
54226A38676K26L34K6n11p99n17j5K3n11j029j009n63j43RK1K01O63J076Q68l7
54206A36989r22j007l91J78L72N31P85O30k24j088j011nJ043J489J378Q02k83
54189A39266j420j581l45J303J936J209q4j171j819j942j490q20m36k08M69J515
54173A34382J954J286L31M7J46k36r68j024j37O96O00q5m88l68j06L0N9m2l73
54154A35704q06r85p01j47K35J56k47n17l31J65N38N89N23O54J049J454J482R32
54136A39747J33j83L77J279J540Q44j30n05j09N68R94R33M30k71q70j266j579
54119A41932j866j834j060M20J909K535K039J052M26L55L32k0m48n85n71p49r87
$$ plain form
54102 142880 142009 141607 141586 141671 141778 141840 141526 140601 139450 138766 138724 138868 138824 138715 138774 138927 138995 139004 139045 138977 138531 137674
54080 137674 136793 136495 137147 138497 139782 140435 140631 140955 141559 141977 141837 141381 141104 141128 141200 141069 140645 139876 138803
54061 138803 137721 137057 137051 137662 138703 139920 140971 141577 141807 142127 143039 144643 146562 148325 149885 151739
54045 151739 154448 157948 161484 164313 166395 168211 170021 171553 172482 172925 173240 173552 173740 173886 174382 175450
54029 175450 176797 177946 178763 179376 179695 179383 178421 177335 176571 175877 174617 172648 170531 168827 167469 165965
54013 165965 164050 161961 160198 159160 158941 159270 159678 159838 159804 159837 160057 160388 160807 161441 162290 163059 163457 163587
53995 163587 163807 164236 164679 165061 165649 166695 168150 169977 172476 175981 180410 185501 191354 198311 206364
53980 206364 215189 224678 234741 244345 251474 254566 253663 249723 243377 234975 225472 216300 208306 201406
$$ packed form
54102A42880q71m02k1Q5J07O2l14r25j151o84m2J44m4j09N9J53O8RM1o8m46q57
54080A37674q81k98O52J350J285O53J96L24O04M18j40m56k77K4P2j31m24p69j073
54061A38803j082o64oO11J041J217J051O06K30L20R12J604J919J763J560J854
54045A51739K709L500L536K829K082J816J810J532R29M43L15L12J88J46M96J068
54029A75450J347J149Q17O13L19l12r62j086p64o94j260j969k117j704j358j504
54013A65965j915k089j763j038k19L29M08J60l4L3K20L31M19O34Q49P69L98J30
53995A63587K20M29M43L82N88J046J455J827K499L505M429N091N853O957Q053
53980B06364Q825R489J0063R604P129L092r03l940o346q402r503r172p994o900
$$ plain form
53966 201406 195370 190280 186079 182344 178867 175965 173850 172088 170094 167962 166384 165913 166535 167804 169023
53951 169023 169445 168685 167124 165696 165195 165743 166892 168157 169493 171265 173661 176261 178445 180209 182242
53936 182242 185142 188931 193485 198889 204933 210690 215231 218628 221686 224708 227143 228574 229443 230420 231498
53921 231498 232128 232048 231507 230818 230075 229336 228696 228036 227010 225508 223955 222830 221956 220585 218348 215857 214101
53904 214101 213302 212678 211355 209219 206731 204192 201535 198737 196046 193697 191604 189448 186956 184110 181239
53889 181239 178974 177858 177836 178240 178384 178085 177516 176767 175787 174692 173835 173457 173374 173094 172247 170944 169770 169375
53871 169375 169956 171194 172630 173922 174641 174169 172261 169636 167524 166444 165818 164943 163920 163267 162971 162491
53855 162491 161642 160935 160930 161600 162526 163455 164457 165627 166835 167701 167831 167131 165906 164592 163467 162764 162845 163856
$$ packed form
53966B01406o036n090m201l735l477k902k115j762j994k132j578m71O22J269J219
53951A69023M22p60j561j428n01N48J149J265J336J772K396K600K184J764K033
53936A82242K900L789M554N404O044N757M541L397L058L022K435J431Q69R77J078
53921B31498O30q0n41o89p43p39o40o60j026j502j553j125q74j371k237k491j756
53904B14101p99o24j323k136k488k539k657k798k691k349k093k156k492k846k871
53889A81239k265j116k2M04J44k99n69p49r80j095q57l78q3k80q47j303j174l95
53871A69375N81J238J436J292P19m72j908k625k112j080o26q75j023o53k96m80
53855A62491q49p07nO70R26R29J002J170J208Q66J30p00j225j314j125p03Q1J011
$$ plain form
53837 163856 165235 166014 165808 165207 165029 165539 166629 168369 170904 173920 176683 178691 180125 181653 183859
53822 183859 186804 190038 193235 196910 202289 210258 220694 233014 246979 262453 278634 294076 307357
53809 307357 317211 322246 321452 315329 305877 295104 283925 272677 261980 252485 244281 237223 231588
53796 231588 227732 225214 222971 220446 217962 215914 214191 212640 211499 210893 210299 209079 207372 205968 205297
53781 205297 205028 204710 204375 204282 204407 204541 204712 205172 205980 206885 207753 208950 211125 214590 218949 223363 227192
53764 227192 230391 233252 235822 237747 238726 238856 238373 237199 235013 231642 227171 221796 215930 210371 205910
53749 205910 202634 199958 197457 195277 193638 192415 191512 191233 191829 192918 193841 194423 195029 195980 197289 198846
53733 198846 200473 201815 202572 202851 203029 203342 203879 204801 206173 207653 208843 209893 211344 213358 215542 217517
$$ packed form
53837A63856J379P79k06o01j78N10J090J740K535L016K763K008J434J528K206
53822A83859K945L234L197L675N379P969J0436J2320J3965J5474J6181J5442J3281
53809C07357R854N035p94o123r452j0773j1179j1248j0697r495q204p058n635
53796B31588l856k518k243k525k484k048j723j551j141o06n94j220j707j404o71
53781B05297k69l18l35r3J25J34J71M60Q08R05Q68J197K175L465M359M414L829
53764B27192L199K861K570J925R79J30m83j174k186l371m471n375n866n559m461
53749B05910l276k676k501k180j639j223r03k79N96J089R23N82O06R51J309J557
53733A98846J627J342P57K79J78L13N37R22J372J480J190J050J451K014K184J975
$$ plain form
53717 217517 219228 220708 222044 223612 225774 228235 230290 231890 233830 236619 239801 242804 245829 249310
53703 249310 252965 256086 258493 260552 262435 264070 265736 268085 271435 275441 279512 283175 286040 287921
53689 287921 289150 290387 291927 293397 294250 294293 293689 292759 291878 291305 290907 290302 289435 288751 288563 288487 287853 286655
53671 286655 285725 285824 286749 287530 287427 286504 285262 284018 282821 281756 280956 280269 279297 277901 276489 275627 275456
53654 275456 275637 275710 275369 274555 273551 272921 273123 274105 275360 276385 277029 277482 278010 278690 279344 279763 279973 280229
53636 280229 280753 281612 282825 284341 285856 286967 287697 288688 290671 293829 297781 301958 305861 309211 312125
53621 312125 315011 318095 321185 324097 327078 330514 334415 338521 342781 347343 352062 356431 360125 363437
53607 363437 367025 371277 375906 380136 383460 386240 389302 392788 395778 397424 398130 399100 400834 402621 403500
$$ packed form
53717B17517J711J480J336J568K162K461K055J600J940K789L182L003L025L481
53703B49310L655L121K407K059J883J635J666K349L350M006M071L663K865J881
53689B87921J229J237J540J470Q53M3o04r30q81n73l98o05q67o84j88p6o34j198
53671B86655r30R9R25P81j03r23j242j244j197j065q00o87r72j396j412q62j71
53654B75456J81P3l41q14j004o30K02R82J255J025O44M53N28O80O54M19K10K56
53636B80229N24Q59J213J516J515J111P30R91J983L158L952M177L903L350K914
53621C12125K886L084L090K912K981L436L901M106M260M562M719M369L694L312
53607C63437L588M252M629M230L324K780L062L486K990J646P06R70J734J787Q79
$$ plain form
53592 403500 403197 402039 400483 398982 397907 397249 396607 395667 394494 393206 391609 389384 386501 383259 380088
53577 380088 377409 375514 374320 373351 372145 370701 369348 368245 367175 365891 364557 363693 363683 364396 365347 366163
53561 366163 366763 367182 367463 367771 368350 369230 370167 371013 371864 372700 373241 373508 374278 376490 380286 384962 389817
53544 389817 394724 399977 405994 413121 421329 430122 439047 448208 457889 467808 477329 486382 495550 505091
53530 505091 514427 522819 530130 536784 543529 551436 561470 573522 586314 598741 611049 624369 639479
53517 639479 656500 675365 695897 717595 739980 763241 788055 814712 842737 871327 899780
53506 899780 927544 954379 980646 1007090 1034170 1061802 1089811 1118302 1147377 1176700 1205582
53495 1205582 1233405 1259841 1284813 1308487 1331285 1353740 1376170 1398495 1420394 1441638 1462234
$$ packed form
53592D03500l03j158j556j501j075o58o42r40j173j288j597k225k883l242l171
53577C80088k679j895j194r69j206j444j353j103j070j284j334q64j0P13R51Q16
53561C66163O00M19K81L08N79Q80R37Q46Q51Q36N41K67P70K212L796M676M855
53544C89817M907N253O017P127Q208Q793Q925R161R681R919R521R053R168R541
53530E05091R336Q392P311O654O745P907J0034J2052J2792J2427J2308J3320J5110
53517F39479J7021J8865K0532K1698K2385K3261K4814K6657K8025K8590K8453
53506H99780K7764K6835K6267K6444K7080K7632K8009K8491K9075K9323K8882
53495A205582K7823K6436K4972K3674K2798K2455K2430K2325K1899K1244K0596
$$ plain form
53484 1462234 1482224 1501565 1520400 1539367 1559243 1580104 1600986 1620540 1637898 1652819 1665303
53473 1665303 1675340 1682939 1688056 1690514 1690155 1687024 1681206 1672624 1661332 1648020 1633861 1619610 1605031
53460 1605031 1589363 1572195 1553680 1533969 1512785 1489747 1465106 1439939 1415495 1392264 1369708
53449 1369708 1346889 1323323 1299286 1275401 1252104 1229533 1207855 1187525 1169102 1152851 1138678
53438 1138678 1126471 1116271 1108035 1101445 1096184 1092278 1089908 1089022 1089439 1091267 1094874 1100449 1107887 1117043
53424 1117043 1127765 1139746 1152785 1167237 1183655 1201835 1220811 1240100 1260438 1282866 1307481
53413 1307481 1333626 1361017 1390069 1421235 1454524 1489666 1526368 1564512 1604505 1647361 1693982
53402 1693982 1744316 1797543 1852992 1910504 1969987 2031235 2094296 2159527 2226908 2295573 2364248
$$ packed form
53484A462234J9990J9341J8835J8967J9876K0861K0882J9554J7358J4921J2484
53473A665303J0037P599N117K458l59l131n818q582j1292j3312j4159j4251j4579
53460A605031j5668j7168j8515j9711k1184k3038k4641k5167k4444k3231k2556
53449A369708k2819k3566k4037k3885k3297k2571k1678k0330j8423j6251j4173
53438A138678j2207j0200q236o590n261l906k370q86M17J828L607N575P438R156
53424A117043J0722J1981J3039J4452J6418J8180J8976J9289K0338K2428K4615
53413A307481K6145K7391K9052L1166L3289L5142L6702L8144L9993M2856M6621
53402A693982N0334N3227N5449N7512N9483O1248O3061O5231O7381O8665O8675
$$ plain form
53391 2364248 2432032 2498652 2564250 2629053 2693025 2755558 2815628 2872390 2925634 2975658 3022849
53380 3022849 3067381 3109170 3148026 3183908 3216897 3246761 3272624 3293440 3308800 3318999 3324166
53369 3324166 3323539 3315598 3298725 3271813 3234760 3188665 3135404 3076841 3014559 2950085 2884703 2818796
53357 2818796 2751932 2684076 2616389 2550355 2486430 2424120 2363166 2303929 2246493 2190033 2133455
53346 2133455 2076320 2018907 1961724 1905388 1850726 1798565 1749327 1702992 1659401 1618354 1579569
53335 1579569 1542926 1508870 1478240 1451427 1427818 1406244 1385855 1366382 1347690 1329496 1311610
53324 1311610 1294135 1277261 1261069 1245720 1231588 1218894 1207358 1196606 1186899 1179018 1173319 1169281
53312 1169281 1166224 1164124 1163387 1164099 1166063 1169489 1175031 1182922 1192601 1203590 1216405 1232067 1250845
$$ packed form
53391B364248O7784O6620O5598O4803O3972O2533O0070N6762N3244N0024M7191
53380C022849M4532M1789L8856L5882L2989K9864K5863K0816J5360J0199N167
53369C324166o27p941j6873k6912l7053m6095n3261n8563o2282o4474o5382o5907
53357B818796o6864o7856o7687o6034o3925o2310o0954n9237n7436n6460n6578
53346B133455n7135n7413n7183n6336n4662n2161m9238m6335m3591m1047l8785
53335A579569l6643l4056l0630k6813k3609k1574k0389j9473j8692j8194j7886
53324A311610j7475j6874j6192j5349j4132j2694j1536j0752r707p881n699m038
53312A169281l057k100p37P12J964L426N542P891R679J0989J2815J5662J8778
$$ plain form
53299 1250845 1272078 1295221 1320411 1347684 1376263 1405192 1434429 1464662 1496110 1528095 1559818
53288 1559818 1590933 1621113 1649697 1676297 1701409 1725855 1749670 1772028 1792217 1810226 1826177
53277 1826177 1839548 1849250 1854495 1855519 1853446 1849330 1843225 1834209 1821382 1804698 1784729 1761932 1736406
53264 1736406 1708202 1677492 1644450 1609374 1572947 1536020 1498997 1461730 1424134 1386668 1350102
53253 1350102 1315038 1281713 1249981 1219309 1188957 1158384 1127474 1096456 1065767 1035854 1006707
53242 1006707 977549 947441 916360 885350 855488 827222 800871 777100 756287 737873 720991
53231 720991 705509 691751 679397 667472 655492 643823 632709 621639 610010 597839 585266
53220 585266 571886 557234 541720 526463 512243 499094 486918 475942 466337 457709 449270 440495
$$ packed form
53299A250845K1233K3143K5190K7273K8579K8929K9237L0233L1448L1985L1723
53288A559818L1115L0180K8584K6600K5112K4446K3815K2358K0189J8009J5951
53277A826177J3371R702N245J024k073m116o105r016j2827j6684j9969k2797k5526
53264A736406k8204l0710l3042l5076l6427l6927l7023l7267l7596l7466l6566
53253A350102l5064l3325l1732l0672l0352l0573l0910l1018l0689k9913k9147
53242A006707k9158l0108l1081l1010k9862k8266k6351k3771k0813j8414j6882
53231G20991j5482j3758j2354j1925j1980j1669j1114j1070j1629j2171j2573
53220E85266j3380j4652j5514j5257j4220j3149j2176j0976r605q628q439q775
$$ plain form
53208 440495 431529 423055 415705 409463 403608 397405 390823 384343 378135 371761 364823 357584 350700 344542
53194 344542 339017 333942 329311 325246 321900 319383 317523 315707 313260 310141 307096 304998 304074 303798 303396
53179 303396 302334 300478 298082 295667 293760 292591 292039 291858 291878 291972 291881 291250 289924 288180 286559 285386
53163 285386 284468 283301 281550 279336 277143 275465 274523 274180 274118 274163 274409 275001 275776 276180 275538 273482 270273
53146 270273 266811 264176 262886 262573 262493 262284 262084 262001 261849 261494 261118 260884 260550 259728 258445 257182 256365 256043
53128 256043 256066 256338 256731 256955 256680 255833 254696 253712 253194 253186 253520 253930 254082 253591 252218 250121 247818 245764
53110 245764 243997 242260 240418 238612 237015 235596 234176 232693 231305 230242 229547 229026 228493 228048 228059 228815
53094 228815 230184 231631 232565 232723 232287 231603 230816 229852 228778 227946 227579 227414 227060 226630 226615 227141 227800 228319
$$ packed form
53208D40495q966q474p350o242n855o203o582o480o208o374o938p239o884o158
53194C44542n525n075m631m065l346k517j860j816k447l119l045k098r24k76m02
53179C03396j062j856k396k415j907j169n52j81K0R4r1o31j326j744j621j173
53163B85386r18j167j751k214k193j678r42l43o2M5K46N92P75M04o42k056l209
53146B70273l462k635j290l13q0k09k00q3j52l55l76k34l34q22j283j263q17l22
53128B56043K3K72L93K24k75q47j137r84n18qL34M10J52m91j373k097k303k054
53110B45764j767j737j842j806j597j419j420j483j388j063o95n21n33m45J1P56
53094B28815J369J447R34J58m36o84p87r64j074q32l67j65l54m30j5N26O59N19
$$ plain form
53076 228319 229044 230437 232375 234193 235186 234937 233517 231667 230416 230061 229788 228749 227278 226451 226585 226866
53060 226866 226548 225855 225450 225627 226345 227529 228825 229462 229041 228340 228726 230599 232842 234016 233773 232791 231640
53043 231640 230219 228410 226747 225976 226070 226180 225692 224926 224554 224630 224596 224019 222950 221648 220413 219617 219459 219647
53025 219647 219766 219925 220557 221509 221964 221577 221086 221314 222063 222626 223057 224058 225638 226693 226293 224883 223778
53008 223778 223731 224335 224650 224063 222638 221010 220017 220150 221143 222145 222431 221965 221252 220777 220701 221015 221729 222741
52990 222741 223702 224234 224287 224094 223762 223196 222474 222057 222318 223021 223578 223845 224346 225521 226998 227971 228227 228467
52972 228467 229433 230994 232377 233190 233863 235022 236739 238600 240290 241757 242905 243447 243233 242551 241977 241881
52956 241881 242131 242207 241641 240378 238786 237289 236055 235004 234024 233145 232536 232342 232408 232213 231327 229974 228877
$$ packed form
53076B28319P25J393J938J818R93k49j420j850j251l55k73j039j471q27J34K81
53060B26866l18o93m05J77P18J184J296O37m21p01L86J873K243J174k43r82j151
53043B31640j421j809j663p71R4J10m88p66l72P6l4n77j069j302j235p96j58J88
53025B19647J19J59O32R52M55l87m91K28P49N63M31J001J580J055m00j410j105
53008B23778m7O04L15n87j425j628r93J33R93J002K86m66p13m75p6L14P14J012
52990B22741R61N32N3j93l32n66p22m17K61P03N57K67N01J175J477R73K56K40
52972B28467R66J561J383Q13O73J159J717J861J690J467J148N42k14o82n74r6
52956B41881K50P6n66j263j592j497j234j051r80q79o09j94O6j95q86j353j097
$$ plain form
52939 228877 228426 228276 227897 227194 226303 225162 223717 222271 221141 220144 218958 217848 217419 217681 218031 218270 218946
52922 218946 220390 222015 222978 223124 222902 222691 222602 222594 222401 221610 220206 218828 218100 217924 217744 217302 216700 215932
52904 215932 214849 213559 212432 211698 211324 211268 211562 212136 212839 213636 214576 215594 216584 217571 218592 219453 219877
52887 219877 219877 219776 219869 220278 220947 221511 221360 220227 218702 217722 217506 217394 216848 216209 216211 217071 218310 219296 219727
52868 219727 219740 219821 220528 222041 223946 225590 226681 227450 228218 228919 229201 228918 228330 227680 226694 224831 221975
52851 221975 218666 215509 212653 209961 207413 205076 202919 201013 199737 199409 199771 200175 200185 199724 198753 197289
52835 197289 195779 194965 195142 195876 196607 197247 197934 198504 198542 197852 196639 195284 194127 193442 193421 194087 195239 196492
52817 196492 197485 198180 198911 200007 201363 202590 203644 205007 207122 209731 211983 213152 213188 212591 211849 210953
$$ packed form
52939B28877m51j50l79p03q91j141j445j446j130r97j186j110m29K62L50K39O76
52922B18946J444J625R63J46k22k11q9qj93p91j404j378p28j76j80m42o02p68
52904B15932j083j290j127p34l74n6K94N74P03P97R40J018R90R87J021Q61M24
52887B19877%j01R3M09O69N64j51j133j525r80k16j12n46o39KQ60J239R86M31
52868B19727J3Q1P07J513J905J644J091P69P68P01K82k83n88o50r86j863k856
52851B21975l309l157k856k692k548k337k157j906j276l28L62M04J0m61r71j464
52835A97289j510q14J77P34P31O40O87N70L8o90j213j355j157o85k1O66J152J253
52817A96492R93O95P31J096J356J227J054J363K115K609K252J169L6n97p42q96
$$ plain form
52801 210953 209507 207366 205102 203567 202937 202416 201098 198997 197006 195887 195578 195522 195448 195590 196176 196963 197390
52784 197390 197140 196423 195728 195454 195723 196378 197102 197665 198135 198719 199378 199852 200128 200574 201375 202127 202352 202218 202285
52765 202285 202642 202786 202415 201811 201310 200825 200227 199834 200068 200775 201279 201105 200399 199554 198746 197979 197424 197426 198083
52746 198083 198953 199370 199074 198430 197984 197964 198256 198714 199296 199988 200779 201709 202810 204074 205557 207415 209660
52729 209660 211964 213852 214950 214937 213584 211229 209030 208189 208826 209998 210821 211152 211171 210873 210331 210007 210331
52712 210331 211102 211618 211369 210434 209308 208482 208106 207952 207722 207351 206906 206361 205795 205686 206454 207668 208273 207860
52694 207860 207177 207027 207180 206876 206021 205259 205120 205632 206668 208137 209816 211481 213170 214921 216338 216939
52678 216939 216956 217210 218069 219037 219575 219832 220236 220768 221069 221041 220961 221098 221496 222075 222680 223138 223523 224318 226021
$$ packed form
52801B10953j446k141k264j535o30n21j318k101j991j119l09n6p4J42N86P87M27
52784A97390k50p17o95k74K69O55P24N63M70N84O59M74K76M46Q01P52K25j34O7
52765B02285L57J44l71o04n01m85n98l93K34P07N04j74p06q45q08p67n55KO57
52746A98083Q70M17k96o44m46k0K92M58N82O92P91R30J101J264J483J858K245
52729B09660K304J888J098j3j353k355k199q41O37J172Q23L31J9k98n42l24L24
52712B10331P71N16k49r35j126q26l76j54k30l71m45n45n66j09P68J214O05m13
52694B07860o83j50J53l04q55p62j39N12J036J469J679J665J689J751J417O01
52678B16939J7K54Q59R68N38K57M04N32L01k8q0J37L98N79O05M58L85P95J703
$$ plain form
52659 226021 228530 231094 233009 234182 234935 235321 234806 232733 229096 224843 221313 219297 218598 218439 218217 217838
52643 217838 217460 217123 216715 216228 215886 215983 216664 217919 219724 222010 224459 226477 227579 227808 227744 228070 229150
52626 229150 230906 232947 234804 236149 236880 236970 236298 234745 232477 230010 227897 226442 225763 226005 227203 228970
52610 228970 230604 231683 232412 233178 233932 234319 234359 234546 235177 235953 236529 237106 238040 239114 239740 239863 240157 241134
52592 241134 242512 243702 244579 245391 246091 246219 245514 244453 244043 245051 247357 249981 251803 252302 251692 250515
52576 250515 249292 248401 247896 247363 246300 244764 243356 242473 241924 241457 241253 241521 241904 241774 240988 239960 239027
52559 239027 238162 237272 236433 235719 235126 234719 234639 234859 235136 235312 235530 236081 237128 238517 239749 240150 239334 237584
52541 237584 235727 234638 234852 236394 238728 240928 242220 242427 241850 240868 239853 239234 239166 239116 238173 235958 233002
$$ packed form
52659B26021K509K564J915J173P53L86n15k073l637m253l530k016o99j59k22l79
52643B17838l78l37m08m87l42R7O81J255J805K286K449K018J102K29o4L26J080
52626B29150J756K041J857J345P31R0o72j553k268k467k113j455o79K42J198J767
52610B28970J634J079P29P66P54L87M0J87O31P76N76N77R34J074O26J23K94R77
52592B41134J378J190Q77Q12P00J28p05j061m10J008K306K624J822M99o10j177
52576B50515j223q91n05n33j063j536j408q83n49m67k04K68L83j30p86j028r33
52559B39027q65q90q39p14n93m07q0K20K77J76K18N51J047J389J232M01q16j750
52541B37584j857j089K14J542K334K200J292K07n77r82j015o19o8n0r43k215k956
$$ plain form
52524 233002 230210 228215 227284 227439 228349 229309 229672 229356 228844 228737 229351 230670 232572 235060 238212 241918
52508 241918 245849 249744 253535 256991 259514 260677 260791 260503 259911 258584 256422 253937 251549 249121 246457
52493 246457 243805 241602 240098 239410 239517 239962 240096 240003 240698 242853 245792 248316 250139 251839 253704 255434
52477 255434 256833 257986 258705 258608 257902 257304 257009 256476 255600 255319 256471 258625 260688 262222 263495 264620
52461 264620 265482 266374 267801 269495 270375 269767 268139 266301 264398 262147 259691 257608 256146 254907 253344
52446 253344 251228 248636 245873 243591 242557 242985 244159 245061 245345 245467 245897 246577 247236 247883 248651 249375 249743
52429 249743 249836 250136 250880 251714 252152 252156 252113 252487 253661 255840 258801 261878 264573 267097 270052 273700 277970
52412 277970 283118 289865 298591 308643 318587 326939 332557 334770 333529 329423 323327 316057 308467 301579
$$ packed form
52524B33002k792j995r31J55R10R60L63l16n12j07O14J319J902K488L152L706
52508B41918L931L895L791L456K523J163J14k88n92j327k162k485k388k428k664
52493B46457k652k203j504o88J07M45J34r3O95K155K939K524J823J700J865J730
52477B55434J399J153P19r7p06n98k95n33q76k81J152K154K063J534J273J125
52461B64620Q62Q92J427J694Q80o08j628j838j903k251k456k083j462j239j563
52446B53344k116k592k763k282j034M28J174R02K84J22M30O80O59O47P68P24L68
52429B49743R3L00P44Q34M38Mm3L74J174K179K961L077K695K524K955L648M270
52412B77970N148O747Q726J0052R944Q352N618K213j241m106o096p270p590o888
$$ plain form
52398 301579 296266 292731 290449 288616 286672 284559 282737 281805 281880 282361 282554 282480 282843 284172 286249 288480
52382 288480 290547 292535 294549 296467 298148 299735 301603 303973 306696 309593 312931 317288 322826 328916
52368 328916 334723 339954 344763 349131 352710 355303 357131 358578 359954 361600 363850 366697 369720 372638
52354 372638 375773 379722 384603 389912 395247 400969 407976 416746 426819 437364 448159 459718 472447
52341 472447 486078 500180 514833 530454 547207 565070 584293 605161 627260 649526 671259
52330 671259 692722 714570 737068 760013 783044 805798 828018 849689 870787 890858 909242
52319 909242 925843 941078 954794 965858 973380 977943 980981 983167 984008 982936 980148 976283 971700
52306 971700 966309 959970 952963 946075 940049 934884 929999 925186 920919 917428 914151 910753 908161 907682
$$ packed form
52398C01579n313l535k282j833j944k113j822r32P5M81J93p4L63J329K077K231
52382B88480K067J988K014J918J681J587J868K370K723K897L338M357N538O090
52368C28916N807N231M809M368L579K593J828J447J376J646K250K847L023K918
52354C72638L135L949M881N309N335N722P007Q770J0073J0545J0795J1559J2729
52341D72447J3631J4102J4653J5621J6753J7863J9223K0868K2099K2266K1733
52330F71259K1463K1848K2498K2945K3031K2754K2220K1671K1098K0071J8384
52319I09242J6601J5235J3716J1064P522M563L038K186Q41j072k788l865m583
52306I71700n391o339p007o888o026n165m885m813m267l491l277l398k592m79
$$ plain form
52292 907682 909309 911840 914619 918197 923133 929163 936079 944604 955711 969444 984944 1001334 1018141
52279 1018141 1035137 1052172 1069022 1085121 1099697 1112445 1123851 1134517 1144385 1152869 1159481 1164025
52267 1164025 1166442 1166819 1165396 1162268 1157270 1150485 1142601 1134363 1125820 1116570 1106657 1096806 1087736 1079567
52253 1079567 1071893 1064163 1055971 1047326 1038687 1030504 1022676 1014751 1006640 998855 991997 986279 981710 978434
52239 978434 976701 976657 978335 981708 986503 991973 997124 1001411 1005206 1009411 1014523 1020173 1025736 1031155 1036840
52224 1036840 1042821 1048522 1053607 1058604 1064291 1070814 1077829 1085276 1093439 1102311 1111503 1120795 1130225 1139480
52210 1139480 1147745 1154478 1159916 1164512 1168298 1171252 1173957 1177245 1181215 1185142 1188426 1191236 1193971 1196521
52196 1196521 1198394 1199429 1200041 1200711 1201422 1201737 1201327 1200343 1199234 1198221 1196996 1194887 1191346 1186292 1180131
$$ packed form
52292I07682J627K531K779L578M936O030O916Q525J1107J3733J5500J6390J6807
52279A018141J6996J7035J6850J6099J4576J2748J1406J0666R868Q484O612M544
52267A164025K417L77j423l128m998o785p884q238q543r250r913r851r070q169
52253A079567p674p730q192q645q639q183p828p925q111p785o858n718m569l276
52239I78434j733m4J678L373M795N470N151M287L795M205N112N650N563N419N685
52224A036840N981N701N085M997N687O523P015P447Q163Q872R192R292R430R255
52210A139480Q265O733N438M596L786K954K705L288L970L927L284K810K735K550
52196A196521J873J035O12O70P11L15m10r84j109j013j225k109l541n054o161
$$ plain form
52181 1180131 1173531 1167094 1161062 1155208 1149137 1142823 1136880 1132151 1128953 1126793 1124880 1122870 1121080 1120040
52167 1120040 1119994 1120809 1122156 1123754 1125565 1127897 1131195 1135521 1140354 1145083 1149657 1154482 1159640 1164537 1168564
52152 1168564 1171824 1174932 1178243 1181652 1185157 1189248 1194619 1201707 1210613 1221208 1233150 1246034 1259688
52139 1259688 1274038 1288524 1302044 1314042 1325488 1338178 1352954 1369085 1385511 1402112 1419409
52128 1419409 1437491 1455825 1473993 1492059 1510209 1528365 1546245 1563508 1579759 1594616 1607830
52117 1607830 1619168 1628220 1634591 1638316 1639811 1639324 1636646 1631540 1624248 1615396 1605537 1595001 1584149
52104 1584149 1573516 1563598 1554589 1546439 1539176 1533067 1528469 1525625 1524694 1525792 1528749 1532876 1537380 1542185
52090 1542185 1548021 1555406 1563814 1572254 1580522 1589478 1600078 1612530 1626469 1641563 1657736 1674976
$$ packed form
52181A180131o600o437o032n854o071o314n943m729l198k160j913k010j790j040
52167A120040m6Q15J347J598J811K332L298M326M833M729M574M825N158M897M027
52152A168564L260L108L311L409L505M091N371P088Q906J0595J1942J2884J3654
52139A259688J4350J4486J3520J1998J1446J2690J4776J6131J6426J6601J7297
52128A419409J8082J8334J8168J8066J8150J8156J7880J7263J6251J4857J3214
52117A607830J1338R052O371L725J495m87k678n106p292q852r859j0536j0852
52104A584149j0633r918r009q150p263o109m598k844r31J098K957M127M504M805
52090A542185N836P385Q408Q440Q268Q956J0600J2452J3939J5094J6173J7240
$$ plain form
52078 1674976 1693099 1711577 1729588 1746432 1761893 1776084 1788954 1800221 1809666 1817120 1822102 1823906
52066 1823906 1822285 1817700 1810631 1800899 1788029 1772155 1754292 1735653 1716752 1697133 1675892 1652630
52054 1652630 1627957 1602994 1578386 1553957 1529247 1504095 1478700 1453492 1429019 1405620 1383104
52043 1383104 1361124 1340071 1321161 1305370 1292607 1282174 1273643 1266930 1261950 1258678 1257252 1257437 1258221
52030 1258221 1258483 1257963 1257037 1255697 1253373 1249700 1244793 1238666 1231064 1222120 1212596 1203014 1192938 1181568
52016 1181568 1168793 1155242 1141469 1127428 1112674 1096721 1079206 1060024 1039476 1018178 996724
52005 996724 975427 954324 933350 912520 891975 871882 852307 833326 815229 798470 783316
51994 783316 769631 757125 745747 735681 726955 719177 711705 704012 695894 687412 678806 670436 662528
$$ packed form
52078A674976J8123J8478J8011J6844J5461J4191J2870J1267R445P454M982J804
52066A823906j621m585p069r732j2870j5874j7863j8639j8901j9619k1241k3262
52054A652630k4673k4963k4608k4429k4710k5152k5395k5208k4473k3399k2516
52043A383104k1980k1053j8910j5791j2763j0433q531o713m980l272j426J85P84
52030A258221K62n20r26j340k324l673m907o127p602q944r524r582j0076j1370
52016A181568j2775j3551j3773j4041j4754j5953j7515j9182k0548k1298k1454
52005I96724k1297k1103k0974k0830k0545k0093j9575j8981j8097j6759j5154
51994G83316j3685j2506j1378j0066q726p778p472p693q118q482q606q370p908
$$ plain form
51981 662528 654826 646558 637005 626103 614365 602291 590133 578246 567290 557830 549911 543235 537686
51968 537686 533505 531039 530434 531502 533789 536857 540530 544698 548880 552329 554727 556452 557861 558567 557751
51953 557751 554945 550239 543988 536850 529964 524527 521022 519118 518320 518468 519672 522151 526178 531913 539273
51938 539273 548100 558247 569130 579513 588257 595187 600576 603890 603832 599838 592799 583909 573439 561158
51924 561158 547450 533363 519742 506808 494429 482414 470631 459253 448831 439822 432184 425666
51912 425666 420336 416455 413945 412307 411015 409783 408601 407909 408619 411527 416559 422828 429484 436193 442808
51897 442808 448944 454067 457746 459547 458870 455253 449003 441387 433959 427576 422110 417180 413031 410424
51883 410424 409765 410725 412884 416354 421436 427920 435208 443012 451499 460691 470075 478981 487097 494470 501235
$$ packed form
51981F62528p702q268r553j0902j1738j2074j2158j1887j0956r460p919o676n549
51968E37686m181k466o05J068K287L068L673M168M182L449K398J725J409P06q16
51953E57751k806m706o251p138o886n437l505j904p98J48J204K479M027N735P360
51938E39273Q827J0147J0883J0383Q744O930N389L314n8l994p039q890j0470j2281
51924E61158j3708j4087j3621j2934j2379j2015j1783j1378j0422r009p638o518
51912D25666n330l881k510j638j292j232j182o92P10K908N032O269O656O709O615
51897D42808O136N123L679J801o77l617o250p616p428o383n466m930m149k607
51883D10424o59R60K159L470N082O484P288P804Q487R192R384Q906Q116P373O765
$$ plain form
51868 501235 507516 513396 518757 523237 526582 529122 531774 535539 540911 547651 554915 561533 566295 568316
51854 568316 567313 563526 557262 548629 537883 525961 514270 503759 494385 485577 477005 468702 460756
51841 460756 453316 446726 441163 436112 430705 424872 419758 416634 415505 415165 414520 413463 412421 411575 410863
51826 410863 410449 410579 410947 410672 409202 406956 404749 402818 400815 398689 397042 396463 396915 398040 399825 402649
51810 402649 406721 411702 416792 421072 423894 425179 425341 424751 423319 420658 416568 411309 405526 400096 395846
51795 395846 393112 391486 390116 388249 385543 382123 378604 375898 374640 374772 375862 377689 380181 382834
51781 382834 384690 385108 384311 382985 381575 380207 379079 378578 378982 380247 382166 384649 387854 392100 397632
51766 397632 404378 411849 419287 425968 431489 435825 439032 440814 440482 437523 432174 425223 417298 408675
$$ packed form
51868E01235O281N880N361M480L345K540K652L765N372O740P264O618M762K021
51854E68316j003l787o264q633j0746j1922j1691j0511r374q808q572q303p946
51841D60756p440o590n563n051n407n833n114l124j129l40o45j057j042q46p12
51826D10863m14J30L68k75j470k246k207j931k003k126j647n79M52J125J785K824
51810D02649M072M981N090M280K822J285J62n90j432k661m090n259n783n430m250
51795C95846k734j626j370j867k706l420l519k706j258J32J090J827K492K653
51781C82834J856M18p97j326j410j368j128n01M04J265J919K483L205M246N532
51766C97632O746P471P438O681N521M336L207J782l32k959n349o951p925q623
$$ plain form
51752 408675 399860 391889 385667 381147 377584 374540 372250 370969 370450 370456 371494 374604 380365 388364 397676
51737 397676 407611 417834 428052 437789 446490 453682 459179 463340 467138 471713 477524 483815 488908 491179
51723 491179 489978 485844 479864 472859 465220 457469 450657 445848 443150 441410 438997 434934 429429 423533
51709 423533 418305 414192 411190 409567 410152 413551 419163 425311 430415 433815 435563 435947 435453 434842 434892 436161
51693 436161 439053 443689 449434 454807 458220 458727 456030 450281 442350 433863 426297 419968 414340 409201
51679 409201 405027 402324 401265 402042 404905 409624 415482 422140 430023 439459 449844 460152 469935 479244
51665 479244 487628 493768 496288 494739 489805 482803 475062 467585 461069 456028 452627 450370 448245 445413
51651 445413 441585 436719 430727 423857 417006 411131 406305 401712 396488 390269 383094 375347 367861 361535
$$ packed form
51752D08675q815p971o222m520l563l044k290j281n19OJ038L110N761P999R312
51737C97676R935J0223J0218R737Q701P192N497M161L798M575N811O291N093K271
51723D91179j201m134n980p005p639p751o812m809k698j740k413m063n505n896
51709D23533n228m113l002j623N85L399N612O148N104L400J748L84m94o11N0J269
51693D36161K892M636N745N373L413N07k697n749p931q487p566o329n628n139
51679D09201m174k703j059P77K863M719N858O658P883R436J0385J0308R783R309
51665D79244Q384O140K520j549m934p002p741p477o516n041l401k257k125k832
51651D45413l828m866n992o870o851n875m826m593n224o219p175p747p486o326
$$ plain form
51637 361535 356595 352498 348685 345099 341903 339204 337271 336492 336663 336735 335846 334337 333121 332257 330919 328840
51621 328840 326993 326424 327007 327871 328644 329598 330741 331484 331432 331047 331244 332521 334665 337091 339247 340881 342231
51604 342231 343996 346934 351394 357248 364201 371945 380033 387815 394682 400276 404370 406637 406798 405017
51590 405017 402021 398786 396175 394828 395160 397233 400733 405211 410389 416203 422707 430115 438875 449454
51576 449454 462005 476343 492163 509052 526384 543608 560778 578504 597122 616111 634557
51565 634557 651985 668594 685024 702478 722962 748702 780872 818939 861254 905876 950536
51554 950536 992171 1027150 1052394 1066421 1069418 1062487 1046789 1023182 992452 955764 914918 872102
51542 872102 829174 786995 745488 704616 665351 629397 597832 570259 545578 523339 503936
$$ packed form
51637C61535m940m097l813l586l196k699j933p79J71P2q89j509j216q64j338k079
51621C28840j847n69N83Q64P73R54J143P43n2l85J97J277K144K426K156J634J350
51604C42231J765K938M460N854O953P744Q088P782O867N594M094K267J61j781
51590D05017k996l235k611j347L32K073L500M478N178N814O504P408Q760J0579
51576D49454J2551J4338J5820J6889J7332J7224J7170J7726J8618J8989J8446
51565F34557J7428J6609J6430J7454K0484K5740L2170L8067M2315M4622M4660
51554I50536M1635L4979K5244J4027K997o931j5698k3607l0730l6688m0846m2816
51542H72102m2928m2179m1507m0872l9265l5954l1565k7573k4681k2239j9403
$$ plain form
51531 503936 487636 473974 462243 452107 443490 436163 429737 423920 418592 413764 409608 406322 403757
51518 403757 401335 398561 395488 392469 389635 386915 384435 382562 381408 380558 379396 377609 375323 372831
51504 372831 370308 367802 365443 363530 362304 361658 361238 360823 360470 360299 360362 360766 361643 362866 363998 364735 365153
51487 365153 365327 364966 363812 362171 360655 359396 357905 355719 352845 349488 345772 342007 338847 336748 335303
51472 335303 333530 330977 328259 326320 325344 324765 324216 323958 324204 324570 324750 325419 327722 331817 336583 340975
51456 340975 345011 349154 353335 357232 361030 365194 369643 373797 377413 380920 384998 390293 397414 406591
51442 406591 417158 427841 437569 445662 451381 454097 454204 453266 452819 453271 454019 454073 452230 447282 438803
51427 438803 427734 415823 404568 394866 387241 381842 378272 375891 374356 373603 373381 373182 372667 371858 370850
$$ packed form
51531E03936j6300j3662j1731j0136q617p327o426n817n328m828m156l286k565
51518D03757k422k774l073l019k834k720k480j873j154q50j162j787k286k492
51504C72831k523k506k359j913j226o46m20m15l53j71O3M04Q77J223J132P37M18
51487C65153J74l61j154j641j516j259j491k186k874l357l716l765l160k099j445
51472C35303j773k553k718j939r76n79n49k58K46L66J80O69K303M095M766M392
51456C40975M036M143M181L897L798M164M449M154L616L507M078N295P121R177
51442D06591J0567J0683R728Q093N719K716J07r38m47M52P48N4j843m948q479
51427D38803j1069j1911j1255r702p625n399l570k381j535p53k22j99n15q09j008
$$ plain form
51412 370850 369658 368452 367689 367765 368615 369787 370936 372160 373861 376264 379118 381894 384239 386093 387420
51397 387420 388154 388573 389478 391660 395307 400196 406378 414295 424225 436004 449468 464919 483019 504462
51383 504462 529977 560348 596053 636914 682349 731984 785615 842350 899902 954953 1004346
51372 1004346 1046112 1079621 1104893 1121697 1129142 1126156 1112329 1088241 1055036 1014015 966780 915420
51360 915420 862150 808753 756611 707124 661646 620906 584849 553168 525765 502590 483363
51349 483363 467591 454577 443311 432711 422298 412335 403037 393950 384462 374744 365781 358531 353215
51336 353215 349221 345436 340946 335830 331164 327950 326178 325208 324698 324662 324892 324971 324791 324535 324231 323838 323679
51319 323679 324176 325182 326222 327311 328791 330334 330954 330253 328902 327642 326569 325695 325338 325491 325603 325585
$$ packed form
51412C70850j192j206p63P6Q50J172J149J224J701K403K854K776K345J854J327
51397C87420P34M19R05K182L647M889O182P917R930J1779J3464J5451J8100K1443
51383E04462K5515L0371L5705M0861M5435M9635N3631N6735N7552N5051M9393
51372A004346M1766L3509K5272J6804P445k986j3827k4088l3205m1021m7235n1360
51360I15420n3270n3397n2142m9487m5478m0740l6057l1681k7403k3175j9227
51349D83363j5772j3014j1266j0600j0413r963r298r087r488r718q963p250n316
51336C53215l994l785m490n116m666l214j772r70n10l6K30P9j80k56l04l93j59
51319C23679M97J006J040J089J480J543O20p01j351j260j073q74l57J53J12j8
$$ plain form
51303 325585 326298 328261 330595 332070 332678 333194 333611 333112 331440 329228 326894 324174 320981 317952 315790
51288 315790 314667 314508 315308 316835 318545 320121 321819 323979 326440 328669 330289 331373 332367 333690 335198
51273 335198 336144 336060 335601 336101 338288 341879 346386 351651 357412 362919 367370 370397 371905 371900 370725 368990
51257 368990 366845 363681 358966 353108 347102 341599 336739 332648 329549 327387 325824 324652 323876 323428 323064
51242 323064 322625 322105 321434 320452 319185 317918 316930 316277 315861 315503 314902 313753 312048 310229 308921 308579 309349
51225 309349 311075 313320 315555 317519 319420 321583 323959 326137 327911 329573 331414 333109 333962 333778 333172
51210 333172 332862 332996 333448 334438 336381 339226 342403 345504 348614 351832 354810 356980 358031 358026 357293 356378
51194 356378 355781 355482 354886 353554 351795 350328 349523 349272 349461 350141 351230 352437 353614 354922 356484 358093
$$ packed form
51303C25585P13J963K334J475O08N16M17m99j672k212k334k720l193l029k162
51288C15790j123j59Q00J527J710J576J698K160K461K229J620J084R94J323J508
51273C35198R46q4m59N00K187L591M507N265N761N507M451L027J508nj175j735
51257C68990k145l164m715n858o006n503m860m091l099k162j563j172p76m48l64
51242C23064m39n20o71r82j267j267r88o53m16l58o01j149j705j819j308l42P70
51225C09349J726K245K235J964J901K163K376K178J774J662J841J695Q53j84o06
51210C33172l10J34M52R90J943K845L177L101L110L218K978K170J051np33r15
51194C56378n97k99n96j332j759j467q05k51J89O80J089J207J177J308J562J609
$$ plain form
51178 358093 359393 360179 360365 359817 358502 356720 355032 353896 353458 353600 354080 354658 355286 356190 357627 359581
51162 359581 361814 364147 366399 367993 368002 365918 362220 357922 353654 349501 345550 342128 339427 337310 335643
51147 335643 334451 333610 332794 331998 331716 332250 333163 333814 334173 334660 335400 336156 336872 337758 338894 340188 341699
51130 341699 343520 345410 347092 348856 351222 353979 356297 357900 359316 360706 361360 360972 360549 361172 362432
51115 362432 363133 363249 364123 366704 370537 374661 378597 382142 385000 387221 389463 392186 394829 396326 396310
51100 396310 395444 394658 394401 394561 394736 394582 394150 393950 394488 395715 397119 398380 399737 401570 403750 405621
51084 405621 406694 407207 407860 409089 410810 412842 415200 417773 420006 421386 422178 423267 425153 427404 429283
51069 429283 430600 431877 433927 437430 442637 449183 456372 463895 472114 481364 491041 499682 506031 509878
$$ packed form
51178C58093J300P86J86n48j315j782j688j136m38J42M80N78O28R04J437J954
51162C59581K233K333K252J594Rk084l698m298m268m153l951l422k701k117j667
51147C35643j192q41q16p96k82N34R13O51L59M87P40P56P16Q86J136J294J511
51130C41699J821J890J682J764K366K757K318J603J416J390O54l88m23O23J260
51115C62432P01J16Q74K581L833M124L936L545K858K221K242K723K643J497j6
51100C96310q66p86k57J60J75j54m32k00N38J227J404J261J357J833K180J871
51084D05621J073N13O53J229J721K032K358K573K233J380P92J089J886K251J879
51069D29283J317J277K050L503N207O546P189P523Q219R250R677Q641O349L847
$$ plain form
51055 509878 512033 513805 516540 521222 528071 536452 545286 553748 561735 569793 578567 588140 597766 606255
51041 606255 612753 617282 620589 623431 625886 627237 626446 622652 615308 604229 589851 573325 555912
51028 555912 538261 520656 503960 489691 478798 470800 464572 459656 456299 454549 454034 454597 456453
51015 456453 459595 463613 468197 473285 478577 483566 488390 494099 501560 510389 519407 527846 535770 543552
51001 543552 551442 559518 567766 576309 585682 596543 608859 621853 635153 649490 665639 683137
50989 683137 700899 718864 738002 758602 779508 799285 817369 833741 848332 861353 873608
50978 873608 885869 898294 910978 924640 940214 957993 977742 999443 1023501 1050477 1081157
50967 1081157 1116654 1157790 1204339 1255360 1310195 1368646 1430274 1494249 1560019 1627502 1696141
$$ packed form
51055E09878K155J772K735M682O849Q381Q834Q462P987Q058Q774R573R626Q489
51041F06255O498M529L307K842K455J351p91l794p344j1079j4378j6526j7413
51028E55912j7651j7605j6696j4269j0893p998o228m916l357j750n15N63J856
51015D56453L142M018M584N088N292M989M824N709P461Q829R018Q439P924P782
51001E43552P890Q076Q248Q543R373J0861J2316J2994J3300J4337J6149J7498
50989F83137J7762J7965J9138K0600K0906J9777J8084J6372J4591J3021J2255
50978H73608J2261J2425J2684J3662J5574J7779J9749K1701K4058K6976L0680
50967A081157L5497M1136M6549N1021N4835N8451O1628O3975O5770O7483O8639
$$ plain form
50956 1696141 1764187 1829348 1890072 1945878 1996574 2041609 2080422 2113239 2141215 2165636 2187094
50945 2187094 2205556 2220975 2233351 2242167 2246380 2245440 2240069 2231727 2221577 2210330 2198612 2186650
50933 2186650 2173538 2157511 2137227 2112468 2083460 2050049 2011812 1968606 1920652 1868261 1811815
50922 1811815 1751954 1689592 1625722 1561299 1497246 1434588 1374522 1318168 1266024 1217817 1173154
50911 1173154 1132217 1095501 1062883 1033416 1006143 980871 958002 937871 920297 904635 890297
50900 890297 877400 866701 858524 851883 845224 837993 830919 824811 819800 815870 813196 811508 809889 807879
50886 807879 806263 806108 807438 809546 812193 815662 819843 824169 828504 833388 839301 846333 854716 865033
50872 865033 877557 891820 907137 923268 940340 958475 977740 998319 1020534 1044866 1072012
$$ packed form
50956A696141O8046O5161O0724N5806N0696M5035L8813L2817K7976K4421K1458
50945B187094J8462J5419J2376Q816M213r40n371q342j0150j1247j1718j1962
50933B186650j3112j6027k0284k4759k9008l3411l8237m3206m7954n2391n6446
50922A811815n9861o2362o3870o4423o4053o2658o0066n6354n2144m8207m4663
50911A173154m0937l6716l2618k9467k7273k5272k2869k0131j7574j5662j4338
50900H90297j2897j0699q177o641o659p231p074o108n011l930k674j688j619k010
50886H07879j616j55J330K108K647L469M181M326M335M884N913P032Q383J0317
50872H65033J2524J4263J5317J6131J7072J8135J9265K0579K2215K4332K7146
$$ plain form
50861 1072012 1102702 1137377 1176283 1219920 1269107 1324482 1386250 1454638 1530342 1614324 1707293
50850 1707293 1809538 1921055 2041627 2170908 2308521 2453888 2605800 2762354 2921503
50841 2921503 3081468 3240326 3395283 3542585 3678196 3798498 3900644 3982814 4044572 4086951
50831 4086951 4112068 4122439 4120530 4108806 4090133 4067968 4046012 4027549 4015093 4010360 4014035 4025222
50819 4025222 4041280 4058582 4073517 4082671 4082361 4068713 4038670 3990832 3925117 3841847 3741540 3625525
50807 3625525 3496192 3356364 3208701 3056044 2902036 2750787 2605753 2469216 2342924
50798 2342924 2228733 2128218 2041872 1969160 1909345 1861860 1825861 1799855 1782184 1771755 1768028
50787 1768028 1770259 1776941 1785979 1795270 1803138 1808506 1810944 1810539 1807493 1801709 1792808 1780596 1765399 1747793
$$ packed form
50861A072012L0690L4675L8906M3637M9187N5375O1768O8388P5704Q3982R2969
50850A707293J02245J11517J20572J29281J37613J45367J51912J56554J59149
50841B921503J59965J58858J54957J47302J35611J20302J02146Q2170O1758M2379
50831D086951K5117J0371j909j1724j8673k2165k1956j8463j2456m733L675J1187
50819D025222J6058J7302J4935R154l10j3648l0043m7838o5715q3270j00307j16015
50807C625525j29333j39828j47663j52657j54008j51249j45034j36537j26292
50798B342924j14191j00515q6346p2712n9815m7485l5999k6006j7671j0429l727
50787A768028K231O682R038R291P868N368K438m05l046n784q901j2212j5197j7606
$$ plain form
50773 1747793 1728028 1705820 1680643 1652116 1620188 1585156 1547557 1507895 1466441 1423396 1379342
50762 1379342 1335420 1293034 1253407 1217298 1184883 1155869 1129967 1107338 1088439 1073397 1061805
50751 1061805 1053134 1047090 1043519 1042385 1044058 1049246 1058284 1070819 1086504 1105724 1129182 1157014 1188876
50738 1188876 1224771 1265230 1310688 1361246 1417162 1479006 1547011 1620580 1698654 1780319 1864891
50727 1864891 1951733 2040205 2129595 2218922 2306969 2392497 2474034 2549254 2614988 2668271 2707300
50716 2707300 2731369 2740450 2735454 2718656 2693212 2662122 2627985 2593712 2562817 2538478 2522313 2514145
50704 2514145 2512815 2517071 2525807 2537738 2551000 2563040 2570920 2571719 2562820 2542059 2508071 2460760 2401542
50691 2401542 2332989 2258082 2179639 2100227 2022336 1948355 1880328 1819827 1768111 1726227 1694823
$$ packed form
50773A747793j9765k2208k5177k8527l1928l5032l7599l9662m1454m3045m4054
50762A379342m3922m2386l9627l6109l2415k9014k5902k2629j8899j5042j1592
50751A061805q671o044l571j134J673N188R038J2535J5685J9220K3458K7832L1862
50738A188876L5895M0459M5458N0558N5916O1844O8005P3569P8074Q1665Q4572
50727A864891Q6842Q8472Q9390Q9327Q8047Q5528Q1537P5220O5734N3283L9029
50716B707300K4069R081m996j6798k5444l1090l4137l4273l0895k4339j6165q168
50704B514145j330M256Q736J1931J3262J2040P880P99q899k0761l3988m7311n9218
50691B401542o8553p4907p8443p9412p7891p3981o8027o0501n1716m1884l1404
$$ plain form
50680 1694823 1674037 1663818 1664326 1675795 1698078 1730645 1773048 1824968 1885564 1952971 2024604 2097760
50668 2097760 2169790 2238122 2300669 2356319 2404815 2446195 2480581 2508408 2530442 2547448 2559958
50657 2559958 2568376 2572946 2573515 2569607 2560960 2547900 2531093 2511165 2488798 2465054 2441351 2419164
50645 2419164 2399953 2385242 2376381 2374045 2378114 2388200 2404143 2425937 2453312 2485526 2521471 2559858
50633 2559858 2599469 2639548 2679994 2720948 2761925 2800977 2834136 2855362 2857638 2835490 2787744
50622 2787744 2718412 2635007 2545791 2457874 2376549 2305182 2245371 2197494 2161300 2136070 2120549
50611 2120549 2113138 2112275 2116550 2124583 2134955 2146086 2155904 2161848 2161640 2153973 2138043 2112654 2076589
50598 2076589 2030090 1975274 1914723 1850143 1782741 1714204 1646516 1581048 1518513 1459650 1405253
$$ packed form
50680A694823k0786j0219N08J1469K2283L2567M2403N1920O0596O7407P1633P3156
50668B097760P2030O8332O2547N5650M8496M1380L4386K7827K2034J7006J2510
50657B559958Q418M570N69l908q647j3060j6807j9928k2367k3744k3703k2187
50645B419164j9211j4711q861k336M069J0086J5943K1794K7375L2214L5945L8387
50633B559858L9611M0079M0446M0954M0977L9052L3159K1226K276k2148m7746
50622B787744o9332q3405q9216q7917q1325p1367n9811m7877l6194k5230j5521
50611B120549p411q63M275Q033J0372J1131R818N944k08p667j5930k5389l6065
50598B076589m6499n4816o0551o4580o7402o8537o7688o5468o2535n8863n4397
$$ plain form
50587 1405253 1355487 1309828 1267905 1229992 1196591 1167971 1144132 1124739 1108914 1095685 1084952
50576 1084952 1077555 1074040 1073772 1075656 1079330 1085106 1092993 1102397 1112730 1123801 1135656 1148548 1163120
50563 1163120 1180158 1200016 1222666 1248399 1278043 1312375 1351733 1396358 1446658 1502700 1563703
50552 1563703 1628290 1694891 1761692 1826680 1888322 1946025 1999497 2048067 2091421 2130881 2169107
50541 2169107 2208194 2248608 2290122 2333133 2378631 2427376 2479569 2534977 2593011 2653132 2715795
50530 2715795 2782781 2856001 2936039 3022312 3114421 3212529 3316264 3423862 3532771 3640623
50520 3640623 3745243 3844025 3933844 4011697 4075214 4122591 4152221 4162544 4152302 4121072 4069577
50509 4069577 3999427 3912589 3811279 3698374 3577624 3453243 3329396 3210138 3099529 3001255
$$ packed form
50587A405253m9766m5659m1923l7913l3401k8620k3839j9393j5825j3229j0733
50576A084952p397l515k68J884L674N776P887R404J0333J1071J1855J2892J4572
50563A163120J7038J9858K2650K5733K9644L4332L9358M4625N0300N6042O1003
50552A563703O4587O6601O6801O4988O1642N7703N3472M8570M3354L9460L8226
50541B169107L9087M0414M1514M3011M5498M8745N2193N5408N8034O0121O2663
50530B715795O6986P3220Q0038Q6273R2109R8108J03735J07598J08909J07852
50520C640623J04620R8782Q9819P7853O3517M7377K9630J0323j0242l1230n1495
50509D069577p0150q6838j01310j12905j20750j24381j23847j19258j10609r8274
$$ plain form
50499 3001255 2917917 2850809 2800541 2767723 2752874 2755655 2774374 2806281 2848103 2896129 2945920
50488 2945920 2992351 3030164 3054528 3061290 3047292 3010976 2952856 2875362 2782201 2677577 2565484
50477 2565484 2449278 2331841 2215981 2104246 1998128 1897796 1802951 1713716 1630532 1553614
50467 1553614 1482958 1418528 1359927 1306214 1256699 1211744 1172135 1137794 1107831 1081712 1059455
50456 1059455 1040604 1024041 1009185 996560 986693 979213 973516 969558 967266 965865 964680 964176 965316
50443 965316 968129 971702 975415 979359 983653 988194 993123 998862 1005650 1013718 1023908 1037326 1054169
50430 1054169 1073564 1094809 1118135 1143919 1171771 1200855 1230704 1261364 1293129 1326480 1361964
50419 1361964 1399764 1439706 1481898 1527030 1575814 1628548 1685579 1747549 1814539 1885186 1957285
$$ packed form
50499C001255q3338o7108n0268l2818j4849K781J8719L1907M1822M8026M9791
50488B945920M6431L7813K4364O762j3998l6316n8120p7494r3161j04624j12093
50477B565484j16206j17437j15860j11735j06118j00332r4845q9235q3184p6918
50467A553614p0656o4430n8601n3713m9515m4955l9609l4341k9963k6119k2257
50456A059455j8851j6563j4856j2625r867p480n697l958k292j401j185n04J140
50443I65316K813L573L713L944M294M541M929N739O788Q068J0190J3418J6843
50430A054169J9395K1245K3326K5784K7852K9084K9849L0660L1765L3351L5484
50419A361964L7800L9942M2192M5132M8784N2734N7031O1970O6990P0647P2099
$$ plain form
50408 1957285 2029213 2100335 2170203 2237868 2301952 2360945 2413481 2458764 2496691 2527077 2548657
50397 2548657 2559256 2556943 2540794 2510747 2467435 2412255 2347060 2273617 2193819 2110498 2027211
50386 2027211 1946830 1870924 1800943 1739227 1687992 1647689 1617326 1596232 1584614 1582283 1587817 1599346
50374 1599346 1615511 1635114 1656270 1676343 1692414 1701567 1701301 1690401 1669285 1639138 1600966 1555907
50362 1555907 1506053 1454018 1401541 1349101 1297005 1246223 1197827 1152200 1109273 1069225 1032418
50351 1032418 998832 968113 940251 915829 895405 878810 865178 853602 843718 835709 829768 825560
50339 825560 822259 819177 816241 813773 811929 810575 809657 809356 809639 809842 809048 806995 804399 802214 800765
50324 800765 799802 799256 799469 800637 802484 804741 807616 811446 816139 821374 827186 833951 841931 851258 862271
$$ packed form
50408A957285P1928P1122O9868O7665O4084N8993N2536M5283L7927L0386K1580
50397B548657J0599k313j6149l0047m3312n5180o5195p3443p9798q3321q3287
50386B027211q0381p5906o9981o1716n1235m0303l0363k1094j1618k331N534J1529
50374A599346J6165J9603K1156K0073J6071R153k66j0900k1116l0147l8172m5059
50362A555907m9854n2035n2477n2440n2096n0782m8396m5627m2927m0048l6807
50351A032418l3586l0719k7862k4422k0424j6595j3632j1576r884q009n941m208
50339H25560l301l082k936k468j844j354r18l01K83K03p94k053k596k185j449
50324H00765r63n46K13J168J847K257K875L830M693N235N812O765P980R327J1013
$$ plain form
50309 862271 875301 890144 906186 923113 940906 959120 976849 993757 1010487 1027576 1044468
50298 1044468 1060218 1074826 1089260 1104313 1120047 1136169 1152329 1167945 1182279 1194827 1205273
50287 1205273 1212925 1216550 1214882 1207139 1193195 1173809 1150890 1127128 1104933 1085670 1069805 1057456
50275 1057456 1048465 1042058 1036640 1030161 1021011 1008966 995356 982060 970153 959574 950033 941891 935971
50262 935971 932739 931998 933332 936544 941508 947795 954726 961811 968913 975842 982090 987311 991904 996634
50248 996634 1001565 1005752 1008159 1008503 1007060 1004142 1000117 995515 990552 984723 977316 968210 957802 946381
50234 946381 934010 920842 907101 892955 878948 866296 855983 847564 839633 831578 824200 818480
50222 818480 814568 812357 812234 814568 819029 825151 833309 844431 858891 876309 896474 919948 947648
$$ packed form
50309H62271J3030J4843J6042J6927J7793J8214J7729J6908J6730J7089J6892
50298A044468J5750J4608J4434J5053J5734J6122J6160J5616J4334J2548J0446
50287A205273P652L625j668p743j3944j9386k2919k3762k2195j9263j5865j2349
50275A057456q991o407n418o479r150j2045j3610j3296j1907j0579r541q142n920
50262I35971l232p41J334L212M964O287O931P085P102O929O248N221M593M730
50248I96634M931M187K407L44j443k918m025m602m963n829p407r106j0408j1421
50234I46381j2371j3168j3741j4146j4007j2652j0313q419p931q055p378n720
50222H18480l912k211j23K334M461O122Q158J1122J4460J7418K0165K3474K7700
$$ plain form
50209 947648 980220 1017929 1060903 1109302 1163391 1223475 1289578 1361054 1436454 1513633 1589949
50198 1589949 1662541 1728869 1787332 1837682 1881031 1919408 1954815 1988360 2020082 2049462 2075609
50187 2075609 2096647 2109171 2108874 2092133 2057276 2004750 1936538 1855641 1765815 1671237 1575868 1482929
50175 1482929 1394996 1314460 1243396 1182693 1131698 1089201 1054646 1027942 1008195 993274 980670
50164 980670 968266 954340 937731 918643 898775 880058 863431 849111 837546 829338 824303 821275
50152 821275 819038 817141 815658 814417 812716 809807 805626 800838 796020 790949 785068 778572 772520 767747
50138 767747 764284 762134 762002 764699 770191 777743 786630 796245 805893 815219 824583 834283 843552 851100
50124 851100 856664 861271 865870 870421 874573 878529 882801 887574 892776 898544 905215 912999 921900 931842
$$ packed form
50209I47648L2572L7709M2974M8399N4089O0084O6103P1476P5400P7179P6316
50198A589949P2592O6328N8463N0350M3349L8377L5407L3545L1722K9380K6147
50187B075609K1038J2524k97j6741l4857n2526o8212q0897q9826r4578r5369r2939
50175A482929q7933q0536p1064o0703n0995m2497l4555k6704j9747j4921j2604
50164I80670j2404j3926j6609j9088j9868j8717j6627j4320j1565q208n035l028
50152H21275k237j897j483j241j701k909m181m788m818n071n881o496o052m773
50138G67747l463k150j32K697N492P552Q887R615R648R326R364R700R269P548
50124H51100N564M607M599M551M152L956M272M773N202N768O671P784Q901R942
$$ plain form
50110 931842 942801 955018 969146 985852 1005114 1026134 1048170 1071230 1095901 1122867 1152881
50099 1152881 1186831 1225261 1267793 1313439 1361730 1413522 1470577 1534437 1605817 1685083 1772986
50088 1772986 1870571 1978331 2095751 2221611 2354035 2489855 2624573 2753890 2875379 2988353
50078 2988353 3092580 3188105 3276269 3359772 3441039 3520765 3597864 3669647 3731365 3776478 3798664
50067 3798664 3793947 3760878 3699529 3611315 3499681 3369890 3227656 3078052 2925442 2773620
50057 2773620 2625620 2483720 2349805 2225459 2111587 2008342 1915664 1833618 1762002 1699798
50047 1699798 1645360 1597122 1554029 1515308 1480051 1447085 1415338 1384323 1354217 1325428 1298088
50036 1298088 1272036 1247215 1223905 1202497 1183056 1165154 1148172 1131818 1116242 1101530 1087142
$$ packed form
50110I31842J0959J2217J4128J6706J9262K1020K2036K3060K4671K6966L0014
50099A152881L3950L8430M2532M5646M8291N1792N7055O3860P1380P9266Q7903
50088A772986R7585J07760J17420J25860J32424J35820J34718J29317J21489J12974
50078B988353J04227R5525Q8164Q3503Q1267P9726P7099P1783O1718M5113K2186
50067C798664m717l3069o1349q8214j11634j29791j42234j49604j52610j51822
50057B773620j48000j41900j33915j24346j13872j03245r2678q2046p1616o2204
50047A699798n4438m8238m3093l8721l5257l2966l1747l1015l0106k8789k7340
50036A298088k6052k4821k3310k1408j9441j7902j6982j6354j5576j4712j4388
$$ plain form
50025 1087142 1072184 1056325 1040145 1024411 1009296 994579 980320 966850 954205 942072 930393
50014 930393 919604 910079 901677 894009 886880 880213 873802 867480 861439 856113 851774 848495 846545 846529
50000 846529 849025 854166 861610 870777 881004 891585 901831 911143 919006 924967 928821 930930 932237
49987 932237 933763 935893 938113 939453 939299 937856 936015 934819 935058 937214 941657 948749 958869 972558
49973 972558 990730 1014602 1045189 1082916 1127828 1180092 1240004 1307521 1381993 1462383 1547329
49962 1547329 1634736 1721574 1804562 1881305 1950892 2013760 2071286 2125360 2177784 2229678 2281306
49951 2281306 2332104 2380207 2421702 2450787 2461387 2449093 2411967 2350280 2266360 2164739 2051659
49940 2051659 1933484 1815172 1699999 1590155 1486975 1390699 1300745 1216683 1138890 1068143
$$ packed form
50025A087142j4958j5859j6180j5734j5115j4717j4259j3470j2645j2133j1679
50014I30393j0789r525q402p668p129o667o411o322o041n326m339l279j950j6
50000H46529K496N141P444R167J0227J0581J0246R312P863N961L854K109J307
49987I32237J526K130K220J340j54j443j841j196K39K156M443P092J0120J3689
49973I72558J8172K3872L0587L7727M4912N2264N9912O7517P4472Q0390Q4946
49962A547329Q7407Q6838Q2988P6743O9587O2868N7526N4074N2424N1894N1628
49951B281306N0798M8103M1495K9085J0600j2294l7126o1687q3920j01621j13080
49940B051659j18175j18312j15173j09844j03180r6276q9954q4062p7793p0747
$$ plain form
49930 1068143 1004914 949242 900953 859522 823861 792774 765705 742759 723995 709032 697351
49919 697351 688530 681975 676794 672263 668177 664600 661501 658951 657336 657002 657748 659101 661059 664214 669068
49904 669068 675524 683172 691854 701727 712839 724726 736457 747047 755817 762350 766225 767096 765175
49891 765175 761415 756836 751613 744939 735770 723685 709184 693433 677616 662229 646880 630864
49879 630864 614011 596917 580529 565670 552914 542501 534234 527589 522096 517630 514345 512421 511897
49866 511897 512725 514949 518810 524488 531631 539311 546705 553791 561237 569677 579252 589687 600596 611764
49852 611764 623312 635399 647496 658216 666405 672339 677307 681903 685265 686192 684409 680357 674210
$$ packed form
49930A068143o3229n5672m8289m1431l5661l1087k7069k2946j8764j4963j1681
49919F97351q821o555n181m531m086l577l099k550j615l34P46J353J958L155M854
49904F69068O456P648Q682R873J1112J1887J1731J0590Q770O533L875Q71j921
49891G65175l760m579n223o674r169j2085j4501j5751j5817j5387j5349j6016
49879F30864j6853j7094j6388j4859j2756j0413q267o645n493m466l285j924n24
49866E11897Q28K224L861N678P143P680P394P086P446Q440R575J0435J0909J1168
49852F11764J1548J2087J2097J0720Q189N934M968M596L362R27j783m052o147
$$ [...]
##END NTUPLES=NMR SPECTRUM
##END=
