##TITLE=AC1470_13FE002652_8026926_Jl8XaGtRlM
##JCAMPDX= 6.0         $$ Bruker NMR JCAMP-DX V2.0
##DATA TYPE= NMR SPECTRUM
##DATA CLASS= NTUPLES
##ORIGIN= BRUKER
##OWNER= Administrator
$$ 1.72 TOPSPIN		Version 2.1
$$ 2013-07-11 20:35:19.921 -0700  Administrator@X
$$ Compression mode = diff/dup
##.OBSERVE FREQUENCY= 400.02188249412
##.OBSERVE NUCLEUS= ^1H
##.ACQUISITION MODE= SIMULTANEOUS (DQD)
##.ACQUISITION SCHEME= undefined
##.AVERAGES= 8
##.DIGITISER RES= 22
##SPECTROMETER/DATA SYSTEM= spect
##.PULSE SEQUENCE= zg30
##.SOLVENT NAME= COFFEE_meoh
##.SHIFT REFERENCE= INTERNAL, COFFEE_meoh, 1, 14.98509
##AUDIT TRAIL= $$ (NUMBER, WHEN, WHO, WHERE, PROCESS, VERSION, WHAT)
$$ ##TITLE= Audit trail, TOPSPIN		Version 2.1
$$ ##JCAMPDX= 5.01
$$ ##ORIGIN= Bruker BioSpin GmbH
$$ ##OWNER= Administrator
$$ $$ E:\/data/COFFEE/nmr/AC1470_13FE002652_8026926_Jl8XaGtRlM/10/pdata/1/auditp.txt
$$ ##AUDIT TRAIL=  $$ (NUMBER, WHEN, WHO, WHERE, PROCESS, VERSION, WHAT)
(   1,<2013-07-11 20:35:12.983 -0700>,<Administrator>,<X>,<go>,<TOPSPIN 2.1>,
      <created by zg
	started at 2013-07-11 20:34:06.796 -0700,
	POWCHK enabled, PULCHK disabled,
       configuration hash MD5:
       C8 4E 4E 5D D3 5C D8 9E 9F 52 82 E0 59 8A DE 15
       data hash MD5: 64K
       E8 70 18 1A 52 D8 0A 4B 3F C3 0C 81 E1 10 B7 E4>)
(   2,<2013-07-11 20:35:15.905 -0700>,<Administrator>,<X>,<proc1d>,<TOPSPIN 2.1>,
      <Start of raw data processing
       efp LB = 0 FT_mod = 6 PKNL = 1 PHC0 = 0 PHC1 = 0 SI = 32K 
       data hash MD5: 32K
       E1 66 04 ED 33 BD A4 1E 77 76 28 5D F9 B8 86 AA>)
(   3,<2013-07-11 20:35:16.280 -0700>,<Administrator>,<X>,<proc1d>,<TOPSPIN 2.1>,
      <pk PHC0 = 97.70142 PHC1 = 0 
       data hash MD5: 32K
       DD 0F BE FC BF B0 43 CC 14 CC AA D0 59 80 67 1D>)
(   4,<2013-07-11 20:35:16.390 -0700>,<Administrator>,<X>,<proc1d>,<TOPSPIN 2.1>,
      <abs ABSG = 1 
       data hash MD5: 32K
       D2 26 61 BF 63 76 2F 3B EF 4C 8B 37 AE 5D 57 D8>)
(   5,<2013-07-11 20:35:16.483 -0700>,<Administrator>,<X>,<proc1d>,<TOPSPIN 2.1>,
      <abs ABSG = 2 
       data hash MD5: 32K
       DF 14 A6 B2 17 21 E1 0E 35 97 B0 D5 97 F7 0B BD>)
(   6,<2013-07-11 20:35:16.562 -0700>,<Administrator>,<X>,<proc1d>,<TOPSPIN 2.1>,
      <abs ABSG = 3 
       data hash MD5: 32K
       A2 55 47 FA 53 8B 73 0F F6 4F E6 62 7A 69 93 D8>)
(   7,<2013-07-11 20:35:16.624 -0700>,<Administrator>,<X>,<proc1d>,<TOPSPIN 2.1>,
      <abs ABSG = 4 
       data hash MD5: 32K
       B1 20 49 D3 95 63 85 03 60 12 93 84 8F 7C D3 20>)
(   8,<2013-07-11 20:35:16.671 -0700>,<Administrator>,<X>,<proc1d>,<TOPSPIN 2.1>,
      <abs ABSG = 5 
       data hash MD5: 32K
       89 A6 0F 5D 1F 03 48 A1 E8 99 A5 25 2C A0 6C DB>)
$$ ##END=
$$ 
$$ $$ hash MD5
$$ $$ 8B AE 95 43 08 23 B2 2A 90 8B EB F2 99 1C 39 D1
##$RELAX= 
##$RELAX= 
##$RELAX= 
##$RELAX= 
##$RELAX= 
##$RELAX= 
##$RELAX= 
$$ Bruker specific parameters
$$ --------------------------
##$DU= <E:\>
##$EXPNO= 10
##$NAME= <AC1470_13FE002652_8026926_Jl8XaGtRlM>
$$ [...]
150 150 150 150 150 150 150 150
##$TP07= 0
##$TPNAME0= <>
##$TPNAME1= <>
##$TPNAME2= <>
##$TPNAME3= <>
##$TPNAME4= <>
##$TPNAME5= <>
##$TPNAME6= <>
##$TPNAME7= <>
##$TPOAL= (0..7)
0.5 0.5 0.5 0.5 0.5 0.5 0.5 0.5
##$TPOFFS= (0..7)
0 0 0 0 0 0 0 0
##$TUNHIN= 0
##$TUNHOUT= 0
##$TUNXOUT= 0
##$USERA1= <user>
##$USERA2= <user>
##$USERA3= <user>
##$USERA4= <user>
##$USERA5= <user>
##$V9= 5
##$VALIST= <valist>
##$VCLIST= <CCCCCCCCCCCCCCC>
##$VD= 0
##$VDLIST= <DDDDDDDDDDDDDDD>
##$VPLIST= <PPPPPPPPPPPPPPP>
##$VTLIST= <TTTTTTTTTTTTTTT>
##$WBST= 1024
##$WBSW= 4
##$XGAIN= (0..3)
0 0 0 0
##$XL= 0
##$YL= 0
##$YMAX_a= 652247
##$YMIN_a= -553938
##$ZGOPTNS= <>
##$ZL1= 120
##$ZL2= 120
##$ZL3= 120
##$ZL4= 120
##$ABSF1= 14.98509
##$ABSF2= -5.573092
##$ABSG= 5
##$ABSL= 3
##$ALPHA= 0
##$AQORDER= 0
##$ASSFAC= 0
##$ASSFACI= 0
##$ASSFACX= 0
##$ASSWID= 0
##$AUNMP= <proc_prof1d_extract_pilot.lims>
##$AXLEFT= 0
##$AXNAME= <>
##$AXNUC= <1H>
##$AXRIGHT= 0
##$AXTYPE= 0
##$AXUNIT= <>
##$AZFE= 0.1
##$AZFW= 0.1
##$BCFW= 0
##$BC_mod= 0
##$BYTORDP= 0
##$COROFFS= 0
##$CY= 15
##$DATMOD= 1
##$DC= 0
##$DFILT= <>
##$DTYPP= 0
##$F1P= 0
##$F2P= 0
##$FCOR= 0.5
##$FTSIZE= 32768
##$FT_mod= 6
##$GAMMA= 0
##$GB= 0
##$INTBC= 1
##$INTSCL= 1
##$ISEN= 128
##$LB= 0
##$LEV0= 0
##$LPBIN= 0
##$MAXI= 10000
##$MC2= 0
##$MEAN= 0
##$ME_mod= 0
##$MI= 0
##$NCOEF= 0
##$NC_proc= -8
##$NLEV= 6
##$NOISF1= 0
##$NOISF2= 0
##$NSP= 0
##$NTH_PI= 0
##$NZP= 0
##$OFFSET= 14.98509
##$PC= 1
##$PHC0= 97.70142
##$PHC1= 0
##$PH_mod= 1
##$PKNL= yes
##$PPARMOD= 0
##$PPDIAG= 0
##$PPIPTYP= 0
##$PPMPNUM= 2147483647
##$PPRESOL= 1
##$PSCAL= 4
##$PSIGN= 0
##$PYNMP= <proc.py>
##$REVERSE= no
##$SF= 400.02
##$SI= 32768
##$SIGF1= 0
##$SIGF2= 0
##$SINO= 400
##$SIOLD= 32768
##$SPECTYP= <>
##$SREGLST= <1H.CDCl3>
##$SSB= 0
##$STSI= 32768
##$STSR= 0
##$SW_p= 8223.68421052631
##$SYMM= 0
##$S_DEV= 0
##$TDeff= 65536
##$TDoff= 0
##$TI= <>
##$TILT= no
##$TM1= 0
##$TM2= 0
##$TOPLEV= 0
##$USERP1= <user>
##$USERP2= <user>
##$USERP3= <user>
##$USERP4= <user>
##$USERP5= <user>
##$WDW= 1
##$XDIM= 32768
##$YMAX_p= 443127578
##$YMIN_p= -740637
##$CURPLOT= <Network HP LaserJet P1505>
##$CURPRIN= <$Network HP LaserJet P1505>
##$DFORMAT= <normdp>
##$LAYOUT= <+/1D_H.xwp>
##$LFORMAT= <normlp>
##$PFORMAT= <normpl>
##$SURQMSG= 1
$$ End of Bruker specific parameters
$$ ---------------------------------
##NTUPLES= NMR SPECTRUM
##VAR_NAME=  FREQUENCY,     SPECTRUM/REAL,   SPECTRUM/IMAG
##SYMBOL=    X,             R,               I
##VAR_TYPE=  INDEPENDENT,   DEPENDENT,       DEPENDENT
##VAR_FORM=  AFFN,          ASDF,            ASDF
##VAR_DIM=   32768,         32768,           32768
##UNITS=     HZ,            ARBITRARY UNITS, ARBITRARY UNITS
##FACTOR=    0.250966925370066, 1,           1
##FIRST=     8223.43324360094, -192329,      -134867
##LAST=      0,             97887,           -229670
##MIN=       0,             -740637,         0
##MAX=       8223.43324360094, 443127578,    0
$$ Real data points
##PAGE= N=1
##DATA TABLE= (X++(R..R)), XYDATA
$$ [...]
23808 57605 -48171 -101966 128165 -12827 123930 -178529 189586 -5489 275336 -208499 274820
23796 -42181 119359 -139811 117059 159740 6346 -61817 -264909 -137484 128518 72459 -118441
23784 -257194 104721 -133320 301217 -104890 257568 27569 16635 -85522 -181105 14911
23773 49367 -222142 12233 97891 -182704 18919 384316 -173325 -184981 -46208 -67679 -191501
23762 -191501 -154356 78304 -61869 -192111 -72229 336646 -24094 -60497 151060 -130540 -68161
23751 -68161 366829 159391 145102 48317 6184 225009 -52556 -9161 -2545 125087 128655 163006
23739 163006 -162453 -434324 -128154 -319489 6443 -199995 -110579 -121551 122833 278919
23729 278919 1036 -49913 -195147 433799 81854 -296654 -66017 -132255 26140 107942 -19132
23717 -79388 -122457 -90154 98080 43165 -76194 124747 -128617 221003 -12180 -56291 -8800
23705 124854 -49469 -4879 -96336 -197006 -123635 99272 217702 249937 189260 232562 -113491
23693 -111881 2279 300862 49123 2055 38072 139929 26121 -166869 86178 219128 -132698
23681 -59749 -225526 33732 -269817 233078 178309 -25462 -166170 -111401 -120580 -139490 -65689
23669 244843 -89109 122966 63670 -124717 -206974 185357 -103216 -90214 -182136 115834
23658 271113 -216020 81543 -154146 -162495 109169 -3099 2470 -110588 45159 -8550 109612
23646 -197995 140203 -216365 174072 -2866 -59828 -229098 -252067 77695 96380 -63613 29580
23634 -722 49177 175680 -187185 329126 -40268 -260335 -175908 -166593 -176919 148502 -111132
23622 172861 -67654 37826 17988 -157234 76681 41423 97298 11876 504405 -28030 -324084
23611 -324084 -217774 82601 15818 -147754 326067 -110433 302527 -111377 151190 -157035
23600 -108516 -106115 136382 50979 -144279 -76574 -318147 -253384 3167 10098 101648 -201390
23588 132668 -53477 -411756 270509 130941 17917 391845 351845 175363 165292 260256
23578 260256 -287188 52914 -50042 88454 -70472 -81102 -86437 -93880 169910 132049 -151775
23566 -49384 -376821 -39317 -223624 -21929 -284211 -218411 97968 186862 -178113 324678 102033
23554 20337 340570 -55517 57683 -98794 -174140 -33349 -33741 -259379 -65332 -103941 -273444
23543 -273444 42846 -121694 -37090 5788 -93537 -340202 -40072 -428712 -56032 48187 -233894
23531 105952 164624 54637 12872 -193262 -229184 139514 -32934 113353 -326965 310695
23520 164674 240212 -128113 134339 -49513 -15282 23324 -203663 129423 199319 -16296 -48825
23509 -48825 -153523 142058 135447 -58866 -914 94438 63203 37400 20753 64406 -127756 81247
23496 151098 230399 -27119 -280329 -123401 -60540 -52403 30249 -370169 -216872 -12693 -188066
23485 -188066 -183999 -255854 -152830 52734 25046 132268 -1511 53846 -185760 -26736 102505
23473 40665 -305677 -116476 -176814 107881 2590 104709 312431 -213555 -40401 130183
23462 -15669 -71696 226211 89055 -71714 35562 -65852 77892 137435 -192588 -40441 58832
23450 -216732 117213 -100873 180700 -94926 144410 157333 -19774 -160454 -277381 -53599
23439 180179 133969 144579 -37353 197737 190049 7801 164902 -350960 38333 72540 -58896
23427 164566 -121437 -45870 -115333 -167636 -66750 -147579 -85040 199645 -15591 -120601 177115
23415 -128381 -61877 -153894 79928 55595 -99658 -255167 93059 210610 -89302 -30564 -33388
23404 -33388 -79037 -157554 17866 -347122 58493 100504 43228 131791 109628 26215 -276460
23392 -478331 -107263 -100951 -56744 -134439 377745 -292897 -11941 30910 55164 114631 -75900
23380 40512 -75025 -293465 -265863 -381905 283730 193842 95996 -109714 48050 9983 -3711
23368 164489 -64306 72988 93010 86677 161260 146817 -221156 365326 1501 -145185 120792
23356 77696 269060 140818 -29352 -22946 -78032 -178833 -39125 -66286 -82371 -180293 -18410
23344 -156955 -87948 381316 146751 304533 -43554 -278901 -172271 83572 221172 -136732
23333 -44449 30561 -140808 -118483 -21789 -318028 -244717 -166309 -183673 -136165 -200807 184279
23321 444227 -194856 41739 -266743 -200234 -126932 227090 15356 -150337 -239913 -196181 141231
23309 -176072 261754 215324 -303979 -326309 -14228 305481 67577 206622 -328758 299 76542
23298 76542 -151092 -399682 -79988 -91824 173777 -47929 -28403 -112300 176407 232416 -64498
23286 53370 -424157 -133833 131071 139198 -299960 133084 -203408 -166950 -184544 37028 104401
23275 104401 -20412 16148 447665 -179010 45659 155624 200044 112610 -72336 -59156 217365
23263 -20586 -68941 -108420 -30128 -50875 -175971 112375 -38593 133990 82145 26748 235946
23252 235946 161667 -101431 191315 105675 351213 84634 -26328 -89434 64106 322471 -166167
23240 18353 -18561 263090 421233 -190562 -124476 131684 370123 48785 -239304 228725
23229 -153761 121133 122293 123754 260208 56578 112015 203264 66211 -47923 -103175 -10112
23217 262112 -91152 -236707 265844 -95197 -119556 -19482 -214234 210798 -138310 -69253
23207 -69253 -208045 -184746 -61612 -361978 -96733 90239 -299485 41256 124453 -131958 160865
23195 393827 -22602 -188776 200246 72681 195355 -511 74365 81429 292515 -73491 178744
23183 103303 159931 -20790 -210074 158933 -21578 34001 -225494 -57693 61208 5992 185906
23172 185906 3732 -141254 3354 -272081 139101 -77045 138957 91730 -20216 -179370 -31744
23160 -150593 206446 -271633 -118480 31966 89111 -5898 -153555 313918 -106487 -3261 -40075
23149 -40075 -275919 -393669 -196451 -498814 -85203 -191553 145980 238793 -76615 -279589
23139 -279589 -67523 -187521 -216441 -152944 87147 -54111 45339 212911 -170045 -163291 -318000
23128 -318000 156026 -389762 194660 -85986 440159 14354 -61374 -346184 29196 -6469 -323262
23117 -323262 72366 -225019 -150460 -42621 -256734 93840 54876 131529 137392 836 -53454 -199444
23105 -199444 -75886 -217706 11846 46963 183451 -96848 -60275 192748 178019 -80095 166297
23093 167184 -222873 -187218 45848 -83342 82322 222408 50271 58002 -114158 184487 -178052
23081 -108885 -246697 73654 -322839 -241413 -86189 -2682 8179 -208293 79043 182665 -114219
23069 -295948 -44825 321401 -212898 -374460 -12823 -114161 39597 -319070 71326 -42471
23058 -2978 -316660 -20892 102869 -379802 -516423 18010 -201399 233688 -151457 49346
23047 159313 127998 294803 68549 -133060 152053 44703 53179 77808 -184485 38094 101671
23036 101671 -26990 -172200 -168597 -15241 -189496 8821 145241 -73833 -210100 -46813 -91337
23025 -91337 92481 95666 -59722 137915 170619 92111 267414 427620 178538 -41058 62560
23013 152051 224002 -305578 -40302 29080 211945 -113303 -143252 -80147 -301354 93565 -188689
23001 63482 -10790 -314960 42305 168911 -224226 -25897 239142 290745 -75053 262917 243747
22990 243747 -223363 -79113 -39961 57145 -109109 219511 -103984 -341655 -29425 -74137
22980 -74137 19568 273144 -90434 -178626 -36028 -15254 83863 17166 -147200 -221107 -104661
22968 133982 78994 -233337 86526 119370 -164948 -112926 -193301 -267528 123780 -15027 138344
22956 193607 -180868 252095 169060 -12709 -247528 -8888 -38469 156605 -162935 -263838
22946 -263838 -178395 58166 -16767 -34295 110181 193777 -58703 240940 -76928 239905 59262
22934 -109078 347005 -53136 206208 -170510 34309 216353 -275434 80549 -102906 -41734
22923 -178132 -279113 28075 -136122 -126420 -9369 -255828 155772 315919 -164878 -273859
22913 -273859 -274372 -266549 27923 -109714 -117824 -188969 -461486 -163821 -305543 29881 -175394
22901 52402 87694 -184397 140853 -288728 -148588 -239755 253647 -3282 69070 57356 401485
22890 401485 -224189 -306227 61151 143884 218375 79379 -256216 -325481 -186800 48950 51497
22879 51497 198738 139386 -30566 -35342 204403 10270 181186 82602 -230957 -356294 -86036
22867 -101590 213962 56274 -438365 -210039 331660 -165465 78406 231541 593 -131178
22856 70502 105835 61472 -49190 -140898 158595 -148700 -212608 204653 58015 -34967 217107
22844 -73092 175916 -20484 103865 -16351 -69766 9766 66801 -192129 -248984 149853 -154472
22832 -102352 -45159 227527 -318344 -258201 -8073 300349 -57341 -19522 9919 -434852 214380
22820 -137180 -241712 132895 -305326 41027 -69507 121876 355046 27283 -88717 -206413
22810 -206413 -100302 161018 -23641 -125853 -151978 -163371 86625 -21162 89298 -11875 -31745
22799 -31745 -111306 -71266 -145316 101658 -250223 -213528 -6143 -219319 -262516 -131983 118023
22787 -209083 -147816 -53493 -36391 5301 -132918 120225 -58677 -25775 152834 89007 73421
22776 73421 206368 -49456 -51412 256911 -384403 126567 -248272 -142221 -2467 327471 -271993
22764 268394 -224487 -52641 -2086 130982 -51716 -114552 -13865 194628 -145524 67953 -177065
22752 -55283 -33486 -359136 -105023 -263191 -80039 76093 -30305 203491 144294 -495977 167016
22740 133144 -18979 183834 156538 -115336 -61898 -7097 -287934 -226390 162495 177720 -4464
22728 143459 -17188 -313426 -240042 -109324 -255694 46062 -124836 -350767 -258699 18396
22717 -145284 283293 125576 -429586 -88845 83951 -198614 -152516 -106864 94430 -76690 -383386
22706 -383386 -229649 -130578 15553 200321 -32784 124195 165538 187684 -33951 136424 178899
22695 178899 -125846 124317 -203609 50148 -57182 -102171 -219970 -12145 -193261 -232573
22685 -232573 -193420 41026 -130823 17397 -169236 -449589 -131378 -41020 24236 103848 211618
22674 211618 390316 -150627 75730 67146 -241736 28938 -210702 64222 196454 -104216
22663 182237 123286 -223421 -110347 -197149 -184971 -16444 133162 459653 -204266 -34828
22652 -128504 -378024 -118931 36332 87766 40858 86290 191351 31290 -17680 55236 -244994
22640 49218 199823 -36569 16967 -102631 248857 -333 1380 -8694 34219 -160856 -199332 27437
22627 -222525 -212377 113544 -78134 -25865 -245730 -267010 106693 -93278 187376 326810
22617 326810 8939 75207 -192732 239856 177653 -126099 66595 116264 6411 148187 238419
22606 238419 123388 -132376 -177683 13426 51614 110627 -67625 -129309 -61390 -202396 -134617
22595 -134617 -41988 -3663 -187598 -77191 229240 30196 -77258 -75943 -267026 96472 -133412
22583 175010 88406 -172362 49489 -49492 -133452 279775 -195353 20504 27794 -134981 6044
22571 157660 -119775 326799 2503 -29486 -339960 -798 -259236 -56830 -126417 -51287 -313608
22560 -313608 -20969 167341 332102 -53345 -107470 80080 136817 263624 -98047 -158135 -3512
22548 -242111 4869 6174 -167961 13632 -172223 354879 -154118 258710 178449 -80604 -128758
22537 -128758 -83213 -338542 20241 105884 -78169 41239 -848 -71834 101866 -112136 -194454
22526 -194454 42811 -185798 24179 -116608 227242 91955 70029 -312083 230357 -149139
22515 -153864 -13724 -54077 115609 -57374 -165334 -262505 -203671 25403 189282 123876 -28280
22503 -22042 -133060 -123999 16263 149588 56408 -262338 85323 -192324 17425 -362556 -397390
22492 -397390 46381 -272623 -185383 -201155 -38082 -74221 -57136 -63040 -53074 -20074 -256225
22481 -256225 -329929 163042 -172442 -39455 -62207 55837 -145497 -269444 -89874 -237913
22471 -237913 66243 -15221 -300783 -313277 -249257 -104392 89037 137237 -198184 29690 -6032
22459 -195412 1142 101254 -14453 333343 -384079 -267851 -156288 218506 -229555 -127220
22449 -127220 -195651 -158351 -273478 17999 -243431 126208 1823 126577 97988 107578 42703
22437 98273 244708 -34825 -192453 -24790 -183920 36099 -14188 -186589 83755 45714 34841
22426 34841 -159715 -144414 191202 54977 -265274 257117 -84507 -462204 109296 71475
22416 71475 89713 -353806 127006 -197321 37212 208920 -15572 11484 136944 38705 -45588
22404 48685 -109960 -148325 -136419 -144703 -65239 -230822 56166 -90915 346846 56217 9615
22392 175335 -44572 24843 -28142 -279468 80003 -28232 322249 -406664 232236 -139102
22381 -1831 -238051 -102029 88458 233164 66314 55132 134096 -68111 28784 -348768 29731
22369 -146634 -114153 -241977 -198097 -248496 168650 -250483 -217056 -151829 99837 -33406 -31976
22358 -31976 61234 -347082 -162980 -206980 53972 -59648 118912 187657 201957 185679 -44110
22346 -419472 -130383 91829 3553 -180978 155160 164278 -91773 -63197 93955 -116499 114777
22334 -15096 -186198 -56132 -147373 189948 323072 76035 305386 -208346 81903 211551
22324 211551 4417 -200620 72207 199879 -37351 184618 -136250 93260 -31296 -113864 56193
22312 -655751 232094 -77394 239335 527839 -227449 102228 225740 -562859 51703 -11251
22301 123457 -269654 -83995 96944 192925 -216450 93930 -385365 -257631 202815 -315940
22290 -203242 -477386 -29283 -239645 146997 -16400 315532 -351398 92626 -99960 -16168
22279 -54898 37364 -385974 -135123 131112 36095 204340 281921 48545 47241 -49267 57383
22267 -186398 375653 -394766 167303 80456 -243773 119248 -153854 57832 -75188 -246546
22257 -246546 328120 -218252 -174937 92236 43955 -117584 11237 -216988 -66140 -170204
22247 -170204 -113522 -132916 229905 139458 -17720 146458 31222 7096 -162909 -130350 -51114
22235 67872 -123120 -31441 -37581 171923 -174106 46097 379171 -181151 -176115 113041 -160021
22223 690 -109917 -64801 -540300 -140215 -67193 31283 10716 -174709 -179447 -358249 149884
22211 -67594 61329 -180131 -122971 186776 91981 126604 118692 177546 -325895 19396 113737
22200 113737 114057 -251288 414522 128376 112695 48519 142588 383025 124254 37266 -210752
22188 -277530 16365 -257350 219439 -39341 -182036 147808 -447426 267710 -442992 -177126
22177 85318 -132883 225090 -24545 -64707 -37082 -18250 -32812 -226458 209120 -130010 -138027
22166 -138027 -241991 -296720 -110029 130284 -17954 122216 27298 -175386 -178440 -14155 225823
22154 -107785 -256666 15526 -298935 213138 -164224 78554 -117304 -152882 143574 -217917
22143 79051 -175230 -368335 -52119 -227230 -466806 180643 48642 56683 -145804 54154 15699
22131 -205037 229588 -35301 -281850 219 -171273 -327699 79483 62002 -131106 21610 2433
22119 -259604 101413 -66659 -6257 77220 -68863 198155 -57230 -95946 32747 80709 -40932
22107 181422 -153062 -115569 140505 -24833 -102384 -203929 -126863 109940 149827 100835 -336089
22095 210700 244463 -192939 352332 -23206 -254991 -264303 -77104 28504 -385951 190618 -207603
22083 -322203 39727 332266 -129492 -104887 -271340 44175 -49275 -162445 113238 -96751
22072 65107 95308 61967 -20169 -235053 56565 -36457 140059 -160161 -267316 676261 180918
22060 -242722 186681 -48536 -186562 -259245 64195 -2087 -175540 -142032 28395 85005 -53929
22048 -72027 24252 -205703 -57545 281305 35052 -191867 -133060 -23315 71596 98107 -93118
22036 67572 268881 -66619 -274709 -68222 211269 -115453 59884 119485 -143080 -52158 -449967
22025 -449967 -119990 -21164 159420 129872 131946 94014 -89352 -20946 222453 77127 -129723
22013 -110594 -127306 9787 109174 -114464 541 -88101 63537 -419011 -12387 23848 183954
22002 183954 -230592 -209147 10049 -94683 -121817 -94035 -47768 -174784 45792 131048 -10636
21990 -116644 -155796 -177621 -189170 265615 -83816 293097 148354 344880 14754 -288490
21979 -374978 62868 -27264 1329 11865 100572 -215747 -169125 121091 -312101 88904 107741
21968 107741 -375051 75497 -396024 -284973 140629 -14191 94375 81301 -86903 -1611 -96585
21957 -96585 -318781 93988 76388 -58152 123932 -277775 -104249 143551 -118741 426656
21946 373665 86625 10880 191107 -37260 -342677 -259916 -139525 -157015 -289737 -46646 -161353
21935 -161353 26017 -102173 -45227 -140129 -201988 150515 24150 -147753 258593 -237901
21924 131229 -349134 110252 -150637 87813 -191397 -63987 -4974 24832 -149662 -222854 110793
21912 -120990 -62850 -59515 -270658 2738 154049 -182531 52979 119087 -18906 97285 90188
21901 90188 16000 -70101 229504 -87884 249201 282878 484664 -46749 -128466 -166629 207715
21889 -112024 5047 -151279 178061 -333815 52217 -221 124919 267212 134035 -2300 18207
21877 -44142 9881 -240574 -78580 -210150 -113107 -82954 -5152 119128 -206025 80673 -105068
21865 11178 156890 -264166 197351 -44407 119837 20538 126506 -393361 -200240 -28650
21854 -424895 5654 21735 -43966 -238566 489284 33362 228242 -235246 63985 153204 54707
21842 -40483 12498 -130679 -134294 86676 -62616 -7007 198042 -188773 -98497 -230096 129073
21830 -204828 -31071 247198 -157225 -311774 97684 341599 165170 62938 66006 316828
21820 316828 192962 -151462 -191165 143298 39645 -29271 -46206 51440 -119342 -80684 69729
21808 164434 -227751 -218235 -201177 -323857 28012 -107298 -206812 -22459 10107 -303780 -205579
21797 -205579 200529 -91264 -150659 69434 -149733 56295 -248756 89506 172839 -387315 -86879
21785 -123867 229239 35999 -168826 -179211 -280453 -44388 -82570 123906 37379 -45339 -9820
21773 -366817 -383833 71469 -64605 -66269 -42683 -41225 -38601 2168 -194057 -120823 245414 -214381
21760 174220 -348892 -12002 -150339 120737 -101891 411118 -21816 132652 -368916 -16842
21749 -29861 -21987 -222556 -189114 -68474 159188 -274758 -119718 313115 -156752 -224699 157075
21737 290924 -249138 63421 -234715 -95436 216965 308321 -19601 105679 -88604 88651 -46945
21725 -182207 -233908 -60986 -88423 156899 -239497 138473 205044 29084 183751 81926 -242833
21713 -6644 -314855 151358 -221623 29076 -75274 169718 -44252 -31776 -69443 293718 44048
21701 323776 241504 -60152 -169367 98164 -312996 -142227 -299951 -126864 -39601 -150774
21691 -150774 -53353 117130 -385505 -201921 -79078 -182190 -76667 34647 198107 -113615
21680 59148 -36208 -221280 -2716 -25345 -304969 252426 -160100 218202 -31572 -99775 -309965
21669 -309965 15505 228246 47224 150943 238419 168830 276901 -189270 -134235 112202
21658 259211 -155540 -17121 -148749 -8308 -240096 -142703 -130742 -90875 129295 304480 130974
21646 155410 198064 -52045 -72126 -70651 -360929 166694 283 -52519 103195 -239451 98349
21634 106648 -40721 -88858 -19605 95705 -53136 -183029 385278 -175452 8985 172715 -333048
21622 82141 119207 -78819 -142228 -104714 -359637 -155591 -87614 -71902 -198277 393584 -31481
21610 -4546 33121 151040 -375477 -103399 -109557 56885 58174 54300 -143121 -191557 -95079 -91213
21598 -91213 29975 -278149 -132447 165205 112314 -141677 -354869 -207825 -32226 -90967
21588 -90967 -384212 -128180 180259 -168610 -84051 127948 -39871 322889 -101847 43082
21577 -377847 207780 47455 -7125 150214 -335832 108352 124523 2702 51810 -147853 137961
21565 -289523 -252969 123676 -246024 133990 -115286 -55347 -84525 -356847 12597 71052
21555 71052 -346456 31667 25849 -154059 -163163 7798 -7694 -185133 41086 -234127 -41050 -110050
21543 -110050 75059 -81907 -97255 30142 -68663 241844 -136408 82752 65712 -208006 -357516
21532 -357516 87862 -185688 -130700 -15772 61775 245097 -310485 138138 16423 16971 -29142
21520 36226 212326 -110907 -234126 96656 -108640 -36550 -17154 59617 55973 -228400 -321318
21509 -321318 338428 -106284 -172202 -159668 -253725 34718 -133881 170576 -54692 -4659 -235784
21498 -235784 30456 145521 394946 -53645 -42087 8090 -234299 -36418 -491660 19354 181580
21487 181580 -131523 -49576 -188831 91320 -197582 69754 -159099 50041 -133196 -384567
21477 -384567 -177412 86414 -83954 289930 -236681 111583 -168476 -13795 -313276 -7372
21466 -39214 91429 -340238 -180710 -122460 -30901 -145977 -37453 159872 48816 -27710 -45852
21455 -45852 -99620 187474 353 34096 -352139 116056 -189390 -270714 -400545 -103546 -61144
21444 -61144 -91042 292043 -21709 287828 108823 135905 -76105 -43001 -79421 -116276 -321391
21433 -321391 20069 -15933 49650 -47036 -105823 -111785 20510 -209992 -124535 72754 149286
21422 149286 -7013 167937 -132366 -92925 -121883 -23470 -54982 226214 146991 -44776 -58330
21411 -58330 -60623 249482 -76848 -46742 -47145 -127104 55260 266959 256439 108581 -335162
21399 38978 314291 36514 -135928 -205904 12676 -269213 -217598 -247369 40043 21128 -27851
21387 -23674 -130033 33198 -117393 -180387 -392093 -143070 33619 -291029 -4403 -165476 -121221
21376 -121221 -29238 197468 227915 -161380 172098 -88496 -92938 37571 242736 251448 -277490
21364 -286265 -233908 -61288 -68050 -19160 -41826 -182617 107455 -98851 -55188 -317091 94276
21352 -181147 -362216 56290 -5819 -58314 -270047 -173146 272268 53272 22917 319989 -49072
21340 -76544 164565 -264221 60337 -84127 -600677 154811 -352071 173667 65915 105702
21330 105702 -139131 201492 -121637 14115 73329 -135753 25035 -263017 189935 -315445
21319 -142149 -23635 184433 20580 -195535 -199028 -64278 -380224 195609 -236109 81370 -370689
21307 -146814 158024 162420 -32655 -152356 -111858 149482 -348620 -45390 -103244 56990 100719
21296 100719 -83478 -66441 172117 -46322 163916 -21308 -34059 -13229 -345814 337775 -168075
21284 23301 -412605 -219539 -199432 241015 -38968 -131292 96083 79670 -68565 163865 -145990
21272 -287284 18163 -129542 -156009 -285217 -175301 -14239 166437 -229151 57197 -245796
21261 71507 -473120 2793 32280 139674 -111507 -61597 29840 -352051 66648 -145668 -174841
21250 -174841 -248625 -175804 -129199 200196 -53017 -89406 56081 -343485 -42606 -146177 53818
21238 217543 37989 -38500 -253191 -210148 40317 -323950 -297185 -283002 -298989 -374869 -116351
21226 -318928 -203440 273135 85230 -440953 -54649 319582 -352301 134842 108956 158060
21216 158060 -337008 29918 478628 58961 -40185 -43100 -138293 -42308 -17622 52493 202756
21205 202756 182563 -101125 50859 26348 -87692 -37213 132003 47229 -202527 -44083 -189085
21194 -189085 -192576 -172898 -180610 162934 116940 -125834 -7765 205722 203709 54940 -363681
21182 279306 65863 -55483 -21634 -42098 111292 -170940 -218603 -22533 -123529 11 334321
21171 334321 -270845 -22136 -130800 -77427 -38489 -272291 -64668 -205043 -267868 -93041 -99272
21160 -99272 -95469 175322 -43147 -212198 11030 -255093 -39196 140165 -305851 -103497 -19074
21148 -193632 126570 -83452 -202343 -55342 -208516 -263954 -45745 78724 -41050 7649 33331
21137 33331 13443 241085 -23263 -53240 -161014 -249064 -104606 -190157 -180361 -199524 -73387
21125 -122556 24227 -210488 101924 -501268 -292642 86017 227122 -63995 -143306 -332285
21115 -332285 -252472 -207420 33542 -198594 -326383 -33911 -251039 -230381 26779 -25742 98849
21103 -21737 117480 -7682 116637 -174869 126168 -88459 86212 39609 -132607 -130048 -111756
21092 -111756 -1025 252507 103573 127080 -90712 44809 -49655 -27126 85134 157619 -128501
21080 -85889 160164 56661 -191257 -143502 294956 12328 -235122 172991 3883 193459 -213258
21068 -184416 103913 -108335 363051 356815 47547 -66916 -117303 83920 -424551 -216342 -58965
21056 14927 -217496 19351 -191328 -166949 -252041 -156192 203201 -86017 143742 -136165 -69667
21045 -69667 -5999 142574 90415 -162743 154360 23062 13941 -181303 -114576 -10267 101141
21033 -193725 -100480 154136 190521 82782 18097 -239779 -301182 -44560 71014 163694 -188648
21021 -75426 -13627 -287805 -56577 -137632 -96154 183343 -141312 -56597 -13301 -71166 -97113
21010 -97113 443210 231964 -142712 -266397 -82834 9025 -157809 -318345 178348 -105190
20999 -159330 -571891 -73206 -110475 -421598 -293429 -2921 97974 -49596 28563 188975 159908
20988 159908 -247361 98115 175965 45233 -25573 -296451 -133204 160387 -70350 77719 225112
20977 225112 283848 127921 89157 -130903 75931 -69440 -164447 -36184 -273144 -84764 74756
20965 104537 -35991 -17924 -508329 -410669 -137007 -242556 -178581 136825 -223129 133004
20954 -273498 -58070 -46686 -72308 141712 315591 320158 -159284 -184678 -24219 -94798 -19961
20942 84197 -104789 -203645 -190055 8599 228558 -125393 -175411 50636 -147635 -105995 169524
20930 -92902 -31686 65604 28430 137738 -237783 50888 -155289 46005 215453 -207477 34178
20918 -161094 -218425 -117022 85372 -458436 -32163 -217883 -135442 -335970 -104201 -3787 -190191
20907 -190191 -24961 -28920 -12962 323300 -7249 -75658 244980 -112469 121551 82850 -110371
20895 1336 117581 -86856 130457 -166356 415924 77131 -242632 -235553 126382 -98818 1261
20883 23506 -30661 179362 -99772 7921 72449 42181 -282022 -92318 -107365 -233461 122945
20871 -4697 131186 -121621 -149306 50797 226817 -230429 106947 30666 85378 -314291 -101970
20859 240515 -190371 4596 -312498 -121211 -70550 -183279 20540 -432245 189883 -195261
20848 -128398 24149 51500 -230436 -108938 -83774 -51740 -110577 -31391 -49634 94834 -210686
20836 -134002 -167057 -37846 -380776 168824 -116334 -29532 -205503 230661 -348371 110427
20825 -163381 -321292 156915 224644 -86142 89918 177449 -171344 71055 -78145 -556635 23646
20813 -274258 -49790 195909 -128350 -37264 -150229 -84111 103045 159478 -115139 3536 -210036
20801 203125 -225849 184922 -16306 118671 69939 -12397 -125467 300012 -151642 5081
20790 69114 157437 323993 -191421 -310575 -197154 92190 -74911 -174772 -191525 -60156 48115
20778 -374180 -376540 128686 -164646 214266 -212762 -94154 213348 -93634 31631 6555 -122595
20766 -156449 136829 -95932 -154634 83586 -189884 -18785 -119033 115683 71333 -25682 244762
20754 -252578 -308179 -176680 -31333 191594 65409 -284148 -178338 -222787 144802 -131884
20743 -218956 -185868 -87255 66020 -91040 116753 144015 -74144 -120931 -140935 -331993 -86716
20731 191663 255907 -206665 -175302 -468484 -61364 -277713 -39177 -207272 -198755 65271 -56298
20719 1182 53510 133534 -128812 45996 95698 -17550 58113 2260 -343743 -360572 63875 9708
20706 -16900 -242803 -245847 -149439 93588 -65900 164787 54918 241271 -65669 -282554 -304163
20695 -304163 -15350 61 -137351 -132594 130192 -95239 -102145 44343 -71163 -219155 180343 72257
20682 117288 -403022 -151016 -30476 -79591 -203420 266976 212137 -43412 -120540 -36903 42512
20670 185124 106575 -432439 -70895 93130 -144534 66679 -35957 -323978 -106850 28156 -294509
20658 -112759 -340930 150045 -76677 13530 -68029 4146 3730 -40795 -105684 -28887 -140389
20647 -140389 -445938 -261574 -18247 -137132 89548 -133056 192418 107856 9408 67617 70255
20636 70255 -351267 -115051 -157161 -284847 55156 -6570 193118 -99478 -104322 72856 -248888
20624 -17857 -244850 -72415 -269888 -115966 -398945 57382 235552 177537 36993 182274
20614 182274 -146574 -63356 -34405 140312 -45772 -225257 88159 -78733 178018 -250849
20603 -256133 99893 -58751 -215866 -94632 -270648 204406 -134680 207970 52502 130232
20593 130232 66640 84040 222810 -21246 -33921 168413 -308459 329748 -25065 81742 -179504
20581 -167121 102857 -611880 155247 22543 234925 -239992 -229521 29493 -51907 108660
20570 -22072 -79737 302436 -252776 145798 187717 -80240 129362 -45356 161455 68380 344810
20559 344810 -100244 -300750 14617 -214174 26661 -226244 -202049 -338217 -252755 117963
20548 -63798 -146371 -284888 21200 -242630 -86914 304029 -69584 34686 2485 225722 -69772
20536 -107539 156865 -73013 220844 7139 -31566 92311 116179 -227632 -272721 -242490 67494
20524 -302568 -218590 126744 60644 85064 -97128 -141666 -80900 24504 -265285 44022 -52992
20512 104984 -370075 -200304 86782 -189494 246179 111655 -51731 -242437 114808 -98304
20501 313988 -135589 -103722 -280769 319693 -338984 -162167 -321595 -179957 -217743 -124281
20491 -124281 -293271 -210419 -181228 172985 56927 -66903 -97424 -139186 209938 -111470 -309709
20480 -309709 16148 -189058 -56957 -139939 228933 -264128 -16040 178814 -195657 44034
20469 -366010 46824 73153 53187 115644 15096 -157312 223021 -78572 -113598 -223394 235713
20457 148681 210249 -66208 110821 221830 435507 -73751 -77577 -501279 22240 -47351 -355699
20446 -355699 25224 -168575 -274873 -84514 41377 -205589 62688 288057 57267 -79433 59877
20434 179611 293081 -42660 -337735 -130195 -210689 -267358 -11227 -243111 -49813 138374
20423 -8600 -65053 -91067 -111828 -7777 68899 -17022 59832 -214848 85061 128541 -6495 -246035
20411 -246035 413883 5677 -94981 -134891 -79583 -203378 201356 -134331 -214285 -51217 -63912
20400 -63912 -35727 -99043 -115278 -234794 -13292 117113 -228473 -73418 -159741 -115158 -220311
20389 -220311 -149918 -239317 41155 -80957 -31631 -181778 5729 -240355 -269434 76021 -127535
20377 318348 -127878 -65325 -129720 63760 99782 -303638 41949 96868 -26203 -165445 332236
20365 -18536 -90994 80619 -195778 -224528 -39175 -255066 -97538 -38464 -168238 -202388 -376692
20354 -376692 6387 -232331 -388284 132653 -5076 -113192 -169887 -14408 -229776 -1457 -159520
20343 -159520 -208107 151865 -144734 70817 -68029 66580 -37412 -62039 83347 157404 -96475
20331 -176959 -205142 44132 -78546 -203174 107277 33874 -90272 41528 199628 -21921 82496
20319 -49433 59850 86508 113745 161317 220927 172093 164092 -199238 -61933 198459 65115
20307 -19227 51820 -209787 -82650 157605 167584 -33633 133845 -128355 -57660 -47052 158549
20295 95757 -46930 -225967 -58147 144721 81444 -217904 72678 -69395 120842 -242340 124430
20283 -3420 -515909 146370 64940 93871 -59095 141807 -106531 17039 -143621 90577 62405
20272 62405 -3821 -223401 -227866 -196675 41497 219898 -242472 167598 -22603 195465 207787
20261 207787 -134876 -41273 -192216 -267860 188555 42761 -165768 -101144 41719 -307189
20250 130251 75397 -294570 39613 190674 -23118 157820 84008 82600 -163562 24806 9576
20238 -90634 -26201 -126909 88469 -201682 388735 130330 -82715 -182164 -349831 -270312 -38088
20226 54501 -440029 -213354 -70222 -48073 84619 -325501 65109 -202008 -55771 -261914 -43404
20214 -405125 -36451 69621 337924 172710 -311626 66091 113215 84406 -199351 -297897 158438
20202 -75594 -25184 128035 69546 81248 -185205 95210 4128 16642 -6788 -108774 -236870
20191 -236870 -256090 19670 -28871 -75549 307914 -463030 143661 2781 -75128 -7029 32398
20179 -130126 -262561 -87171 154182 253382 -107274 -459442 -252800 21079 -146775 18491
20168 -302339 275984 -68000 159532 -184772 -152787 242379 17750 -82777 -209791 -96888
20157 -149081 10526 24456 -14199 -66146 -195832 1980 -21316 75622 -240523 -123515 -124641
20146 -124641 121896 -119982 -201438 -420448 -668990 -84142 48134 125589 -239217 35394
20135 -128618 204911 -69877 -20180 73173 112913 -117997 -64402 278034 -251523 -149318
20125 -149318 -145703 77499 28376 38856 -355792 352964 -183097 128407 -52616 57597 -384912
20113 -106429 4839 -204935 -51218 95103 -143608 -202916 -12739 163640 -197294 -59060 -136365
20102 -136365 -48707 184270 -17791 -133004 -94535 -60425 54655 -72463 3264 138574 -247782
20090 -260362 180591 -194748 46524 -320117 -161796 -382642 37562 -323660 -216144 -18598
20079 -90783 -236453 -366777 -26575 -54352 -656643 -121304 -147874 217067 -111624 14057
20068 125223 -18305 119470 -319839 104721 -530777 -28176 -134741 -138237 151305 56492
20057 -68712 72216 239053 -62855 322225 19640 -365731 63005 -100700 125229 -175967
20046 -121613 -75666 -336736 -410702 -376637 287548 -147783 185000 -411158 -201524 -296891
20036 -296891 -221665 74074 238388 -12671 336629 -211229 -80803 117113 53903 -111350
20025 11763 -15049 188421 -337058 247322 314241 124123 -361336 97859 11948 -165048
20014 231903 -48236 46134 -62185 -217178 174960 -126078 -170101 -112357 -57866 57773 -179532
20002 -251823 159467 -16513 -58282 58383 -47918 -30268 -261763 37565 -277199 -281199 137831
19990 -96138 -6320 -64396 -72825 109198 -32725 -19824 184205 -31942 -474934 -373461 1247
19978 -29010 95075 -225641 -192246 -300776 -109181 129279 -51478 182576 -173518 259631
19967 -206857 -435149 30109 312626 -79796 -1890 -95290 210372 -179457 -188727 -45973 -276380
19956 -276380 105695 -67383 -69720 -4164 210 -127653 9294 -85356 -429490 -214392 102489
19944 -120258 -105544 -282082 -97669 -102731 119273 364261 -98503 -304557 -132675 49973 -169652
19932 13196 232509 -257024 -277659 298124 -281158 -76874 88947 -240968 -120154 273584
19921 1194 373361 254559 -297211 -22988 -59408 -278189 -15744 -100683 88606 -251186 -484819
19910 -484819 -190527 -178883 406483 -118127 36625 -179168 -3250 196447 -188158 -279904
19900 -279904 -44728 -13020 300904 -87308 183922 11581 -250606 27758 -63129 182067 125818
19889 125818 15546 -344352 41609 41158 220470 36369 279800 45584 -68722 202968 -55047
19877 -17493 67968 -249011 226274 -31427 -21060 -239214 -223677 -117329 -115215 -97982 43432
19865 160990 -258045 -55231 230642 3609 -186762 -240410 -17395 86178 -235606 71152 33610
19853 -75960 -57596 -111290 -63841 -83319 149748 162484 -211930 244363 77651 -52796 -15609
19841 -76965 -95065 167526 -241 97741 -37499 -238505 -1379 -19393 -127000 12115 -252708
19829 73267 67442 -216103 -84596 -80213 -83439 142085 129502 -114113 -244672 -36081 -157930
19818 -157930 177486 270976 31335 -373313 -84723 -93938 -331459 84841 -69982 29084 -95220
19806 -252916 -70610 14652 -14150 -6603 8224 -170507 -152874 -7298 -25437 -209856 -90196 -186924
19794 -186924 -430847 -9696 -132185 -134172 19546 -147860 55241 124987 -191447 -30964 82964
19782 -35827 102668 -173295 -213430 -106207 -18884 13472 227930 -49666 -293751 11010 66717
19771 66717 -291842 -89369 -98133 -60694 -191359 -182818 -99865 104428 175876 23184 -472959
19759 -209796 29884 -120929 217841 62829 -222336 -30348 27885 -152893 25825 -8042 86668
19747 302528 170559 -339225 -53922 -327781 14699 235948 33970 -201929 107819 -302458
19736 105524 -395315 -18971 -219405 154336 -125483 -231913 160200 -219337 157737 5491
19725 -119873 -175211 56262 47982 -46096 -65509 162158 -48835 -4178 146396 76203 -100788
19713 178092 -113102 150351 88925 -285130 -144068 -56752 -24573 -33339 110354 -69742 348312
19701 -142878 -127529 -33170 117575 -158766 -51442 151151 -126607 139871 -272967 164342
19690 -219068 31080 -218105 -201208 -70990 -71319 -120052 -108904 69131 -238277 -332266 -35962
19678 228931 -48942 -112288 51472 87880 -115502 12105 -305280 13587 8407 -171280 99788
19666 77321 -117268 -5966 -82033 -122598 -191788 80040 58454 -116041 98164 -197815 -145543
19655 -145543 78306 -45330 -41605 -278710 67178 -105246 112827 568800 -227705 -9993 -103263
19644 -103263 111080 -4082 -258483 -375206 -37125 -162230 -73993 -43689 -182657 -296269
19634 -296269 89599 466642 -233709 123260 56837 -15988 -352842 -95396 242260 141241
19624 141241 -286725 -98757 -258866 -131121 71765 4525 54175 30312 35420 -75539 -126246
19613 -126246 -75732 243858 -259154 140166 -252639 81894 265427 217928 -217585 325560
19602 -96851 -116175 -374091 -187756 -185988 -404206 -443605 -100322 271022 -140094 -89496 175849
19590 310726 -210760 84075 -133814 91599 -14916 -80813 -258597 -253835 -68508 272805 19147
19578 -455048 -186905 40642 56472 19720 25701 -25258 -131102 -25287 -187336 -217170 -357973
19567 -357973 -214630 -173572 -266467 176660 -155808 -263180 -124505 -88814 543563 78137
19556 -300089 -195294 -144537 114240 -197346 18622 56929 -367327 109625 -251615 -476834
19546 -476834 149160 -181011 -60160 -264331 29316 81189 316461 71983 -92954 13297 -92686
19534 -95497 141554 22235 -189707 -365408 -32446 78033 -223350 219717 -89627 19862 -332201
19522 65867 -251669 269689 131937 -356655 73200 -311715 -279365 347335 -77689 254947
19511 -399558 -436320 -75948 55996 -84541 193790 -107123 80216 -207837 -39431 -376252 -16857
19499 51489 -26017 22616 97522 -45286 -103318 -233237 1983 -89085 -317765 44329 -197126
19487 57546 -340929 -53449 333638 51385 -134339 -38950 -198654 -350835 -396351 -16161 -278300
19476 -278300 -183933 -49583 247726 113764 146352 77290 -94806 -14234 -299082 -32627 -219937
19465 -219937 -300910 7355 -40940 120593 170047 -367131 -13540 -293832 -260009 -21391 -82705
19454 -82705 -223423 -26782 250616 196450 -6147 -169388 127593 29951 -56419 -150710 -14247
19442 -136868 88470 268441 -269184 -92949 49933 39498 11073 -197092 -374311 -299950 381376
19430 -48796 112590 -4813 88076 116480 38886 -77081 -20925 -23400 205608 -234868 -277917
19419 -277917 -85598 358513 -122362 -5192 -102943 -102313 -137527 -6984 -92824 -221060 -182916 -21429
19406 -175832 37409 -53436 142389 -120236 -78423 39083 54646 -148123 -9691 349428 47807
19394 -216856 -93068 -31321 -107190 -79204 -61925 -66196 65751 135500 76516 -114180 233610
19382 -21771 -53624 197275 -68634 -197027 232699 -191390 178368 -235262 -237307 -192955 -264827
19371 -264827 -31152 -32395 -65466 -319465 -13193 -113788 -34597 327763 -128731 -34302 -98774
19360 -98774 -84250 -127755 -173634 -15729 -13677 67342 30009 58994 -263163 -99289 -257180
19349 -257180 173795 -236779 -189841 -72371 -20600 -151670 -230623 -203746 -147807 -51208 156004
19337 -122120 217668 29413 -253971 -77610 211592 -323611 72791 8930 175487 -41266 -316974
19326 -316974 15482 54035 98967 24163 69417 -166610 87296 -108908 -61542 90490 125766
19315 125766 -159932 -23717 -32231 -90618 -71512 -173808 169985 -332307 -81560 -395786 -214084
19304 -214084 100127 160117 -216527 -70869 -291908 35786 -83908 -87841 220530 -132833 -170816
19293 -170816 49615 11716 -87427 -270532 -142132 -364178 -232684 -360440 38250 363487
19283 363487 106145 22788 292664 -7910 -160720 -164727 -90158 98625 65326 -8368 201631
19271 -147717 -101677 34862 -4179 132197 -47821 134185 41449 -468284 176680 -152099 -328829
19260 -328829 -289286 -36186 32665 43997 -336184 -319713 -172683 -165316 166819 -71047 21251
19248 -38080 83802 -170596 20503 -276979 -71435 -26671 -281203 -92079 -199440 -168086 -124562
19237 -124562 -4506 -69942 12174 54002 -159937 -154182 -22183 13225 -205494 -147371 -77739
19226 -77739 166663 -2674 -260084 -75709 -38565 -173323 285751 -138639 -107563 74441 -20189
19214 -34643 91335 -40652 7647 -82375 -119629 193926 -404126 -113570 -201956 177287 14548
19202 -266216 -300332 15830 82820 -335487 -248498 -127488 5129 78971 -46189 -62645 -10809
19190 186736 109621 -278277 -279355 262720 -96716 -12902 -279715 -217630 -23953 -186111 31575
19178 -190945 -439826 -30338 105 174563 -47879 256757 18515 -15298 14409 -156517 -42787
19166 -51206 -250519 151183 49399 273409 -98083 85073 -105871 -68567 -80226 53880 119914
19155 119914 52699 160892 74088 178396 111685 74435 -173363 159322 -70609 -25442 168030
19143 40250 53913 345577 -95467 116423 -25681 48450 118005 -238987 12968 155060 -176291
19131 -63280 -36482 -60222 -206696 -5678 -164875 -199417 77818 -212082 44217 70444 190308
19120 190308 -45806 -197337 -214923 -134625 -2216 27518 -4484 -61508 -267296 -359802 -156329
19108 -376772 -210905 -147603 -197994 -59128 -176278 -109764 100888 -171027 151967 27047
19097 -34149 -305163 -83046 22518 137342 272315 -300617 66087 -103754 77077 -134080
19086 -96382 84547 38361 -53548 -72796 -186139 -33561 116770 -38222 214225 276783 -15091
19074 -155342 -146859 93589 164412 20370 -124999 442583 -179275 -144450 412771 -152485 -22888
19062 43624 27158 -96531 95354 -394174 -174175 277147 -63126 19743 -65977 -138593 -194715
19051 -194715 -188299 17760 -49521 -35145 -219905 133143 -82193 153833 -8936 -367567 42122
19039 65449 -239884 106072 53782 37845 -47528 172755 -94586 335287 -64259 49283 -242034
19027 89837 95586 -5585 -18327 -36246 -330911 -14744 74819 185333 113652 -108263 -352358
19016 -352358 -245398 180122 -115534 -266319 -290100 -156769 25201 -23413 -70596 -235799
19006 -235799 -152779 -138733 101780 187470 9695 106413 -35581 -205304 -63795 -54654 99448
18994 -179521 225906 141687 -44203 184392 -28347 162189 -181631 -222363 -283080 77263 -114147
18982 38278 76832 44372 -504153 66848 -8839 -91078 -219322 123931 -133413 81333 -6961
18970 -106502 72098 -124164 68000 -222470 -21812 -487199 17511 -180987 -191569 135854
18959 -187660 70005 2618 -74559 143590 -3374 89835 -29256 -464990 231481 -131937 78970
18947 -135937 85678 123886 -108264 122659 352892 -36712 172906 3192 33563 -9520 62080
18935 128798 -54838 150809 -165625 55059 -3794 118139 -202057 -94203 -265852 -179764 -36012
18923 -105742 261013 -11865 -142628 17916 -167306 205983 -42181 -139924 131862 128030 45752
18911 -260634 -79286 -183580 -113330 -37541 -49948 -316194 205438 78548 -39161 -58224 112954
18899 -162368 17027 67885 446807 -63025 -224612 -180938 -125761 273784 -106190 -54509 -23793
18887 -69305 -231069 -249565 -11104 -23143 136313 172362 -118829 31591 -113200 -124426 -282013
18876 -282013 -150714 118784 33398 -86568 132654 -37423 -145153 280048 -136728 104302
18865 2012 -1999 -34419 57828 -130885 -317033 143431 258024 -202633 5489 30877 -121200
18853 280533 250639 -124370 -182889 -123714 105978 -59406 -12588 -58561 -391242 200783 -153491
18841 -71539 77830 -170728 389009 -239531 3620 383304 -158210 -47600 139609 45632 -39620
18829 487102 -299256 -61231 -500715 -230622 -304683 70513 2271 185176 140911 515329 209733
18817 -227870 29601 57342 88427 -734 -176012 -148405 -120064 301020 245470 -228593 137847
18805 -402385 -218977 75032 -69030 13648 -15870 79947 -85092 -59660 -23958 369237 -131940
18793 -123178 -282242 -59620 -57948 -35832 -333975 -185608 175175 106752 -144851 -71074 312153
18781 -307018 352367 25850 -88814 268066 -106553 -257834 -125887 -113994 129660 -210323
18770 -152677 326754 71120 180429 -169072 157471 -201206 -429746 431481 -178638 -145299
18760 -145299 -289821 -91328 -34510 196227 -102442 61328 30145 61385 -399354 -24763 -330792
18749 -330792 -277561 -129455 8694 -141238 -72855 -161039 -106789 111939 -288708 -504316 -195381
18737 -352700 128505 76561 55502 299223 -148401 -425205 -65980 -267509 -399347 -39762
18726 -222474 73214 -46584 -311602 -278284 -318036 135789 -160251 -88335 286070 239487 -380946
18714 133179 -278760 -145188 -52718 -32312 22960 65593 -286458 272469 -137309 -433706
18704 -433706 62477 71848 -72089 -332761 -57515 -194880 197654 -235851 -336821 -171301
18694 -171301 75776 -354934 270423 141638 -248688 -283211 -278797 -73773 11925 124326 -77069
18682 143280 16552 -34014 -253787 128232 54054 -111558 218157 -137615 -212563 45689
18671 -77423 116521 -140028 153660 -83989 184727 -101962 30986 -116590 -78292 48382
18660 -1004 -275376 -256862 364399 -184548 -373238 52163 160009 -109512 120922 116216 -93031
18648 -269880 -89034 -109341 99706 -143343 302628 201454 -19240 -72906 -258034 -142355
18638 -142355 497610 -194200 128964 -22513 283812 -11786 -57028 -134827 -303447 -558859
18628 -558859 83867 32163 -119195 -193993 169853 -271321 -147352 -41911 83008 -88158 37298
18616 171439 -6088 -134126 -303061 -311312 226730 -121281 -25018 12259 -101887 -224696 -306600
18605 -306600 -64989 -112074 -87295 -156722 147715 -75467 -346119 86702 71862 -15502 -28981
18594 -28981 -333296 -121089 -128705 23070 6089 85674 45960 -281340 -125447 220209 220009
18583 220009 -35586 -192643 -117023 294469 29719 -292218 102640 -78791 -196955 2017 -84569
18571 78064 -378813 -388238 -123009 153017 132513 131742 -21243 164176 64953 -136944 -2856
18559 56838 -190401 -60536 -214203 19204 -530681 -104846 -120874 -144198 -40290 -484942 -171738
18547 196479 258563 -410555 140755 -258638 -63508 236235 23956 201402 -6177 14352 -66441
18535 -84878 63196 -230408 50272 114527 -242855 -112668 -286047 101353 -30816 -135781
18525 -135781 36160 -221486 1526 -83960 9271 -30684 42981 -26605 -199125 -251243 -293669
18514 -293669 75748 -214732 -116980 188445 -334469 -444995 -81522 -226602 -255537 -50840
18503 -11750 304304 -211870 190300 212024 -297873 -64467 36305 53914 -234638 -130808
18493 -130808 -66741 175847 -95992 -323947 -135646 133086 -53843 -114994 148827 -88908
18482 -74172 95368 -45890 133735 76183 83012 -167568 -76539 169464 224127 12961 157810
18471 157810 -232533 -144884 -37485 -121551 -83657 278947 -119099 46873 -149828 69021 89125
18460 89125 89720 32662 26571 -27768 -545832 -8181 -220041 -344875 164625 -263618 -23906
18448 -153676 -60278 -78528 16811 280959 -162730 -227312 -132260 152596 -190255 -197995 29198
18436 -109841 126509 24356 -160895 288214 -80775 -156441 -118410 7453 140167 -112538 -163313
18425 -163313 119876 103286 -249033 -41873 -130326 -56679 -340398 -169308 33573 62761 -285089
18413 -6513 110437 -20939 202969 -98127 284687 80675 -2213 -72660 258186 -196638 144782
18401 401572 -160059 80481 -42717 8204 -291121 -278308 -192806 162660 87676 208592 -360557
18389 316115 93262 -83059 255716 133212 111307 -113985 -608251 8496 -278292 7677 140282
18378 140282 45459 -9829 -24749 100705 -160009 -79526 242512 -40483 111795 249866 53202
18366 -149204 82079 -261432 -9408 -162832 -154656 -241366 -404729 -113374 -49947 -259252 216433
18354 123612 18598 40204 45126 -39645 -75777 32872 24097 -415928 217478 -469200 -27846
18342 28877 -141265 -123544 -211984 50806 158147 -27022 356316 152876 -206836 377900
18331 420846 -283969 74378 -309518 -342633 -173460 -22198 117715 -206431 -209293 -252554 -103337
18319 -85319 -139609 205732 -209617 31572 23620 94169 8358 171159 -29438 219247 28016
18307 69672 -6794 221938 138549 64301 291124 -132448 55997 142689 -4118 -24036 69265
18295 5198 291112 189347 -25746 -97031 -285788 -320 122807 -413 34654 -55692 -184647 118308
18282 276156 13373 -37444 23845 121236 218903 -236381 -151868 239892 76401 143733 -16593
18270 -140627 -437253 -271503 25212 217793 174779 -74211 -271415 172033 -106872 -117968
18260 -117968 96571 204600 -256410 239857 254096 -104432 144392 -282963 20298 108916
18250 108916 -240183 -157050 -274024 -36530 -191879 302663 53985 -4215 236489 -343240
18239 -287122 -100019 206999 142274 37004 61569 -27406 101591 -81476 -49495 161013 -116389
18227 -58430 -175201 10200 -3280 136957 -121451 -126713 -274452 -70473 -258974 -11494 -111771
18216 -111771 -238558 102380 134834 -140323 -164409 23981 390010 96130 63053 47116 -96384
18204 -439401 154506 -192903 -104175 79908 -64176 54235 -204854 144742 113517 -96994 77343
18192 164143 3841 87575 -125076 -314195 117360 -192587 60695 40514 -107097 164367
18181 -94212 -35834 -5441 200842 -421166 -200081 123339 -1321 -68155 178707 89547 -58835
18169 -292904 49276 -145032 -113718 20215 -258951 43989 -104985 -385041 32892 115024 12497
18157 31403 -224209 279993 -24307 36901 361156 -178858 -232409 44413 226460 -341629
18146 -34130 -15826 57538 280904 24922 112782 46811 -23195 159904 135460 -142683 -131234
18135 -131234 -237350 62269 -128977 -19699 -197283 131711 204813 143562 198980 151823 -12687
18123 -133208 1817 -114416 86137 -10977 78715 -213021 -125220 24347 -71238 -259828 -96823
18111 96435 -103923 -145929 -47332 -117425 371947 -54446 211407 -51432 -198010 -19534 69934
18099 228161 149285 70068 -40951 -152377 366474 -287215 -44217 -81192 172310 84702 50918
18088 50918 31160 411117 243021 -320076 80045 120752 -123862 -14301 -212327 118298
18077 -307765 230450 -157220 213032 93320 -335419 54137 -12749 -160600 167314 205186
18067 205186 -190128 7550 5370 -322833 59461 -47823 163442 -274723 -287760 39295 -234990
18055 225931 59896 -238968 -130889 176309 -24053 -76808 44944 -189788 -387649 78220
18044 -202255 120256 -61287 88883 -248807 171625 359345 -35906 8128 -26749 134197 119763
18033 119763 106447 -229508 58010 103349 -182352 -88794 -64004 -13144 -337053 -205606 105469
18021 -286283 -9477 -300334 -32856 -99606 -12377 180477 145970 28704 -4520 16545 -76691
18009 170605 252186 -281083 -317225 91306 -327958 -131632 -133080 -113770 184856 10995 -56938
17997 30528 -170469 -223480 -61323 188267 178513 37827 -88954 -111165 368500 -15659 -120663
17986 -120663 38295 -65128 -145937 182567 86276 80311 307341 -6340 -49678 -91122 -5304 -106790
17974 -106790 166988 130317 -76029 -45052 -241114 147563 -394771 -99405 -209956 17100
17963 -93640 237572 -289353 -113627 -148717 -112995 96372 -193158 -84462 -145834 -4420 150507
17951 -34606 -213568 202845 92120 -37017 29508 199546 -16999 -61630 -304377 14357 -164904
17939 210505 -446318 -415028 -82059 87253 327191 5387 -25122 144565 37048 132474 128703
17928 128703 -63847 -29376 199039 138747 69400 -220036 -130461 -226294 -191830 220893 26239
17916 -36340 -46844 37565 -172410 -14568 -252436 170702 -172952 -80145 127957 367027
17906 367027 16351 -133680 12673 -28496 161150 167214 -276201 -94388 -275050 -65247 -258077
17895 -258077 -5142 -155195 -90932 66164 -189346 249047 -31876 -254792 -48175 -95306 -289162
17884 -289162 48429 -329042 -111737 54988 -325051 96344 39802 -214843 -12547 45110 -360005
17872 -63008 16946 -340923 164103 -23897 39421 113609 172546 58427 248210 -177441 26360
17860 163877 -230889 -100194 112237 -6492 -26034 -838 107119 -29348 -172956 22557 144345
17849 144345 -124935 91294 141735 -105059 34872 -75633 -82977 -206584 234891 402701 83540
17837 -10 -304565 58412 97777 222615 408539 -37884 28234 57720 -136687 268599 116007
17825 -26882 -178480 171313 15251 25724 -268198 -215821 41804 199223 -160792 -141878 -91627
17814 -91627 -168043 -19868 131864 19932 153551 212738 45773 146430 78767 142861 25621
17802 -190326 201177 34200 -55222 -117627 128455 202850 55748 -65057 -4288 -265215 -149620
17791 -149620 -15565 7838 -70683 181898 9119 -154714 -79324 168232 -125344 -1839 -256753
17780 -256753 -131807 87222 32279 77329 156423 69633 11152 126263 272056 217914 143322
17769 143322 -277686 163645 -3787 177560 114850 131218 -55634 267767 -52114 -212243 218103
17757 234589 468683 233944 -171260 6483 -186800 -199907 -102436 153635 -15638 -357204
17747 -357204 25805 153123 -3480 137454 -27724 -137129 -24023 196383 267578 197162 -172731
17735 -102045 128244 406724 104969 74306 -126831 264818 47788 85323 141977 -198827
17724 -32891 -69495 87499 80784 88457 192922 318273 113874 87128 -108977 319242 -180072
17712 -175868 -40648 229232 -1861 -61991 128211 220763 274715 9548 -80079 -49845 167410
17700 -13812 15357 -192788 26388 53245 -61715 149158 74117 -11733 177193 21271 177422
17689 177422 207905 -168892 -83447 -145265 94415 265861 -230237 43423 -227989 -208116 -113679
17678 -113679 290946 5507 370628 109747 320897 -56826 144760 16845 7989 -96398 -17569
17666 -3977 -51907 225461 -34585 -12302 -49085 49529 7345 296694 109 144296 46977 54628
17654 54628 98867 130834 81444 193636 48626 -140734 5537 -67505 -5929 -103910 -203227 133239
17641 -118299 -148223 74578 192236 42526 203998 83833 157244 104629 83856 216525 -60256
17629 232688 -16577 232012 152686 -51171 -44556 64902 -120965 -75146 -54607 164426 350896
17618 350896 199292 104583 -224990 320203 59754 355779 44641 75200 -104460 246267
17607 34912 -313816 249219 -43682 -109837 -101870 110441 156850 87460 71885 -154326 178604
17595 -187383 -51520 27983 29831 44249 19165 28928 -110731 -219881 58505 -53037 202142
17583 -193438 308985 121272 -413793 -27088 -1886 -88944 97835 -129453 20477 44830 -43655
17571 96054 99309 124414 -8710 134390 -118762 283827 -211112 12376 333429 -258423 46345
17559 82688 -131857 -101970 -208097 158221 39686 67112 -322550 138735 -127991 132102
17548 -16739 141461 178644 106535 6134 -124070 215978 -84706 99352 120080 -270577 237575
17536 -10369 -37371 187486 -216799 123932 96834 147570 117702 -25054 207092 22385 291554
17525 291554 26965 -204628 98509 126976 358127 197124 -261121 -211825 53891 100304 84413
17514 84413 116235 27798 220569 183411 -53293 -229399 -37216 92568 94712 79901 391818
17503 391818 23936 369590 19114 281956 176320 207743 228439 138371 -34152 171116 156812
17492 156812 -33713 225530 -77154 -12213 530674 33669 93346 468112 -85427 41621 -27595
17480 -42873 -49292 -4016 47890 185545 187163 332754 234807 224316 50331 61886 -27628 165536
17467 324886 57296 257881 206963 58145 -22421 120065 235193 654260 91890 85811 251182
17456 251182 259094 131986 44461 -290954 260991 282270 572092 361696 165315 474289
17446 474289 318095 433259 384872 472900 376627 275468 293596 25880 135804 74804 202152
17435 202152 36675 379174 200495 589876 299811 465424 -54012 281850 218235 -231481
17424 33158 355497 346657 567770 359438 105988 656474 381057 277377 359456 439049
17414 439049 251495 485333 132017 241863 366253 225347 166735 5442 193174 431885
17404 431885 11474 294390 241635 109688 144563 -137682 133666 130686 108287 -194198 262928
17392 7803 306611 214483 -121368 60653 123405 10275 3503 124634 75810 -10477 30364
17380 42281 4860 77798 -346316 36465 290303 193396 -156559 10948 559349 69089 310093
17369 310093 49939 96405 441070 286452 18941 410805 136767 278192 -431806 -38567
17358 12930 224578 502298 -110887 146268 64205 454341 227728 -315776 -98661 166203
17347 206473 182224 500301 299079 250123 192166 270175 479763 80457 282737 35800 316387
17336 316387 -117668 301629 386916 228073 81458 218058 123927 481512 117831 113759
17326 113759 230793 232217 110718 41936 54806 270488 333134 160337 82556 318069 71451
17314 286970 -75072 172664 -45004 84654 194861 103079 293393 -71324 234279 -44114 -212641
17303 -212641 198317 33462 121106 414301 150141 125976 211298 113761 401771 4859 69191
17292 69191 57493 244454 -321224 -69063 49117 55082 -89257 186277 305649 -16993 218355
17280 -12437 147540 357534 -28885 233075 -160065 -32077 205525 -58569 269943 -120365
17269 130285 183516 313373 459519 262521 308444 302774 206901 187791 -49301 96409 300903
17258 300903 111971 80511 309981 60802 268051 55648 168734 106417 239954 -69028
17247 347506 263803 151596 271075 80882 -391 11927 188432 177955 548539 454666 27741
17235 -81949 72766 318005 -28514 399129 10502 219221 239493 276580 215911 281695 205572
17224 205572 45653 272134 210576 96391 448271 375181 517505 54131 207640 189463 238356
17213 238356 260566 286160 273119 55387 341983 47371 195484 62793 210383 254191 143793
17202 143793 87121 350143 212317 341242 252947 303819 548192 281044 212623 432894
17192 432894 494676 43095 484242 511331 170195 196067 523269 -32877 228022 210778 311244
17181 311244 295620 390482 193484 308074 217771 281628 360691 340490 204383 106079 354492
17170 354492 321764 250579 287515 342805 187185 479289 53189 19294 274017 194102 90432
17158 322326 372650 118194 152574 580588 368409 222371 190143 513023 442674 359515
17148 359515 -62079 501909 286079 256607 258742 145625 383430 509005 331946 342410
17138 342410 474894 361476 414806 171460 545377 486728 461535 546832 99596 302445
17128 302445 503650 626752 231792 257078 359194 239809 459547 448615 320301 296481
17118 296481 201077 711379 351445 471712 400654 646934 303129 149739 143098 393297
17108 393297 594373 643194 109196 312252 329818 462657 459636 533573 291069 506083
17098 506083 766513 486131 579311 337989 369046 608618 994698 569621 280349 530620
17088 530620 490014 498372 183797 624896 198108 590404 241398 378377 484044 511331
17078 511331 457027 627134 511670 673834 333696 530397 232953 165338 485824 466205
17068 466205 676368 358558 496970 322384 451701 375488 732637 487993 641113 428834
17058 428834 573907 589542 604766 768860 645692 481904 629790 433397 527024 612964
17048 612964 560479 798719 769898 506946 495510 590567 641663 682923 562633 664108 511765
17037 511765 610773 680026 508780 536681 885315 868302 785951 522614 409981 409476 834546
17026 834546 180231 550902 606872 816398 896765 715972 1005390 635596 915795 592505
17016 592505 806524 749098 720664 542093 707513 687925 544859 858425 631979 697396
17006 697396 354230 793393 967917 847922 529775 818512 941829 436282 763807 737778
16996 737778 626295 637966 702429 823953 866569 803651 1107971 878703 1042539 860801
16986 860801 809754 967933 952493 738834 861903 778278 598923 685970 1310236 981185
16976 981185 929518 490418 878720 1067424 976522 984474 707823 921539 756471 833549
16966 833549 1264724 954493 1059838 1184993 832563 1041364 842262 1135942 1125504 1039941
16956 1039941 1190721 1229585 1237168 1124665 1044043 1309640 935255 1486382 1096078 1344422
16946 1344422 1343865 1026831 811938 1175495 1085104 1310242 1523645 1321293 1290427 1573992
16936 1573992 967649 1160492 1200900 1626511 1177720 1430689 1355749 1025420 1290647 1212736
16926 1212736 1704350 1282600 1237512 1460003 1508662 1462518 1581334 1411812 1479139 1410288
16916 1410288 1480858 1405993 1491176 1410423 1586959 1688939 1859026 1610324 1661174 1908285
16906 1908285 1744103 1524327 2119283 1721033 1792830 1789733 2131178 1822054 1954192 1977407
16896 1977407 2493320 1918148 2024657 1991660 2148734 2320284 2377463 1900539 2401723 2155280
16886 2155280 2322581 2123527 2219256 1923984 2472940 2139138 2629893 2304503 2681650 2371933
16876 2371933 2409490 2466256 2228746 2511567 2974172 3021782 2623316 2898130 2490834 3037876
16866 3037876 2950599 2693457 2909766 2929223 3124837 3097769 3169672 3024221 3249001 3116969
16856 3116969 3308656 3248861 3449482 3583798 3617697 3473302 3531951 3777781 3943809 3665377
16846 3665377 3953669 3900681 4238725 3887891 3916732 4136257 4127753 4348910 4650042 4492910
16836 4492910 4612175 4548655 4651149 4479525 4847483 4647233 5012171 5559667 5329125 5167039
16826 5167039 5195894 5844090 5556732 5858871 5545728 6119028 6195390 6182733 6817329 6389732
16816 6389732 6740051 6783763 6695917 7117342 7182808 7386716 7568212 7406517 7758528 8065421
16806 8065421 8075035 8303575 8877168 8612621 9087585 9203518 9107017 9433503 9825589 9881472
16796 9881472 10347861 10623262 10714652 10843653 11365872 11875451 12276388 12211172 12564523 13047475
16786 13047475 13264143 13783702 13910503 14540652 14818264 15385155 15997086 16434945 16863148
16777 16863148 17650900 17953816 18477581 19167558 19951084 20585764 21174256 21961995 22350180
16768 22350180 23644167 24278121 25632179 26478694 27536648 28422087 29663780 30696327
16760 30696327 31900383 33222071 34682390 35961540 37887621 39859856 41420602 43320805
16752 43320805 45248733 47248100 49464568 51801453 54754287 57144981 60103667 62981813
16744 62981813 66113907 69629100 73008881 76959009 81159545 85290859 89960704 94360475
16736 94360475 99531331 104549864 109591346 114807892 120511479 126005397 131578574 136881700
16728 136881700 142188946 147605666 152507448 156757732 160710729 163979538 166503641 168267931
16720 168267931 169352538 169545184 168699561 167498112 164887710 161785845 157939518 153796038
16712 153796038 148901437 143696687 138565161 133098215 127009514 121715703 115923991 110465511
16704 110465511 105065689 99726823 94957884 90242277 85523279 81359315 77181327 73271431
16696 73271431 69795051 66120350 62980105 59759753 57080884 54191872 51574181 49346431
16688 49346431 47197501 44932009 42969585 41206904 39323340 37750725 35960090 34691832
16680 34691832 33023851 31642974 30368807 29490693 28104487 27344398 26035518 24976924
16672 24976924 24404715 23258610 22543257 21702238 21266229 20282210 19841101 19237494 18693609
16663 18693609 18101882 17265919 16572438 15984767 15759197 15322637 14921556 14764542 13806928
16654 13806928 13667827 13112261 12914210 12413107 12432898 11812557 11461137 10916268 10637199
16645 10637199 10866218 10280946 9880082 9912672 9639324 9286067 9175482 9016850 8952976 8361330
16635 8361330 8149608 8196044 7753661 7606320 7363935 7467142 7309985 7105362 6966678 6709358
16625 6709358 6929049 6682539 6344710 6360873 6320466 6014784 5751991 5807390 5652764 5498107
16615 5498107 5463691 5565029 5585502 5094979 5128779 4808160 5214877 4844493 4948723 4820873
16605 4820873 4595219 4713265 4496561 4168777 4417305 4217894 4238860 4193087 3663569 3740087
16595 3740087 3702733 3540397 3877940 3701353 3287898 3652127 3648575 3714372 3339099 3370263
16585 3370263 3095627 3229029 3281832 2920967 3283760 2980275 2972799 2477142 3236577 2992614
16575 2992614 2787098 2727234 2627729 2854114 2780247 2714155 2899236 2431175 2673624 2336689
16565 2336689 2733643 2584377 2578232 2783732 2423093 2276478 2393563 2287381 2465213 2404456
16555 2404456 2402340 2210130 2074123 2251376 2166212 1980664 2323315 2070552 2174100 2235491
16545 2235491 2125921 2066546 2003742 1790912 2122011 1730899 1762812 1850226 1666318 1744389
16535 1744389 1942038 1717983 2015919 1672821 1809580 1654456 1638019 1566922 1384422 1990889
16525 1990889 1607046 1498819 1547480 1400560 1849100 1539444 1664476 1192039 1825365 1546853
16515 1546853 1377572 1483315 1584528 1402375 1455597 1406222 1328435 1317495 1483427 1360573
16505 1360573 1426760 1322103 1132089 1149467 995264 989780 1198523 1338289 1459887 1307822
16495 1307822 1236470 1443986 959060 938084 1239751 901077 1145831 1215646 1039429 1121057
16485 1121057 1040082 1127894 1443906 1125444 1223459 719703 1277940 1086827 1230263 1122265
16475 1122265 1055678 960280 918820 942849 997994 1090359 1104005 854584 1105211 982186 1280948
16464 1280948 921637 450514 778422 1053302 1095138 522453 815965 988382 1025406 966264
16454 966264 642452 607776 1037511 983497 783067 787530 744700 755359 569245 969344 593909
16443 593909 996493 834421 630868 539943 1081358 945061 679781 593355 834100 1074361
16433 1074361 650963 618833 709715 653856 754534 711377 780170 856460 719907 825501
16423 825501 575907 630707 806566 876824 716676 669762 880991 362907 544547 460692
16413 460692 588564 697146 651869 758186 698294 362630 748425 252892 525799 746821
16403 746821 498630 916855 617227 692167 171017 902048 762751 621381 522383 581846
16393 581846 481308 685128 645488 822074 368049 608404 592320 511927 443432 77227
16382 535481 437088 631252 581721 -18706 391023 540923 346571 428256 238486 552432
16372 552432 518668 474085 431856 629651 372228 818832 645513 736833 304069 564674
16362 564674 385684 681491 479884 159247 313006 605586 431870 367427 425476 336734
16352 336734 516446 209502 645530 406587 694994 492327 242522 437498 630155 421098
16342 421098 974358 323013 277333 524678 458974 255937 279291 111959 346660 387130
16332 387130 522067 344273 370270 421650 729685 382930 376927 554422 658754 423823
16322 423823 507267 548797 337583 344321 667224 236483 445106 354238 431432 213906 270782
16311 270782 289960 776272 -2987 273486 184005 515197 354318 109788 214219 76865
16300 850639 187600 487225 658888 434236 222654 573836 834554 494972 352786 665991
16290 665991 67553 581759 487131 314147 457883 557335 365219 294145 407966 233982
16280 233982 289086 676059 275075 312253 155438 333264 218376 8561 489462 82401
16269 -37990 417299 302599 344380 123521 218289 80850 305139 299120 269082 272862 530114
16258 530114 246435 123549 375439 325324 373083 54774 269526 68057 140225 424365
16248 424365 67667 301811 176429 54456 238669 -3516 276831 -21609 265650 181954 20917
16236 258367 194286 66115 269673 134561 493579 124209 588868 313120 172721 -77595
16225 -6630 22408 427797 100578 160920 -6941 378198 507337 184939 -262052 552443 115908
16213 177822 283280 75038 340264 -87928 415554 -41168 102600 15522 525831 134388
16202 -14898 169268 87839 -43433 -102169 797135 -36442 311159 -111965 -115503 -60133 177301
16190 337227 85570 162753 251274 -15995 305306 396133 100378 614235 187532 -143403
16179 213383 -50174 99697 296195 577251 211909 55754 223607 317457 381833 343730 -178849
16167 312281 149870 85643 64843 -10428 5553 112615 169474 74113 74689 425673 340445
16156 340445 28236 102372 142196 30161 38751 -183481 352477 115436 315932 349673 64173
16144 156207 187703 184882 48998 -97933 -5576 -218744 105381 142463 234007 117318 26441
16132 -180738 -34984 83808 96332 134364 17178 253037 117424 104217 -86432 -62520 -91008
16121 -91008 66608 25310 86129 179982 90388 -48828 90251 255464 137086 -63972 -284863
16110 -284863 -147333 15940 101347 -348295 386384 120109 241222 31848 350262 102445
16099 546019 216124 358623 184937 102829 151472 255241 39197 58321 18679 290435
16089 290435 84661 -170716 303769 52399 -49256 -231451 -102260 -72705 87507 123750 166686
16078 166686 225355 177502 209030 64635 209562 -34537 50737 444045 261563 137322 -288230
16066 -65795 -179096 -327440 -25459 -66772 -47378 62302 -120882 -80858 67790 -144569 190463
16054 248465 411779 377252 -162931 13610 -231185 -340127 76756 95017 -160963 -3043 294293
16042 159020 257845 96778 28639 -280890 -55111 -20380 -48746 -202048 22613 -82428 -33058
16030 11956 147012 195398 11218 -78829 151625 711 -29149 -36035 -15716 -18097 -214914 -184306
16018 -184306 28257 -23318 -152789 100217 -235403 -256890 143239 221875 -166445 242467
16007 -41601 22924 314833 -60443 -38968 -108824 324658 -197241 130569 -10720 -29209 -214764
15996 -214764 -202299 -136712 -87759 49220 117920 -22757 -82864 13211 244883 391216 100764
15984 378587 270072 135241 265731 260699 -122881 -259223 -42839 -73456 -173185 -293421
15974 -293421 -24099 -350203 -10591 -104781 1218 15035 116110 -413715 -425058 -315807 -37370
15962 -37900 222496 -48355 571887 -66055 12381 310860 47812 -17562 -70613 -27327 94440
15950 -251132 79056 256873 -186591 84122 -97617 -243047 139113 -252369 -241414 -195519
15940 -195519 111659 -153126 -60253 6699 -63125 185935 -129883 -17309 88070 7265 -104944
15928 -82849 224279 135924 166944 -1240 -162050 -63367 204067 -60519 134102 169672 -449381
15916 84116 443234 222980 -140844 1319 77369 28249 -90937 158334 -200638 65344 -33956
15904 -252624 30879 -309310 206540 -48001 25232 -75878 -18924 -49799 -59199 30871 94251
15893 94251 105 186402 -88096 -244015 207175 170098 183272 19841 -20490 -178636 158684
15881 -63221 109011 -144687 234852 -142498 -137258 -198254 57987 -232245 -194858 218733 -45288
15869 97532 50930 8715 30615 -175527 102198 -173188 -357479 -384592 -170012 -183245 -32277
15857 350543 -152439 -121742 -23465 317445 -92918 -156909 -162721 130327 -172891 -77927 -109307
15846 -109307 203589 92347 66457 -38751 -123980 -14713 -75203 75376 142476 -2153 1164 -7738
15833 -100251 29602 -89643 -20309 -348492 297204 -300441 113941 -99384 50322 7771 -81919
15821 22279 -25401 396318 -247490 136716 -177833 -28386 46911 -85091 112567 34306 220282
15810 220282 118501 -133376 328687 -53296 49282 -205640 -36828 -16880 180920 10464
15799 -56347 -77034 -136250 319574 -158725 -73831 -96372 -52038 -32531 231455 -108501 -111538
15788 -111538 157906 228272 -32576 -56824 172367 -241881 -143897 -330575 -99042 -89050 -37793
15776 -34697 -188368 -349776 129027 -133017 109919 254131 -106688 75762 -315698 -6727
15765 -4958 4043 237731 78749 -45031 129423 -26667 -15624 -11501 -2014 -109065 -44363 -139305
15753 -139305 -123384 91308 208827 -34139 174366 -185691 -182500 15542 307843 -180256 -111093
15742 -111093 -164741 -35472 -166303 -343187 81877 21310 -328122 33969 99005 -66309 -167883
15731 -167883 -72991 -98367 -132137 46592 42124 -80676 -226720 -19635 98604 -353558 -148256
15719 -40488 124605 -139430 70926 -162919 182128 -151213 -104590 -163398 -11125 191594
15708 25858 144387 -213511 269175 -173867 -397146 81653 -104717 -39964 105678 139636
15698 139636 -147212 -192287 -67173 -69049 141454 -10026 -46634 139381 -92603 -4784 237924
15686 130688 307898 73459 -144568 -19808 -18527 150189 -15616 -97624 -151549 38274 -264025
15674 268033 45293 166758 72003 449443 -99051 38035 -79553 -30242 151051 -62958 147851
15662 56981 -21923 -237624 -38189 -121958 -331561 59324 -175320 47719 29882 -84001 100036
15650 136871 30722 -13304 137740 148602 -57265 -86545 -130814 -74578 -434251 -40947 -204067
15639 -204067 -195335 -32290 -420620 12036 -295995 224642 141651 110060 153019 5880 40965
15628 40965 -84319 60951 -416548 34187 -212784 125159 68927 -207818 -7494 -149000 124563
15616 -20586 138370 -394590 -146053 -93589 -143250 198722 -400654 21711 39913 -72121 -19264
15604 -74575 -166720 105755 -95324 -22002 358425 18823 143292 -196146 51394 -301228 -90466
15592 97001 -111918 17696 -86250 90442 35325 197266 88409 -201511 -217203 -67187 -200082
15581 -200082 176554 38116 25153 113835 -219190 -50423 -318869 -255592 10040 2907 8244
15570 8244 36643 -119745 -216161 424808 -244992 284407 -344271 284986 -265503 -40181
15559 76230 351884 145753 67603 447356 -59433 121261 625416 29969 -101146 -153206
15549 -153206 51957 -60636 -157115 -1083 104393 181633 268084 187277 265309 108621 109817
15538 109817 114717 17778 119834 104942 -87643 150515 -210379 23002 -48089 -88272 -287463
15527 -287463 -169574 119415 20302 193486 407976 -63125 18469 -23619 -102642 -8925 476092
15515 -22090 -80089 -312647 111247 188696 161914 -17135 -322354 110776 33165 -49527 408641
15503 294581 -203781 240238 -73526 131522 379297 -10550 43975 -324696 153602 190434
15493 190434 187208 -206397 72391 -266278 -292324 -72455 -33429 74829 -90839 -25458 109491
15481 200613 228628 -218898 -84541 -136580 155444 36971 496125 39650 -109474 -109615 137673
15469 161343 183348 -74369 -6564 179525 -82972 -143731 -18861 -234210 -26034 280006 -64156
15457 166823 48737 221503 -51955 267810 527100 98431 -163054 -139827 421621 227882
15447 227882 -223876 7269 252582 -167552 72539 -265558 -196958 -20930 -65227 188868 -121648
15435 319583 6831 83698 -45087 51567 154170 169747 -41312 288835 -134888 11480 158260
15424 158260 -92709 -204856 390071 -6839 201127 -126440 -60582 -181415 -378843 200720
15413 -7710 313841 -68753 22914 339 377385 88611 -130939 93694 119923 -162667 21961
15401 -111988 -68212 -170724 -154008 116210 251233 -16851 -37967 41913 -138992 234017
15390 -302629 -185529 -127100 130457 -137531 131890 218838 -151062 -3618 40538 -11452 -280240
15379 -280240 276571 424162 19982 -406395 -143681 -70604 175260 181854 -7457 70312 -184576
15367 216856 -163388 -278670 -65114 95709 22170 -337081 -24175 363307 31173 -12491 -324689
15356 -324689 -6896 86460 -6988 -23661 546455 -67478 -22726 185688 84412 -10687 470326
15344 201127 22226 170355 -35292 37131 28625 -113238 169822 -81050 51773 206928 161415
15333 161415 303581 256289 223191 -317723 -204336 96020 -189014 -133530 -87878 153729
15322 91743 471533 -186369 -88045 24601 157957 55369 -25486 -19284 491039 61504 55493
15311 55493 -188043 -111429 39533 -107504 114511 -101077 -294179 196242 -314370 -120084
15300 8144 248840 -115768 -88933 99381 -1279 315027 261676 306384 511512 99161 170101
15289 170101 -40352 169846 197503 -151728 121673 78181 35972 -260436 -258493 331156 178202
15278 178202 295542 94386 -168740 -331468 -36240 359703 -35406 104832 217751 194317
15268 194317 157063 140988 143217 180919 190093 91034 8663 70945 114791 254184 -31995 -26672
15256 -26672 149164 95847 112879 462842 351233 245135 182706 37543 81968 172137 307148
15245 307148 17237 250888 148563 195320 321487 -65648 154660 202193 12744 44489 291485
15234 291485 -223058 -101060 147506 68953 -311270 81737 200004 34825 7129 133619
15224 133619 -23007 -139250 -135025 47628 44512 -57468 108348 207167 169092 20097 165145
15213 165145 8042 293257 301388 -120195 -118509 140943 14163 198171 -235217 238722 -156151
15201 198698 -50142 147776 310700 312781 122758 236740 26613 177195 -53390 -33354 316331
15189 322511 342169 70949 283327 388872 189541 320881 113365 -11676 -207822 -23093
15178 286374 167920 -34381 182494 243626 205644 -375316 25728 56144 287048 -79775 21899
15166 -49648 329888 375025 82096 315292 303614 224506 3756 256637 -111743 71316 153330
15155 153330 -274164 504768 334655 167618 106536 219271 61107 331116 392788 420617
15145 420617 -223100 194051 233658 -128609 231857 109576 506613 214784 337790 312364
15135 312364 -330034 157307 75924 61034 16774 788 198416 -24366 492262 37033 230705
15124 230705 -88895 141208 338877 -146572 8486 270417 34884 201930 282716 -116319
15113 -72356 315543 190346 391777 344177 -199061 491103 214069 59630 241773 124307
15103 124307 257374 476973 150604 483264 251436 390888 344751 368627 -76651 106441
15092 179783 87277 -91120 315116 288198 194051 -175386 79868 292853 113901 280510
15082 280510 216962 269293 -173659 254634 12830 -110931 128305 399281 127462 364351
15072 364351 -176748 295196 121949 217226 -51626 365793 139760 -7342 43001 24174 96955
15061 96955 673016 272027 199456 -264197 239326 180691 -90731 246091 146458 -77830 324190
15049 -37019 171515 -35200 166901 147903 296487 -134935 352664 131616 -90596 317679
15038 102854 116619 -27057 -138827 9038 275982 64993 367246 306516 251101 18393 -10713
15026 161126 234169 -13094 130296 438081 273865 367041 93069 286822 391879 302318
15016 302318 252246 322032 142902 152341 304953 197787 326726 -15958 466713 173423
15005 321185 442988 281372 132204 279902 431556 123619 251397 315337 292439 349967
14995 349967 381470 19139 382259 221808 221200 10401 -226057 46336 47746 571413 -53551
14983 85681 65976 362124 149212 156121 173467 27053 211160 368658 300112 498886 96497
14971 402059 89116 305254 286752 380839 165027 137505 74427 175040 478828 225727
14960 320204 146585 215176 385561 279265 404457 358165 500201 246812 354377 259446
14950 259446 -104566 126378 79828 2246 134791 450458 844257 142701 421784 197685
14939 233859 292907 207401 335203 321771 191059 259638 414084 377428 60957 508042 91574
14927 256928 333533 460104 329360 366761 408579 440620 352857 443837 567713 336099 431113
14916 431113 284606 45110 150137 434448 109792 248670 466582 620103 423049 296403
14906 296403 464468 500417 480211 19234 486117 414366 305678 189060 232872 179132 244993
14895 244993 217114 285627 296957 527948 389381 68195 321117 445873 99280 414773
14885 414773 192307 359768 634921 655401 181753 300879 336969 545223 622209 761961
14875 761961 227486 555008 320332 618879 267206 99900 709033 403321 162847 262174
14865 262174 424607 428153 291258 282582 275926 591710 378679 501441 538136 368435 502757
14854 502757 521170 710400 287983 405277 44854 518183 694558 615514 222784 623145
14844 623145 657339 292750 552634 506745 597570 466240 441885 513444 532797 343150 491867
14833 491867 313473 359072 751318 608417 768332 678344 584089 461050 349353 694185
14823 694185 212988 202456 661389 422021 720171 581878 337682 280896 638738 581807
14813 581807 725453 394057 558394 417237 698117 -30323 481410 599008 460866 111695
14802 619924 500504 375505 483544 456706 664556 683749 939060 725702 585348 606757
14792 606757 788767 542381 610284 744151 590301 653065 698354 609549 495546 667940
14782 667940 640959 571603 362469 674505 768359 514990 716347 928603 612929 320900
14772 320900 852849 922896 378222 281785 480148 762778 722102 656539 647256 876441 345193
14760 611587 561151 755909 655184 540471 1085857 787375 512522 742918 955298 457585
14749 847452 1012698 698337 936774 655540 572630 418378 890085 728526 702707 883600
14739 883600 842154 683684 644263 853230 727599 1049595 821920 627289 795000 793996
14729 793996 926612 774021 867866 905140 991869 713952 640369 1247366 916638 1050804
14719 1050804 1180350 816466 912415 934173 1330547 891222 1235700 678691 949400 1083965
14709 1083965 910872 1062346 963264 883771 837434 1051945 780084 717142 755922 903420
14699 903420 899922 1080757 878152 911278 973179 1217560 1081902 1028593 927962 901420 482113
14688 482113 1309978 1059471 1100197 1140001 992494 917608 1173282 1047855 811200 1328874
14678 1328874 1016218 1213793 1062809 1037329 1037994 858785 1333054 1232225 979108 941488
14668 941488 1170960 996158 1092096 1096764 1268563 1293737 964327 1111756 1294461 1053963
14658 1053963 963674 1002051 1042654 1202714 1132904 1008314 1184044 1095240 1125446 1278364
14648 1278364 851795 1251657 1265457 1185349 1114189 1298595 1031554 1302634 1653424 1166018
14638 1166018 1417103 1224869 1480107 1281717 1512635 1326235 1173000 1326056 1486581
14629 1486581 1633971 1573108 1680653 1357044 1084138 1421032 1463987 1360991 1355539 1379465
14619 1379465 1185848 1565302 1617140 1422654 1555429 1681327 1525854 1514612 1590526 1772901
14609 1772901 1806159 1351834 1195549 1732445 1830201 1833853 1367885 1915899 1360691 1413630
14599 1413630 1621818 1740264 1918717 2159546 1846605 1729321 1855666 2025696 1657723
14590 1657723 2075049 2311527 2017723 1821946 1724279 1630564 2348233 1906704 2119268 2181745
14580 2181745 1991098 2196018 1965084 2377108 2024382 2447565 2101369 2012148 2116124 2574316
14570 2574316 2391246 2185988 2100707 2649098 2450027 2663774 2098729 2638299 2803400 2925774
14560 2925774 2506494 3198506 2929342 3245473 3432852 3866879 3890563 3996976 4757486 5420682
14550 5420682 6791379 9549641 13942039 23519195 36335243 35637218 18570659 8749709
14541 5130476 3533464 2870435 2673192 2497661 2109636 2342950 2422438 2207434 2198233 2260785
14531 2260785 2329085 1940458 2437997 2440454 2360561 2463824 2460340 2649460 2649504 2689189 2879099
14520 2879099 2620163 2741324 3046375 2746574 2829918 2616261 2808013 3052246 2893033 2692220
14510 2692220 2992680 3012154 2941024 3177621 3222629 3253688 2973524 3339306 3099439 3210921
14500 3210921 3388072 3272024 3418880 3507437 3421353 3658308 3043009 3430647 3427556 3389426
14490 3389426 3480336 3606569 3674113 3749813 3759446 3446308 3781186 3775273 3517171 4345255 3951188
14479 3951188 4242907 4153586 4509832 4451195 4463412 4111811 4121083 4097912 4533783 4432981
14469 4432981 4431011 4618042 4793856 4810835 5051997 4670015 5001929 4883947 4686978 5034653
14459 5034653 4823017 5238567 5151426 5378646 4942836 5138216 5525525 5229608 5702495 5505615
14449 5505615 5575343 5752363 5733937 5808140 5984680 5837208 6118536 6312138 6428064 6466577
14439 6466577 6758232 6371676 6630165 6999144 6663557 6621653 6618116 7007406 7055894 7161805
14429 7161805 7380451 7295724 7347601 7594790 7784372 7949063 7759305 7645923 8097193 8204457
14419 8204457 8321304 8517143 8800531 8761261 8909161 8984476 9058333 9208910 9278256 9525518
14409 9525518 9633529 10039621 9912055 9884077 10299373 10306778 10413107 10761056 11043003 10836867
14399 10836867 11057914 11270760 11689137 12075411 11720938 12070473 12350663 12805841 12709889
14390 12709889 12985928 12956947 13474429 13920680 13664102 14050682 14530584 14727667 14344085
14381 14344085 15326485 15453222 15618562 15604179 16374955 16637913 16851485 17066504 17483796
14372 17483796 17932307 18338095 19005378 19046201 19495044 19704604 20227429 20942213 20863929 21508855
14362 21508855 21853136 22390074 22983153 23503460 23529823 24437229 25297455 25519950 26353068
14353 26353068 26495936 27411790 28256165 28531818 29287059 30122344 30734382 31386201 32369884
14344 32369884 33350151 33752103 34884596 36081709 36791677 37828457 38551306 39745144 41047180
14335 41047180 42038351 43403422 44764149 46185734 47571994 49188368 50616139 51955812
14327 51955812 53633394 55270580 57418697 59236952 61161686 63246959 65479518 67777983
14319 67777983 70217457 72458017 75333909 78029942 80786696 83861435 87311777 90684835
14311 90684835 94547852 98099367 101909843 106248958 110646801 115560694 120262214 125885610
14303 125885610 131687552 137253632 143745323 150388516 157465492 164754618 172483095 180960857
14295 180960857 189428591 198818669 208460347 218648955 229460818 240651759 252069724
14288 252069724 264117043 276812408 289940509 303296090 316642454 330470838 344686185
14281 344686185 358367182 371721606 385010349 397666353 409882589 420591292 429970623
14274 429970623 437149519 441369146 442989730 443069884 442498073 443127578 441463461 438358427
14266 438358427 433626347 426204642 416982374 406198137 394256283 381392153 368015474
14259 368015474 353848420 339207510 324723026 310507709 296373921 282797036 269574502
14252 269574502 256813543 244682227 232886507 221794148 211164813 201351678 191636119
14245 191636119 182735574 174296636 166604264 158632335 151420091 144696145 138299693 132843135
14237 132843135 126815800 121368724 115967903 111559952 106878946 102872528 99074332 95286886
14229 95286886 91426306 87806323 84740763 81321171 78688807 75551131 72818369 70454693
14221 70454693 67868802 65545848 63472946 61310469 58926248 57657032 55526342 54404323
14213 54404323 52560698 51097546 49106592 47713854 46384049 45277015 44701367 43273750
14205 43273750 41408405 40241313 39236934 38583514 37486224 36451349 35636372 34381584
14197 34381584 33313308 32629676 31867251 31151500 30296775 29717984 28705278 28319958 27050361
14188 27050361 26773054 26343871 25696062 24902741 24650248 23977993 23356354 23128268 22487892
14179 22487892 22211355 21664337 20797672 20548156 20090441 19999800 19491561 18848653 18525438
14170 18525438 18203525 17873312 17704844 17445008 16867812 16434532 16339653 15868126 15753670
14161 15753670 15180797 15044125 14976199 14573283 14482100 14315987 13951740 13657210 13356959 13396935
14151 13396935 12898265 13206864 12704361 12475397 11931190 12007742 11893177 11833330 11656253 11346598
14141 11346598 11041729 10655654 10864391 10647808 10598022 10069451 10097469 9977002 9847321 9680100
14131 9680100 9490874 9364473 9678288 9219369 9033054 9084245 8741185 8774218 8510522 8552963
14121 8552963 8362434 8235254 8171028 7748444 8174150 8037741 7475446 7604432 7626844 7744485
14111 7744485 7460161 6936391 7056112 6905159 7008730 7122063 6900454 6222527 6546155
14102 6546155 6247419 6488756 6485700 6464173 6112641 6204216 5781815 6009223 5903199 5909580
14092 5909580 5650760 5791821 6003684 5579066 5617092 5770732 5503725 5201118 5410007 5428849
14082 5428849 5311893 5245512 5345800 5077438 4832367 5054081 5012352 4900172 4570478 4959465
14072 4959465 4592194 4339110 4551718 4272359 4554231 4088234 4033058 4308424 4364429 4154035
14062 4154035 4242066 4282901 4380113 4084827 4339178 4106267 3936332 4041697 4187877 3989755
14052 3989755 3761074 3867226 3615445 3461667 3764940 3676369 3935048 3804052 3385759 3523643
14042 3523643 3649625 3429999 3494809 3476654 3367652 3389974 3327106 3377476 3364765 3530895
14032 3530895 3187571 2800962 3204575 3119347 3008446 2751600 3081023 2845750 2880326 2906349
14022 2906349 2950077 2731339 2854805 2888236 2523466 2613445 2270374 2585656 2514745 2776237
14012 2776237 2613644 2577569 2259687 2398592 2147768 2570829 2441344 2851314 2221882 2304029
14002 2304029 2223813 2315087 2393036 2376398 2337271 2351494 2145776 2350407 2452828 2110959
13992 2110959 2484855 2530681 3503265 5224524 9176533 17308533 31812155 38325323 24356875
13983 24356875 14017890 8812484 6385859 5135069 4375102 3876932 3868404 3466994 3397766
13974 3397766 2887633 2826027 3047579 2517891 2759030 2342282 2672572 2466419 2554811 2432124
13964 2432124 2086214 1891128 2461399 2165382 2150601 2209795 1805878 2298970 2032431 2224217
13954 2224217 1909701 1884113 1833241 1859012 2061048 2090126 1991009 1929368 2126717 1922958
13944 1922958 1758089 1597699 1767809 1912082 1993491 2022774 1642975 1965836 1770482 1764656
13934 1764656 1907018 1698658 1946108 1904331 2021317 1577844 1712146 1594266 1635932 1360111
13924 1360111 1604193 1749964 1607722 1646515 1535499 1405507 1879023 1286473 1688636 1580723
13914 1580723 1662149 1338517 1656864 1778052 1579618 1414853 1361679 1462085 1675150 1129265
13904 1129265 1408523 1268156 1161829 1466462 1647389 1590857 1559235 1454693 1307810 1261708
13894 1261708 1457628 931393 1325648 1514044 1482877 1426314 1134047 1437707 1483532 1354301
13884 1354301 1311888 1397287 1237166 1336236 1129303 1660181 1397530 1149883 1094138 947309
13874 947309 1218657 990759 1167328 1242000 957682 1002067 1328134 1242209 973102 1065901
13864 1065901 1010473 1080864 1076376 992658 1009683 1087390 1089650 825426 816077 1120035 1216348
13853 1216348 965044 1055750 960091 1251730 974507 1058059 1016848 1197246 1266302 998014
13843 998014 1362844 1150024 1182945 1126835 1063932 939150 1009486 954909 1156774 1057653 825480
13832 825480 1043792 1232653 1114372 1159381 1143668 846180 1226034 863638 1080044 499899
13821 668127 889272 1020793 838255 1040967 1005485 895165 929747 1059352 1123580 894218
13811 894218 899927 979618 860980 837545 810046 985926 884334 1081740 1021838 948810 582877
13800 582877 969949 956829 652594 1082351 1007142 849437 793475 1023514 887591 1124153
13790 1124153 850511 739126 898451 889075 823034 651878 797777 683078 1215332 572102
13779 745713 679930 736867 633728 716896 477867 719449 477439 771080 809465 495108
13769 495108 682687 817097 775334 693092 682288 633801 785935 808491 769335 590025 572153
13758 572153 564657 545521 648368 643702 595407 702525 456748 502836 788611 969081 342521
13746 772294 609550 657964 313150 310506 492876 558660 568381 479227 609193 648862 721333
13735 721333 763880 351892 724419 196373 633070 319798 463048 884561 429805 497228
13725 497228 747208 884244 962343 517006 538606 583862 661232 670998 880627 664989 630491
13714 630491 623623 529415 819527 461926 637703 496332 644854 799416 687002 386120
13704 386120 521581 751562 800090 385841 620500 346154 538328 581776 410539 656599
13694 656599 447773 663123 754900 585547 626279 777136 753596 442454 912410 413149
13683 420963 609465 266263 406591 672663 252478 657517 680153 552003 478499 439711
13673 439711 415839 494132 583528 414796 84988 515779 272311 408779 649675 685899
13663 685899 180246 281494 652707 631128 295302 485081 271453 -87597 575216 745956
13653 745956 309012 698001 435374 623605 8414 448217 474757 625540 521563 294220
13643 294220 412367 335359 308874 504545 228956 129866 83907 251480 508145 391291
13633 391291 336112 340448 291316 505467 735813 285020 533506 189293 380976 476176
13623 476176 590057 549731 620739 166633 467441 450308 375776 196895 303027 230669
13613 230669 558338 471815 722943 442718 730337 205442 353629 322748 477562 509045
13603 509045 457005 540708 362435 458578 468996 320024 314454 399053 421207 257841 284767
13592 284767 109295 394204 506155 544422 194739 332783 247373 119392 136522 421764
13582 421764 224893 499530 404119 671386 151013 429901 450456 115265 506782 561155
13572 561155 260635 629214 684923 36490 280258 313953 388531 90183 306149 235167 180940
13561 180940 126120 458937 334731 420808 435765 389960 509663 266888 478832 356164
13551 356164 234048 335366 190899 366246 306983 106024 534116 228886 503817 141213
13540 206563 529683 386690 57310 526131 369537 174674 226095 389131 153131 326234
13530 326234 162076 59071 371200 366962 4642 564001 360886 186190 -3382 563672 55166
13518 275435 194676 488392 325328 268938 622635 372470 228708 339516 300936 254728
13508 254728 96404 386395 301820 519370 546929 408119 299381 67887 489125 554589
13498 554589 74306 432897 467585 505301 36066 520582 327137 -24564 52626 145230 183294
13487 183294 227709 424896 268232 181193 41499 277216 443283 501778 85772 202974
13477 202974 690006 248053 669788 269483 357952 -215099 150343 265707 26121 198722
13467 198722 284365 89134 124040 219017 -39768 -135188 372260 -79295 100721 123156 351956
13456 351956 -31928 42735 -107007 106475 516097 446571 394688 -85217 162672 130729 -139162
13444 145065 87279 -236161 176510 94816 318635 434025 387584 290927 329829 -71177 422987
13432 -376434 194499 238584 231664 148849 317402 76527 270051 548502 247591 62310 -35999
13420 335284 541147 144777 374321 167817 137021 53403 362773 413073 295138 313182
13410 313182 125247 -96612 387621 145132 89535 48601 91785 525489 285093 362567
13400 362567 180703 209093 158652 217635 -103151 291631 300474 256097 25771 164068 172074
13389 172074 373224 202009 409383 -424297 348816 206343 149533 336204 378598 114440
13378 103684 114199 229122 24223 -54075 484244 295982 286423 148156 264587 27109 346288
13367 346288 355560 188755 36003 417983 -58250 92222 31990 621761 132147 641917 517028
13356 517028 255516 -120475 129357 367853 301476 381097 213900 451678 465511 479896
13346 479896 302647 203702 375426 530643 333357 306404 500644 428680 -112027 185164
13335 262322 110155 41607 166256 186230 454934 211400 62027 346238 -248399 64416
13324 371347 248758 173744 166350 303467 651634 192869 579284 289453 89904 350101
13314 350101 251681 -18357 360790 112168 177655 105138 93805 118940 144020 166008 139859
13303 139859 278647 24199 130247 47638 228060 96081 225998 116954 60244 76926
13293 76926 -100446 205304 156981 259697 50665 -243619 99360 227985 271179 -52078 163195
13281 289709 123907 126665 349826 -259152 4748 -119250 110089 -54290 311788 86588 4008
13269 14590 180790 -129785 207686 444 68276 138723 106384 238462 201861 79262 -67343
13257 284188 225043 265265 100379 -17587 379008 -87810 87829 -121602 -94737 102753 214767
13246 214767 -15601 261421 -318942 276290 350939 -134354 304901 164218 122658 276113
13236 276113 428937 196596 73020 151291 -61740 -96522 -182920 53153 105683 186246 90144
13224 282766 372520 44808 -50618 -243023 279934 -59901 285794 265447 -266155 448046
13213 31922 46182 117100 51162 66398 68429 6366 -102230 -86850 318928 46581 105886 -296779
13200 -6543 397716 161892 -30896 180783 241485 35982 -242233 575183 55772 147343 43645
13188 114224 75139 -213393 81874 534851 349300 67387 124528 241744 123471 -136841
13177 315161 -32172 26636 114777 -123239 99181 -205213 334680 196608 231708 -93432 106542
13165 141501 63667 226661 243261 188942 -112782 301854 -198317 95583 -69715 53847 -56162
13153 -200041 38039 -92354 8744 109633 -59273 201207 -66101 185739 -127759 113962 -124813
13141 106185 149564 -128080 162277 -90625 277448 191631 108961 100894 522915 35941 -110123
13129 192158 -88594 181270 -126884 -94745 178649 -177547 209298 93988 296626 200095
13119 200095 548208 162443 173604 -55708 -143294 154162 66953 -101420 274123 388324
13109 388324 -95465 -304890 233800 194993 -112437 -32248 -9734 -61202 -20802 251128 74583
13097 105578 84098 -228328 -30200 205523 -230231 212764 38742 -151742 68120 162726
13087 162726 16304 -196072 169047 186137 -49717 -148065 -24400 -85615 98896 108291 -42997
13075 -156858 45953 -108875 -34908 -184908 -238897 -47802 186268 86000 160413 197836 -66046
13063 132142 -15380 -12865 3966 198878 254147 132728 166479 169008 1994 192673 82175 -204948
13050 33052 204914 51069 355512 -50251 -8356 62765 324636 197825 78264 39190 -268658
13038 37453 233784 115790 166138 138706 450995 75972 49780 287045 -76460 125723 -56091
13026 -85595 321478 48770 -4584 -272831 78751 -222588 164301 50573 191595 113320 328255
13015 328255 -51130 -212947 504727 -18112 163910 85040 -122507 94996 614444 57672
13004 -12359 291883 132558 -83493 114233 277981 16030 61190 534893 235955 336155
12994 336155 106395 11346 250501 -86248 79032 82467 -34865 36036 -39473 -40630 38486
12982 -97966 241844 42556 93997 -81725 -298077 135394 122725 -252803 -347946 -12657 -8714
12971 -8714 143627 163851 -124575 -304810 207408 170046 4297 -11419 -216713 16703 -144537
12959 391980 101184 153767 126523 -192522 15789 148604 172193 -9117 293655 -104154 42208
12947 24792 48718 117871 -150312 57779 -199506 209255 142492 270934 129406 -76065 36269
12935 9953 -43149 408950 -44021 -451218 185994 167954 14862 -236192 39460 114624 -243366
12923 -48310 60607 -54621 123922 152503 239952 91159 -90 109243 -50219 34190 -44177 -268238
12911 -268238 -210906 197287 1562 -194496 -229474 -291947 -155824 130480 -157602 199680
12900 53071 -195662 -53000 298258 119750 222199 32081 268356 -221133 -258328 358440
12889 -12569 -98277 6008 -83621 104473 -235639 -75710 -164195 112491 48707 100210 -71966
12877 149028 -69212 68094 -105377 66099 149372 -178102 -248218 -331832 192816 -112707 -80773
12866 -80773 11086 69130 -114489 -97101 80426 -109652 174999 8169 -161599 -4855 137845
12854 -178062 -56856 458681 276163 258969 106100 200416 86841 -367667 59899 58454 -97206
12842 134141 93995 17177 -3975 -123994 34113 318476 -96560 161335 48998 101052 -70285
12830 102566 2561 228348 100019 -62636 -55673 -248858 178855 -141164 442626 -114887
12819 -201287 -173718 47703 75891 -54474 -6753 64716 -381179 44040 -30325 251596 -144323
12807 142752 8373 55794 -119138 -136431 -83142 106507 159026 17681 -49476 198016 -82506
12795 -356092 302421 8604 -108016 324432 115735 -9410 72650 -84820 -20465 -271804 69764
12783 -60123 -17384 -21955 -347954 229279 -93750 -127078 -189702 -128051 205057 252064 -178395
12771 331233 216712 180404 26936 -5083 -274208 219084 111571 336710 -226320 -129613
12761 -129613 166352 -143978 196688 -69003 315159 -147771 -99982 -13369 -30981 -99580
12751 -99580 61486 175885 -67707 -32796 -89874 69110 149869 -47199 -160 -243071 17768 -82099
12738 65552 86861 148414 152033 40121 -249771 -66811 208971 -228469 188238 -79375 327091
12726 -73200 64523 103004 -98297 -22853 303262 -77955 115457 198116 -43997 -55585 46460
12714 106727 17996 109212 209206 121127 222523 154027 -20587 210969 99703 371032 72923
12702 203100 -68124 257994 -155754 -112188 337062 302888 95514 -165945 318832 17837
12691 321420 271975 117222 188579 -151309 -17233 -163649 159928 -52563 183411 63758
12680 -107545 -48706 33552 -188248 15591 -191452 -205417 110180 171721 -151480 -187371 133452
12668 21008 158005 75525 -61743 490453 47864 74162 -373643 124300 103588 78113 -25499
12656 168250 200390 140794 -152403 280135 -24825 -69895 157003 81861 -185068 112383
12645 -56019 291831 70696 95485 98479 -166255 278924 -290779 -362687 -96357 172055 64481
12633 190326 344444 -76464 190715 243596 222663 278027 508752 266372 211202 157310 73028
12621 93951 313317 296894 156146 -122605 368230 -225703 278543 78472 232686 275035
12611 275035 -61506 -288721 216635 -196677 -355367 143196 -122866 -144747 139164 266476
12601 266476 -34130 -111340 -133719 162307 231547 69756 -86153 124835 232038 61384 279220
12590 279220 -28729 56270 -306908 148286 9077 94753 -121098 -48343 -92787 281240 -195624
12578 128154 -117546 -160348 158972 225875 -408378 -62054 95235 241088 11039 81537 -329799
12566 125353 51634 -88716 -44149 83457 111529 128244 70801 219791 78904 347696 -11425
12554 150642 57594 -128616 -134447 223849 73765 218418 71760 62587 -132391 269056 131441
12542 331160 -164036 40556 123815 72445 -79567 -206416 90671 -13920 -50815 -17960 238351
12530 77652 152187 -144008 -77336 17997 38109 158289 192145 241830 -227887 -73350 12982
12518 229736 220669 -115427 179823 39559 38463 19879 -128477 16753 94081 379035 25597
12506 -369735 131504 222044 -10908 223304 -193720 -134864 96231 -44324 -31043 161795 112638
12495 112638 161074 -9054 37574 -87265 -6679 46531 -208534 102070 209619 17421 -167998
12483 11597 -329992 -99977 31444 -76479 237790 3027 338076 238764 -106980 -50418 253406
12471 -21781 -128768 19422 113748 188057 -228001 -132960 -371127 28906 16885 -76814 -121863
12460 -121863 20970 200165 -47611 -96280 -72520 163383 -86471 -138213 209397 -1246 -244541
12449 -244541 81785 127943 92031 -126407 -196047 55799 235364 -260607 3059 -45073 -101539
12438 -101539 92899 144209 134029 76275 -269990 195705 -50213 168744 77811 -75129 75366
12426 262992 -169669 -71636 117443 176393 -126806 62204 -142129 1410 -255780 2147 -184459
12414 -190163 172851 138842 -144395 -93552 -184762 -240697 100788 266337 -48699 13051 -250591
12402 -41568 -277766 77987 -103255 -97738 -24525 -75039 22488 272904 -210094 106797 136231
12391 136231 -102374 -115709 -127708 9010 121082 -276386 49345 43467 119212 -328638 125149
12379 135656 -88338 -82583 293741 106718 -79634 112811 -12667 -101458 -135762 132456 228833
12368 228833 -51445 -25657 -60300 61381 -220800 -72391 -13631 -89411 195543 109013 43184
12356 60818 -277704 -39340 -310617 -204222 -34050 186971 9437 45550 -18469 123971 -25508
12344 -21000 -573731 -17338 -194494 153093 243615 -57602 82732 -22027 37634 -361338 40550
12332 386431 65724 -45827 16939 -37595 -25677 260179 -61447 254389 337575 -33599 108914
12320 471252 14024 -247084 10169 -12983 -263747 -110927 190298 -260108 3652 -30952 189607
12308 43771 109804 -145466 27822 191041 -292795 -101953 -74882 801 16794 126102 -4746
12296 -116431 272438 22 10192 -188600 267266 171051 15204 52510 -54133 290858 399914
12285 399914 -539538 18583 292520 -114221 90742 142353 22027 110933 92480 -13864 31366
12273 -47713 144738 270444 299240 228473 -111895 253854 580935 218088 -200060 -188167
12263 -188167 192134 -319105 -178237 -295926 -83903 382536 -61839 160631 235196 -141478
12252 -18700 114466 -118119 91740 -16758 -10367 -13962 134237 -4387 70307 -98398 16251 266857
12240 266857 154325 -282067 -121372 324825 5025 -40731 -43305 -58840 75684 -34278 29516
12228 73383 283900 184624 170883 -61424 -140616 413687 329012 324277 206391 241257 74718
12216 46588 139040 -61164 61080 109150 -62027 -22428 98678 163135 182538 331917 51448
12204 116989 75936 68091 122009 -208684 51322 116682 295328 -101692 -42301 98873 272698
12193 272698 18559 257039 95081 -41102 95696 66112 -279396 247051 221461 147618 83600
12182 83600 -70784 218394 -38608 37483 203722 296889 -148208 -229148 -69207 -24583 133397
12170 255233 179978 118869 -22527 113574 63204 218708 -158895 332079 -55202 88081 -178286
12158 118687 27715 84041 -177252 -38268 -37664 148523 -201736 218158 -4440 -52633 273417
12146 160428 -76941 137374 -80387 25312 -13410 190430 349636 80412 319379 54709 -60475
12134 182263 92463 -9018 -90841 211629 -43008 177800 -67674 -389831 -324153 25040 96995
12123 96995 -41728 -253937 -68878 -17313 442267 -37821 -92352 220116 18000 108759 248111
12112 248111 18111 -111094 116708 183741 18989 55778 136245 -1110 91644 78120 -51013
12100 200804 -8872 -10434 324389 -177140 101520 53792 -389429 -169553 43050 -368778 -306892
12089 -306892 214658 -38098 38056 -190853 297062 95388 -72826 -85590 -306441 -234887 -231084
12078 -231084 278395 152989 189849 167601 -11741 -237875 34823 815565 619109 458385
12068 458385 68252 60737 296787 343022 148141 158923 -210398 -15405 22641 149049 -18238
12056 274461 148907 -102120 -475143 -59665 88466 126337 -88929 208699 -6849 -216403 66011
12044 -254509 28554 -316311 -26908 296423 35648 -159446 -223868 -27151 134364 103797 -279670
12032 -283933 -102943 -52558 15622 113198 144116 -170837 324510 98095 1709 -3649 -156645
12021 -156645 -43811 -252752 59698 -39058 84274 -76138 -136624 -109848 -88232 203217 -248576
12009 72314 -38838 57073 -23247 278009 142310 39446 67206 -228652 223469 -232418 -308881
11998 -308881 -63951 -507104 61772 246177 148520 26665 -171179 151499 87877 -450243
11987 289013 16620 173729 148807 228908 248200 -19392 -172001 6465 -71455 180611 -88026
11975 178185 -268979 144503 230416 -15364 75111 -104718 42982 136484 73383 -484020 -244609
11964 -244609 -224327 -73088 179141 126311 -56962 32616 -62960 -108341 -162457 -162053 -184885 -23017
11951 -4468 93305 19256 58185 -115386 7139 -209457 66269 -197917 -145612 -78821 -81231 51073
11938 -66730 -110503 -117045 161723 -181355 -223399 21356 31856 -43695 225806 312169 -153357
11926 -91544 72861 195348 -44309 -223433 -71521 26247 -106050 -119597 150549 396930 -206535
11914 198248 -189459 -171271 -132857 172735 74249 -77520 52359 86463 -20215 -54812 -231932
11903 -231932 40266 -8588 -5218 206823 200611 45890 -178886 -116896 -283491 8719 127570
11892 127570 -69265 35489 -219394 -118319 -59622 -139774 -321504 -180371 -64722 69981 -88680
11880 -54204 257860 110974 167141 232542 237607 -310701 -281305 -265778 -1770 -12733 63600
11868 -192169 316654 8820 -100734 -112830 97245 -170537 -23983 -61860 274738 179325 -246053
11856 -16493 -28490 85551 -251513 -65548 -26850 -200568 -222218 -75181 139890 357635 -450672
11844 194683 -75122 -643 -347165 -103529 -103859 -259823 135043 -170233 75099 -3751 61078
11832 246952 -532294 -303469 -17087 100660 229352 -239385 360283 261138 362851 112765
11821 -8611 69563 15333 118132 -189859 -67717 -204173 40834 -347643 -28615 75853 152854
11810 152854 -31619 245578 18367 -44849 35640 -331382 -242514 -128801 53910 137120 78537
11799 78537 -81146 -226066 50648 -251934 -52105 -253487 161901 238805 87685 -920 167435
11787 -269609 226819 79114 15178 107217 37457 -83322 -232640 183349 236434 220444 49049
11775 312814 264245 296080 256833 25740 122222 314220 -12881 -96760 38193 61788 63228
11764 63228 -72650 -62893 -187452 59143 -174582 -145288 -271241 16784 -450100 29893 -223234
11752 256395 -1583 65656 118822 118562 -76545 -41734 -118495 177739 -195549 -328663 164021
11740 -157537 21177 130467 -285945 -60180 31003 -231484 95662 116005 351717 99624 -339953
11728 71619 -13836 -46255 -57431 -22132 146753 1335 201204 95464 203750 151274 35170
11716 -36882 -84280 149826 -50009 21741 129400 244964 56900 84152 138870 6817 -260941
11704 161269 -132411 157141 105304 -65570 -56026 89525 -129085 -26103 53526 -343734 -10711
11692 155740 -77600 -333418 279293 85095 24636 119798 -214273 113274 1460 54824 37398
11681 37398 257719 94524 140586 -55142 -231318 1777 -271405 -113989 343902 355549 -421884
11669 19026 280448 88098 -174837 -28698 -143925 -96621 61909 41498 182212 -79822 -139761
11658 -139761 -25888 189179 76618 -106604 157083 120898 201350 192024 17713 99301 5235
11646 -131174 -134405 38705 3459 -11777 -183435 159785 20408 197627 -118965 241414 -8214
11634 -130786 -55419 -102749 -104500 -138086 57782 119871 -216250 -83804 -74538 9055 369207 -320021
11621 113747 150919 -327805 -184603 44066 -424837 -320949 175014 10109 -246517 -530914
11611 -530914 -118027 -140655 -20441 21574 184885 -139004 -61854 133718 -108882 -206481
11601 -206481 103354 -85565 92556 -14887 379056 446974 234725 -291287 -27180 122971
11590 140769 -171550 -91650 6429 -133044 -141692 -118942 -118633 -14083 36953 85443 165500 -325769
11577 315313 64597 151215 -127754 30672 -171702 352338 12656 -76098 60325 -29744 52854
11565 315845 249478 244971 -198023 79157 37690 92505 -79390 -151991 35255 214889 -193978
11553 -148458 114937 47320 168818 368331 96925 -148679 -300100 72253 25055 15171 39130
11542 39130 -288543 66362 -69768 191860 128270 116020 131430 -227931 90703 293264 290776
11531 290776 131208 -230267 -142347 100579 -125211 -7741 234343 -228574 402613 -6973
11520 193469 41937 -26639 -265452 86352 -139270 51063 157241 225441 -327421 271142
11509 56519 172943 378618 332045 289545 115623 262442 168150 261945 -102640 -114952 220209
11497 38379 -9068 -43154 223131 -231541 171309 97684 246069 -57442 25232 71856 47825
11486 47825 -108197 -159724 154002 -15510 -35608 -171396 200734 -32254 -163329 169889
11475 616914 134108 184601 -59817 149397 -272151 86154 12787 120700 244344 182366
11465 182366 -122932 95209 -172019 129788 286008 -68605 87655 -198966 171352 216333
11455 216333 206354 361134 210412 -113204 158420 68330 398874 147796 183611 329220
11445 329220 41919 82504 184737 135605 200241 -86333 413790 90739 297760 -39920 292491
11433 -107335 110481 53538 -56760 -5020 -79175 123221 -79336 -254938 -868 -121150 103022
11421 -257785 -368653 51481 -16625 127393 15841 -94981 -261298 -136117 180213 81738
11410 108579 153689 -62848 -181398 8534 -65361 119640 34285 260907 -82425 32138 -188030
11398 362495 65743 381372 -202252 305979 22542 -272263 -237122 268520 -17658 -297692
11388 -297692 -23641 137182 -185308 234847 -101375 122724 -163509 -327775 24001 -199773
11377 -184936 -50297 26677 96747 -74100 120550 214018 -99655 157296 265148 -69724 -53685
11366 -53685 154438 162878 101222 -9355 123830 -85651 10654 -96712 197939 -34198 -11889
11354 -146388 -50215 8048 421073 270108 -176456 -126154 -23025 -144175 -95522 68984 111710
11343 111710 -314333 -43672 -20666 113027 83997 -112504 73230 -37144 -337739 52372 -265650
11331 228314 -290978 -154132 -106408 -28489 -102598 72409 -95766 -227546 134766 -134735
11320 -31372 254537 -203024 -31721 165949 -115566 -65919 162329 233933 116415 -94053
11309 -90528 151565 -21925 -2894 4969 -93972 -171361 75196 -181877 76565 294282 -336621
11297 120204 114700 -202754 -162860 -71916 -10914 -50965 146322 -308430 24962 -189379 46103
11285 21105 -247244 289065 -84354 -311933 -105195 -77383 -127681 15713 -440286 47623 -108886
11273 -210193 207 203768 149974 -76655 -2316 49477 211825 141713 57219 121435 127254 -384314
11260 -380785 228689 -164849 -333484 -68215 -37885 313893 -103322 11028 -318960 90977
11249 88919 -345972 399708 -100112 -122816 -150633 -148005 130705 16376 124349 296572 409
11237 -9828 -343337 213763 -7335 -155950 -22776 67251 46994 115583 -64547 -95054 -41311
11225 60755 24173 147765 -290740 -307849 -257498 -18572 157748 -230327 135415 -497738
11214 -11128 164393 361 -210131 -474169 -244007 -27819 -369375 75251 -145803 -49585 -187025
11203 -187025 -100454 19803 150416 -145072 -186445 -192174 -91911 -120256 28586 -72256 238828
11191 -17747 -164947 244968 -65287 -270779 -249198 -205806 42807 -183797 -78174 26942 -362005
11179 -288492 -46672 133052 352899 263575 59965 -73031 -329260 188092 -89952 -167292 -80850
11167 7678 -29374 -205777 -414607 -382917 -8422 -155157 -13759 2147 196003 -289611 274804
11155 -17508 -85608 -119106 64192 -137385 162203 359502 -14485 -215515 -198396 -181578 209407
11143 -114943 129548 -328469 62521 406134 200011 88173 1974 -19292 -73972 235526 74938
11131 -82973 211661 103735 -67866 169002 244552 -94643 -98514 -78677 335660 -41390 120344
11119 172109 282374 -171497 -170420 37098 -170011 72787 -229709 -110406 -208202 67155 48712
11108 48712 114037 84399 57428 129444 104251 399778 195395 140950 500101 97572 294876
11097 294876 119061 -43885 195576 162584 -23511 135759 88923 208614 52877 391016
11087 391016 167560 294312 -104717 336071 347960 365304 183853 204561 5190 427315
11077 427315 477213 210630 -199937 305966 218452 154855 51685 382385 -69771 108932
11066 17195 464171 -8483 411384 543385 643067 329769 351551 366838 612816 742388 583941
11055 583941 509890 467434 313250 472502 686250 456597 806140 691715 643772 728934
11045 728934 737501 393887 530865 416983 790839 503950 482973 968520 615802 644311
11035 644311 685905 444024 737394 693958 793227 783136 784392 951252 703525 830854 589252
11024 589252 348067 524850 725867 640690 536515 563206 318369 433988 411028 839404
11014 839404 487962 664231 390281 550536 534006 549438 794772 834700 479290 574992
11004 574992 772663 554658 417767 492201 494822 738045 654513 581531 516492 710021 741135
10993 741135 547693 577811 823565 477955 793336 702926 955107 1072220 995715 914561
10983 914561 986970 1270629 1317320 1259152 1158553 1825216 1718902 1958302 2383974 2578744
10973 2578744 2502091 2731159 2617898 2084089 2219208 2129246 1679715 1450031 1349019 1102185
10963 1102185 1132845 1177059 1261022 1260465 1158511 1135910 1008965 1145728 970713 668042 846934
10952 846934 426283 472288 322504 140415 -17072 -37726 -54643 341075 -228916 249509
10941 41864 88909 -160740 -133178 174984 246076 9012 -59002 286507 -8857 124450 162162
10930 162162 15419 -17946 -217129 -138876 119493 -122503 -153977 -233012 5547 242979 -103899
10918 -117514 -221852 -204266 82789 22088 43534 -78954 -337813 -122605 -65996 -13984 -55172
10907 -55172 -17986 -176810 147541 24822 104406 134250 119620 35532 166976 -9732 -226305
10896 -226305 250779 -184170 417695 -116188 41345 -33894 -179992 369030 29364 254228
10886 254228 -72340 -45423 -297642 -63816 112271 -292873 117026 80619 27599 -293640
10875 -103405 2994 -225190 24949 393755 -132303 -116848 -149148 -415538 33276 110223 -199752
10863 -366840 59304 -141640 -255556 -235863 -185174 346362 -264024 -87365 -139178 41094 516484
10852 516484 -110386 -171410 -141409 156089 -40472 140216 84370 -162217 287030 -11856
10841 -88855 261904 349409 -123483 -163244 -427263 -48858 -28958 -378270 -18678 -267049 120602
10829 179986 109500 -15932 -60122 -258149 -104803 -80137 -221295 -277577 202933 50392 -122776
10817 -89088 126254 -138336 -93679 -426073 -25274 -94544 -473937 -272849 -180398 -221313 103553
10805 6530 -126488 -359401 -160987 -166380 -333616 80881 -157333 243 17348 -389942 123221
10793 65760 176739 83534 60469 -367912 93779 -138411 -36139 -28590 -118482 -375190 -159633
10781 -165009 -59938 16663 -309593 -199283 69040 -75914 263300 8366 59175 146006 -72443
10769 -93175 79327 -253098 -225416 131848 240591 -80534 -302900 -175176 -533344 266386
10758 330708 -198045 139334 -92828 99136 173393 219085 21605 -271627 -125322 -91396 -154181
10747 -154181 149874 -88028 -96104 287640 -220314 185987 -82971 -95731 -222462 59584 88251
10736 88251 -14007 -303736 221959 -127906 -66207 2603 -102760 -191663 118111 -399749 -192305
10724 -53591 108032 -2780 179299 76039 -328578 -314866 -94887 -472535 -342727 16369 34962
10713 34962 -11524 195435 176603 -157629 -72327 -75926 276921 -48897 157946 -230756 -55370
10701 -366447 108170 -205948 -324518 -117888 337268 -146199 -331258 -307503 87100 -122762
10690 -24190 -113415 197148 -255012 -129171 409236 88659 -98526 -92457 -22959 -58168 94167
10678 -106562 -135211 153710 -370247 68628 246170 129067 190592 -9674 96705 18580 -299194
10666 -314337 -233014 221650 -255007 73246 137310 -212003 -320683 -193429 189440 -163250
10655 -288053 296908 -101265 -139206 -88537 -228330 115465 -268465 80870 -310618 -390942
10645 -390942 -455698 8556 18416 -330820 5531 70780 -149490 -130893 -19806 -406175 86611
10633 94254 -116978 -54945 10329 -115051 72891 39336 136000 -60356 26116 -140305 -223912
10622 -223912 206493 -460957 106759 -162127 54165 52309 289480 -266526 169236 9951
10611 -112322 115803 -86807 58521 19465 -163935 -190904 -97248 -13747 -296555 -155379 -103426
10600 -103426 109273 245069 -7118 -186387 -353034 -311607 113782 -170304 17411 -159280
10589 -248485 -190056 -261617 179217 -75509 -8660 -184991 -301385 200109 142727 8679 -76839
10577 84438 -40477 -92183 -4265 -60850 268806 -161402 -145308 270243 -186914 13415 -123411
10565 -74607 34521 -242726 -62738 -82098 -378861 -301724 95353 243331 500171 -377475 -287984
10554 -287984 82050 -134794 -74644 225641 105118 -277966 78430 -163027 -142877 -793 -197514
10543 -197514 -296390 -747 338979 233781 -81415 -190353 -366125 -207177 72696 -55243 -17851
10531 -279027 -42900 344377 25510 -292200 -43756 4060 -93888 46370 -80375 -9815 -50981
10520 -50981 -69200 48141 94816 -69324 95642 255679 14823 -110375 -402672 165826 -67189
10508 12167 -111338 -56404 -139780 271370 153996 -413662 -429232 -279225 -90134 298239
10497 326039 206780 47535 164179 88717 26392 -351398 -92602 -131552 368133 332012 -81290
10485 -131457 206350 124547 236418 -51824 204534 180052 -136452 220621 304750 -146744
10474 -80690 -44162 -181512 -130786 -218538 -259743 -96951 32320 -240999 -468656 118939 125543
10463 125543 62666 -217265 193564 -61375 18355 -59645 -131994 188823 138289 -83023 -14182
10451 -293373 -117821 -215918 -259914 60171 270191 -155703 18235 281249 -35967 -106482 -194399
10440 -194399 83877 -171726 -155157 305413 37247 72788 61730 163716 -97216 -49803 118241
10428 8273 93687 -366154 -254881 199095 -480892 -16819 -234968 337591 -1358 -11485 95606
10416 65274 187388 -426562 112048 -179965 -61082 20788 -53104 -77296 -121618 115645 81047
10405 81047 -169181 -156984 187466 -304932 -102456 -297353 -53556 -33270 277734 -134251
10394 142464 36205 40233 -67564 347765 51316 287543 135537 44981 64693 68946 193637
10383 193637 130399 117731 -102931 98369 116467 233376 -98355 191272 195648 119324 -47902
10371 249937 603907 77104 564129 400343 376002 573944 268130 131018 489588 217723
10360 620602 240607 -4985 -22163 22347 242983 -52494 10514 195249 496162 578470 522920
10349 522920 157763 363503 106918 261932 -210622 496778 308504 434284 39289 287114
10339 287114 152787 404349 70793 -9567 470851 20239 -116803 41123 338148 -5278 128893
10327 27561 -41458 125917 -88659 269019 116615 208332 111643 182017 62909 295088 25936
10315 -65585 31307 176459 22941 178577 -64785 -84403 103645 62885 -78238 -140560 111702
10303 -109319 -187415 1325 -33079 -131308 -153270 -37606 162803 151761 -14935 7923 -6118 -250915
10291 -250915 -42822 -311280 50840 143416 223803 232733 -297342 -121949 -54583 -25276 161326
10279 -88556 -187641 -71664 79989 27949 -42391 175768 -189915 68582 -228891 -214941 -5805
10267 115422 -125808 240482 82079 -191014 295216 81677 281635 134290 182714 119225
10257 119225 -31088 11807 -22592 287226 369050 21231 167438 97567 -13384 159521 -261539
10245 100725 -77885 -138724 174144 235064 123155 -168325 -163715 -102953 -176423 -191890 -49711
10233 188909 -269194 67015 -269840 129639 84184 67693 -5412 -236578 -98349 -212185 -221691
10222 -221691 -241969 58558 -162863 -111318 -247346 -185787 29663 118648 201669 186955 171575
10211 171575 93574 -154685 -252249 97537 -279941 -409561 -63705 60143 16893 86921 -141199
10199 13046 -90759 -182120 -79750 187931 22767 -300733 -353783 -332304 105489 -202784 -196189
10188 -196189 41272 -206742 72317 -215865 -7646 50523 117570 -48535 -165402 40085 87987
10177 87987 213219 -217621 -208206 -415204 -105354 -244766 -83731 18466 36012 69341 -214867
10165 101157 -95450 -211038 209083 -271028 -361854 49528 3975 -17017 307952 -29202 -148950
10154 -148950 -237182 -96623 -39495 302717 -162356 129369 -80096 118008 -23729 -181593
10144 -181593 258027 -379917 37720 -359043 195534 -631795 -510386 -225133 95399 -7065
10133 128675 36237 -84018 -237147 -188707 96041 -244427 -62251 38745 85626 226679 -7188
10121 -216695 -71194 -56040 -135253 -100137 -161304 -126222 80613 47311 -62103 88892 -288439
10109 -238776 -24880 -6234 134331 -158758 -182240 28859 -97719 -243279 -341853 170504 -220053
10097 -178338 -338361 128279 -56116 55280 27985 106595 -239188 -27544 -206349 123887
10086 -49014 -293006 39572 -109332 136420 176796 -54251 -207087 -57946 -10763 272378 -190364
10074 318474 115820 -101312 108102 -279898 -110310 86093 104580 38036 -117105 -316158
10064 -316158 -10863 -146998 71250 -2871 88773 -199414 -44062 -10006 -129366 178317 -23809
10052 76850 -393918 267321 -63473 162738 86017 83151 -61874 -272027 -317058 -215529 -26853
10040 -44467 -250089 181175 75376 228136 -104272 203692 -205174 -83923 141841 135302
10030 135302 118770 32754 266480 118354 -212352 -60181 -95221 -182694 83019 -94839 -2672
10018 130001 -103382 149477 -294446 -50679 -165334 -155121 -62537 -24821 13627 -43415 -48904
10007 -48904 -84155 155031 -203364 213691 -132277 4163 -180608 -3479 -400724 -600073 -322655
9996 -322655 -185393 167866 -366041 -278853 -78756 158576 -151367 115895 -24477 -251566
9986 -251566 129654 -333976 -53741 -33431 -405548 65553 -88745 -273969 165424 -76763 59265
9974 -175203 187419 -399582 -40853 -353900 3818 -150772 53404 19632 -267725 62203 -271026
9962 -295605 4863 44473 98922 43333 -95392 27571 -383632 -207784 -22379 -462595 -51614
9950 213858 -360649 -50700 -30055 -141505 -387605 50135 261612 -129175 51480 -123584
9939 216963 -121901 89522 113558 -155572 -29273 -216354 -49072 -113851 76704 -166478 167896
9927 43035 92878 -527047 -276321 112791 46005 -189070 -211683 31297 -160873 -126476 -195859
9916 -195859 171957 -297478 170749 128133 198713 -298525 134602 -140659 -40688 -81364
9906 -81364 -225358 -237979 -174419 150542 -386313 174182 -59880 25514 -120535 292505 -150210
9894 -256635 -175897 -261607 -29615 -35464 -192907 -18208 -87211 -76095 -184754 77741 -240191
9882 48219 258106 460956 211689 -137864 -368398 -210772 -347 94921 -144786 -166637 63127
9870 -44589 -307434 14280 -37292 -4537 18178 53213 6168 -53421 -343624 56369 -196351 -151575
9858 -151575 -84031 137876 -65588 -110895 156177 -152233 8778 -330666 226960 -36883 -299215
9847 -299215 -93180 77735 -255719 -20817 42282 -136474 -385451 -455011 -194766 62371 -145137
9835 14824 129218 -75407 -122746 -208776 226083 70304 -186520 43 103854 -381588 77523
9823 89295 -25980 72050 156222 -60162 193712 47260 -149168 -117024 -263720 -120297 -145546
9812 -145546 114289 100694 -35646 -383336 28907 -271035 -67693 -11225 84423 -8797 -224714
9801 -224714 40428 -274981 -121802 -214380 113219 -453926 -35400 -68161 -71440 20976 -212443
9789 79531 -198507 14522 126168 -435125 -137378 280807 -57776 -346337 -141617 316082
9778 154954 -168298 -99867 -56247 -126610 -179482 -94698 276371 -379403 -182321 -60901 73639
9766 76766 -207751 -168197 -156756 -52225 177341 33063 -110691 -284872 -87821 62861 -202358
9754 -218325 -157123 -80045 -285708 -86452 -181535 30940 136187 -94863 -55836 17663 -15912
9742 364465 150828 -181520 -341670 -267478 -148951 -19579 -244343 -27456 288561 -79591
9731 91128 -117542 -283175 -210230 199720 -5935 28639 27175 -95771 -39610 -178900 -158903
9720 -158903 -66144 58745 52855 -244305 -457363 -248199 286987 -91699 143100 -100856 -282035
9709 -282035 -54772 -153042 407712 10934 -148442 276726 -10554 -105944 -215765 35036 73189
9698 73189 -174507 -100547 -2428 59533 222259 -285917 -42131 48019 218627 -11889 -223856
9687 -223856 -17989 66377 308250 -132718 -58941 -250046 -121411 -220698 -30235 -37030 -272484
9676 -272484 -120739 -100454 -522640 166824 -88235 -195513 7748 23095 -169988 -11119 -102624
9665 -102624 -87931 -138459 -17522 94886 -169339 -232147 -109406 -192877 -409970 5208 -380615
9653 -166303 -185530 -178551 -2148 -181864 -197810 125936 -200976 80622 -99261 162789 399178
9642 399178 46280 -296905 -92774 -195583 51040 -317995 -169120 -47747 -283762 -132731
9631 18220 -11291 -78713 -317454 -16108 -193624 106624 26060 -193547 210629 -224850 -29376
9619 -125398 -209319 -89118 117410 -112458 -246909 -342294 155798 52319 -61371 -45270 244623
9607 151990 -52638 217661 -243838 9420 -46357 -199482 -149676 -55169 -6600 -51293 -42328 -183331
9595 -183331 -314690 -98494 -197017 -60792 77406 -115566 -114680 96161 -264470 -45470 217921
9583 48745 -167496 -265255 -378754 25172 98429 103235 -41509 -516149 -339841 -36052 274555
9571 -364141 -155467 -387511 -296042 122260 56289 -14447 -133553 -100976 66272 277411 45999
9559 18151 -79821 -30508 17213 -80973 -214632 83689 214574 161824 108676 -585 162427 -194489
9546 -506073 -292953 72200 313042 -350400 -118872 -178188 -434003 158377 -217467 -216692 -42673
9534 -73242 -240031 -390344 18526 -199385 -6099 -31006 -123592 -450551 192406 -108533 12944
9522 -63440 93458 -265308 -240085 -34982 -12030 -30007 129951 -195124 -8287 184993 12460
9510 -111785 -69244 57245 -51139 -199908 -328758 -170736 162918 52647 -53671 235354 46490
9498 -106335 -326196 -256036 -190750 -257727 -9837 -93381 39388 -169393 -298901 64135 83206
9487 83206 236789 -100812 -45415 -123512 -12869 138889 -4321 -71968 -188481 -101281 -55307
9476 -55307 218581 -192599 -176865 251652 -404824 -337702 -4982 324717 -32325 -355217 -24243
9464 -267702 -254863 -280299 77504 52744 -71811 191113 -129498 -23719 -191207 32724 181870
9453 181870 98891 -61439 -27352 -364135 355582 -62726 -56829 -89293 -64571 -288967 -299119
9442 -299119 70977 41305 -59560 -176460 -51583 -64823 -105634 95387 234987 -233263 71047
9430 186591 -131336 -81549 8101 -234483 121310 68241 -81224 -69433 -158624 65903 133685
9419 133685 96331 -303550 76230 -208297 279241 -29485 117436 -455380 -157814 -321478
9409 -321478 -8782 -276333 206151 -219307 167678 -56418 -37898 -151258 -10720 -150261 -8863
9397 123347 -10462 -235861 189276 -108790 181248 -143989 -55914 221374 -13804 174463
9386 -3257 -303870 259125 -41085 475 50964 4672 167819 66252 100875 144484 -236890 -41268
9373 -261373 146764 112180 -290605 -251456 50606 -322956 -153769 -152432 113621 116337 -209027
9361 80020 -115023 -44252 180593 -117315 1789 -9816 -320790 -44351 102014 -247607 82750
9349 -142781 -117071 -365909 -199467 112046 -258967 -278599 140113 250996 -208321 29283
9338 -194312 -121108 -57732 103340 -206087 88538 -75076 -98602 185033 36760 -106581 -40979
9326 434780 -27146 -200960 -9950 -70216 -504779 -205010 -33284 -307547 99167 -49707 -14248
9314 -120801 -167217 -20999 186260 -80341 217010 -64620 -161347 -115070 9123 56886 -110255
9302 170195 -160183 -59996 -244078 -222473 -124254 -17250 -133015 -155718 -105960 -302682 -205874
9291 -205874 170264 171174 -64918 -11566 -184743 -80083 68349 -183570 121677 -91875 -154356
9280 -154356 242047 -205117 -48993 61058 -90944 -310596 -246584 24471 164293 -136143 -34559
9268 103369 -171331 52784 79123 -161042 324576 -109644 -311141 135821 -146138 6610
9257 13975 -258074 161038 -166175 -168917 97512 138041 21301 -34170 -36126 -36426 -271496 94499
9244 141129 -134728 162284 -108344 -273903 -272364 347551 -204874 186164 -218850 -89612
9233 325501 148753 -12029 -153091 236644 -497928 -99767 15397 -156263 154457 132930
9223 132930 -235919 -217820 -371898 -183881 6091 186217 26134 -144740 106029 40573 -327672
9211 136653 143313 51380 -224384 -137288 -161658 35411 -57998 170414 -7187 -405466 -267194
9200 -267194 -23330 3440 89483 -28146 -124596 182133 202247 -183636 -29335 -343196 -112785
9188 25808 83383 -278837 26587 -149244 228383 -452224 -131806 82799 -166752 -159108 35019
9176 -233309 76058 135092 -217025 234891 -33078 -339606 152640 375028 -133519 -334558
9166 -334558 -42663 110498 -51442 -274036 -52032 -233497 -184886 -12131 -75975 -489710 482674
9154 -28460 6925 -22991 -190068 221617 -33777 170862 -155704 207612 37682 -58639 -162387
9143 -162387 -379272 169156 -280860 -294962 77223 -193095 -62526 124143 159974 -210999
9132 -92886 63540 -91868 -124670 106633 -480539 -548606 -38069 -34704 -280479 -125705 -484754
9121 -484754 -355106 -64706 42788 -165659 30264 -207836 -16390 126610 127070 -249161 96258
9109 -226007 -106138 117927 -233882 171779 112337 12443 -94315 114565 -362084 -1228 -269811
9098 -269811 -155652 -299916 -283360 -72617 -27391 231058 -50570 31359 -162572 -238012 -168906
9087 -168906 -56227 66785 250072 -90574 74502 -171938 221043 92088 -108591 -320397 -183792
9076 -183792 -96973 -141908 -231961 140473 -253582 -189294 -167454 -196664 62539 -10140 -199133
9065 -199133 258713 -187017 -193964 107621 91370 83363 -152914 -68183 -253600 166238 260418
9054 260418 41949 16627 -125921 -18771 -208670 -327028 154619 -152703 -267485 -394580
9044 -394580 -14592 -263151 25759 11701 5225 272767 -185223 40087 82174 198016 -59951
9032 -180005 130609 71187 244019 11709 140018 232323 5185 -63268 -31715 -360436 41251
9020 -267843 229855 -125597 -175237 187762 -148926 -211135 -129099 67214 -105353 -86952 -256284
9009 -256284 40760 -68000 83335 140481 77008 103711 -151650 -124312 219423 6410 23126
8998 23126 -26745 -214634 -62608 203275 -139805 -131191 -5916 -271814 -101435 -70415 10539
8986 -82331 -229767 47487 178646 22811 -326802 -359381 -26497 -68178 -18998 -85903 200412
8974 -245736 -129591 -183215 147782 -178788 -410874 -120029 -95574 45526 -66909 69723 123030
8963 123030 -20401 -87441 110132 -244169 -320919 77162 -96558 167375 365945 -253478 118639
8951 -234689 -328320 -93056 -229093 -14158 -492183 -101207 221779 278824 65428 79193 -177943
8939 -114187 79260 -161150 79675 174289 -91110 233789 -358215 -87750 148775 16819 -106373
8927 -11584 -84163 61466 -339517 -70902 184845 733140 660179 88418 -211659 -68066 -5838
8915 78055 -197026 164074 130152 -207105 -108373 9680 21614 58987 238755 -22135 104110
8903 -98504 -172978 -268543 106432 -132764 -405842 140790 -175683 -209267 -50792 -284224 -84327
8891 12904 57821 65100 301830 -203003 -127359 138445 -323996 -67946 -193290 -236186 -3559
8879 109853 -244407 33843 -205523 129189 -61856 114044 19942 105473 -36819 -13098 -99346
8868 -99346 84398 196751 -159429 -518036 55491 63115 -175695 19981 46776 111349 -306420
8856 -248860 50351 -80792 -331076 14506 -427070 110483 103003 25346 -105854 -126482 -16644
8844 -372049 87586 -156242 -124327 -18016 97609 170397 -114477 -233793 -466472 -105819 -261476
8833 -261476 -114212 70085 123718 12586 -92366 -197653 292018 108843 -59644 -351849 246333
8821 234537 -92068 95615 -31438 -20135 54778 145860 -263439 251179 226145 -248689 -313709
8810 -313709 -168761 -160678 -214681 197332 -136451 -61529 -176873 303203 88590 -80024 128057
8798 -31849 -67641 -182725 -73808 418447 3718 -221129 -104272 270738 -102101 -82092 -46747
8787 -46747 36983 -277494 49586 -112498 -116352 -8592 -199948 -476694 30737 97132 132542
8776 132542 -3759 -251056 -256924 -206264 -182971 -33016 302627 -6742 -45095 -365029 60910 196369
8764 196369 -290068 112214 -121484 -216181 -18389 -7263 -209489 -1954 -45896 86047 106011
8753 106011 -60024 -220231 202055 -52681 209778 -264069 183124 -179146 -333792 -177843
8743 -177843 -31184 -123844 79292 61290 11313 196401 46831 -270264 66743 -31169 -45811
8732 -45811 -48995 -147739 233654 -287445 -8708 -437060 -26451 -70403 173673 115577 205295
8721 205295 -144092 -40053 30555 45819 29206 -72694 110032 -189360 154264 61098 -961
8709 -257000 -119470 -214250 -143781 176884 -208782 -323166 162723 -11487 -340203 -205284
8699 -205284 131244 24720 48026 9244 -241451 -232927 -171408 -212696 -19733 41988 50281 -186866
8686 204870 -160815 -50077 -239972 102593 306479 -65420 -346747 -59150 77839 -4613 -94439
8675 -94439 -15602 231463 -37458 -28779 130684 -57789 -22488 118316 -31064 71225 256423
8664 256423 125076 -218084 25291 -92294 -346210 -5083 104427 -22796 -273812 -66593 -519043
8653 -519043 17714 40929 96524 73293 20711 -9798 -644136 -322822 -204375 223194 -40734
8641 140592 46919 63592 55222 167236 -249570 -120009 -178608 78878 50341 -137658 -309921
8630 -309921 -184374 -241340 96908 -60587 273687 -121240 293261 -127035 -88458 189318
8619 -80180 86829 -189102 -32491 36809 571 -6465 310425 157133 -119366 -204235 16779 -206258
8606 32930 66163 -23081 -48719 46173 -22829 217152 -245998 -81924 -99751 -42179 -56287
8595 -56287 -153727 -4880 -269464 192923 -228538 111169 183165 -34319 -230821 -48927 -189394
8584 -189394 329570 -83203 -95882 -115318 -308842 164031 -78139 61604 -291120 -61743 -120131
8573 -120131 -108002 -211997 -324797 -386750 41935 209725 54423 57377 -42507 -146870 -277003
8562 -277003 -239548 166110 44214 207455 74604 -226287 44166 -192680 -152099 -220512 340105
8550 -48993 -83489 20688 -45260 -44885 89530 60617 -144942 204858 145406 -253826 -53250 -87109
8538 -87109 -175541 -44610 86355 -127401 -183203 -56634 236116 -163330 -645 -46194 -83608 55406
8525 87624 -205851 -299666 -263245 82696 -59113 -30086 -276113 -192854 85845 -234291 -391031
8514 -391031 105071 15966 -70851 -233316 22049 304544 77864 213041 -44097 -209876 -266931
8503 -266931 261084 -87250 -97323 -100479 -178529 -40684 -198767 -119697 -215933 -67618 134915
8491 114289 -117968 -207786 -121522 1163 -324498 -258362 -26421 172073 -83066 -223916 -189341
8480 -189341 -84769 75330 -255373 -124195 -51734 97205 -222646 -221402 241083 210765 -193655
8468 -240409 347873 -40130 -171402 -184094 13128 -242922 -766 253906 -15633 -129519 34813
8456 98968 -113065 -49923 -170959 -256136 86686 -38847 57405 -430803 42159 -184229 -182099
8445 -182099 -76180 157741 298733 237248 178766 6444 283343 327303 -386211 -33772 219504
8433 280070 -163168 93158 337819 -51140 228663 251020 -190668 124936 21712 -489411
8422 -191809 -49977 24275 264663 30854 12056 -221198 220148 17000 -203827 81226 -182540
8410 -211454 -242603 -97738 21435 19563 -102022 -174346 201844 81573 -72572 -77191 -210763
8399 -210763 -94207 -135468 40759 21083 -291652 -6286 73343 -214225 22186 -52520 60576
8387 -38461 -308234 -194829 -277092 152319 -289021 262876 94956 -154284 190792 -274460
8376 96266 13785 -12917 117440 -176929 -385328 -99803 -73073 -26809 159031 8345 77491
8365 77491 74790 -5506 -35214 -174793 -69342 -224197 -283278 -42307 134514 63915 128395 45080
8352 -89753 48877 21600 -115241 -27099 -281298 320369 84293 269484 -76353 -166963 87120
8340 84485 -164517 -32316 1538 -129965 24884 -186193 -85032 -114921 -76636 -199012 -147783
8329 -147783 -20877 -48269 132648 -23079 -120578 -83055 333545 -128462 58376 -270942 -210027
8318 -210027 -53807 -154527 -70712 -110582 32478 89742 -185028 -356776 128670 54444 222618
8307 222618 37238 287646 -314483 124414 -346830 65654 -192772 -278189 -375155 -164127
8296 -26124 -25508 -103398 202508 -100183 104067 115847 -478210 283037 -73001 211116 -111555
8284 223033 128470 250344 -12869 108461 -433721 -3002 -160506 -114503 75848 78852 264910
8273 264910 38039 150943 -111849 -197891 -22188 29972 -136756 -60870 42182 31856 96206
8262 96206 117447 257737 -257228 9391 204577 -77523 102940 173513 -36927 167003 -206294
8250 -132785 29163 -261547 -242649 1533 33108 318602 -207387 -82028 -77865 -252634 -135941
8239 -135941 -39160 -1321 58911 277067 -70375 54258 -74076 -322082 34001 -22734 189054
8227 -16634 -111727 -46168 36693 -78927 -102698 390849 -113225 50009 -203774 -197452 -94835
8215 -57765 -72693 31820 -8867 207074 203511 -184397 2753 2333 -31288 128047 -242272 10312
8202 -56527 -192803 -59148 -119019 -61721 -314018 227931 -59831 -82563 199885 -117466 -372519
8191 -372519 -13608 83196 -28574 25026 123495 -113520 376871 -526003 -240176 403548 -81625
8179 -314309 205785 -198236 -325265 -308928 -171315 -210660 68516 -18052 207294 38119 -132096
8167 -240114 137914 -206546 -3530 30826 -111029 301457 43657 -27104 38780 -200438 -170328
8156 -170328 -10186 101787 -138751 -196197 56390 132235 -226343 -59848 144971 220577 -80458
8144 110053 -128284 -110984 89856 71564 211840 -112931 -235526 -172682 -133283 99893 -11655
8132 258616 192156 -99013 -88947 60428 -328837 57172 -205312 -36295 -105752 -67977 -266725
8121 -266725 -160679 -212504 -234756 -115803 -43653 -340138 -262507 1874 -87885 -69120 -200607
8110 -200607 -60392 -49794 -183033 -10926 -307712 62396 150385 270169 -95970 78210 -59514
8098 278680 -434944 19078 -60849 24310 -209931 -209529 -72769 -24310 79552 143912 244410
8087 244410 -138225 62960 77570 228152 167566 -101956 -11372 -99085 -178212 99190 -178351
8075 -119042 -138583 -123194 -296152 -246219 -280 -162550 -199836 -69822 -7113 -1303 85329 -34242
8062 -205601 -24010 72247 16000 -202461 354414 289041 113499 35580 -118380 -116278 145776
8050 25930 107933 79637 50150 -95959 -56854 5817 155810 295995 -70650 -34182 -184957
8039 -184957 -195839 23493 189040 -294992 34458 193609 220811 31611 -53019 308381 -87647
8027 137187 175279 -187435 3250 201125 30469 -299020 151653 14738 -201817 328284 -281895
8015 -38986 70558 86406 193345 93821 -89877 285877 -292586 262325 394735 -229058 60371
8003 -13224 184240 -50535 -112999 -83574 71943 -272860 -60665 -141397 17764 298865 34140
7991 -232365 -134190 -82918 62225 341339 -36605 145401 68557 -22206 5555 305435 -232153
7979 46661 16210 -91798 65249 -45536 -107699 -34143 -99532 -522930 -68036 -261066 -7281 -6123
7967 -6123 82821 1839 -115184 -176305 247258 268533 -62716 -277163 112617 -119106 -170285
7956 -170285 59323 -20250 -87398 -59013 138204 -100766 -277101 248291 83246 267341 -270218
7944 -137925 73572 -35368 -16239 -61956 -7929 -104411 -165116 8967 -159393 -236555 -278504 -95830
7931 -115519 -14928 -259221 153770 -41835 -100326 -136073 -31769 132058 -194604 -205831 38517
7919 -101363 68764 -414492 -272804 -320581 -53492 -321284 -146455 -71900 -61879 -348314 -453517
7908 -453517 -34967 179372 -121728 75279 -206329 -49986 105208 25530 -208420 125076
7897 396758 -249868 975 21792 125168 -65610 42343 -138585 -28498 107089 -54154 54609
7885 -5569 -109953 -82707 231962 41827 290443 -152690 -63135 -408784 40918 66308 51589
7874 51589 -218118 -14859 -138150 36113 81613 -225530 -158853 -362907 -118759 -301189 -171473
7863 -171473 137228 -143185 -342639 113110 -32791 -219582 -261649 90793 114679 187358 -204413
7851 -90347 65365 76584 79919 -6759 85975 66480 -445672 389611 211010 43859 -128037
7839 -26360 -212752 -49780 -22111 -46324 -274918 54141 -30083 -45630 54462 -300727 -36636
7827 -229513 -61984 109812 20798 67 -200179 252375 135420 -79726 -119112 -91799 97774
7815 -43825 48589 55998 -174016 141029 -129191 -27999 -161515 -78713 159137 -126569 280393
7803 141484 -105803 -101549 191937 -223017 -376022 -34152 -340724 -64030 -128245 24752 -94384
7791 -66105 -210359 -360209 -105955 134197 -103000 101488 -51227 58553 156256 26805 -214741
7779 -114438 184050 -31748 -40308 54183 -70342 -271245 -108079 -195537 -82797 85036 22763
7767 -4600 -306264 -244052 73685 181020 -58212 -143086 -179651 134375 199455 217501 281277
7756 281277 -108220 135642 131427 -227944 77794 102177 39627 140249 213881 -133525 160483
7744 42083 48781 141002 -191622 -207066 -18655 38554 179263 13680 -53716 307169 -35346
7732 -22304 146872 -227106 -171463 236989 203169 78199 7773 -141748 -5957 -5582 -171722 -275907
7720 -275907 -261025 -71983 7706 123896 88464 -63437 -186940 -88096 -261247 -23345 51088
7708 33515 58186 -23590 -62636 92164 41028 44226 23546 110112 -53615 -170801 -298839 230000
7695 -31059 229139 6420 -133810 161060 94625 117208 305591 52775 25096 99809 -59492
7683 -225478 -6219 -18885 -192945 20698 -250387 57760 -165102 -274975 -363926 -51818 190616
7671 -184097 -145253 116615 -80542 -78120 -261407 -409368 236711 -29979 -26141 67424 234167
7660 234167 -172640 -80002 90 -127948 -198664 78554 -71993 -39297 49296 -47352 -301532 73712
7647 138546 76594 -106142 -29804 314378 -200747 -109529 -212302 -93011 -52728 223021 -122904
7635 12592 -66954 -112645 -83348 36548 30953 155047 -164241 72830 124662 124519 28192 -257958
7622 116595 -232487 -78925 56811 178646 -247996 -34264 68046 -230880 -269486 -38955 26117
7610 108184 -535538 -45964 270121 132675 8468 -64302 -18453 23278 42697 -97988 155405
7598 204851 25704 -270698 138908 -525523 -35017 -205889 -280121 130118 -6335 -173391 -18174
7586 88227 -304012 -243215 71721 417518 -17894 219920 -87813 -9479 50708 73348 514483
7575 514483 -131599 -456222 -72274 293582 217054 154386 -94946 -174659 245668 -248379 31288
7563 -111112 -86686 -91683 -106476 -4265 -148809 -116256 -9540 55479 76479 79459 127470 185179
7551 185179 78397 213088 29133 -118675 -3452 -209337 -251535 -124149 131677 -119229 -5102
7539 -52685 -146938 -386885 194778 -282287 -440307 -149071 120016 -101897 -54133 172149
7528 -113452 -91097 27012 189424 199789 -40802 -107682 17397 -14613 231882 92514 -15434
7516 32407 175267 -286864 -68501 53361 -40095 115348 193337 -85608 30293 125148 31384
7504 46692 -185428 30180 -297914 -161624 -142435 49925 -295118 -213137 215176 28480 -10196
7492 45244 37477 93748 -175916 189634 13213 -179248 -118 -332986 46242 267883 -185771
7480 284860 -47589 -39748 -40004 12030 -215481 88721 -52103 -120943 -541989 -123131 -125124 104435
7467 -236233 -5822 -68233 264971 46697 -198833 81435 2509 -89800 -422982 -219790 -70967
7455 -205894 30041 227289 76714 109851 -6039 -39012 36913 -337254 -28904 145853 -11882
7443 -200142 261891 316931 112007 324264 -54710 288190 -87595 -55147 -120320 -200159 136005
7431 -55362 -158443 180410 -41091 50119 -51417 -27114 36983 341289 -359379 32992 -311687
7419 257587 54499 -78620 -385902 -7929 161456 -229940 -158157 -447203 -71960 -216185 -31313
7407 37336 -7384 82830 -158362 -173019 -128376 138053 -127890 -312164 118998 -195032 -47493
7395 194880 56194 245412 402154 163074 -144739 86356 338752 -406847 7254 -98419 131497
7383 -209160 241608 -56926 -284895 110022 -17104 211331 163906 -144376 -376804 -266618
7373 -266618 21973 55136 64751 231004 -323145 -80627 110579 -102760 181857 -84221 -81245
7362 -81245 -116113 -111552 134807 -196756 -21835 -140728 -341322 62610 221129 110053 19245
7350 189270 43464 96611 -284918 -172256 157209 163710 -49891 153586 194284 -188711 94863
7338 -368391 -53469 -25350 -67083 420308 -167878 31708 137558 -236872 50717 28966 331210
7327 331210 7685 330228 59481 -168547 -46875 -163242 -205839 -187952 -151396 212244 -52395
7315 19410 -97745 243025 -26415 218920 -140671 -72439 226533 229685 116745 -129906 -257485
7304 -257485 -130744 -22191 -126232 -291649 -130077 -121479 -304918 175601 70544 101485 -102562
7292 152496 -161279 -225635 -177832 -192197 108124 121250 114724 -188879 -142465 -12153 125296
7280 -219573 -74601 -212496 262805 -88650 -96545 -145912 322531 61860 -179535 93033 -158953
7268 6200 116391 249888 -118081 146933 465087 -86400 371597 155891 -201816 -220087
7258 -220087 -106200 -346782 -160050 -366602 217138 -253222 23660 -107348 -248833 -253808
7248 -253808 -44010 45199 454946 217744 -133204 -15202 -27016 -6388 -221943 -140591 -219683
7237 -219683 -161784 164299 -97518 99128 -224872 -12631 123552 -103927 138147 -161741
7226 -331804 -180520 11775 298770 48689 -220917 6521 90536 -159699 64522 -402417 -157382
7214 149714 -55551 -385936 -69089 90223 -93845 85878 -62016 6333 134272 -90112 36776
7202 169090 -219949 223746 303385 10387 152504 21043 84487 40758 -118440 -182371 -143005
7191 -143005 159821 -170736 125633 22322 -16902 -271557 -74434 41429 -180287 343839
7180 -131142 -23120 -192674 -226607 -152253 -123473 229285 -29894 125802 -95094 53592 -82133
7168 11314 -204725 -37250 98675 119767 -189648 -146716 239686 -137959 31276 286206 88912
7156 218301 326053 -51576 106831 -103163 81328 -38267 -278712 -5490 -197370 -121760 -243018
7145 -243018 101537 -304070 -64013 61409 140221 -132217 -148112 -194272 -100429 5661 -45006
7133 -27368 81364 -24966 -201471 196830 144404 24826 -42544 177510 -270180 -12875 66315
7121 -113436 -69317 -441881 -220111 -147457 -3326 76253 15503 188801 -39070 -270753 -146622
7110 -146622 -260962 -81450 255487 -5794 110360 -11850 -189078 44541 -140347 -296836 7341
7098 -210823 -7496 -138871 102646 -138733 53014 -295501 -83355 6688 176606 -372533 -158247
7086 72612 -152986 -136582 51203 -161046 261204 122643 34700 -2148 118282 -58163 -138398
7075 -138398 29118 18150 164102 -235805 61197 -133680 -236085 122277 -128544 -22643
7064 -76921 -19945 -4744 -99653 -39613 77330 -55909 30489 -30839 28630 4589 -226552 -316897
7052 -316897 330866 427510 -408051 203929 96882 -38317 -91115 -194336 -6446 168670 -105080
7040 100007 346433 -1992 166978 -89024 12404 79613 228961 -107401 84786 -235772 -221105
7029 -221105 75478 -123813 -9100 343154 59037 -53246 -168519 -307509 -54631 67426 103858
7018 103858 84031 -82848 -119929 56461 -110666 76992 -369142 -295404 -31103 176655 275634
7007 275634 121280 88177 38332 -423242 -95601 73497 288437 -360620 73669 -243514 129732
6995 -94568 -180998 134939 127907 220359 -43882 -133043 25503 -37967 40581 -237242 195366
6983 -130748 -164158 -125291 -208992 128378 -23130 -358373 -219777 -179382 193303 258253 41236
6971 114157 150688 147960 -89460 111812 84630 94404 183574 -356410 -119536 -79975 151530
6959 151705 -134558 168983 -27580 -214888 185761 -45020 -97974 149936 254181 125319
6948 45513 93578 60449 -21698 -42915 73821 30533 -124494 295674 8254 95372 -56000 208575
6935 125920 -110615 138873 151084 79977 112757 65811 -73287 -123527 -42405 -114938 103743
6923 7861 -464399 -36263 -37203 60846 92259 -80058 326998 -216283 -263964 -163699 -446190
6912 -446190 -301218 17618 -96380 -110747 31872 84224 -38654 -2850 135996 -133688 -22568
6900 53530 217711 99732 111956 156359 -278678 -36553 142623 -325950 -89825 -223152 270222
6888 -76845 -64477 62556 -116516 238202 -355839 350235 -93717 140282 -220831 -169014 -90713
6877 -90713 -286177 -70269 84869 262736 -22025 -108076 88487 -123980 -12356 -104023 -319143
6866 -319143 -151799 -132417 394345 -354742 61886 195408 -40282 -52062 27533 -122353 -147289
6855 -147289 -243688 -312736 -257827 -207557 -45440 -159983 402817 -147100 -41420 73108 -107990
6843 -331156 179751 -4299 301464 24861 -338840 187563 -135148 -134374 -84075 -188371 471033
6831 124611 81893 -137823 -96090 -239494 66845 -211188 -103911 42369 262979 246126 -18174
6819 136481 -145243 -373586 -8871 9201 -82535 -122558 4151 27816 -44927 -19283 -60969 -189936
6807 -189936 51744 -133632 9712 -202940 -90201 25677 -126183 -95751 -118395 231974 12054
6795 189891 42886 149836 -40549 65158 -146839 -195338 5119 1958 258014 -103611 -308912
6784 -308912 314901 -280980 -88003 -119502 -183181 -117369 15848 36667 120979 -455970 174434
6772 -270750 -11042 142061 -81255 -206855 21144 -45910 -52539 -282517 290309 -157068 52373
6760 46331 -4350 -273108 232965 -13981 -176632 -49670 257107 96328 -261572 -8681 181131
6748 138283 -334702 139181 318150 85102 -209201 -108931 31289 -101138 28283 -43831
6737 -191842 109675 -74617 38952 12831 13846 258554 -118825 -140978 -14296 299142 -105222
6725 -105762 -105422 -137039 158013 42998 -32210 13144 95615 36228 -23796 312137 -83072 190554
6712 154989 62478 398163 150960 -171129 -110461 -98442 -4586 364992 120708 46840 -261044
6700 65581 -235487 129232 -225506 -49864 -223459 -84689 80402 -329469 99161 -268681 -183663
6689 -183663 -80989 204315 192270 206497 138061 7288 119477 315253 -391819 112735 67247
6678 67247 73342 -121820 -52173 -441850 132348 188372 -156644 18816 -111856 -49958 -58480
6667 -58480 32007 472722 -47958 -281888 177811 63772 -52527 -337109 86234 247452 -196847
6655 112353 -256779 -26537 331024 -20081 -300716 179722 43562 -211364 55376 16865 134235
6644 134235 240794 -54417 -179689 150400 -147011 -162398 27120 -135300 61 -54911 -192418
6633 -192418 -29564 -287080 -142142 114568 -179832 249224 16458 178641 -240487 -211350
6623 -211350 34001 123843 -441349 -161447 -94140 -42638 137859 -68659 -54109 39464 -184249
6611 17759 -44916 -199719 -192892 -27922 212877 160455 -80370 -192219 15960 424722 -107309
6599 154248 -54152 212854 92269 -65826 -236216 -75002 -124772 -96343 -45784 -535764 -98749
6587 175681 114084 16777 117182 -92068 -341671 145668 184749 -448447 354229 111290
6576 -203595 36108 -25713 -14172 108984 226407 -144 -82920 51892 205251 64349 511221
6565 511221 -258553 77514 50300 191419 -153065 -61823 -202761 -154219 -18737 145348 534303
6554 534303 -130660 -258820 -28736 -52763 -17957 -84642 -249003 191515 61114 -97557 72751
6542 -142136 -58145 22180 41939 -27368 -162080 -383731 -168753 238344 202199 -30246 -176143
6531 -176143 -106436 -327549 -58136 382036 -9861 75794 62644 22446 64814 -78996 62003
6519 -164651 -58868 -145917 120400 -277078 19904 -148834 -48796 199325 180305 -160950 166401
6507 -41508 445628 -57181 202240 -65430 41494 -308602 -97816 -5574 163553 -174226 105627
6495 -40345 7811 -102109 -86007 199623 374222 -129754 -242786 50504 48015 -87830 -133170
6484 -133170 20880 107162 -197207 9837 162222 -40368 13861 -16750 351345 -46908 -152005
6473 -152005 112133 169676 293047 -162326 -135166 -130487 25746 -413653 -59747 -244771 57808
6461 -61569 -194832 -102512 -231124 53926 -111507 150628 303443 -174791 66452 66949 -290842
6449 -158230 93313 -85594 18338 -91073 1823 169569 -75189 196696 -126867 -110715 -18954
6437 -205996 128877 -122977 22694 -171922 -234705 77752 -220313 -69577 122478 446720
6427 446720 -103732 135011 170695 -234239 312273 -181610 -59637 -229221 33799 219672
6417 219672 98603 102431 45998 -319854 -117932 -54718 38389 -197743 59592 128729 222528
6406 222528 -49258 174253 170986 -297229 -363025 183198 167662 72354 -298335 19593 -258556
6394 52786 -302926 -402 -28055 34618 20233 -306071 -129591 7275 -259368 -273308 -297306 140921
6381 -85292 65722 -380254 -25782 -49211 -397266 -230845 -154720 -485614 37598 -122619 -19947
6369 278150 -9241 71318 45387 84128 -255035 38038 -83568 -231473 109920 195685 -143562
6357 100467 -80486 -105813 -273386 -253144 -73368 179612 196804 305046 -235035 27424 45786
6346 45786 -103043 -204721 110653 100330 20062 96018 41340 178231 -182982 76996 -83557
6334 103729 -47605 -94065 177525 -371627 420161 -386464 164295 -256384 -92881 74601
6323 35882 -270394 21846 69051 131415 75285 35305 29010 90488 -201421 70398 33785 -79689
6310 175696 -176813 228608 -63519 -213422 28715 -86616 215374 203328 -144081 -71436 12111
6298 -19214 74023 -196431 151197 153100 -38352 145832 165484 171258 -227973 -62704 -147216
6287 -147216 -16212 92306 -165429 47780 -58256 -177489 -50581 -116691 139139 -61171 -46805
6276 -46805 94159 -92257 124153 -40224 123565 127557 -306007 -278258 -159221 222201 -208286
6264 9834 -149391 -138456 219824 99525 19755 22750 -30776 121940 -152787 -183535 -99059
6253 -99059 115692 -4235 177942 101818 246187 123696 -97026 132120 94433 -275408 150844
6241 111325 77830 24268 273907 195340 60057 -436613 253232 -130501 -2006 -66814 -4906
6229 44459 -5422 167110 151611 -70190 177294 37077 82268 -103696 -20909 69522 -280223
6217 202852 79968 69409 61891 8885 -80305 -446515 98779 -223539 -38554 96050 103551 31520
6204 -14207 -204003 -237178 -42925 -22320 -147380 66576 105972 327825 27753 -31748 25396
6192 -42798 47709 -72090 -72001 -234385 -46894 -36493 42503 222979 -380656 -9042 -113496 -47044
6179 163362 46555 -8182 -225263 305779 -17145 -187392 20562 -142156 9770 -5613 -160908
6168 -160908 -3914 -66966 35039 -78344 -148083 97408 -39986 187217 -33463 41971 98631 -23338
6155 -357629 47701 219593 -166630 -113618 124449 -219654 -88412 -5717 -222780 31022 -26855
6143 -65901 36898 -67023 33454 185010 130777 173050 48408 -144454 223452 179777 369966
6132 369966 164068 -166070 -62652 -163140 -437385 51461 179561 108015 73421 -98818 -127809
6121 -127809 -90842 -134961 237345 234172 40058 68545 113372 -61450 -41046 45366 74428 74573
6109 74573 -275969 -169957 -42116 -18008 -106634 -282284 -39570 -100212 183519 20710 -138164
6097 -171132 -147478 174305 -193533 26094 150031 -103593 -274395 -50618 -237058 68466
6086 -91942 -288185 -148620 -79406 28183 163668 123476 175682 -162514 -245843 -20595 -158883
6075 -158883 -28946 11704 -2935 -233863 -14254 -79042 187671 -240739 22955 -203845 -114170
6064 -114170 -308865 121446 -320921 230661 284315 11998 113800 244862 -40098 65309
6053 128363 -125136 -38203 -249946 62706 138250 129447 74223 -301516 -148484 99147 -228876
6041 -4307 -149455 6334 98105 146163 5606 -6330 -201835 374561 149175 21536 85854 130728
6029 130728 -433921 -203665 -141316 -61368 164570 -211927 116551 40111 -95418 -191265 -77824
6017 169321 80997 50981 236756 36190 285032 -110202 125944 -111526 41181 -23819 -20201
6006 -20201 -46035 -75840 114275 -27058 261940 -127321 -81425 -284203 128330 -449820 -87362
5994 -294986 108297 11949 -207168 155083 131240 -162203 320230 -323689 -87382 26469
5983 -285422 85074 -16522 -438173 117106 309840 -18453 38501 249172 196061 201306 -13768
5971 132483 38332 141895 -18401 -8195 -38117 -170847 7912 266271 56514 -324422 -147655
5959 -132979 -119312 -63232 143948 122263 3726 276363 -171054 107356 -113123 98829 236957
5948 236957 78035 83717 -162750 -159217 -59155 -315862 90771 -49377 -154775 -298526 -84748
5936 -213800 -120794 93897 8111 212992 99753 178127 -73062 -61167 -34255 -212133 89743
5924 358331 98374 101490 -74531 387544 -183505 -43374 -265407 13580 -64594 -161520 -47479
5912 -32490 88093 -6908 -70747 -173388 -64114 -302425 65149 -171351 -55166 378499 896 -197043
5899 -3385 -12564 287862 188620 163200 -94008 -972 232520 -236418 -22134 -202629 56301 -147482
5886 42400 230048 -45087 107234 -87974 -43845 -79280 76540 -17296 1351 37007 -166127
5874 91777 106799 154067 80207 70234 -85174 -48612 105629 -409690 128933 157995 -215657
5862 -205237 -217362 -115312 140809 58233 -147236 -141329 247900 -313250 71567 104236 176674
5851 176674 201856 408485 39000 -221450 -26139 190385 -65143 110712 48804 70215 252971
5840 252971 -13422 -336559 98642 -294249 -2175 8972 22963 109121 -14858 93819 56378 -20912
5827 -384808 -155249 67075 12349 -147812 -499037 -166567 79101 -105160 -322457 -85657
5816 206265 -13648 269081 370706 -91803 -325125 145703 232253 -24328 -14952 -198915 -133711
5805 -133711 -11642 -128282 233536 -78994 191319 26827 28723 256472 139479 126336 -139700
5793 97878 132581 16243 140681 -120228 114464 -158282 98230 8404 -139032 -134372 153831
5781 244093 -26485 23952 240748 -274285 208598 173619 25912 289488 -3806 11616 -80012
5769 216647 172297 -37086 14541 -139711 -11177 -9783 103599 176394 -116024 183339 -88632
5757 -78098 14048 107952 15408 177588 38307 10915 -109506 -179184 46753 -66642 101115
5745 -113808 120954 223284 -120661 339117 293400 -101619 -21206 16452 -106056 -82809
5735 -82809 -43746 294321 61409 219849 162125 21219 418017 12827 -293062 38408 -122170
5723 257131 -158695 135610 31899 12187 -50726 -78479 81041 173568 154925 181279 -84424
5711 90598 576 -150514 20350 248946 -138965 2460 -78428 -296415 58898 -81634 -153095 88665
5698 -152204 7453 -97952 12816 305241 -47587 53135 -108009 -298474 -248680 9794 143547
5687 143547 231090 105358 43339 68359 74406 200201 42886 -91223 -630 8341 -178760 -308659
5675 -308659 23786 -20541 -128009 -208415 -47746 100666 151271 19624 235546 3739 222795
5664 222795 -118433 223055 -126341 -6675 -96729 11139 75183 179880 -81688 35791 -128308
5652 -254518 -64549 -232209 -133817 -201692 24590 106433 87309 250479 -229992 161243 -9631
5640 -127006 -78262 -164333 33572 9462 -102664 190996 -94474 131276 -5581 -115566 -170206
5629 -170206 82366 -137179 -29687 139703 250237 -62155 -12993 89889 -324053 19122 -205255
5617 -300400 -8327 7661 163507 60466 75306 377740 35247 -221815 -209888 -280907 128525
5605 -225891 -132734 -92592 1997 -258971 -339060 211668 -87813 183924 -132880 43139 -253560
5593 -59438 182711 97894 132523 148775 -128715 154893 -192316 -246513 -88698 130642 154263
5582 154263 19294 91221 119267 34052 -522174 367908 -241163 50989 -141149 -176488 450445
5570 161730 -247072 48809 -151470 -183835 -103712 -37909 328954 105724 -249462 340258
5559 -125454 -177450 41806 -177101 -163017 62765 -142371 -134555 296454 157559 9806 -72247
5547 -18276 -221087 32224 -223461 -52222 482705 30271 163948 206222 210816 -3354 184475
5535 -122595 -241479 -121476 -74378 -262061 -234847 360997 -153838 128787 -298031 -208812
5525 -208812 -208234 15427 347235 12230 -135007 -11588 -207923 -173878 278876 -106038 -49329
5513 101869 36230 -44406 -269762 -81263 66624 8895 -33735 193574 180425 -61704 -108126
5502 -108126 260228 35938 -230060 -184564 -164951 17597 227111 -49878 -57393 -194571 185608
5490 58816 -39969 155614 -44508 22059 -100706 -125469 208186 -344922 131638 8851 239966
5479 239966 -28591 -41260 177881 97903 -276511 56776 -462555 20916 -208371 50642 138896
5468 138896 -27983 -149075 120032 -401866 218395 65598 -119031 100200 -119047 -93648
5458 -93648 215546 -162041 7497 111016 -19475 -108446 -75605 97760 168251 96488 -95000
5446 -376361 -83128 35361 83244 55117 -259326 242990 -48270 198136 19033 167626 -23540
5434 -36755 287069 -66064 -7700 -512 -50491 127792 40914 -108760 202163 132363 215161 -13
5421 117082 40076 -123914 83277 83160 216968 -78013 300984 -56481 -91772 258322 -324893
5409 56864 -45878 -14589 -105558 60494 -4523 -11845 -6512 98145 -231131 103849 133255 -26820
5396 314774 -88056 -13327 -99371 -95543 -269842 -306765 -187240 -91356 335231 69676 304875
5385 304875 118434 572869 -144148 -227040 -377008 128343 -100899 309318 56880 -9945
5374 -89178 333884 5761 -427520 143087 -15913 202296 132092 86585 -161771 -161798 17944 31668
5362 31668 116293 -22964 178916 -26172 169583 29032 -108465 -298509 3218 -66626 -265385
5351 -265385 262693 -216859 -51985 43725 -28344 230895 161764 226833 -25118 -66082 231608
5339 -145764 -279057 116793 -53134 64408 177041 231099 281303 -157198 -103676 250696 96091
5327 -70344 -114748 -184922 -20557 -20824 194322 262462 -36242 -132854 58420 5564 4511 -36212
5314 -76053 85868 -216775 -222990 -52533 60813 103704 -222263 -140208 121361 -209645 294466
5302 -265492 -28445 190939 -330327 -31047 301334 -4195 -376094 233520 105294 -19574 -570
5290 -218260 -44965 -374348 215264 194016 -59499 -109689 106728 -150912 -69908 355629 -112011
5278 -104641 -22730 57574 -76086 -28019 -47795 21971 -260421 -337659 218112 84746 15687
5266 138828 -347210 153684 -43988 224716 159655 216020 -161566 224143 93790 184741 300701
5255 300701 130486 -128400 -110669 -81768 -256383 54307 252898 -130068 -117459 231999
5244 310693 13886 -238179 284031 114041 46858 -6445 -88238 77829 136124 109439 296927
5233 296927 199988 -148147 -87181 296843 290144 -184733 227371 133338 199719 188012 194140
5222 194140 -104129 -227452 -157523 -78475 -46314 -87279 103760 -228470 -143729 -99030 72448
5210 103763 71094 -217464 71281 -181926 -268942 -61918 77324 88795 -254152 -167927 73800
5198 33529 -22619 -9281 -1797 -139191 -224777 268516 -172869 57025 -127024 32583 169648
5187 169648 -140667 -108533 18223 282791 20641 110731 -48029 -248853 -176535 56907 154943
5176 154943 -71611 28498 -237295 197429 115779 21885 157203 -42510 175669 -79780 -94968
5165 -94968 28560 113609 156068 324547 166763 -129510 -216829 136900 -67327 -344569 -237021
5154 -237021 -76201 104149 230297 -230204 -103790 -191500 160305 56137 -204282 151316
5143 145257 -329837 108428 -24231 -108687 71326 283339 183426 21461 362508 -94101 -355617
5132 -355617 168224 255160 -14808 152781 54754 -27172 -198400 204014 -193682 140434
5121 -80986 214026 460916 -74024 126238 54717 147647 -306709 68008 -390623 -39683 -174133
5110 -174133 169101 281062 34135 91721 -23563 336697 -115907 23200 -59320 91567 33373
5098 383945 -36866 -12809 -182155 144092 -230158 -245727 22026 -15289 -44710 -32584 79747
5086 -146626 47209 211562 73237 30914 45773 39381 231093 -108605 -315418 -9986 4945
5074 67613 -116334 225266 577214 -90946 -353130 156958 105420 -64002 233313 -46655 42848
5062 185456 55243 105353 358481 176074 -138097 219498 142138 -154626 -26013 178039
5051 73589 156090 147230 118147 -317681 -63456 177109 176265 -90595 6842 189620 27144 282702
5039 282702 -37341 -418034 92430 -261781 57080 -190927 -110056 -63357 -207564 -256539 70418
5027 -89242 -57416 144580 -340811 -39483 -89228 -375067 190096 106610 -410677 237255 -77318
5015 -212364 79609 -4097 204012 -57545 444672 15933 172722 46376 -43445 191401 259613
5004 259613 -113014 116323 -174845 -175430 92924 4180 -92657 185070 302919 -60083 306208
4992 179385 43499 263392 -174930 -37261 -176537 40720 -33113 57201 126468 -28993 125593
4980 267529 -172122 156197 104634 -10845 -24188 -148602 -277211 -242705 70935 -154617 22515
4968 -92319 -219241 351864 -262262 -61076 69356 54656 -223380 -206391 181839 16307 -161244
4956 91577 155733 116254 42425 272897 -32005 63165 -181665 -18890 249455 188176 -108427
4944 -54487 -155268 135466 -8464 -10719 -165858 -103000 -27600 131990 302072 -37543 -226194
4933 -226194 206740 -373926 -51735 -294374 -135750 42164 -38392 166203 -34322 139876
4922 -184088 96434 -24782 223964 146292 -441078 -91093 -7253 222085 171941 53837 -91342
4910 -145650 -341162 144978 6991 10644 196174 67031 -73095 -242010 93061 -110990 83647
4898 124479 -107775 -175321 67354 45323 111547 35209 106616 233190 -118059 -18606 -246821
4887 -246821 -76959 -95279 63863 224872 -200290 398436 37301 -336465 211941 -119065
4876 -121347 247669 -55761 27998 260789 -91206 133357 -76237 101221 -121718 -170422 -44150
4864 -146717 270976 -52047 -13372 43206 -129536 239914 -212428 274141 -164938 83006
4853 146540 -83700 -292921 201495 99325 225355 -66381 -128838 -83090 245535 1346 -36043
4841 141079 -19397 -332543 425462 311100 -170236 -32685 -280807 148103 -187518 82410
4830 195965 -136504 -99757 -175421 208850 163316 164357 215093 -191399 263204 -3312 134175
4818 158640 166363 -73474 -99500 -9401 14370 -164242 -160285 60478 -219325 -8732 -413332 -73033
4805 -69065 83419 -99535 -36792 306258 -74172 196311 -274166 -365295 90684 84380 -143580
4793 155474 238618 -43177 -281111 -294301 60862 236538 -172122 161756 -273121 260613
4782 174224 -40383 195897 -92738 -31788 -141569 31491 93351 -71794 53732 -167572 332405
4770 71318 10400 177735 -313868 79034 -42864 128724 -38570 136424 -78950 -354925 -82801
4758 -229598 123860 -238648 -224572 -44368 -42708 -104692 17178 254384 96763 -87223 -61831
4747 -61831 268437 -121346 -69362 41981 136636 -127507 536298 11298 -240431 60409 -197607
4735 338519 164709 -228950 155971 128443 -16801 -107767 -16780 -90584 4456 40547 81091
4724 81091 154952 278298 190618 -272831 -166785 -252702 -246612 -41723 118441 -69514 110825
4712 -119946 29855 -186895 -121654 -282963 -180566 112093 -187041 102386 -297512 85072
4701 276340 -4419 -170596 -41786 146614 39590 291844 -9600 -26933 87371 19244 -286665
4689 -71432 134837 179572 374355 -42088 -204410 -168593 -15916 109533 319632 -37406 175715
4677 -54996 -23526 156340 -65914 169834 144442 -148933 -253581 -99852 60137 -50928 -133300
4666 -133300 -55377 324095 173888 -209237 -141456 198795 306703 345628 -306547 14975
4655 -388796 244897 202535 -112220 -356003 67805 -141854 -292603 102013 -75956 67310
4644 58291 112311 25993 146249 394096 392486 -43681 -185411 219582 110691 -261197 -135053
4633 -135053 -137379 -298497 -70246 149019 -131731 125300 -156476 149363 134669 13909 61518
4622 61518 152692 123379 283721 -45762 151308 244421 138467 324147 -58707 -49124 426458
4610 -191642 55547 -39351 -102128 -106383 266882 -294735 -170927 151743 -151659 103949 250010
4599 250010 129825 75437 82272 -104239 88450 -48993 369464 -178426 -109058 286592 65780
4587 -43814 -309609 -10156 59317 274925 -210470 -164947 -288557 -38742 -85054 4249 -179370
4575 184295 229620 131754 -21871 200632 -116794 -223762 -284525 105152 205746 217430 305412
4564 305412 116531 13401 88897 -14313 -29231 118261 -24001 303867 353721 -53168 -121074
4553 -121074 -140642 32941 -3053 -116935 386647 -60846 -21127 135584 -249484 -149105 185252
4541 -100059 90741 146526 -5848 132117 -48311 130764 -81072 62665 2022 80092 -175560
4529 45157 -161933 67392 121530 264242 25399 76523 133354 36764 -126455 -310435 -416
4517 151227 164590 -274600 -73947 118453 -133908 54719 -8491 68002 126014 20280 -93015
4505 52406 -264406 247701 -102954 -52271 -97122 197954 176310 224098 -175905 70533 -143514
4493 106644 -205066 -74420 -51094 -132405 146903 133250 -26745 -80061 -62399 -186314 -109437
4482 -109437 38575 245620 123565 -12805 5474 -34302 37213 266487 73484 -149848 305608
4470 -8099 -48799 -196159 -10804 -308504 288567 -103632 -104883 -113636 -111133 -308540 -74721 -88173
$$ [...]
##END NTUPLES=NMR SPECTRUM
##END=
