##TITLE=AC1470_13FE002652_8026926_Jl8XaGtRlM
##JCAMPDX= 6.0         $$ Bruker NMR JCAMP-DX V2.0
##DATA TYPE= NMR SPECTRUM
##DATA CLASS= NTUPLES
##ORIGIN= BRUKER
##OWNER= Administrator
$$ 1.72 TOPSPIN		Version 2.1
$$ 2013-07-11 20:48:19.657 -0700  Administrator@X
$$ Compression mode = diff/dup
##.OBSERVE FREQUENCY= 400.02188249412
##.OBSERVE NUCLEUS= ^1H
##.ACQUISITION MODE= SIMULTANEOUS (DQD)
##.ACQUISITION SCHEME= undefined
##.AVERAGES= 64
##.DIGITISER RES= 22
##SPECTROMETER/DATA SYSTEM= spect
##.PULSE SEQUENCE= noesygpps1d.comp
##.SOLVENT NAME= COFFEE_meoh
##.SHIFT REFERENCE= INTERNAL, COFFEE_meoh, 1, 14.96077
##AUDIT TRAIL= $$ (NUMBER, WHEN, WHO, WHERE, PROCESS, VERSION, WHAT)
$$ ##TITLE= Audit trail, TOPSPIN		Version 2.1
$$ ##JCAMPDX= 5.01
$$ ##ORIGIN= Bruker BioSpin GmbH
$$ ##OWNER= Administrator
$$ $$ E:\/data/COFFEE/nmr/AC1470_13FE002652_8026926_Jl8XaGtRlM/12/pdata/1/auditp.txt
$$ ##AUDIT TRAIL=  $$ (NUMBER, WHEN, WHO, WHERE, PROCESS, VERSION, WHAT)
(   1,<2013-07-11 20:48:14.641 -0700>,<Administrator>,<X>,<go>,<TOPSPIN 2.1>,
      <created by zg
	started at 2013-07-11 20:36:44.220 -0700,
	POWCHK enabled, PULCHK disabled,
       configuration hash MD5:
       C8 4E 4E 5D D3 5C D8 9E 9F 52 82 E0 59 8A DE 15
       data hash MD5: 64K
       E0 D5 12 30 36 AE A0 8B 16 20 84 22 D4 A4 F4 D0>)
(   2,<2013-07-11 20:48:17.563 -0700>,<Administrator>,<X>,<proc1d>,<TOPSPIN 2.1>,
      <Start of raw data processing
       efp LB = 0.3 FT_mod = 6 PKNL = 1 PHC0 = 0 PHC1 = 0 SI = 128K 
       data hash MD5: 128K
       A5 DC 7F 7B E7 ED 16 64 FF 62 79 63 AF 72 18 64>)
(   3,<2013-07-11 20:48:18.563 -0700>,<Administrator>,<X>,<proc1d>,<TOPSPIN 2.1>,
      <pk PHC0 = -80.29907 PHC1 = 0 
       data hash MD5: 128K
       82 E2 F4 C4 F3 98 98 CB 20 D6 22 31 A1 8E 43 64>)
(   4,<2013-07-11 20:48:19.110 -0700>,<Administrator>,<X>,<proc1d>,<TOPSPIN 2.1>,
      <abs ABSG = 1 
       data hash MD5: 128K
       B3 29 40 84 30 1F 14 1E EB E4 0D D3 8E 2A DF D3>)
(   5,<2013-07-11 20:48:19.204 -0700>,<Administrator>,<X>,<proc1d>,<TOPSPIN 2.1>,
      <abs ABSG = 2 
       data hash MD5: 128K
       AC DC C4 A8 02 5B 86 E3 3E DA 7E 8F B5 35 CE F8>)
(   6,<2013-07-11 20:48:19.282 -0700>,<Administrator>,<X>,<proc1d>,<TOPSPIN 2.1>,
      <abs ABSG = 3 
       data hash MD5: 128K
       46 C3 BB 44 2D 5F 98 94 A0 37 15 B8 34 7E BA 1C>)
(   7,<2013-07-11 20:48:19.360 -0700>,<Administrator>,<X>,<proc1d>,<TOPSPIN 2.1>,
      <abs ABSG = 4 
       data hash MD5: 128K
       10 6B A2 C1 4A 3C 7F 1F CD 49 16 0D 4A C6 E8 A0>)
(   8,<2013-07-11 20:48:19.485 -0700>,<Administrator>,<X>,<proc1d>,<TOPSPIN 2.1>,
      <abs ABSG = 5 
       data hash MD5: 128K
       F2 48 1E D0 AC CC F3 87 E5 07 95 33 D5 0F A0 B6>)
$$ ##END=
$$ 
$$ $$ hash MD5
$$ $$ C3 28 1A EB D7 9D 68 50 90 99 C8 4F B4 91 CC 62
##$RELAX= 
##$RELAX= 
##$RELAX= 
##$RELAX= 
##$RELAX= 
##$RELAX= 
##$RELAX= 
##$RELAX= 
$$ Bruker specific parameters
$$ --------------------------
##$DU= <E:\>
##$EXPNO= 12
$$ [...]
##$TP07= 0
##$TPNAME0= <>
##$TPNAME1= <>
##$TPNAME2= <>
##$TPNAME3= <>
##$TPNAME4= <>
##$TPNAME5= <>
##$TPNAME6= <>
##$TPNAME7= <>
##$TPOAL= (0..7)
0.5 0.5 0.5 0.5 0.5 0.5 0.5 0.5
##$TPOFFS= (0..7)
0 0 0 0 0 0 0 0
##$TUNHIN= 0
##$TUNHOUT= 0
##$TUNXOUT= 0
##$USERA1= <user>
##$USERA2= <user>
##$USERA3= <user>
##$USERA4= <user>
##$USERA5= <user>
##$V9= 5
##$VALIST= <valist>
##$VCLIST= <CCCCCCCCCCCCCCC>
##$VD= 0
##$VDLIST= <DDDDDDDDDDDDDDD>
##$VPLIST= <PPPPPPPPPPPPPPP>
##$VTLIST= <TTTTTTTTTTTTTTT>
##$WBST= 1024
##$WBSW= 4
##$XGAIN= (0..3)
0 0 0 0
##$XL= 0
##$YL= 0
##$YMAX_a= 5879909
##$YMIN_a= -11859335
##$ZGOPTNS= <>
##$ZL1= 120
##$ZL2= 120
##$ZL3= 120
##$ZL4= 120
##$ABSF1= 14.96077
##$ABSF2= -5.597412
##$ABSG= 5
##$ABSL= 3
##$ALPHA= 0
##$AQORDER= 0
##$ASSFAC= 0
##$ASSFACI= 0
##$ASSFACX= 0
##$ASSWID= 0
##$AUNMP= <proc_prof1d_extract.lims>
##$AXLEFT= 0
##$AXNAME= <>
##$AXNUC= <1H>
##$AXRIGHT= 0
##$AXTYPE= 0
##$AXUNIT= <>
##$AZFE= 0.1
##$AZFW= 0.1
##$BCFW= 0
##$BC_mod= 0
##$BYTORDP= 0
##$COROFFS= 0
##$CY= 15
##$DATMOD= 1
##$DC= 0
##$DFILT= <>
##$DTYPP= 0
##$F1P= 0
##$F2P= 0
##$FCOR= 0.5
##$FTSIZE= 131072
##$FT_mod= 6
##$GAMMA= 0
##$GB= 0
##$INTBC= 1
##$INTSCL= 1
##$ISEN= 128
##$LB= 0.3
##$LEV0= 0
##$LPBIN= 0
##$MAXI= 10000
##$MC2= 0
##$MEAN= 0
##$ME_mod= 0
##$MI= 0
##$NCOEF= 0
##$NC_proc= -2
##$NLEV= 6
##$NOISF1= 0
##$NOISF2= 0
##$NSP= 0
##$NTH_PI= 0
##$NZP= 0
##$OFFSET= 14.96077
##$PC= 1
##$PHC0= -80.29907
##$PHC1= 0
##$PH_mod= 1
##$PKNL= yes
##$PPARMOD= 0
##$PPDIAG= 0
##$PPIPTYP= 0
##$PPMPNUM= 2147483647
##$PPRESOL= 1
##$PSCAL= 4
##$PSIGN= 0
##$PYNMP= <proc.py>
##$REVERSE= no
##$SF= 400.020009729376
##$SI= 131072
##$SIGF1= 0
##$SIGF2= 0
##$SINO= 400
##$SIOLD= 131072
##$SPECTYP= <>
##$SREGLST= <1H.CDCl3>
##$SSB= 0
##$STSI= 131072
##$STSR= 0
##$SW_p= 8223.68421052631
##$SYMM= 0
##$S_DEV= 0
##$TDeff= 65536
##$TDoff= 0
##$TI= <>
##$TILT= no
##$TM1= 0
##$TM2= 0
##$TOPLEV= 0
##$USERP1= <user>
##$USERP2= <user>
##$USERP3= <user>
##$USERP4= <user>
##$USERP5= <user>
##$WDW= 1
##$XDIM= 131072
##$YMAX_p= 364657455
##$YMIN_p= -13137
##$CURPLOT= <Network HP LaserJet P1505>
##$CURPRIN= <$Network HP LaserJet P1505>
##$DFORMAT= <normdp>
##$LAYOUT= <+/1D_H.xwp>
##$LFORMAT= <normlp>
##$PFORMAT= <normpl>
##$SURQMSG= 1
$$ End of Bruker specific parameters
$$ ---------------------------------
##NTUPLES= NMR SPECTRUM
##VAR_NAME=  FREQUENCY,     SPECTRUM/REAL,   SPECTRUM/IMAG
##SYMBOL=    X,             R,               I
##VAR_TYPE=  INDEPENDENT,   DEPENDENT,       DEPENDENT
##VAR_FORM=  AFFN,          ASDF,            ASDF
##VAR_DIM=   131072,        131072,          131072
##UNITS=     HZ,            ARBITRARY UNITS, ARBITRARY UNITS
##FACTOR=    0.0627417313425164, 1,          1
##FIRST=     8223.62146879497, -879,         -47044
##LAST=      0,             584,             -47516
##MIN=       0,             -13137,          0
##MAX=       8223.62146879497, 364657455,    0
$$ Real data points
##PAGE= N=1
##DATA TABLE= (X++(R..R)), XYDATA
$$ [...]
64851 242769 241523 240465 239449 238328 236923 235423 234488 234617 235445 235944 235416 234140 232944 232304 232054 231848
64835 231848 231572 231220 230709 230083 229696 229888 230535 231245 232027 233492 236235 240132 244344 247970 250775 253409
64819 253409 256911 261853 267934 274404 280727 286700 292174 297054 301551 306039 310564 314721 318079 320451
64805 320451 321698 321611 320142 317528 314061 309930 305353 300532 295388 289703 283780 278593 274979 272845 271422
64790 271422 270024 268295 266070 263519 261328 260215 260237 260823 261429 261826 261927 261857 262211 263696 266280 269132
64774 269132 271663 274311 277960 282864 288507 294310 300041 305579 310768 315717 320954 327006 333856 340972
64760 340972 347810 354132 359916 365088 369409 372578 374491 375479 376114 376587 376365 374786 371927 368447 364439
64745 364439 359077 351807 343388 335135 327461 320020 313103 307764 304283 301436 297957 294066 290929 289124
64731 289124 288336 288164 288436 288938 289555 290582 292273 294198 295719 296984 298695 300977 303319 305743 309100
64716 309100 313708 318422 321669 322987 323007 322287 320760 318260 315028 311533 307950 304002 299394 294504 290354
64701 290354 287542 285333 282403 278485 274659 271900 270022 268416 267093 266445 266514 267124 268388 270417 272779
64686 272779 274884 276763 278964 281841 285496 290232 296444 304006 312215 320314 327750 334077 339184 343499
64672 343499 347513 351148 354033 356145 357499 357455 355268 351382 347232 343487 339402 334323 328900 324102 319793
64657 319793 315338 311234 308956 309022 310052 310170 308914 307417 306969 307856 309584 311896 315158 319762 325545
64642 325545 332222 340114 349775 360776 371545 380835 388852 396432 403509 409103 412634 414570 415647 416017
64628 416017 415347 413356 410025 405472 399812 392969 384717 375176 365297 356430 349186 342957 336801 330580
64614 330580 324954 320407 316655 313098 309577 306385 303645 301016 298186 295427 293322 291976 290834 289397
64600 289397 287882 287041 287559 289725 293336 297657 301794 305513 309571 314864 321369 328203 334631 340625 346588
64585 346588 352997 360275 368464 376839 384278 390227 395059 399309 402892 405262 406090 405556 404113 402107 399531
64570 399531 396081 391579 386306 380655 374577 367743 360310 352982 346180 339641 333129 326989 321553 316457
64556 316457 311220 306262 302675 300929 300274 299490 297892 295618 293368 291946 291734 292460 293622 295067 296941
64541 296941 299211 301603 303893 305764 306475 305291 302518 299568 297680 296888 296494 296114 295841 295672 295362 294773
64525 294773 294035 293332 292807 292614 292905 293767 295326 297701 300682 303676 306314 308903 311951 315392 318778 322130
64509 322130 326012 330668 335647 340553 345713 351687 358419 365234 371506 376998 381693 385570 388507 390198
64495 390198 390322 388979 386758 384101 380856 376849 372640 369122 366421 363856 361151 359012 358118 357983 357398
64480 357398 355708 353183 350278 347131 343865 340823 338229 335916 333692 331862 331057 331515 332685 333639 333868
64465 333868 333659 333735 334626 336394 338771 341314 343415 344444 344149 342843 341141 339609 338647 338450 338836 339298
64449 339298 339535 339868 340868 342645 344824 347196 350091 353983 359010 365002 371798 379372 387745 396876 406652
64434 406652 416992 428095 440514 454862 471464 490391 511744 535730 562619 592900 627324
64423 627324 666418 710019 757692 809485 865691 925698 987628 1049264 1108959 1165562 1218200
64412 1218200 1266517 1310412 1348972 1380190 1402473 1416020 1421889 1420060 1409402 1389499 1361436 1326466
64400 1326466 1284838 1236515 1182445 1124446 1064161 1002706 941190 881023 823624 770061 721054
64389 721054 677143 638747 605978 578266 554273 532535 512387 494162 478416 465203 454150
64378 454150 444874 437098 430551 424990 420178 415756 411345 406878 402523 398080 392809 386253 378987 372118
64364 372118 366153 360795 355780 351391 348015 345657 344190 343846 345035 347742 351390 355459 360070 365705
64350 365705 372397 379440 386007 391804 396815 400640 402593 402553 401235 399419 397316 394944 392636 390669 388677
64335 388677 386058 382865 379722 376905 374137 371450 369572 369054 369383 369484 368904 368085 367577 367405 367264 367003
64319 367003 366706 366461 366207 365787 365027 363737 361657 358537 354411 349745 345181 341019 337032 332832 328322
64304 328322 323702 319130 314605 310236 306458 303780 302300 301585 301146 300930 301213 302085 303284 304687 306761
64289 306761 310274 315601 322451 330174 338150 345990 353727 361901 371149 381523 392266 402365 411180
64276 411180 418505 424233 428173 430157 430204 428684 426297 423616 420520 416293 410593 404231 398693 394871 392415
64261 392415 390293 387739 384635 381239 377747 374051 369891 365227 360331 355374 350067 343998 337351 330889
64247 330889 325144 319972 315101 310769 307405 304949 302971 301434 300838 301476 302973 304746 306530 308226 309644
64232 309644 310803 312275 314725 318151 321966 325770 329607 333485 337150 340514 343811 347057 349780 351707
64218 351707 353344 355362 357597 359167 359476 358542 356444 353125 348983 344954 341582 338378 334641 330586 327103
64203 327103 324541 322352 320085 318197 317595 318622 320787 323346 325962 328925 332953 338736 346475 355835
64189 355835 366387 377964 390419 403053 414521 423461 429137 431485 430663 426821 420277 411703 401974
64176 401974 391873 381976 372677 364161 356370 349195 342750 337336 333168 330253 328559 328084 328676 330046
64162 330046 332116 335198 339615 345242 351598 358222 364692 370420 374842 377907 380055 381563 382159 381495 379781
64147 379781 377696 375697 373591 370776 366820 361854 356524 351543 347282 343728 340690 337836 334682 330952
64133 330952 327085 324030 322307 321573 321350 321826 323480 326159 329048 331527 333610 335576 337751 340704 345084
64118 345084 350871 357205 363310 369358 376096 383845 392120 400026 406725 411758 415229 417631 419261 420034
64104 420034 420081 420208 421306 423506 426380 429741 433637 437551 440323 441043 439555 435956 430224 422654 414079
64089 414079 405199 396070 386714 377792 370058 363358 356841 350105 343609 337881 332894 328312 323973 320005
64075 320005 316870 315337 315915 318038 320240 321459 321852 322096 322278 321989 321257 320765 321054 321912 322695 323023 323082
64058 323082 323389 324285 325494 326298 326405 326558 327857 330410 333114 335048 336698 339378 343739 349267 355104
64043 355104 360770 366079 370947 375644 380812 386782 393012 398556 402982 406487 409202 410913 411703 412466 414279
64028 414279 417293 420585 423233 425247 427293 429735 432314 434686 436749 438198 438174 435905 431664 426581 421426
64013 421426 416027 410155 404493 400189 397575 395818 393832 391130 387793 384069 380257 376716 373689 371206
63999 371206 369221 367687 366434 365221 364122 363703 364543 366618 369289 371937 374464 377178 380330 383942 388073
63984 388073 393059 399146 405943 412623 418890 425302 432268 439111 444875 449914 455828 463641 472834 482549
63970 482549 492942 504647 517438 530397 543287 556960 572272 589203 607305 626636 648031
63959 648031 672685 701644 735538 774619 819011 868869 924416 986179 1055289 1133178 1220686
63948 1220686 1317739 1424029 1539430 1663329 1794170 1930398 2071397 2216508 2363377 2508275
63938 2508275 2647989 2780297 2902540 3011080 3102812 3176276 3230579 3264130 3275304 3263758
63928 3263758 3230203 3175445 3100636 3008155 2901098 2781836 2651937 2513633 2370540 2226527
63918 2226527 2084328 1945468 1811128 1682751 1561959 1450059 1347534 1254082 1169298 1093140
63908 1093140 1025516 965657 912381 864908 822960 786208 754155 726534 703208 683532 666362
63897 666362 650895 637069 624938 614180 604525 596163 589266 583465 578217 573460 569334 565425 560873
63884 560873 555381 549694 544850 541185 538290 535837 534241 534513 537530 543479 551810 561571 571815 581976
63870 581976 592144 602929 614843 627683 640676 653214 665285 677077 688367 698533 707145 714307
63858 714307 720311 725012 727744 727909 725524 721028 714666 706405 696495 685721 674800 663717 651974
63845 651974 639266 625595 610913 595206 578954 562952 547472 531984 515998 499917 484727
63834 484727 471011 458518 446631 435045 423975 413833 404748 396399 388355 380493 372994 366056 359843
63821 359843 354567 350313 346794 343608 340767 338600 337061 335545 333566 331269 329080 327167 325469 323945
63807 323945 322508 321004 319504 318321 317422 316196 314221 312034 310596 310097 309795 308996 307692 306158 304397
63792 304397 302286 299984 297916 296372 295169 293673 291253 287976 284855 283146 283226 284247 284915 284509 283236
63777 283236 281827 280898 280597 280745 281249 282253 283861 285850 287796 289270 289842 289222 287723 286386 286128 286775
63761 286775 287281 286892 285790 284644 283966 283937 284396 284790 284527 283669 283086 283732 285880 289121 292828 296499 299952
63744 299952 303327 306698 309629 311475 312240 312720 313508 314332 314766 315197 316473 318780 321515 324238 327152 330520
63728 330520 334175 337917 342010 346906 352656 358897 365237 371406 377033 381570 384525 385736 385434 384084
63714 384084 382030 379204 375288 370336 365206 361065 358339 356280 353775 350534 347304 344932 343493 342497
63700 342497 341691 341311 341567 342250 343026 343900 345189 347149 349748 352692 355527 357889 359926 362396 366049 370844
63684 370844 375894 380216 383410 385644 387278 388678 390232 392277 394915 397920 400858 403332 405258 406999
63670 406999 409189 412230 415836 419107 421235 422177 422492 422471 421680 419621 416584 413356 410132 406330 401704
63655 401704 397022 393165 390051 387088 384300 382129 380306 377944 374927 372268 370688 369739 369057 369622 372681
63640 372681 377705 382541 385747 387992 390949 395521 401464 408144 415142 422468 430574 440001 450741 462162
63626 462162 473795 485969 499402 514424 530902 548739 568041 588838 611024 634665 660155
63615 660155 687943 718145 750406 784016 818160 852050 884721 914702 940197 959840 973249
63604 973249 980815 983192 981194 975902 968456 959698 950205 940434 930476 919781 907554 893489 877818
63591 877818 860716 842153 822434 802339 782505 763078 744309 727060 712146 699347 687603
63580 687603 676197 665346 655505 646574 638110 630198 623739 619762 618521 619378 621599 625086 630202 637039
63566 637039 645260 654771 666104 679754 695324 711801 728691 746527 766233 788367 813147 840843
63554 840843 871729 905697 942139 980184 1018824 1056751 1092172 1122885 1146607 1161490 1166705 1162811
63542 1162811 1151652 1135727 1117451 1098748 1081075 1065497 1052448 1041405 1031042 1019926 1007044
63531 1007044 991701 973274 951453 926646 899741 871431 842020 811914 781806 752243 723421
63520 723421 695748 670241 647824 628392 611046 595215 581057 568772 558059 548477 539864 532079
63508 532079 524713 517494 510795 505288 501120 497748 494567 491433 488595 486397 485045 484358 483722 482547 480849
63493 480849 479164 477857 476783 475712 474760 474269 474552 475912 478526 481989 485265 487571 489264 491494 494972
63478 494972 499351 503745 507487 510362 512487 514125 515395 516016 515494 513597 510512 506541 501903 496898 491942
63463 491942 487270 482782 478314 473915 469833 466477 464399 463936 464695 465768 466800 468537 471966 477169 483500
63448 483500 490698 499259 509712 522112 536560 553810 574850 599924 628188 658356 689466 720830
63436 720830 751323 779035 802028 819573 832494 842305 850348 857947 866866 878906 894995 915054
63424 915054 938784 966120 996798 1030003 1064787 1100546 1136618 1171422 1202394 1226993 1243885
63413 1243885 1253218 1255926 1252908 1244988 1233531 1220597 1208030 1196323 1184616 1171744 1157051 1140361
63401 1140361 1121620 1100729 1077432 1051332 1022362 991270 959233 926954 894602 862760 832713
63390 832713 805354 780444 757577 737357 720769 707662 696833 687675 680834 676953 675599 675958 678032
63377 678032 682479 689533 698706 709470 721740 735649 751276 768686 787940 808952 831579 855976
63365 855976 882699 912263 944673 979384 1015594 1052404 1088801 1123746 1156335 1185742 1210876
63354 1210876 1230222 1242331 1246710 1244248 1236700 1225744 1212482 1197557 1181380 1164149 1145847 1126467
63342 1126467 1106133 1084834 1062038 1036816 1008619 977952 946149 914394 883064 852143 822126
63331 822126 794242 769768 749325 732906 720221 710779 703860 698714 694609 690438 684475 675089 661818
63318 661818 645470 627286 608426 590212 574013 560363 548598 537878 528281 520392 514137 508711
63306 508711 503601 498955 494854 490930 487060 483826 481746 480349 478556 475848 472600 469375 466373 463552
63292 463552 460826 457958 454643 450942 447395 444476 442072 439665 436917 433978 431360 429569 428700 428223 427329
63277 427329 425651 423518 421429 419541 417869 416651 416043 415634 414793 413564 412702 412600 412690 412225 411323 410733 410814
63260 410814 411266 411872 412960 414908 417534 420277 422827 425372 428316 431986 436493 441606 446773 451490 455799
63245 455799 460202 465021 470047 475085 480655 487726 496667 506853 517470 528353 539695 551275 562571
63232 562571 573575 584856 596648 608397 619557 630393 641542 653099 664631 675929 687190
63221 687190 698475 709517 720209 730830 741532 751842 760872 767801 772015 773079 770910 765922 758758
63208 758758 749874 739449 727603 714622 701070 687783 675593 664856 655285 646391 638105 630922
63196 630922 625486 622096 620518 620170 620575 621762 624256 628586 634835 642664 651621 661392 671878 683172
63182 683172 695382 708332 721504 734407 746930 759260 771556 783860 796140 808123 819076
63171 819076 828073 834674 839171 842066 843304 842136 837689 829625 818350 804722 789525 773117 755378
63158 755378 735962 714743 692322 670160 649947 632498 617304 603311 590062 577876 567050
63147 567050 557322 548256 539840 532462 526431 521717 517980 514660 511239 507728 504850 503442 503601 504599 505663
63132 505663 506623 507770 509338 511327 513711 516604 520191 524523 529385 534318 538848 542753 546132 549194
63118 549194 552066 554775 557386 560097 563266 567274 572246 577815 583394 588759 594278 600447 607320 614552
63104 614552 621792 628727 634827 639530 642877 645707 648913 652586 656074 658756 660541 661684 662410 662790 662760
63089 662760 662095 660510 657976 654871 651704 648713 645879 643271 641173 639722 638620 637440 636250 635727 636492
63074 636492 638444 640902 643349 645822 648633 651990 656136 661591 668898 678088 688666 700283 713209
63061 713209 727958 744586 762658 781898 802647 825482 850538 877331 905165 933580 962494
63050 962494 992177 1023107 1055659 1089737 1124769 1160146 1195615 1231307 1267538 1304637 1342701
63039 1342701 1381290 1419387 1455770 1489317 1518906 1543311 1561532 1573141 1578069 1576205 1567540 1552592
63027 1552592 1532204 1506930 1477061 1443290 1406839 1368795 1329822 1290796 1253177 1218296 1186565
63016 1186565 1157850 1132315 1110395 1092241 1077784 1067242 1060970 1058809 1060089 1064361 1071687 1082099
63004 1082099 1095242 1110658 1128017 1146928 1166893 1187615 1209105 1231324 1253971 1276692 1299140
62993 1299140 1320789 1341120 1360155 1378361 1395790 1411641 1424927 1435148 1441895 1444187 1440770 1431074
62981 1431074 1415490 1394763 1369404 1339725 1306163 1269496 1230789 1191073 1151053 1111284 1072614
62970 1072614 1036141 1002463 971317 942253 915409 891262 869791 850249 831801 814068 797141
62959 797141 781334 766941 754027 742448 732124 723072 714994 707114 698782 690120 681775 674231 667659
62946 667659 662212 657907 654290 650774 647430 645046 644301 645195 647342 650449 654386 659096 664602 670903 677750
62931 677750 684623 690802 695267 696850 695034 690539 684549 677417 668743 658716 648484 638914 629823 620952
62917 620952 612852 606021 599796 593133 586265 580624 577209 575851 576069 577634 580067 582569 585000 588229
62903 588229 592883 598306 603499 608632 614659 621548 627813 632107 634549 636087 637111 637232 636045 633530
62889 633530 629807 625080 619819 614492 609037 603004 596361 589731 583660 578085 572799 568038 564136 560893
62875 560893 557806 554776 552073 549710 547445 545453 544357 544305 544435 543663 541696 539051 536350 533972 532108
62860 532108 530755 529671 528675 527975 528028 529098 531084 533621 536160 538155 539561 541059 543365 546253 548667
62845 548667 549986 550808 552187 554349 556588 558354 559915 561758 563771 565499 567004 568845 571097 572962
62831 572962 573792 574073 574842 576288 577607 578278 578787 579823 581318 582811 584406 586793 590353 594603 598568
62816 598568 601446 603000 603638 604181 605348 607321 609822 612517 615288 618258 621745 626038 631080 636470 641941
62801 641941 647643 653825 660470 667514 675199 683850 693469 703906 715362 728398 743582 761482 782823
62788 782823 808020 836539 867388 900398 936395 975848 1018016 1061952 1107813 1156318 1207006
62777 1207006 1257751 1306168 1350982 1391879 1428533 1460173 1485832 1504625 1515880 1519337 1515317 1504602
62765 1504602 1488195 1467326 1443499 1418152 1392168 1365977 1340262 1316231 1294840 1275810 1257770
62754 1257770 1239339 1219801 1198663 1174996 1147606 1115871 1080276 1042186 1003148 964335 926451
62743 926451 890131 856233 825500 797983 773135 750693 731118 714939 701905 691160 682060 674408
62731 674408 667989 662381 657339 652993 649497 646819 645037 644617 646090 649509 654339 659838 665522 671421
62717 671421 678034 685996 695684 707124 720213 734920 751274 769273 788913 810315 833834 859938
62705 859938 888806 920102 953407 988920 1027338 1068789 1112250 1156342 1200405 1244305 1287493
62694 1287493 1328809 1367048 1401016 1429148 1449893 1462645 1467638 1464715 1453049 1432523 1404735 1371937
62682 1371937 1335332 1294975 1251014 1204396 1156532 1108856 1062621 1018575 976752 936929 899360
62671 899360 864780 833750 806230 781684 759313 738376 718694 700831 685391 672209 660527
62660 660527 649866 640255 631632 623527 615561 607905 600974 594866 589305 584025 579121 575024 572133 570340
62646 570340 568984 567469 565916 565002 565167 566181 567448 568565 569533 570644 572201 574189 576223 577910 579215
62631 579215 580332 581313 582068 582606 583029 583360 583674 584333 585792 588178 591298 594975 599029 603027 606529 609597
62615 609597 612679 615901 618945 621691 624547 627994 632278 637657 644444 652515 661292 670562 680902 692912
62601 692912 706543 721665 738836 758745 781082 804607 828313 851895 875124 897411 918153
62590 918153 936972 953398 966740 976469 982315 983862 980644 973075 962805 951520 939542 926182
62578 926182 911446 896811 884099 873963 865797 858914 853511 850562 851036 855262 862820 872884 884684
62565 884684 897712 911425 924746 935870 942707 943669 938219 926784 910239 889412 865052 838246
62553 838246 810701 784379 760639 739764 721327 704869 690139 676894 664786 653532 643056
62542 643056 633507 625242 618681 613886 610315 607300 604779 603255 602955 603448 604289 605712 608324 612387 617758
62527 617758 624422 632670 642751 654639 668194 683333 700039 718391 738549 760521 783971 808467
62515 808467 833870 860231 887360 914685 941454 966740 989372 1008286 1023078 1033895 1040704 1043100
62503 1043100 1040928 1034702 1025140 1012704 997960 982061 966360 951618 937963 925538 914805 906211
62491 906211 899954 896178 895089 896781 901153 908042 917218 928182 940226 952798 965584 978130 989671
62478 989671 999566 1007651 1013879 1017734 1018361 1015252 1008518 998406 984836 967604 946936 923724 899242
62465 899242 874666 850714 827556 805114 783525 763268 744718 727657 711447 695750 680972
62454 680972 667921 657174 648814 642570 637958 634367 631293 628589 626377 624723 623596 623137 623601 624921
62440 624921 626593 628290 630293 632881 635425 636683 636149 634676 633466 632741 631755 629872 627191 624183 621173
62425 621173 618331 615844 613834 612190 610595 608694 606239 603240 600049 597197 595052 593648 592813 592368 592197
62410 592197 592284 592688 593354 593958 594239 594542 595715 598220 601577 604967 608208 611786 616023 620694 625569 630883
62394 630883 636983 643747 650751 657949 665818 674700 684250 693825 703369 713661 725603 739439 754799
62381 754799 771374 789239 808585 829479 852029 876543 903278 932179 963012 995599 1029726
62370 1029726 1065054 1101455 1139404 1179777 1223337 1270730 1322829 1380566 1444129 1512566 1584240
62359 1584240 1657401 1730197 1800420 1865597 1923290 1971335 2008032 2032372 2044067 2043417 2031352 2009531
62347 2009531 1979988 1944398 1903787 1858858 1810216 1758171 1702848 1644808 1585236 1525221 1465313
62336 1465313 1406182 1349265 1296073 1247049 1201693 1159688 1121252 1086458 1054923 1026326 1000649
62325 1000649 977697 956880 937651 919713 902583 885513 868203 851203 835206 820268 806129
62314 806129 793005 781536 771967 763761 756046 748371 741031 734726 729776 725658 721586 717531 714251 712191
62300 712191 710918 709917 709396 709751 710716 711753 713032 715254 718501 721955 724868 727275 729589 731980 734346
62285 734346 736577 738724 741226 744889 750154 756393 762495 768317 774935 783242 792975 803514 814998 827991
62271 827991 842471 857911 874280 892359 913054 936862 964045 994902 1029789 1069103 1113175
62260 1113175 1161901 1214593 1270529 1329478 1391194 1454437 1516932 1576289 1630499 1677547 1715284
62249 1715284 1742185 1757980 1763286 1758885 1745575 1724291 1695876 1660819 1619539 1572870 1521961 1467715
62237 1467715 1410638 1351322 1291009 1231614 1175184 1123176 1076053 1033557 995376 961434 931585
62226 931585 905286 881789 860589 841603 825058 811280 800362 791876 785018 779211 774360 770406
62214 770406 766959 763697 760920 759310 759284 760923 764364 769724 776563 783934 791144 798210 805498 813295 821826
62199 821826 831251 841385 851783 862365 873657 886097 899426 913127 927256 942366 958711 975994
62187 975994 993981 1012980 1033597 1056233 1080964 1107664 1136044 1165690 1196159 1227036 1257926
62176 1257926 1288463 1318323 1347043 1373849 1397858 1418589 1436213 1451393 1465112 1478689 1493533
62165 1493533 1510425 1528969 1547838 1565519 1580639 1591811 1597678 1597451 1591214 1579416 1562167 1539343
62153 1539343 1511345 1479319 1444313 1406492 1365537 1321758 1276450 1231088 1186458 1142753 1100266
62142 1100266 1059817 1022583 989609 961264 936995 915763 896928 880585 866904 855364 844974
62131 844974 835208 826415 819216 813665 809106 804707 800141 795803 792344 789911 787930 785784 783586 782101
62117 782101 781951 783069 784794 786218 786590 785802 784539 783636 783258 782992 782685 782681 783087 783370 783054 782433 782206 782664
62099 782664 783696 785348 787883 791319 795382 799970 805296 811483 818383 825906 834307 843993 855174 867719
62085 867719 881250 895429 910358 926634 944763 964584 985530 1007454 1030822 1056131 1083600
62074 1083600 1113463 1145932 1180565 1216224 1252237 1289259 1328333 1369237 1410376 1450230 1488193
62063 1488193 1523868 1556326 1584567 1608164 1626805 1639518 1645128 1643579 1636200 1624417 1608583 1588290
62051 1588290 1563421 1534508 1502249 1467117 1429402 1389351 1347235 1303594 1259504 1216368 1175272
62040 1175272 1136639 1100527 1067066 1036440 1008655 983563 961075 941134 923511 907799 893692
62029 893692 881172 870421 861556 854379 848254 842293 835886 829117 822519 816365 810388 804291 798309 792957
62015 792957 788268 783584 778256 772392 766788 762176 758727 756233 754591 754007 754847 757390 761602 766984 772645
62000 772645 777760 782095 786037 789971 793620 796067 796447 794613 791134 786739 781777 776118 769445 761580
61986 761580 752647 743080 733520 724580 716540 709306 702750 697054 692575 689331 686802 684366 681839 679547
61972 679547 677953 677247 677178 677142 676572 675458 674391 673945 674088 674404 674765 675423 676475 677689 679068 681189 684565
61955 684565 688874 693241 697295 701521 706593 712805 720377 729869 741814 756033 771799 788797 807651
61942 807651 829258 853722 880044 906837 933275 959461 985955 1012949 1039880 1065860 1090422
61931 1090422 1113620 1135445 1155398 1172813 1187354 1198928 1207320 1212332 1214243 1213708 1211118 1206425 1199866
61918 1199866 1192522 1185801 1180500 1176741 1174796 1175587 1180160 1188757 1200587 1214437 1229464 1245387 1261955
61905 1261955 1278346 1293231 1305438 1314411 1319861 1321157 1317381 1308097 1293878 1275937 1255269 1232281
61893 1232281 1207194 1180683 1153946 1128067 1103389 1079628 1056560 1034413 1013510 993828 975115
61882 975115 957328 940601 924792 909332 893715 878019 862859 848887 836399 825335 815601 807372
61870 807372 801095 797160 795581 796006 797945 801005 805102 810672 818584 829596 843865 861066 880916
61857 880916 903415 928656 956679 987515 1021157 1057475 1096338 1137729 1181457 1226736 1272371
61846 1272371 1317292 1360505 1400529 1435506 1464229 1486639 1502985 1512928 1515980 1512559 1503993 1491718
61834 1491718 1477078 1461867 1448307 1438182 1432260 1430681 1433462 1440415 1450908 1463958 1478399 1492892
61822 1492892 1506100 1517026 1524823 1528176 1525286 1514862 1496808 1471709 1440051 1402479 1360505 1316233
61810 1316233 1271322 1226640 1182876 1140915 1101453 1064768 1031063 1000656 973622 949623 928332
61799 928332 909593 892952 877628 863395 851005 840992 832345 823243 813115 803139 794528 787100
61787 787100 780030 773289 767578 763147 759472 756112 753284 751432 750566 750191 749575 748026 745230 741587 738036
61772 738036 735386 733792 732885 732314 732187 733084 735606 739780 744940 750309 755632 761064 766640 772209 777819
61757 777819 783735 789912 795719 800401 803627 805552 806564 807048 807091 806302 804159 800681 796520 792304 788196
61742 788196 784232 780676 777741 775285 773112 771254 769631 767790 765504 763371 762185 761838 761473 760806 760619
61727 760619 761724 763879 766120 767827 769195 770882 773428 776924 781022 785316 789645 793887 797630 800482
61713 800482 802708 804990 807360 808907 808894 807655 805918 803629 800157 795502 790556 786045 781748 776999 771576
61698 771576 765862 760397 755500 751189 747308 743852 741143 739397 738116 736313 733568 730526 728058 726306
61684 726306 724933 723956 723666 723794 723511 722545 721772 722201 723688 725095 725563 725195 724627 724438 724995 726292 727750
61667 727750 728582 728683 728852 729811 731348 732816 734229 736270 739250 742608 745590 747952 749836 751485 753441
61652 753441 756657 761744 768148 774557 780258 785758 791947 798984 806326 813667 821354 829685 838068 845245
61638 845245 850362 853516 855098 854909 852301 847140 840230 832662 825045 817534 810365 803983 798763 794788
61624 794788 791851 789542 787445 785482 783983 783166 782658 781754 780116 777886 775209 772000 768215 763943 759033
61609 759033 753113 746229 739142 732535 726204 719493 712392 705573 699347 693197 686670 680173 674459 669635
61595 669635 665246 661203 658009 655954 654528 652936 650898 648669 646438 644072 641425 638686 636257 634361
61581 634361 632774 630996 628766 626493 625048 624995 626014 627119 627439 626842 625967 625753 626760 628832 631423 634335
61565 634335 637930 642555 648008 653842 659963 666540 673431 680226 686857 693643 700486 706490 710734 713061
61551 713061 713700 712539 709391 704922 700542 697173 694605 692357 690681 690225 690958 692053 692870 693641 695009
61536 695009 697257 700209 703651 707511 711713 716120 720650 725236 729634 733466 736433 738361 739064 738471 736929
61521 736929 735061 733109 730691 727448 723705 720132 716956 713957 711259 709614 709711 711461 714080 716619 718290
61506 718290 718632 717730 716165 714533 713056 711738 710775 710591 711486 713316 715466 717203 718315 719494 721782
61491 721782 725477 729796 733799 737374 741052 745177 749679 754517 759817 765493 771096 776229 780886 785310
61477 785310 789658 793916 797981 801753 805281 808819 812644 816732 820662 823886 826060 827206 827551 827128 825542
61462 825542 822320 817587 812110 806538 800859 794841 788641 782561 776511 770281 764293 759457 756227 754272
61448 754272 753145 752738 752902 753224 753567 754464 756603 760144 764772 770060 775457 780235 783961 786967 790042
61433 790042 793687 797847 802156 806180 809596 812468 815267 818355 821595 824754 828138 832384 837683 843607
61419 843607 849736 856035 862407 868246 872780 875759 877536 878508 878684 877861 876050 873580 870843 868164 865961
61404 865961 864725 864496 864529 863938 862738 861817 861748 862045 861879 861086 860018 858745 856970 854630 852039 849432 846840
61387 846840 844466 842785 842151 842659 844458 847782 852519 858076 863932 870094 876849 884255 892046 899772 906892
61372 906892 912887 917485 920634 922183 921842 919654 916324 912811 909697 907094 905030 903718 903396 904101 905659
61357 905659 907910 911008 915397 921326 928354 935582 942477 949318 956719 964866 973356 981647 989517 997193
61343 997193 1005105 1013403 1021638 1029116 1035605 1041521 1047330 1053090 1058732 1064414 1070261 1075931 1080847 1084732
61329 1084732 1087609 1089534 1090802 1092386 1095517 1100595 1106876 1113491 1120511 1128731 1138669 1150151 1162758
61316 1162758 1176269 1190497 1204944 1218894 1231870 1243828 1254825 1264595 1272629 1278690 1283034 1285972
61304 1285972 1287316 1286442 1282911 1276880 1268857 1259210 1248088 1235856 1223394 1211673 1200833 1189872 1177607
61291 1177607 1163966 1150049 1136852 1124377 1112226 1100609 1090225 1081362 1073731 1067197 1062151 1059022
61279 1059022 1057800 1058212 1060024 1063054 1067249 1072911 1080477 1089850 1100259 1111078 1122533 1135317 1149769
61266 1149769 1165742 1183080 1201790 1221776 1242781 1264610 1287236 1310674 1334874 1359546 1383805
61255 1383805 1406161 1425268 1440771 1453164 1462905 1470034 1474616 1477076 1477925 1477548 1476525 1475791 1476136 1477681
61241 1477681 1480181 1483699 1488658 1495282 1503330 1512407 1522173 1532121 1541393 1549046 1554385 1556832 1555730 1550624
61227 1550624 1541731 1529767 1515205 1498078 1478772 1458621 1439181 1420943 1403302 1385785 1368812
61216 1368812 1353041 1338597 1325423 1313942 1304710 1297624 1292169 1288408 1287005 1288055 1290525 1293229 1295924
61203 1295924 1299093 1303049 1307647 1312538 1317186 1320836 1322996 1324000 1324731 1325832 1327463 1329668 1332466 1335536
61189 1335536 1338221 1339942 1340326 1338997 1335758 1331097 1325960 1320689 1314584 1306857 1297690 1287982 1278344 1268803
61175 1268803 1259220 1249412 1238947 1227441 1215204 1203080 1191471 1179978 1168227 1156569 1145536 1134973
61163 1134973 1124238 1113088 1101857 1090813 1079919 1069332 1059623 1051165 1043664 1036684 1030439 1025622
61151 1025622 1022496 1020498 1018863 1017314 1015934 1014546 1012552 1009520 1005701 1001752 997938 993855 989169 984490
61137 984490 981145 979987 980747 982698 985689 990163 996436 1004471 1014349 1026437 1040842 1057100 1074742
61124 1074742 1093931 1115098 1138073 1161999 1186205 1210763 1235973 1261521 1286524 1310315 1332895
61113 1332895 1354571 1375473 1395679 1415522 1435333 1454844 1473277 1490191 1505812 1520135 1532065
61102 1532065 1540004 1543247 1542217 1537312 1528237 1514787 1497728 1478361 1457590 1435986 1414470 1394147
61090 1394147 1375294 1357092 1338675 1320104 1302065 1284893 1268249 1251599 1234705 1217577 1200181
61079 1200181 1182378 1164166 1145875 1127986 1110771 1094280 1078745 1064724 1052583 1041996 1032283
61068 1032283 1023158 1014849 1007532 1001110 995623 991493 989050 988125 988383 989899 993049 997840 1003659 1009836
61054 1009836 1016374 1024002 1033452 1044785 1057592 1071829 1088143 1107190 1128914 1152913 1179326 1208814
61042 1208814 1241605 1277082 1314444 1353199 1392684 1431563 1468283 1501786 1531401 1556344 1575928
61031 1575928 1590267 1600378 1607524 1612770 1617155 1622033 1629143 1640487 1658009 1683264 1717609 1762983
61019 1762983 1822244 1898351 1993575 2110249 2252113 2423514 2626024 2855579 3102960 3356468
61009 3356468 3603334 3828994 4017401 4155437 4239699 4279776 4294068 4300675 4310174 4324027 4336261
60998 4336261 4334622 4301765 4219805 4078059 3878785 3636427 3371555 3104106 2849140 2615510
60988 2615510 2406704 2222902 2062805 1924274 1804442 1700354 1609856 1531559 1463932 1404841
60978 1404841 1352112 1304255 1260553 1220753 1184848 1152785 1124046 1097634 1072767 1049592 1028970
60967 1028970 1011486 996759 983777 971773 960679 950782 942129 934421 927471 921592 917317 914763 913431
60954 913431 912781 912887 914297 917227 921096 925038 928777 932786 937603 943210 949143 954986 960636 966269 972199
60939 972199 978556 984827 989880 992724 993214 991774 988609 983634 977107 969812 962358 954721 946715 938607
60925 938607 930944 923988 917603 911559 905745 900228 895281 891156 887669 884315 881042 878578 877637 878032 878992
60910 878992 880107 881519 883412 885938 889533 894581 900683 906957 913274 920619 929871 940799 952655 965302
60896 965302 979194 994608 1011426 1029511 1048794 1069082 1090187 1112182 1135102 1158438 1181328
60885 1181328 1203206 1223951 1243566 1262134 1280060 1297847 1315614 1333357 1351692 1371667 1393538
60874 1393538 1416318 1438941 1461384 1484016 1506158 1525904 1541336 1551421 1555839 1554528 1547590 1535203
60862 1535203 1517456 1494588 1467569 1437998 1407098 1375014 1341394 1306452 1271135 1236369 1202531
60851 1202531 1169739 1138332 1108849 1081634 1056589 1033307 1011408 990808 971783 954770 940008
60840 940008 927165 915264 903121 890094 876471 863056 850400 838605 827782 818372 810749 804685
60828 804685 799487 794678 790386 787012 784633 782775 780746 778205 775394 772824 770818 769476 768984 769573 770984
60813 770984 772346 772960 773204 774309 777144 781348 785692 789219 792030 795032 798894 803275 807241 810443 813505
60798 813505 817075 820894 824262 827025 829446 831256 831690 830705 829443 829018 829286 829167 827891 825542 822709
60783 822709 820003 817656 815146 811522 806549 801336 797265 794399 791520 787732 783410 779426 776083 773213
60769 773213 770849 769216 768167 767125 765633 763694 761505 759216 757079 755596 755205 755832 756961 758222 759744
60754 759744 761924 765009 769046 774052 779936 786301 792563 798356 803648 808480 812791 816462 819243 820621
60740 820621 820128 817918 814731 811128 807080 802547 798006 793990 790394 786755 783123 780070 777769 775482
60726 775482 772182 767479 761852 756177 751152 747038 743800 741411 739878 738954 738120 737081 736026 735154 734207
60711 734207 732931 731768 731545 732452 733829 734991 735779 736219 736203 735883 735964 737197 739646 742721 745869 749094
60695 749094 752869 757652 763453 769989 777254 785644 795167 804823 813339 820464 826967 833371 839398 844815
60681 844815 849995 855188 859940 863838 867395 871516 876459 881997 888324 896013 905062 914759 924672 935218
60667 935218 946996 959967 973641 987809 1002677 1018266 1033902 1048522 1061487 1072920 1083012
60656 1083012 1091183 1096415 1098580 1098876 1098529 1097433 1094582 1089644 1083530 1077482 1072063 1067049 1061875 1056131
60642 1056131 1049970 1044142 1039337 1035545 1032287 1029292 1026540 1023783 1020615 1017035 1013384 1009659 1005459 1000838
60628 1000838 996697 994054 993312 994394 997139 1001301 1006657 1013497 1022565 1034151 1047686 1062704 1079775
60615 1079775 1099781 1122503 1146615 1171016 1195498 1219982 1243660 1265174 1283297 1297290 1306913
60604 1306913 1312242 1313229 1309386 1300277 1286461 1269567 1251207 1232133 1212644 1193345 1174901 1157253
60592 1157253 1139739 1122064 1104713 1088205 1072417 1057027 1042310 1029005 1017432 1007166 997715
60581 997715 989218 982232 977043 973502 971538 971520 973907 978646 985126 992742 1001365 1011086 1021530 1031620
60567 1031620 1040162 1046565 1050907 1053362 1053921 1052791 1050847 1049419 1049608 1051899 1056325 1062754 1071026 1081064
60553 1081064 1092966 1106814 1122263 1138537 1155093 1172209 1190595 1210287 1230109 1248338 1263705
60542 1263705 1275547 1283246 1286004 1283333 1275450 1263042 1246984 1228615 1209906 1192685 1177574 1164122
60530 1164122 1152079 1142027 1134519 1129112 1124784 1121067 1118283 1116870 1117066 1119285 1124252 1132423 1143508
60517 1143508 1156756 1171600 1187867 1205537 1224462 1244295 1264753 1286063 1309076 1334745 1363496
60506 1363496 1395301 1430281 1468844 1511092 1556313 1603198 1650297 1696109 1738937 1776844 1807636
60495 1807636 1828843 1838007 1833391 1814539 1782256 1738245 1684825 1624749 1561036 1496859 1435283 1378598
60483 1378598 1327705 1282422 1242462 1207804 1178140 1152714 1131243 1114470 1103045 1096017 1091126 1086661
60471 1086661 1082552 1079645 1078490 1078981 1080581 1082632 1084785 1087322 1090632 1094256 1096930 1097833 1097213 1095436 1092012
60456 1092012 1086303 1078797 1070768 1062788 1054368 1045174 1035700 1026358 1016715 1006305 995726 986145 977842
60443 977842 969997 961989 954276 947707 942423 937796 933211 928567 924157 920344 917403 915448 914494 914618 915982
60428 915982 918575 922043 925927 930029 934416 939134 944144 949539 955562 962261 969230 975907 982165 988560
60414 988560 995957 1004869 1015070 1025805 1036356 1046443 1056029 1064817 1072040 1076822 1078673 1077561 1073629
60401 1073629 1067131 1058673 1049265 1039838 1030803 1022319 1014886 1009269 1005704 1003616 1002439 1002443 1004320 1008127 1013119
60386 1013119 1018614 1024595 1031420 1039341 1048405 1058427 1068987 1079853 1091478 1104551 1118899 1133449
60374 1133449 1147520 1161451 1175415 1188307 1198563 1205647 1209946 1211592 1210394 1206769 1201713 1195733 1188734
60361 1188734 1181123 1174031 1168023 1162456 1156622 1150836 1145767 1141319 1136834 1131992 1126799 1120994 1114210 1106603
60347 1106603 1098698 1090685 1082296 1073364 1064067 1054697 1045589 1037206 1029904 1023648 1018292 1014036 1011230 1009802
60333 1009802 1009302 1009543 1010805 1013334 1016943 1021218 1025841 1030652 1035551 1040398 1044906 1048713 1051654 1053837
60319 1053837 1055333 1056086 1056419 1057313 1059734 1063776 1068920 1075077 1082975 1093481 1106888 1122832 1140481 1158621
60305 1158621 1175731 1190069 1199712 1202975 1199324 1189758 1175761 1158046 1136803 1113079 1088994 1066365
60293 1066365 1045791 1027467 1012209 1000967 993517 988349 983942 979933 976956 975568 975394 975350 974642 973355
60279 973355 971876 970012 967211 963679 960702 959470 959863 960628 960590 959536 958241 957827 958849 960818 962727
60264 962727 964150 965573 967619 970391 973731 977656 982132 986753 991052 994988 998801 1002534 1005934 1008615
60250 1008615 1010095 1009958 1008232 1005406 1001868 997695 993251 989427 986747 984615 982123 979317 976982 975384
60236 975384 974110 973114 972981 973831 974834 975347 976015 978164 982330 987878 993819 999592 1005166 1010842 1017020
60221 1017020 1023963 1031755 1040456 1050071 1060251 1070366 1080177 1090215 1101186 1113113 1125360 1137324
60209 1137324 1148698 1159226 1168750 1177621 1186656 1196392 1206615 1216775 1226678 1236553 1246609 1256817
60197 1256817 1267097 1277525 1288284 1299498 1311157 1323207 1335718 1348897 1362791 1377012 1391001
60186 1391001 1404639 1418349 1432355 1446112 1458731 1469783 1479310 1487214 1493264 1497774 1501656 1505447
60174 1505447 1508717 1510786 1511627 1511548 1510314 1507308 1502435 1496196 1488741 1479508 1468116 1455118 1441473 1427618
60160 1427618 1413440 1398902 1384240 1369665 1355273 1341284 1328058 1315842 1304695 1294695 1286036
60149 1286036 1278936 1273617 1270418 1269755 1271867 1276587 1283396 1291755 1301494 1312941 1326511 1342131 1359069
60136 1359069 1376364 1393275 1409355 1424340 1438047 1450189 1460241 1467813 1473282 1477676 1481712 1485217
60124 1485217 1487766 1489443 1490574 1491065 1490698 1489870 1489302 1488935 1487781 1485036 1480783 1475352 1468640 1460525 1451525
60109 1451525 1442365 1433069 1422997 1411873 1400388 1389768 1380949 1374180 1369123 1365241 1362298 1360628 1360820
60096 1360820 1363127 1367297 1373058 1380589 1390300 1402104 1415068 1427937 1439998 1451293 1461911 1471263
60084 1471263 1478292 1482341 1483539 1482297 1478679 1472466 1463617 1452386 1439079 1423948 1407371 1389911 1372035
60071 1372035 1353871 1335353 1316593 1297962 1279768 1262000 1244550 1227717 1212241 1198603 1186411
60060 1186411 1174788 1163408 1152860 1143837 1136268 1129568 1123586 1118887 1116003 1114708 1114214 1113933 1113885 1114479
60046 1114479 1116122 1118997 1123072 1128284 1134730 1142610 1151853 1161905 1172087 1182159 1192270 1202347 1211843
60033 1211843 1220262 1227627 1234127 1239537 1243395 1245615 1246451 1245793 1243037 1237888 1230825 1222493 1213065 1202664
60019 1202664 1192105 1182542 1174364 1166910 1159370 1151605 1144050 1137231 1131553 1127174 1123797 1120755 1117536 1114114
60005 1114114 1110623 1106860 1102321 1096615 1089748 1082081 1074186 1066637 1059784 1053686 1048271 1043475 1039261 1035707
59991 1035707 1033112 1031777 1031567 1031953 1032671 1034080 1036563 1039767 1042873 1045593 1048452 1051897 1055453 1058094 1059389
59976 1059389 1059999 1060989 1062812 1065105 1067332 1069342 1071195 1072687 1073477 1073692 1074055 1075143 1076690 1077897 1078259
59961 1078259 1077886 1077161 1076487 1076326 1077077 1078682 1080657 1082630 1084714 1087250 1090483 1094595 1099708 1105483 1110917
59946 1110917 1114988 1117484 1118945 1119869 1120286 1119994 1118743 1116130 1111897 1106599 1101557 1097749 1095019 1092709 1090790
59931 1090790 1089871 1090308 1091955 1094759 1098967 1104554 1110944 1117606 1124556 1131959 1139640 1147410 1155649 1165077
59917 1165077 1175977 1187997 1200702 1214020 1228096 1242892 1257963 1272504 1285662 1296985 1306511
59906 1306511 1314370 1320440 1324581 1327037 1328303 1328685 1328270 1327250 1325997 1324792 1323717 1322868 1322423 1322516 1323179 1324400
59890 1324400 1325991 1327448 1328105 1327419 1324961 1320405 1313899 1306357 1298893 1291924 1285133 1278261 1271432 1264704
59876 1264704 1257885 1251085 1244954 1240037 1236231 1233200 1230928 1229519 1228753 1228326 1228341 1229161 1230918 1233476 1236742
59861 1236742 1240622 1244806 1248973 1253177 1257638 1262128 1265862 1268076 1268551 1267617 1265844 1263671 1261104 1257816
59847 1257816 1253697 1249187 1244815 1240609 1236385 1232531 1230059 1229722 1231405 1234513 1238595 1243433 1248800 1254416
59833 1254416 1260021 1265309 1269857 1273206 1274930 1274631 1272050 1267295 1260810 1253035 1244324 1235258 1226750 1219521
59819 1219521 1213567 1208438 1203997 1200699 1199139 1199580 1201951 1206000 1211234 1216911 1222356 1227227 1231234 1233705
59805 1233705 1233848 1231585 1227830 1223651 1219371 1214723 1209641 1204426 1199221 1193863 1188405 1183421 1179559 1177036
59791 1177036 1175680 1175163 1175068 1175130 1175689 1177620 1181503 1187112 1193883 1201401 1209065 1215805 1220866 1224642 1228041
59776 1228041 1231182 1233463 1234830 1236033 1237387 1238172 1237773 1236692 1235793 1235096 1234040 1232606 1231333 1230334 1229082
59761 1229082 1227306 1225449 1223946 1222513 1220501 1217669 1214304 1210783 1207389 1204443 1202272 1200958 1200275 1199903
59747 1199903 1199571 1199037 1198148 1197090 1196425 1196655 1197716 1199063 1200285 1201527 1203245 1205774 1209288 1214006 1220078
59732 1220078 1227258 1235017 1243183 1252246 1262783 1274664 1287113 1299552 1312116 1325153 1338449 1351204
59720 1351204 1362721 1372801 1381393 1388189 1392860 1395538 1396653 1396335 1394299 1390417 1385051 1378629 1371253 1362999
59706 1362999 1354330 1345880 1337970 1330626 1323925 1318010 1312903 1308661 1305606 1304052 1303891 1304827 1306874 1310129
59692 1310129 1314123 1317959 1321176 1323932 1326334 1328306 1330322 1333511 1338491 1344681 1351291 1358430 1366562 1375315
59678 1375315 1383730 1391592 1399724 1408802 1418536 1428134 1437112 1445490 1453632 1462038 1470878 1479631 1487618 1495038
59664 1495038 1503075 1512786 1524301 1537209 1551213 1566024 1581033 1595558 1609148 1621256 1630837 1636751
59652 1636751 1638504 1636235 1630021 1619554 1604545 1585160 1562093 1536438 1509510 1482453 1455794 1429479
59640 1429479 1403444 1378154 1354635 1334001 1316808 1302716 1290835 1280500 1271670 1264520 1258872 1254253
59628 1254253 1250339 1247019 1244083 1241176 1238007 1234369 1229959 1224513 1218097 1210928 1202886 1193699 1183701 1174008
59614 1174008 1165576 1158420 1152053 1146436 1142020 1138936 1136610 1134322 1131940 1129922 1128665 1127921 1126859 1124742
59600 1124742 1121469 1117462 1113141 1108788 1104766 1101397 1098453 1095275 1091660 1088235 1085562 1083324 1080981 1078913
59586 1078913 1078144 1078985 1080668 1082410 1084173 1086126 1088069 1089885 1092082 1095363 1099843 1105125 1110931 1117203
59572 1117203 1123669 1129779 1135220 1140299 1145761 1152283 1160054 1168656 1177370 1185717 1193712 1201601 1209465 1217052
59558 1217052 1223835 1229162 1232577 1234106 1234143 1233073 1231208 1228955 1226667 1224247 1221382 1218300 1215919 1215108 1216342
59543 1216342 1220200 1227442 1237959 1250219 1262462 1274005 1284580 1292781 1296368 1294416 1288449 1281172 1274638
59530 1274638 1269733 1266639 1265170 1264942 1265650 1267120 1269061 1271082 1273082 1275246 1277502 1279297 1280142 1280094 1279469
59515 1279469 1278290 1276207 1272741 1267519 1260475 1252030 1242916 1233731 1224725 1215883 1206940 1197455 1187358 1177439
59501 1177439 1168786 1161681 1155524 1149987 1145594 1142844 1141344 1140274 1139317 1138625 1138226 1137968 1137914 1138284 1139092 1140215
59485 1140215 1141735 1143885 1146750 1150364 1155036 1161261 1169266 1178776 1189124 1199494 1209279 1218428 1227272
59472 1227272 1235843 1243655 1250434 1256769 1263694 1271887 1281715 1293764 1308761 1326917 1347837 1371035 1396144
59459 1396144 1422529 1449142 1474863 1498785 1520075 1537899 1551665 1561244 1566824 1568605 1566687 1561257
59447 1561257 1552908 1542694 1531562 1519648 1506447 1491859 1476709 1462003 1448088 1434978 1423146
59436 1423146 1413274 1405260 1398022 1390394 1381856 1372422 1362342 1352105 1342429 1334051 1327614 1323629 1322262
59423 1322262 1323163 1325850 1330327 1337204 1347397 1361919 1381511 1405823 1433028 1460839 1487803 1512891
59411 1512891 1533804 1546738 1548633 1539532 1522655 1502671 1484134 1470593 1463848 1463529 1467704 1474157 1481014
59398 1481014 1486229 1486905 1479810 1463232 1438664 1410469 1383437 1360408 1342024 1328101 1318521 1312971
59386 1312971 1310748 1311299 1314560 1320492 1328657 1338479 1349591 1361599 1373837 1385656 1396782 1407133 1416568
59373 1416568 1425030 1432612 1439139 1443947 1446443 1446770 1445590 1443319 1439853 1435059 1429319 1423689 1419546 1417919
59359 1417919 1418917 1421894 1426235 1431811 1438637 1446486 1455071 1464302 1474131 1484360 1494899 1505917 1517381
59346 1517381 1528653 1538896 1547778 1555480 1562233 1568158 1573379 1577850 1581055 1582224 1580851 1576842 1570368
59333 1570368 1561921 1552416 1542813 1533598 1524833 1516563 1508863 1501574 1494468 1487682 1481598 1476237 1471155 1466038
59319 1466038 1460991 1456048 1450698 1444162 1435941 1425975 1414514 1402129 1389647 1377654 1365993 1354016
59307 1354016 1341486 1329073 1317779 1307988 1299397 1291874 1285950 1282120 1279943 1278437 1277339 1277371 1279057 1281871
59293 1281871 1284950 1288134 1291728 1295613 1299313 1302835 1306790 1311576 1317034 1323013 1329726 1337303 1345431 1353714
59279 1353714 1362095 1370664 1379344 1388080 1397117 1406734 1416799 1426877 1436787 1446846 1457525 1468966 1480845
59266 1480845 1492553 1503413 1512837 1520466 1526337 1530866 1534445 1537048 1538406 1538652 1538428 1538109 1537169 1534642
59252 1534642 1530101 1523872 1516465 1508222 1499455 1490441 1481158 1471366 1461022 1450315 1439319 1428037 1416868
59239 1416868 1406555 1397436 1389103 1381015 1373099 1365508 1358169 1350927 1343836 1336942 1329973 1322637 1315090 1307749
59225 1307749 1300739 1293886 1287162 1280742 1274565 1268219 1261462 1254677 1248652 1243909 1240284 1237156 1234180 1231837
59211 1231837 1231096 1232348 1234783 1237035 1238399 1239224 1240272 1242088 1245060 1249611 1255816 1262982 1270080 1276810
59197 1276810 1284000 1292672 1302855 1313558 1323868 1333699 1343329 1352671 1361358 1369291 1376588 1383062 1388235
59184 1388235 1391959 1394534 1396069 1396212 1394816 1392425 1389701 1386674 1383026 1378876 1374778 1371035 1367535 1364287
59170 1364287 1361651 1359938 1359197 1359492 1360962 1363339 1365784 1367533 1368525 1369108 1369316 1368837 1367692 1366493 1365796 1365361
59154 1365361 1364329 1362131 1359043 1355833 1353055 1350923 1349715 1349808 1351100 1352734 1353822 1354371 1355088 1356255 1357207
59139 1357207 1357061 1355561 1352907 1349073 1343813 1337253 1330009 1322624 1315208 1307810 1300793 1294580 1289285 1284939
59125 1284939 1281913 1280693 1281176 1282690 1284948 1288637 1294610 1302682 1311692 1320825 1330420 1341271 1353400 1365801
59111 1365801 1377206 1386891 1394904 1401836 1408392 1414920 1421195 1426752 1431407 1435377 1438884 1441806 1443769 1444597
59097 1444597 1444656 1444758 1445557 1446879 1447671 1446858 1444333 1441077 1438279 1436352 1434718 1432395 1428745 1423827 1418157
59082 1418157 1412224 1406198 1400016 1393551 1386676 1379374 1371955 1365062 1359233 1354504 1350590 1347321 1344670 1342445
59068 1342445 1340256 1337903 1335621 1333838 1332768 1332198 1331507 1329995 1327480 1324579 1322149 1320406 1318794 1316721
59054 1316721 1314098 1311085 1307729 1304083 1300385 1296834 1293363 1289893 1286660 1284096 1282516 1282048 1282578 1283513 1283913
59039 1283913 1283323 1282340 1281988 1282581 1283584 1284517 1285505 1286837 1288437 1289986 1291328 1292576 1294007 1296013 1298914
59024 1298914 1302699 1307081 1311953 1317591 1324223 1331503 1338603 1344783 1349795 1353747 1356638 1358076 1357482 1354664
59010 1354664 1350109 1344579 1338510 1332032 1325509 1319765 1315634 1313453 1312979 1313576 1314478 1315245 1316172 1317961 1320757
58995 1320757 1323720 1325793 1326746 1327142 1327441 1327442 1326717 1325296 1323725 1322400 1321017 1318814 1315489 1311700 1308480 1306332
58979 1306332 1305240 1305434 1307483 1311443 1316455 1321607 1326836 1332574 1338933 1345783 1353356 1361994 1371281 1380120
58965 1380120 1387957 1395464 1403637 1412515 1421125 1428538 1434634 1439756 1443848 1446205 1446159 1443832 1439937 1434834
58951 1434834 1428127 1419347 1408638 1396477 1383071 1368546 1353448 1338499 1323905 1309469 1295350 1282133
58939 1282133 1269961 1258124 1245806 1232963 1220287 1208582 1198296 1189388 1181459 1174231 1167963 1163164
58927 1163164 1159859 1157470 1155438 1153665 1152339 1151793 1152511 1154699 1157661 1160225 1162113 1164365 1168067 1173120
58913 1173120 1178691 1184432 1190668 1197722 1205652 1214556 1224662 1236165 1249188 1263652 1278834 1293378
58901 1293378 1306261 1317646 1328487 1339518 1350960 1362808 1374827 1386581 1398173 1410860 1426240
58890 1426240 1444714 1465249 1486605 1508194 1529704 1550569 1570145 1588036 1604023 1617977 1629963
58879 1629963 1640064 1647989 1653146 1655198 1654287 1650758 1645074 1637967 1630227 1622248 1614182 1606492 1599773 1593926
58865 1593926 1588200 1582308 1576883 1572417 1568323 1563551 1557758 1551309 1544467 1537199 1529680 1522457 1516115 1511129
58851 1511129 1507964 1506891 1507603 1509267 1511027 1512342 1512966 1512870 1512163 1510876 1508769 1505429 1500474 1493544 1484335
58836 1484335 1472878 1459682 1445378 1430247 1414294 1397614 1380444 1362889 1344956 1326884 1309232
58825 1309232 1292557 1277137 1262979 1249918 1237699 1226169 1215564 1206525 1199717 1195268 1192562 1190571
58813 1190571 1188541 1186416 1184572 1183142 1181761 1179996 1177881 1175931 1174680 1174303 1174608 1175374 1176714 1179080 1182724
58798 1182724 1187240 1191919 1196559 1201611 1207428 1213809 1220534 1227909 1236375 1245845 1255951 1266826 1279140
58785 1279140 1293297 1309039 1325881 1343566 1361861 1380248 1398054 1414740 1429890 1443059 1453824
58774 1453824 1461907 1467156 1469494 1469076 1466366 1461951 1456186 1449154 1440950 1431956 1422754 1413769 1405032 1396358
58760 1396358 1387772 1379716 1372760 1367180 1362904 1359872 1358320 1358569 1360579 1363822 1367742 1372265 1377675 1383906
58746 1383906 1390135 1395278 1398828 1401086 1402651 1403956 1405234 1406578 1407863 1408833 1409420 1409840 1410313 1410883 1411573
58731 1411573 1412460 1413530 1414769 1416525 1419353 1423137 1426768 1429220 1430814 1432885 1436271 1440718 1445799 1451716
58717 1451716 1458797 1466689 1474595 1482112 1489283 1495869 1501052 1504092 1504935 1503861 1500738 1494942 1486001 1473973
58703 1473973 1459042 1441048 1419736 1395394 1368880 1341002 1312232 1283155 1254784 1228022 1202988
58692 1202988 1179305 1156989 1136615 1118538 1102420 1087847 1075108 1064907 1057396 1051919 1047804 1045089
58680 1045089 1044266 1045571 1048742 1053305 1058811 1064925 1071655 1079541 1089257 1100888 1113823 1127486 1141861
58667 1141861 1157055 1172665 1187938 1202381 1215772 1227633 1237142 1243659 1246972 1246938 1243279 1236001 1225751
58654 1225751 1213470 1199799 1185015 1169452 1153719 1138416 1123726 1109379 1095140 1081349 1068821
58643 1068821 1058044 1048691 1040129 1032285 1025634 1020400 1016197 1012569 1009523 1007368 1006314 1006316 1007018 1007713 1007682
58628 1007682 1006800 1005618 1004733 1004327 1004444 1005343 1007264 1009995 1012875 1015164 1016479 1017174 1018344 1021040 1025241
58613 1025241 1029886 1034011 1037488 1040526 1042917 1044193 1044237 1043489 1042760 1042915 1044295 1046181 1047355 1047521 1047736 1049034
58597 1049034 1051161 1053194 1054917 1056873 1059385 1062275 1065403 1068737 1071958 1074724 1077474 1081410 1087443 1095488
58583 1095488 1104880 1115128 1126151 1138039 1150697 1163688 1176596 1189621 1203425 1218079 1232606
58572 1232606 1246045 1258597 1271172 1284270 1298089 1313480 1331786 1353599 1378415 1405656 1435307
58561 1435307 1467304 1500908 1534963 1568268 1599469 1627066 1649916 1667601 1680267 1688413 1692717 1693564
58549 1693564 1690674 1683651 1672910 1659543 1644231 1626788 1606773 1583935 1557978 1528642 1496332 1462142
58537 1462142 1426990 1391185 1355044 1319440 1285467 1253974 1225578 1200634 1178944 1159976 1143603
58526 1143603 1130200 1119924 1112382 1107139 1103936 1102259 1101421 1101351 1102630 1105315 1108401 1110818 1112327 1112967
58512 1112967 1112358 1110171 1106730 1102503 1097449 1091524 1085393 1079870 1074961 1070097 1065034 1059986 1055201 1051028
58498 1051028 1048081 1046656 1046199 1045995 1046117 1047116 1049009 1051331 1053976 1057237 1061181 1065731 1071314 1078614 1087675
58483 1087675 1098021 1109702 1123393 1139207 1156164 1173139 1189640 1205187 1218497 1227905 1232465 1232345
58471 1232345 1228390 1221616 1212814 1202283 1189976 1176071 1161314 1146700 1133065 1121068 1111266 1103905
58459 1103905 1098844 1095988 1095742 1098729 1104927 1113214 1121902 1129781 1136652 1142852 1148314 1152226 1153612 1152073
58445 1152073 1147934 1141952 1135071 1128170 1121596 1114947 1107706 1100194 1093586 1088804 1085611 1082947 1080034 1076992
58431 1076992 1074516 1073193 1073225 1074584 1077242 1081166 1086258 1092386 1099442 1107208 1115163 1122601 1128963 1133982
58417 1133982 1137490 1139204 1138721 1135667 1129928 1121917 1112571 1102889 1093391 1084076 1074770 1065371 1056010 1047277
58403 1047277 1040067 1034763 1030746 1027282 1024761 1024345 1026309 1029571 1033178 1037434 1042954 1049240 1055025 1059763
58389 1059763 1064059 1068606 1073326 1077709 1081617 1085598 1090453 1096490 1103150 1109468 1114784 1118758 1120846 1120447
58375 1120447 1117790 1114159 1110990 1109191 1109457 1112401 1117814 1124430 1131212 1138485 1147195 1157436 1168452 1179749
58361 1179749 1191401 1203354 1215196 1226584 1237287 1246836 1254727 1261000 1266066 1269993 1272471 1273520 1273738
58348 1273738 1273851 1274491 1276334 1279910 1285120 1291376 1298307 1306002 1314708 1324751 1336701 1351083 1367716
58335 1367716 1385679 1403952 1421868 1439042 1455293 1470636 1484983 1497928 1509212 1519266 1528748
58324 1528748 1537525 1544702 1549815 1553592 1557330 1561879 1567398 1573790 1581113 1589691 1599987 1612325 1626660
58311 1626660 1642599 1659566 1676976 1694468 1712140 1730346 1749174 1768323 1787512 1806684 1825693
58300 1825693 1844248 1862356 1880390 1898408 1915820 1932094 1947402 1962310 1977253 1992715 2009500
58289 2009500 2028308 2049203 2071694 2095052 2118570 2142165 2166929 2194361 2224764 2257112 2290664
58278 2290664 2325693 2362357 2400100 2438894 2479804 2523431 2568988 2615993 2665556 2718626 2774111
58267 2774111 2830465 2888257 2949371 3014265 3081869 3151693 3224147 3298952 3375097 3452407 3531512
58256 3531512 3612242 3693623 3775503 3858649 3943266 4029029 4116715 4208231 4304824 4406745 4514710
58245 4514710 4630047 4753120 4883200 5020290 5165685 5320492 5484996 5659720 5845645
58236 5845645 6043012 6251370 6471182 6704213 6952121 7215930 7496951 7796970 8117570
58227 8117570 8460565 8828812 9225095 9650625 10106542 10596608 11126431 11700464 12322165
58218 12322165 12997064 13733336 14539616 15425053 16401855 17485282 18691165 20036441 21542836
58209 21542836 23237995 25154115 27330164 29817065 32677564 35979518 39791617 44186588
58201 44186588 49246376 55063737 61741195 69391394 78145672 88178221 99737086 113152877
58193 113152877 128808456 147086468 168301576 192574955 219629763 248609325 278076815
58186 278076815 306206156 330983414 350298168 362072602 364657455 357425304 341153940
58179 341153940 317860986 290174465 260636564 231265097 203425450 177898798 155029677
58172 155029677 134879854 117344792 102223132 89260837 78188337 68746683 60697386
58165 60697386 53825183 47942460 42891147 38538036 34769557 31490892 28625191 26109438
58157 26109438 23890817 21926108 20180483 18624142 17230691 15978328 14849678 13829421
58149 13829421 12903831 12062650 11298517 10603602 9968901 9387345 8855002 8368179 7921500
58140 7921500 7509787 7129715 6778471 6452695 6149836 5868831 5608247 5365264 5137471
58131 5137471 4924228 4725272 4539399 4365507 4203464 4052746 3911341 3777138 3649498
58122 3649498 3528506 3413612 3304038 3199735 3100941 3007231 2917731 2831834 2749246 2669829
58112 2669829 2593838 2521756 2453594 2388792 2326984 2268184 2212136 2158265 2106431 2056963 2009835
58101 2009835 1964602 1921254 1880226 1841439 1804271 1768629 1735042 1703450 1672895 1642683 1612952
58090 1612952 1583813 1554930 1526222 1498017 1470276 1442695 1415803 1390790 1367733 1345112 1321633
58079 1321633 1297557 1273658 1249941 1226103 1202389 1179157 1156264 1133523 1111200 1089603 1068748
58068 1068748 1048802 1030058 1012128 994063 975808 958650 943670 930573 918563 907403 896910
58057 896910 886420 875670 865371 855966 846524 835929 824563 813828 804412 795918 787822 779818 771561
58044 771561 762958 754524 746642 738754 730013 720560 711360 702919 694837 686499 677599 668210 658965 650918
58030 650918 644480 638629 631858 623823 615414 607362 599529 591625 583904 576948 571128 566318 561813 556625
58016 556625 550349 543673 537681 532692 528193 523730 519328 515100 510960 506831 502743 498639 494340 489728
58002 489728 484756 479396 473757 468114 462558 456894 451221 446370 443407 442900 444995 449745 456711 464472
57988 464472 471340 476693 481119 485299 489286 492856 495892 498219 499559 499906 499656 499229 498870 498895 499678 501250
57972 501250 503237 505327 507575 510126 512987 516147 519536 522673 524770 525452 525118 524314 522995 520744 517488
57957 517488 513577 509199 504171 498521 492999 488646 485894 484289 483114 482081 481377 481296 482061 483856 486697
57942 486697 490312 494389 498904 503946 509288 514579 520061 526533 534344 542765 550735 557873 564345 569991
57928 569991 574138 576210 576102 573974 570146 565330 560541 556536 553419 550826 548364 545903 543708 542307
57914 542307 541985 542326 542454 541833 540699 539641 538913 538174 536726 533945 529700 524490 519071 513741 508127 501767
57898 501767 494814 487990 481922 476809 472695 469663 467535 465713 463781 462176 461721 462444 463363 463667 463593 463776
57882 463776 464193 464308 463926 463205 461993 459886 456987 453917 450988 447964 444822 442117 440288 439126 438257
57867 438257 437704 437679 438254 439575 441940 445331 449314 453790 459397 466676 475274 484448 494011 504171 514695
57852 514695 524764 533492 540112 543944 544808 543321 540238 535572 528901 520393 510839 500667 489549 477137
57838 477137 463669 449691 435652 422026 409455 398497 389410 382228 376769 372515 368834 365450 362427
57825 362427 359611 356439 352459 347806 343024 338641 335043 332502 330996 330046 328866 326789 323631 319833
57811 319833 316212 313426 311600 310513 310046 310257 311037 311955 312641 313242 314398 316623 319705 322877 325744 328831
57795 328831 332810 337245 340690 342261 342622 343027 343874 344682 345130 345451 345843 346074 345729 344567 342706 340737
57779 340737 339471 339157 339058 338227 336556 334655 332864 330968 328796 326510 324194 321685 318967 316282 313752
57764 313752 311190 308394 305299 301924 298562 295921 294550 294060 293449 292282 291108 290711 291433 293215 295617
57749 295617 297678 298483 298187 297845 297945 297727 296428 294547 293252 292923 292934 292599 291722 290319 288373 285956 283280
57732 283280 280543 277878 275327 272754 269955 267036 264483 262674 261535 260840 260552 260688 261113 261742 262621 263556
57716 263556 264058 264022 264075 264710 265358 264963 263400 261686 260760 260562 260469 260156 259811 259860 260806 263076 266712 271163
57698 271163 275480 278768 280561 280966 280533 279800 278879 277486 275434 273013 270877 269594 269364 270122 271892 274942
57682 274942 279612 286087 294510 305262 318948 336088 356943 381693 410593 444015 482558 527102
57670 527102 578316 635716 697243 759755 819694 873050 915018 940443 945345 928669 893004 843615
57658 843615 786441 726456 667297 611561 560761 515154 474334 438180 406874 380005 356393
57647 356393 335148 316397 300575 287471 276418 267037 259219 252663 246996 242240 238592 235786 233130
57634 233130 230171 226999 223931 221198 218841 216599 214021 211006 208067 205702 203623 201069 197710 193836
57620 193836 189790 185800 182294 179751 178089 176727 175403 174460 174139 174036 173545 172514 171266 170260 169868
57605 169868 170116 170465 170178 169128 167972 167377 167434 167963 168882 169895 170240 169298 167340 165247 163631 162588 162143
57588 162143 162363 162980 163351 162998 161998 160736 159486 158333 157305 156457 155877 155651 155703 155683 155235 154394 153543 152910
57570 152910 152343 151653 150920 150185 149097 147317 145235 143797 143417 143429 142903 141651 140092 138471 136857 135801
57554 135801 136179 138095 140482 142205 143143 143819 144440 144898 145398 146339 147583 148505 148872 149124 149622 150156 150396
57537 150396 150334 150010 149253 148071 146908 146071 145223 143898 142342 141336 141208 141490 141564 141314 141037 140995 141199 141430
57519 141430 141368 140854 140097 139484 139161 139019 139138 139958 141746 144004 145754 146491 146650 146973 147570 147895 147640 147311
57501 147311 147708 149046 150840 152504 153731 154363 154356 153958 153566 153205 152534 151546 150877 151033 151653 152018 152053 152238
57483 152238 152687 152940 152769 152540 152529 152449 151996 151422 151052 150669 149940 149283 149615 151194 153245 154897 156062 157200
57465 157200 158622 160331 162264 164352 166413 168265 169873 171211 172076 172225 171719 170989 170576 170890 172033 173661
57449 173661 175119 175960 176398 177085 178452 180418 182738 185411 188612 192296 196018 199182 201528 203326 204935
57434 204935 206109 205937 203724 199846 195502 191706 188741 186490 184770 183281 181680 180038 178955 178955 179987
57419 179987 181707 183963 186608 189137 191056 192645 194889 198532 203489 209277 215572 222069 228077 232698
57405 232698 235385 236071 234812 231650 226948 221492 215973 210434 204537 198339 192516 187730 184059 181246
57391 181246 179238 178084 177442 176675 175545 174518 174174 174585 175421 176439 177622 179037 180793 182983 185392
57376 185392 187353 188184 187824 186862 185951 185313 184848 184530 184621 185448 186956 188547 189565 189964 190264 190784 191229 191282
57358 191282 191256 191782 193021 194597 196279 198304 200928 203944 206725 208610 209307 209210 209306 210435 212535 214785
57342 214785 216537 217838 219056 220318 221509 222559 223584 224867 226764 229381 232238 234493 235696 236178
57328 236178 236575 237131 237618 237770 237603 237359 237347 237826 238935 240688 243003 245638 248180 250308 252104 253930
57312 253930 255909 257759 259209 260350 261431 262525 263656 265094 267166 269756 272282 274297 275981 277925
57298 277925 280493 283527 286675 289878 293384 297285 301191 304507 306978 308816 310400 312014 313855 316028
57284 316028 318349 320311 321401 321495 320857 319824 318559 317117 315733 314948 315327 317009 319695 323178 327729
57269 327729 333733 341065 349150 357649 366823 377054 388109 399046 408856 417294 425159 433659 443368
57256 443368 453859 464380 474625 484537 493716 501587 508221 514484 521239 528732 536852 545522 554591
57243 554591 563737 572783 581950 591592 601829 612572 623672 634949 646282 657723 669316 680825
57231 680825 692030 703304 715332 728168 741180 754196 767954 782892 798147 812538 826124
57220 826124 839906 854225 868441 882253 896447 911995 929042 947141 965988 985516 1005559
57209 1005559 1025764 1045703 1064918 1083169 1100776 1118447 1136584 1154971 1173290 1191627 1210273
57198 1210273 1229389 1249202 1270335 1293511 1319000 1346595 1376073 1407252 1439578 1472000 1503532
57187 1503532 1533882 1563397 1592521 1621467 1650298 1679052 1707653 1735893 1763665 1791115 1818384
57176 1818384 1845327 1871797 1898191 1925288 1953346 1981648 2009216 2035766 2061744 2087705 2114051
57165 2114051 2141189 2169372 2198292 2227194 2255497 2283011 2309513 2334590 2358139 2380739 2403235
57154 2403235 2426187 2449941 2474905 2501251 2528435 2555497 2582105 2609056 2637538 2668000 2699835
57143 2699835 2731969 2763450 2793535 2821644 2847603 2871792 2894758 2916577 2936791 2955032 2971520
57132 2971520 2986923 3001951 3017266 3033609 3051722 3072154 3095259 3121377 3150821 3183654 3219544
57121 3219544 3257823 3297708 3338633 3380630 3424440 3471285 3522567 3579758 3644289 3717280 3799414
57110 3799414 3891273 3993967 4109677 4242014 4396040 4577748 4793224 5048416 5349867 5705540
57100 5705540 6124766 6617340 7192453 7857590 8617407 9473307 10424336 11468702 12604502
57091 12604502 13829051 15137238 16519305 17958580 19430321 20902486 22337368 23692482
57083 23692482 24921436 25977604 26821656 27429634 27796328 27931499 27851492 27571579 27103108
57074 27103108 26455394 25639132 24668424 23561194 22339095 21027182 19652927 18244923
57066 18244923 16832030 15442435 14101632 12829932 11641400 10544656 9544031 8640009
57058 8640009 7829560 7107059 6465300 5896158 5391304 4943093 4544838 4190286 3873244
57049 3873244 3588025 3329913 3094878 2879087 2679024 2491961 2316101 2150491 1995002
57040 1995002 1850111 1716266 1593318 1480536 1376986 1281833 1194618 1115389 1044319 981008
57030 981008 924350 873184 826856 785126 747909 715190 686733 661574 638312 616164 595351
57019 595351 576185 558290 541143 524810 509481 494689 479757 464855 450877 438302 426740
57008 426740 415672 405071 395189 386148 377892 370204 362755 355413 348449 342117 336234 330595 325610 321911
56994 321911 319330 316929 314191 311649 310133 309953 311058 313508 317306 322089 327319 332601 337560 341610
56980 341610 344103 344607 342884 338845 332724 325181 316948 308461 299965 291855 284718 279007 274727 271475
56966 271475 268962 267583 268325 271799 277529 284575 292754 302752 314898 328316 341430 352810 361254
56953 361254 365669 365547 361435 354437 345285 334238 321813 309235 297959 288930 282252 277383 273679
56940 273679 270959 269685 270555 273946 279840 288188 299148 312878 329068 346660 364011 379391 391353
56927 391353 398682 400295 395564 384899 369793 352175 333742 315755 299056 284048 270751 258959
56915 258959 248295 238303 228905 220729 214471 209826 205611 201222 197401 195087 194053 193297 192409 191734 191378
56900 191378 190912 190234 190004 190903 192969 195893 199543 203860 208656 213981 220482 229046 240090 253312 267953
56885 267953 283036 297459 310029 319449 324438 324335 319902 313232 306396 300135 294034 287836 282279 278647
56871 278647 277860 280146 285448 293893 305843 321574 341015 363834 389733 418503 449727 482525
56859 482525 515568 547152 575155 597112 610742 614736 609288 596057 577553 556228 533838 511614
56847 511614 490934 473586 461195 454537 453603 458207 468416 484656 507718 538522 577411 623453
56835 623453 674590 728453 782780 835042 881938 919458 943462 950580 939371 911266 870344 821790
56823 821790 770260 719320 671693 629340 593252 563615 540469 524135 515023 513246 518579 530759
56811 530759 549739 575595 608058 645907 686747 727402 764476 794464 813647 818695 808079 783071
56799 783071 747184 704510 658523 612027 567525 527131 492089 462649 438552 419671 406186
56788 406186 398188 395277 396712 402101 411782 426173 444605 465034 485025 502780 516911 525551 526445
56775 526445 518288 501662 478488 450915 420964 390644 361568 334354 308896 285370 264545 246981
56763 246981 232360 219889 209040 199591 191263 183692 176673 170113 163847 157824 152382 147972 144577
56750 144577 141616 138490 135071 131718 129018 127481 127149 127392 127307 126464 125174 123951 122889 121671 120095
56735 120095 118421 117123 116351 115742 114914 114064 113816 114382 115185 115572 115628 115927 116620 117257 117492 117562 117865 118403 118755
56716 118755 118463 117379 115877 114728 114437 114684 114730 114453 114590 115823 117985 120324 122135 122946 122616 121680 121284
56699 121284 122189 123992 125683 126822 127678 128395 128605 128061 127122 126407 126161 126180 126167 126015 125885 126142 127143 128957
56681 128957 131266 133556 135396 136621 137370 137895 138284 138405 138152 137679 137313 137405 138344 140448 143595 147088 150167
56664 150167 152655 154960 157559 160670 164259 168035 171432 173946 175546 176534 176979 176607 175397 174020 173400
56649 173400 173865 174898 175763 176257 176752 177501 178178 178354 178310 178933 180632 182752 184298 184934 184908 184386 183394 182224
56631 182224 181224 180214 178729 176924 175617 175139 174712 173389 171291 169433 168543 168456 168533 168227 167232 165527
56615 165527 163537 162023 161531 161861 162186 161753 160486 158900 157494 156353 155294 154235 153318 152789 152841 153415
56599 153415 154113 154538 154837 155580 156839 157738 157436 156315 155634 156054 157088 158059 158906 159830 160698 161273 161655 162079
56581 162079 162465 162524 162192 161702 161377 161556 162537 164340 166630 169027 171329 173377 175003 176395 178196 180823
56565 180823 183886 186662 189087 191859 195607 200324 205681 211404 217105 222067 225656 227926 229545 231059
56551 231059 232453 233582 234714 236275 238091 239354 239555 239070 238498 237790 236548 234973 233777 233114 232270 230673
56535 230673 228643 226780 225115 223350 221496 219742 217928 215764 213428 211414 209764 207912 205335 201968
56521 201968 197985 193609 189298 185706 183134 181184 179163 176792 174454 172840 172344 172623 172734 171943 170483
56506 170483 169300 168947 168958 168520 167562 166842 167030 168030 169250 170186 170515 169945 168416 166459 164960 164381 164428
56489 164428 164531 164388 163901 163014 161944 161293 161446 161976 162082 161599 161124 161187 161703 162301 162728 162839 162654 162588 163218
56470 163218 164583 166081 167266 168307 169389 170114 169990 169261 168784 169107 169986 170745 170871 170349 169662 169402 169734
56453 169734 170296 170678 170818 170867 170927 171137 171748 172876 174332 175818 177110 177959 178167 177963 177908 178158 178143 177307 175875
56434 175875 174588 173996 174303 175541 177371 179025 179983 180552 181306 182134 182380 181846 181159 181094 181920 183349 184728
56417 184728 185302 184737 183474 182335 181797 181848 182390 183305 184174 184351 183498 181887 180226 179311 179621 180981 182784
56400 182784 184746 187151 190031 192535 193743 193867 194004 194808 196046 197419 199106 201258 203527 205357 206468
56385 206468 206908 206925 206893 207141 207805 208940 210524 212155 213105 213126 212867 212974 213175 212927 212562 212837 213575 213829 213428
56366 213428 213233 213693 214248 214526 215008 215897 216365 215753 214777 214590 215233 215868 216161 216504 217082 217561 217753 217914 218339
56347 218339 219037 219802 220245 219930 218885 217834 217533 218033 218968 220322 222301 224610 226498 227663 228605 229908
56331 229908 231514 232876 233573 233652 233658 234439 236666 240205 244006 246826 248172 248598 249105 250286 252009 253741
56315 253741 255027 255684 255927 256489 258307 261684 265823 269578 272549 275116 277583 279891 282124 284643 287488
56300 287488 290220 292580 294775 296822 298158 298357 297800 297190 296766 296460 296504 297324 298966 301077 303422 306047
56284 306047 309099 312733 317093 322049 327096 331797 336161 340309 343968 346733 348811 351179 354915 360493
56270 360493 367529 375060 382222 388913 395712 403083 410917 419042 427823 437811 449064 461270 474471
56257 474471 489197 505819 524206 544231 566327 591333 619760 651396 685663 722296 761503
56246 761503 803349 847220 892121 937330 982392 1026547 1068629 1107560 1142551 1172754 1197228
56235 1197228 1215428 1227267 1232606 1231154 1223053 1208962 1189352 1164332 1134586 1101844 1067861 1033326
56223 1033326 998224 962764 927381 892346 858064 825491 795450 767662 741070 715106 690137
56212 690137 666796 645426 626125 608799 593103 578675 565420 553325 542192 531920 522801 515069
56200 515069 508385 502275 496905 492879 490351 488862 487926 487225 486290 484728 482920 481918 482416 484076 486038
56185 486038 487761 489233 490636 492005 493189 494164 495352 497349 500142 502915 504999 506726 508892 511598
56171 511598 514208 516454 519033 522945 528515 535152 541886 548203 554494 561579 569712 578319 586939 595996
56157 595996 606270 617996 631001 645434 661757 680100 700229 722187 746576 774264 806090
56146 806090 842772 884778 932410 986145 1046526 1113325 1185190 1260390 1337348 1413887 1486699
56135 1486699 1552637 1610493 1660843 1704558 1742424 1775937 1807116 1836993 1864877 1889193 1908394
56124 1908394 1921004 1925804 1922592 1912381 1896462 1875482 1849403 1817827 1780141 1735752 1684432 1626386
56112 1626386 1562209 1493288 1422168 1351990 1285380 1224029 1169025 1121012 1080094 1046054 1018599
56101 1018599 996975 979723 965579 954492 947055 942987 940914 939624 938830 938652 939136 940465 942931 946492
56087 946492 950784 955661 961244 967438 973974 980917 988611 997108 1006140 1015585 1025464 1035626 1045995 1056963
56073 1056963 1068913 1081534 1094276 1107246 1120937 1135337 1150150 1165677 1182533 1200621 1219265
56062 1219265 1238181 1257382 1276368 1294605 1312663 1331630 1351377 1370653 1388998 1407299 1426184
56051 1426184 1445184 1463866 1482690 1502268 1522767 1544402 1567502 1591734 1616243 1640921 1666610
56040 1666610 1693789 1722140 1751719 1783376 1817558 1853719 1891373 1930753 1971981 2014602 2058386
56029 2058386 2103636 2150289 2197673 2245532 2294406 2344739 2396598 2450487 2507298 2567204 2629685
56018 2629685 2694859 2763502 2835550 2910002 2986654 3066544 3150404 3238144 3330121 3427158 3528890
56007 3528890 3633986 3742733 3857566 3980123 4109551 4244789 4386743 4537005 4695917
55998 4695917 4863132 5038796 5223149 5416331 5619577 5835203 6064562 6307568 6565004
55989 6565004 6839520 7133344 7446940 7781180 8138963 8523423 8936419 9380258 9859131
55980 9859131 10377405 10938257 11545574 12205693 12926136 13714505 14579992 15534274 16589993
55971 16589993 17760720 19063857 20521900 22160660 24009821 26107517 28503029 31255914
55963 31255914 34437559 38135842 42455173 47511386 53431153 60357820 68455171 77910306
55955 77910306 88946358 101838660 116912167 134515319 154975057 178500471 204993954
55948 204993954 233832017 263783988 293149093 319969735 342139231 357474785 364023835
55941 364023835 360665643 347655726 326666631 300255128 271111480 241497678 213019967
55934 213019967 186649432 162858856 141786966 123374252 107447226 93767154 82068388
55927 82068388 72088429 63581782 56323933 50116698 44792448 40210435 36250323 32810904
55919 32810904 29810515 27182671 24870496 22826111 21011814 19397402 17956179 16664560
55911 16664560 15503126 14455357 13506307 12643939 11859866 11146676 10495816 9899417 9352252
55902 9352252 8849981 8387111 7958587 7561893 7195614 6857098 6543301 6252722 5984686
55893 5984686 5737672 5510014 5301252 5111161 4938281 4781038 4639531 4514612 4405595
55884 4405595 4310171 4225972 4150904 4082290 4016813 3951058 3881404 3804036 3716110 3616758 3506708
55873 3506708 3387693 3262730 3135823 3010361 2888268 2771045 2660481 2557570 2461795 2372427
55863 2372427 2289599 2213302 2142428 2075872 2013623 1955726 1901200 1849207 1800380 1755657 1714537
55852 1714537 1675816 1639359 1605653 1574035 1542831 1511165 1479406 1447924 1416638 1385818 1356276
55841 1356276 1328444 1301937 1276113 1250645 1225623 1201605 1179323 1158805 1139051 1119063 1098932
55830 1098932 1079431 1060944 1043346 1026555 1010594 995403 981054 967673 954689 940824 925520
55819 925520 909789 894899 880882 867266 854556 843660 834187 824681 814629 805077 797042 790347
55807 790347 784354 778993 774542 771016 768224 766158 765001 764975 766239 768650 771533 773930 775154 774970 773403
55792 773403 770679 767261 763573 759635 755111 749646 743014 735092 725842 715212 703084 689709 676296
55779 676296 664692 656306 651702 651213 655042 662321 670829 678333 683559 685276 681329 669866 651422 628814
55765 628814 605088 582226 561509 543785 528926 515764 503050 490320 477866 466370 456666 449341
55753 449341 444323 441073 439146 438337 438418 439151 440502 442536 445184 448363 452099 456092 459350 460708 459690
55738 459690 456571 451838 445969 439498 432777 425822 418793 412380 407132 402608 397769 392140 386087 380094
55724 380094 374331 368856 363688 358753 354259 351008 349746 350270 351729 353715 356434 359821 363189 365837
55710 365837 367366 367299 365126 361049 356207 351828 348394 345674 343142 340212 336416 331582 325697 318779 311219
55695 311219 304022 298091 293285 288738 284134 280094 277254 275504 274233 272826 270926 268760 267227 267031
55681 267031 267721 268247 268461 269182 270681 272126 272870 273248 273472 272759 270490 267530 265285 263866 262243 260006
55665 260006 257893 256516 255588 254694 254031 253874 253938 253821 253781 254491 256122 258120 259943 261717 263936 266740 269759
55648 269759 272649 275463 278338 281021 282925 283509 282347 279048 273571 266692 259727 253634 248637 244700
55634 244700 241878 239994 238516 237112 236052 235641 235568 235323 235078 235645 237527 240378 243422 246039 247907 248964
55618 248964 249487 249944 250529 250842 250192 248227 245256 241961 238867 236064 233442 231062 229179 227949 227288 227007
55602 227007 226908 226650 225812 224278 222434 220738 219236 217639 215730 213368 210302 206466 202555 199800 198842
55587 198842 199064 199363 199408 199709 200543 201421 201960 202884 205604 210724 217357 224094 230376 236652 243307 249775
55571 249775 254843 257681 258439 257865 256496 254334 251206 247175 242443 237042 230928 224362 217842 211596 205415
55556 205415 199093 192724 186423 180165 174250 169571 166852 165691 164892 163755 162563 161710 160939 159753 158202
55541 158202 156780 155767 155078 154712 154838 155322 155506 154766 153148 151233 149491 148050 147087 147020 147980 149296 149959
55524 149959 149683 149200 149294 149769 149569 147867 144893 141779 139732 139247 139913 140863 141446 141511 141273 141078 141189 141471
55506 141471 141270 139969 137798 135742 134525 133953 133395 132505 131300 129991 129061 129022 129638 129817 128832 127334 126563
55489 126563 126876 127709 128770 130391 132691 135255 137848 140767 144175 147613 150520 152823 154750 156424 157875
55474 157875 159058 159673 159343 158161 156702 155278 153536 151041 147890 144611 141741 139675 138443 137456 135910
55459 135910 133739 131748 130531 129716 128603 127076 125461 123915 122486 121351 120492 119414 117828 116387 116089
55444 116089 117060 118452 119476 119960 119964 119510 118839 118385 118291 118326 118454 119029 120182 121435 122211 122530 122888 123619 124605
55425 124605 125540 126238 126687 126984 127238 127461 127568 127507 127393 127468 127939 128808 129812 130503 130414 129246 127018 124164
55407 124164 121398 119254 117732 116560 115817 115973 117132 118513 119079 118582 117730 117359 117704 118458 119232 119817 120181
55390 120181 120472 120972 121906 123148 124081 123909 122348 120103 118488 118418 119730 121443 122496 122265 120734 118431
55374 118431 116099 114201 112746 111629 110910 110623 110539 110339 109920 109367 108820 108585 109144 110704 112780 114483 115239
55357 115239 115129 114653 114367 114532 114846 114680 113881 113163 113345 114325 115211 115374 114942 114261 113398 112327 111202 110259
55339 110259 109650 109440 109531 109569 109278 108892 108898 109307 109608 109492 109136 108676 107990 107229 106943 107216 107271 106507 105469 105094
55319 105094 105367 105519 105377 105580 106401 107236 107603 107929 108842 110224 111475 112360 113041 113481 113325 112335 110682 108916
55301 108916 107807 107912 108925 109735 109571 108890 108655 108991 109243 109238 109605 110628 111597 111821 111682 112067 113139 114262
55283 114262 114851 114715 113780 112219 110766 110165 110157 109702 108428 107313 107499 108870 110273 110872 110780 110509 110351 110392
55265 110392 110722 111292 111748 111688 111161 110717 110822 111305 111593 111486 111337 111304 110847 109446 107614 106567 106791 107502
55247 107502 107798 107787 108142 108877 109159 108279 106397 104348 103001 102852 103867 105527 107092 107982 108033 107513 106945
55230 106945 106752 106935 107163 107203 107095 106860 106332 105491 104758 104637 105151 105854 106297 106307 105965 105632 105889 107040 108655
55211 108655 109896 110359 110355 110349 110490 110796 111388 112199 112664 112163 110836 109653 109480 110232 111124 111621 111891 112369 113166
55192 113166 114037 114709 115000 114820 114347 114061 114274 114626 114400 113355 111964 110813 110196 110326 111406 113167 114732
55175 114732 115397 115328 115158 115120 114996 114757 114739 115146 115753 116220 116473 116643 116768 116622 115894 114561 113092 112022 111366
55156 111366 110746 110194 110322 111416 112766 113362 112953 111980 110798 109587 108801 108923 109676 110102 109624 108617 107775
55139 107775 107394 107454 107973 108988 110371 111855 113065 113544 113100 112191 111564 111416 111244 110660 109912 109400 109083 108729
55121 108729 108440 108557 109164 109994 110753 111320 111665 111741 111454 110723 109654 108653 108179 108351 108880 109392 109672 109714 109773
55102 109773 110284 111384 112622 113528 114355 115715 117480 118714 118878 118434 117940 117246 116095 114938 114426 114447 114368
55085 114368 114088 114167 114920 116010 116958 117597 117907 117855 117502 116967 116220 115226 114314 114015 114410 114979 115195 115033 114745
55066 114745 114454 114109 113666 113127 112568 112253 112526 113412 114431 115014 115099 115188 115781 116817 117759 118200 118258 118228 117991
55047 117991 117091 115505 113950 113108 112806 112360 111645 111370 112238 114184 116546 118695 120331 121425 122128 122657
55031 122657 123127 123457 123459 122931 121775 120243 119062 118990 120045 121296 121627 120653 118851 116944 115334 114087 113225
55014 113225 112892 113168 113787 114197 114074 113705 113669 114182 114966 115778 116680 117663 118397 118702 119013 119875 121017 121455 120674
54995 120674 119336 118550 118733 119479 120270 120892 121171 120850 119899 118689 117660 116990 116681 116748 117109 117508 117801 118163
54977 118163 118738 119220 119185 118775 118697 119438 120787 122169 123176 123704 123974 124542 125921 127868 129349 129572 128876
54960 128876 128247 128094 127948 127325 126458 125975 126134 126607 126996 127413 128443 130400 132647 133952 133747 132780 132190
54943 132190 132157 131924 131063 130088 129618 129483 129068 128248 127494 127226 127491 128317 129960 132552 135677 138552 140717
54926 140717 142485 144676 147881 152053 156856 162253 168453 175264 181795 187120 191094 194286 197083 199138
54912 199138 199697 198307 195090 190538 185236 179734 174467 169614 165008 160307 155395 150651 146665 143604
54898 143604 140967 138180 135355 133216 132254 132215 132534 133024 133859 135086 136518 138149 140315 143229 146573 149775
54882 149775 152630 155477 158808 162853 167571 172774 178113 183065 187179 190454 193304 195960 197922 198214
54868 198214 196287 192524 187749 182482 176954 171630 167155 163687 160724 157871 155367 153493 151824 149594
54854 149594 146715 143867 141566 139601 137525 135223 132796 130325 128063 126546 126045 126092 125929 125369 124845 124628
54838 124628 124407 123807 123010 122539 122584 122778 122690 122282 121809 121389 120926 120422 120135 120335 121023 122020 123172 124323 125199
54819 125199 125635 125822 126072 126361 126393 126133 125953 126126 126468 126638 126551 126322 126066 125985 126377 127294 128314 128953 129128
54800 129128 128955 128289 126912 125189 124115 124475 126108 128131 129735 130668 131104 131275 131297 131240 131181 131145 131111 131244
54782 131244 131997 133713 136126 138558 140709 142893 145356 147794 149907 152094 155087 158998 163199 167175
54768 167175 171046 175192 179740 184616 189808 195320 200912 205977 209668 211216 210357 207454 203106 197753
54754 197753 191772 185729 180139 175080 170427 166375 163276 160896 158427 155459 152502 150216 148489 146681
54740 146681 144505 142314 140688 140083 140696 142219 143798 144642 144765 144877 145598 147056 149205 152093 155660 159612
54724 159612 163741 168207 173238 178692 184082 188923 192845 195513 196739 196692 195742 193948 190906 186293 180469
54709 180469 174398 168996 164671 161358 158702 156178 153362 150306 147580 145774 145004 144941 145079 144816 143544
54694 143544 141086 138069 135509 133878 132814 131801 130861 130341 130294 130415 130517 130694 130900 130681 129644 128065
54678 128065 126710 125955 125378 124456 123409 122982 123355 123783 123478 122541 121666 121173 120757 120092 119219 118298 117405 116718
54660 116718 116603 117318 118819 120969 123642 126401 128331 128567 127068 124705 122500 120864 119571 118396 117629
54645 117629 117750 118611 119273 118985 118157 117906 118686 119871 120832 121819 123345 125121 126246 126335 125895 125513 125178 124647
54627 124647 124073 123925 124400 125267 126304 127596 129179 130537 130852 129982 128937 128979 130253 131658 132215 132095 132068
54610 132068 132342 132463 132167 131766 131646 131855 132338 133194 134414 135627 136373 136610 136787 137429 138668 140059 140835
54593 140835 140439 138913 136790 134756 133451 133367 134442 135814 136433 136143 135775 135998 136496 136624 136482 136769 137729
54576 137729 138827 139516 139800 139896 139804 139527 139400 139859 140988 142480 143908 144856 145000 144341 143273 142184 141113
54559 141113 140056 139444 139804 140909 141790 141884 141839 142714 144579 146404 147318 147516 147754 148424 149486 150942 152736
54542 152736 154271 154694 153985 153307 153803 155265 156359 156065 154461 152268 150150 148515 147448 146605 145569 144514
54526 144514 144096 144439 144736 144284 143468 143159 143447 143688 143614 143635 143982 144279 144155 143683 142967 141901 140675 140020 140480
54507 140480 141710 142894 143595 143973 144443 145300 146375 146899 146200 144799 144204 145219 147000 148321 149148 150198
54491 150198 151461 152184 152131 151839 151662 151501 151554 152374 153843 154970 155141 154884 154938 155235 155373 155599 156645 158769
54473 158769 161402 163635 164887 165406 166224 168130 170485 171636 170875 169370 168650 168865 169218 169585 170609 172362
54457 172362 173877 174256 173541 172343 171102 169946 168858 167811 166936 166470 166228 165383 163325 160645 158621 157815
54441 157815 157843 158504 160078 162203 163455 162840 161138 160001 160102 160876 161731 162640 163554 164111 164182 164149 164375 164729
54423 164729 164879 164778 164631 164619 164759 164879 164657 163913 162983 162580 163135 164326 165370 165675 165249 164659 164543 164954
54405 164954 165233 164825 164146 164177 165133 166173 166707 167335 168876 170934 172235 172239 171645 171266 171161 171027 170697 169958
54387 169958 168547 166791 165731 166020 167088 167887 168129 168217 168312 168214 168016 168141 168644 169078 169199 169310 169793 170725
54369 170725 172066 173772 175559 176995 178017 178991 180095 181073 181745 182266 182623 182354 181156 179416 177826 176819
54353 176819 176645 177486 178959 179974 179792 179008 178793 179289 179477 178611 176976 175082 172877 170256 167762 166122
54337 166122 165308 164606 163579 162526 161951 161880 161877 161559 160921 160216 159643 159237 159002 159013 159282 159608 159739 159643 159460 159175
54317 159175 158599 157788 157237 157394 158053 158502 158294 157652 156995 156367 155602 154928 154945 155869 157105 157847 157939 157846 157901 157923
54297 157923 157568 156725 155499 154093 152900 152359 152521 152907 153028 152899 152872 153068 153205 152942 152266 151546 151260 151554
54279 151554 152036 152175 151949 151855 152177 152564 152594 152453 152737 153756 155371 157312 159240 160647 161201 161199 161232 161326 160831
54260 160831 159385 157605 156532 156608 157442 158403 159175 159796 160380 160905 161197 161075 160509 159573 158331 156871 155463
54243 155463 154523 154349 154929 155943 156866 157112 156369 154943 153692 153422 154259 155592 156592 156820 156377 155627 154813
54226 154813 153998 153249 152743 152637 152900 153355 153811 154146 154336 154414 154383 154209 153987 154018 154500 155194 155659 155785 155794 155642
54206 155642 154890 153349 151488 149900 148722 147873 147555 148071 149282 150612 151461 151410 150300 148532 147044 146508
54190 146508 146668 146907 147220 148053 149308 150280 150715 151298 152732 154837 156823 158171 158864 159018 158647 157766 156548
54173 156548 155357 154540 154057 153399 152143 150539 149276 148717 148665 148838 149168 149536 149598 149073 148029 146801 145813
54156 145813 145429 145709 146306 146825 147162 147278 146916 146048 145353 145570 146456 147142 147493 148260 149687 150911 151206 150941
54138 150941 150734 150431 149723 149146 149492 150507 151131 150945 150608 150866 151787 153058 154387 155470 156065 156281 156414
54121 156414 156463 156181 155654 155376 155602 156000 156128 155966 155782 155699 155584 155213 154455 153405 152407 151821 151764 152109 152680
54102 152680 153304 153831 154320 155079 156175 157049 157042 156330 155911 156446 157509 158168 158063 157595 157296 157368 157795 158535 159491
54083 159491 160512 161565 162787 164234 165692 166912 167993 169295 170908 172501 173833 175165 176865 178818
54069 178818 180677 182627 185364 189184 193537 197725 201654 205546 209231 212189 214153 215225 215390 214304
54055 214304 211766 208225 204597 201524 198893 196175 193236 190583 188624 187013 185192 183460 182840 183736 185294
54040 185294 186421 186925 187296 187884 188790 190130 191747 192941 193115 192555 192008 191616 190923 189830 188832 188188 187522
54023 187522 186485 185320 184416 183705 182836 181701 180486 179324 178150 176860 175520 174420 173905 174026 174405 174576
54007 174576 174386 173979 173537 173237 173253 173442 173231 172210 170783 169824 169687 169977 170270 170541 170740 170501 169637 168639
53989 168639 168363 169255 170966 172617 173431 173365 173176 173656 174802 176016 177048 178256 179845 181348 182183 182387
53973 182387 182466 182785 183422 184395 185632 186778 187414 187499 187427 187558 187810 187755 187024 185665 184134 182996 182576 182853
53955 182853 183548 184302 184892 185407 186059 186734 186955 186546 186106 186457 187730 189371 190940 192427 193913 195475 197548
53938 197548 200789 205294 210346 215206 219799 224343 228716 232536 235591 237870 239332 240016 240313 240923 242567
53923 242567 245760 250598 256569 262775 268513 273541 277817 281263 283824 285319 285161 282739 278288 272876
53909 272876 267184 260859 253578 246150 239841 234869 230439 226098 222301 219542 217687 216349 215268 213995
53895 213995 211805 208413 204488 200992 198194 195674 193100 190624 188511 186767 185261 184034 183306 183188 183483
53880 183483 183833 184003 183914 183466 182564 181453 180785 181008 181746 182113 181699 180949 180529 180606 180924 181270 181526 181421 180624
53861 180624 179169 177520 176119 175009 174021 173168 172698 172792 173315 173894 174204 174239 174348 174920 175903 176710 176735 175998
53843 175998 175125 174758 175101 175986 177049 177782 177781 177217 176791 176939 177259 177069 176320 175610 175414 175692 176240 176955 177688
53824 177688 178209 178453 178579 178712 178868 179097 179412 179651 179787 180279 181604 183473 185068 186109 186979 187755 187973
53807 187973 187717 188033 189547 191452 192763 193960 196333 200003 203717 206496 208415 209665 210047 209804 209969
53792 209969 211192 212844 213906 214218 214208 213837 212679 210870 209188 208052 207013 205492 203611 201975 200833
53777 200833 199802 198359 196415 194282 192216 190220 188357 187062 186811 187512 188461 189039 189240 189409 189662 189758
53761 189758 189439 188714 187838 187127 186745 186567 186313 185881 185510 185556 186163 187224 188517 189794 190830 191554 192108 192668
53743 192668 193234 193670 193879 193824 193470 192929 192684 193399 195302 197869 200305 202318 204247 206470 208899 211132
53727 211132 212844 213803 213784 212936 212207 212858 215240 218317 220703 221966 222642 223272 223942 224707 225856 227497 229292
53710 229292 230863 232255 233744 235447 237325 239393 241652 243968 246344 249143 252647 256419 259557 261775
53696 261775 263851 266690 270121 273032 274649 275320 275934 276894 277908 278566 278764 278524 277724 276190 273978 271425
53680 271425 268998 267139 266105 265751 265554 265041 264275 263780 263910 264409 264640 264205 263218 262023 260837 259719 258795
53663 258795 258291 258299 258571 258644 258153 257052 255595 254143 252890 251789 250847 250461 251161 252842 254586 255621 256227
53646 256227 257213 258622 259674 260043 260442 261509 262792 263518 263917 264925 266772 268700 270153 271462 273071
53631 273071 274787 276230 277507 278909 280320 281539 282930 285150 288293 291852 295563 299666 304107 308053
53617 308053 310720 312470 314627 318152 322811 327669 332131 336360 340883 345937 351138 355720 359256 362161
53603 362161 365277 368815 371984 373955 374922 375718 376487 376435 375075 373066 371329 369815 367831 365343 363082
53588 363082 361334 359439 356889 354271 352465 351319 349830 347555 345093 343026 341073 338698 336079 333927
53574 333927 332589 331852 331531 331591 331682 331235 330328 329856 330410 331472 332264 332929 334015 335069 334831 333033 331076
53557 331076 330435 331101 332211 333562 335706 338834 342378 345643 348238 350017 351230 352748 355493 359521 364140
53542 364140 368964 374221 379953 385666 391179 397207 404506 412779 421082 429162 437819 447847 459097 470777
53528 470777 482407 494191 506581 519724 533413 547458 561912 576922 592564 608966 626464
53517 626464 645356 665484 686324 707602 729633 752914 777485 802819 828237 853335 878052
53506 878052 902425 926308 949304 971030 991380 1010523 1028822 1046848 1065316 1084649 1104568
53495 1104568 1124369 1143682 1162772 1182050 1201530 1220874 1239740 1257933 1275349 1291986 1307959
53484 1307959 1323422 1338498 1353244 1367552 1381047 1393226 1403775 1412632 1419746 1424926 1428027 1429144
53472 1429144 1428423 1425652 1420111 1411021 1398313 1382937 1366238 1348975 1331151 1312812 1294414 1276140
53460 1276140 1257340 1237262 1215994 1194045 1171303 1147353 1122747 1098957 1076757 1055479 1034233
53449 1034233 1013072 992523 972762 953893 936336 920184 904767 889730 876099 865324 857517
53438 857517 851553 846750 843413 841734 841245 841697 843632 847635 853681 861635 871679 883717 896896 910377
53424 910377 924308 939537 956646 975695 996688 1019682 1044523 1070900 1098613 1127463 1157023
53413 1157023 1186986 1217710 1249957 1283965 1319242 1355473 1393298 1433836 1477572 1523980 1572157
53402 1572157 1621565 1672145 1723987 1777152 1831752 1887911 1945433 2003592 2061435 2118367 2174368
53391 2174368 2229675 2284422 2338491 2391402 2442199 2489786 2533668 2574227 2611984 2646770 2677965
53380 2677965 2705381 2729375 2749997 2766604 2778661 2786454 2790446 2790118 2783993 2770804 2750228 2722469
53368 2722469 2687710 2646292 2599054 2547085 2491268 2432329 2371187 2308936 2246509 2184489 2123164
53357 2123164 2062542 2002499 1943174 1885117 1828789 1774031 1720425 1668068 1617532 1568977 1521846
53346 1521846 1475645 1430632 1387365 1345977 1306323 1268568 1233109 1200010 1169074 1140498 1114928
53335 1114928 1092615 1072945 1055138 1039112 1025251 1013553 1003456 994476 986496 979299 972335 965368
53323 965368 959014 954145 950898 948709 947242 946726 947283 948573 950447 953457 958215 964568 971935 980227 989859
53308 989859 1001016 1013543 1027556 1043434 1061040 1079589 1098619 1118627 1140356 1163844 1188639
53297 1188639 1214616 1242028 1270815 1300290 1329649 1358570 1387254 1415931 1444218 1470940 1494821
53286 1494821 1515469 1533478 1549500 1563521 1575193 1584461 1591420 1595856 1597355 1595755 1591132 1583536 1573168
53273 1573168 1560665 1546650 1530936 1512657 1491331 1467464 1441987 1415399 1387643 1358504 1327893
53262 1327893 1295858 1262598 1228431 1193687 1158674 1123762 1089405 1055949 1023420 991558 960185
53251 960185 929600 900487 873202 847152 821177 794640 767926 741794 716657 692692 670183
53240 670183 649286 629681 610953 593181 576713 561529 547401 534609 523821 515076 507414 499762
53228 499762 491863 484095 476751 469731 462694 455248 447152 438532 429740 420952 412084 403166 394531 386450
53214 386450 378856 371524 364362 357410 350816 344887 339863 335458 331000 326232 321665 317801 314268 310144
53200 310144 305037 299440 294091 289310 285030 281085 277329 273678 270238 267302 265073 263460 262206 261113
53186 261113 260020 258625 256659 254334 252376 251296 250692 249666 247944 246122 244687 243369 241838 240507
53172 240507 239949 239800 239095 237613 236082 234922 233729 232320 231424 231618 232223 232073 231050 229999 229328 228562
53156 228562 227391 226359 226125 226557 226924 226759 226200 225657 225434 225608 226075 226692 227440 228395 229550 230727 231710
53139 231710 232391 232749 232740 232300 231530 230876 230980 232105 233742 235027 235613 235791 235691 234849 233021 231059 230309 231159
53121 231159 232737 234152 235513 237476 240205 243114 245411 246624 246812 246517 246370 246435 246065 244643 242310 239745
53105 239745 237346 234991 232547 230181 228009 225764 223134 220320 218014 216804 216695 217225 217938 218661 219360
53090 219360 219849 219849 219419 219157 219667 220831 221906 222414 222646 223113 223785 224206 224169 223898 223665 223578 223698 223933 223829
53071 223829 222962 221606 220523 219866 218891 217096 215084 213750 213050 212266 211184 210202 209404 208499 207763 208056 209462
53054 209462 210752 210836 210139 209795 209975 209896 209266 208774 209017 209707 210228 210385 210257 209797 209003 208248 207962 208136 208386
53035 208386 208459 208403 208349 208370 208462 208456 208004 206909 205479 204321 203748 203616 203700 203887 203920 203321 201906 200233 199203 199238
53015 199238 200087 201323 202696 203953 204715 204766 204297 203663 203034 202413 201847 201412 201112 200997 201304 202291 203912 205787
52997 205787 207438 208501 208858 208731 208562 208567 208477 207915 206993 206358 206616 207805 209364 210458 210444 209260 207417 205607
52979 205607 204397 204255 205450 207626 209820 211327 212360 213531 214998 216669 218796 221556 224134 225232
52965 225232 224719 223882 223727 223837 223402 222573 222046 221860 221420 220390 218901 217099 215116 213241 211533 209589
52949 209589 207327 205702 205699 206763 207206 206316 205196 205147 206021 206681 206507 205844 205311 205159 205146 204691 203332 201305
52931 201305 199503 198633 198659 199219 200166 201362 202323 202683 202813 203447 204684 205869 206406 206219 205337 203661 201502
52914 201502 199898 199803 201068 202618 203602 203973 203952 203461 202402 201167 200393 200264 200380 200365 200315 200573 201279 202272
52896 202272 203220 203753 203702 203352 203281 203721 204294 204595 204858 205642 206976 208254 209039 209538 210068 210456 210388 210134 210378
52877 210378 211230 211845 211363 210053 209177 209739 211612 213921 215926 217314 217944 217727 216830 215645 214419 213102
52861 213102 211708 210573 209999 209720 209006 207467 205594 204315 203967 203886 203177 201781 200550 200229 200718 201430 201942
52844 201942 201941 201023 199202 197443 196883 197417 197752 197033 195792 194988 194802 194908 195320 196215 197249 197766 197651 197425
52826 197425 197531 197997 198738 199726 200795 201605 201902 201705 201373 201615 203072 205562 208059 209836 211227 212781
52810 212781 214125 214471 213944 213401 212959 211733 209315 206598 204684 203657 202949 202287 201677 200929 199830 198636
52794 198636 197842 197571 197494 197277 196824 196248 195782 195587 195553 195511 195702 196613 198112 199230 199134 197988 196544 195228
52776 195228 194094 193281 192960 192945 192872 192728 192823 193296 194005 194820 195664 196363 196786 197062 197293 197255 196806 196465 196998 198356
52756 198356 199652 200297 200657 201277 202005 202344 202332 202499 203109 203901 204659 205597 207035 208903 210749 212112 212809
52739 212809 213013 213201 213862 215082 216403 217240 217390 217047 216448 215692 214865 214060 213150 211842 210140 208584 207784
52722 207784 207774 208009 207896 207181 205989 204747 204016 204106 204829 205760 206601 207128 207035 206205 205010 203908 202832 201475
52704 201475 200107 199504 199934 200851 201846 203266 205371 207372 207988 206868 205032 203948 204468 206437 208899 210740
52688 210740 211587 212108 213161 214694 215741 215501 214129 212448 211174 210496 210178 209935 209722 209717 210005 210444 210911
52671 210911 211487 212195 212764 212937 212914 213177 213845 214527 214879 215133 215918 217625 220016 222407 224242 225465 226277
52654 226277 226606 226053 224401 221958 219233 216496 213833 211475 209788 208992 209065 209835 211014 212289 213560 215000
52638 215000 216687 218323 219499 220112 220375 220578 221054 222189 224128 226496 228590 229785 229670 228129 225645
52623 225645 223336 222162 222085 222307 222296 222196 222254 222297 221943 221086 219964 218835 217710 216417 214995 213987 214095
52606 214095 215386 217099 218490 219535 220467 220985 220583 219546 218917 219352 220538 221908 223308 224667 225503 225326
52590 225326 224366 223511 223462 224176 225140 226009 226833 227640 228009 227376 225884 224550 224257 224859 225613 226181 226670 226954
52572 226954 226721 226177 225971 226243 226465 226433 226697 227597 228548 228801 228430 227938 227335 226252 224790 223618 223270 223732
52554 223732 224600 225230 224910 223426 221435 219853 218956 218538 218743 220035 222179 224028 224755 224848 225394 226674 227995
52537 227995 228774 229171 229545 229757 229355 228259 226907 225811 225231 225211 225624 226120 226371 226462 226793 227440 227985 228252
52519 228252 228852 230457 232803 234984 236727 238686 241368 244352 246859 248673 250171 251779 253668 255645
52505 255645 257108 257465 256874 256132 255575 254538 252391 249661 247466 246093 244822 243064 241034 239271 238109
52490 238109 237747 238292 239442 240519 241060 241221 241475 242161 243335 244757 245918 246365 246153 245784 245678 245902 246375
52473 246375 247016 247636 248051 248396 249022 249977 250944 251799 252878 254440 256243 257923 259504 261235 263075 264632
52457 264632 265453 265171 263584 260908 257861 255176 253058 251229 249341 247128 244428 241401 238700 237038 236578
52442 236578 236865 237286 237377 236896 236032 235469 235836 237004 238236 239068 239638 240094 240220 239911 239606 239852 240695 241884
52424 241884 243418 245410 247529 249145 250154 251348 253761 257878 263500 270085 277007 283677 289603 294344
52410 294344 297425 298559 297972 296274 293828 290516 286308 281762 277621 274048 270648 267202 264031 261541
52396 261541 259731 258348 257340 256930 257274 258203 259327 260384 261450 262775 264399 266049 267482 268799 270249
52381 270249 271847 273450 275116 277061 279212 281185 282933 285138 288627 293490 299074 304770 310490 316241
52367 316241 321526 325468 327592 328298 328396 328227 327447 325696 323297 321114 319847 319680 320492 322096 324289 326927
52351 326927 330051 333675 337408 340648 343323 346148 349922 354800 360494 366913 374212 382315 390809 399426
52337 399426 408372 418053 428564 439478 450226 460755 471793 484206 498024 512377 526533 540618
52325 540618 555023 569541 583579 596920 609577 621020 630326 637255 642561 646945 650237 651975 652334
52312 652334 652056 651764 651731 652020 652397 652303 651398 649980 648552 647111 645369 643565 642464 642425 642904 643053 642497 641341
52294 641341 639791 638064 636403 634868 633286 631696 630734 631241 633525 637267 642144 648151 655230 662896 670561
52279 670561 678104 685821 693862 701975 709876 717550 725011 731995 738127 743288 747540 750776 752834 753992
52265 753992 754916 755893 756403 755729 753819 751277 748728 746523 744854 743656 742412 740583 738291 736106 734018
52250 734018 731211 727188 722597 718339 714225 709277 703289 697301 692303 688051 683627 678811 674446 671592
52236 671592 670670 671347 672964 674975 677173 679594 682237 684968 687701 690480 693324 696217 699382 703291 708148
52221 708148 713534 718897 724291 730244 736884 743540 749398 754318 758834 763430 767957 771796 774598 776808
52207 776808 779275 782297 785305 787746 789928 792547 795564 798242 800363 802723 806044 809963 813587 816693
52193 816693 819694 822619 824826 825822 825829 825254 824040 821843 818567 814370 809226 802938 795698 788409 782130
52178 782130 777131 772662 767779 762381 757287 753386 750953 749853 749962 751012 752252 752837 752729 752855 754162
52163 754162 756712 759804 762779 765470 768024 770621 773302 775893 778061 779627 780834 782191 784041 786403
52149 786403 789230 792577 796450 800666 805016 809441 813915 818337 822761 827589 833228 839584 846280 853412
52135 853412 861666 871433 882180 893011 903608 914273 925313 936895 949294 962642 976353 989355
52123 989355 1001095 1011918 1022300 1032240 1041609 1050590 1059330 1067551 1074915 1081366 1086643 1089847 1090170 1087946
52109 1087946 1084416 1080521 1076428 1072069 1067522 1062848 1058183 1054032 1050860 1048262 1045192 1041245 1037080 1033245
52095 1033245 1029264 1024418 1018909 1013569 1008745 1004137 999650 995810 993333 992752 994447 998505 1004458 1011564
52081 1011564 1019504 1028471 1038452 1048750 1058455 1067159 1075014 1082241 1088809 1094558 1099411 1103359 1106274 1107849
52067 1107849 1107888 1106680 1104861 1102744 1099895 1095613 1089717 1082708 1075221 1067589 1059824 1051651 1042525 1031971
52053 1031971 1020033 1007140 993470 978771 962987 946711 930760 915550 901155 887759 875617
52042 875617 864678 854706 845839 838645 833404 829627 826551 823977 822280 821588 821278 820460 818824 816715 814440
52027 814440 811825 808567 804678 800229 794901 788305 780816 773563 767340 761900 756601 751324 746257 741027
52013 741027 734710 726794 717712 708278 698981 689887 680808 671329 661026 650000 638967 628597 618942
52000 618942 609786 601332 594169 588618 584460 581269 578738 576621 574566 572137 568928 564663 559273 552871
51986 552871 545643 537824 529725 521555 513080 503773 493584 483334 474025 465938 458809 452705 448180 445541
51972 445541 444545 445010 447168 451081 456107 461384 466688 472411 478749 485190 490794 494795 496966 497500 496546
51957 496546 493911 489432 483689 477924 472981 468520 463664 458332 453591 450663 449861 450616 452348 455120 459422
51942 459422 465374 472401 479852 487742 496450 505705 514393 521603 527302 531623 533976 533592 530695 526421
51928 526421 521496 515565 507969 498731 488595 478509 469244 461173 454166 447865 442198 437472 434042 432191
51914 432191 432336 434956 440179 447791 457714 470120 484995 502044 521155 542352 564845 586552 605031
51901 605031 618634 626441 627580 621430 608481 590377 569055 546252 523692 502903 484433 467733
51889 467733 452294 438636 427826 420260 415353 412297 410769 410897 412889 416727 421952 427670 433027 437747
51875 437747 441973 445564 447968 449037 449561 450406 451297 450985 448723 445043 440907 436663 432252 428076 425022
51860 425022 423705 424174 426257 429630 433466 436581 438283 438720 438172 436346 432764 427629 421847 416198 410798
51845 410798 405385 399850 394344 389045 383995 379155 374604 370647 367665 365802 364887 364724 365294 366508 367843
51830 367843 368478 367936 366482 364774 363228 361857 360674 359999 360106 360631 360673 359727 358419 358057 359424 362180
51814 362180 365437 368609 371519 373885 375107 374762 373158 371196 369576 368216 366525 364178 361433 358725
51800 358725 356202 353785 351464 349277 347156 345046 343080 341417 340040 338955 338465 338908 340178 341799 343410
51785 343410 344769 345476 345269 344673 344735 345871 347480 349007 350853 353784 357833 362380 367160 372676 379605
51770 379605 388078 397483 406766 415018 421950 427620 431598 432820 430675 425877 419771 412981 405342 396955
51756 396955 388643 381256 375119 370238 366544 363690 361105 358564 356404 355001 354426 354837 356732 360379 365268
51741 365268 370560 375948 381604 387424 392747 397013 400332 403245 406094 408806 411159 413095 414775 416415
51727 416415 418022 419205 419224 417404 413638 408554 403131 398077 393551 389425 385687 382534 380144 378518 377565
51712 377565 377229 377429 377979 378724 379755 381286 383192 384763 385204 384444 383224 382328 381974 382137 383086 385113 387846
51695 387846 390353 391950 392449 391586 388849 384288 379005 374318 370644 367578 364824 362541 360908 359902 359585
51680 359585 360135 361484 363283 365380 368023 371391 375150 378765 382157 385833 390325 395558 400870 405624
51666 405624 409666 413091 415710 417081 417104 416312 415410 414793 414599 414851 415176 414651 412371 408218 402923 397564
51650 397564 393121 390063 387881 385184 380849 375099 369173 364110 360187 357307 355239 353487 351510 349266
51636 349266 347134 345248 343353 341372 339605 338204 336923 335569 334292 333286 332567 332183 332189 332261 331853 330999
51620 330999 330400 330338 330016 328578 326453 325068 325320 326857 328861 331010 333488 336435 339788 343629 348408
51605 348408 354572 361948 369689 376898 383123 388068 391156 391844 390267 387107 382849 377640 371863 366291
51591 366291 361524 357811 355505 355038 356154 357851 359549 361888 365868 371691 378941 387483 397505 408872
51577 408872 420987 433208 444986 455808 465491 474400 482939 490986 498197 504721 511200 518355 527109
51564 527109 538851 554806 575132 599121 626192 655991 687497 718845 748402 775530 799945
51553 799945 820796 836774 846929 851019 849239 841889 829310 811955 790408 765247 736840 705500
51541 705500 672075 638238 605844 575923 548478 523148 499846 478892 460902 446427 435303
51530 435303 426371 418259 410460 403324 397080 391431 386222 381882 378848 376825 374921 372396 369193 365989
51516 365989 363751 362980 363270 363878 364647 366052 368337 371123 373991 376880 379710 382156 384165 386272 388892
51501 388892 391583 393390 393760 392783 390752 387884 384349 380297 375887 371478 367564 364329 361457 358576 355618
51486 355618 352554 349102 345041 340533 335854 331146 326731 323237 320826 318687 316016 313209 311289 310248
51472 310248 308929 306734 304481 303167 302663 302292 302105 302743 304262 305912 307137 308222 309819 312256 315429
51457 315429 319061 322908 326878 331058 335465 339821 343839 347778 352415 358306 365348 373134 381417 389928
51443 389928 397966 404596 409322 412343 414196 415386 416289 416977 416954 415381 411785 406454 399978 392688 384765
51428 384765 376641 368861 361638 354917 348936 344287 341320 339806 339302 339513 340084 340389 339947 338964 338121 337905
51412 337905 338337 339263 340565 342109 343827 345941 348816 352461 356358 359922 363005 365841 368691 371674 374785
51397 374785 377881 380801 383679 387029 391235 396074 401082 406469 413286 422455 433935 447199 462377
51384 462377 480525 502714 529176 559364 592482 627730 664314 701547 738868 775616 810907
51373 810907 843861 873706 899396 919410 932419 938079 936708 928205 911880 887646 856917 821905
51361 821905 784294 744948 704661 664624 626086 589882 556443 526021 498835 475100 454940
51350 454940 438168 424184 412292 402124 393645 386743 381034 376086 371665 367695 364147 360996 358152
51337 358152 355362 352369 349233 346310 343772 341343 338655 335795 333264 331463 330370 329668 329033 328330 327730
51322 327730 327703 328740 330972 334100 337680 341408 345117 348637 351704 353922 354800 354008 351713 348636 345606
51307 345606 343136 341414 340528 340468 340956 341559 342012 342310 342428 342176 341450 340436 339379 338201 336535 334188 331481
51290 331481 329141 327871 327888 328765 329758 330414 330862 331429 332089 332497 332486 332301 332288 332563 333120 333962 334899 335402 335067
51271 335067 334284 334084 335111 336905 338439 339163 339279 339110 338619 337606 336056 334117 332054 330375 329642 329848
51255 329848 330216 329996 329220 328309 327238 325796 324475 324274 325404 326934 328008 328734 329415 329618 328746 327056
51239 327056 325429 324359 323841 323919 324562 325163 324993 324185 323543 323355 323165 322837 322926 323623 324148 323742 322729 322052
51221 322052 322145 322821 323872 325144 326220 326642 326465 326183 326127 326257 326512 327004 327864 329136 330822 332890 335235
51204 335235 337728 340188 342289 343719 344520 345057 345499 345587 345124 344386 343791 343380 342845 341866 340213 337875 335424
51187 335424 333918 334012 335242 336504 337090 336996 336530 336087 336140 336970 338385 340044 341920 344120 346362 348055 348911
51170 348911 349238 349696 350939 353214 355972 358174 359394 360287 361489 362415 361914 359883 357356 355075 352878
51155 352878 350651 348906 347994 347512 347027 346772 347064 347520 347512 347102 346922 347303 348018 348792 349605 350488 351317 351899 352142
51136 352142 352166 352210 352205 351487 349418 346472 344260 344027 345422 347083 348172 348856 349565 350378 351186 351978 352766 353484
51118 353484 354090 354587 354905 354980 355039 355690 357457 360179 362954 364874 365912 366892 368444 370244 371573 372395 373294
51101 373294 374391 374975 374436 373059 371538 370202 369078 368366 368328 368916 369843 370860 371712 372107 372027 371781 371425
51084 371425 370520 368951 367603 367563 368783 370150 370828 371032 371498 372719 374760 377300 379766 381870 384142 387519
51068 387519 392317 397986 404024 410710 418657 427934 437878 447682 456935 465632 473780 481178 487815 494500
51054 494500 502654 513100 525192 537471 548942 559336 568432 575774 581120 584539 585925 584810 580894
51041 580894 574480 566345 557414 548436 539551 530108 519287 506899 493374 479297 465536 453537 444479
51028 444479 437961 432321 426605 421531 418292 417189 417871 420082 423497 427372 431144 435079 439764 445310
51014 445310 451531 458464 466035 473618 480678 487640 495364 503888 512404 520422 528290 536477 545042 553938
51000 553938 563257 572953 582723 592332 601688 610549 618538 625592 632020 637960 643137 647228 650123 651691
50986 651691 651629 649744 646256 641794 637317 633926 632369 632632 634342 637542 642727 650118 659474 670812 684872
50971 684872 702501 723852 748392 775421 804359 834823 866746 900264 935228 970979 1006820
50960 1006820 1042553 1078275 1113728 1148053 1180158 1209259 1235186 1258356 1279377 1298615 1316173
50949 1316173 1332223 1347050 1360589 1372185 1381047 1386850 1389692 1389637 1386634 1380935 1373410 1365217 1357040
50936 1357040 1348587 1338836 1326910 1312724 1296779 1279365 1260136 1238382 1213592 1185811 1155705 1124319
50924 1124319 1092537 1060703 1028796 996886 965284 934432 904980 877820 853534 831824 811894
50913 811894 793471 776975 762671 750202 739138 729385 720744 712614 704561 696796 689705 683311 677578
50900 677578 672798 669136 666194 663574 661520 660357 659623 658503 656966 655696 654989 654529 654290 654822 656334
50885 656334 658216 659841 661330 663179 665622 668718 672573 677003 681311 684962 688349 692511 698165 705272
50871 705272 713380 722120 731469 741829 753824 767836 783777 801459 821039 842921 867325 894179
50859 894179 923435 955361 990548 1029688 1073267 1121425 1174172 1231640 1293812 1359980 1428998
50848 1428998 1500371 1574686 1652437 1732585 1812825 1891299 1967438 2040895 2110152 2172694 2226491
50837 2226491 2270935 2306398 2333330 2352088 2363333 2368180 2367924 2363956 2358080 2352487 2349008 2348452 2350933
50824 2350933 2356582 2365445 2376754 2388857 2400108 2409301 2414950 2414652 2405837 2387141 2358694 2321193 2275181
50811 2275181 2221291 2160688 2094903 2025379 1953340 1880047 1807037 1736111 1669137 1607748 1553056
50800 1553056 1505469 1464739 1430233 1401415 1378203 1360918 1349831 1344800 1345240 1350214 1358424 1368334
50788 1368334 1378602 1388451 1397543 1405470 1411544 1415124 1416109 1415016 1412467 1408550 1402708 1394305 1383176 1369449
50774 1369449 1353038 1333666 1311384 1286657 1259856 1231063 1200601 1169328 1138053 1106987 1076136
50763 1076136 1045964 1017225 990344 965448 942873 923112 906248 891999 880370 871711 865990 862511
50751 862511 860678 860603 862653 866736 872529 880141 890127 902931 918729 937749 960225 985933 1014258
50738 1014258 1045034 1079041 1117203 1159326 1204023 1249852 1296191 1342835 1389264 1434793 1479217
50727 1479217 1522631 1564499 1603471 1638457 1669408 1696599 1719431 1736451 1746449 1749163 1745158 1735695
50715 1735695 1722745 1708441 1694148 1680398 1667904 1658187 1652819 1652278 1655930 1662908 1672656 1684647 1697979
50702 1697979 1711413 1723672 1733594 1740042 1741797 1737740 1727347 1711074 1690187 1666259 1640863 1615481
50690 1615481 1591211 1568496 1547481 1528749 1513374 1502122 1494967 1491682 1492589 1498425 1509755 1526882
50678 1526882 1550126 1579727 1615459 1656631 1702334 1751370 1802085 1852750 1902188 1949746 1994606
50667 1994606 2035582 2071812 2103405 2131234 2156211 2178869 2199356 2217574 2233328 2246502 2257161
50656 2257161 2265514 2271831 2276395 2279507 2281682 2283927 2287682 2294169 2303840 2316716 2333212 2354269 2380535
50643 2380535 2411667 2446557 2483965 2522734 2561655 2599470 2635050 2667545 2696498 2721836 2743506
50632 2743506 2760893 2772726 2777589 2774159 2760647 2734562 2693918 2639068 2573099 2500458 2425548 2352605
50620 2352605 2285912 2229102 2184041 2150756 2128434 2116188 2112945 2117201 2127286 2141623 2158456 2175453
50608 2175453 2189968 2199659 2202703 2197534 2182815 2157890 2123060 2079238 2027444 1968768 1904728 1837435
50596 1837435 1769354 1702858 1639771 1581026 1526655 1476285 1429762 1387356 1349457 1316240 1287587
50585 1287587 1263196 1242647 1225488 1211314 1199728 1190288 1182654 1176805 1172936 1171045 1170815 1172094 1175203
50572 1175203 1180442 1187404 1195221 1203552 1212990 1224291 1237618 1252855 1270360 1290972 1315346 1343697
50560 1343697 1376098 1412599 1452931 1496497 1542791 1591478 1641885 1692749 1742792 1791342 1838192
50549 1838192 1883301 1927084 1970749 2015716 2062629 2111375 2162140 2215972 2274137 2337306 2405619
50538 2405619 2479156 2558004 2642070 2731284 2825964 2926663 3033591 3146425 3264793 3388728
50528 3388728 3518310 3652714 3789629 3925730 4057700 4182738 4298149 4400804 4487346 4554844
50518 4554844 4601045 4624141 4622756 4596295 4545094 4470187 4373293 4257175 4125746 3983552 3835289
50507 3835289 3685783 3539956 3402351 3276665 3165824 3072256 2997833 2943718 2910410 2897745
50497 2897745 2904617 2928919 2967949 3018546 3076502 3136148 3191110 3235554 3264587 3273974 3260416 3222555
50485 3222555 3161441 3079813 2981007 2868455 2745745 2616829 2485918 2356827 2232044 2112503
50475 2112503 1998564 1891074 1791166 1699264 1614917 1537645 1467387 1404065 1347307 1296818 1252510
50464 1252510 1214023 1180611 1151773 1127496 1107541 1090993 1076985 1065494 1056922 1051199 1047813 1046432
50452 1046432 1046962 1049111 1052386 1056376 1060630 1064476 1067506 1070094 1072830 1075501 1077341 1078413 1080072 1083783
50438 1083783 1089858 1097645 1106556 1116651 1128562 1143146 1160964 1181824 1205032 1230266 1258000 1288875
50426 1288875 1322897 1359529 1398392 1439650 1483852 1531563 1582994 1637766 1695215 1755183 1818362
50415 1818362 1885603 1956947 2031541 2108341 2186496 2264964 2342084 2415827 2484554 2547486 2604324
50404 2604324 2654278 2695479 2725465 2742237 2744687 2732130 2704025 2660483 2602809 2533175 2453956
50393 2453956 2367649 2277185 2185769 2096330 2011323 1932920 1862952 1802650 1752752 1713822 1686097
50382 1686097 1669121 1662043 1664313 1675530 1694375 1718147 1743727 1768637 1790864 1808084 1817680 1817586
50370 1817586 1806884 1785698 1754841 1715480 1668869 1616395 1559939 1501818 1443937 1386992 1330825
50359 1330825 1275490 1221676 1170147 1121268 1075218 1032353 993138 957889 926678 899362 875578
50348 875578 854817 836631 820758 807160 796059 787812 782476 779467 777906 777389 778158 780524 784385
50335 784385 789418 795413 802180 809350 816477 823195 829105 833538 835662 834875 831166 825259 818389 811656
50321 811656 805478 799827 795035 791968 791170 792182 794128 796800 800746 806337 813152 820403 827687 835123
50307 835123 842950 851162 859506 867718 875700 883375 890430 896447 901479 906271 911591 917335 922552 926378
50293 926378 928676 929713 929550 927997 925041 921069 916705 912628 909616 908582 910301 914953 921937 930094
50279 930094 937943 943673 945325 941651 933031 921286 908465 896013 885006 876409 870525 866563 863459
50266 863459 861063 860002 860470 861744 862994 864105 865538 867824 871284 875770 880535 884840 889006 894436
50252 894436 902268 912310 923599 935562 948245 961840 976698 993703 1013965 1037896 1064864 1093810
50240 1093810 1123889 1154509 1185067 1214832 1242875 1268097 1289623 1307346 1321941 1334235 1344670
50229 1344670 1353326 1360129 1364695 1365997 1362410 1352303 1334770 1309948 1278744 1242274 1201614 1158096
50217 1158096 1113641 1070497 1030542 994883 964066 938378 917760 901438 887879 875233 861970
50206 861970 847241 830806 812791 793572 773797 754319 735930 719103 703973 690453 678305
50195 678305 667159 656622 646408 636473 627113 618892 612228 606912 602176 597420 592727 588514 584873
50182 584873 581577 578717 576890 576593 577677 579573 581851 584360 587000 589743 592866 596846 601861 607621
50168 607621 613842 620689 628431 636784 644996 652717 660395 668605 677245 685811 694289 703272 713124 723474
50154 723474 733704 743554 752941 761447 768405 773483 776942 779426 781656 784233 787425 791140 795285 800188
50140 800188 806509 814738 824992 837288 851824 868887 888681 911341 937073 966132 998706 1034923
50128 1034923 1075084 1119822 1169794 1225104 1285152 1349140 1416373 1485654 1554633 1620569 1682055
50117 1682055 1739562 1794145 1846192 1895731 1943073 1988182 2029660 2065077 2092142 2108871 2113014
50106 2113014 2102557 2077212 2038709 1989312 1930642 1864197 1792218 1717434 1642307 1568835 1498599
50095 1498599 1432545 1371091 1314841 1264702 1220923 1182559 1148444 1118209 1091639 1067523 1044180
50084 1044180 1021053 998924 978431 959131 940320 922072 905059 889760 876188 864090 853120
50073 853120 842986 833615 825042 817115 809579 802446 795915 789881 783951 778115 772957 768972 766043 763890
50059 763890 762653 762633 763706 765380 767292 769281 771144 772719 774244 776282 779149 782542 785754 788147 789485
50044 789485 789974 790002 789824 789492 789099 788874 788990 789436 790149 791054 791891 792276 792143 791841 791601 791180 790328 789290 788512
50025 788512 788114 788104 788781 790378 792440 794235 795741 797591 800001 802504 805009 808512 814360 823249 835294
50010 835294 850629 869470 891913 918140 948609 983607 1022765 1065285 1110375 1157076 1203883
49999 1203883 1249001 1290888 1328356 1360567 1387496 1410163 1429782 1446679 1460356 1470212 1475328 1473613
49987 1473613 1462182 1439128 1404570 1359969 1307122 1248142 1185589 1121945 1059210 999270 944041
49976 944041 894598 850569 811085 776092 746085 720778 698934 679638 663072 649731 639396
49965 639396 631227 624541 619201 615510 614012 615212 619131 625121 632285 640112 648658 658140 668449 678997
49951 678997 688989 697753 704834 709936 713000 714337 714343 712923 709463 703628 695901 686999 677013 665613 652914
49936 652914 639556 625973 612234 598762 586531 576160 567289 559276 552134 546258 541608 537817 535001
49923 535001 533779 534384 536195 538343 540418 542445 544596 547149 550443 554559 559242 564455 570815 579074
49909 579074 589137 599974 610618 621003 631603 642560 653490 664049 674202 683787 692096 698233
49897 698233 701786 702979 702260 699981 696357 691364 684587 675492 664116 651348 638348 625757 613571
49884 613571 601624 589919 578545 567575 557200 547777 539582 532619 526822 522365 519523 518166 517671
49871 517671 517599 518253 520266 523712 528008 532720 538052 544359 551665 559976 569654 580821 592649 603907
49857 603907 614234 624236 634195 643299 650493 655599 659195 661778 663467 664229 663846 661748 657351 650632
49843 650632 642184 632768 623038 613500 604381 595545 586921 579069 572998 569297 567557 566772 566212 565932 566444
49828 566444 567939 569868 571569 573309 576334 581682 589234 598201 608022 618269 628067 636505 643602 650042
49814 650042 655779 659710 661137 660930 660650 660890 660968 659910 657109 652227 645154 636235 626244 616072 606545
49799 606545 598334 591564 585492 578976 571421 563156 554989 547709 541910 537795 534982 532820 531078 529988
49785 529988 529530 529127 528368 527629 527486 527851 528324 529292 531888 536622 542696 549140 556068 564153 573117 581581
49769 581581 588489 593989 598624 602369 604998 606925 608909 610963 612186 611702 609294 605047 598978 591292
49755 591292 582584 573400 563966 554637 546272 539576 534213 529101 523650 518298 513806 510440 508090 506768
49741 506768 506560 507248 508316 509379 510379 511288 511933 512282 512757 513964 516030 518472 520941 523940 528495 535139
49725 535139 543514 552992 563236 573908 584209 593257 600832 607295 612713 616463 617838 616812 614079
49712 614079 610564 606916 603178 598778 593072 586093 578631 571579 565370 560142 556040 553092 551018 549413
49698 549413 547978 546443 544600 542725 541654 542054 543775 546231 549150 552522 556145 559940 564608 571134
49684 571134 579504 588621 597740 607316 618029 629643 641395 652953 664223 674455 682341 687083 688840
49671 688840 688176 685575 681565 676897 672427 668978 667126 666676 666455 665094 662021 657227 650277 640406 627802
49656 627802 614058 600856 588706 577413 567176 558524 551419 545229 539641 535072 532040 530524 530073
49643 530073 530239 530734 531311 531664 531482 530675 529573 528647 527814 526205 523000 518403 513466 509013 505064 501308
49627 501308 497689 494318 491113 487857 484621 481930 480479 480591 481887 483464 484494 484720 484466 484285 484624
49612 484624 485545 486607 487238 487508 488315 490461 493674 496903 499433 501284 502624 503408 503773 504236 505197 506600
49596 506600 508296 510340 512643 514759 516402 517891 519698 521774 523734 525449 526972 528099 528573 528766 529563
49581 529563 531400 533794 536055 538151 540626 543870 547702 551608 555268 558939 563348 569088 576062 583638
49567 583638 591356 599301 607702 616426 625079 633447 641599 649511 656716 662382 665778 666769 665900 663957 661377
49552 661377 658085 653768 648229 641581 634426 627808 622706 619406 617509 616506 616014 615419 613925 611404 608935
49537 608935 607861 608401 609640 610919 612735 616084 621332 627922 635050 642454 650735 660898 673202 686344
49523 686344 698081 706915 712918 716852 719031 719415 718347 716596 714867 713812 714290 716871 721039 725449
49509 725449 729076 731582 732543 731120 726851 720121 711425 700751 688323 675439 663779 653985 645527
49496 645527 637878 631156 625616 621169 617634 615017 613259 612022 610945 609907 608951 608146 607624 607497 607714
49481 607714 608184 609023 610336 611754 612631 612802 612807 613187 613973 615030 616482 618357 620158 621244 621593 621809 622454
49464 622454 623608 625034 626431 627501 628009 627853 627029 625585 623646 621333 618582 615210 611302 607343 603776
49449 603776 600591 597523 594476 591567 588957 586914 585742 585338 585040 584351 583704 584089 585980 589010 592669
49434 592669 596804 601482 606886 613519 621946 632053 642914 653686 664319 675118 685918 696000
49422 696000 704468 710254 712115 709265 702195 692523 681998 671827 662800 655457 649938 646089 644030 644389
49408 644389 647681 653618 661267 669773 678716 687954 697538 707732 718623 729549 739380 747736 755627
49395 755627 764411 774161 783469 790869 796005 799352 801335 802107 801777 800342 797500 793008 787236 780949 774484
49380 774484 767463 759454 750672 741953 734254 728229 724037 721445 720256 720675 723055 727317 732971 739710
49366 739710 747515 755938 763774 769886 774138 777125 779224 780391 780703 780440 779545 777513 774053 769511 764508
49351 764508 759522 755071 751880 750420 750388 751046 752017 753428 755279 757057 758166 758464 758120 757112 755207 752465
49335 752465 749409 746464 743414 739692 735234 730733 726992 724294 722554 721698 721528 721423 720802 719952 719978 721670
49319 721670 724660 727856 730429 732236 733608 735099 737243 740220 743806 747862 752699 758667 765579 772902
49305 772902 780401 788166 796152 804304 813236 824058 837140 851460 865614 879040 891702 902808
49293 902808 910638 913758 911990 906066 896936 885651 873496 861630 850645 840737 832158 825091 819165
49280 819165 813606 808093 803061 798893 795121 790899 786082 781320 777148 773639 771097 770346 771783 774621
49266 774621 777809 781454 786639 793904 802717 812559 823815 837216 852975 870707 889623 908376 925273
49253 925273 939185 949865 956993 959483 956491 948720 937976 925616 912128 897917 883599 869489
49241 869489 855664 842710 831594 822565 814976 808493 803759 801459 801345 802723 805394 809538 815096 821803
49227 821803 829549 838217 847352 856493 865659 875142 884938 894642 903726 911609 917736 921937 924572 926097
49213 926097 926748 926938 927549 929382 932604 937125 943188 951089 960649 971598 984233 998978 1015316 1031881
49199 1031881 1047661 1062574 1076787 1090077 1102063 1112668 1122106 1130717 1138782 1146173 1152218 1156415
49187 1156415 1159275 1161966 1165110 1168500 1172059 1176416 1182284 1189890 1199430 1211580 1227077 1246067 1268147
49174 1268147 1292612 1318143 1342525 1363157 1377896 1385423 1385330 1378444 1366917 1353394 1339966 1327990
49162 1327990 1318599 1312772 1310769 1311821 1314592 1317885 1320988 1323620 1325748 1327437 1328862 1330364 1332334 1334909
49148 1334909 1337953 1341401 1345546 1350813 1357356 1365018 1373554 1382742 1392352 1402265 1412631 1423724 1435595
49135 1435595 1447931 1460328 1472636 1484959 1497329 1509488 1521143 1532380 1543645 1555255 1567126
49124 1567126 1579144 1591492 1604340 1617447 1630512 1643854 1658370 1674813 1693544 1715100 1740607
49113 1740607 1771445 1808671 1852695 1903137 1958951 2019015 2082541 2148374 2213850 2275186 2329671
49102 2329671 2377175 2418868 2454237 2479404 2488479 2477130 2445916 2400678 2349100 2296046 2241800
49091 2241800 2184519 2123788 2061761 2001837 1947063 1899389 1859421 1826531 1799501 1777184 1758695
49080 1758695 1743463 1731430 1722758 1716848 1711984 1706478 1699991 1693351 1687420 1682613 1679092 1676653 1674658
49067 1674658 1672818 1671847 1672560 1674449 1676042 1676763 1677620 1679887 1683886 1689212 1695256 1701166 1706125 1710303 1714909
49052 1714909 1720702 1727000 1732717 1737815 1742946 1748139 1752823 1757158 1762366 1769386 1777829 1786624 1795344 1804365
49038 1804365 1813959 1823716 1832949 1841334 1848964 1856015 1862665 1869268 1876220 1883546 1890892 1898071 1905293 1912642
49024 1912642 1919731 1926281 1932770 1939877 1947460 1954744 1961563 1968726 1976951 1986143 1996138 2007543 2021113
49011 2021113 2036528 2052451 2067865 2082925 2098371 2114404 2130339 2145210 2158526 2170407 2181136
49000 2181136 2190777 2199217 2206327 2211905 2215768 2218195 2219968 2221513 2222193 2221087 2218428 2215528 2213229 2211179
48986 2211179 2208913 2206768 2205132 2203467 2200969 2197882 2195310 2193792 2192720 2191266 2189308 2187295 2185607 2184192
48972 2184192 2182631 2180461 2177592 2174350 2171066 2167863 2165002 2163033 2162170 2161901 2161805 2162499 2165132 2170061 2176740
48957 2176740 2184913 2195048 2207400 2221467 2236841 2253955 2273380 2294826 2317520 2341278 2366542
48946 2366542 2393352 2420965 2448629 2476387 2504985 2535321 2568117 2603778 2642165 2682540 2723996
48935 2723996 2766147 2809385 2854420 2901446 2949763 2998241 3046224 3093941 3142016 3190631 3239297
48924 3239297 3287395 3334774 3381673 3428118 3473584 3517376 3559290 3599792 3639576 3679086 3718422
48913 3718422 3757461 3795932 3833545 3870274 3906396 3942102 3977154 4011159 4044054 4076049 4107124
48902 4107124 4136950 4165363 4192584 4218773 4243599 4266431 4286765 4304266 4318598 4329469 4336745
48891 4336745 4340354 4340136 4336012 4328116 4316519 4300904 4280825 4256318 4227986 4196439 4161913 4124474
48879 4124474 4084275 4041408 3995743 3947112 3895533 3841100 3783886 3724291 3663431 3602833 3543577
48868 3543577 3485883 3429607 3374959 3322585 3273062 3226499 3182697 3141557 3103239 3067929 3035528
48857 3035528 3005657 2977946 2952308 2928999 2908503 2891323 2877690 2867392 2860025 2855438 2853767 2854905
48845 2854905 2858162 2862702 2868191 2874757 2882430 2890966 2900237 2910459 2921937 2934844 2949287 2965251 2982391
48832 2982391 3000175 3018395 3037203 3056499 3075719 3094529 3113438 3133262 3154183 3175729 3197525
48821 3197525 3219621 3242127 3265039 3288528 3313047 3338882 3365777 3393092 3420236 3446942 3473273
48810 3473273 3499534 3526072 3553147 3580869 3609179 3637865 3666852 3696530 3727506 3759818 3792665
48799 3792665 3825128 3856902 3888072 3918515 3947897 3975933 4002238 4026274 4047951 4067980 4086991
48788 4086991 4104553 4119807 4132763 4143974 4152849 4157323 4155550 4147224 4132990 4113449 4089183 4060979
48776 4060979 4029277 3993909 3954886 3913072 3869558 3824809 3778825 3731633 3683055 3632497 3579670
48765 3579670 3525264 3470347 3415416 3360601 3306464 3253935 3203654 3155917 3111000 3068909 3029028
48754 3029028 2990723 2954176 2919988 2888094 2857768 2828685 2801264 2775874 2752326 2730319 2709904
48743 2709904 2691406 2675339 2662387 2652887 2646152 2640794 2635840 2631139 2626653 2621920 2616451 2610224 2603553
48730 2603553 2596821 2590554 2585425 2581889 2579993 2579579 2580464 2582350 2584864 2587779 2590991 2594316 2597540 2600665
48716 2600665 2603830 2607070 2610452 2614251 2618544 2622759 2626183 2628899 2631678 2634956 2638478 2642086 2646169 2651146
48702 2651146 2656971 2663400 2670258 2677301 2684323 2691659 2700064 2709739 2719862 2729382 2737989 2746076 2754144 2762468
48688 2762468 2770979 2779215 2786795 2794128 2802287 2811957 2822916 2834642 2846886 2859366 2871492 2882885
48676 2882885 2893686 2903978 2913299 2921139 2927437 2932111 2934458 2933500 2928547 2919046 2904400 2884495 2860041
48663 2860041 2831766 2799698 2763818 2724931 2684063 2641372 2596652 2550783 2505646 2462453 2421058
48652 2421058 2381149 2343298 2308355 2276390 2246733 2218649 2191545 2164797 2137808 2110251 2082120
48641 2082120 2053628 2025110 1996871 1969087 1941921 1915623 1890293 1865730 1841823 1818869 1797015
48630 1797015 1775553 1753452 1730724 1708628 1688309 1669769 1652461 1636426 1622361 1610888 1602172
48619 1602172 1596032 1592051 1589684 1588633 1589102 1591480 1595850 1601851 1608861 1616156 1623090 1629304 1634635 1638761
48605 1638761 1641268 1642296 1642795 1643758 1645403 1647469 1650045 1653526 1657704 1661457 1663601 1663800 1662448 1659879 1655900
48590 1655900 1649984 1641772 1631499 1620053 1608492 1597386 1586661 1576111 1565873 1556281 1547499 1539593
48578 1539593 1532857 1527808 1524783 1523770 1524606 1527154 1531198 1536405 1542548 1549586 1557369 1565341 1572705 1578836
48564 1578836 1583345 1585781 1585497 1581973 1575294 1566223 1555755 1544583 1533083 1521711 1511097 1501501 1492428
48551 1492428 1483206 1473881 1465038 1456680 1447839 1437569 1425856 1413201 1399846 1385872 1371667 1357626
48539 1357626 1343647 1329555 1315845 1303372 1292412 1282701 1274302 1267691 1262958 1259764 1258207 1258924 1262010
48526 1262010 1266562 1271611 1276768 1281470 1284266 1283589 1278904 1270746 1260070 1248080 1236135 1225159 1215374
48513 1215374 1207066 1201245 1198954 1200263 1204493 1211130 1219923 1230395 1241999 1254634 1268313 1282354 1295438
48500 1295438 1306385 1314363 1318566 1318456 1314333 1307048 1297137 1284904 1271334 1258030 1245854 1234257 1222351
48487 1222351 1210212 1198687 1188282 1178752 1169682 1161055 1153168 1146192 1139978 1134310 1129292 1125296 1122469
48474 1122469 1120470 1118782 1117082 1115193 1113013 1110848 1109470 1109454 1110649 1112644 1115499 1119470 1124279 1129271
48460 1129271 1134235 1139424 1144762 1149631 1153573 1156657 1158965 1160260 1160428 1159866 1159118 1158343 1157317 1155811 1153854
48445 1153854 1151666 1149333 1146451 1142294 1136491 1129291 1120937 1111248 1100351 1089424 1079886 1071932 1064585
48432 1064585 1057188 1050080 1043756 1038128 1032860 1027787 1022671 1017101 1010923 1004342 997387 989726 981193 972073
48418 972073 962682 953138 943644 934464 925464 916264 907073 898702 891369 884124 876025 867418 859501 852956
48404 852956 847571 843035 839479 837104 835597 834154 832078 829379 826715 824668 823238 822195 821549 821259 820765
48389 820765 819459 817557 815881 814791 813945 813067 812208 811190 809605 807600 805943 804993 804246 803146 801681
48374 801681 799864 797369 794094 790565 787343 784466 781729 779001 776046 772646 769094 765912 762902 759293
48360 759293 755098 751390 748735 746258 742996 739347 736283 733768 730922 727477 724243 722167 721480 721666 722013
48345 722013 722370 723441 725922 729410 732859 736220 740615 746652 753708 761369 770289 780671 791031 799658
48331 799658 806552 812691 818043 821639 823350 824296 825494 827030 828687 830628 833319 837206 842489 849063
48317 849063 856833 866096 877165 889713 903277 918371 936131 956774 979651 1005041 1034574 1069594
48305 1069594 1110651 1159017 1216996 1286166 1367175 1462153 1575649 1712704 1878019 2077424
48295 2077424 2317627 2604420 2944873 3352394 3846388 4448177 5184399 6092540 7204479
48286 7204479 8507829 9927883 11359332 12708078 13882166 14746871 15128690 14903220 14089377
48277 14089377 12851637 11411155 9952646 8589906 7377708 6331823 5444380 4698246
48269 4698246 4076827 3564582 3144557 2800200 2518301 2288028 2099015 1942482 1812547
48260 1812547 1704542 1613325 1534536 1465968 1406277 1353618 1306594 1265061 1228704 1196103 1166204
48249 1166204 1139383 1115897 1094511 1073799 1053721 1034848 1017111 1000347 985089 971741 959801
48238 959801 948830 939293 931578 925065 919159 914402 911611 910617 910768 911828 913351 913828 911581 906056 897445
48223 897445 885641 870605 853377 835696 818745 802879 788173 774524 761589 749341 738376
48212 738376 729017 720471 711565 701953 692001 681908 671746 661981 653101 644879 636707 628523 620753 613551
48198 613551 606779 600560 595134 590303 585712 581554 578265 575568 572603 569127 565883 563538 561859 560191
48184 560191 558344 556699 555758 555734 556296 556546 555622 553545 551290 549908 549735 550470 551679 552990 554042 554581
48168 554581 554592 554254 553844 553759 554458 556099 558242 560159 561605 563073 565107 567507 569625 571366 573329 575781
48152 575781 578027 579247 579622 580099 581313 583299 585956 589006 591592 592791 592706 592344 592228 591871 590917 589988
48136 589988 589936 590875 592489 594678 597224 599378 600633 601726 604061 608134 613034 617457 620771 623148 625184
48121 625184 627459 630127 632945 635942 639820 645219 651734 658223 664137 670022 676561 683603 690393 696433
48107 696433 701838 707117 712904 719709 727570 735893 743899 751343 758634 766146 773572 780224 785844 790803
48093 790803 795513 800109 804901 810537 817132 823609 828658 832260 835561 839338 843323 847097 850721 854178
48079 854178 857093 859532 862358 866129 870213 873674 876546 879526 882849 886288 889982 894414 899684 905442
48065 905442 911458 917563 923173 927548 930558 932560 933589 933287 931606 928832 924800 918778 910299 899560
48051 899560 886888 872506 857085 841860 827799 814955 802858 791000 778846 766053 753093
48040 753093 741000 730000 718936 706708 693816 681746 671188 661679 652838 644901 637843 630890
48028 630890 623509 616297 610248 605354 600576 595109 589112 583125 577312 571621 566282 561667 557732 553987
48014 553987 549988 545594 540852 536091 532138 529899 529345 529216 528174 526137 524163 523085 522632 521892 520339
47999 520339 518278 516405 515086 514045 512744 510998 509069 507266 505734 504636 504127 503969 503608 502945 502612
47984 502612 503026 503576 503340 502364 501503 501118 500765 500271 500270 501284 502822 503861 503883 503120 502133 501516 501708 502697 504073
47965 504073 505589 507387 509423 511140 512179 513192 515260 518594 522353 525798 529052 532495 535927 538834
47951 538834 541284 544088 547919 552567 557207 561277 564877 568313 571501 574037 575758 576988 578094 578949
47937 578949 579007 577913 575832 573173 570114 566611 562791 559118 555990 553337 550769 548047 545143 541882 537931
47922 537931 533356 528893 525405 523187 522000 521477 521201 520608 519355 517778 516608 516222 516484 517308 518884 521225
47906 521225 523977 526907 530241 534218 538597 542965 547305 551872 556656 561331 565781 570332 575367 580866
47892 580866 586433 591646 596232 599971 602600 603978 604376 604397 604388 604017 602634 600072 596816 593341 589563 585131
47876 585131 580000 574479 568829 563048 557032 550743 544238 537680 531393 525855 521535 518607 516721 515153
47862 515153 513412 511635 510155 508785 506967 504779 503268 503403 504980 506952 508560 509725 510553 511130 511825
47847 511825 513135 514988 516662 517756 518833 520718 523434 526324 529042 531805 534571 536538 536827 535432
47833 535432 533159 530793 528616 526705 525284 524649 524895 525847 527173 528567 529982 531782 534512 538434 543372
47818 543372 549149 556021 564550 575050 587369 601207 616494 633316 651534 670639 690128 709986
47806 709986 730623 752096 773466 793171 810110 824179 835709 844589 850088 851451 848575 842214
47794 842214 833511 823153 810967 796608 780600 764248 748389 732825 717293 702449 689252 677767
47782 677767 667321 657656 649116 641724 634870 628167 621964 616682 612199 608231 604891 602450 600915 600278
47768 600278 600910 603297 607441 612813 618765 624756 630404 635662 640977 646976 653925 661516 669212 676761
47754 676761 684438 692712 701636 710657 719243 727509 735925 744588 753212 761699 770015 777518 783184 786858
47740 786858 789610 792407 794992 796556 796887 796165 794065 790034 784344 778027 771620 764564 756089 746221 735643
47725 735643 724921 714116 703009 691528 679967 668837 658565 649389 641489 634865 629017 623196
47713 623196 617290 612062 608147 605211 602568 600292 599073 599184 600232 601832 603860 606138 608596 611761
47699 611761 616321 622130 628358 634788 642112 650624 659476 667785 675747 683906 691889 698776 704445 709589
47685 709589 714440 718298 720515 721215 720719 718882 715450 710721 705300 699385 692753 685410 677787 670142 662077
47670 662077 652942 642604 631663 620988 611176 602415 594637 587721 581644 576436 571959 567823 563706
47657 563706 559698 556134 553160 550725 548894 547732 546837 545538 543843 542730 543135 544999 547666 550781 554225
47642 554225 557537 560200 562406 564959 568411 572868 578503 585604 594112 603859 615330 629392 646072
47629 646072 664464 684241 706393 731778 759588 788127 816647 845576 875025 903932 930775
47618 930775 954536 974790 991271 1003586 1011198 1013664 1011001 1003708 992256 976772 957431 934862
47606 934862 909837 882885 854659 826387 799224 773239 747671 722231 697564 674379 652836
47595 652836 633010 615290 599820 586003 573068 560912 549936 540274 531627 523739 516545 509825
47583 509825 503126 496222 489454 483444 478562 474742 471676 469042 466529 463882 461070 458382 456123 454110
47569 454110 451645 448261 444422 441238 439435 438827 438798 438996 439416 440036 440636 440909 440618 439761 438699 438010 438058
47552 438058 438777 439949 441583 443863 446848 450372 454165 457888 461165 463815 466065 468341 470838 473391
47538 473391 475752 477807 479592 481270 483168 485563 488358 491111 493480 495463 497100 498130 498273 497791 497507
47523 497507 498086 499341 500335 500150 498542 495931 492908 489872 487036 484542 482360 480153 477531 474548 471806
47508 471806 469886 468776 467944 466884 465411 463534 461345 459097 457126 455535 454144 452893 452126 452254 453195
47493 453195 454393 455416 456332 457422 458668 459646 459872 459306 458513 458263 458793 459505 459628 459198 459090 459913 461180
47476 461180 461845 461553 461009 461140 462250 464026 465989 467657 468485 468082 466578 464616 462911 461783 461066 460346
47460 460346 459411 458615 458769 460433 463299 466466 469425 472557 476584 481732 487735 494533 502567 512224 523243
47445 523243 534951 547020 559788 573751 588909 604751 620852 637284 654359 672053 689791
47434 689791 706790 722430 736329 748227 757926 765230 769805 771200 769174 763930 755852 745131 731928
47421 731928 716920 701313 686100 671427 656909 642466 628613 616042 605132 595891 588129 581546
47409 581546 575812 570828 566928 564631 564041 564577 565490 566655 568599 571710 575681 580061 585067 591349 598945
47394 598945 606944 614358 620952 626953 632365 637013 641072 645031 649122 653029 656144 657825 657495 654893
47380 654893 650349 644597 638233 631514 624655 617929 611291 604186 595977 586556 576431 566294 556518 547013
47366 547013 537548 528251 519694 512267 505556 498709 491428 484315 478109 472885 468212 463794 459656 455878
47352 455878 452415 449178 446068 442974 439922 437145 434856 433089 431893 431524 432094 433142 433952 434405 435135
47337 435135 436627 438459 439748 440222 440468 441134 442183 443093 443511 443410 442753 441334 439083 436345 433755 431905
47321 431905 431082 431114 431346 431049 430065 428901 427988 427063 425616 423792 422405 422042 422596 423770 425552 427926 430498
47304 430498 432845 435049 437496 440320 443392 446775 450711 455088 459326 463006 466333 469772 473440 477164
47290 477164 481016 485431 490705 496566 502378 507606 511980 515404 517972 520061 522111 524139 525638 526186
47276 526186 526044 525953 526287 526607 526102 524314 521419 517942 514332 510768 507262 503946 501204 499447 498750 498787
47260 498787 499093 499356 499579 500180 501921 505449 510717 516994 523549 530255 537380 544927 552357 558920 564077
47245 564077 567515 568930 568066 565132 561147 557640 555817 556006 557861 560928 564874 569356 573971 578412 582564
47230 582564 586499 590468 594728 599156 603073 605729 606927 607016 606341 605005 603087 600761 598126 595139 591742
47215 591742 587826 583182 577827 572326 567414 563316 559741 556499 553648 551102 548720 546920 546535 547827
47201 547827 550204 553181 556969 561694 566680 571167 575369 580196 586187 593243 601157 609836 619117 628766
47187 628766 638549 648082 657015 665688 675061 685404 695627 704605 712621 720480 727626 732474 734649 735595
47173 735595 736595 737290 736750 735057 733035 731017 728698 725836 722407 718265 713255 707592 701713 695873 690193
47158 690193 684897 680118 675596 670968 666277 661922 658212 655267 653314 652672 653329 654724 656125 657262 658523
47143 658523 660561 663654 667517 671656 675680 679115 681271 681713 680768 679136 677031 674084 670056 665117 659410
47128 659410 652896 645842 638937 632642 626760 620885 614885 608737 602287 595448 588310 580872 573102 565492
47114 565492 559025 554164 550288 546500 542592 538788 535033 531145 527415 524380 522184 520632 519651 519180 518793
47099 518793 518091 517342 517168 517695 518633 520053 522325 525146 527441 528584 529198 530326 532232 534361 536187 537636
47083 537636 538828 539723 540081 539690 538650 537369 536129 534802 533313 532247 532385 533500 534221 533559 532163 531577
47067 531577 532462 534119 535700 537267 539465 542551 546199 550057 554076 558192 562064 565376 568288 571294
47053 571294 574671 578320 582130 586147 590254 594099 597617 601345 605752 610475 614731 618474 622582 627695
47039 627695 633315 638430 642695 646580 650512 654316 657633 660464 663055 665342 666831 667135 666462 665377 664174
47024 664174 662716 660879 658852 656824 654609 651859 648559 645130 642124 640000 639029 639107 639752 640587 641786
47009 641786 643703 646094 648130 649343 650211 651566 653731 656446 659421 662606 666012 669630 673576 678052
46995 678052 683025 688038 692529 696380 700085 704316 709348 714953 720848 727116 734038 741584 749209 756208
46981 756208 762209 767396 772341 777582 783230 788905 794086 798432 801830 804304 806044 807393 808564 809393
46967 809393 809527 808865 807679 806380 805299 804638 804429 804568 805028 805977 807567 809707 812270 815382 819202 823490
46951 823490 827690 831504 835137 839006 843462 848724 854703 860832 866426 871312 875849 880321 884645 888706
46937 888706 892511 895831 898106 898964 898487 896763 893604 889037 883696 878195 872358 865544 857646 849302 841162
46922 841162 833358 825731 818219 810939 804197 798503 794266 791356 789202 787511 786710 787488 790061 794107 799404
46907 799404 806259 815167 826167 838737 852249 866291 880508 894426 907740 920601 933229 945320
46895 945320 956219 965752 974479 982955 991129 998664 1005446 1011426 1016246 1019544 1021576 1023177 1025078 1027504
46881 1027504 1030321 1033254 1036010 1038524 1041156 1044434 1048578 1053490 1059155 1065762 1073339 1081561 1090070 1098823
46867 1098823 1107930 1117185 1125904 1133307 1139151 1144007 1148744 1153641 1158090 1161246 1162829 1163132 1162452 1160833
46853 1160833 1158281 1154910 1150795 1145925 1140425 1134649 1129018 1123861 1119363 1115528 1112255 1109623 1108077 1108076 1109581
46838 1109581 1112075 1115156 1118853 1123363 1128651 1134388 1140140 1145557 1150458 1154743 1158212 1160703 1162523 1164434
46824 1164434 1166832 1169148 1170478 1170605 1169819 1168001 1164742 1160497 1156636 1153863 1151313 1147832 1143554 1139425
46810 1139425 1135640 1131488 1126610 1121518 1116783 1112445 1108431 1104917 1102010 1099568 1097661 1096766 1097182 1098608
46796 1098608 1100541 1102755 1105125 1107373 1109468 1112012 1115788 1121030 1127431 1134650 1142350 1149923 1156739 1162818
46782 1162818 1168775 1174991 1181174 1186911 1192228 1197416 1202648 1208148 1214390 1221621 1229316 1236629 1243474 1250716
46768 1250716 1259146 1268653 1278614 1288736 1299055 1309417 1319557 1329668 1340358 1351752 1363051 1373312
46756 1373312 1382427 1390930 1398975 1405910 1410936 1413888 1415280 1415833 1416051 1416042 1415562 1414318 1412341 1410055 1407987
46741 1407987 1406558 1406038 1406414 1407210 1407796 1408133 1408927 1410784 1413407 1415927 1417827 1419193 1420216 1420974 1421631 1422305
46725 1422305 1422599 1421805 1419764 1417016 1413812 1409528 1403563 1396378 1388951 1381387 1372820 1362702 1351465 1339686
46711 1339686 1327258 1313839 1299654 1285348 1271256 1257293 1243421 1229752 1216197 1202440 1188423
46700 1188423 1174559 1161276 1148559 1136152 1124070 1112653 1102134 1092388 1083250 1074920 1067743 1061561
46688 1061561 1055641 1049515 1043696 1039153 1036078 1033640 1031087 1028650 1027040 1026453 1026572 1027301 1028868 1031217 1033913
46673 1033913 1036845 1040461 1044908 1049382 1052905 1055533 1058226 1061514 1064830 1067306 1068768 1069569 1069862 1069526 1068675
46658 1068675 1067683 1066586 1064935 1062491 1059727 1057318 1055357 1053506 1051765 1050621 1050474 1051366 1053464 1057283 1063111
46643 1063111 1070460 1078479 1086745 1095389 1104654 1114672 1125502 1136880 1147967 1157742 1165750 1172187 1177264
46630 1177264 1180843 1182754 1183003 1181548 1178319 1173652 1168220 1162102 1154384 1144262 1132344 1120213 1108725
46617 1108725 1097419 1085733 1074109 1063423 1053758 1044427 1035132 1026534 1019456 1013930 1009338 1005262 1001780
46604 1001780 998949 996401 993732 991083 989016 987764 986861 985586 983614 981140 978534 976040 973681 971265
46590 971265 968527 965423 962279 959514 957257 955328 953467 951462 949221 946994 945455 945152 945814 946528 946732
46575 946732 946751 947223 948358 949998 952089 954661 957491 960167 962489 964463 965984 966968 967845 969433 972083
46560 972083 975226 978055 980457 982987 986137 989992 994503 999716 1005599 1011921 1018432 1025056 1031824 1038773
46546 1038773 1046042 1053940 1062803 1072835 1084176 1096967 1111164 1126321 1141801 1157348 1173345 1190394
46534 1190394 1208658 1227725 1247033 1266252 1285245 1303926 1322335 1340676 1358916 1376396 1392192
46523 1392192 1406022 1418489 1430170 1440697 1449151 1455328 1460175 1464783 1469197 1472467 1473730 1473046 1471206
46510 1471206 1468976 1466568 1463674 1459853 1454869 1448789 1441903 1434660 1427609 1421188 1415353 1409412 1402365 1393608
46496 1393608 1383373 1372502 1361701 1351005 1339908 1327891 1314666 1299973 1283530 1265493 1246792
46485 1246792 1228545 1211012 1193450 1175148 1156396 1138195 1121267 1105682 1091340 1078460 1067451
46474 1067451 1058519 1051501 1045987 1041592 1038244 1036230 1035899 1037372 1040624 1045730 1052725 1061244 1070579 1080163
46460 1080163 1089790 1099284 1108300 1116637 1124466 1131946 1138770 1144374 1148458 1150981 1151792 1150723 1148092 1144681
46446 1144681 1140987 1136825 1131854 1126222 1120472 1115043 1110123 1105806 1102077 1098806 1096091 1094487 1094561 1096208
46432 1096208 1098809 1102093 1106465 1112335 1119531 1127677 1136894 1147728 1160474 1174857 1190410 1206934 1224537
46419 1224537 1243375 1263363 1284043 1304675 1324562 1343319 1360932 1377666 1393905 1409812 1424900
46408 1424900 1438119 1448635 1456550 1462673 1467649 1471477 1473792 1474311 1472901 1469523 1464228 1457159 1448478 1438426
46394 1438426 1427448 1416122 1404886 1393950 1383417 1373356 1363827 1355099 1347832 1342746 1340030 1339290 1340120
46381 1340120 1342402 1346055 1350905 1357101 1365306 1376163 1389835 1406320 1425895 1448804 1474709 1502944
46369 1502944 1533219 1565679 1600326 1636842 1674939 1714364 1754430 1793900 1831551 1866562 1898408
46358 1898408 1926826 1952033 1974469 1993960 2009427 2019648 2024111 2022903 2016241 2004490 1988317 1968280
$$ [...]
##END NTUPLES=NMR SPECTRUM
##END=
