##TITLE=AC1471_13FE002653_8027014_YZZf2qlXnJ
##JCAMPDX= 6.0         $$ Bruker NMR JCAMP-DX V2.0
##DATA TYPE= NMR SPECTRUM
##DATA CLASS= NTUPLES
##ORIGIN= BRUKER
##OWNER= Administrator
$$ 1.72 TOPSPIN		Version 2.1
$$ 2013-07-11 21:09:09.518 -0700  Administrator@X
$$ Compression mode = diff/dup
##.OBSERVE FREQUENCY= 400.02188249412
##.OBSERVE NUCLEUS= ^1H
##.ACQUISITION MODE= SIMULTANEOUS (DQD)
##.ACQUISITION SCHEME= undefined
##.AVERAGES= 8
##.DIGITISER RES= 22
##SPECTROMETER/DATA SYSTEM= spect
##.PULSE SEQUENCE= zg30
##.SOLVENT NAME= COFFEE_meoh
##.SHIFT REFERENCE= INTERNAL, COFFEE_meoh, 1, 14.98509
##AUDIT TRAIL= $$ (NUMBER, WHEN, WHO, WHERE, PROCESS, VERSION, WHAT)
$$ ##TITLE= Audit trail, TOPSPIN		Version 2.1
$$ ##JCAMPDX= 5.01
$$ ##ORIGIN= Bruker BioSpin GmbH
$$ ##OWNER= Administrator
$$ $$ E:\/data/COFFEE/nmr/AC1471_13FE002653_8027014_YZZf2qlXnJ/10/pdata/1/auditp.txt
$$ ##AUDIT TRAIL=  $$ (NUMBER, WHEN, WHO, WHERE, PROCESS, VERSION, WHAT)
(   1,<2013-07-11 21:09:02.612 -0700>,<Administrator>,<X>,<go>,<TOPSPIN 2.1>,
      <created by zg
	started at 2013-07-11 21:07:57.316 -0700,
	POWCHK enabled, PULCHK disabled,
       configuration hash MD5:
       C8 4E 4E 5D D3 5C D8 9E 9F 52 82 E0 59 8A DE 15
       data hash MD5: 64K
       90 83 EA 8F 1D 22 9F 59 F5 06 D6 21 36 E4 5A DB>)
(   2,<2013-07-11 21:09:05.549 -0700>,<Administrator>,<X>,<proc1d>,<TOPSPIN 2.1>,
      <Start of raw data processing
       efp LB = 0 FT_mod = 6 PKNL = 1 PHC0 = 0 PHC1 = 0 SI = 32K 
       data hash MD5: 32K
       A6 23 79 51 D1 7F CE B7 29 1A C2 BB E1 A6 6F 82>)
(   3,<2013-07-11 21:09:05.862 -0700>,<Administrator>,<X>,<proc1d>,<TOPSPIN 2.1>,
      <pk PHC0 = 95.09216 PHC1 = 0 
       data hash MD5: 32K
       5D 82 D4 A4 AC 86 82 5C 21 55 90 C8 93 10 08 3F>)
(   4,<2013-07-11 21:09:05.971 -0700>,<Administrator>,<X>,<proc1d>,<TOPSPIN 2.1>,
      <abs ABSG = 1 
       data hash MD5: 32K
       EE 36 5E 2C E1 E9 12 89 A5 B6 B8 5B F6 8B 3C 64>)
(   5,<2013-07-11 21:09:06.112 -0700>,<Administrator>,<X>,<proc1d>,<TOPSPIN 2.1>,
      <abs ABSG = 2 
       data hash MD5: 32K
       90 C4 F9 61 E8 6A 21 85 73 D4 B4 ED 04 EF B5 40>)
(   6,<2013-07-11 21:09:06.206 -0700>,<Administrator>,<X>,<proc1d>,<TOPSPIN 2.1>,
      <abs ABSG = 3 
       data hash MD5: 32K
       DF 68 9E 55 F9 4F 8D 42 E9 09 FC FA 3E 1E AE FC>)
(   7,<2013-07-11 21:09:06.253 -0700>,<Administrator>,<X>,<proc1d>,<TOPSPIN 2.1>,
      <abs ABSG = 4 
       data hash MD5: 32K
       DD 47 91 37 B6 05 DC 6B 72 89 D2 8A 2C 02 8E 7A>)
(   8,<2013-07-11 21:09:06.315 -0700>,<Administrator>,<X>,<proc1d>,<TOPSPIN 2.1>,
      <abs ABSG = 5 
       data hash MD5: 32K
       2F C8 B7 50 CB E5 AB 2A C1 6D B1 18 F5 CC E6 A3>)
$$ ##END=
$$ 
$$ $$ hash MD5
$$ $$ 0A 35 E9 C6 C6 9C 70 23 79 D3 F7 4E 7F 83 F7 DD
##$RELAX= 
##$RELAX= 
##$RELAX= 
##$RELAX= 
##$RELAX= 
##$RELAX= 
##$RELAX= 
$$ Bruker specific parameters
$$ --------------------------
##$DU= <E:\>
##$EXPNO= 10
##$NAME= <AC1471_13FE002653_8027014_YZZf2qlXnJ>
$$ [...]
##$TP= (0..7)
150 150 150 150 150 150 150 150
##$TP07= 0
##$TPNAME0= <>
##$TPNAME1= <>
##$TPNAME2= <>
##$TPNAME3= <>
##$TPNAME4= <>
##$TPNAME5= <>
##$TPNAME6= <>
##$TPNAME7= <>
##$TPOAL= (0..7)
0.5 0.5 0.5 0.5 0.5 0.5 0.5 0.5
##$TPOFFS= (0..7)
0 0 0 0 0 0 0 0
##$TUNHIN= 0
##$TUNHOUT= 0
##$TUNXOUT= 0
##$USERA1= <user>
##$USERA2= <user>
##$USERA3= <user>
##$USERA4= <user>
##$USERA5= <user>
##$V9= 5
##$VALIST= <valist>
##$VCLIST= <CCCCCCCCCCCCCCC>
##$VD= 0
##$VDLIST= <DDDDDDDDDDDDDDD>
##$VPLIST= <PPPPPPPPPPPPPPP>
##$VTLIST= <TTTTTTTTTTTTTTT>
##$WBST= 1024
##$WBSW= 4
##$XGAIN= (0..3)
0 0 0 0
##$XL= 0
##$YL= 0
##$YMAX_a= 652251
##$YMIN_a= -552686
##$ZGOPTNS= <>
##$ZL1= 120
##$ZL2= 120
##$ZL3= 120
##$ZL4= 120
##$ABSF1= 14.98509
##$ABSF2= -5.573092
##$ABSG= 5
##$ABSL= 3
##$ALPHA= 0
##$AQORDER= 0
##$ASSFAC= 0
##$ASSFACI= 0
##$ASSFACX= 0
##$ASSWID= 0
##$AUNMP= <proc_prof1d_extract_pilot.lims>
##$AXLEFT= 0
##$AXNAME= <>
##$AXNUC= <1H>
##$AXRIGHT= 0
##$AXTYPE= 0
##$AXUNIT= <>
##$AZFE= 0.1
##$AZFW= 0.1
##$BCFW= 0
##$BC_mod= 0
##$BYTORDP= 0
##$COROFFS= 0
##$CY= 15
##$DATMOD= 1
##$DC= 0
##$DFILT= <>
##$DTYPP= 0
##$F1P= 0
##$F2P= 0
##$FCOR= 0.5
##$FTSIZE= 32768
##$FT_mod= 6
##$GAMMA= 0
##$GB= 0
##$INTBC= 1
##$INTSCL= 1
##$ISEN= 128
##$LB= 0
##$LEV0= 0
##$LPBIN= 0
##$MAXI= 10000
##$MC2= 0
##$MEAN= 0
##$ME_mod= 0
##$MI= 0
##$NCOEF= 0
##$NC_proc= -8
##$NLEV= 6
##$NOISF1= 0
##$NOISF2= 0
##$NSP= 0
##$NTH_PI= 0
##$NZP= 0
##$OFFSET= 14.98509
##$PC= 1
##$PHC0= 95.09216
##$PHC1= 0
##$PH_mod= 1
##$PKNL= yes
##$PPARMOD= 0
##$PPDIAG= 0
##$PPIPTYP= 0
##$PPMPNUM= 2147483647
##$PPRESOL= 1
##$PSCAL= 4
##$PSIGN= 0
##$PYNMP= <proc.py>
##$REVERSE= no
##$SF= 400.02
##$SI= 32768
##$SIGF1= 0
##$SIGF2= 0
##$SINO= 400
##$SIOLD= 32768
##$SPECTYP= <>
##$SREGLST= <1H.CDCl3>
##$SSB= 0
##$STSI= 32768
##$STSR= 0
##$SW_p= 8223.68421052631
##$SYMM= 0
##$S_DEV= 0
##$TDeff= 65536
##$TDoff= 0
##$TI= <>
##$TILT= no
##$TM1= 0
##$TM2= 0
##$TOPLEV= 0
##$USERP1= <user>
##$USERP2= <user>
##$USERP3= <user>
##$USERP4= <user>
##$USERP5= <user>
##$WDW= 1
##$XDIM= 32768
##$YMAX_p= 450155301
##$YMIN_p= -736866
##$CURPLOT= <Network HP LaserJet P1505>
##$CURPRIN= <$Network HP LaserJet P1505>
##$DFORMAT= <normdp>
##$LAYOUT= <+/1D_H.xwp>
##$LFORMAT= <normlp>
##$PFORMAT= <normpl>
##$SURQMSG= 1
$$ End of Bruker specific parameters
$$ ---------------------------------
##NTUPLES= NMR SPECTRUM
##VAR_NAME=  FREQUENCY,     SPECTRUM/REAL,   SPECTRUM/IMAG
##SYMBOL=    X,             R,               I
##VAR_TYPE=  INDEPENDENT,   DEPENDENT,       DEPENDENT
##VAR_FORM=  AFFN,          ASDF,            ASDF
##VAR_DIM=   32768,         32768,           32768
##UNITS=     HZ,            ARBITRARY UNITS, ARBITRARY UNITS
##FACTOR=    0.250966925370066, 1,           1
##FIRST=     8223.43324360094, -35781,       40019
##LAST=      0,             -44142,          -228018
##MIN=       0,             -736866,         0
##MAX=       8223.43324360094, 450155301,    0
$$ Real data points
##PAGE= N=1
##DATA TABLE= (X++(R..R)), XYDATA
$$ [...]
19537a82561A57920a94833j21884J24109L3288A9404g8024k5847J3191I7925b69175
19525b18343C9732a04729B23474R4136a34888F1053a43441k47216E3927a87987
19514F0707m072b01381a3038j54895C17597a41335j15557f5577p772k7686B17951
19502a31747A35391a48838c2221F7194Q2462a11391o9270b4468B14a1303j13531
19491a24834J5643K0610j47746h0533F0414H456Q6940a52143j16481C3121b97623
19479C8972b44808d8781o9433j16437Q9903M373A43474L8753C631J61167L6045
19468B00843c22840F8195K79838h0267A55991g5365G8950O8306h3048p308b2509
19456a8560E4875a30596k13696h2153n5971l2691i698F1815b09468N9373N9584
$$ y = [-182561, 157920, -194833, -316717, -192608, -159320, 19404, -78024, -103871, -90680, 97925, -269175, -218343, 39732, -104729, 223474, 317610, -134888, 61053, -143441, -390657, 53927, -187987, 60707, 56635, -201381, -13038, -167933, 317597, -141335, -256892, -65577, -73349, -101035, 217951, -131747, 135391, -148838, -32221, 67194, 149656, -111391, -180661, -24468, 214, -11303, -124834, -109191, -88581, -236327, -80533, 60414, 8456, 95396, -152143, -268624, 33121, -297623, 38972, -244808, -48781, -118214, -234651, -144748, -140375, 143474, 182227, 3631, 164798, 200843, -322840, 68195, 348033, -80267, 155991, -75365, 78950, 147256, -83048, -90356, -22509, -18560, 54875, -130596, -344292, -82153, -138124, -170815, -9698, 61815, -209468, -150095, -90511]
19445i0511A4701a38211p6388c0110F96b08701K4799P9930R99k84620I2080a54540
19432D2701b16017k37506A16512c35920A61574m597B264K3769i9545A33647b90801
19420C90984A77835j6713R359g162B8849f2139B59867A2094d0557p6817I585K06516
19408B16101b45778j27259G7610b16650A48019a09416N1127A83069a72645a1602
19397a42702j79305F8222L84c17108A1703d63015B56904o0904a30560H1842a27253
19385B12680D8975i2690k08199A09911M7827b38400c9032j81290A29336d6465
19374b58131a11227j43346Q3135P003F7070b20602A18561b318B72023f7744B01256
19362a71035N6132E1930l273b93479E6738J92219a88395b9234m4651G4894b76754
$$ y = [-90511, 14701, -138211, -214599, -30110, 696, -208701, -183902, -103972, -102973, -387593, 92080, -154540, 42701, -216017, -453523, 116512, -335920, 161574, 156977, 2264, 26033, -99545, 133647, -290801, 390984, 177835, 161122, 170481, -7162, 28849, -62139, 259867, 12094, -40557, -117374, 9585, 216101, -245778, -373037, 77610, -216650, 148019, -109416, -58289, 183069, -172645, -11602, -142702, -322007, 68222, 68606, -317108, 11703, -463015, 256904, 196000, -130560, 81842, -127253, 212680, 48975, -92690, -300889, 109911, 157738, -238400, -39032, -220322, 129336, -46465, -258131, -111227, -254573, -171438, -164435, 67070, -220602, 118561, -2318, 272023, -67744, 201256, -171035, -114903, 51930, 48657, -293479, 56738, 248957, -188395, -29234, -73885, 74894, -276754]
19350C13615c92596B03340b22216q3130J32150A88091q0288A4936b01755d1477
19339A16049b48899J00993B42748d1319A44109a31258C63093j28541a36156f2861
19328F3519J9687k0299J19182l3442g4483A5197a64777n3176b3116k93024B84599
19316I7951a77497A65786C0774a41481A36753K0990c63320R2816A55080a64358
19305E50083e7737A54528e5004e150j10132M7581C7625K99779H4695l4023J20933
19294A71605l0139c15041B09617a96744A7492b76723b8544j24501c7278B9698
19283H222N9201a42212j85689I7058i1331L4859o3482J1310k30927a43891O4073
19272g9818l1943M6998A5347b16029B30431b41776c3526j41307e8039A1280b24013
$$ y = [313615, -392596, 203340, -222216, -305346, -173196, 188091, 107803, 14936, -201755, -41477, 116049, -248899, -147906, 242748, -41319, 144109, -131258, 363093, 234552, -136156, -62861, 63519, 83206, 62907, 182089, 148647, -74483, 15197, -164777, -217953, -23116, -316140, 284599, 97951, -177497, 165786, 30774, -141481, 136753, 157743, -363320, -270504, 155080, -164358, 550083, -57737, 154528, -55004, -5150, -115282, -67701, 37625, 337404, 84695, 50672, 171605, 141466, -315041, 209617, -196744, 17492, -276723, -28544, -153045, -37278, 29698, 8222, 67423, -142212, -327901, 97058, -91331, -56472, -119954, -108644, -339571, -143891, -79818, -111761, -64763, 15347, -216029, 230431, -241776, -33526, -174833, -58039, 11280, -224013]
19260b6474F7409K84942B1821c0156j69090F9399b1209n7124j31904k27056i4842
19248E7475J78291h4034k23699q7044g8608r2876i016B10879a69450m700r0212
19237b64362j381E7819b68883B730K20625J12035b27712i0031c1060l6867l6137
19226a04064a4433q7812L6982C6259a83326O1165o1403O8218a2739C3674g9811
19214a54971r4683A269J46878a96275l2697A09292C3163R5030a25439j65257J38018
19203a52678q9439c5431r6709m915A25459a71848G6812b6155j51717j54818C33289
19191c03797J31847A03554a44811H9791J15537a2316p6354n3839c3059k82970
19181c16029P8747a13196k3441e0423C57498H5034j9814J1128K4498b16045f8742
$$ y = [-26474, 67409, 352351, 21821, -30156, -199246, 69399, -21209, -78333, -210237, -437293, -94842, 57475, 235766, -84034, -307733, -394777, -78608, -171484, -9016, 210879, -169450, -174150, -264362, -265743, 57819, -268883, 2730, 223355, 335390, -227712, -90031, -31060, -67927, -104064, -14433, -102245, -65263, 36259, -183326, -122161, -183564, -115346, -12739, 33674, -79811, -154971, -249654, 1269, 148147, -196275, -228972, 109292, 33163, 128193, -125439, -290696, -152678, -242117, -35431, -132140, -137055, 125459, -171848, 76812, -26155, -177872, -332690, 333289, -303797, -171950, 103554, -144811, 89791, 205328, -12316, -88670, -142509, -33059, -316029, -237282, -113196, -136637, -50423, 357498, 85034, 65220, 76348, 100846, -216045, -68742]
19169g354j09889k51877J80489q7079B69318c52011M980a13851k10700a31472
19158a607k01189e1861j61860a3896m68577D7077a57520j53724J24003j05095
19148b92336C30637f7797j01877c1088C316a41387m0523l4326A04248K31904a01312
19136a33361L8413k15412O6408L2925B61230H4495b7990i872j92862R1627E1624
19124D2575o44a8847j81193o4222a22572j01108D41154A11140a8375k30615D7495
19112h4274B96273b32324p3815J26555A22967b05699j08552A07544e7269G6335
19101G111b4970A01493l0103J00058b1552h79j09242k26209a12062p3448f4435
19089b42550A38402h7840A2571J20295C8660R6755D4475R0206J62051A39932d7603
$$ y = [-7354, -117243, -369120, -188631, -275710, 269318, -352011, -347031, -113851, -324551, -131472, -1607, -202796, -51861, -213721, -13896, -482473, 47077, -157520, -311244, -187241, -292336, 330637, -67797, -169674, -31088, 3316, -141387, -181910, -216236, 104248, 336152, -101312, -133361, -94948, -310360, -243952, -211027, 261230, 84495, -27990, -9872, -202734, -111107, 51624, 42575, 41931, -18847, -200040, -264262, -122572, -223680, 441154, 111140, -18375, -248990, 47495, -84274, 296273, -232324, -306139, -179584, 122967, -205699, -314251, 107544, -57269, 76335, 7111, -24970, 101493, 71390, 171448, -21552, -879, -110121, -336330, -112062, -185510, -64435, -242550, 138402, -87840, 12571, 132866, 38660, 135415, 44475, 134681, 296732, 139932, -47603]
19077E7014Q3555L0354E9723b81176C1741e64k56504b2420k9813B23301C1467
19065A87976c09601A2361L4074d96924h0220A91548j9800g6003p4958L4819N6942
19054e9200j12333k69943J73030C31207f6673F8379e8087I9345a84334F4615a00659
19042h5857a5067k27798g9300l6670n017a4873j75346A91619a1888q1744C5161
19030G7603a31905F6107M8945i102B12345H4920b17516C90903j32610f1316a7795
19018A1129M5142b55840A74589q5306g5910C51570e0792a5531G4383e4330l4996
19007h9326J297C5660a17944e0392E2260M7476a87637g0352q3166C1223e5591
18995E1476J34755R608E3701J45036a22359C4874c9647k20937P2522D708J7461
$$ y = [57014, 140569, 170923, 59723, -281176, 31741, -564, -257068, -22420, -52233, 223301, 31467, 187976, -309601, 12361, 46435, -496924, -80220, 191548, 171748, -76003, -150961, -116142, -59200, -171533, -441476, -268446, 331207, -66673, 68379, -58087, 99345, -184334, 64615, -100659, -85857, -15067, -242865, -79300, -115970, -120987, -14873, -190219, 191619, -11888, -93632, 35161, 77603, -131905, 66107, 115052, -9102, 212345, 84920, -217516, 390903, 258293, -61316, -17795, 11129, 56271, -255840, 174589, 89283, -75910, 351570, -50792, -15531, 74383, -54330, -89326, -88029, 35660, -117944, -50392, 52260, 99736, -187637, -70352, -153518, 31223, -55591, 51476, 186231, 195839, 53701, 198737, -122359, 34874, -39647, -260584, -188062, 4708, 22169]
18984B2169J47599a14141C32763j47124b80830B11055a10001A9847R7968n0338
18974F7477A727K048K12932H6009f9229A6417e7529j35393D6039b48275a7793
18962A58410E6313L13622a89998n7745B86501g7411E7280b55132Q7147r7994a4663
18950H2065i0569L4539K1217L753N822A92917e7473B49383h7602A82775L7416
18939B20191f5767A68474a52400f9545B00427d0679o2991A10508a6519C3258J6764
18928E0022b50000j44475b532I9058K6518a45941E831K46804b8349k38716a2536
18916a03763r2689j20654a23758A07389f8344B9220P4626A1915i3022D7540J68536
18905B16076B1962f5273k26890G438b19433E8182c88625B56717j09808b55979
$$ y = [22169, 169768, -114141, 332763, 185639, -280830, 211055, -110001, 19847, 117815, 67477, 1727, 3775, 216707, 86009, -69229, 16417, -57529, -192922, 46039, -248275, -17793, 158410, 56313, 369935, -189998, -247743, 286501, -77411, 57280, -255132, -167985, -265979, -14663, 82065, -90569, -56030, -34813, -31060, -25238, 192917, -57473, 249383, -87602, 182775, 220191, -65767, 168474, -152400, -69545, 200427, -40679, -103670, 110508, -16519, 33258, 50022, -250000, -394475, -2532, 99058, 125576, -145941, 5831, 252635, -28349, -267065, -12536, -103763, -196452, -317106, -123758, 107389, -68344, 29220, 103846, 11915, -93022, 47540, 216076, 21962, -65273, -292163, 7438, -219433, 58182, -388625, 256717, 146909, -255979]
18894d32212R7888a56825B58670j06998a66655A91120o2234f909A02423k9949
18884G2474a98050B31774A8250i6486C6133g6347j01419d590j16561h492k38696
18873b47188A27251b38956B01442a05030j11269F4547a10294n0957L2072b7691
18862c16188c9919A21828e8153j1847M44j62754A36137a23018n108k25385G6574
18850B63095i6700K9878o2237E4759f0494K614F6915A8440b96003N144g6728k22823
18838b99551B4179b20031M6434A10279c55997A42448A8137J15658d5377k69343
18828c14720J11044I9564h1839A3535a52753B44280i5752B39744c0131j5639j07240
18817a53010K1384D1289L9806K60247A15657K37942h6276A88561a01155k03893
$$ y = [-432212, -334324, -156825, 258670, 151672, -166655, 191120, 128886, -6909, 102423, 72474, -198050, 231774, 18250, -96486, 36133, -76347, -177766, -4590, -121151, -8492, -247188, 127251, -238956, 201442, -105030, -216299, 64547, -110294, -161251, -129179, -27691, -316188, -39919, 121828, -58153, -70000, -69556, -232310, 136137, -123018, -128126, -353511, 76574, 263095, -96700, -66822, -129059, 54759, -60494, -57880, 66915, 18440, -296003, -290859, -76728, -299551, 24179, -220031, -173597, 110279, -355997, 142448, 18137, 133795, -45377, -314720, -203676, 99564, -81839, 13535, -152753, 244280, -95752, 239744, -30131, -45770, -153010, -131626, 41289, 81095, 341342, 115657, 353599, -86276, 188561, -101155, -305048]
18807c05048e1844j7142A89745m2162o3316a41232L8587k26815g5908j19731d9451
18795H5675a23694j86945A4692b8773E23425g1634A37523a43319E6966c57174
18784E68644b66002L0237J01742j76866a14565A20631J68907e0925A71857k7886
18774A43971f764p478J552k36118A5605M5069c35651J57456j80928d9961j20156
18763a70117b3895j14800c0182l31035J32420A72770l6140o5748c8312a4333a911
18751a43464A67814a93279a1882q9967B2318i9627k6837j00588A98159a36162
18740A9429c77726a4301j93381b4364m0205k0278A365d8373j48918O0045l4383
18729a71629C22995r0518d37638a19488j5094k6973b9698m8758B15761a9710q428
$$ y = [-305048, -51844, -68986, 189745, 147583, 84267, -141232, -102645, -329460, -75908, -195639, -49451, 85675, -123694, -310639, 14692, -28773, 523425, -71634, 137523, -143319, 56966, -357174, 568644, -266002, -235765, -134023, -310889, -114565, 120631, 289538, -50925, 171857, 143971, -6764, -14242, -12690, -248808, 15605, 60674, -335651, -178195, -359123, -49961, -170117, -23895, -138695, -30182, -361217, -228797, 172770, 136630, 70882, -38312, -14333, -1911, -143464, 167814, -193279, -11882, -101849, 22318, -99627, -126464, -227052, 198159, -136162, 19429, -377726, -14301, -207682, -24364, -64569, -84847, 1365, -48373, -197291, -137246, -171629, 322995, 232477, -437638, -119488, -134582, -161555, -29698, -78456, 215761, -19710, -28138]
18718b8138A30672J52218F8163e1824K2480k7989j53860e6012e233B0528J42689
18707A63217a27024A12063D565a34936g669B95402c03364P6206A48694C7630d37
18695c5448a3260A19334J0016b09707B403a16399l1669A1408J21807a85568M3607
18684a41961o915r3541G8929b03162B39983C1070f1454k8011A3269J55979a41071
18672A01871b21878c4747F0588c58871d9359l7478r1021d3034m3490b3722B42692
18660d2529l30205j7110A44727m1259e3587A17622e1192A70468a65272c120r7594
18649a00714G0296b85838A77288a34395B54153k822h9329A36566B5219J04165
18639A29384A4583b01123B53354G9335J45224a75293L8584c3913A31893a23353
$$ y = [-28138, 130672, 282890, 68163, -51824, -29344, -57333, -211193, -56012, -5233, 20528, 163217, -127024, 112063, 4565, -134936, -7669, 295402, -303364, -227158, 148694, 37630, -437, -35448, -13260, 119334, 129350, -209707, 2403, -116399, -148068, 11408, 133215, -185568, -141961, -148876, -242417, 78929, -203162, 239983, 31070, -61454, -89465, 13269, 169248, -141071, 101871, -221878, -34747, 60588, -358871, -49359, -86837, -177858, -43034, -86524, -23722, 242692, -42529, -372734, -389844, 144727, 103468, -53587, 117622, -51192, 170468, -165272, -3120, -100714, 70296, -285838, 177288, -134395, 254153, 251331, -89329, 136566, 25219, 129384, 14583, -201123, 253354, 79335, 224559, -175293, -136709, -33913, 131893, -123353]
18628a90239b0017B3242b88370h5509j41817A55156a88700A58391c3221l4637
18618f7858g412A11100b07079A90682n4392b66593A25382d713l32004B8949b34078
18606h0768B64204n638g3955B88961g7426j4974A02522a55344f7902k34861e3537
18594c4380o7160C36940e2455H0269A9915b83187A60137b6233G2318J10310F7414
18582a98703n244E4268e2059p5713b5187k1773k04401B27521I2268a46346A5949
18570A23764E4475g6270k07803G3564R0117D5054J49231a25688G450c24531h3857
18558d5527E1051a06608E3839e5233m98379G8461c4622n1389o6896B06675E0444
18546b59872c6855A96731b40943A93511c69660R6994H6114J22583a6725k57401
$$ y = [-190239, -20017, 23242, -288370, -85509, -227326, 155156, -188700, 158391, -33221, -67858, -7412, 111100, -207079, 190682, 136290, -266593, 125382, -4713, -336717, 28949, -234078, -80768, 264204, 258566, -73955, 288961, -77426, -92400, 102522, -155344, -67902, -302763, -53537, -34380, -101540, 336940, -52455, 80269, 19915, -283187, 160137, -26233, 72318, 182628, 67414, -198703, -203947, 54268, -52059, -127772, -25187, -46960, -251361, 227521, 92268, -146346, 15949, 123764, 54475, -76270, -284073, 73564, 163681, 45054, 194285, -125688, 7450, -324531, -83857, -45527, 51051, -106608, 53839, -55233, -553612, 78461, -34622, -86011, -152907, 206675, 50444, -259872, -36855, 196731, -240943, 193511, -369660, -272666, 86114, 208697, -16725, -274126]
18536b74126C59540a66830J9367k74117A55059a13417D0994a84474j42116G327
18525g1411B60802a47818C22153B4090b36394c5255k32943J20401l5104h3027
18514e3025a2442j00180A99756b00075p5748E3834d8331k1933j79430i3403M1451
18503e1952j85156D1267a14587G7177b19418q7092a38650D5157b28073C28901
18492B5435a18007j48589A93971H7219J60323j14519m9303a34135I0608B7101
18481h2917D9393I867p2a01967A02219R0134d3193B6493J93641D7460E610a02560
18468H7343L7449b54696A56586f5748A88040G2968d8430j0605l2894L1607j0473
18457g0795C78780C4944A4853b8118k06330h4646M0952k80893c6617j10667a5715
$$ y = [-274126, 359540, -166830, -147463, -421580, 155059, -113417, 40994, -184474, -326590, 7327, -71411, 260802, -147818, 322153, 24090, -236394, -35255, -268198, -147797, -182901, -83027, -53025, -12442, -112622, 199756, -200075, -275823, 53834, -48331, -70264, -249694, -93403, -51952, -237108, 41267, -114587, 77177, -219418, -306510, -138650, 45157, -228073, 328901, 25435, -118007, -266596, 193971, 87219, 247542, 133023, 83720, -134135, 90608, 27101, -82917, 49393, 9867, 9795, -101967, 102219, 192353, -43193, 26493, 220134, 47460, 5610, -102560, 87343, 124792, -254696, 156586, -65748, 188040, 72968, -48430, -59035, -91929, -60322, -70795, 378780, 34944, 14853, -28118, -234448, -84646, -43694, -324587, -36617, -147284, -15715]
18445c24671c9213m0709F2032a78526A10043J18272q1349d02817B01531a124k40302
18434b41426Q6830p285C87312A68083a52280j56993e3905f385j6126r687l784
18423c5982n7569j96719a16063k8060m6047l3314c912G6116b2239A00918k2478
18412G8440A0178R029J74033c8714l3118b3823k47939A25394a20265M8736b5091
18400H3847b90522d5647j6555A94212R4359c13321j22876a45262B00413I5050
18389A1823K1084c36319c9134B31776d838n505m0294A52228a49410B2894Q8753
18378A11647H164c53432I6545d2391B34176E7512J21334a07155C0986K14916I6054
18366e8579k17021m6591J04647K6421A69953a96250C6346f2194j2759G187L08906
$$ y = [-324671, -39213, -79922, 62032, -178526, 110043, 228315, 146966, -402817, 201531, -1124, -241426, -154596, -161881, 387312, 168083, -152280, -309273, -53905, -6385, -22511, -32198, -35982, -93551, -290270, -116063, -144123, -190170, -223484, -3912, 76116, -22239, 100918, 78440, 10178, 19207, 193240, -38714, -71832, -23823, -271762, 125394, -120265, -71529, -25091, 83847, -290522, -45647, -62202, 194212, 288571, -313321, -436197, -145262, 200413, 95050, 11823, 32907, -336319, -39134, 231776, -4838, -10343, -50637, 152228, -149410, 22894, 111647, 8164, -353432, 96545, -42391, 234176, 57512, 178846, -107155, 30986, 245902, 96054, -58579, -275600, -322191, -217544, -191123, 169953, -196250, 36346, -62194, -74953, 7187, 316093]
18355C16093I2284J04739c72239R4270J9935Q998c5852a1949C00210c30962l7891
18344c68853B80759a39721a5314B0003c81785a9989B32999i1641k2346D3923c49567
18332d7315A09859i3685A5095e7434E2614f7766k5401k4741l14505A45891b5418
18320a75252f3071A51298B5252P9812F293a05662K8768A06680J27517J12400a09547
18308h8554k5515k45553D985b82737H9687a54871B21146j4382a78046d4556A47751
18296A56672J9774l7092k9751d5951C5136K25972a07416j39640A16982k9575a25835
18284a21401j96426d7513D8040J13219k2755l1090h4057k35914a24563A98755
18273c44042Q4076I5487a63389o3844A71225c30737B42330e1974I042e53357e5638
$$ y = [316093, 92284, 197023, -372239, -277969, -258034, -249036, -35852, -11949, 300210, -330962, -368853, 280759, -139721, -15314, 20003, -381785, -19989, 232999, -91641, -113987, 43923, -349567, -47315, 109859, -93685, 15095, -57434, 52614, -67766, -93167, -117908, -432413, 145891, -25418, -175252, -63071, 151298, 25252, 105064, 6293, -105662, -76894, 106680, 234197, 346597, -109547, -88554, -114069, -359622, 4985, -282737, 89687, -154871, 221146, 206764, -178046, -44556, 147751, 156672, 176446, 139354, 109603, -45951, 35136, 261108, -107416, -247056, 116982, 87407, -125835, -121401, -317827, -47513, 48040, 161259, 138504, 107414, -84057, -319971, -124563, 198755, -344042, -259966, 95487, -163389, -227233, 171225, -330737, 242330, -51974, 9042, -553357, -55638]
18261B85480o0006q6058b13651G9185d8357l58097O4303D35598d3172A23882b41794
18249b48528C42062A24249b13933N2494C5994g0112j59893J4919B28238A01563
18238f1315j75060b9491h318n8461B3073M3121c7264k18766d9212b3728A6715
18226B07103b52597D91626a30281A70965c67302A11119a47120b6793j80208k88578
18216d95579F1649c43235c93A02556a06245B50139b7885G3212a2673K505F9613
18204E6100e03955D4690a16003e0420D5340b10790G6194J9273b1364F7651C754
18192B9212a66439q5464A2428Q9224f3955j57640C28501f0174j45648G2169b27214
18180F0839b42389g1321B91914d4018r0405A3854K77637l9797e2974B46207r6736
$$ y = [285480, 225474, 139416, -213651, 79185, -48357, -406454, -342151, 435598, -43172, 123882, -241794, -248528, 342062, 124249, -213933, -161439, 35994, -70112, -230005, -215086, 228238, 101563, -61315, -236375, -29491, -8318, -66779, 23073, 66194, -37264, -256030, -49212, -23728, 16715, 207103, -252597, 491626, -130281, 170965, -367302, 111119, -147120, -26793, -207001, -495579, 61649, -343235, -393, 102556, -106245, 250139, -27885, 73212, -12673, -10168, 69613, 56100, -503955, 44690, -116003, -50420, 45340, -210790, 76194, 95467, -21364, 67651, 3754, 29212, -166439, -251903, 12428, 101652, -63955, -221595, 328501, -60174, -205822, 72169, -227214, 60839, -242389, -71321, 291914, -44018, -134423, 13854, 291491, 251694, -52974, 246207, 149471]
18169A49471n3772J32725c05098A80439G5991B0072h3429A68130M5791a84779
18158E8630m470b6467E3346K7877g1076l3839j26123j62871k5421A39476P6514
18147B15990f2272k8657c9514A4185L23261e3673I8354f1640C320J680J97370
18136B02370A9710a1708E4028a16816A59675i8915k2637b7789B77753H8759d1171
18124E6515L4146a42687A5620K54198a53622O722B89504e5087F9242b37317B61704
18112c13317M3954A95723A1107R5077d20002A4711d2755j28016j20161C77974
18101G6164K04681l3561b34809h5579j44416k2874b5369m1837k52498A075i0094
18089C34636a54435C1290O7856N5158O9655a83004j36196A41511j6325a70863
$$ y = [149471, 95699, 228424, -305098, 180439, 75991, 20072, -83429, 168130, 213921, -184779, 58630, 54160, -26467, 53346, 81223, -71076, -104915, -231038, -393909, -419330, 139476, 215990, -62272, -90929, -39514, 14185, 337446, -53673, 98354, -61640, 3320, 5000, 202370, 19710, -11708, 54028, -116816, 159675, -98915, -121552, -27789, 277753, 88759, -41171, 56515, 90661, -142687, 15620, 269818, -153622, -146900, 289504, -55087, 69242, -237317, 261704, -313317, -269363, 195723, 11107, 106184, -420002, 14711, -42755, -170771, -290932, 377974, 76164, 280845, 247284, -234809, -85579, -229995, -252869, -25369, -67206, -319704, 1075, -90094, 334636, -154435, 31290, 99146, 154304, 223959, -183004, -319200, 141511, 125186, -170863]
18078d5323l10700A15716a23798q6535J02682G9201b08222F4064L41314I8995
18067A08148a10079j39393D63776b54242O6686A47098p2991j6562a37904A35014
18056G0144P3232J19565A11765b09734R8831N435A32842a421j6105j07240n3685
18045a78451B08828b45373c6135E5551a17419A12798c60642J34535M427c7506
18034A15676a15500k6865k5705K8622B01497b20630A57422b36074C6772A5180
18023A00669K1136C3156K04780H3740b59374B74370f4186l3934M0956A707L6644
18012C8351A6283K16883J0895B3912M5509L598F871L262c12350g6224A77318a05755
17999b15351m5521a04935A05021J44548a06911A61339B9651d5893B73864E9813
$$ y = [-45323, -356023, 115716, -123798, -210333, -107651, 79201, -208222, 64064, 405378, 98995, 108148, -110079, -249472, 463776, -254242, -187556, 147098, 74107, 57545, -137904, 135014, 70144, 143376, 262941, 111765, -209734, -110903, -105468, 132842, -1421, -17526, -124766, -178451, 208828, -245373, -36135, 55551, -117419, 112798, -360642, -226107, -221680, -37506, 115676, -115500, -142365, -168070, -139448, 201497, -220630, 157422, -236074, 36772, 15180, 100669, 121805, 33156, 237936, 83740, -259374, 274370, -64186, -98120, -57164, 1707, 38351, 16283, 233166, 244061, 23912, 69421, 73019, 6871, 10133, -312350, -76224, 177318, -105755, -215351, -260872, -104935, 105021, 249569, -106911, 161339, 29651, -45893, 273864, 59813]
17988E2198a26113O2211b4614E6149a12344A59807I274O3232a75496j54532b8008
17976h3651B10922g0073E0811a55740j25450A07771i985o201C6220b26569e1375
17964c35511a46110d7271N549a6498C55259j41768E6044a91651j62022J03761
17954b49912A80054B5328J4033h8084E0070b29140j06639b391j81385A48594Q9272
17943B37866c1578m15816a34559a0995A22042b95323a25604F4799c14813e7395
17932C8970K01408q5058n9851K1188c6641H1452c54148B7803c3775A06891O1797
17921A68688a92558h1150B12377c52587C7023i4514B80228A31288m4492M9438
17911A36234N8385m4603a75785b2326r0935A15665n304e3329C1999R5809b7045
$$ y = [52198, -126113, -63902, -24614, 56149, -112344, 159807, 9274, 72506, -175496, -330028, -28008, -83651, 210922, -70073, 50811, -155740, -281190, 107771, -9985, -16186, 36220, -226569, -51375, -335511, -146110, -47271, -41722, -16498, 355259, 213491, 56044, -191651, -353673, -249912, 180054, 25328, 39361, -88084, 50070, -229140, -335779, -2391, -183776, 148594, 237866, -31578, -447394, -134559, -10995, 122042, -295323, -125604, 64799, -314813, -57395, 38970, 240378, 155320, 95469, 116657, -36641, 81452, -354148, 27803, -33775, 106891, 168688, -192558, -81150, 212377, -352587, 37023, -94514, 280228, 131288, 86796, 136234, 194619, 150016, -175785, -22326, -113261, 115665, 110361, -53329, 31999, 127808, -27045]
17899B7742i6299A41693a70934l9347B3657K70893a64505I08J76831i5414R47
17888i4467K1773E1714K6492A7879a20930K6114A2865i7475A03367d2045B55168
17876d8905I9009B6805J48675b82919f5982J3305n8638D16987j70717i483A00698
17864b14934d322A69262o0565R7602q0283a71501A91717e8857p9643C13509f9293
17852B95135d4328C6707M5461e4160A53044A3190N2878O6824c24361C46006j57802
17841A88204b76025D3784a43791B45617a11602K618j0072n844j4301A2393L963
17830A6356f5112A86434k5784a23302p6734I7023J03403C2597d5434J3783j66528
17819a98179G0056a39578I264J6471r843c55836A95231a14079J5493B69880d3337
$$ y = [27742, -96299, 141693, -170934, -210281, 23657, 294550, -164505, 908, 177739, -95414, -94467, -72694, 51714, 78206, 17879, -120930, -94816, 12865, -97475, 103367, -42045, 255168, -48905, 99009, 26805, 175480, -282919, -65982, -52677, -111315, 416987, 246270, -9483, 100698, -214934, -4322, 169262, 108697, 206299, 126016, -171501, 191717, -58857, -138500, 313509, -69293, 295135, -44328, 36707, 82168, -54160, 153044, 13190, 66068, 132892, -324361, 346006, 188204, -276025, 43784, -143791, 245617, -111602, -108984, -119056, -124900, -139201, 12393, 16356, -65112, 186434, 160650, -123302, -200036, 97023, 200426, 32597, -45434, -31651, -198179, 70056, -139578, 9264, 25735, 15892, -355836, 195231, -114079, -98586, 269880, -43337]
17807a66814J0295p2549A51409R7831q0570B6920K65926k4789g8957m5830A42987
17795G7080e3355B24485G9718L3953J53285J81090D0628J6385c4057A2752b90628
17783C42359G8986J78764h347j2948D7590A7246J8101J42457A4503L0892K2206
17772F7601b27921p0036J13135c965k39769k38319b12554A3996b2744A19301a77638
17760f4308B02161a18242p5340g6231j14648O070M7755k52467e0379I2114L45255
17749D37369a44095P914A21949K32659c559k70557G7742K08622a08613A02565
17738b53433I461O7920f290H7723B5423R2596f1031J2515A47202C2696K75657
17727C08353a01408G5307d6194a7367j339n5657F0738k282a67315A80053c20915
$$ y = [-166814, -156519, -229068, 151409, 249240, 168670, 26920, 292846, 268057, -78957, -124787, 142987, 77080, -53355, 224485, 79718, 113671, 266956, 448046, 40628, 57013, -34057, 12752, -290628, 342359, 78986, 257750, -8347, -21295, 47590, 17246, 35347, 177804, 14503, 45395, 67601, -227921, -297957, -184822, -3965, -243734, -482053, -212554, 13996, -22744, 119301, -177638, -64308, 202161, -118242, -193582, -76231, -190879, -184809, -137054, -389521, -50379, 92114, 437369, -144095, -136181, 121949, 354608, -3559, -274116, 77742, 286364, -108613, 102565, -253433, 9461, 77381, -6290, 87723, 25423, 118019, -61031, -48516, 147202, 32696, 308353, -101408, 75307, -46194, -17367, -18706, -74363, 60738, 58456, -167315, 180053, -320915]
17715F4244A0517a20882A94184a11426j30196A3925J35027K42025G5524b53117
17704A39761a92087F8158a38809C09458a19558d15o7223I2211l5283J4549c23301
17692B03103a43408B87156j11203a17830m1974B97933H0791O082a36990n1078
17682a88068J9069G6052A2795K46479c80670A39599o8076a05991D5911E529c8582
17670a05571b5995j21396F3174a66680A49426K5179e5314A72790J67438B3698
17659E63199A66640P2148j09428A8936L81063a76779A74714H3295J18455K35766
17649D37516b6765C7367j008a16402I16K45780A11572b3614B86390c70851K7543
17638c43308P2983d621A72521a51701n1227m9767A7859a01186j9265A63981a26083
$$ y = [64244, 10517, -120882, 194184, -111426, -241622, 13925, 148952, 390977, 75524, -253117, 139761, -192087, 68158, -138809, 309458, -119558, -415, -67638, 92211, 56928, 71477, -323301, 203103, -143408, 287156, 175953, -117830, -159804, 297933, 80791, 86873, -136990, -188068, -168999, 76052, 12795, 259274, -380670, 139599, 71523, -105991, 45911, 5529, -38582, -105571, -25995, -147391, 63174, -166680, 149426, 174605, -55314, 172790, 340228, 23698, 563199, 166640, 238788, 129360, 18936, 399999, -176779, 174714, 83295, 201750, 437516, -26765, 37367, 36359, -116402, 916, 246696, 111572, -23614, 286390, -370851, -343308, -270325, -4621, 172521, -151701, -202928, -252695, 17859, -101186, -120451, 163981, -126083]
17626A54166b42389d0160D3576h2329j01636B05652D9386B2411J27056K78170
17616D27637A77644N0791i7183j51391i029D904e4551q2186B89233a2108A71875
17604D0994d865A13194a28529A84678G292J29764k3921M4256n6427j7273R8968
17593A82659e2367B45362G1361J89454a77998D0739b19568G5406l6728b77016
17582a26529E9465a46425a0064l0495A17214Q7686D0933g4752j55037C34449j41295
17571A93154a47072b5237A27074F2156L1269J46607a61014a4421D16378A40468
17560C49642D1607J29732C5570a03784a486E98K19779j03366a4979H7695b23048
17548A37750c24308A80948L3135F0806L14525A45012F0945J20390n637a9414q9574
$$ y = [154166, -242389, -40160, 43576, -82329, -183965, 205652, 49386, 22411, 149467, 427637, 177644, 228435, -97183, -248574, -9029, 4904, -54551, -136737, 289233, -12108, 171875, 40994, -4865, 113194, -128529, 184678, 7292, 137056, 113135, 157391, 100964, 83691, 182659, -52367, 245362, 71361, 260815, -177998, 40739, -219568, 75406, 38678, -277016, -126529, 59465, -146425, -10064, -40559, 117214, 204900, 40933, -74752, -229789, 334449, 193154, -147072, -25237, 127074, 62156, 93425, 240032, -161014, -14421, 416378, 140468, 349642, 41607, 171339, 35570, -103784, -1486, 598, 220377, 117011, -14979, 87695, -223048, 137750, -324308, 180948, 214083, 60806, 375331, 145012, 60945, 181335, 175698, -19414, -108988]
17537a08988I7148b83866B05593J73J1524q5089j4806n5641b75064F9575O2496
17526A32071J75296G6981K22361o5656b45542A63001E5189J21533L0829J96298
17516D03849L7450b3249A24337m7521a87422e9664A97241H5916B0454f9242j84894
17505b54136C20584J36601p1916A61384E0608f1929I4770k0844J58123A11034
17494A59288B1242K78258j10891d8486B71743D2930J77310b04648M6308B01213
17483B80091B1093J7596a03596M2534D6176J74818K08450G7611L13680d8860C55637
17471A74241J96509d9032p7771C05714F7583M80198G3655b405B22033D7654K05952
17460B53606J18659G2672J62735q2135J26139L1953k4025j21269j2142k8244J39941
$$ y = [-108988, 97148, -283866, 205593, 205766, 217290, 132201, 117395, 61754, -275064, 69575, 132071, 307367, 76981, 299342, 233686, -245542, 163001, 55189, 176722, 207551, 403849, 441299, -23249, 124337, 76816, -187422, -59664, 197241, 85916, 20454, -69242, -254136, 320584, 457185, 385269, 161384, 50608, -61929, 94770, 73926, 232049, 111034, 159288, 21242, 299500, 188609, -48486, 271743, 42930, 220240, -204648, -158340, 201213, 280091, 21093, 38689, -103596, -61062, 46176, 220994, 429444, 77611, 391291, -48860, 355637, 174241, 370750, -49032, -126803, 305714, 67583, 547781, 73655, -2405, 222033, 47654, 253606, 372265, 72672, 235407, 153272, 279411, 311364, 287339, 166070, 153928, 125684, 265625]
17449B65625k2027K89701l2554G6018J99504C9147R5183K32542P9477e2115E14600
17437B67379A15230M40213a45260D51524j65947C7526L96652A26393O3291l0417
17427A59267L38814B41603L72606B42166K72524r0483I2360J48249J79411r0893
17417C29127m0452l9017K90621r4930K6438G0269b08992I0143L07247A40607a15852
17405I2590K17118N6937d990B47843J31900o2987C3733L26094l2682j7836r0273
17394B19036j05880J36358L5266J01971I2304J40062m5079N9749q6385b15070
17383B34196J57342r1254B278J79340L7039q6693C3079N6690R2343M9378m7047
17372A84443J42947E7668J26273C1983K02437o3730g5499C11395j07257I2495
$$ y = [265625, 243598, 533299, 500745, 76018, 275522, 39147, 134330, 366872, 446349, -52115, 514600, 267379, 115230, 555443, -145260, 451524, 285577, 37526, 434178, 126393, 189684, 159267, 498081, 241603, 614209, 242166, 514690, 424207, 92360, 240609, 420020, 329127, 288675, 249658, 540279, 445349, 471787, 70269, -208992, 90143, 397390, 140607, -115852, 92590, 309708, 366645, -4990, 247843, 379743, 316756, 33733, 359827, 327145, 309309, 219036, 113156, 249514, 284780, 386751, 92304, 232366, 187287, 247036, 160651, -215070, 234196, 391538, 300284, 2278, 181618, 218657, 131964, 33079, 89769, 182112, 231490, 184443, 327390, 57668, 183941, 31983, 234420, 170690, -75499, 311395, 204138, 92495]
17361a68167C76663L8623A87289I1556L47789B5892A1530L01898D0020a43758
17350A84716M1577J24032Q3547j82228G4099J58121H8760D3248J58644J83524
17340C85416j87982B7804L56177j52146h4089D9541A3517b48393B96053c4388
17329b81A37729K0680M63765I4075a43594A88832B7586i1103L8116G8439J99940
17318B78379j8834K0690A29028J0523C2183Q8126J94655F4279a05605B10143J30934
17307C41077h3362E04771a85980C11676A47184j8913b8646D11026p3194c40304
17296B05162l6200E5374L61158A10518J53941b7221j39385A4303L20330A28228
17285D40498j01897M9804n6209I8447r774M02634B15852B7080K22795j4313D5202
$$ y = [-168167, 376663, 415286, 187289, 91556, 439345, 25892, 11530, 313428, 40020, -143758, 184716, 226293, 350325, 433872, 251644, 74099, 232220, 88760, 43248, 201892, 385416, 197434, 27804, 383981, 231835, -84089, 49541, 13517, -248393, 296053, -34388, -281, 137729, 158409, 622174, 94075, -143594, 188832, 27586, -91103, -52987, 78439, 278379, 259545, 280235, 129028, 139551, 32183, 120309, 314964, 64279, -105605, 210143, 341077, -83362, 504771, -185980, 311676, 147184, 128271, -28646, 411026, 337832, -340304, 205162, 168962, 55374, 416532, 110518, 264459, -27221, -166606, 14303, 334633, 128228, 440498, 338601, 388405, 332196, 98447, 88673, 491307, 215852, 27080, 249875, 235562, 45202]
17273F579L12986m4266p571r8698P5621J91255j63734H5383N2744i3320A50109
17261B39674q1446Q4611f320C51586C4964K99482b03904E62990H2277a12239B45672
17249C95741j84436k3118D1872M9898L43361j71002A21558L5280J43613l7130
17239B63321b539p973A91717k0662R1054l2706N8191J36695A65733l751K98186
17228D60168j6446A63977o7586P599a51035B54015d5618H8192L30331k8227F2088
17216B66358A9162K10205j01601O2666J3543L9211K15286j20868p6838j782J71465
17205D30449A19721J82398F1562L84661a23160C33856A25714M44167k04460a13325
17194C36186j7941L6236A6988J13253J8738j2511K37382o518i5490B20042m5125
$$ y = [6579, 319565, 275299, 267728, 169030, 244651, 435906, 272172, 85383, 138127, -93320, 150109, 239674, 158228, 242839, -6320, 351586, 34964, 334446, -203904, 562990, 82277, -112239, 245672, 395741, 211305, 188187, 41872, 91770, 435131, 264129, 121558, 156838, 300451, 263321, -2539, -10512, 191717, 171055, 262109, 229403, 287594, 424289, 165733, 161982, 460168, 443722, 163977, 96391, 103990, -151035, 254015, -45618, 88192, 418523, 390296, 62088, 266358, 19162, 229367, 127766, 190432, 203975, 243186, 458472, 337604, 260766, 258984, 430449, 119721, 302119, 61562, 446223, -123160, 333856, 125714, 569881, 365421, -113325, 336186, 318245, 354481, 16988, 130241, 148979, 136468, 373850, 367332, -95490, 220042, 174917]
17183A74917L92760A9889L17023r5846J77380J39945k52433O6657l8137q6479
17173B47999N1396A12992L37015E3809K82506j32466A8115d918A24481K41172
17163C65653c2226C75822A55317J70200A56979K21748J89795B29875J0164k013
17153B38026P5605J8301j26389h333C78323A11733M1957M9234h1689C80853J2112
17142C92965A89328K31868j87509J68179m8836A65234K75851R7237j25976A37683
17131E05132k25920K72922j55324o4182q4443c4035D07031O5977K58230l48041
17121C83197A85173j4207J86763J95892j52486n4171N8366Q3035k38804K70255
17111E19816A58850K24049j00465p0234K43094j2452j78852F8214O15417H0008
$$ y = [174917, 567677, 19889, 336912, 241066, 418446, 558391, 305958, 372615, 334478, 247999, 299395, 112992, 450007, 53809, 336315, 203849, 18115, -4918, 124481, 365653, -32226, 375822, 155317, 325517, 156979, 378727, 568522, 229875, 240039, 238026, 313631, 331932, 205543, -8333, 378323, 111733, 153690, 202924, -81689, 380853, 392965, 189328, 421196, 233687, 401866, 353030, 165234, 441085, 538322, 412346, 137683, 505132, 279212, 552134, 396810, 332628, 248185, -34035, 407031, 473008, 731238, 383197, 185173, 170966, 357729, 553621, 401135, 346964, 405330, 488365, 249561, 519816, 158850, 382899, 282434, 212200, 455294, 442842, 263990, 68214, 683631, 80008]
17100F10451o2635j30991j3637n8078A3576N45831R156q7623L7730a3159F10165
17088E48114k30694j1400J73650L4048j99494Q8669p6510K62034B40957M78835
17078G19792k89552R3092J03326j72507M4683J46563j58488K3999K24281A71218
17067B99832M81726k81548j2857Q549j36897Q5934A26454O20534N8379C12090
17056B87038K96674k22520J09453k08095L22537j20027J03793n2716K70882k26654
17046E60365J01192j94257K96686J63317K5390k53544M5357j51902j65566K38190
17036F65228J9480k73646N00903k62452R9633r8377K44483j31838k17793m511
17026E41110J48641K06375j67215J86842D44215J69121M5730M3310k9860N6603
$$ y = [610451, 547816, 416825, 403188, 345110, 13576, 559407, 568563, 480940, 518670, -13159, 610165, 548114, 317420, 306020, 479670, 513718, 314224, 402893, 326383, 588417, 240957, 719792, 430240, 523332, 626658, 454151, 498834, 645397, 486909, 510908, 735189, 171218, 299832, 781558, 500010, 487153, 495702, 358805, 444739, 126454, 746988, 805367, 312090, 287038, 583712, 361192, 470645, 262550, 585087, 465060, 568853, 516137, 787019, 560365, 661557, 467300, 763986, 927303, 952693, 699149, 744506, 592604, 427038, 665228, 684708, 411062, 911965, 649513, 749146, 650769, 895252, 763414, 545621, 541110, 689751, 896126, 728911, 915753, 444215, 613336, 659066, 702376, 672516, 729119]
17016G29119J37214j32949K08506k89003j35174J48341O9534j39992M01230k30240
17006G66586M19380D77160L63743n7428k22563P531K09687o4386p8480K92239
16996I27503j86254o0221L26517k06084J01697R3927q8229l01250P60449l43233
16986A024822j91754q2108q2792L48583k50257L24303j65242K840J53598j39691
16976I42302n743L16466m49354j14823K25628m7127K09489j78609Q3094J57259
16966A138582J27673o4756J4883l79780L73486j26125n04424O73328k03539Q4516
16956A133844q0775J33346K09281l80375M47339n22354M42959k88062p1732J93294
16946A216765K39062l02519K57578m41908J60048J91307j12464J30499o9055K60457
$$ y = [729119, 866333, 733384, 941890, 652887, 517713, 666054, 735588, 595596, 996826, 766586, 1185966, 477160, 840903, 783475, 560912, 568443, 778130, 713744, 635264, 927503, 741249, 681028, 1007545, 801461, 903158, 997085, 908856, 607606, 1368055, 1024822, 833068, 750960, 668168, 1016751, 766494, 1090797, 925555, 928395, 1081993, 942302, 936559, 1253025, 803671, 688848, 914476, 867349, 1076838, 898229, 981323, 1138582, 1266255, 1201499, 1216382, 836602, 1210088, 1083963, 579539, 1252867, 1049328, 1133844, 1053069, 1186415, 1395696, 1015321, 1462660, 940306, 1383265, 1095203, 1023471, 1216765, 1455827, 1153308, 1410886, 968978, 1129026, 1320333, 1207869, 1338368, 1269313, 1529770]
16936A529770p4654k28617L7372J26955N5502M3994j26842j9427J9468J57411
16926A520932P8461K6536n33453K11856L11745K4145J9796K10867o67518O29256
16916A832623l90384L46849j6105j30973R8064k6021m01572J98712M26980l90938
16906A547235P0365K66646J14120k50222J01300K24073k91711M48281k0997j11866
16896B097224J66141k7904r6289l4354j25425K99135p4792L196J88796q0796k56239
16885B058693O9109K22545m9148l2045K27188R3231R9366j32490J36717R0959
16875B784125j08240j85939K94431k37675K45461Q0193j1301R4749J4013J30412
16865C100229P7420m5308r9462n9914K12812O6767r4510M76111m55867M27838
$$ y = [1529770, 1455116, 1226499, 1263871, 1390826, 1446328, 1490322, 1363480, 1344053, 1363521, 1520932, 1599393, 1625929, 1092476, 1304332, 1616077, 1640222, 1660018, 1870885, 1203367, 1832623, 1442239, 1789088, 1772983, 1642010, 1740074, 1714053, 1312481, 1511193, 1938173, 1547235, 1617600, 1884246, 1998366, 1748144, 1849444, 2073517, 1781806, 2230087, 2209090, 2097224, 2263365, 2235461, 2139172, 2104818, 1979393, 2278528, 2203736, 2206932, 2395728, 2314932, 2058693, 2127802, 2350347, 2301199, 2269154, 2496342, 2589573, 2688939, 2556449, 2693166, 2784125, 2675885, 2489946, 2784377, 2546702, 2792163, 2872356, 2861055, 2955804, 2969817, 3100229, 3177649, 3132341, 3032879, 2972965, 3185777, 3252544, 3158034, 3634145, 3178278, 3606116]
16855C606116M1371m71845P45716r3612o3533j14939N09801k07995k02036J91022
16845C940066o3918K65472K91535k75889L93447j18707Q6654K21937j00942O9208
16835D708863L05854m8659L1233K69307Q7574l80444K76232K81217r787K18628
16825E740018k0687N0538O84304n75313J88490J79475J31302L23159J64943o4533
16815F801696J63270O4648M35389l8944K14511M44379k8076L34991l263J77935
16805H566536K06986J06203M34726L06080j24685M12902J55569K22033J98418
16796A0484768M71399O22089l1352L80171K98717l4533O72490K21131N37261L40175
16786A3962316L65863J3168M27891J005995K60767L22567N75775N27660M54966
$$ y = [3606116, 3647487, 3175642, 3921358, 3827746, 3764213, 3649274, 4159075, 3951080, 3749044, 3940066, 3876148, 4141620, 4433155, 4157266, 4550713, 4432006, 4518660, 4740597, 4639655, 4708863, 5014717, 4966058, 4997291, 5266598, 5354172, 4973728, 5249960, 5531177, 5521390, 5740018, 5719331, 5769869, 6454173, 5878860, 6067350, 6246825, 6378127, 6701286, 6866229, 6801696, 6964966, 7029614, 7465003, 7426059, 7640570, 8084949, 8056873, 8391864, 8388601, 8566536, 8773522, 8879725, 9314451, 9620531, 9495846, 9908748, 10064317, 10286350, 10484768, 10956167, 11578256, 11546904, 11927075, 12225792, 12191259, 12863749, 13084880, 13622141, 13962316, 14328179, 14341347, 14769238, 15775233, 16036000, 16358567, 16934342, 17462002, 17916968]
16777A7916968M74236R06249P37423N82093P15100N58710Q89557Q77952J003001
16768B4661289Q12089N90793J308059R74311J056413J205812J025138J280526
16760C2914430J775297J558835J705699J755932J612637J441658K289029J681455
16752D6734972K453782K485112K284149K526949L086438K548360L261080L467321
16744F8848163L602124L727001L525325M533981L994297N005008M437999N039493
16736A02713391N409285M863816N504858N121653N859287M996193N710322M966073
16728A45144878M807292M194505M314752L117872K574428K316154Q77818L22957
16720A67670656j90029j279289k013994k989314k966761l915040m590739m937227
$$ y = [17916968, 18391204, 19297453, 20034876, 20616969, 21332069, 21890779, 22780336, 23658288, 24661289, 25473378, 26064171, 27372230, 28346541, 29402954, 30608766, 31633904, 32914430, 34689727, 36248562, 37954261, 39710193, 41322830, 42764488, 45053517, 46734972, 49188754, 51673866, 53958015, 56484964, 59571402, 62119762, 65380842, 68848163, 72450287, 76177288, 79702613, 84236594, 88230891, 93235899, 97673898, 102713391, 108122676, 112986492, 118491350, 123613003, 129472290, 134468483, 140178805, 145144878, 149952170, 154146675, 158461427, 161579299, 164153727, 166469881, 167347699, 167670656, 167480627, 166201338, 164187344, 161198030, 158231269, 154316229, 149725490, 144788263]
16712A44788263m785140n271804n217807n601101n271381n332158n423518n318290
16704A02567064n248143m675800m344499m511286m114570m003615l821799l258968
16696F8588384l365050l181314l117669k538583k739345k488111k422466k029287
16688D6706559j908609j878596j949221j708223k007168j344033j296416j140679
16680C3473614j771507j240290j069535j236665q69436j249362n12389r68164
16672B4556266p35791j029948q35936r46225n67197o79784o73106l603r72595
16663A8112081q81119j12617o44255m71585l82397n40526k04638q01560j90358
16654A3883026n62596k41999o19493j38870m31560k02712p48199L09194m04270
$$ y = [144788263, 140003123, 134731319, 129513512, 123912411, 118641030, 113308872, 107885354, 102567064, 97318921, 92643121, 88298622, 83787336, 79672766, 75669151, 71847352, 68588384, 65223334, 62042020, 58924351, 56385768, 53646423, 51158312, 48735846, 46706559, 44797950, 42919354, 40970133, 39261910, 37254742, 35910709, 34614293, 33473614, 31702107, 30461817, 29392282, 28155617, 27286181, 26036819, 25524430, 24556266, 23820475, 22790527, 21954591, 21008366, 20441169, 19761385, 19088279, 19084676, 18112081, 17230962, 17118345, 16474090, 16002505, 15620108, 15079582, 14874944, 14073384, 13883026, 13320430, 13078431, 12458938, 12320068, 11888508, 11685796, 10937597, 11246791, 10842521]
16645A0842521n10121j40052q9648l07446l35294n0900j67658j56472m14877j40555
16635H529498l76136j71302m239l61061k21358K2700j72654j25978m4430j03326
16625F971714k05007q829n49622K1020o7356J80871n00592J94141j82939k22571
16615E630830M4773k72462R1921m14139N954L270M8350j74896j30648k37139k8346
16604D567468j05143m3526k7927J18879k43863j64058j02806J74008K3481k40999
16594C955514O1993l79616J23667j12992j15111k99828L20001j59861n791r7396
16584C290580K01321k12576K6742j82309J02863m7979j40214k18624K35871j1352
16574C044323k83935K50740k51594j16530K7156K170J92406l00931k70867M04609
$$ y = [10842521, 10332400, 10192348, 10102700, 9795254, 9459960, 9409060, 9241402, 9084930, 8670053, 8529498, 8153362, 7982060, 7977821, 7616760, 7395402, 7418102, 7245448, 7119470, 7075040, 6971714, 6766707, 6757878, 6208256, 6229276, 6161920, 6342791, 5842199, 6036340, 5853401, 5630830, 5675603, 5403141, 5495062, 5080923, 5086877, 5090147, 5138497, 4963601, 4832953, 4595814, 4567468, 4462325, 4418799, 4390872, 4509751, 4265888, 4101830, 3999024, 4173032, 4196513, 3955514, 4017507, 3637891, 3761558, 3648566, 3533455, 3233627, 3553628, 3393767, 3387976, 3290580, 3491901, 3279325, 3306067, 3123758, 3226621, 3178642, 3038428, 2819804, 3055675, 3044323, 2760388, 3011128, 2759534, 2643004, 2670160, 2672330, 2864736, 2563805, 2292938, 2697547]
16564B697547k37180L39896j88933Q6816o60964J74025N75689m51231j05226j17905
16554B112534Q1637K83433m62136j780L0703k7478L17359l15041j74553p2971
16544A771707K46263j78088K39J46569K7639j43995k88755O36013p01076L60209
16534A876725J59142j60987l44447K70375l60992J14537M69324l13830j43911
16525A565936K47843j37013j15046K36737o13190R5082K67767J89247k65055j41258
16515A331050K76179J39442P8690n04744L09222j22394j1244j23791M44965n47262
16505A270113K68533k13768Q2591p3977q3467Q6375P8752J16376k07614j0735
16495A313179j90517j74179L40654k94251J57781J60579n5183k76162M00030l0767
$$ y = [2697547, 2460367, 2800263, 2611330, 2698146, 2037182, 2211207, 2786896, 2335665, 2230439, 2112534, 2194171, 2477604, 2015468, 2013688, 2044391, 2016913, 2334272, 2019231, 1844678, 1771707, 2017970, 1839882, 1840121, 1986690, 2014329, 1870334, 1581579, 2217592, 1516516, 1876725, 2035867, 1874880, 1530433, 1800808, 1439816, 1554353, 2023677, 1709847, 1565936, 1813779, 1676766, 1561720, 1798457, 1185267, 1280349, 1548116, 1737363, 1472308, 1331050, 1607229, 1746671, 1825361, 1320617, 1629839, 1507445, 1496201, 1372410, 1817375, 1270113, 1538646, 1324878, 1407469, 1333492, 1250025, 1336400, 1415152, 1531528, 1323914, 1313179, 1122662, 948483, 1289137, 994886, 1152667, 1313246, 1258063, 981901, 1381931, 1351164]
16485A351164k88754N4797j69737N6273K0836k5316j35333M62615l47001k19403
16475G60141O63517m28719k01329J9312J11777J93177r8324P3146j67821K21198
16465A146075m35354K56619k76120J57107J48347M6770k69444m7377J98220J51903
16455A076746p400j5957m8918j11685p5702k24982L99667m524l92773L44373l77505
16444E61340M75948l43537K08202L6258j12488j01457O07308n45919J0726R593
16434H05974j31381J7443R1347j56837L97324l75882L99552l05242j01982J1168
16424F51484L62853l58231r6628L31661M6714j88978l09570N56789l07056M2469
16414G31507q2918O3226L95275l69571k47841M41984r947q916l74766O5293J3382
$$ y = [1351164, 1062410, 1117207, 947470, 1003743, 1024579, 999263, 863930, 1326545, 979544, 760141, 1423658, 994939, 793610, 812922, 924699, 1117876, 1019552, 1092698, 924877, 1146075, 710721, 967340, 691220, 848327, 996674, 1043444, 774000, 726623, 924843, 1076746, 1069346, 1053389, 1004471, 892786, 817084, 592102, 991769, 987245, 594472, 938845, 561340, 1037288, 693751, 901953, 938211, 825723, 724266, 1331574, 785655, 796381, 805974, 674593, 692036, 783383, 626546, 1023870, 647988, 1047540, 742298, 640316, 651484, 1014337, 656106, 559478, 891139, 937853, 748875, 439305, 996094, 689038, 731507, 648589, 711815, 1107090, 737519, 489678, 931662, 921715, 912799, 538033, 603326, 616708]
16403F16708N3163N3298l9956k38197M08222k60565J34041k78447K86053j8010
16393G16310Q2152o6290M9533k58960q0078L00469k1772k64130M790B11240K69198
16382D80438o2547L66947J13335k21631l07881L80284q1877l14831J74258B50770
16371D27352j53742L31113j63443l9597m6346p8243L01602A42823M51724p8379
16361E16168k5964B34531L31842J57244j26782B79057K66854q3166l0635P18913
16351A151023A44920K37560Q6062K03601P2475l66374K32730k07856l8891K66913
16341F31140C08529P4502K09764B57965L85997j53100Q7451p137r168J08218j44840
16330E25386j15428O9697L3552l8617J61081k46224K41285Q8552m1357J04806
$$ y = [616708, 669871, 723169, 683213, 445016, 853238, 592673, 726714, 448267, 734320, 716310, 798462, 732172, 781705, 522745, 442667, 743136, 721364, 457234, 462024, 211240, 480438, 417891, 784838, 898173, 676542, 368661, 748945, 667068, 352237, 526495, 250770, 427352, 273610, 604723, 441280, 401683, 355337, 277094, 578696, 142823, 594547, 516168, 490204, 234531, 566373, 723617, 596835, 279057, 545911, 462745, 432110, 1151023, 144920, 382480, 468542, 672143, 744618, 378244, 610974, 403118, 364227, 631140, 308529, 383031, 592795, 257965, 643962, 490862, 578313, 571176, 562008, 670226, 525386, 409958, 479655, 513207, 474590, 635671, 389447, 630732, 719284, 677927, 782733]
16320G82733C81555L7088q0427J85905j98208l0823L73505B53168K74763Q7030
16310F14961K51898m16351n5629J92509k58566J548K46824B33237L89890k55954
16300C67173M5j58766M00142k72945L12496n7255q3787b6705B75509J99437r1411
16289C83535j59188J49691a7301B75579n3292K47302o9066p5421L99740C04147
16278C93042L1401q8676Q1455q9028K06102j27151L7536m2242J0015p3023j24604
16267B14827J55423r9910M0288n8770J66949k066M0658A99802L79971j30331k16477
16256B32965D4809A15K1544L95366A94100J91591r9635Q8200j32686K3234K685
16245B67489N1066L5912n4804K57851j2409B52131j8514Q1141o7154j7415Q4687
$$ y = [782733, 381555, 418643, 338216, 524121, 325913, 295090, 668595, 253168, 527931, 614961, 866859, 450508, 394879, 587388, 328822, 330370, 577194, 233237, 623127, 367173, 367218, 208452, 608594, 335649, 648145, 590890, 507103, -26705, 275509, 474946, 383535, 224347, 374038, -17301, 275579, 222287, 469589, 400523, 325102, 724842, 304147, 393042, 424443, 335767, 417222, 328194, 534296, 407145, 444681, 402439, 412454, 339431, 214827, 370250, 270340, 310628, 251858, 418807, 416741, 457399, 199802, 579773, 449442, 232965, 44809, 115, 21659, 417025, 194100, 385691, 286056, 374256, 241570, 264804, 267489, 318555, 354467, 299663, 557514, 545105, 252131, 233617, 314758, 247604, 230189, 314876]
16234C14876C9377J57171J18903m8306F5678O4766J18328o7079R4597H301b4301
16222C12734A02288J43239K0277E0213L68351A40514Q382J51415K42095B06237
16211B68014J81172A41568p296L13145A55468k5101o0340A2434L01245H2488K07025
16200B89513A41651C8650M35928A05778J87488m8583A19466L51630a12113A94548
16189B12798L9375o4431J9697J56455h5627E04370D2435J41080J26565b00649
16178B84569R4016j76494E3942P3734J52067r6136Q5368r6316G0156C0781J68583
16167A99364r7932K09528a99188G0464c3066j4987B66487M6942g3775B84568l4928
16156B49640P2397m5553p4515i860q6772C75153A28300M31304C0347N3880Q3827
$$ y = [314876, 39377, 196548, 315451, 267145, 65678, 130444, 248772, 181693, 276290, 8301, -24301, 312734, 102288, 245527, 265804, 50213, 418564, 140514, 148896, 300311, 542406, 206237, 268014, 449186, 141568, 134272, 447417, 155468, 130367, 70027, 12434, 313679, 82488, 289513, 141651, 38650, 474578, 105778, 293266, 244683, 119466, 471096, -112113, 194548, 212798, 252173, 187742, 207439, 363894, -85627, 504370, 42435, 183515, 310080, -200649, 284569, 378585, 202091, 53942, 127676, 279743, 183607, 268975, 172659, 70156, 30781, 199364, 101432, 310960, -199188, 70464, -33066, -48053, 266487, 313429, -73775, 284568, 249640, 322037, 276484, 201969, -9860, -96632, 375153, 128300, 559604, 30347, 84227, 168054]
16145A68054J28499e3954B33958P9719m9154a44991B25787r502b08799b8246A84888
16133B65060F0622G897M7474J87464L92550A71434a18066j67335Q4757F3759R6022
16122A59781J22690J8941B0508M7772J98987c50175A05567N4024P0344B9444a63219
16110A3097K31405q2638J03545K10124F0940a3318r5981C82777j77611C5310K21354
16099B56664a4283A98226c9987A15321K19423P790a47403E5612L54163o357A31737
16087a71979A63156j3411b83503a3889q4483A68931D9835J25019p9458K00633
16077B96029A4408K90028f5973C28572b18201G5884k360B075J43215K96044A72542
16065e3796A29611M1524E5318K32967b28811a9753E3379J20688H2207K08767J6362
$$ y = [168054, 296553, -53954, 233958, 313677, 264523, -144991, 225787, 216285, -208799, -28246, 184888, 265060, 60622, 7897, 55371, 242835, 635385, 171434, -118066, -285401, -200644, 63759, 159781, 282471, 301412, 20508, 68280, 267267, -350175, 105567, 159591, 229935, 29444, -163219, 13097, 244502, 161864, 265409, 475533, 60940, -13318, -109299, 382777, 205166, 35310, 256664, -14283, 198226, -39987, 115321, 334744, 342534, -147403, 55612, 409775, 403418, 131737, -171979, 163156, 149745, -283503, -13889, -98372, 168931, 49835, 174854, 95396, 296029, 14408, 304436, -65973, 328572, -218201, 75884, 73524, 2075, 145290, 441334, 172542, -53796, 129611, 171135, 55318, 288285, -228811, -19753, 53379, 174067, 82207, 290974, 307336]
16054C07336f9066C1424O6201J40556a29238A15536j7180b4877k5282B2273J38122
16043A60395i6570r4869C83526a5708B2887Q9993k9217a9917A61023O3243C2430
16031c59956H4049N385b6398k09422D42729H3110b62985a09711D25185c85746
16020i3032q2673h1079H2519Q1324b37866M2119A25994l3093a54596G0143a29571
16008i6049j05494k8443B43353i3134j00828n866k12099l2834D2466f8990C661
15996a05406B10927b6731E6936k5980N7936K3912a11048A25640c1990j72516C6810
15984B26172K82014A42251K77506j75350j15487K0293R4246o0731a36612B001
15973H4846L84344c03514J27536B7273M4754g9773B8974a70241A50699O4371g8714
$$ y = [307336, -69066, 31424, 97625, 238181, -129238, 115536, 98356, -24877, -50159, 22273, 160395, -96570, -191439, 383526, -15708, 22887, 112880, 83663, -19917, 161023, 224266, 32430, -359956, 84049, 89434, -26398, -235820, 442729, 83110, -262985, -109711, 425185, -385746, -93032, -175705, -81079, 82519, 163843, -237866, -195747, 125994, 92901, -154596, 70143, -129571, -96049, -201543, -229986, 243353, -93134, -193962, -199828, -411927, -444761, 42466, -68990, 3661, -105406, 210927, -26731, 56936, 30956, 88892, 112804, -111048, 125640, -31990, -204506, 36810, 226172, 508186, 142251, 419757, 244407, 128920, 149213, 243459, 182728, -136612, 2001, 84846, 469190, -303514, -175978, 27273, 72027, -79773, 28974, -170241, 150699, 215070, -78714]
15961F6427P9242B8487J89348k3400h7174A99288B5705h2350F8131O0621B5052
15949g9869B5079J30283n5256a38364H0267a0135j6936D1895i5459I6523c3500
15937b01668c9439A94232C0931c49657e0642E426c19399D5825J27573b77188p5312
15926c52500B41113a31228B42960b22038A25006D7518a44271p4155K2060E0219
15915A62705o5527J56672I6840K31428B2458e7624B3653a13057A15058d5552A20614
15903A35803c62146G5670M30222h0814c191B83440b33511m415i2402c0097l88228
15892d18325g0966c118q4879B18895O0306a16854g540I9840b9226j9107B3093
15880H8445g5889I1115P963l9235a31700I1960c09773J3964A34112b44232m0647
$$ y = [66427, 145669, 28487, 217835, 194435, -87174, 199288, 25705, -82350, 68131, 128752, 25052, -79869, 25079, 155362, 100106, -138364, 80267, -10135, -27071, 41895, -95459, 96523, -33500, -201668, -39439, 194232, 30931, -349657, -50642, 5426, -319399, 45825, 173398, -277188, -352500, 241113, -131228, 242960, -222038, 125006, 47518, -144271, -218426, -196366, 50219, 162705, 97178, 253850, 96840, 328268, 22458, -57624, 23653, -113057, 115058, -45552, 120614, 135803, -362146, 75670, 505892, -80814, -3191, 283440, -233511, -237926, -92402, -30097, -418325, -70966, -3118, -87997, 218895, 279201, -116854, -7540, 99840, -29226, -48333, 23093, 88445, -75889, 91115, 99078, 59843, -131700, 91960, -309773, -295809, 134112, -244232, -284879]
15869b84879f6587H6108b04332B55953G8931b17280h4531a0020j54494m3173r318
15858b17005A8126R4464d5066B76140a66803o7184B3026K40702H7446a41366B75849
15846G2041G936c3283j20768d5184J9906J577p8701l5909J6088L2317C2398j0713
15834B1685K321J71167B2038J2669a90572j52822a65660b8368D2699a64439C1312
15822C2197J39223n8813c89017C2788h6695C40639A63820J15227A37194g5822
15811h8285m1565j9211E3088a29762F9139j6404P499a58965k17711J28284D5618
15799H1112a2570A043c8952C0149i0184M4616j32562F0068P9435f7387A2902J4861
15787B7763M4733J24527a48759o2382a6588j6606A09448j717a38492C00799b76680
$$ y = [-284879, -66587, 86108, -204332, 255953, 78931, -217280, -84531, -10020, -164514, -207687, -217005, 18126, 112590, -45066, 276140, -166803, -233987, 23026, 263728, 87446, -141366, 275849, 72041, 7936, -33283, -154051, -45184, -25278, -23701, -102402, -138311, -122223, -89906, 32398, 21685, 24006, 195173, 22038, 34707, -190572, -343394, -165660, -28368, 42699, -164439, 31312, 32197, 171420, 112607, -389017, 32788, -86695, 340639, 163820, 279047, 137194, -75822, -88285, -129850, -149061, 53088, -129762, 69139, 52735, 60234, -158965, -376676, -248392, 45618, 81112, -12570, 1043, -38952, 30149, -90184, -45568, -178130, 60068, 139503, -67387, 12902, 27763, 72496, 197023, -148759, -211141, -16588, -33194, 109448, 107731, -138492, 300799, -276680]
15775B38253i9963K115J7991C5999f39237a33706A9845c21348H723b32423B51972
15763E3853b22126f6885I8010K46067A29274J66801a60307k9939h5607q0914h977
15751a45883e796j49975F3730Q0990a87716B67257b7153o6407E5141a60866f746
15739E1408g3205k1575C73708D9004K99664C78c925j19711o6799j41673a11448
15727a2927k31307C3576a45326O6072D1891i6279M6572k19259g0118I4904c79866
15715c5040k68706a22002g102j36624a615k69766b5067G1533a29251B06779b31858
15703C52449e26828b09153a2865p2320m4475m1613p1512c6069A39865J54061b9540
15691A84524k7451i4763j24073g9288L988D27414G509O8468a51906C62560b28222
$$ y = [238253, -99963, -97848, -79857, 35999, -639237, -133706, 19845, -321348, 8723, -232423, 251972, 53853, -222126, -66885, 98010, 344077, 129274, 296075, -160307, -190246, -85607, -166521, -8977, -145883, -5796, -155771, 63730, 144720, -187716, 267257, -27153, -93560, 55141, -160866, -6746, 51408, -73205, -94780, 373708, 49004, 348668, 378, -3925, -123636, -190435, -332108, -111448, -12927, -244234, 33576, -145326, -79254, 41891, -96279, -49707, -268966, -70118, 94904, -379866, -35040, -303746, -122002, -7102, -143726, -1615, -271381, -25067, 71533, -129251, 206779, -231858, 352449, -526828, -209153, -12865, -85185, -129660, -171273, -242785, -36069, 139865, 293926, -29540, 184524, 157073, -94763, -218836, -79288, -75300, 427414, 7509, 75977, -151906, 362560, -228222]
15679a41118f3440m3245K2184A29045b14864b5880C0248b28949A10073B4323i3487
15667G0230g8731n0190H6832B7818L12615f3443j91079F7096P0679a679p6968
15656g8647A71263b01335P9786e4541A37018a04449A29542a15385g780B50808
15645A20651J23445C7871J39411N0843D8745Q4350J04994F3740Q9871a70903P7537
15634i3366A15973b45477A62887J14777i550r3431K9531A54674E5164L0146K58189
15623C43499g9215E585a34879r8895C90001a0122A36951b8205l42794C56088E3982
15611H7004I205b7270k43679A9722g2277J989j16536A26849a96284K9958J5029
15600a51297L4120A16166h0952D1291b53722L5873R6865A76411k7652a46139b0121
$$ y = [-141118, -63440, -106685, -84501, 129045, -214864, -25880, 30248, -228949, 110073, 24323, -93487, 70230, -78731, -128921, 86832, 27818, 340433, -63443, -254522, 67096, 137775, -1679, -78647, 171263, -201335, -121549, -54541, 137018, -104449, 129542, -115385, -7780, 250808, 120651, 244096, 37871, 177282, 228125, 48745, 133095, 238089, 63740, 153611, -170903, -93366, 115973, -245477, 162887, 277664, -9550, -102981, -73450, 154674, 55164, 85310, 343499, -79215, 5585, -134879, -233774, 390001, -10122, 136951, -28205, -370999, 356088, 53982, 87004, 9205, -27270, -270949, 19722, -72277, -70288, -186824, 126849, -196284, -166326, -151297, -117177, 116166, -80952, 41291, -253722, -217849, -120984, 176411, 148759, -146139, -20121]
15588a73381P1902H5646K26900A0619d5880B95110e6616B59620c9223k28847A55952
15576A7071a24529j63832A90902r2855a08582B89944f9453j00910K3533D1229
15565a34727L6349B18382a90114C5108p525c2936j28174A94980a20556M2996A53386
15553A71691i0830B01611C6125K23646P8765a33633B12099b37355e0929q3764
15543a34693A0392b95067K8902e087k18732I7946i5405j01779f0135k6646A17339
15531b17811c3254A23587J45242r0838b18768g0010a848A7130N483a23249A23911
15519B64467C2551K6829a27016C8441K9516J0877k9787J38587c38810g7677p5093
15508a52770n1911A14814a9971j49253a8772A6941a42376n4455K9915j7457A14843
$$ y = [-173381, -101479, 85646, 312546, 10619, -45880, 295110, -56616, 259620, -39223, -268070, 155952, 17071, -124529, -288361, 190902, 98047, -108582, 289944, -69453, -170363, -146830, 41229, -134727, -98378, 218382, -190114, 35108, 27583, -32936, -161110, 194980, -120556, -77560, 153386, 171691, -90830, 201611, 36125, 259771, 338536, -133633, 212099, -237355, -50929, -134693, 10392, -295067, -266165, -5087, -223819, 97946, -95405, -197184, -60135, -86781, 117339, -217811, -33254, 123587, 268829, 177991, -218768, -70010, -1848, 17130, 22613, -123249, 123911, 264467, 32551, 59380, -127016, 38441, 67957, 78834, 49047, 187634, -338810, -77677, -152770, -204681, 114814, -19971, -169224, -18772, 16941, -142376, -196831, -166916, -184373, 114843]
15496A09813h4775A78741h9999a8261n8655j91958m9574i7865E9884a80780p0956
15485b51736B28478h296A37936L6519a07619d0426I8590b48707A4564K06069J7943
15474B38576n9508P481H2733a92998B41035B3354a65271o1323F8401i1283k55986
15463c47269B28042o0765H491K18164Q8205E3336N790J79588k3247M5607A24180
15451B18401R4552C0291J01632b80422H7723h9715A31615k382i9293E2368k0861
15440C1507e8486r1739N0188I9259a40004f8877A8229g8905j2477K9039C8219
15428I0110g1730a829B23496b20140B29853a01524N483L8515l2375a9336a867
15416E2277J79462j854E4597a35133m0283A10977l2852K07702a13192c0728j09707
$$ y = [109813, -84775, 178741, -89999, -18261, -76916, -268874, -318448, -97865, 59884, -180780, -251736, 228478, -8296, 137936, 174455, -107619, -40426, 98590, -248707, 14564, 220633, 238576, 179068, 186549, 82733, -192998, 241035, 23354, -165271, -226594, 68401, -91283, -347269, 228042, 167277, 8491, 226655, 314860, 53336, 59126, 238714, 215467, 261074, 124180, 218401, 312953, 30291, 131923, -280422, 87723, -89715, 131615, 129233, -99293, 52368, 31507, -58486, -150225, -100037, 99259, -140004, -68877, 18229, -78905, -91382, -62343, 38219, 90110, -71730, -1829, 223496, -220140, 229853, -101524, -96041, -57526, -89901, -19336, -1867, 52277, 231739, 229885, 54597, -135133, -175416, 110977, 78125, 285827, -113192, -30728, -140435]
15405a40435A6867J10127o1228l1024b53046C3765P1748a51083A86725K9613A3
15393I7628a28316C55887a89350G1358a46984C32949a30666L5502B3510a71628
15382b12737l1589D42712k19348a880F8234A1331N809K52460j01043h7500J6989
15371g0511l2020B20634a85993i0091A171e760G7989Q5281b8555A87090a59527
15359B15497A3184K1010a45900a532j27798b5727R463B24389H0354J441a86035
15347a36458I7990P2447b31503B02460K3923p9646c48886B6616J87582c81831
15336a7983A50690a64034q4985a6020k7153E03746A70114i0027j33176B84294
15325b48342D46623A57994E753J16327K52880d672j7459g738j20309E6354J18324
$$ y = [-140435, 16867, 126994, 65766, 34742, -253046, 33765, 105513, -151083, 186725, 216338, 13, 97628, -128316, 355887, -189350, 71358, -146984, 332949, -130666, -95164, 23510, -171628, -212737, -244326, 442712, 223364, -1880, 68234, 11331, 17140, 269600, 168557, -87500, -70511, -102531, 220634, -185993, -90091, 1171, -5760, 77989, 163270, -28555, 187090, -159527, 215497, 13184, 34194, -145900, -1532, -129330, -25727, -16264, 224389, 80354, 81795, -186035, -136458, 97990, 170437, -231503, 202460, 226383, 146737, -348886, 26616, 214198, -381831, -17983, 150690, -164034, -249019, -16020, -43173, 503746, 170114, -90027, -223203, 284294, -248342, 446623, 157994, 5753, 122080, 374960, -4672, -22131, -7738, -128047, 56354, 174678]
15314A74678d1391C03K25588N2761K9807q7597R5272G4941k5183h2246D32862
15302B64982j23441a51538k10574b5662B43755f170D8450B1062b88721c6850I3918
15290a6520I7922a8886A78745a41907a7199B14140b85513C1308d7033l2363B788
15278b40654k23709c2509A68072q11B1480K20251d81510A25624m7480a1114j08299
15267a19413c61l5850A3739b03508b1692j56168A83106K81608E9336K71311c1322
15255c36200A38600L65833i817D81548A89666L34084A91273p6990J35985d533
15244a52122B9922K92742j13583f1880k51915d1694C9856J10235Q457N6372D7318
15232I3638a10198K0013C24023A08401R7940I0460k1641j3418P2089O5871H3987
$$ y = [174678, -41391, 303, 225891, 278652, 308459, 220862, 316134, 74941, 49758, -82246, 432862, 264982, 141541, -151538, -362112, -25662, 243755, -6170, 48450, 21062, -288721, -36850, 93918, -16520, 97922, -18886, 178745, -141907, -17199, 214140, -285513, 31308, -47033, -79396, 2788, -240654, -464363, -32509, 168072, 167261, 21480, 241731, -481510, 125624, 78144, -11114, -119413, -361, -36211, 13739, -203508, -21692, -177860, 183106, 464714, 59336, 330647, -31322, -336200, 138600, 504433, -9817, 481548, 189666, 523750, 191273, 114283, 250268, -4533, -152122, 29922, 322664, 209081, -61880, -313795, -41694, 39856, 150091, 158548, 214920, 47318, 93638, -110198, -90185, 324023, 108401, 206341, 90460, 68819, 55401, 127490, 193361, 83987]
15220C56110F0277e2608j1610n7516m5295f6330a4267B73501m9236q4810b33351
15208A69828c26886a12040A92968h0561I1049J15003C8064M9412J90741b5206
15197C33397A38292a63283a8506r9415A72632f2523j33079A59860M2409q8941
15187A13328b25186A13421Q728D4980b09339L0662A87376b6478B02630B1002O4430
15176H5432J07609B3868e321C74888C4520K01034d0050A19700n3815b93139A65969
15164A73987H2743e9936k0813q0318c6584C02180A24559M4755K0161d6469B00174
15152i5709B21337a85721C41126A24083k2358a7127A86460h508H3700q193K4374
15141I9881m2659K75059I5983a8395D68964A63134J01206M6739j47818A9565L25001
$$ y = [356110, 60277, -52608, -64218, -121734, -167029, -66330, -14267, 273501, 224265, 139455, -233351, 169828, -326886, -112040, 192968, -80561, 91049, 206052, 38064, 87476, 278217, -25206, 333397, 138292, -163283, -18506, -117921, 172632, -62523, -195602, 159860, 202269, 113328, -225186, 113421, 122149, 44980, -209339, -178677, 187376, -26478, 202630, 21002, 85432, 193041, 23868, -5321, 374888, 34520, 235554, -40050, 119700, 65885, -293139, 165969, 173987, 82743, -59936, -80749, -161067, -36584, 302180, 124559, 169314, 189475, -46469, 200174, -95709, 221337, -185721, 341126, 124083, 101725, -17127, 186460, -8508, 83700, 75507, 99881, 57222, 332281, 95983, -18395, 468964, 163134, 264340, 311079, 163261, 19565, 344566]
15130C44566g2001H5767J54315K85255A09755N036D0634K06333J41180A24565
15119C77141a71057r3767A76871i1475C9770J1492J97025J89759C5665K03077
15109B38742q5331J2674G3682M02698F4693j6844K03897e895E13527h941A62523
15097B29192e0767G859K88924p4770H2018L35744B05522a25443C96827M4227A9774
15085C475M08494I0432P8020M550a24611e2981j85632D08932A71549J60898N8440
15074C90887d2115p1105D20075o3420I2762N6055b328A66329l9809Q7630m4243
15063A69907j0726m377J16425j4752J8184I3755O523K59984n9801I6496M01517
15052D98013H6905P974J52539A21376n777Q4007K05339p8212Q4433B5353M64746
$$ y = [344566, -72001, 85767, 240082, 525337, 109755, 114791, 40634, 246967, 388147, 124565, 377141, -171057, -264824, 176871, -91475, 39770, 51262, 248287, 438046, 35665, 238742, 153411, 166085, 73682, 476380, 64693, 47849, 251746, -5895, 513527, -8941, 162523, 229192, -50767, 7859, 296783, 222013, 82018, 417762, 205522, -125443, 396827, 441054, 19774, 3475, 411969, 90432, 168452, 173002, -124611, -52981, -238613, 408932, 171549, 332447, 390887, -42115, -113220, 420075, 356655, 92762, 148817, -2328, 166329, 126520, 214150, 169907, 159181, 154804, 271229, 256477, 274661, 93755, 100278, 360262, 300461, 96496, 498013, 86905, 94879, 247418, 121376, 115599, 199606, 404945, 326733, 411166, 25353, 490099]
15041D90099q6600A00732e6782E45554j98870A35203h7314A87840l1846Q3413
15031B39407A2782e8590C29708J10024a63542C34108c8467I9892d8949B62925
15020B32513R3973a1812B61612g5089D46452K8809H4950M25464M7231j89641k886
15009C65118j60650r4852J56967F8860O2541L17748j81306J65073H7897J13680
14999B01577l3572J33220J73533j92492m0090K84886A95188E3003L4410a02338
14988D6178M34206k1030A86988J82334L7392j95237P7896A32030K07360d2629
14977C48854K13995o9408h892H1809B8442K79670l2148A25241m6184J75666C1799
14965C44170m7496J75752j27437J87568A66765L4767K03189q3403A60504B2274
$$ y = [490099, 403499, 100732, -56782, 545554, 346684, 135203, -87314, 187840, 155994, 239407, 12782, -58590, 329708, 439732, -163542, 334108, -38467, 99892, -48949, 262925, 232513, 326486, -11812, 261612, -75089, 446452, 475261, 84950, 510414, 557645, 368004, 365118, 204468, 109616, 266583, 68860, 131401, 449149, 267843, 432916, 87897, 201577, 168005, 301225, 474758, 282266, 242176, 527062, 195188, 53003, 87413, -102338, 46178, 480384, 459354, 186988, 369322, 406714, 211477, 289373, 132030, 339390, -42629, 348854, 562849, 493441, -8892, 81809, 28442, 308112, 275964, 125241, 79057, 254723, 31799, 344170, 296674, 472426, 344989, 532557, 166765, 201532, 404721, 321318, 160504, 22274]
14954D97568A13432J43349a5505C55101q3287P4324A65009J48355L5166j28961
14944B19569k6831J06045k8927K43307F9494K8557J20592q3400J91158n6745n1297
14933B18359E3094N6056J33365n0843L26639A97229O5809Q2834K57946j14512
14923D89306A24764N91855l57345D2892J13953L0508Q9685p487K03801B10932
14912H19630k97856j28415I2327L03605A2910K89298b1512D19484q9009h4194
14901A74409J6938L17004J2720B60362J78099j91103Q6422J73087m4004f0773
14890A80758L01237j14289A57555L88373B15375J49829R4076K01505L31152l82623
14880F09314o4701A80101J23837L49442k20283J57339k58974k2138K56718k25261
$$ y = [497568, 113432, 256781, -15505, 355101, 271814, 346138, 165009, 313364, 348530, 219569, 192738, 298783, 269856, 513163, 69494, 98051, 218643, 135243, 326401, 269656, 218359, 53094, 109150, 242515, 191672, 518311, 197229, 263038, 345872, 603818, 489306, 124764, 716619, 359274, 42892, 156845, 187353, 277038, 269551, 473352, 210932, 819630, 521774, 393359, 92327, 395932, 12910, 302208, -21512, 419484, 330475, -84194, 174409, 191347, 508351, 521071, 260362, 438461, 247358, 333780, 506867, 462863, -60773, 180758, 481995, 367706, 157555, 545928, 215375, 365204, 459280, 660785, 991937, 609314, 544613, 180101, 303938, 653380, 433097, 590436, 331462, 309324, 566042, 340781]
14870C40781K88418J9354D1841N03937B44765L25092k13156A54770N38213B45570
14859E75740k5394J45792A80716L17333k2153L21455l46346k07335J76783j11804
14849C08649Q5061J38146k31097l0057K33391L2658q8962L9385P5228H3253N51429
14838F34682j65125J42013L02881D32791J09915K69667B65342K39709k19466o4042
14828B21543M11255k56196O5254A46025K22649R20R793K9724n7787L87820k99885
14817D39259L87407B20416M16151n8521A45428N20643j22802j04883K91970l48838
14807C81518J38499K3881k41702K15465j25606Q7291j36512J15116J62873A69862
14796C86504K63166j2538J49873l41839J24322R7622j82276K06154k14889k9862
$$ y = [340781, 629199, 648553, 41841, 545778, 244765, 569857, 356701, 154770, 692983, 245570, 575740, 550346, 696138, 180716, 498049, 475896, 797351, 451005, 243670, 420453, 308649, 393710, 531856, 300759, 270702, 504093, 536751, 447789, 487174, 562402, 83253, 634682, 469557, 611570, 914451, 432791, 542706, 812373, 265342, 505051, 285585, 221543, 632798, 376602, 441856, 146025, 368674, 369594, 379387, 409111, 351324, 739144, 439259, 826666, 220416, 636567, 578046, 145428, 666071, 543269, 438386, 730356, 381518, 520017, 543898, 302196, 517661, 392055, 479346, 342834, 457950, 620823, 169862, 386504, 649670, 637132, 787005, 445166, 569488, 667110, 484834, 690988, 476099, 446237]
14786D46237J72592K09473B73889L3541J03557K96502j05118j16954L819j23433
14776C65803q7481K92427M56149m37480L42235m37225J04169O04193m79592j47037
14766E76161B16515N0419K79383L49266k66926j64170K19410K01591j58869q6075
14756F40544J88636K58306p5118j92857K3063J86965j48010l4413k52543j32891
14746D61682N7204N93207m05415J31471J32137j37842K06765q7305k25633J64937
14736H91208j50920Q8145L4429O5705j5057k34592L10472l59348K35691r3425
14726G72308k70308K29824L06751r6121j23907l3504O3692L01410l60621j93632
14716E95892L97941l49732L57110J23845j86694k53566O6393J59617M0743l73842
$$ y = [446237, 618829, 828302, 273889, 307430, 410987, 707489, 602371, 485417, 489236, 365803, 278322, 570749, 1026898, 589418, 931653, 494428, 598597, 1202790, 723198, 576161, 216515, 266934, 546317, 895583, 628657, 464487, 683897, 885488, 726619, 640544, 829180, 1087486, 1012368, 819511, 842574, 1029539, 881529, 847116, 594573, 461682, 518886, 1112093, 706678, 838149, 970286, 832444, 1039209, 951904, 726271, 891208, 740288, 828433, 862862, 928567, 913510, 678918, 989390, 630042, 865733, 772308, 502000, 731824, 1038575, 942454, 818547, 785043, 848735, 1150145, 789524, 595892, 993833, 644101, 1001211, 1125056, 938362, 684796, 751189, 910806, 951549, 577707]
14706E77707M28902p4638J78900n38564J11711K24328L1526J97758L1754k50119
14696I19265j43901L10231j81669J62014o3924j14384M9610O3953k58702K36960
14686I79453J55374m95459M00270L20559j36701O3755j12683k13528K62951l19303
14676I04688N79947m28529O1372M6120r3407p0020n1477J35116k76420J17422
14666I24812N55069k45966k0435j75508K98943l65467k19218L11954Q666j32624
14656I40226J12007K04285j59681O0235J79539M890k24035K48297K70005l99477
14646A236291j24555J8648L81720N4288k33480j79717J86266K1088K5131L39693
14636A725373l80821J3382j45934p8694O2582J90374J39282k42588J43884p7080
$$ y = [577707, 1006609, 931971, 1110871, 572307, 684018, 908346, 939872, 1137630, 1169384, 919265, 775364, 1085595, 903926, 1065940, 1002016, 887632, 937242, 1001195, 742493, 979453, 1134827, 639368, 1039638, 1360197, 1223496, 1287251, 1174568, 961040, 1223991, 904688, 1484635, 1056106, 1117478, 1163598, 1070191, 1000171, 948694, 1083810, 807390, 924812, 1479881, 1233915, 1213480, 1037972, 1336915, 971448, 752230, 1064184, 1072850, 940226, 1052233, 1256518, 1096837, 1157072, 1336611, 1341501, 1117466, 1365763, 1635768, 1236291, 1111736, 1130384, 1512104, 1566392, 1332912, 1153195, 1339461, 1360549, 1385680, 1725373, 1344552, 1357934, 1212000, 1133306, 1195888, 1386262, 1525544, 1282956, 1426840, 1349760]
14626A349760L67111j15177k1899K70604l84101j64087L35109k10158O2179j4904
14616A474437j27458J27925J35804J04532j95923k16584L27256M47366n91563
14607A485792J43316L24862n0726l57598J14075k8474M26070m62332j1797j50981
14597A432207M40627j96170N30859k94880q3728l469R4092J68162q3678m1353
14587A962669j050L21303k26933j14250r4636K29669n6859m07446L67852K68710
14577B249029L7722m31105K47793K38385r8211L1033m7824Q2907J21526R2379
14567B523634K9196j44412K1694K53848K4355m6572J69582K15171j86701M40849
14557C300644N0173J52951J40109K14119K04527N83076R14705N44874K210608
$$ y = [1349760, 1716871, 1601694, 1579795, 1850399, 1466298, 1302211, 1637320, 1427162, 1489341, 1474437, 1346979, 1474904, 1610708, 1715240, 1519317, 1302733, 1629989, 2077355, 1485792, 1629108, 1953970, 1903244, 1545646, 1659721, 1631247, 2057317, 1594985, 1583188, 1432207, 1872834, 1676664, 2207523, 1912643, 1828915, 1825446, 1919538, 2087700, 2004022, 1962669, 1961619, 2282922, 2055989, 1941739, 1847103, 2076772, 2019913, 1612467, 1980319, 2249029, 2286751, 1855646, 2103439, 2341824, 2243613, 2274646, 2226822, 2309729, 2431255, 2523634, 2552830, 2408418, 2430112, 2683960, 2708315, 2661743, 2831325, 3046496, 2859795, 3300644, 3350817, 3503768, 3643877, 3857996, 4062523, 4645599, 5560304, 6105178, 8315786]
14548H315786L710714Q473855J4326801L188258j5600858j1189807m867471k433069
14540C924209j052318l24235m26243N30661k68142l57634L75023q7290Q6049j6250
14530B383830K81858o27302N54292j43416l3792M07122n87342O98558k31245r4528
14520B608035K01172k78402p3286J7717L31809j9079N9489J54449P4570N8124
14510C134598Q2262M5136k65056L62011n55169L93526P0763J87372j31662K8643
14500C352424O3653L3168P65K49006j86348l41024N93057k99656L44422m3407
14490C766060k34770K36191K40031l48990M46258k34874O3047J00369L4714L70978
14480D439014n23983J57072n0540L23719K22731n77857O53785k30935L6801K89191
$$ y = [8315786, 12026500, 20500355, 34827156, 38015414, 22414556, 11224749, 6357278, 3924209, 2871891, 2547656, 2121413, 2652074, 2383932, 2026298, 2401321, 2314031, 2400080, 2383830, 2665688, 2038386, 2592678, 2449262, 2415470, 2822592, 2235250, 2933808, 2702563, 2608035, 2809207, 2530805, 2457519, 2475236, 2807045, 2787966, 2847455, 3001904, 3076474, 3134598, 3216860, 3261996, 2996940, 3358951, 2803782, 3197308, 3268071, 3455443, 3323781, 3352424, 3416077, 3449245, 3450010, 3699016, 3512668, 3171644, 3764701, 3465045, 3809467, 3766060, 3531290, 3767481, 4007512, 3658522, 4104780, 3869906, 3932953, 4033322, 4068036, 4439014, 3915031, 4072103, 4021563, 4345282, 4568013, 3990156, 4643941, 4413006, 4449807, 4738998]
14470D738998q8311p739j14028N69513n33337N17802k91194j07889N89764n7389
14460E216190J31740j96399M91558k92886L8375j32090J19246L00324j93170o6487
14450E416401M02083J83360K1313K11276r3289O660J4985J8358R7404M55771k85460
14439F448862J22938m8000K64068L51M4556j6698J70134J76832R2857j96408J18726
14428G178218N8869O62512J06110J07380j44748K52279l2847J26555p2886J81799
14418H423241J99151K02674K16750O9493L41524k28591O1453N0827L11137K51431
14408I899090J54158j48545P26772j5837k9567K82424n29762Q60867M0068L54906
14398A1594574O3178L32061J44595P4323J36055J06357K48683L62916L22480j46773
$$ y = [4738998, 4650687, 4642948, 4528920, 5098433, 4565096, 5082898, 4791704, 4683815, 5273579, 5216190, 5347930, 5151531, 5643089, 5350203, 5388578, 5256488, 5375734, 5676058, 5482888, 5416401, 5818484, 6001844, 6023157, 6234433, 6141144, 6147804, 6162789, 6181147, 6278551, 6734322, 6448862, 6571800, 6523800, 6787868, 6788219, 6832775, 6816077, 6986211, 7163043, 7255900, 7059492, 7178218, 7237087, 7899599, 8005709, 8113089, 7968341, 8220620, 8187773, 8314328, 8241442, 8423241, 8622392, 8825066, 9041816, 9111309, 9452833, 9224242, 9285695, 9336522, 9647659, 9899090, 10053248, 9904703, 10631475, 10615638, 10586071, 10868495, 10338733, 11199600, 11239668, 11594574, 11657752, 11989813, 12134408, 12208731, 12344786, 12451143, 12699826, 13062742, 13385222, 13238449]
14388A3238449L35944J8091K96753M55708K54451K51670K63181k51939Q27568
14379A5689876J698J52175R41936j61569L58495L38391N19952K63035M42858M00460
14369A8947307N6102O53989K57852L85676M05247M97095N78673J458J069343L46912
14359B3199654M31195O85793K52567N70960L70435P48885N96734O91177N51114
14350B8098514P04750N87815J114630M34303Q64396Q62638R13424R32230M72826
14341C4985526J416044Q33425J143266P86528J067243J136202J336395R87892
14333D3692521J159799J385679J686406J393130J890647J303274J581737J421807
14325E5515000K102244J928392K121935K034399J905999K589257K610950K678601
$$ y = [13238449, 13574393, 13592484, 13889237, 14344945, 14599396, 14851066, 15114247, 14862308, 15689876, 15691574, 15843749, 16785685, 16624116, 16982611, 17321002, 17840954, 18103989, 18546847, 18947307, 19003409, 19657398, 19915250, 20300926, 20706173, 21203268, 21781941, 21783399, 22852742, 23199654, 23630849, 24316642, 24569209, 25140169, 25510604, 26259489, 26856223, 27547400, 28098514, 28803264, 29391079, 30505709, 30940012, 31804408, 32667046, 33580470, 34512700, 34985526, 36401570, 37234995, 38378261, 39164789, 40232032, 41368234, 42704629, 43692521, 44852320, 46237999, 47924405, 49317535, 51208182, 52511456, 54093193, 55515000, 57617244, 59545636, 61667571, 63701970, 65607969, 68197226, 70808176, 73486777]
14317G3486777K337324K887725L111490L084712L002055L490030L973060M145003
14309I9518176L814368M238769M746219M469343N312469N400227N859120N740594
14301A39099285O447355O686498P098235P746236P923922Q259383Q658011R811310
14293B01730235R872654J0473878J0874077J1305277J1962189J2596143J2711104
14286B81525557J3292805J3807540J3840206J4328776J3853232J4057746J3675840
14279C78381702J3509302J2464661J1856510J0590002R383046P445695M955994
14272D48586912J568389j74682j302988k341273l132225l245200m235864o509439
14264D29213630r500218j0954187j2531337j3652739j4123340j4660384j4563622
$$ y = [73486777, 75824101, 78711826, 81823316, 84908028, 87910083, 91400113, 95373173, 99518176, 103332544, 107571313, 112317532, 116786875, 122099344, 127499571, 133358691, 139099285, 145546640, 152233138, 159331373, 167077609, 175001531, 183260914, 191918925, 201730235, 211602889, 222076767, 232950844, 244256121, 256218310, 268814453, 281525557, 294818362, 308625902, 322466108, 336794884, 350648116, 364705862, 378381702, 391891004, 404355665, 416212175, 426802177, 436185223, 443630918, 448586912, 450155301, 449980619, 448677631, 446336358, 443204133, 439958933, 435723069, 429213630, 419713412, 408759225, 396227888, 382575149, 368451809, 353791425, 339227803]
14257C39227803j4713165j4724564j3987254j3904913j3034362j2811522j2094047
14250B43957976j1892509j1244357j0315526r887958r585448r168120q449476
14243A73414582p722021p639270p032217p001396o171814n823311n639767n389179
14235A20995607m946463m864935m983614m185099l501495l844991l458476l952022
14227H7258512l418934l091431k941930k530874k713857k427369k568008k037066
14219F5529043k487152j834029k348378j874429j717862j732076j163119j491240
14211E0880758k068336j414674j674563q75689j240914p56754j628554j218325
14203D0002949j441411p76539o29980r54044r53156j150644q05860j001502r18118
$$ y = [339227803, 324514638, 309790074, 295802820, 281897907, 268863545, 256052023, 243957976, 232065467, 220821110, 210505584, 200617626, 191032178, 181864058, 173414582, 165692561, 158053291, 151021074, 144019678, 137847864, 132024553, 126384786, 120995607, 116049144, 111184209, 106200595, 102015496, 98514001, 94669010, 91210534, 87258512, 83839578, 80748147, 77806217, 75275343, 72561486, 70134117, 67566109, 65529043, 63041891, 61207862, 58859484, 56985055, 55267193, 53535117, 52371998, 50880758, 48812422, 47397748, 45723185, 44847496, 43606582, 42849828, 41221274, 40002949, 38561538, 37784999, 37155019, 36200975, 35247819, 34097175, 33291315, 32289813, 31371695]
14194C1371695m63926o74991r68134n84569j184340j54240p60316n45400l41936
14185B5693843r71664n22916r35700L5718q33696n35433k11000n61805p4816j190125
14175A9892406M30904r23690l22279k27606o02908k20186k20932o44032N964m66473
14165A6701168k95923m55185r6603k50689l80355j97527k29295k27238n98666
14156A3969687K342n60710N9082k63828k7575n41209L2620o83042p3639J50918
14146A2064646m9480n49667J33324l39347k63833k63265l23573R6134k55988j9184
14136A0229767J29181o03876K04463k42239J43862n03330O0792l51549j40688
14127H926383L218j36651k42742j74944l3542j38270J49450j36548j75112n70347
$$ y = [31371695, 30907769, 30232778, 29264644, 28680075, 27495735, 27341495, 26581179, 26035779, 25693843, 24722179, 24199263, 23263563, 23299281, 22465585, 21930152, 21719152, 21157347, 21082531, 19892406, 20323310, 19399620, 19077341, 18849735, 18246827, 18026641, 17805709, 17161677, 17167641, 16701168, 16405245, 15950060, 15853457, 15602768, 15222413, 15024886, 14795591, 14568353, 13969687, 13972029, 13411319, 13470401, 13206573, 13178998, 12637789, 12670409, 11987367, 11913728, 12064646, 12015166, 11465499, 11598823, 11259476, 10995643, 10732378, 10408805, 10504939, 10248951, 10229767, 10358948, 9755072, 9959535, 9717296, 9861158, 9357828, 9418620, 9067071, 8926383, 8929601, 8792950, 8550208, 8375264, 8341722, 8203452, 8352902, 8216354, 8041242, 7470895]
14117G470895L88884m3743l94636K71408k79607p2420k49385m6847j33098l7559
14107F873892P3586l2615j82799l90858J83410j11458j94976j3749q9792K66338
14097F380979k83724J08346l20356l09984K99854J345k33145j1047j03762j61636
14087E366870L75092l74956N4604k18152J63952j60161m49326J55570k29650o1705
14077D622138J66115p8715J79929l1317k79305o8680j36860J66026j70432M87355
14067D856254l72237j88309L2601O965k91516L02277k24299k53601N22810l06187
14057D084758K4050j36717r4382j51333L18659k63445J85576m57636L81280m77632
14047C413178L68601l57087K19042k70192Q1385j96974K37358j91422m3993L23584
$$ y = [7470895, 7859779, 7816036, 7421400, 7692808, 7413201, 7340781, 7091396, 7044549, 6911451, 6873892, 6947478, 6914863, 6732064, 6341206, 6524616, 6413158, 6218182, 6204433, 6114641, 6380979, 6097255, 6205601, 5885245, 5575261, 5875115, 5876460, 5643315, 5632268, 5528506, 5366870, 5741962, 5367006, 5421610, 5203458, 5367410, 5207249, 4757923, 4913493, 4683843, 4622138, 4788253, 4709538, 4889467, 4858150, 4578845, 4510165, 4373305, 4539331, 4368899, 4856254, 4484017, 4295708, 4328309, 4335274, 4043758, 4346035, 4121736, 3868135, 4390945, 4084758, 4108808, 3972091, 3877709, 3726376, 4045035, 3781590, 3967166, 3509530, 3890810, 3413178, 3781779, 3424692, 3643734, 3373542, 3454927, 3257953, 3495311, 3303889, 3259896, 3583480]
14037C583480k82314m3981J14335j60862J36034k83861j7263Q9526K80736o73281
14027B742549k93324R98575m08463j97218L12696n76520J81244O3598l26315K60671
14017B757493j10904J58861o25295P38444l37649k22783J12995K07018j35680
14008B542500k38008L33989p19570P88443n26391K66466k31879J76681k78969
13999B113262L03622m21695M29749l15959j75016m7216P37287j99157L3126O83022
13989C141025R40024K739463O842750J5249090J0272315j1553520j1454751o197455
13981I978941l152637j308721j215617l02185o54408j7467j21731k08455j20534
13972B877186k67539J12490j66783j98665J79460O852k95164k10816M38195r4345
$$ y = [3583480, 3301166, 3257185, 3371520, 3210658, 3346692, 3062831, 3045568, 3135094, 3415830, 2742549, 2449225, 3447800, 3039337, 2842119, 3154815, 2578295, 2759539, 2823137, 2496822, 2757493, 2646589, 2805450, 2180155, 2918599, 2580950, 2358167, 2471162, 2678180, 2542500, 2304492, 2638481, 1918911, 2707354, 2180963, 2447429, 2215550, 2392231, 2113262, 2416884, 1995189, 2424938, 2108979, 1933963, 1886747, 2624034, 2424877, 2458003, 3141025, 4081049, 6820512, 13663262, 28912352, 39184667, 27631147, 16176396, 9978941, 6826304, 5517583, 4301966, 3999781, 3345373, 3327906, 3206175, 2997720, 2877186, 2609647, 2722137, 2555354, 2356689, 2536149, 2543001, 2247837, 2037021, 2475216, 2380871]
13962B380871k72452o587k72596L41811J8945q1766R9290k68387m9265L62471
13952B252335l79324K41524l49626J69552q5967j87210M03689j12019p3348j86691
13942A692915M2196j10323K68030O6318j35012j76500K55195l05888J00612J12851
13932A810394j14791l60981O78468n64780P34748o32423K29220j01858q5757j88893
13922A403347K94188L5500r3756j44155K63738k50968j23066J51849J48865l00080
13912A385462P9843K98207Q4054m28508J46754K24384k61405j58j83768K21545
13902A566410l99624k25757L58362J80145j15664o521K12867m60907L02884j19662
13892A292533j85833L68839q2573K9191n13308r3840K61930K9865N1239J22624
$$ y = [2380871, 2108419, 2101832, 1829236, 2171047, 2189992, 2108226, 2207516, 1939129, 1889864, 2252335, 1873011, 2114535, 1764909, 1934461, 1848494, 1661284, 2064973, 1952954, 1879606, 1692915, 1735111, 1624788, 1892818, 1959136, 1824124, 1647624, 1902819, 1596931, 1697543, 1810394, 1695603, 1334622, 2013090, 1448310, 2183058, 1550635, 1779855, 1677997, 1592240, 1403347, 1697535, 1733035, 1639279, 1495124, 1758862, 1507894, 1384828, 1536677, 1685542, 1385462, 1465305, 1763512, 1847566, 1419058, 1565812, 1790196, 1528791, 1528633, 1344865, 1566410, 1166786, 941029, 1299391, 1479536, 1363872, 1357351, 1570218, 1109311, 1412195, 1292533, 1106700, 1475539, 1392966, 1422157, 908849, 815009, 1076939, 1106804, 1158043, 1280667]
13882A280667J35360j77449Q8546j18594K99679j64334J03859k55332K7367j3599
13872A206170l3546p3031q1511J37763j97874K25477r0917J55942l14518M33915
13862A367870j46999k21105K14873r1020J64002k91218j28825n1943L18840K13589
13852A348064k81752k69957o0082Q7543p4703p8823K54076j25949L33275o4037
13842A067655j6937o2383l45421M06345O8088j24851Q0035J93461m41333M21615
13832A246274k70793k14384M20604l0123n38312K87283l943O5936p208l21268
13822F34066K59245O4455k88816P8242M26961l45074r9586o7799J02417r3703
13812F70408K54151K31696k17227J79480l50720L8193L61613k69219j46769J10669
$$ y = [1280667, 1416027, 1238578, 1327124, 1208530, 1508209, 1343875, 1447734, 1192402, 1219769, 1206170, 1172624, 1099593, 1018082, 1155845, 957971, 1183448, 1092531, 1248473, 933955, 1367870, 1220871, 999766, 1214639, 1123619, 1287621, 996403, 867578, 815635, 1134475, 1348064, 1066312, 796355, 736273, 823816, 749113, 670290, 924366, 798417, 1131692, 1067655, 1050718, 988335, 642914, 1049259, 1117347, 992496, 1072531, 1265992, 824659, 1246274, 975481, 761097, 1181701, 1151578, 613266, 900549, 896606, 962542, 955334, 634066, 893311, 957766, 668950, 747192, 1174153, 829079, 729493, 661694, 764111, 670408, 924559, 1156255, 939028, 1118508, 767788, 805981, 1167594, 898375, 751606, 862275]
13802H62275j65136J71883j04674k2448j82970K05597n1935K8925J23052O2328
13792I26897k15017J68403l06169j50611K35372R2845j36589n783L16328m10051
13782E15625K42045Q6468l60287j83330J58663J54000m1600K93844l32851L68343
13772I00920C83541K61370J80615C86768L12033O2858l58849K79126J19824L9708
13762H41468C39378N52461l31359J74970L57547l79132K32902k76343Q1852L501
13752G55777j71432q8118k00393J37766k3030K05926B92779M74240C20880N6215
13742C77095L54157J4934m6565k05286l4915J54304L04293k21906o5778j00558
13732E29775Q1780k11486L49390l68344J56637L79321j5070D19213K0153J56029
$$ y = [862275, 697139, 869022, 764348, 741900, 558930, 764527, 712592, 741517, 864569, 926897, 711880, 880283, 574114, 423503, 658875, 751720, 615131, 609348, 925676, 515625, 757670, 844138, 483851, 300521, 459184, 613184, 571584, 865428, 532577, 900920, 383541, 644911, 825526, 386768, 698801, 761659, 402810, 681936, 801760, 841468, 339378, 891839, 560480, 735450, 1092997, 713865, 946767, 670424, 752276, 755777, 584345, 496227, 295834, 433600, 410570, 616496, 292779, 767019, 320880, 377095, 731252, 746186, 699621, 494335, 459420, 613724, 918017, 696111, 630333, 529775, 611555, 400069, 749459, 381115, 537752, 917073, 902003, 419213, 439366, 595395]
13722E95395L7426j1159k84387N59733n5413j17104l45563L1609J61128k10426
13712C61239J53117K42075A79277N50816J08243j70100j85121K15348B59579J79455
13702D39034O1757J63376k6208J74383j98221k3612L33800B09865L88276j46472
13692D51669j02821N87619m24190J6715K05071o2640p8111B90700K28606L31538
13682H50844k72431j25114k08429L29624B59266K32210j81037L200J95877p1722
13672D37794r4703p1012K48785j46584J44716m4817k1396m898j04432L34258k44607
13661D33104l5504J53484k8394J949R0184k50056j5173K01417B18831m5007M19957
13650E93781q2079l0546F8556M10174j70058H3065O02288C33622A02254M66128
$$ y = [595395, 632821, 621662, 337275, 897008, 841595, 724491, 378928, 410537, 571665, 361239, 514356, 756431, 179277, 730093, 838336, 668236, 483115, 698463, 259579, 439034, 500791, 664167, 637959, 812342, 614121, 590509, 924309, 209865, 598141, 451669, 348848, 936467, 512277, 528992, 734063, 671423, 593312, 290700, 519306, 850844, 578413, 453299, 244870, 574494, 259266, 491476, 310439, 313639, 509516, 437794, 343091, 272079, 520864, 374280, 518996, 474179, 452783, 447885, 343453, 677711, 433104, 397600, 551084, 522690, 524639, 614823, 364767, 349594, 551011, 218831, 173824, 593781, 511702, 481156, 68556, 478730, 308672, 83065, 685353, 333622, 102254, 568382]
13640E68382r9570n9765L59830l70182k3736A85627l3146M67979k49411K75046
13630F46095B27365j7075J2651P4186r915K49932j85615K811j03405M21306R0972
13619G63213B78519J03974h0628A30770J542L85793A42768J22766O0330j2574
13609C13290K20965B36330L0619A07288L55584o6722J08920j10935o077j80200
13599B07858J38981m306J61557j94834j12064j0117J28316K7455K83650j00045
13589E26451m0857k26302J25125l5876l1652N8953A46775J78509n3616O9892L346
13578C44906K00496o5177j15842o7504n3178N6466j1151j0059h072A54841m5120
13567A09721K34212L55199l45867j25593C9330M17693k09694M73052G4308L53977
$$ y = [568382, 468812, 409047, 768877, 398695, 374959, 185627, 152481, 620460, 371049, 646095, 227365, 210290, 222941, 297127, 287212, 537144, 351529, 354340, 250935, 672241, 763213, 278519, 382493, -80628, 130770, 132312, 518105, 142768, 265534, 325864, 313290, 534255, 236330, 266949, 107288, 462872, 396150, 505070, 394135, 388058, 207858, 346839, 342533, 504090, 309256, 197192, 187075, 315391, 342846, 626496, 526451, 485594, 259292, 384417, 348541, 316889, 375842, 146775, 325284, 271668, 341560, 344906, 545402, 480225, 364383, 296879, 243701, 300167, 289016, 278957, -8072, 154841, 109721, 343933, 699132, 353265, 227672, 39330, 457023, 247329, 720381, 74308, 428285]
13557D28285B13311K94900B43168L34996n3116k11463p1862J32012I3602K85588
13547C79190A42797K54570o693E6224K04671N8353A17467l2474K30629q668i4193
13535a5345B84260a3960E57459H5280k9267L63867B02867o511J96829j23880A03996
13523F90410A37518P0430J054M1905J6886J30707a18455A32134M4492A7744K73652
13512B91396J85127a016C41138A56408N1401n837L7312R1692O6320E1895a57180
13500A34093K03918K91366j63359M4893A39784n3643l7418K64240G4610J3109
13490H7719J24414H7172M4165K22309c516C11353A07781J88819L5702o4148j20636
13479A47518L33517B07220J56450j02842D168L92691l2703j05089J94312A86152
$$ y = [428285, 213311, 508211, 243168, 578164, 525048, 313585, 241723, 373735, 93602, 379190, 142797, 397367, 390674, 56224, 260895, 319248, 117467, 84993, 315622, 306954, -94193, -15345, 284260, -13960, 557459, 85280, 56013, 419880, 202867, 196356, 393185, 269305, 103996, 690410, 137518, 207948, 209002, 250907, 267793, 398500, -118455, 132134, 176626, 17744, 291396, 476523, -1016, 341138, 156408, 207809, 201972, 239284, 330976, 397296, 51895, -157180, 134093, 338011, 629377, 466018, 510911, 139784, 86141, 48723, 312963, 74610, 87719, 212133, 87172, 131337, 353646, -3516, 311353, 107781, 296600, 332302, 268154, 147518, 481035, 207220, 363670, 260828, 4168, 396859, 364156, 259067, 453379, 186152]
13468A44907K44194H0687N38778E5830M2751D8008L23871j1493g6240q06C45579
13456A81479J952l803E7487K50375q4068p8688a13188C85578A61191K8845o714
13445A83322a02582A47223A0062K72673A03181J92422a07219b0718o9844B03232
13434E7000P8368J22199k0966K9037a57950A95633d1691C05208R3070A12163K00478
13423C12641a88141C1143J07652K02147N8169j70394j07347K37926j71981K26252
13413D13567G6022a04321A51469M7511b2898D4218Q0943j9346P903J98170j40192
13402A71696d1227i548B79377J32990A9067J28300J1360L682J78001A14491f3075
13390C79069f957F9344K67560E2828J9027J02312J7241M2445k4115B5014K63740
$$ y = [144907, 389101, 80687, 619465, 55830, 98581, 48008, 371879, 360386, -76240, -77046, 345579, 181479, 183431, 179628, 57487, 307862, 223794, 145106, -113188, 385578, 161191, 190036, 183322, -102582, 147223, 10062, 282735, 103181, 295603, -107219, -20718, -90562, 203232, 57000, 135368, 257567, 236601, 265638, -157950, 195633, -41691, 305208, 398278, 112163, 312641, -188141, 31143, 138795, 340942, 399111, 228717, 121370, 359296, 187315, 413567, 76022, -104321, 151469, 198980, -22898, 44218, 125161, 105815, 113718, 311888, 171696, -41227, -9548, 279377, 412367, 19067, 147367, 158727, 162409, 340410, 114491, -63075, 379069, -6957, 69344, 336904, 52828, 71855, 174167, 191408, 233853, 209738, 25014, 288754]
13379B88754J7070j29680J67656r0645K75117G907K29954l6215a6605C53692J92020
13368E45712n8885j30097I0527c8222l3299D32082j55124A01750J83566O5238
13358C50554n0038J3636r2362n6270K30894K01664E8240L181J8390K10017a16779
13346B66348K5926M7020K19024k73464J20839j10099A22484K96708H2568a57997
13335E00021B44136F704J67968a15460C58232D8341L41856A35083j0162a98286
13324E61535B271Q4637C0729a3958C41766p1709r8234c8016A82089J29778M9067
13313C60934d6160E56958q0347A03183J73366j30725N7996R8843a6880A84721
13302B69629F0921P1465J87977J84880A43712M9093J9465o0700R8247j20810P0544
$$ y = [288754, 305824, 176144, 343800, 253155, 528272, 7907, 237861, 201646, -16605, 353692, 545712, 486827, 356730, 90527, -38222, -71521, 432082, 276958, 101750, 285316, 350554, 300516, 314152, 221790, 165520, 396414, 598078, 58240, 61421, 79811, 289828, -116779, 266348, 292274, 339294, 558318, 284854, 405693, 295594, 122484, 419192, 82568, -157997, 500021, 244136, 6704, 174672, -115460, 358232, 48341, 390197, 135083, 124921, -198286, 561535, 2271, 86908, 30729, -13958, 341766, 270057, 171823, -38016, 182089, 311867, 360934, -46160, 556958, 476611, 103183, 276549, 145824, 203820, 302663, -16880, 184721, 269629, 60921, 132386, 320363, 505243, 143712, 192805, 212270, 151570, 249817, 129007, 199551]
13291A99551c2539k31301D25083k03055o2940K28943j59578J06150o9909I8419
13280I0813a9134A85068a43665B3995A1743J91500B5314P4366e1423C33624q2479
13269B51145B0480L02853b04723A24878a83982A31681J49733j30750J35850J78180
13259D64694B6293K48229l2982j7055F4628i2338B06244D1725d25414D3210A1452
13247E4195a5001A4289K94610B0035M5605J73422a0442A84827E5609e42j03536
13236a04078b4419G5324i2011E24238a59386A74780E8808L16756A06836J3057
13226A19893a989A90421M9288l900P1615I3579b93881d0313A61493H0298J25948
13215B06246a54641d8200j26362E34912G0328K02862a03256D2886C896h8590C52154
$$ y = [199551, -32539, -263840, 425083, 222028, 159088, 388031, 228453, 334603, 264694, 98419, 90813, -19134, 185068, -143665, 23995, 11743, 203243, 25314, 99680, -51423, 333624, 251145, 20480, 323333, -204723, 124878, -183982, 131681, 281414, 150664, 286514, 464694, 26293, 274522, 241540, 224485, 64628, -92338, 206244, 41725, -425414, 43210, 11452, 54195, -15001, 14289, 308899, 20035, 65640, 239062, -10442, 184827, 55609, -542, -104078, -24419, 75324, -92011, 524238, -159386, 174780, 58808, 375564, 106836, 119893, -1989, 190421, 239709, 235809, 307424, 93579, -293881, -40313, 161493, 80298, 206246, -154641, -48200, -174562, 534912, 70328, 273190, -103256, 42886, 3896, -88590, 352154]
13203a30113B35419h1886g568A76724d7454o8350k3309A13696g154D63535A4876
13191b92217a28469C26950A07451d3093C1572K71168b19176Q8317E9215L67990
13181D27205a8889j57297k5773A78080B6068a23829B80498p8967p8658p850b17206
13169C75022c38942A48715a45962B56573A25845b11757e484k0334G2805J59606
13159B32411Q1993e1678q5893B29591m236K19424j16024f7769a9139m0950o8490
13148a28579p199D58063G5331b8500a0583A91811b06449h9945c6008p7975K6871
13137h7112d2068A80048J9090q4164a23347K6804E3431D936J58966L1118I7396
13125a62043k2227A92867h0720A2494c0580B79722j19966M7784M2099n36F533
$$ y = [-130113, 235419, -81886, -7568, 176724, -47454, -115804, -139113, 113696, -7154, 463535, 14876, -292217, -128469, 326950, 107451, -43093, 31572, 302740, -219176, -130859, 59215, 427205, -18889, -176186, -201959, 178080, 26068, -123829, 280498, 201531, 122873, 115023, -217206, 375022, -338942, 148715, -145962, 256573, 125845, -211757, -5484, -25818, 72805, 232411, 314404, -51678, -137571, 229591, 225355, 444779, 328755, -67769, -19139, -60089, -128579, -135778, 458063, 75331, -28500, -10583, 191811, -206449, -89945, -36008, -113983, -87112, -42068, 180048, 199138, 114974, -123347, -96543, 53431, 4936, 163902, 195020, 97396, -162043, -184270, 192867, -80720, 12494, -30580, 279722, 159756, 207540, 249639, 249103, 6533]
13113c0799A18672c4986D26443a11878C8362e5589k13250B82808A2132K38486
13103B50618j23259K00602b270C28617H9289j6505h5992m9619A28681d2335m5504
13092h7839b3171B29007n5382P6712p2665c250C6813j5252c17277E3512K25106
13081B78618k3225P9872C3112h1298A75666p3610b42253b1129A14856a73505E4301
13069B64328B8886J89406J22455A12148K87267j67412C4096K80101n6810J32021
13059C89408F8270O1716c31363J02833A70975J74533D3129J99111A02329J3934
13049A16263n6137a54965B47091A08168m0037f7728j2154C30431m6948j26228
13039A57255o4729e3506A3806O8859h6299A54850L18460c0694I9130c9694C12937
$$ y = [-30799, 118672, -34986, 426443, -111878, 38362, -55589, -268839, 282808, 12132, 250618, 127359, 327961, -2270, 328617, 89289, 72784, -85992, -135611, 128681, -42335, -87839, -23171, 229007, 173625, 250337, 177672, -3250, 36813, 21561, -317277, 53512, 278618, 255393, 335265, 33112, -81298, 175666, 102056, -242253, -21129, 114856, -173505, 54301, 264328, 28886, 218292, 340747, 112148, 399415, 232003, 34096, 314197, 257387, 389408, 68270, 129986, -331363, -228530, 170975, 345508, 43129, 242240, 102329, 116263, 60126, -154965, 247091, 108168, 68131, -67728, -79882, 330431, 283483, 157255, 92526, -53506, 13806, 82665, -86299, 154850, 473310, -30694, 99130, -39694, 312937]
13027B75056C9558g1537A68863c8582H5073B5071c804C93711G1328J49115l638
13016B16805P0506c27907a17260A96394b96907G070J3581O0476i7022r0736K8318
13005a59440D09101j10833d6439A27689j2407n2039Q5495l353A4009f7328A13549
12993A00119b7290j09066j3721E3754J22405q6964a02834B68907E5930A5003C724
12981B4392J02639E8692P8274o3647J93677l345G4125K07970P1931f2463a3914
12969a5177B77945r0711i76j05423B09607a04870G2825B7086K08450G385a26753
12957A19607D4309a40562j25005A45433N499E5458K62770q4120C9393A8671a66582
12945F1303e4977k12874A7566a88631o4395A27987a1863A50619a1978A23044J06239
$$ y = [275056, 39558, -71537, 168863, -38582, 85073, 25071, -3804, 393711, 71328, 220443, 216805, 287311, -327907, -117260, 196394, -296907, 7070, 20651, 81127, -97022, -187758, -159440, 409101, 298268, -46439, 127689, 115282, 63243, 148738, 145385, 14009, -67328, 113549, 100119, -27290, -136356, -150077, 53754, 176159, 89195, -102834, 268907, 55930, 15003, 3724, 24392, 127031, 58692, 136966, 73319, 266996, 263651, 74125, 282095, 354026, -62463, -13914, -15177, 277945, 187234, -976, -106399, 209607, -104870, 72825, 27086, 235536, 7385, -126753, 119607, 44309, -140562, -265567, 145433, 150932, 55458, 318228, 234108, 39393, 18671, -166582, 61303, -54977, -267851, 17566, -188631, -253026, 127987, -11863, 150619, -11978, 123044, 229283]
12934B29283g9212B45848A22435f2733B01730o1546P9848a70186A05095J21739
12924B26834a1192j53788B56802G354a30946A30993c4198B87441e1654j69444
12914b21098P2381L8176A21122c88955a53976N5809A89513a38872I1748Q2867
12904A74615p0091i1487j51025A4938M44K4558J35869j6335e0691B04186e355
12892C03988A6837K97337A32133c62453A24556c2043A24066a48657A64745J85705
12882C50450f6906F895R5357N5590D3553a50696A89122m0417E3791J13067m3124
12871A23734A07a27881e6914j05806A02666M3038A5465M4873f9793A37279o1195
12860G6084K41175d2187k03993B27879E5762A4211a58913n6403B5527J66019a77346
$$ y = [229283, -79212, 245848, 122435, -62733, 201730, 140184, 220032, -170186, 105095, 226834, -11192, -164980, 256802, 7354, -130946, 130993, -34198, 287441, -51654, -221098, -148717, -110541, 121122, -388955, -153976, -98167, 189513, -138872, 91748, 174615, 104524, -91487, -242512, 14938, 15382, 39940, 175809, 159474, -50691, 204186, -5355, 303988, 16837, 314174, 132133, -362453, 124556, -32043, 124066, -148657, 164745, 350450, -66906, 6895, 102252, 157842, 43553, -150696, 189122, 148705, 53791, 166858, 123734, 107, -127881, -56914, -162720, 102666, 145704, 15465, 60338, -69793, 137279, 76084, 317259, -42187, -246180, 227879, 55762, 14211, -158913, -215316, 25527, 191546, -177346]
12848B9739g7353j34028A76566J37560c6821p3235A85286Q5278J53750a39495
12837I5004a06781q184F6568i111l13702a41408F7417A1535c0514A79167E7287
12825G7036g21k5882A23942b96497a7757l67897J65571f8612k0057n4094j11823
12814b54586J19932G3238C3537i2469k49235C158a06109j3001A796c2689P373
12803b5316j5722A90242e0003m816f039j58396f9446j11774m1150G0331a24918
12791f2939J3112k41131A41676C0317J5945J14799G2835i063H0534K7220B5890
12779e0759j32190E3422b02934O7540A02942J88582a45582m7976C41944f1136
12768B4296J17176b20773B15555C6615I159h6954c9729n788E9395Q12a25549K3739
$$ y = [29739, -77353, -211381, 176566, 314126, -36821, -110056, 185286, 270564, 424314, -139495, 95004, -106781, -114965, 66568, -9111, -322813, -141408, 67417, 11535, -30514, 179167, 57287, 77036, -721, -26603, 123942, -296497, -17757, -385654, -220083, -68612, -88669, -142763, -254586, -134654, 73238, 33537, -92469, -341704, 3158, -106109, -119110, 1796, -32689, -25316, -41038, 190242, -50003, -54819, -6039, -164435, -69446, -181220, -222370, 70331, -124918, -62939, -49827, -290958, 141676, 30317, 46262, 161061, 72835, -9063, 80534, 107754, 25890, -50759, -182949, 53422, -202934, -135394, 102942, 291524, -145582, -193558, 341944, -61136, 24296, 141472, -220773, 215555, 36615, 9159, -86954, -39729, -45517, 59395, 60207, -125549, -101810]
12756a01810G7681K48683j62225o3479k155P9131C8479L4061j0551J83183N04579
12745G49751a55092j01054A1085c0435j29961C4181J0508K0292J48645n1335r952
12734A52339o2609C7804A2640M8319a53633A23280L5897R8305b40633h12B09602
12722A5322c259j38334r6804B60553J33081C0812q013i6571K2805C1745e246A0556
12709F6443K92262A09107a61697B83427q5779k7926p0368J2538b40j18524l7265
12698a56029E9424e5143I0305e221n5300D80522D8195j8746K05427A14994c39089
12686d2097C38405o1791D0386O2632i3285I8116O9746f3190D0376J3759K02541
12675B56676j02275a03593A81279h8631J3366j17085D5470f0678n810A21250D4560
$$ y = [-101810, 77681, 326364, 164139, 100660, 98505, 177636, 38479, 72540, 61989, 245172, 749751, -155092, -256146, 11085, -30435, -160396, 34181, 44689, 64981, 213626, 162291, 152339, 89730, 37804, 12640, 60959, -153633, 123280, 159177, 257482, -240633, -812, 209602, 15322, -3259, -141593, -238397, 260553, 393634, 30812, 22799, -96571, -73766, 31745, -5246, 10556, 66443, 358705, 109107, -161697, 283427, 197648, 169722, 99354, 111892, -240, -118764, -156029, 59424, -55143, 90305, -5221, -60521, 480522, 48195, 29449, 234876, 114994, -339089, -42097, 338405, 276614, 40386, 103018, -93285, 98116, 167862, -63190, 40376, 54135, 256676, 154401, -103593, 181279, -88631, -75265, -192350, 45470, -60678, -66488, 121250, 44560]
12663A81447F4421J86726f4935C42305e1750B02628a18062B92470F4741P8429
12653A43170j0072c61025A59186i298A99079b52114D0433J90078I5047a33347
12642f4866B66938D5253a6357a017k99409H9187D147a54539a0448A54970F1791
12630A76300K12875R2070A91869C8283K8482K30527E5511F187h5123B85245b16991
12618B00072i3260j36941a3754j51564A35088a4984B44452A4703c4537A39739
12607c7730B79400A19508L0854m7601B5079J03721R6553E0924K3625P8126E9579
12595B5348J55887J79871F3354b4454q813r6023G9628h5611J9596B4760K06656
12584B31416D5962a64493I3068i8471F5362R4407e9995r1086O9295D9313A7224
$$ y = [181447, 64421, 251147, -64935, 342305, -51750, 202628, -118062, 292470, 64741, 143170, 133098, -361025, 159186, -9298, 199079, -252114, 40433, 230511, 95047, -133347, -64866, 266938, 45253, -16357, -1017, -300426, 89187, 4147, -154539, -10448, 154970, 61791, 176300, 389175, 481245, 191869, 38283, 66765, 297292, 55511, 6187, -85123, 285245, -216991, 200072, -93260, -230201, -13754, -165318, 135088, -14984, 244452, 14703, -34537, 139739, -37730, 279400, 119508, 150362, 102761, 25079, 128800, 225353, 50924, 74549, 152675, 59579, 25348, 181235, 361106, 63354, -24454, -33267, -129290, 79628, -85611, -66015, 24760, 231416, 45962, -164493, 93068, -98471, 65362, 159769, -59995, -151081, -81786, 49313, 17224]
12572f2489j83868O9373A0200b87536B81279C6367l663L749a48759k49833P3996
12561c24596D0458c76502a27674A59045m4415j4718B929L7529J64485i1961p9904
12550a71865D112a90870A07133a16902A47798o0628b28759k6046A78966J17374
12540B96340F7815c882o9726J8653o3512k06949A72862N0444b22936F4346J60823
12529B25169a46969A44794d37542C30193a38575A40397J61630j8241a62070P0826
12519i1244B10459I3545m4223a08058n8066k03563i8076C4267K1573b7561r5413
12508a22974B39684b13609c6519l1522n7806M3768l19570b8290j53443E0539c59601
12496C25400A49306e9416B29410a50975D36626j89187a2168j76613H2390a82118
$$ y = [-62489, -246357, -176984, 10200, -287536, 281279, 36367, 32704, 36453, -148759, -398592, -324596, 40458, -376502, -127674, 159045, 114630, 99912, 2929, 40458, 204943, -91961, -171865, 4112, -190870, 107133, -116902, 147798, 87170, -228759, -254805, 178966, 296340, 67815, -3882, -73608, -54955, -118467, -325416, 172862, 223306, -222936, 64346, 225169, -146969, 144794, -437542, 330193, -138575, 140397, 302027, 283786, -162070, -91244, 210459, 93545, 49322, -108058, -166124, -369687, -98076, 34267, 55840, -27561, -122974, 239684, -213609, -36519, -68041, -125847, -82079, -401649, -28290, -181733, 50539, -359601, 325400, 149306, -59416, 229410, -150975, 436626, 247439, -12168, -188781, 82390, -182118]
12485E5558B0949P7852k0619J56034a79571A02353j1667D4339b9631C54422H9315
12473B37021e49242A1707J75149a49455F0383A3523f6902m4459A30573g5608j53171
12462b28779a222j10306L847a6740H12J7717Q3139g0736j11733l30g3527l8478
12450a12005G5234c0520E7764b20551B28961I2000J2556b27665A20176h6197E3300
12438f4000A13046g2070I6448D1924i1302E7486J09330I011M3110k1443a07555
12426a86499B04335a72488A04497B5544L23388a39476p3242R6668q7948E0028
12415b2813R88A96588a94816c4481r522j5808f502A22957b12665J2931C0478a12253
12402c5570A1788K33469j04718J95745A22172B9033a7860j61869j99288B03097
$$ y = [55558, 20949, 98801, 78182, 234216, -179571, 102353, 90686, 44339, -29631, 354422, 89315, 237021, -549242, 11707, 186856, -149455, 60383, 13523, -66902, -111361, 130573, -75608, -228779, -1222, -111528, -107681, -16740, 812, 18529, 101668, -70736, -182469, -182799, -73527, -112005, 75234, -30520, 57764, -220551, 228961, 92000, 104556, -227665, 120176, -86197, 53300, -64000, 113046, -72070, 96448, 41924, -91302, 57486, 166816, 9011, 52121, 30678, -107555, -186499, 204335, -172488, 104497, 25544, 348932, -139476, -212718, -116050, -203998, 50028, -22813, -21825, 196588, -194816, -34481, -44003, -59811, -6502, 122957, -212665, -199734, 30478, -112253, -35570, 11788, 245257, 140539, 336284, 122172, 29033, -17860, -179729, -379017, 203097]
12391a03037I1533J93311f7887F2534k9045a29848A80847b64653g6931B9411g8183
12379A09873a76194A16678c9850J3498A19060N6126a15745A0914K563K7670J12059
12368A53206k4583b84262P5015b3848n4682j98515d275C40228e2514A7922a15750
12356a42276B4693R2289a99385A35641b94258a40372b0888k77721J40055A28670
12345f0244Q085A6210N6282d2444j31813E6397a54301C4994i4982O668K08j65000
12333b53106G3687O1623a66825D96R6342Q3844a01735K7411E1741J31157f9899
12321C88208j61684a3676k4114n1819M144F1393a68579C228b2313m17886d4540
12309b8641C5653b35951J15137F5665P2273c93496A63410b31568L0149c0121j15048
$$ y = [-103037, 91533, 284844, -67887, 62534, 33489, -129848, 180847, -264653, -76931, 29411, -78183, 109873, -176194, 116678, -39850, -26352, 119060, 175186, -115745, 10914, 13477, 41147, 153206, 128623, -284262, -209247, -23848, -78530, -277045, -4275, 340228, -52514, 17922, -115750, -142276, 24693, 116982, -199385, 135641, -294258, -140372, -20888, -298609, -158554, 128670, -60244, -52159, 16210, 72492, -42444, -174257, 56397, -154301, 34994, -94982, -88314, -88106, -253106, 73687, 135310, -166825, 496, 96838, 180682, -101735, -74324, 51741, 182898, -69899, 388208, 226524, -13676, -37790, -89609, -85465, 61393, -168579, 3228, -22313, -440199, -44540, -28641, 35653, -235951, -120814, 65665, 137938, -393496, 163410, -231568, -201419, -30121, -145169]
12298a45169k39270B75765c36997A23176b36478j11203a63918A56097g572A17186
12287E346K02610o3042l7126L7872J83658h9248A56548P5778F5328k3892J43238
12276A84674P2386j03161E0173d5781j7301j5907B74571h4237B38121a7399D0974
12264c8588N173k9659D6754j6513O8523J93344r101F6557c0813E67891b2154B24245
12251B54916q7582d63E28718A46935F8295J06572a53084g1563I790a03213h086
12239A17674J86413D8908g8568c7A05663R5245i0889D536L04937l5151p7397e3815
12226H9177E110L08505a29708C88068A87801q7959M7664K09921J62849j95619
12216C24657c3510A33566K00629h7041G5426a16605B24484o7093o3507K01133
$$ y = [-145169, -384439, 275765, -336997, 123176, -236478, -347681, -163918, 156097, -7572, 117186, 5346, 207956, 144914, 107788, 145660, 329318, -89248, 156548, 232326, 65328, 41436, 184674, 257060, 153899, 50173, -45781, -63082, -78989, 274571, -84237, 238121, -17399, 40974, -38588, -33415, -63074, 46754, 30241, 98764, 292108, 283007, 66557, -30813, 567891, -22154, 224245, 254916, 167334, -463, 528718, 146935, 68295, 174867, -153084, -71563, 9790, -103213, -8086, 117674, 304087, 48908, -78568, -37, 105663, 200908, -90889, 4536, 309473, 274322, 196925, -53815, 89177, 5110, 313615, -129708, 388068, 187801, 99842, 147506, 357427, 520276, 324657, -33510, 133566, 334195, -87041, 75426, -116605, 224484, 157391, 93884, 295017]
12206B95017j40556L26718A22773c0683C56720A58188A2104M94736A24463h1599
12195A45574K51132E7592K03681q6349a9467F10264A39567f0233B71728C0987
12184g7076B8743J94908r0354E3208J92497l5718q7096K7046k6934O27h6586m205
12172i0791A68080A729K13937G5888J86807c31390A63143b1977A33098e5579k4408
12161g9987A4234c35956I4470b92323a4401E8917N7828B2435L00255c89018H9912
12149B05203f061k827A4609a71986g2179A13413J80014a57648c6290E8628c38443
12137D2184K41244K0840p0562b46098j1894e0454l701A76559f724A16814D173
12125B1843J52079H5775A9132a31231C46563F7715k0823a98514m6832f0794b1149
$$ y = [295017, 154461, 481179, 122773, -30683, 356720, 158188, 12104, 506840, 124463, -81599, 145574, 396706, 57592, 261273, 174924, -19467, 610264, 139567, -60233, 271728, 30987, -77076, 28743, 223651, 133297, 53208, 245705, 209987, 122891, 149937, 123003, 123630, -86586, -90791, 168080, 1729, 215666, 75888, 262695, -331390, 163143, -21977, 133098, -55579, -79987, 14234, -335956, 94470, -292323, -14401, 58917, 116745, 22435, 322690, -389018, 89912, 205203, -6061, -8888, 14609, -171986, -72179, 113413, 293427, -157648, -36290, 58628, -338443, 42184, 283428, 304268, 233706, -246098, -257992, -50454, -54155, 176559, -6724, 116814, 4173, 21843, 173922, 85775, 19132, -131231, 346563, 67715, 46892, -198514, -245346, -60794, -21149]
12113a82923I2537d1988m2894c6471C7879J22949K0543a08940J8437l16032A25665
12101E7695b51239P5703F8613c98065J11740a22774m6837A19685J22417D2840
12090e9121A31217J21167c319F0115a16722d6965k7451j72326C0177a45175H7890
12078b15399f8758j22824A17790e8090B15626A9410b6929I0043b26219E6689K84102
12067C40791N46827O04584n78033m29226A86500E4914J99595c1584k27064C76573
12056c64429J54854B23704F6912J28939l880I0495a38465e215j31592a3756j3562
12045b7318F4353j7519d21781a1428B24505b38579e3230H6835a7004m2973A63951
12033a05149a9367j8659l34274A72623b07317D2997b27805E9160L25480F7513
$$ y = [-182923, 92537, -41988, -84882, -36471, 37879, 160828, 181371, -108940, -90503, -406535, 125665, 57695, -251239, -175536, 68613, -398065, -286325, -122774, -169611, 119685, 242102, 42840, -59121, 131217, 252384, -3319, 60115, -116722, -46965, -74416, -246742, 30177, -145175, 87890, -215399, -68758, -191582, 117790, -58090, 215626, 19410, -26929, 90043, -226219, 56689, 340791, 887618, 1492202, 914169, 484943, 186500, 54914, 254509, -31584, -258648, 376573, -364429, -209575, 223704, 66912, 195851, 191971, 90495, -138465, -5215, -136807, -13756, -27318, 64353, 46834, -421781, -11428, 224505, -238579, -53230, 86835, -17004, -59977, 163951, -105149, -19367, -38026, -372300, 172623, -207317, 42997, -227805, 59160, 384640, 67513]
12022a68212j6472C0052b2729j24132P0594D4624b87916A3555c0235j70320A35692
12010b19625A39900E5822J57558J47036a5613l56615A77406c7525k47498N6496
12000b28527A26401A185J703g1223r5290j19869J39642L6367K299A90998k9933
11989A61065K57922a50670C32417b9525j80825A48481b20725A30684a2802F8363
11978i1812r6695b8833j32864i552j89977c1851B13185k9920l2496b05164Q8811
11967a16353L0744n3885K4355m8268G5233J89962g3684A91100d1437A69147a6179
11955c46352a10296k9892O7534B81760b31998B05944g7464L7982j08267J2891
11945a34858j35288H6874k4174E568a16279n0866j46975m9768Q3030A80191c04402
$$ y = [-168212, -184684, 30052, -22729, -146861, -76267, 44624, -287916, 13555, -30235, -200555, 135692, -219625, 139900, 55822, 213380, 360416, -15613, -372228, 177406, -37525, -285023, -228527, 126401, 1185, 2888, -71223, -166513, -286382, -146740, -110373, -108074, 190998, 161065, 418987, -150670, 332417, -29525, -210350, 148481, -220725, 130684, -12802, 68363, -91812, -188507, -28833, -161697, -9552, -199529, -31851, 213185, 183265, 150769, -205164, -116353, -85609, -139494, -115139, -163407, 75233, 265195, -73684, 191100, -41437, 169147, -16179, -346352, -110296, -140188, -72654, 281760, -231998, 205944, -77464, -39482, -147749, -134858, -270146, 86874, 62700, 5568, -116279, -167145, -314120, -363888, -280858, 180191, -304402]
11933D8711i8641B66558b63386J25687o0661i1123F2361K42335g9009b3872j57151
11922a81023A83728J77490A75381C8648f8797l5576r6020g9562p4500N2891j17028
11911b18199A92678f2032i444G8617P5961n0871J85565I0063i2394A36573b30771
11899b08238B03496b81554A43305a29514r6791h036C59296j34870a07065B79759
11888g2484A01893J45026e0693j49484B94546a25892e4195E6893b74917d9568
11877f4123E1884H132a78570G3365a4903n2900q1059A25211a8052l20373a47266
11865a93995g2670j68721D5477a35841c8907I4244M4748O8977a42523K7655j90712
11854c05580i1509j12787i0384j11830c3368A40983L8647A6877J28586a31667
$$ y = [48711, -98641, 266558, -263386, -137699, -198360, -91123, 62361, 304696, -79009, -23872, -181023, 183728, 361218, 175381, 38648, -68797, -104373, -200393, -79562, -154062, -101171, -218199, 192678, -62032, -9444, 78617, 154578, 103707, 289272, 90063, -92394, 136573, -230771, -208238, 203496, -281554, 143305, -129514, -226305, -8036, 359296, 224426, -107065, 279759, -72484, 101893, 246919, -50693, -200177, 294546, -125892, -54195, 56893, -274917, -49568, -64123, 51884, 8132, -178570, 73365, -14903, -67803, -148862, 125211, -18052, -338425, -147266, -193995, -72670, -241391, 45477, -135841, -38907, 94244, 138992, 207969, -142523, -114868, -305580, -91509, -204296, -90384, -202214, -33368, 140983, 179630, 16877, 145463, -131667]
11843B60877b39579N3944n3753B26183a66942m7865A33475b35695b9862A36125
11832A1130f5787b9754l192r5924A35060D6536b89451G8734c26489a30638j25741
11821b56379A77007f1451F6936J44333A1289M3667J51572H0529f208A37648d607
11809b1480l13786B31473h7515r297B69298A0643g4793p7660K295H9378a05745
11797F8856k6968d7094l26323J49184D0594a44136j16672f5567b8108l7217A24503
11785C8753c05574i7164A09767d39100A02204g7859c8259B00933G2824e7925J7490
11774d0435F4305A7461a42627k1462f7268C52104j44219I9923d61871b9749q211
11763c7960B37466n5754M7359c5608j17540j84129B73894b12134B60610d9188
$$ y = [260877, -239579, -185635, -239388, 226183, -166942, -214807, 133475, -235695, -29862, 136125, 11130, -65787, -29754, -32946, -128870, 135060, 46536, -289451, 78734, -326489, -130638, -256379, 177007, -61451, 66936, 211269, 11289, 54956, 206528, 80529, -6208, 137648, -4607, -21480, -335266, 231473, -87515, -96812, 269298, 10643, -74793, -152453, -150158, 89378, -105745, 68856, 41888, -47094, -373417, -224233, 40594, -144136, -260808, -65567, -28108, -65325, 124503, 38753, -305574, -97164, 109767, -439100, 102204, -77859, -38259, 200933, 72824, -57925, -40435, 64305, 17461, -142627, -164089, -67268, 352104, 207885, 99923, -461871, -29749, -37960, 237466, 181712, 229071, -35608, -153148, -337277, 273894, -212134, 260610, -49188]
11752a09317j27308I1475a23998N8246A86215M0376P0219k4306L2589d598D8825
11740g3937A5113K51162a57362B22945H6886J17407d4985a9148A96959a02112
11729a52582A08592E907a83917C1015B899N4673o873P4287A9346a04232G0030
11717B07975m7036o6279i4225A60010a5207a969B80818a6219o664C3034J61020
11706A94054m6446a19107j16662B41111a72299B36110H6059b32173A39042R8686
11696B37728A0352J09972L5769e0210F2056B7759b50841A40143b8773j0771a7709
11684b84202n0729a65225A18488N3564k8784o6816j0937a30041c8329H5882O0027
11673A45909M0237P1785m2021a07642A91820d8089l4429j15952L9132b5562A77389
$$ y = [-109317, -236625, 91475, -123998, -65752, 186215, 226591, 296810, 272504, 305093, -4598, 48825, -73937, 15113, 266275, -157362, 222945, 86886, 204293, -44985, -19148, 196959, -102112, -152582, 108592, 5907, -183917, 31015, 2899, 57572, 50699, 124986, 19346, -104232, 70030, 207975, 160939, 94660, -94225, 160010, -15207, -1969, 280818, -16219, -22883, 33034, 194054, 147608, -119107, -235769, 241111, -172299, 236110, 86059, -232173, 139042, 237728, 10352, 120324, 156093, -50210, 62056, 27759, -250841, 140143, -28773, -39544, -17709, -284202, -334931, -165225, 118488, 172052, 143268, 76452, 65515, -130041, -38329, 85882, 145909, 186146, 257931, 215910, -107642, 191820, -48089, -82518, -198470, -159338, -25562, 177389]
11661b13598A52766F1697k1356L39599G907J83502a02444j2631j44481C10662
11650e7332k13506C9471a26769E09188E799a17615E463J64280F99R3280a42620
11638A1976K1961g912E2806K08749C5551c8064j24690F255a93074o779A75147
11626A01446N4633R5228A09780P0027g3487D7214a88233B30676c65110E9457J37234
11615A96691B7836Q2422a57521F9006i7160c3955F7788c01788B32950A12975o019
11604A06956a33984A8547N5716i6332D16162c9796A57138J98451a50555A98025
11593b6818n6225A2408a60971C6283f997D8453L927f7826A69916J18918a29355
11581b5273B72360L9656A19842k7040l9888L26285F3021d0481C2585J09434J3206
$$ y = [-213598, 152766, 61697, 40341, 379940, 7907, 191409, -102444, -115075, -259556, 310662, -57332, -270838, 39471, -126769, 509188, 5799, -117615, 5463, 169743, 699, 93979, -142620, 11976, 33937, -7912, 52806, 261555, 35551, -38064, -162754, 6255, -193074, -199853, 175147, 101446, 156079, 251307, 109780, 179807, -73487, 47214, -188233, 230676, -365110, 59457, 196691, 27836, 110258, -157521, 69006, -97160, -33955, 67788, -301788, 232950, 112975, 106956, -133984, 18547, 74263, -96332, 416162, -39796, 157138, 355589, -150555, 198025, -26818, -83043, 12408, -160971, 36283, -6997, 48453, 52380, -67826, 169916, 288834, -129355, -25273, 272360, 312016, 119842, 92802, 52914, 379199, 63021, -40481, 32585, 142019, 155225]
11570A55225L6859g4671B911L76149A67253J7564H583b8131A57816C7017a98091
11558f0644A23334a13340A41928l9789L0950c664k08229L4509N4407c0456B77932
11546i7638k4982C64642b1400B2885L26965j41029m902j4310m5768g4087E3166
11534F1041K27254A07546l3909J46738K32435h1759A11276R6354q811J76969j08417
11523B67371A7320d8444A01692h1254r6607C35176h8552A34703g8406A10298a01110
11511A50170q595n2350P8608a28058B36006m3910E4648J16440j0433C1425M20943
11500D52368A75966A5164M2147P2633a4559C61283a69891C584K55234A08846J33544
11489B42390A03892j7538j1994J97353A31487J52970I0756L8201L6104J14734
$$ y = [155225, 192084, -74671, 2911, 379060, 167253, 184817, 8583, -28131, 157816, 37017, -198091, -60644, 123334, -113340, 141928, 102139, 133089, -3664, -211893, -177384, -122977, -30456, 277932, -97638, -122620, 364642, -21400, 22885, 349850, 208821, 203919, 189609, 143841, -74087, 53166, 61041, 288295, 107546, 73637, 220375, 452810, -81759, 111276, 207630, 198819, 375788, 267371, 17320, -48444, 101692, -81254, -177861, 335176, -88552, 134703, -78406, 110298, -101110, 150170, 141575, 89225, 167833, -128058, 236006, 192096, 54648, 171088, 160655, 31425, 452368, 175966, 15164, 57311, 129944, -14559, 361283, -169891, 3584, 258818, 108846, 242390, 103892, 86354, 74360, 271713, 131487, 284457, 90756, 128957, 165061, 279795]
11479B79795b29018H9770l6707K87193g4990C0009a39453e1341A51329a58439
11468g4636m7783O0004B06577l873n2979K48923L3855A42458C9818K37901F3533
11456a06000E1558a48078D3310K15620m4572r4514B5963J06731B7803J61218K4491
11445B13512B8969e2169B78832E3855M842B5185K398L81268D8354J76624m9453
11434A75525i6308C2150J31250M3806K35319j38741b8786j59834B56929b20506
11423b68081A98864b97868B876J72219E4222a33609n2363E5101b23751F9759J88542
11412B58301c11736a15343F9108a22577k56098B02463f468B01247G3501j3468
11402F0033a21240B4139L01840a6446k54446A08697B4375J35496c0906E4153K7897
$$ y = [279795, -229018, 89770, 53063, 340256, -74990, 30009, -139453, -51341, 151329, -158439, -74636, -122419, -62415, 206577, 202704, 149725, 398648, 432503, 142458, 39818, 277719, 63533, -106000, 51558, -148078, 43310, 258930, 214358, 119844, 25963, 132694, 27803, 189021, 213512, 28969, -52169, 278832, 53855, 58697, 25185, 27583, 408851, 48354, 224978, 175525, -96308, 32150, 163400, 207206, 442525, 303784, -28786, -188620, 256929, -220506, -268081, 198864, -297868, 2876, 175095, 54222, -133609, -185972, 55101, -223751, 69759, 258301, -311736, -115343, 69108, -122577, -378675, 202463, -6468, 201247, 73501, 60033, -121240, 24139, 325979, -16446, -270892, 108697, 24375, 159871, -30906, 54153, 82050]
11391H2050B1797b09771i4889B1070c5634E7946F805K48393A03672e1170I4605
11379A7249g1069A79911H4201b19086C56860f2129F4557a39681k95879e9405A16867
11367F806e7308A59735b34334j59127c5411p1286F1784b28778h7275F802f2569
11355A18258f374l73208h8014k4123j03202R0438e6384A56452a4731j65200B27302
11343b9281o0653A82622o4500g5413B7198g9773j6726B43145C4060a04507m879
11332a09386j05320m8918c1017C39940A49611Q938n6715J28596a81483A17345
11321b73614e0429A10888J60698I0610C099J42732b32755A91477i9102H9633Q8898
11310A78531a02479k91232B18677b46714H5957A2051b62672b0325k05937L3592
$$ y = [82050, 21797, -209771, -94889, 21070, -35634, 57946, 6805, 255198, 103672, -51170, 94605, 17249, -71069, 179911, 84201, -219086, 356860, -62129, 64557, -139681, -435560, -59405, 116867, 6806, -57308, 159735, -234334, -393461, -35411, -106697, 61784, -228778, -87275, 6802, -62569, 118258, -6374, -379582, -88014, -112137, -215339, -124901, -56384, 156452, -14731, -179931, 227302, -29281, -89934, 182622, 118122, -75413, 27198, -79773, -96499, 243145, 34060, -104507, -109386, -214706, -263624, -31017, 339940, 149611, 158549, 101834, 230430, -181483, 117345, -273614, -50429, 110888, 271586, 90610, 3099, 145831, -232755, 191477, -99102, 89633, 178531, -102479, -393711, 218677, -246714, 85957, 12051, -262672, -20325, -226262, -192670]
11300a92670F4037k1640g157j95221r1345a38619o7136B07833c832A95946R5729
11289B91675b06860D1873d25869J90362c1526k7320B02884I9983e6123p2660A2511
11277A06047J06668E3553K61695h2664m8604B1014b16607j20175d1510q846k5487
11266g5843k60527B43486b67241a1433A46772k7428Q12h2827B65854j01797A6190
11254b36850a13483q6516P5921q1149l8985P576k47846C47698A04556k5726a8739
11242D3906J43043a9986q441m5286j62197d5435B82397a7185A36492m3002a11473
11230e5929G5276L2079a51787N9442j37111B068K07945a30998D7854J43942H7322
11218a37515l8734j5072A61110g4631E0559j6558K24733I3897b87848j02898R6441
$$ y = [-192670, 64037, 42397, -7157, -202378, -293723, -138619, -205755, 207833, -3832, 195946, 291675, -206860, 41873, -425869, -235507, -31526, -58846, 202884, 99983, -56123, -128783, 12511, 106047, 212715, 53553, 315248, -82664, -131268, 21014, -216607, -336782, -41510, -50356, -75843, -336370, 243486, -267241, -11433, 146772, 119344, 120156, -82827, 265854, 164057, 16190, -236850, -113483, -199999, -124078, -205227, -244212, -236636, -484482, 347698, 104556, 78830, -18739, 43906, 186949, -19986, -28427, -73713, -235910, -45435, 282397, -17185, 136492, 93490, -111473, -55929, 75276, 107355, -151787, -92345, -229456, 2068, 210013, -130998, 47854, 191796, 87322, -137515, -176249, -191321, 161110, -74631, 50559, 34001, 258734, 93897, -287848, -390746, -294305]
11207b94305C619g7603k7984J1654E2960a45406H413a04900k39627C74974j14140
11196B60834f1561A3991a84850A85729f6221G4488K3913j3697c5654K787B21942
11184C9971f4726m1968G8263g9497l53191a96270a6413f982l4979l89013K11948
11173b19026B1094b3730m7251A44108j8426c7236k57608i2526A60566B522b07442
11161a76639e8775H6592K03521B8531J48821a77533a739A9076e8960D09687A92316
11149b5032j26227C9921R1096l7905J13032C9228b2145j30162B91899c6638n4580
11138i1218B1285N3956J17544A7782f5668j31084C35125j26105i4905n004B50180
11126A91225L0920m2669n3339D7190a14649M1249A58430L4202J28909E6882a51117
$$ y = [-294305, 3619, -77603, -105587, -93933, 52960, -145406, 8413, -104900, -344527, 374974, 260834, -61561, 13991, -184850, 185729, -66221, 74488, 98401, 84704, -35654, -32867, 221942, 39971, -64726, -106694, 78263, -79497, -432688, -196270, -16413, -6982, -41961, -430974, -219026, 21094, -23730, -70981, 144108, 125682, -37236, -294844, -92526, 160566, 2522, -207442, -176639, -58775, 86592, 290113, 28531, 177352, -177533, -1739, 19076, -58960, 409687, 192316, -25032, -151259, 39921, 131017, 93112, 206144, 39228, -22145, -152307, 291899, -36638, -91218, 21285, 75241, 192785, 17782, -65668, -196752, 335125, 209020, -94905, -99909, 250180, 191225, 222145, 179476, 126137, 47190, -114649, -73400, 158430, 192632, 321541, 56882, -151117]
11114F3740K39138A9785P0581c8509C49331a57859E5832a11211F0789J49463a33028
11102E31139A65500J88206A8905J28063j024E3962J68471H1143M2094D6134K44667
11091B90801a56350d7211A43702J70219J24866A35611C1429L06541A31331J84003
11081C15334P6021A05066J1686P8786J74937m8364M1877N4080j7242A27524J41881
11070B69405K73027m5382k17003L68777j79728J70670k60900J62539K90916J75919
11060A008240k68102O2017j40701j68987J45914K40195j68482n8723l9678l5513
11050E76180K42700o8058M30732j60545O9995m33598O18999n87287l522K4082
11040G09678j46302K10080J17733j53649J78526j89140J33098j5821J40866j52907
$$ y = [63740, 302878, 19785, 90366, -38509, 349331, -157859, 55832, -111211, 60789, 210252, -133028, 531139, 165500, 353706, 18905, 146968, 145944, 53962, 222433, 81143, 123237, 46134, 290801, -156350, -47211, 143702, 313921, 438787, 135611, 31429, 337970, 131331, 315334, 391355, 105066, 116752, 195538, 370475, 322111, 363988, 418068, 400826, 127524, 269405, 542432, 497050, 280047, 648824, 469096, 639766, 378866, 541405, 832321, 1008240, 740138, 802155, 661454, 492467, 638381, 878576, 710094, 651371, 611693, 576180, 818880, 750822, 1181554, 1021009, 1091004, 657406, 1276405, 689118, 685596, 709678, 563376, 773456, 891189, 737540, 916066, 726926, 860024, 844203, 985069, 832162]
11030H32162p83l0217O2425J66700q7048n0620k11210N2661J2135K56300j30645
11019H71860k32082K25722k25862J75495n0547j62783Q2190L86629l35234N6943
11009G92331j21400k3888N6364o7456K8851K58543n2321m3000k90897M66064j39107
10998H64084o7223J2276K00614m27168k12668O00482j79534L80900l28417O5330
10988I08676J34593l28089L44520O9061K62837k27450L25758r1381J35199J50505
10978A684229K53035K5601N79410N5640N54010K68220J01862j78354J62281L9114
10968C545048p04351j66455k22914l29993o8847l40629q6603n9535K62449j4523
10958A813647l00755M1564k0471J3508k23671j40350j90921j16651K91875E81747
$$ y = [832162, 831379, 801162, 863587, 1030287, 943239, 892619, 681409, 734070, 746205, 1002505, 871860, 639778, 865500, 639638, 815133, 764586, 601803, 683993, 1070622, 735388, 792331, 670931, 647043, 703407, 635951, 664802, 923345, 871024, 828024, 537127, 1003191, 864084, 796861, 809137, 1009751, 582583, 369915, 970397, 790863, 1171763, 843346, 908676, 1043269, 715180, 1059700, 1128761, 1391598, 1164148, 1489906, 1398525, 1533724, 1684229, 1937264, 1962865, 2542275, 2597915, 3151925, 3420145, 3522007, 3343653, 3505934, 3545048, 2840697, 2674242, 2451328, 2121335, 2052488, 1711859, 1625256, 1565721, 1828170, 1813647, 1512892, 1554456, 1533985, 1547493, 1323822, 1183472, 992551, 875900, 1167775, 581747]
10947F22231q4032j83224M0249I6671J16332J57643j39397c64082h1095C1508
10936C39374A42551E7819A1653a12902A89476p9206a36863L855A72722K16933
10926C89655a22168j1838C5877K11060A19817K06695a51692k69362A57823a08817
10915A42099a84329A12383C8601a28401r1836e2577b5273j92547R9534j49029
10905b67315d8298j26859e4280A04804a91483D3723K2717i9153A82461H5517d0319
10893B47244D9043O8166A8439g8301K7940j489q6205C16284a0712k29063R6829
10882a42946p199H3174d44778d9314q6437A80878P5454E67J32642E9069f6989
10870a05069B42404a29369c415m62059b18228h9491A07207f647j04442A57712
$$ y = [622231, 538199, 354975, 395224, 96671, 213003, 370646, 231249, -364082, -81095, 31508, 339374, 142551, 57819, 11653, -112902, 189476, 110270, -136863, -133008, 172722, 389655, -122168, -134006, 35877, 246937, 119817, 326512, -151692, -421054, 157823, -108817, 142099, -184329, 112383, 38601, -128401, -220237, -52577, -25273, -217820, -118286, -267315, -48298, -175157, -54280, 104804, -191483, 43723, 66440, -99153, 182461, 85517, -40319, 247244, 49043, 117209, 18439, -78301, -50361, -51850, -138055, 316284, -10712, -239775, -142946, -150145, 83174, -444778, -49314, -135751, 180878, 256332, 567, 133209, 59069, -66989, -105069, 242404, -129369, -3415, -465474, -218228, -89491, 107207, -6647, -111089, 157712]
10859A30201a32818G511J43010J68520f0211B99909b67883F5791a81333p7676
10849b59009J25170K2808F167b36503H1222b37993A2818b15634A21659f6440A62239
10837c10283B84511D9219b48555A31573d0426j84047f400A24684L1684g0034k42816
10826c12850C791J09536a45887E5271a180l0029I6255a55841j69222a53827D0927
10814C52538i2440J4517l06122d5194B07527a14589B48141b58366e151l67889
10804c73040a68454C22313H347K51388l4778A02680g5324f354A12057a9371L023
10793a6348l05587f4745p9758j9301j14909A09686a1185p5468j5510j80739B47705
10781c4669l3533j21119j99975J66058M3097A53958d17224a27064C05462c7090
$$ y = [130201, -132818, 7511, 150521, 319041, -60211, 299909, -267883, 65791, -181333, -259009, -133839, -111031, 6167, -236503, 81222, -237993, 12818, -215634, 121659, -66440, 162239, -310283, 284511, 49219, -248555, 131573, -40426, -224473, -6400, 124684, 156368, -70034, -312850, 3791, 113327, -145887, 55271, -1180, -31209, 96255, -155841, -325063, -153827, 40927, 352538, -92440, -77923, -384045, -45194, 207527, -114589, 248141, -258366, -5151, -373040, -168454, 322313, 8347, 259735, 224957, 102680, -75324, -6354, 112057, -19371, -16348, -321935, -64745, -144503, -163804, -278713, 109686, -11185, -86653, -102163, -282902, 247705, -34669, -68202, -189321, -389296, -223238, -180141, 153958, -417224, -127064, 305462, -37090]
10770a0206k41461A86604D5839c20069J37386A11953k9726f8813q2609B72203
10759a4741D7467J33824E5237i5634d4259k68671A36613D0861M8000e6929j38552
10748a95481C82786j85596c7721q808j6002A49388b29334A16186A8102b55858
10737h670B66208c2582j45015A78541I786K95016g9093l054L4752F1606e997q818
10725a4815j10411O1404l39601c4251A03785b23131Q5728B90642b02101B3520
10714b28064F9633G306a84976R0583B08879e3974j19935f1689k45481G449a64917
10702i098A9075J47400a42967j52258a43383j92688a13774m0030c0217A28051
10691a38876c9256j51773B83887a25185l1075L7185K6973k21314F7136j9296J7821
$$ y = [-10206, -251667, 186604, 45839, -320069, -182683, 111953, 82227, -68813, -151422, 272203, -14741, 47467, 181291, 55237, -95634, -44259, -312930, 136613, 40861, 88861, -56929, -195481, 382786, 197190, -37721, -46529, -62531, 149388, -229334, 116186, 18102, -255858, -8670, 266208, -32582, -177597, 178541, 9786, 304802, -79093, -82147, -47395, 61606, -5997, -14815, -125226, -63822, -403423, -34251, 103785, -223131, -137403, 290642, -202101, 23520, -228064, 69633, 7306, -184976, -94393, 208879, -53974, -173909, -61689, -307170, 7449, -164917, -9098, 19075, 166475, -142967, -295225, -143383, -336071, -113774, -153804, -30217, 128051, -138876, -39256, -191029, 283887, -125185, -156260, -119075, -92102, -313416, 67136, 47840, 65661]
10680F5661b3744C8496O7482P5335m7158L0355c63414b958A27458a31822k3003
10669a54825j54883h5677j35567d3087j67587H4522c35340d0157h098j38369A4650
10657c6123k21496q237a18562B32290b76732J35635j55516i0755j51639F7976
10646A7684h7694K4647J5525j22968k9617k20493b00383A39996a39269j53248
10636b92517a9445A0673b13014A34883e3581A41961n5644b04109B136J20135o666
10625A15605b89490D9521d65141h751o5940B46360k308a18224H7993a49708C13978
10613a79387h7394A03011l3365J15056d1057j35060J0545e2335k0755J3414p7478
10602a37154A55077b24905K1411C5589b32240C06952D4388c97662A91310c19782
$$ y = [65661, -23744, 38496, 105978, 181313, 134155, 164510, -363414, -2958, 127458, -131822, -154825, -309708, -85677, -221244, -43087, -210674, 84522, -335340, -40157, -8098, -146467, 14650, -36123, -257619, -265856, -118562, 232290, -276732, -141097, -296613, -90755, -242394, 67976, 17684, -87694, -63047, -47522, -170490, -200107, -420600, -200383, 139996, -139269, -292517, -19445, 10673, -213014, 134883, -53581, 141961, 86317, -204109, 2136, 122271, 115605, -289490, 49521, -465141, -8751, -74691, 246360, 244052, -118224, 87993, -149708, 313978, -179387, -87394, 103011, 69646, 184702, -41057, -176117, -165572, -52335, -73090, -59676, -137154, 155077, -224905, -203494, 35589, -232240, 306952, 44388, -397662, 191310, -319782]
10591E7131c11757L0427A05123a57862A27887d2280j31410A67334c7097A2674
10580A15792d3803K1543G454J3850a32047l75203C0811j0395a10346D9781P2753
10569A22534b96035a3712A39214f5069k63662a01331j56484K7169C689d99703
10558g6304J240F1051a50781B70711a7850l25466a63255f5840I0708J6156A6084
10546B2598i6407h078C3203m305c20045a21125G5130L59099a07080o7722g8962
10534D9661K6151b69097C9029b51617J00160D15528D8757J34612h4646I4464f108
10522E8858i4966a7309j9971j41810f0046j1704B33145d1659A31389b37985H1448
10510d3618A0953Q0957C9538M2398G286N6924J44849C9130b43922d148B08194
$$ y = [57131, -311757, -281330, 105123, -157862, 127887, -42280, -173690, 167334, -37097, 12674, 115792, -43803, -22260, 7454, 21304, -132047, -507250, 30811, 20416, -110346, 49781, 122534, -296035, -13712, 139214, -65069, -328731, -101331, -257815, -230646, 3689, -499703, -76304, -75064, 61051, -150781, 270711, -17850, -343316, -163255, -65840, 90708, 106864, 16084, 22598, -96407, -8078, 33203, 28898, -320045, -121125, 75130, 434229, -107080, -174802, -78962, 49661, 75812, -269097, 39029, -251617, -151457, 415528, 48757, 183369, -84646, 94464, -6108, 58858, -94966, -17309, -37280, -179090, -60046, -71750, 233145, -41659, 131389, -237985, 81448, -43618, 10953, 91910, 39538, 81936, 7286, 64210, 209059, 39130, -243922, -4148, 208194]
10498d9938m4426O062j38849J09743C4592K1981a06747A37048c48561g4346G8716
10486A09690K5697M26694r7123K38218A3430L50588a74491A53502a45726A10775
10475A90148a06612n9567A6872f184j87206A60506d0280J2471k42092r8134A91081
10463A74900a2610r3135n4254H013K00561b70145c1542q8782j19133J15350D3748
10451A05531J7354a30897E0412h4675Q555j9822C41095P9609j86558a95410a3862
10439d3700j7488k02699c7880l43268Q8198N1738h2372j07953F4911b16349j60766
10428c77115f7848l2860o3443Q1631A44706N6972a78085B32295j13863b47011
10417f1588I8144b9724C0422b40397n6228J24406j79977d1996p526D44662H4532
$$ y = [-49938, -94364, -88302, -227151, -117408, 34592, 56573, -106747, 137048, -348561, -74346, 78716, 109690, 135387, 562081, 464958, 703176, 13430, 364018, -174491, 153502, -145726, 110775, 190148, -106612, -166179, 16872, -6184, -193390, 160506, -40280, -27809, -269901, -368035, 191081, 174900, -12610, -105745, -159999, 8013, 208574, -270145, -31542, -120324, -239457, -124107, 43748, 105531, 122885, -130897, 50412, -84675, -76120, -95942, 341095, 420704, 234146, -195410, -13862, -43700, -61188, -263887, -37880, -381148, -292950, -241212, -82372, -190325, 64911, -216349, -377115, -67848, -100708, -164151, -82520, 144706, 201678, -178085, 232295, 118432, -247011, -61588, 98144, -29724, 30422, -240397, -296625, -172219, -352196, -41996, -49522, 444662, 84532]
10405A56486N3137J27849l4680a78284O6098A97877k0562b83433B7543O4045O7826
10394A59414J74320I8685K95063o1620K1545q4858b08376c6311C8078J21716l1430
10383A28364h0615A19186J7071o4442J85052F3699K06306K2093A37106L25037
10373D62143j56224J56125A86331J14837q8539K18893J98160B64835L35995m8310
10363E52520k68060L10100k77065A09149L9980l9476K93989B6445K82872J01912
10353D11229j28869K54001M2822J61551k32910l1410k15563j09758k2371O37187
10343G65909l31779j67331K48646A78302K60112k07484J09259o6194a5388D89353
10332I6859a8708B07931g3322E0294q417J90193a05516g313A32905M38954p6515
$$ y = [156486, 209623, 337472, 302792, -178284, -112186, 197877, 177315, -283433, 27543, 91588, 159414, 333734, 98685, 393748, 332128, 353673, 268815, -208376, -36311, 38078, 159794, 128364, -80615, 119186, 136257, 71815, 256867, 63699, 270005, 292098, 137106, 462143, 305919, 462044, 186331, 301168, 212629, 431522, 629682, 264835, 600830, 552520, 284460, 594560, 317495, 109149, 149129, 109653, 403642, 26445, 309317, 411229, 282360, 536361, 579183, 740734, 507824, 476414, 260851, 151093, 128722, 765909, 434130, 266799, 515445, 178302, 438414, 230930, 340189, 273995, -15388, 489353, 96859, -18708, 207931, -73322, 50294, 41877, 232070, -105516, -7313, 132905, 571859, 495344]
10321D95344B07396p4073o2304j8034b80632l5119A21215K7744m1002L277i8878
10309a36129H575L42887d8939J6761r3325j92960e975j19298B80084m2160j09027
10298A28897a03316B31151A09367e4133j50006A88948a91198E7325a51366F8906
10287c54224J02035B21023D185a63861b1537l22722d8617k48792O2934F5708e1888
10275C1431a33933l983p9056B38097g7052j39784A83928a06544A20217J02510
10265B22727q9854K31586J95754j48958A99159q3302O8847l8335a6204C39662
10254B3615g1005C4632b18463f7957K9590k22633a6951D6579J80561H2540e39622
10242i469A27645K4806f3696H234b24029D08049F1753A7258L7074f498H300b51227
$$ y = [495344, 207396, 133323, 71019, 52985, -280632, -315751, 121215, 148959, 107957, 111234, -98878, -136129, 8575, 351462, -48939, -32178, -125503, -318463, -5975, -125273, 280084, 237924, 128897, -103316, 231151, 109367, -54133, -204139, 188948, -191198, 57325, -151366, 68906, -354224, -252189, 221023, 4185, -163861, -21537, -344259, -48617, -297409, -234475, 65708, -51888, 31431, -133933, -137916, -216972, 238097, -77052, -216836, 183928, -106544, 120217, 222727, 132873, 364459, 560213, 411255, 199159, 115857, 184704, 146369, -16204, 339662, 23615, -71005, 34632, -218463, -67957, -38367, -261000, -16951, 46579, 227140, 82540, -539622, -9469, 127645, 152451, -63696, 8234, -224029, 408049, 61753, 17258, 54332, -6498, 8300, -251227]
10229C04193a63724M267F9163b66713d5806D2954J8954b38653j1852C6578b48387
10217b87796b4974k63868A10622B8555b03149j67070I9173P6429c3681l2790B2784
10205A26115b01275O4761H2748f7155A87139B2676a82604l5108A5807e11823E1857
10193a58117K725A55236K0478i0101J8223q2552N7340j47850a02592K6822j01270
10182a77040j71888h9063j63115I2723D3811a61627M4779b5728C34995f583A66966
10170f4238D1136a54459k89950c3743A28383f3257j57806B78161c05243A30968
10159B7220b53671J08162R373e2390b699j24904o0737b932l00131A69285a87563
10147b34510B00939a73527g2749c2969q5840A23966b09732g1723j58517a6946
$$ y = [304193, -163724, -159457, 69163, -266713, -45806, 42954, 61908, -238653, -250505, 36578, -248387, -287796, -24974, -288842, 110622, 28555, -203149, -370219, 99173, 175602, -33681, -66471, 22784, 126115, -201275, -136514, 82748, -67155, 187139, 22676, -182604, -217712, 15807, -511823, 51857, -158117, -155392, 155236, 175714, -90101, -71878, -154430, -97090, -244940, -102592, -75770, -177040, -348928, -89063, -252178, 92723, 43811, -161627, -116848, -25728, 334995, -6583, 166966, -64238, 41136, -154459, -444409, -33743, 128383, -63257, -221063, 278161, -305243, 130968, 27220, -253671, -145509, -136136, -52390, -2699, -127603, -188340, -2932, -303063, 169285, -187563, -234510, 200939, -173527, -72749, -32969, -118809, 123966, -209732, -71723, -230240, -16946]
10136B9829J28736a33760k6936K9345C21949E3247K30377j38506J20310a297j55488
10125a56785A33063a33138a03j8484n9404p7035L3688p1178A5877K10824D5248
10113c67162A11206b65111h5384j11521k39585a89751b5111A3379a49048j6890
10103a65938d8893A50768F5074k7589a80264A58755d12327a62911E5677c74954
10092a25937j6518j6500B19599d4609j82742j74542a19474I7513a41658m4492
10082a86150O5743A58906k7870L40330c15757J40942j64165B39386a15258j35513
10072b50771A08901K5793j9880N1889K2512c9572r8657J95A51950J18143D7887
10060H8950a63573j2869b5526j83747a2867q5185F0306M325N2510d28861A60883
$$ y = [29829, 158565, -133760, -160696, -131351, 321949, 53247, 283624, 145118, 265428, -1297, -156785, 133063, -133138, -103, -18587, -77991, -155026, -121338, -192516, 15877, 226701, 45248, -367162, 111206, -265111, -85384, -196905, -436490, -189751, -25111, 13379, -149048, -165938, -48893, 150768, 65074, 37485, -180264, 158755, -412327, -162911, 55677, -374954, -125937, -142455, -158955, 219599, -44609, -227351, -401893, -119474, 97513, -141658, -186150, -120407, 158906, 131036, 471366, -315757, -174815, -338980, 239386, -115258, -250771, 108901, 134694, 114814, 166703, 189215, -39572, -138229, -138034, 151950, 270093, 47887, 88950, -163573, -176442, -25526, -209273, -12867, -98052, 60306, 64631, 117141, -428861, 160883]
10048a13596l9711k68071a45910f5735j1221A38613E4476c8795F4709b06796e0575
10036c15624a8440k6039j13528e1301h278k92297J23657k05517E1907M7720a00397
10024a72441C00575a16736j36305h7563B0951a54021I8151c43222A02312a6106
10013e9676E2169J3429d0095C8505j2769a96834P9738K1751A20191F0029i0938
10001D2629K07197A6110K6408c5716j51200q6518K6577a05308B35961c52734A50457
9989d21351B13460b5665k01567g8363r3904A24050b17138P3250H4467d22360A61287
9977A79294l6388b49479B13948f0552j12677M7236B17437a71447h4048r78H2327
9965b4354A12178K189L6144h8196k7072M2855a6344k42411g9732k78125J08677
$$ y = [-113596, -153307, -421378, -145910, -65735, -76956, 138613, 54476, -38795, 64709, -206796, -50575, -315624, -18440, -44479, -158007, -51301, -8278, -300575, -176918, -382435, 51907, 99627, -100397, -172441, 300575, -116736, -253041, -87563, 20951, -154021, 98151, -343222, 102312, -16106, -59676, 52169, 65598, -40095, 38505, 25736, -196834, -117096, -95345, 120191, 60029, -90938, 42629, 249826, 16110, 42518, -35716, -186916, -273434, -246857, -105308, 235961, -352734, 150457, -421351, 213460, -25665, -227232, -78363, -172267, 124050, -217138, -143888, 84467, -422360, 161287, 179294, 142906, -249479, 213948, -60552, -173229, -125993, 217437, -171447, -84048, -85026, 82327, -24354, 112178, 114367, 150511, -88196, -115268, -72413, -16344, -258755, -79732, -357857, -249180]
9954b49180J24413j85755a14990I175Q9053a02032j06718K8761f0342F4643c2447
9942g0408C7441b56323e3716r3797K0970D5647b3600l6288j98202B53247a03038
9930c52986C77307b19675P0086b1409l94227J10095B19929C4740c43741a69374
9919A18790b22384A87044l1476b88563H4676a27923N3225J0384j64290c6701j37132
9908a73833D2655b01425B02541I8037a75178b136j46846n6213i9276m2687D04658
9896b00509j8662B64406A12511i4893E0706c47893I0854J3495d6336A84689p5006
9885A09683a87698B36656j1324a6734m70061c251F4739b48687F515b04382L1332
9874a73050o615G7599F129J36196F1178a07824H2456a9980B8258b37756j6356
$$ y = [-249180, -124767, -310522, -114990, 9175, 98228, -102032, -208750, -179989, -60342, 64643, -32447, -70408, 37441, -256323, -53716, -147513, -126543, 45647, -23600, -59888, -258090, 253247, -103038, -352986, 377307, -219675, -149589, -21409, -415636, -305541, 219929, 34740, -343741, -169374, 118790, -222384, 187044, 155568, -288563, 84676, -127923, -74698, -64314, -228604, -36701, -173833, 42655, -201425, 202541, 98037, -175178, -2136, -148982, -205195, -99276, -141963, 404658, -200509, -219171, 264406, 112511, -94893, 50706, -347893, 90854, 104349, -46336, 184689, 109683, -187698, 236656, 225332, -16734, -486795, -3251, 64739, -248687, 6515, -204382, -173050, -179665, 77599, 6129, 142325, 61178, -107824, 82456, -19980, 28258, -237756, -254112]
9863b54112Q2275j88377J71299n4298P6551k5984e0226A1382a10873m83462B9115
9851e0746H2579K15347A27372C9462L7255a72792A02854C6865K8771a44466C4634
9839a4010j41802B0080O8510a93053f0340D6063b22741f4766q5997d0619p1536
9828a12155A7641Q5647b1503H3099i4957j99482J13909k37345C3403a23845M583
9817a19262B43946j03469b25429p9395K7513r6319a4646C65969a20122j87142
9807c07264A05165k9885d0405H0103j5385a18740j1072N6232C36193G2e402B7838
9794h7702I5724i1662a6938B95893I7075C5779c50244A05557K5653a06490d3941
9782a03479B53765A08407a22306L1069l1569J0153j40278a08485j19544J11607
$$ y = [-254112, -171837, -360214, -188915, -243213, -166662, -192646, -50226, 11382, -110873, -594335, 29115, -50746, 82579, 297926, 127372, 39462, 76717, -172792, 102854, 36865, 65636, -144466, 34634, -14010, -155812, 20080, 88590, -193053, -60340, 46063, -222741, -64766, -150763, -40619, -112155, 17641, 103288, -21503, 83099, -94957, -294439, -180530, -417875, 33403, -123845, -119262, 243946, 140477, -225429, -304824, -277311, -373630, -14646, 365969, -120122, -307264, 105165, 75280, -40405, 80103, 64718, -118740, -129812, -73580, 336193, 72, -5402, 27838, -87702, 95724, -91662, -16938, 295893, 97075, 35779, -350244, 105557, 131210, -106490, -43941, -103479, 253765, 108407, -122306, -91237, -122806, -112653, -252931, -108485, -228029, -116422]
9772a16422A41728C5696K4039b22764A44192a20838k57478J72352j82116e9594
9761a56764A9310a94417g5787J8011p5700g685k34598P4573O2920j18955c5018
9749a03654j65123A3559b73186e8445A14059c4151j00052m6795J9326I3863a21080
9737b90933P0396J8668k4710E0320L7729a97864K736A57069J67910b30450B42323
9725a60540r1615i9172B8886b96763A4407c25234J00519B28519b74405A11896
9714d48508A38500K5421a76853q0173B95967a59171d0625n9659c0646l63453g8196
9702b06636M1147O7849k13899d1769A20763K79969D3011J52706A8421a82242j98223
9691c80465a19895C2585c58332Q5178e695A28524a01436d5250A33375a75760Q836
$$ y = [-116422, 141728, 35696, 59735, -222764, 144192, -120838, -378316, -205964, -388080, -59594, -156764, 19310, -194417, -75787, -57776, -133476, -7685, -242283, -167710, -104790, -223745, -35018, -103654, -268777, 13559, -273186, -58445, 114059, -34151, -134203, -180998, -161672, 93863, -121080, -290933, -220537, -201869, -226579, 50320, 88049, -197864, -195128, 157069, 324979, -230450, 242323, -160540, -252155, -99172, 28886, -296763, 14407, -325234, -224715, 228519, -274405, 111896, -448508, 138500, 163921, -176853, -257026, 295967, -159171, -40625, -100284, -30646, -394099, -78196, -206636, -165489, -97640, -311539, -41769, 120763, 400732, 43011, 195717, 18421, -182242, -380465, -119895, 32585, -358332, -273154, -5695, 128524, -101436, -45250, 133375, -175760, -166924]
9680a66924m963J8327j01665P1679Q2116C1831J7489b50980E0948c35485i8964
9668C19926a50694B70895H8708f7534E0944b07299b1286j13060B53321o7966a57264
9656D5331L9685a63599E4419N3542b27017a6366A08358a03325r2049B24474i6670
9644A07856d1517J6815B41382A5800K20874a57430A80666a8126k88238j9773n4755
9633c80892A50418l2198F221K09616a42783k96887K05783k4810Q2551N6800J1530
9622a07816E8659c40926N3090H038J3843d36707E1926f2499A84027e3925j35234
9611a89159A1592E181a0134k86599e4483j77437E69611f8394B46162j12149m1333
9600I2680N9656K95228h8957k285k17317A64972a99228E5829a24079E31012A93198
$$ y = [-166924, -171887, -153560, -255225, -183546, -101430, 31831, 49320, -250980, 50948, -335485, -98964, 319926, -150694, 270895, 88708, -67534, 50944, -207299, -21286, -134346, 253321, 185355, -157264, 45331, 85016, -163599, 54419, 107961, -227017, -16366, 108358, -103325, -195374, 224474, -96670, 107856, -41517, -24702, 241382, 15800, 236674, -157430, 180666, -18126, -306364, -326137, -380892, 150418, 118220, 6221, 215837, -142783, -439670, -233887, -258697, -176146, -119346, -107816, 58659, -340926, -287836, 8038, 21881, -436707, 51926, -62499, 184027, -53925, -189159, 11592, 5181, -10134, -296733, -54483, -231920, 569611, -68394, 246162, 134013, 92680, 152336, 447564, -88957, -91242, -308559, 164972, -199228, 55829, -124079, 531012, 193198]
9588f4316q5072B01394r8759a04575E2625d0049o2444J4806G9321a80627B71690
9576d60266a93594g8980n7061k62352F4265a45386O9828k30532J45613g0855b0757
9564d991j64600O0396M0874j59828n3314k054J0413g9434P558F3096b85067C985
9551F3808J76453c76496A89372f8541k06459B9112i9339b8373I1108a85633d3319
9539a55427j72671d4997j74801J2162o778a4661j07652p2409k631H9478a24349
9527h0980o6787p1341c5503j69609B03890c50582J19231D9659J03950j2028a61629
9515C685J04561I95J41637g4637l28930A58390L6480i0441l43360a49877l36813
9504d86690A69195L5470i7019j106o4948k8444Q0953K7927K1958F730h7280A87054
$$ y = [-64316, -149388, 201394, 102635, -104575, 52625, -40049, -102493, -87687, 79321, -180627, 271690, -460266, -193594, -78980, -136041, -398393, 64265, -145386, -75558, -306090, -160477, -70855, -20757, -4991, -169591, -109195, -68321, -228149, -281463, -283517, -273104, -79434, -71876, 63096, -285067, 3985, 63808, 240261, -376496, 189372, -68541, -275000, 29112, -99339, -28373, 91108, -185633, -43319, -155427, -328098, -44997, -219798, -207636, -214414, -14661, -122313, -194722, -197353, 89478, -124349, -80980, -147767, -219108, -35503, -205112, 203890, -350582, -231351, 49659, 153609, 141581, -161629, 3685, 108246, 995, 142632, -74637, -403567, 158390, 194870, -90441, -433801, -149877, -486690, 169195, 204665, -97019, -98125, -163073, -191517, -110564, -82637, -60679, 6730, -87280, 187054]
9491b35784D8147J2991d36628C0158b18660k27032J94935M2014k2381A16506d1251
9479a34872j0952A40440c6646j04664K8223g771A39674a77918d9239g684k9774
9468c7458n3155L0229j48713G5349J71818j02467n886c2742m27555A04288J08105
9457B12393e3489a8702n5165E1797K08806A19743a60319k54238G6170c47914e0061
9445a65629l7305A57777h8183f771j96426d0468p8921J3493I9162b7671j66367
9434a94038h9374k47555B1274b15811a1505j67733C5643a79277a4377j74107M6558
9423a41926j01325B09767m214G7894M3088b9569A2847h2456k73351B3221a6119
9411e8976o4964j50782D8961a23807A2492f1172A6079Q128h1959A28186K92347
$$ y = [-235784, 48147, 61138, -436628, 30158, -218660, -445692, -250757, -208743, -231124, 116506, -41251, -134872, -145824, 140440, -36646, -141310, -113087, -7771, 139674, -177918, -49239, -7684, -37458, -90613, -60384, -209097, 75349, 247167, 144700, 138814, -32742, -460297, 104288, 212393, -53489, -18702, -73867, 51797, 260603, 119743, -160319, -414557, 76170, -347914, -50061, -165629, -202934, 157777, -88183, -6771, -203197, -40468, -119389, -105896, 99162, -27671, -194038, -89374, -336929, 21274, -215811, -11505, -179238, 35643, -179277, -14377, -188484, -141926, -243251, 209767, 205553, 77894, 120982, -29569, 12847, -82456, -355807, 23221, -16119, -58976, -123940, -274722, 48961, -123807, 12492, -61172, 16079, 24207, -81959, 128186, 420533]
9400D20533b44315g320l04682d5676C0842a40577A57081D5914A4054O563a4154
9388A94631b28278g2032b8631j83957A56188C197f9326i909k32986A5134Q977
9377B4111b9672j31313j44662B3303L6779J96304K2006b3562m6043j77706A4775
9365e615B01985i8050L6312D1565a76461h6519D0020d11071g7731J1028l48026
9354d14729C46746f6333r6422r763b3693A00526N2292a30319j09576J04183e1265
9342B9741o390K64740b07296g3844n2496A38647e3962B0938J06216F864J8347
9331B5211f9512l09412P4318a12924k85127G7671a5611C4241c26808a20256M7182
9320g3074A74216i5918J2553j61044N0139c6977m56771J38692a5570k40044j24104
$$ y = [420533, -244315, -7320, -312002, -45676, 30842, -140577, 157081, 45914, 14054, 20617, -14154, 194631, -228278, -72032, -28631, -212588, 156188, 3197, -69326, -9909, -242895, 15134, 24111, -29672, -160985, -305647, 23303, 60082, 256386, 278392, -23562, -69605, -247311, 14775, -5615, 201985, -98050, -61738, 41565, -176461, -86519, 40020, -411071, -77731, -66703, -414729, 346746, -66333, -162755, -172518, -23693, 100526, 152818, -130319, -239895, -135712, -51265, 29741, 23351, 288091, -207296, -73844, -126340, 138647, -53962, 20938, 127154, 6864, 25211, -69512, -378924, -304606, -112924, -398051, 77671, -15611, 34241, -326808, -120256, -73074, 174216, -95918, -83365, -244409, -194270, -36977, -493748, -355056, -15570, -255614, -379718]
9309c79718e398j78738B6037M3702a61159A63387C6197J6157b32785B0786J21282
9298A42068d775o291o6758B45208g980j35082l4224E4310K41467G9582J19137
9287A98719b26419d9005j03317A44109b32977B01153a42396A55783C0157c3773
9276b63433D2982c51257O3515a35551C16527a53943B2269P0276a99204O4802j38298
9265b72700A86189h4334I539b23015h8479C2116N414E301K27862c01829d2855
9253a976l8070m39397E0464K7227d8846C25490b33289o7207l4341a07676j51157
9242b58833H3787f1373o5113G2559P1537n2884c98359a88050B4367a0957A32132
9230a8656r66q6177M0002A84280d3433a7264e569A01320a64595f7155l8179c0100
$$ y = [-379718, -5398, -184136, 26037, 69739, -161159, 163387, 36197, 52354, -232785, 20786, 142068, -4775, -11066, -77824, 245208, -7980, -143062, -177286, 54310, 295777, 79582, 198719, -226419, -49005, -152322, 144109, -232977, 201153, -142396, 155783, 30157, -33773, -263433, 42982, -351257, -287742, -135551, 316527, -153943, 22269, 92545, -199204, -134402, -272700, 186189, -84334, 9539, -223015, -88479, 32116, 37530, 5301, 233163, -301829, -42855, -1976, -40046, -479443, 50464, 77691, -48846, 325490, -233289, -300496, -334837, -107676, -258833, 83787, -61373, -126486, 72559, 144096, 91212, -398359, -188050, 24367, -10957, 132132, -18656, -19622, -105799, -65797, 184280, -43433, -17264, -5569, 101320, -164595, -67155, -105334, -30100]
9217B01465L25755E3426a17526j6490A21124a01982a8174F1935f4568A20331N4624
9206A74955D3091c50988f6650m0450A08173J55909a74100j01231B03846b87510
9195f231G7370J87375c88317i7536N489a122A6036a66026j16261J05383K0472
9184a56432D565c60479c4324j24009P8360I0131a90284h868k54993g4069k07570
9173b81639C48577a40974a5819k21430Q9151C89978b05862c9835j44180d1734
9162b29950P3582P2460a4403B30994J14614b50547B28181b05064i427n28502H7960
9150b80880R0613C08966G7328a65394L2426L0654B07091b25794R9635k1250q1638
9139b29047J11765B936N7391b27783A9891B665b52680K4217m8300a34257K5399
$$ y = [201465, 527220, 53426, -117526, -134016, 121124, -101982, -18174, 61935, -64568, 120331, 174955, 43091, -350988, -66650, -107100, 108173, 264082, -174100, -275331, 203846, -287510, -6231, 77370, 264745, -388317, -97536, -92047, -1122, 16036, -166026, -282287, -176904, -156432, 4565, -360479, -34324, -158333, -79973, 90131, -190284, -8868, -263861, -74069, -281639, 348577, -140974, -15819, -237249, -148098, 389978, -205862, -39835, -184015, -41734, -229950, -156368, -83908, -14403, 230994, 345608, -250547, 228181, -205064, -9427, -537929, 87960, -280880, -190267, 308966, 77328, -165394, -132968, -102314, 207091, -225794, -126159, -147409, -229047, -117282, 2936, 60327, -227783, 19891, 2665, -252680, -228463, -276763, -134257, -108858]
9128a08858o6543N5218B05374a75074o2434f5385I9467c24514M4085a29401K8723
9117a00678k10176a09940k018G4107r115P7573p0173J5123c64578a76182N9296
9106a16886M9428D5890b43740c189j23574B43868A17327a25557C9731F57e05562
9094a8290A56658c32596b1640C88557A15663A6792P0560c34090I1211a14916m0154
9083a55070P1443j18455q9785G1504a8812k4125H5385a66560B61955a45967C50737
9071G6315k0856i016l03831Q9262m3218Q9733b3473H9677m301b90512G3383e5836
9058G4221a33854f3995a6275C09431a0749A0247J44570a9980k90991c2472A0573
9046A86686A1002L4252a9644A20717l9510b2620p1643k15365C95905b54712A43888
$$ y = [-108858, -175401, -120183, 205374, -175074, -237508, -65385, 99467, -324514, -280429, -129401, -100678, -310854, -109940, -111958, 74107, 64992, 142565, 72392, 87515, -364578, -176182, -116886, -67458, 45890, -243740, -3189, -126763, 243868, 117327, -125557, 39731, 657, -505562, -18290, 156658, -332596, -21640, 388557, 115663, 16792, 87352, -334090, 91211, -114916, -155070, -83627, -202082, -291867, 71504, -18812, -42937, 85385, -166560, 261955, -145967, 350737, 76315, 55459, -9016, -312847, -223585, -266803, -177070, -23473, 89677, 85376, -290512, 73383, -55836, 74221, -133854, -63995, -16275, 309431, -10749, 10247, 154817, -19980, -310971, -32472, 10573, 186686, 11002, 45254, -19644, 120717, 81207, -22620, -94263, -309628, 395905, -254712, 143888]
9034f6279j34995j34808A90381a38480a8510q2508j04377i3327B69870b01837
9023b14566c8930C4765b03454G0689b06261E6585J11090b76442a16486Q529c3197
9011A58565G7509l4725f1200o4441E8919J77251F2287a29732A7246a62145A45636
8999a3809j80773A68284H0740c5334n3359j44577a11889C9803I448b1671q8061
8988a09732C9234b00962C31759g7218k57940J17791a07867B37508b18205i4617
8977b15818F4618a833j15857P592M1697a9274k82964c4002l55596C9265O4471
8966A03736C2018J83c33532C31432a53133j29792E3589b06964j23406A02794a59026
8954B6635b21116M0719d2777l0425m8378p4609j63881A8104L3725A0015a34512
$$ y = [-66279, -201274, -336082, 190381, -138480, -18510, -101018, -205395, -93327, 269870, -201837, -214566, -38930, 34765, -203454, 70689, -206261, 56585, 167675, -276442, -116486, -107957, -33197, 158565, 77509, 42784, -61200, -125641, 58919, 236170, 62287, -129732, 17246, -162145, 145636, -13809, -194582, 168284, 80740, -35334, -88693, -233270, -111889, 39803, 9448, -21671, -109732, 39234, -200962, 331759, -77218, -335158, -217367, -107867, 237508, -218205, -94617, -215818, 64618, -1833, -117690, -110098, -68401, -19274, -302238, -34002, -389598, 39265, 103736, 32018, 32201, -333532, 331432, -153133, -282925, 53589, -206964, -330370, 102794, -159026, 26635, -221116, -180397, -42777, -73202, -121580, -196189, -360070, 18104, 51829, 10015, -134512]
8942c11403d4576j10691p8265O3223g1022B33020k3880D5978Q3393c1709j82813
8931b14522a02971j90703A27193a04710j45390d468k19227j0799P9997C38214
8920C68309b1782A20144c77568a68871l820A10402c09581e1413A41227a14288
8909g7661K3339J1996I8221P0200A5936a82303k20949B05110b53165J01639o836
8898a58362o3805M0084f8533j95632g7216n7971A37705c22343A44684b3877j10089
8887a33966e0301j22335c8675B32801f7272p205j17464h4005l69741J49078Q2817
$$ y = [-311403, -44576, -155267, -233532, -170309, -71022, 233020, 209140, 45978, 129371, -31709, -214522, -102971, -293674, 127193, -104710, -250100, -4468, -223695, -234494, -154497, 338214, 368309, -21782, 120144, -377568, -168871, -172691, 110402, -309581, -51413, 141227, -114288, -77661, -54322, -42326, 98221, 168421, 15936, -182303, -403252, 205110, -253165, -151526, -158362, -222167, -182083, -68533, -264165, -77216, -135187, 137705, -322343, 144684, -23877, -133966, -50301, -172636, -38675, 232801, -67272, -74477, -191941, -84005, -453746, -304668, -221851]
$$ [...]
##END NTUPLES=NMR SPECTRUM
##END=
