##TITLE=AC1471_13FE002653_8027014_YZZf2qlXnJ
##JCAMPDX= 6.0         $$ Bruker NMR JCAMP-DX V2.0
##DATA TYPE= NMR SPECTRUM
##DATA CLASS= NTUPLES
##ORIGIN= BRUKER
##OWNER= Administrator
$$ 1.72 TOPSPIN		Version 2.1
$$ 2013-07-11 21:22:08.456 -0700  Administrator@X
$$ Compression mode = diff/dup
##.OBSERVE FREQUENCY= 400.02188249412
##.OBSERVE NUCLEUS= ^1H
##.ACQUISITION MODE= SIMULTANEOUS (DQD)
##.ACQUISITION SCHEME= undefined
##.AVERAGES= 64
##.DIGITISER RES= 22
##SPECTROMETER/DATA SYSTEM= spect
##.PULSE SEQUENCE= noesygpps1d.comp
##.SOLVENT NAME= COFFEE_meoh
##.SHIFT REFERENCE= INTERNAL, COFFEE_meoh, 1, 14.9607
##AUDIT TRAIL= $$ (NUMBER, WHEN, WHO, WHERE, PROCESS, VERSION, WHAT)
$$ ##TITLE= Audit trail, TOPSPIN		Version 2.1
$$ ##JCAMPDX= 5.01
$$ ##ORIGIN= Bruker BioSpin GmbH
$$ ##OWNER= Administrator
$$ $$ E:\/data/COFFEE/nmr/AC1471_13FE002653_8027014_YZZf2qlXnJ/12/pdata/1/auditp.txt
$$ ##AUDIT TRAIL=  $$ (NUMBER, WHEN, WHO, WHERE, PROCESS, VERSION, WHAT)
(   1,<2013-07-11 21:22:03.518 -0700>,<Administrator>,<X>,<go>,<TOPSPIN 2.1>,
      <created by zg
	started at 2013-07-11 21:10:34.018 -0700,
	POWCHK enabled, PULCHK disabled,
       configuration hash MD5:
       C8 4E 4E 5D D3 5C D8 9E 9F 52 82 E0 59 8A DE 15
       data hash MD5: 64K
       FA 1D 49 5E 96 F3 C2 1A 4A 63 9C 1C 53 AA BA 1D>)
(   2,<2013-07-11 21:22:06.409 -0700>,<Administrator>,<X>,<proc1d>,<TOPSPIN 2.1>,
      <Start of raw data processing
       efp LB = 0.3 FT_mod = 6 PKNL = 1 PHC0 = 0 PHC1 = 0 SI = 128K 
       data hash MD5: 128K
       A7 54 60 15 88 DD C1 A6 9E 43 E1 02 21 33 E8 0F>)
(   3,<2013-07-11 21:22:07.409 -0700>,<Administrator>,<X>,<proc1d>,<TOPSPIN 2.1>,
      <pk PHC0 = -82.75452 PHC1 = 0 
       data hash MD5: 128K
       F3 5C 8B A6 DB 5E 27 9C 56 04 46 EA 87 CF 7B 3F>)
(   4,<2013-07-11 21:22:07.893 -0700>,<Administrator>,<X>,<proc1d>,<TOPSPIN 2.1>,
      <abs ABSG = 1 
       data hash MD5: 128K
       D7 E8 E3 17 EF F9 B3 E7 62 B7 9B 29 E6 A3 52 2E>)
(   5,<2013-07-11 21:22:08.003 -0700>,<Administrator>,<X>,<proc1d>,<TOPSPIN 2.1>,
      <abs ABSG = 2 
       data hash MD5: 128K
       2E BA 81 D8 33 ED E1 78 2F 3B 51 41 54 02 22 66>)
(   6,<2013-07-11 21:22:08.081 -0700>,<Administrator>,<X>,<proc1d>,<TOPSPIN 2.1>,
      <abs ABSG = 3 
       data hash MD5: 128K
       91 FA 24 37 68 53 ED 28 F1 60 98 25 9B 99 B7 10>)
(   7,<2013-07-11 21:22:08.159 -0700>,<Administrator>,<X>,<proc1d>,<TOPSPIN 2.1>,
      <abs ABSG = 4 
       data hash MD5: 128K
       90 1A 86 BB 2E 29 2E 3B 83 EE 46 EF 24 62 CA 75>)
(   8,<2013-07-11 21:22:08.237 -0700>,<Administrator>,<X>,<proc1d>,<TOPSPIN 2.1>,
      <abs ABSG = 5 
       data hash MD5: 128K
       42 2E 2F A5 C9 0E 78 57 09 04 7E 0F 3E FF 00 48>)
$$ ##END=
$$ 
$$ $$ hash MD5
$$ $$ BB 47 9B 8C E0 C8 8E 40 C2 22 94 B7 9A D4 40 35
##$RELAX= 
##$RELAX= 
##$RELAX= 
##$RELAX= 
##$RELAX= 
##$RELAX= 
##$RELAX= 
##$RELAX= 
$$ Bruker specific parameters
$$ --------------------------
##$DU= <E:\>
##$EXPNO= 12
$$ [...]
150 150 150 150 150 150 150 150
##$TP07= 0
##$TPNAME0= <>
##$TPNAME1= <>
##$TPNAME2= <>
##$TPNAME3= <>
##$TPNAME4= <>
##$TPNAME5= <>
##$TPNAME6= <>
##$TPNAME7= <>
##$TPOAL= (0..7)
0.5 0.5 0.5 0.5 0.5 0.5 0.5 0.5
##$TPOFFS= (0..7)
0 0 0 0 0 0 0 0
##$TUNHIN= 0
##$TUNHOUT= 0
##$TUNXOUT= 0
##$USERA1= <user>
##$USERA2= <user>
##$USERA3= <user>
##$USERA4= <user>
##$USERA5= <user>
##$V9= 5
##$VALIST= <valist>
##$VCLIST= <CCCCCCCCCCCCCCC>
##$VD= 0
##$VDLIST= <DDDDDDDDDDDDDDD>
##$VPLIST= <PPPPPPPPPPPPPPP>
##$VTLIST= <TTTTTTTTTTTTTTT>
##$WBST= 1024
##$WBSW= 4
##$XGAIN= (0..3)
0 0 0 0
##$XL= 0
##$YL= 0
##$YMAX_a= 6572116
##$YMIN_a= -11818133
##$ZGOPTNS= <>
##$ZL1= 120
##$ZL2= 120
##$ZL3= 120
##$ZL4= 120
##$ABSF1= 14.9607
##$ABSF2= -5.597482
##$ABSG= 5
##$ABSL= 3
##$ALPHA= 0
##$AQORDER= 0
##$ASSFAC= 0
##$ASSFACI= 0
##$ASSFACX= 0
##$ASSWID= 0
##$AUNMP= <proc_prof1d_extract.lims>
##$AXLEFT= 0
##$AXNAME= <>
##$AXNUC= <1H>
##$AXRIGHT= 0
##$AXTYPE= 0
##$AXUNIT= <>
##$AZFE= 0.1
##$AZFW= 0.1
##$BCFW= 0
##$BC_mod= 0
##$BYTORDP= 0
##$COROFFS= 0
##$CY= 15
##$DATMOD= 1
##$DC= 0
##$DFILT= <>
##$DTYPP= 0
##$F1P= 0
##$F2P= 0
##$FCOR= 0.5
##$FTSIZE= 131072
##$FT_mod= 6
##$GAMMA= 0
##$GB= 0
##$INTBC= 1
##$INTSCL= 1
##$ISEN= 128
##$LB= 0.3
##$LEV0= 0
##$LPBIN= 0
##$MAXI= 10000
##$MC2= 0
##$MEAN= 0
##$ME_mod= 0
##$MI= 0
##$NCOEF= 0
##$NC_proc= -2
##$NLEV= 6
##$NOISF1= 0
##$NOISF2= 0
##$NSP= 0
##$NTH_PI= 0
##$NZP= 0
##$OFFSET= 14.9607
##$PC= 1
##$PHC0= -82.75452
##$PHC1= 0
##$PH_mod= 1
##$PKNL= yes
##$PPARMOD= 0
##$PPDIAG= 0
##$PPIPTYP= 0
##$PPMPNUM= 2147483647
##$PPRESOL= 1
##$PSCAL= 4
##$PSIGN= 0
##$PYNMP= <proc.py>
##$REVERSE= no
##$SF= 400.020009756335
##$SI= 131072
##$SIGF1= 0
##$SIGF2= 0
##$SINO= 400
##$SIOLD= 131072
##$SPECTYP= <>
##$SREGLST= <1H.CDCl3>
##$SSB= 0
##$STSI= 131072
##$STSR= 0
##$SW_p= 8223.68421052631
##$SYMM= 0
##$S_DEV= 0
##$TDeff= 65536
##$TDoff= 0
##$TI= <>
##$TILT= no
##$TM1= 0
##$TM2= 0
##$TOPLEV= 0
##$USERP1= <user>
##$USERP2= <user>
##$USERP3= <user>
##$USERP4= <user>
##$USERP5= <user>
##$WDW= 1
##$XDIM= 131072
##$YMAX_p= 384866733
##$YMIN_p= -11553
##$CURPLOT= <Network HP LaserJet P1505>
##$CURPRIN= <$Network HP LaserJet P1505>
##$DFORMAT= <normdp>
##$LAYOUT= <+/1D_H.xwp>
##$LFORMAT= <normlp>
##$PFORMAT= <normpl>
##$SURQMSG= 1
$$ End of Bruker specific parameters
$$ ---------------------------------
##NTUPLES= NMR SPECTRUM
##VAR_NAME=  FREQUENCY,     SPECTRUM/REAL,   SPECTRUM/IMAG
##SYMBOL=    X,             R,               I
##VAR_TYPE=  INDEPENDENT,   DEPENDENT,       DEPENDENT
##VAR_FORM=  AFFN,          ASDF,            ASDF
##VAR_DIM=   131072,        131072,          131072
##UNITS=     HZ,            ARBITRARY UNITS, ARBITRARY UNITS
##FACTOR=    0.0627417313425164, 1,          1
##FIRST=     8223.62146879497, -1381,        -57039
##LAST=      0,             -25,             -57009
##MIN=       0,             -11553,          0
##MAX=       8223.62146879497, 384866733,    0
$$ Real data points
##PAGE= N=1
##DATA TABLE= (X++(R..R)), XYDATA
$$ [...]
63953F87560N2447N9821O8332P7735Q7948R9048J10715J22193J32761J42029J49924
63942A790513J56613J62225J66255J67510J65041J58824J49120J35553J17756
63933C169410R6705P4400N1939K8798M309k0898m5523o8943r1096j11380j28485
63922B959236j41444j50342j55857j58487j58352j55557j50552j44046j36489
63913A608110j27818j17957j07514r7480q8188p9121o9959o1225n3526m6709m0396
63902G18217l4809l0361k6751k3297k0043j7632j6080j4500j2299r877p902o472
63890D98194n351m356l164j291J222L546M973N821P037R092J1746J4523J7002
63877E58994J8856K0137K1328K2721K3940K4546K4872K5607K6620K6966K6123
$$ plain form
63953 687560 740007 799828 868160 945895 1033843 1132891 1243606 1365799 1498560 1640589 1790513
63942 1790513 1947126 2109351 2275606 2443116 2608157 2766981 2916101 3051654 3169410
63933 3169410 3266115 3340515 3392454 3421252 3425561 3404663 3359140 3290197 3199101 3087721 2959236
63922 2959236 2817792 2667450 2511593 2353106 2194754 2039197 1888645 1744599 1608110
63913 1608110 1480292 1362335 1254821 1157341 1069153 990032 920073 858848 805322 758613 718217
63902 718217 683408 653047 626296 602999 582956 565324 549244 534744 522445 512568 504666 498194
63890 498194 492843 488487 485323 484032 485254 488800 493773 499594 506631 515723 527469 541992 558994
63877 558994 577850 597987 619315 642036 665976 690522 715394 741001 767621 794587 820710
63866H20710K4635K3184K1616J9234J5730J1432O827K278j986n945r810j3734
63854I14171j7493k0665k3099k4980k6431k7394k7956k8509k9277k9831k9471
63843F29065k8218k7016k6651k6661k5832k3745k1346j9741j8889j7890j6268
63832C76808j4453j3112j2432j2129j1803j1180j0298r463q892q425p839p284
63820B49498p076p044o586n482m239l459l173k990k567j783p89r4k66j244k191
63805B00515k384k047j997k556l201l231k574j861j723k010j806n36J032J435
63791A77056K95j153j596j151p78p76p27n36o07r18r12m55j99n74j135j271j009
63774A63554p16m58j10K36M17M76M08L1m87m01O62J805J705K89j098j349p16j49
$$ plain form
63866 820710 845345 868529 890145 909379 925109 936541 943368 945646 943660 937715 927905 914171
63854 914171 896678 876013 852914 827934 801503 774109 746153 717644 688367 658536 629065
63843 629065 600847 573831 547180 520519 494687 470942 449596 429855 410966 393076 376808
63832 376808 362355 349243 336811 324682 312879 301699 291401 281938 273046 264621 256782 249498
63820 249498 242422 235378 228792 223310 219071 215612 212439 209449 206882 205099 204310 204216 203950 202706 200515
63805 200515 198131 196084 194087 191531 188330 185099 182525 180664 178941 176931 175125 174589 175621 177056
63791 177056 177351 176198 174602 173451 172673 171897 171170 170634 170027 169109 168197 167742 167543 166969 165834 164563 163554
63774 163554 162838 162380 162270 162506 162923 163399 163807 163838 163351 162950 163612 165417 167122 167411 166313 164964 164248 164099
63756A64099j05l97p12q47o45j28M49R44J508K170K528K218J559J223J399J688
63740A76951J874K188K713L011K755K381K550L241L775L757L467L308L333L559
63726B18863M275N676P311Q329Q249P282N985M766L711K633J270l75j926l014
63712B73035l671m157m480m490m327m391m660m570l796k775k114j785j357p13
63698B25749j9P56J655K152J631N42K40J248K496K884K877L617M915N395M594
63683B60732L656L547L633K846J464P96J408K570L357L525L251K767K415K569
63669B98536L157L651L608K954J770J90j424k675l590m476n229n385n004m869
63655B81214n391n909n609m668l899l573l283k739k051j311n00J61L81L30N34
$$ plain form
63756 164099 163994 163597 162885 162038 161393 161265 161714 162658 164166 166336 168864 171082 172641 173864 175263 176951
63740 176951 178825 181013 183726 186737 189492 191873 194423 197664 201439 205196 208663 211971 215304 218863
63726 218863 223138 228814 236125 244454 252703 259985 265970 270736 274447 277080 278350 277975 276049 273035
63712 273035 269364 265207 260727 256237 251910 247519 242859 238289 234493 231718 229604 227819 226462 225749
63698 225749 225730 226486 228141 230293 231924 232466 232706 233954 236450 239334 242211 245828 250743 256138 260732
63683 260732 264388 267935 271568 274414 275878 276674 278082 280652 284009 287534 290785 293552 295967 298536
63669 298536 301693 305344 308952 311906 313676 313866 312442 309767 306177 301701 296472 291087 286083 281214
63655 281214 275823 269914 264305 259637 255738 252165 248882 246143 244092 242781 242281 242442 242823 243153 243687
63640B43687J220K200L361M683N742N911N282M821N305O517P792Q842R689J0309
63626C25361J0818J1651J3006J4420J5433J6386J7974K0172K2213K3682K5026
63615E16142K6863K9237L1763L3993L5435L5534L4007L1041K6952K1864J5948
63604H38779R746L953j002m940p596q708q475p672p183p508q748j0828j3596j6805
63590G49417k0128k3141k5316k6232k5895k4793k3417k1836j9896j7672j5544
63579E05547j3760j2132j0259p965n502l388j957r27M28K482M772O618Q097R872
63565D81926J2018J3728J4489J4944J6040J7809J9648K1432K3562K6008K8171
63554F89775K9930L2089L5433L9616M3191M4362M1719L4886K4965J4050M042l996
$$ plain form
63640 243687 244907 247107 250468 255151 260893 266804 272086 276907 282212 288729 296521 305363 315052 325361
63626 325361 336179 347830 360836 375256 390689 407075 425049 445221 467434 491116 516142
63615 516142 543005 572242 604005 637998 673433 708967 742974 774015 800967 822831 838779
63604 838779 848525 852478 851476 846536 838940 830232 821757 814085 806902 799394 790646 779818 766222 749417
63590 749417 729289 706148 680832 654600 628705 603912 580495 558659 538763 521091 505547
63579 505547 491787 479655 469396 461431 455929 452541 450584 449657 450085 452567 457339 463957 472054 481926
63565 481926 493944 507672 522161 537105 553145 570954 590602 612034 635596 661604 689775
63554 689775 719705 751794 787227 826843 870034 914396 956115 991001 1015966 1030016 1034058 1030062
63542A030062r538j2376j2999j2516j1647j0232q110o054n186n843p631j0359
63530I17571j4085j8382k2338k5487k8182l0816l3167l4731l5261l4768l3326
63519F07028l1157k8670k6130k3507k0791j8264j6218j4636j3298j2045j0805
63508C91507r525q312p396o753n957m700l345k643k836l351l474l075k533k063
63494C25544j446m93M65Q11L88j95j63O51J791K813L702M638N626O467O941O895
63478C64435O274N251M203L388K670J717M32r83k400l954n679p166p882p872p823
63463C44611q214q572p943o101l968k657k293k065j273J00J790L730N761P263
63449C20169P677P375P549R043J1608J4543J7654K1210K5199K9196L2787L5541
$$ plain form
63542 1030062 1020524 1008148 995149 982633 970986 960754 952644 946590 941404 935561 927930 917571
63530 917571 903486 885104 862766 837279 809097 778281 745114 710383 675122 640354 607028
63519 607028 575871 547201 521071 497564 476773 458509 442291 427655 414357 402312 391507
63508 391507 381982 373670 366274 359521 353564 348864 345519 342876 340040 336689 333215 330140 327607 325544
63494 325544 324098 323605 324070 324881 325269 325074 324911 325562 327353 330166 333868 338506 344132 350599 357540 364435
63478 364435 370709 375960 380163 383551 386221 387938 388370 387387 384987 381033 375354 368188 360306 352434 344611
63463 344611 336397 327825 319882 313781 309813 307156 304863 302798 301525 301625 303415 307145 312906 320169
63449 320169 327846 335221 342770 351813 363421 377964 395618 416828 442027 471223 504010 539551
63437E39551L6530L4616K9663K3025J6462J0901O577L869L290M826P886J1925
63425G29121J6572K1283K5511K9353L3363L7528M0813M1958M0342L5984K9239
63414A081067K0819J1776L151m163r291j1657j1743j1055j0841j1195j1699j2595
63402A022574j4774j8710k3831k8945l3040l5694l6986l7040l5887l3801l1504
63391F92362k9492k7361k4448k1098j8381j6496j4464j1739r024o860m578j595
63379E06826J246K850L646M875O650Q175R535J1652J4524J7065J8915K0957K3612
63366F50528K6019K7572K9032L1284L3942L6034L7367L8321L8764L7955L5212
63355A022030L0269K3374J5446P745J017m630q931j1297j1791j1463j1214j1108
$$ plain form
63437 539551 576081 610697 640360 663385 679847 690748 697325 701194 704484 709310 717196 729121
63425 729121 745693 766976 792487 821840 855203 892731 933544 975502 1015844 1051828 1081067
63414 1081067 1101886 1113662 1116813 1112650 1103359 1091702 1079959 1068904 1058063 1046868 1035169 1022574
63402 1022574 1007800 989090 965259 936314 903274 867580 830594 793554 757667 723866 692362
63391 692362 662870 635509 611061 589963 571582 555086 540622 528883 519859 512999 508421 506826
63379 506826 508072 510922 514568 519443 526093 534268 543803 555455 569979 587044 605959 626916 650528
63366 650528 676547 704119 733151 764435 798377 834411 871778 910099 948863 986818 1022030
63355 1022030 1052299 1075673 1091119 1098864 1099881 1095251 1086320 1075023 1063232 1051769 1040555 1029447
63343A029447j1271j2578j5574j9507k3256k6659k9996l2769l4100l3996l3150
63332G56591l1805k9746k7210k4668k1704j7282j1370n613k087j911m951j0016
63320E68228j5205j8837k0461k0626j9786j8052j5891j4113j2940j1863j0666
63309C89788r754r180q211o471m811m298m758n081m717m182m096m358m436m062
63295C11373l445k948k749k803k997l257l378l031k143j223r47j403j990k154
63281B76905j902j592j488j630j847j750j061p2M23n7j104j823j661p84J75O73
63265B61405P09P73J241J871K157K055K043K440L073L664M124M334M112L646L548
63250C01195M209N341O449P466Q543R566J0232J0579J1086J2251J4165J6351J8013
$$ plain form
63343 1029447 1018176 1005598 990024 970517 947261 920602 890606 857837 823737 789741 756591
63332 756591 724786 695040 667830 643162 621458 604176 592806 587193 585106 583195 578244 568228
63320 568228 553023 534186 513725 493099 473313 455261 439370 425257 412317 400454 389788
63309 389788 380034 370854 362643 356172 351361 347063 342305 337224 332507 328325 324229 319871 315435 311373
63295 311373 307928 304980 302231 299428 296431 293174 289796 286765 284622 283399 282452 281049 279059 276905
63281 276905 275003 273411 271923 270293 268446 266696 265635 265563 265986 265929 264825 263002 261341 260557 260732 261405
63265 261405 262114 262887 264128 265999 268156 270211 272254 274694 277767 281431 285555 289889 294001 297647 301195
63250 301195 305404 310745 317194 324660 333203 342769 353001 363580 374666 386917 401082 417433 435446
63237D35446J8693J8833J9312K0369K1338K1667K1645K1765K1874K1594K1180
63226F63716K1185K1463K1341K0794K0658K1428K2491K2884K2250K0677J8146
63215H97033J4578J0187N266j07n783j1182j5713j9417k2789k5948k8438k9890
63203G67797l0371l0010k8641k6120k2715j8934j5201j1844r088o754m169q72
63191E63078K668N490P383R275J2117J5593J8360J9496J9420J9257J9582K0098
63179G31817K0424K0779K1519K2338K2412K1456K0120J8979J7561J4929J1001
63168I43335O685K679j293n806j0865j6016k0960k5618k9774l3031l5094l5934
63156G38308l5758l4900l3583l1728k9245k6554k4395k2909k1368j9174j6637
$$ plain form
63237 435446 454139 472972 492284 512653 533991 555658 577303 599068 620942 642536 663716
63226 663716 684901 706364 727705 748499 769157 790585 813076 835960 858210 878887 897033
63215 897033 911611 921798 927064 926957 921174 909992 894279 874862 852073 826125 797687 767797
63203 767797 737426 707416 678775 652655 629940 611006 595805 583961 574873 568119 563950 563078
63191 563078 565746 571236 578619 587894 600011 615604 633964 653460 672880 692137 711719 731817
63179 731817 752241 773020 794539 816877 839289 860745 880865 899844 917405 932334 943335
63168 943335 950020 952699 951406 945600 934735 918719 897759 872141 842367 809336 774242 738308
63156 738308 702550 667650 634067 602339 573094 546540 522145 499236 477868 458694 442057
63145D42057j4390j2468j0590q953p957p375o555n458m629m193l620k725k070
63132C51074j981j934j324m03J18n1o76j397j750j252k3J016J186R95J436K506
63116C47540L213K994K423K227K282K017J373Q63Q21J096J435J791K098K080J575
63101C75828R34P83J295J944K115J761J209N96r1n52k88N68J172J047Q42J454
63085C90617K676L423L256K995L526M603N300N267N005N026N331N781O477P508
63071D56791Q675R809J1098J2725J4321J5306J5771J6572J8340K0802K3316K5693
63059F49219K8171L0870L3671L6561L9576M2508M4909M6484M7275M7613M8057
63048A094914M9111N0561N1359N0744M9324M8536M9006N0054N0864N1418N2040
$$ plain form
63145 442057 427667 415199 404609 395656 387699 380324 373769 368311 363682 359489 355869 353144 351074
63132 351074 349093 347159 345835 345432 345550 345499 344823 343426 341676 340424 340401 341417 342603 343598 345034 347540
63116 347540 350753 353747 356170 358397 360679 362696 364069 364932 365753 366849 368284 370075 372173 374253 375828
63101 375828 376762 377545 378840 380784 382899 384660 385869 386465 386374 385822 385534 386102 387274 388321 389163 390617
63085 390617 393293 396716 399972 402967 406493 411096 416396 421663 426668 431694 437025 442806 449283 456791
63071 456791 465466 475275 486373 499098 513419 528725 544496 561068 579408 600210 623526 649219
63059 649219 677390 708260 741931 778492 818068 860576 905485 951969 999244 1046857 1094914
63048 1094914 1144025 1194586 1245945 1296689 1346013 1394549 1443555 1493609 1544473 1595891 1647931
63037A647931N2610N2562N1232M7941M2269L4542K5685J6265O132m785j5977k6945
63025A929462l7625m7552n5390o0147o2473o3805o4402o3225n9702n4608m8943
63014A311590m2882l6268k9472k3064j6992j0727m094K443Q324J3434J8098K2631
63002A213021K6985L0769L3702L5901L7637L8836L9201L8806L8275L8165L8297
62991A609595L7872L6241L3464L0063K6238K1390J4673O046l491j2910k2138l1676
62979A745367m1453n0484n7722o2893o6427o8858p0284p0282o8349o4624o0003
62968A063988n5375n0944m6664m2970m0357l8378l5848l2312k8593k5596k3225
62957F43726k0931j8753j7149j6149j5347j4560j3879j3146j2054j0792r986r830
$$ plain form
63037 1647931 1700541 1753103 1804335 1852276 1894545 1929087 1954772 1971037 1977169 1972384 1956407 1929462
63025 1929462 1891837 1844285 1788895 1728748 1666275 1602470 1538068 1474843 1415141 1360533 1311590
63014 1311590 1268708 1232440 1202968 1179904 1162912 1152185 1148091 1150534 1158858 1172292 1190390 1213021
63002 1213021 1240006 1270775 1304477 1340378 1378015 1416851 1456052 1494858 1533133 1571298 1609595
62991 1609595 1647467 1683708 1717172 1747235 1773473 1794863 1809536 1815582 1812091 1799181 1777043 1745367
62979 1745367 1703914 1653430 1595708 1532815 1466388 1397530 1327246 1256964 1188615 1123991 1063988
62968 1063988 1008613 957669 911005 868035 827678 789300 753452 721140 692547 666951 643726
62957 643726 622795 604042 586893 570744 555397 540837 526958 513812 501758 490966 480980 471150
62945D71150r735r145q274p696p537p532p673q134q566q089o388m384l373l601
62931C71023m232m552m592m542m219l517k794k335j869j172q12j510k930l895
62917C28052l798l097k359j627q90m29k53O6M97K25j120k506k574j359j00L93
62901C09121L53J64r3k29J25P81J012N74Q6J0qk69k73M37J222J111L06k1N63J278
62881C16250J464J458J708J861J440P90N87O87L28o22j404j448j049p35n32k04
62865C20579K02L83K52K3KL85J040J442J124L64K2M96J217J544J659K080K639
62848C35453K644J942J095N31J16k62l43RN00Q69J209J516J425P95J84K15O83
62831C48581Q71O47O21J200J961K246J986J707J851K454L274M028M397M124L332
$$ plain form
62945 471150 461415 452270 443996 436300 428763 421231 413558 405424 396858 388769 382381 377997 374624 371023
62931 371023 366791 362239 357647 353105 348886 345369 342575 340240 338371 337199 336387 334877 331947 328052
62917 328052 324254 321157 318798 317171 316281 315852 315599 315665 316162 316387 315267 312761 310187 308828 308728 309121
62901 309121 309474 309638 309545 309316 309441 310222 311234 311808 311894 311904 311896 311627 311354 311791 313013 314124 314430 314409 314972 316250
62881 316250 317714 319172 320880 322741 324181 324971 325558 326245 326573 325951 324547 323099 322050 321315 320783 320579
62865 320579 320781 321164 321416 321439 321441 321826 322866 324308 325432 325796 325818 326314 327531 329075 330734 332814 335453
62848 335453 338097 340039 341134 341665 341781 341519 341176 341185 341685 342554 343763 345279 346704 347499 347683 347898 348581
62831 348581 349452 350099 350720 351920 353881 356127 358113 359820 361671 364125 367399 371427 375824 379948 383280
62816C83280K624K599L189L771M006M292N094O075O466O185O009O522P494Q589
62802D56195R984J1693J2846J2628J1732J1990J4241J7419K0071K2133K4516K7599
62790F53047L0979L4535L8787M3919M9230N4053N8717O4022O9961P5583Q0040
62779A252873Q3261Q5464Q6444Q5633Q2525P6845O8547N7953M5724L2421J8217
62768A975907L307j1629k5720l8529m9960n9647o6974p1886p5142p7434p8602
62757A423691p8075p5826p2522o8836o5011o1092n7179n3297m9344m5249m1204
62746G56056l7499l4186l0944k7371k3517k0028j7554j5978j4517j2682j0814
62735E10966r418q312o971n471m448l994l315j830o7J075J627K480M061N777O901
$$ plain form
62816 383280 385904 388503 391692 395463 399469 403761 408855 414930 421396 427581 433590 440112 447606 456195
62802 456195 466179 477872 490718 503346 515078 527068 541309 558728 578799 600932 625448 653047
62790 653047 684026 718561 757348 801267 850497 904550 963267 1027289 1097250 1172833 1252873
62779 1252873 1336134 1421598 1508042 1593675 1676200 1753045 1821592 1879545 1925269 1957690 1975907
62768 1975907 1979214 1967585 1941865 1903336 1853376 1793729 1726755 1654869 1579727 1502293 1423691
62757 1423691 1345616 1269790 1197268 1128432 1063421 1002329 945150 891853 842509 797260 756056
62746 756056 718557 684371 653427 626056 602539 582511 564957 548979 534462 521780 510966
62735 510966 501548 493236 486265 480794 476346 472352 469037 467207 467140 468215 469842 472322 476383 482160 489061
62720D89061P522Q266R409J0726J2062J3589J5517J7779K0172K2695K5675K9547
62708F82020L4424L9801M4845M9128N3001N7121O1710O6462P0957P4847P7734
62697A312050P9288P9476P8293P5206O9379O0617M9727L7653K4664J0658m028
62686A872983j8557l2113m4214n4638o3332p0251p5098p7529p7782p6754p5069
62675A207646p2513o8867o4773o1053n7497n3180m7936m2691l8293l4770l1902
62664F34171k9581k7404k4656k1247j8063j5933j4665j3531j2188j0750r398q333
62652D28422p778p542p064o183n458n252n028m139k873k011j665j281o50j81k16
62637C71101o75j315j902k133j921j642j620j483o56O38J505J545J259J271J707
$$ plain form
62720 489061 496583 504849 514258 524984 537046 550635 566152 583931 604103 626798 652473 682020
62708 682020 716444 756245 801090 850218 903219 960340 1022050 1088512 1159469 1234316 1312050
62697 1312050 1391338 1470814 1549107 1624313 1693692 1754309 1804036 1841689 1866353 1877011 1872983
62686 1872983 1854426 1822313 1778099 1723461 1660129 1589878 1514780 1437251 1359469 1282715 1207646
62675 1207646 1135133 1066266 1001493 940440 882943 829763 781827 739136 700843 666073 634171
62664 634171 604590 577186 552530 531283 513220 497287 482622 469091 456903 446153 436755 428422
62652 428422 420644 413102 406038 399855 394397 389145 384117 379978 377105 375094 373429 372148 371498 371317 371101
62637 371101 370426 369111 367209 365076 363155 361513 359893 358410 357754 358392 359897 361442 362701 363972 365679
62622C65679K459L402M171M318L947L728M043M596N057N568O295P037P611Q216
62608D36127R075J0104J1298J3071J5740J8949K2033K4813K7580L0527L3542L6468
62596F89327L9169M1343M2582M2609M1327L8743L5025L0472K5144J8774J1312
62585A055827L388m138j1001j7542k3911k9622l3995l6767l8174l8593l8280l7319
62573G49873l5791l3981l2272l0770k9124k6939k4274k1563j9101j6864j4739
62562D64455j2786j1210j0232r855r624q780p053n149m056l886l818l275k644
62549C72087k522k745k652k086j500j135n77N60J915K722K731K476K551K892K958
62534C77675K556K253K814M367O337Q196J0027J2156J4511J6639J8353J9983K1952
$$ plain form
62622 365679 368138 371540 375711 380029 383976 387704 391747 396343 401400 406968 413263 420300 427911 436127
62608 436127 445202 455306 466604 479675 495415 514364 536397 561210 588790 619317 652859 689327
62596 689327 728496 769839 812421 855030 896357 935100 970125 1000597 1025741 1044515 1055827
62585 1055827 1059215 1055077 1044076 1026534 1002623 973001 939006 902239 864065 825472 787192 749873
62573 749873 714082 680101 647829 617059 587935 560996 536722 515159 496058 479194 464455
62562 464455 451669 440459 430227 420372 410748 401968 394915 389766 385710 381824 378006 374731 372087
62549 372087 369565 366820 364168 362082 360582 359447 358870 359430 361345 364067 366798 369274 371825 374717 377675
62534 377675 380231 382484 385298 389665 396002 404198 414225 426381 440892 457531 475884 495867 517819
62521E17819K4385K7221L0440L3933L7310M0117M2165M3489M4109M3981M3006
62510I27975M0858L6990L1161K3973J6490R317K287m880j1964j8357k3480k7085
62498A003285k9410l1140l2801l4041l3874l1853k8665k5376k2379j9359j5950
62487F98437j1999p551k987R95L895N838P181Q008Q395Q809R559J0002Q948O057
62473G53587K314r95l441n585q361j2259j6703k0298k2143k2836k3625k4686k5009
62460E69960k4027k2484k1269k0291j9037j7567j6233j4849j2932j0607q576p299
62448C74789o619o070n239l979k677k008k054j949r78L06P43J44n37o55o45j097
62432C41475j740j825j187m72m18j159k129k564k156j296o17l80m76q49j540k344
$$ plain form
62521 517819 542204 569425 599865 633798 671108 711225 753390 796879 840988 884969 927975
62510 927975 968833 1005823 1036984 1060957 1077447 1086764 1089051 1084171 1072207 1053850 1030370 1003285
62498 1003285 973875 942735 909934 875893 842019 810166 781501 756125 733746 714387 698437
62487 698437 686438 678887 675900 676895 680790 686628 693809 701817 710212 719021 728580 738582 747530 753587
62473 753587 755901 754906 751465 745880 737519 725260 708557 688259 666116 643280 619655 594969 569960
62460 569960 545933 523449 502180 481889 462852 445285 429052 414203 401271 390664 382088 374789
62448 374789 368170 362100 356861 352882 350205 348197 346143 344194 343216 343522 344265 344409 343872 343217 342572 341475
62432 341475 339735 337910 336723 336251 335833 334674 332545 329981 327825 326529 325912 325532 325056 324207 322667 320323
62416C20323k757k482j713r53o85j113j949k423j941p53K53M96J49l14n75m38
62400C03125J74J004J568J687J619J583J547J547J812K296K561K364K040J992
62386C26919K230K709L657N121O581P572Q377R453J0488J0743J0315J0254J1229
62373D25648J2751J4036J5100J6523J8505K0588K2299K3764K5642K8596L2764
62362F56216L7639M2492M6960N1175N5410N9656O3439O5872O5989O3328N8213
62351A266389N1297M2928L3262K2837J2543K945n943j4081k1129k7057l2530l8188
62339A293273m3775m8415n1592n3404n3937n2958n0393m6818m3155l9939l6998
62328G71889l3837l0316k6910k4201k2244k0635j9144j7957j7184j6525j5786
$$ plain form
62416 320323 317566 315084 313371 312418 311733 310620 308671 306248 304307 303554 303807 304303 304452 304138 303563 303125
62400 303125 303299 304303 305871 307558 309177 310760 312307 313854 315666 317962 320523 322887 324927 326919
62386 326919 329149 331858 335515 340636 347217 354789 363166 372619 383107 393850 404165 414419 425648
62373 425648 438399 452435 467535 484058 502563 523151 545450 569214 594856 623452 656216
62362 656216 693855 736347 783307 834482 889892 949548 1012987 1078859 1144848 1208176 1266389
62351 1266389 1317686 1360614 1393876 1416713 1429256 1432201 1426258 1412177 1391048 1363991 1331461 1293273
62339 1293273 1249498 1201083 1149491 1096087 1042150 989192 938799 891981 848826 808887 771889
62328 771889 738052 707736 680826 656625 634381 613746 594602 576645 559461 542936 527150
62317E27150j5243j5147j5153j4732j3936j3102j2037j0256q088o694o634p016
62305C89112o574n144l649k901k873k995k753k048j200n69j37L34P58P91O25J080
62289C61857K465L897M352M055L993M378M489M055L804M347N264N861O196O806
62275D25819P818Q893R793J0506J1002J1363J2061J3673J6324J9714K3563K7720
62263E98249L1951L6114M0496M5500N0891N5824N9780O3029O5878O7770O7553
62252A183035O4488N8631N0392M0159K8556J6656N609m020j2442k0212k7698l4862
62240A348292m1412m7034n1484n4615n6517n7588n8218n8247n6913n3645m8885
62229G63734m3857l9466l5649l1857k7879k4009k0714j8309j6754j5523j3926
$$ plain form
62317 527150 511907 496760 481607 466875 452939 439837 427800 417544 409456 402762 396128 389112
62305 389112 382538 377394 373745 370844 367971 364976 362223 360175 358975 358406 358269 358603 359361 360152 360777 361857
62289 361857 364322 368219 372571 376626 380619 384997 389486 393541 397345 401692 406956 412817 419013 425819
62275 425819 433637 442530 452323 462829 473831 485194 497255 510928 527252 546966 570529 598249
62263 598249 630200 666314 706810 752310 803201 859025 918805 981834 1047712 1115482 1183035
62252 1183035 1247523 1306154 1356546 1396705 1425261 1441917 1447526 1443506 1431064 1410852 1383154 1348292
62240 1348292 1306880 1259846 1208362 1153747 1097230 1039642 981424 923177 866264 812619 763734
62229 763734 719877 680411 644762 612905 585026 561017 540303 521994 505240 489717 475791
62218D75791j1915j0278r641r517q900p695o787o603o445n634m558l993l879l518
62204C76428k658j638o21N71J838K770L391M320N948P838R289J0086J0552J1137
62190D39251J2135J3509J4845J5729J6221J6647J6868J6377J5252J4421J4472
62179F05727J4700J3938J2122J0447J0059J1207J3640J7258K2020K7560L3220
62168G91898L8434M3000M6998N0501N3268N4687N4015N0725M4695L6339K6652
62157A291212J6917Q084L22o708j3295j9509k5439l1300l7226m2956m7761n0714
62145A041627n1275m9723m7000m3990m1009l7909l4440l0426k5917k1384j7517
62134F41037j4633j2409j0369q427o718n233l903k841k074j294j98J064K207L375
$$ plain form
62218 475791 463876 453598 443957 434440 425540 417845 411058 404455 398010 392376 387818 383825 379946 376428
62204 376428 373770 372132 371511 372082 373920 376690 380081 384401 390349 398187 407476 417562 428114 439251
62190 439251 451386 464895 479740 495469 511690 528337 545205 561582 576834 591255 605727
62179 605727 620427 634365 646487 656934 666993 678200 691840 709098 731118 758678 791898
62168 791898 830332 873332 920330 970831 1024099 1078786 1132801 1183526 1228221 1264560 1291212
62157 1291212 1308129 1316213 1316535 1309827 1296532 1277023 1251584 1220284 1183058 1140102 1092341 1041627
62145 1041627 990352 940629 893629 849639 808630 770721 736281 705855 679938 658554 641037
62134 641037 626404 613995 603626 595199 588481 583248 579345 576504 574430 573136 572938 574002 576209 579584
62120E79584M847O244O664N721L982K263R54J11k73m24p12j218j676k092k857
62105F01118l947m558m043k822j674n17J317L725N689O683P345Q395R521J0027
62091F36259J0056J0449J1577J3007J4306J5429J6225J6324J5879J5919J7327
62080G92757J9788K2189K3912K5259K6694K8247K9739L1056L1974L2095L1340
62069A095050L0281K9697K9885L0542L1198L1512L1223L0041K7700K4141J9650
62058A410920J4691R464L741k524q584j3398j6840j9912k3537k7581l1442l5040
62046A259958l8607m1826m3955m4762m4675m4002m2574m0401l8076l6168l4587
62035H10325l2846l0711k8283k5670k2903k0107j7450j4964j2565j0286q381p199
$$ plain form
62120 579584 584431 590675 597339 603060 607042 609305 610259 610370 610097 609673 608961 607743 606067 603975 601118
62105 601118 597171 592613 588570 585748 584074 583557 584874 588599 594288 600971 608316 616711 626232 636259
62091 636259 646315 656764 668341 681348 695654 711083 727308 743632 759511 775430 792757
62080 792757 812545 834734 858646 883905 910599 938846 968585 999641 1031615 1063710 1095050
62069 1095050 1125331 1155028 1184913 1215455 1246653 1278165 1309388 1339429 1367129 1391270 1410920
62058 1410920 1425611 1435075 1438816 1436292 1427708 1414310 1397470 1377558 1354021 1326440 1294998 1259958
62046 1259958 1221351 1179525 1135570 1090808 1046133 1002131 959557 919156 881080 844912 810325
62035 810325 777479 746768 718485 692815 669912 649805 632355 617391 604826 594540 586159 578960
62023E78960o916p368q075q571q773q935r240r511r378q636p406n992m600l193
62009D72366j683j54J222K568M242O215P802Q335P960P380O918O275N119L428
61995E37993J292j185l586n269o028o335o783p502q284q976r597j0256j1075j1939
61981D42470j2244j1354r508p818p121p049o615n359l642k117j300j364j915k107
61967C62957j424k36O97J118J276J272J000O47O96J274J995K601L299M302N448
61952C86922O558P791R323J0945J2390J3895J6036J8917K1874K4147K5728K7379
61940E81905K9823L2902L5631L7080L7205L6698L6087L5287L4072L2572L0908
61929I60170K8613K5035K0334J5473J0986O326Q84m742r210j1989j3738j5056
$$ plain form
62023 578960 572044 564676 556601 548030 539257 530322 521082 511571 502193 493557 486151 480159 475559 472366
62009 472366 470683 470529 471751 474319 478561 484776 492578 500913 508873 516253 523171 529446 534565 537993
61995 537993 539285 538100 534514 529245 523217 516882 510099 502597 494313 485337 475740 465484 454409 442470
61981 442470 430226 418872 409364 401546 394425 387376 380761 375402 371760 369643 368343 366979 365064 362957
61967 362957 361533 361297 361994 363112 364388 365660 366660 367307 368003 369277 371272 373873 377172 381474 386922
61952 386922 393480 401271 410594 421539 433929 447824 463860 482777 504651 528798 554526 581905
61940 581905 611728 644630 680261 717341 754546 791244 827331 862618 896690 929262 960170
61929 960170 988783 1013818 1034152 1049625 1060611 1066937 1067821 1063079 1053869 1041880 1028142 1013086
61917A013086j5562j4519j1863q157l933N55N208J0085J5258K0225K3842K5287
61905A059512K4841K3187K0355J5968J0294M112k378r512j6836k2865k6673k8931
61893A051074l0841l2634l3746l3797l2752l0579k7577k4722k2862k1751k0523
61882G39290j8984j7699j6937j6301j5459j4523j3606j2612j1605j0750r722p819
61870E73273n039k398p38K78J560L362N268P101R227J1911J4904J7870K0907K4445
61856F81931K8697L3334L7761M1711M5492M9474N3408N6484N8138N8515N7963
61845A202908N6302N2947M7621M0590L2229K2724J2383J989p446j5206k0971k4478
61833A401592k5449k3976k0690j6230j0678l883L670J0749J6293J9991K1714K0925
$$ plain form
61917 1013086 997524 983005 971142 962985 959052 959607 964815 974900 990158 1010383 1034225 1059512
61905 1059512 1084353 1107540 1127895 1143863 1154157 1158269 1155891 1146379 1129543 1106678 1080005 1051074
61893 1051074 1020233 987599 953853 920056 887304 856725 829148 804426 781564 759813 739290
61882 739290 720306 702607 685670 669369 653910 639387 625781 613169 601564 590814 581092 573273
61870 573273 568234 565836 565098 565376 566936 570298 575566 582667 591894 603805 618709 636579 657486 681931
61856 681931 710628 743962 781723 823434 868926 918400 971808 1028292 1086430 1144945 1202908
61845 1202908 1259210 1312157 1359778 1400368 1432597 1455321 1467704 1469693 1462247 1447041 1426070 1401592
61833 1401592 1376143 1352167 1331477 1315247 1304569 1300686 1304356 1315105 1331398 1351389 1373103 1394028
61821A394028J7205J1114L774m378j3700k4086l4255m2717m8999n3472n6435n7960
61809A090119n8375n8141n7142n4693n0565m5647m1187l7593l4272l0626k6796
61798E95082k3377k0663j8434j6384j4410j2548j0811r275q065p159o330n484
61786D42142m852m605m473m068l500l230l393l669l908m307m801m820m113l320
61772C85083l184l368k767j080N68Q79j12j141j108p6J074J681J835K048K601
61757C82933L295L769L884L760L567L376L182K884K349J571P71K13r5l28n13m36
61741D14182L8P31J352J800K131K226J752O33n81j032m10O65J291J239J018J103
61725D28138J436J816K316K994L488L355K742K288K351K668K785K449J594L28
$$ plain form
61821 1394028 1411233 1422347 1426121 1421743 1408043 1383957 1349702 1306985 1257986 1204514 1148079 1090119
61809 1090119 1031744 973603 916461 861768 811203 765556 724369 686776 652504 621878 595082
61798 595082 571705 551042 532608 516224 501814 489266 478455 469180 461115 453956 447626 442142
61786 442142 437290 432685 428212 424144 420644 417414 414021 410352 406444 402137 397336 392516 388403 385083
61772 385083 381899 378531 375764 374684 375252 376131 376019 374878 373770 373694 374768 376449 378284 380332 382933
61757 382933 386228 389997 393881 397641 401208 404584 407766 410650 412999 414570 415341 415554 415459 415131 414618 414182
61741 414182 414220 414951 416303 418103 420234 422460 424212 424845 424264 423232 422822 423487 424778 426017 427035 428138
61725 428138 429574 431390 433706 436700 440188 443543 446285 448573 450924 453592 456377 458826 460420 460748
61711D60748r29j705k064k581l568m710n603o227o598o508o012n644n601n225
61697C97773m036k852k899l953m520l911l072k948l142k883k370k268k468k368
61683C54083j926j573j283p65l51p10j613j936j168j46J13l51p66o75k32K27N13
61666C41441O87R48J281J296Q57O72J549L053L766L157K278K119K206J673R97
61651C67980J513L453N569O747P113P367P735P938P707P038O164N426M950M429
61637D51129L432J864j20k424m882o911p885p810p267o665o028n471n284n414
61623C90264n292m464l026j366J94J393K096K476K767K774K054P37m17r98j478
61608C87714k431l710m838n797o835p797q271q283q210q028p238n735m264l645
$$ plain form
61711 460748 459819 458114 456050 453469 449901 445191 439588 433361 426763 420255 414243 408599 402998 397773
61697 397773 393737 390885 387986 384033 379513 375602 372530 369582 366440 363557 361187 358919 356451 354083
61683 354083 352157 350584 349301 348536 348185 347475 345862 343926 342758 342612 342725 342374 341608 340933 340701 340928 341441
61666 341441 342128 343076 344357 345653 346510 347182 348731 351784 355550 358707 360985 363104 365310 366983 367980
61651 367980 369493 372946 378515 385262 392375 399742 407477 415415 423122 430160 436324 441750 446700 451129
61637 451129 454561 456425 456305 453881 448999 442088 434203 426393 419126 412461 406433 400962 395678 390264
61623 390264 384972 380508 377482 376116 376310 377703 379799 382275 385042 387816 389870 390607 390190 389192 387714
61608 387714 385283 381573 376735 370938 364103 356306 348035 339752 331542 323514 316276 310541 306277 302632
61594C02632l792l892l433k757k476k640k786k652k540k798l278l531l427l214
61580B59416k999k576j866j232j135j562j970j827j161n87o91j372j973k084j936
61565B34445j844j675j259r22r51q78m0J142J418M07p89j071o09j54J60O56J258
61548B29294J653J846J902J451K73q74q88K04J237J446J225J220J436J648K007
61533B45080K676L207K946J917Q36K08j86q03j579j990j838j687k150k936l027
61518B40674k016q06o26j626k886l574l526k842j579o8J009J162M98n15j329j356
61502B20594l10J192J836Q65j035k467k727k105j135m2J038J776J854J260L11
61487B20905m69n85P5J033J636J689J495J234P14q0n61j54Q01J314R60L96L26
$$ plain form
61594 302632 298840 294948 291515 288758 286282 283642 280856 278204 275664 272866 269588 266057 262630 259416
61580 259416 256417 253841 251975 250743 249608 248046 246076 244249 243088 242501 241810 240438 238465 236381 234445
61565 234445 232601 230926 229667 228745 227794 226916 226876 228018 229436 229843 229054 227983 227374 227220 227380 228036 229294
61548 229294 230947 232793 234695 236146 236419 235545 234657 234861 236098 237544 238769 239989 241425 243073 245080
61533 245080 247756 250963 253909 255826 256662 256870 256684 255881 254302 252312 250474 248787 246637 243701 240674
61518 240674 238658 237852 237226 235600 232714 229140 225614 222772 221193 221125 222134 223296 223794 223279 221950 220594
61502 220594 220284 221476 223312 224177 223142 220675 217948 215843 214708 214666 215704 217480 219334 220594 220905
61487 220905 220436 219851 219926 220959 222595 224284 225779 227013 227727 227647 227086 226932 227733 229047 230007 230403 230729
61470B30729M81J11p52j178o39K24M71N8k51j7L67L27j88p56j009q30k79M51J010
61451B28330J101Q02N56P27J174J415J258J007R99J179J384J843K909M304N207
61436B54195N264N049N222N689N962N974N906N529M428K866J726J433J495J328
61422C12066J015R19J021J077J123J339J551J352P60L21M28P59N81m91k124l578
61406C18119m295m239l723l028k319j851j989k795l724m080l753l226k826k312
61392B73959j416m99j84m95q00p01m21j85K39J020J745K014K168K693L149K598
61376B84884J206M28J180K605L288L002K526K303K176K180K559L031K903K120
61362C16391J446J418J804K347L297M746O004O379O215O550P826R372J0233J0067
$$ plain form
61470 230729 231210 231321 230569 229391 228752 228976 229447 229505 229254 229237 229604 229931 229743 228987 227978 227148 226869 227320 228330
61451 228330 229431 230233 230789 231516 232690 234105 235363 236370 237369 238548 239932 241775 244684 248988 254195
61436 254195 259459 264508 269730 275419 281381 287355 293261 298790 303218 306084 307810 309243 310738 312066
61422 312066 313081 314000 315021 316098 317221 318560 320111 321463 322223 322544 322972 323731 324312 323821 321697 318119
61406 318119 313824 309585 305862 302834 300515 298664 296675 293880 290156 286076 282323 279097 276271 273959
61392 273959 272543 272044 271860 271365 270565 269864 269443 269258 269497 270517 272262 274276 276444 279137 282286 284884
61376 284884 286090 286518 287698 290303 293591 296593 299119 301422 303598 305778 308337 311368 314271 316391
61362 316391 317837 319255 321059 323406 326703 331449 337453 343832 350047 356597 364423 373795 384028 394095
61348C94095R235Q347P853P832P985P854P217O334N711N539N411M820L850L081
61334D85164K720K215J047n29j988l365m875n995n837m575l581l804m707n200
61320D46690m963m370l706l104k767k648k176r80M24J257J570K055K954L820M320
61305D38376M550M560M126L123J647k71k512m359m919m224l385l258l523l425
61291D26506k883k344j957j523j079q44o55l2J091K120K523K425K314K461K850
61276D30973L492M429N456O127O182N848N567N516N509N412N471O087P255Q499
61262E11823R426J0171J1063J1936J2135J1323R964Q823Q108P484O716N929N183
61249F30084M273L146K058J059l16k380m684o530p892r202j0359j0735j0213r513
$$ plain form
61348 394095 403330 411677 419530 427362 435347 443201 450418 456752 462463 468002 473413 478233 482083 485164
61334 485164 487884 490099 491146 490617 488629 485264 480389 474394 468557 463982 460401 456597 451890 446690
61320 446690 441727 437357 433651 430547 427780 425132 422956 421976 422400 423657 425227 427282 430236 434056 438376
61305 438376 442926 447486 451612 454735 456382 456111 453599 449240 444321 440097 436712 433454 429931 426506
61291 426506 423623 421279 419322 417799 416720 415876 415221 415189 416280 418400 420923 423348 425662 428123 430973
61276 430973 434465 438894 444350 450477 456659 462507 468074 473590 479099 484511 489982 496069 503324 511823
61262 511823 521249 531420 542483 554419 566554 577877 587841 596664 604772 612256 618972 624901 630084
61249 630084 634357 637503 639561 640620 640304 637924 633240 626710 618818 609616 599257 588522 578309 568796
61235E68796r210r099q847q583q341p626o258n091n000n519n391m298l163k703
61221D79667k691k753k921k989k306q07M72P13N17R27J723J732O97k47j75M51
61205D72010P12O32J053K446M457O529Q426J0128J1598J2786J3652J4071J3901
61192E72401J3250J2528J2043J1608J0703R148P446O278N766N378M691L943L551
61179F78734L277K310L55j753k868k826k562k967l995n021n674o020o164o133
61165F38693o199o900q451j0342j1731j2218j2057j1652j1143j0413r340p861
61153E20386o045m258l109k896l151l080k573k507l802o284q800j0320j0664j0205
61139D42692r327q376p725p460p076n939m036k043n14P00K077L713N195O111O534
$$ plain form
61235 568796 559586 550487 541640 533057 524716 517090 510832 505741 500741 495222 489831 485533 482370 479667
61221 479667 476976 474223 471302 468313 466007 465200 465672 466385 466902 467829 469552 471284 471981 471734 471559 472010
61205 472010 472722 473354 474407 476853 481310 487839 496265 506393 517991 530777 544429 558500 572401
61192 572401 585651 598179 610222 621830 632533 641681 649127 655405 661171 666549 671240 675183 678734
61179 678734 682011 684321 684676 682923 680055 677229 674667 671700 667705 662684 657010 650990 644826 638693
61165 638693 632494 625594 617143 606801 595070 582852 570795 559143 548000 537587 528247 520386
61153 520386 514341 510083 506974 504078 500927 497847 495274 492767 488965 482681 473881 463561 452897 442692
61139 442692 433365 424989 417264 409804 402728 396789 392753 390710 390196 390896 392973 396686 401881 407992 414526
61124D14526P003Q042R664J1348J2594J3463J4435J5714J6955J7726J8009J8082
61112E77561J8102J8010J7676J6971J5853J4557J3474J2609J1372R271O617M060
61100G36133J560j530n220q440j0317j1332j2562j4105j5083j5150j5115j5682
61088F13157j6322j6116j5236j4773j5153j5566j5144j4049j2971j2127j1303
61077D54397j0481r842r280q526p748p445p663p781p247o182n055m159l514k959
61063C56515k162r38L55J074J187J389K063K721K870K922L629M921O028O625P135
61048C96334Q023R327J0899J2513J3767J4403J4782J5448J6256J6562J6316J6220
61036E60850J6672J7311J7874J8690J9874K0833K1217K1714K3167K5408K7913
$$ plain form
61124 414526 421529 429571 439235 450583 463177 476640 491075 506789 523744 541470 559479 577561
61112 577561 595663 613673 631349 648320 664173 678730 692204 704813 716185 725456 732073 736133
61100 736133 737693 736163 730943 722503 712186 700854 688292 674187 659104 643954 628839 613157
61088 613157 596835 580719 565483 550710 535557 519991 504847 490798 477827 465700 454397
61077 454397 443916 434074 424794 416268 408520 401075 393412 385631 378384 372202 367147 362988 359474 356515
61063 356515 354353 353415 353770 354844 356031 357420 359483 362204 365074 367996 371625 376546 382574 389199 396334
61048 396334 404357 413684 424583 437096 450863 465266 480048 495496 511752 528314 544630 560850
61036 560850 577522 594833 612707 631397 651271 672104 693321 715035 738202 763610 791523
61025G91523L1248L6810M5140N5411O6859Q0077R6562J17531J43505J74689K10841
61014A850196K49713K84547L03317K92839K47156J73968R2597K4465j6117k5030
61004C477651p002K5787N5125O1564L2785k9605j10323j88060k45510k75505k80508
60993B516399k67732k44629k17169j89720j64694j42363j21952j03222q6717p2809
60983I05392o1245n1700m4127l8403l4140l1022k8837k7024k4809k2052j9447
60972E22586j7509j5873j4046j2367j1542j1524j1507j0884r668q097o444n227
60960C87898m912n254n363m638l273j771m11O43J207J430J819K591L229L076K231
60945C78502J553J793K884L947L925K445K47j425k018k072k347k939l488l901
$$ plain form
61025 791523 822771 859581 904721 960132 1026991 1107068 1203630 1321161 1464666 1639355 1850196
61014 1850196 2099909 2384456 2687773 2980612 3227768 3401736 3494333 3518798 3502681 3477651
61004 3477651 3470649 3496436 3551561 3613125 3645910 3616305 3505982 3317922 3072412 2796907 2516399
60993 2516399 2248667 2004038 1786869 1597149 1432455 1290092 1168140 1064918 978201 905392
60983 905392 844147 792447 748320 709917 675777 644755 615918 588894 564085 542033 522586
60972 522586 505077 489204 475158 462791 451249 439725 428218 417334 407666 399569 393125 387898
60960 387898 382986 377732 372369 367731 364458 362687 362276 362919 364126 365556 367375 369966 373195 376271 378502
60945 378502 380055 381848 384732 388679 392604 395049 395296 393871 391853 389781 387434 384495 381007 377106
60931C77106m376m923n237n047m326l288k354j949k021k054j799j585j576j176
60917C35395R8J539J988J488J289K011K802K703J973J493J479J508J369J170R25
60902C59230O10M70O78Q62N05k94r22j047q22m30P9M85M29j90j164k297l408m103
60884C48671m053l542l254l371l388k921k229j614p82P35K682M103M304L540K704
60869C41585K483K876L434L859M229M657M954M924M848N222N991O368N730M387
60855D05547L273K951L175L303L064K864L321M417N246M957L830L021L182L788
60841D55939L983L563K795J864R28M03N43R35J059J112J744L027M335N292O162
60826D93684P168Q187R263J0813J2845J4629J5676J6563J8107K0126K1805K2960
$$ plain form
60931 377106 372730 367807 362570 357523 353197 349909 347555 345606 343585 341531 339732 338147 336571 335395
60917 335395 335493 337032 339020 340508 341797 343808 346610 349313 351286 352779 354258 355766 357135 358305 359230
60902 359230 359840 360310 360988 361850 362355 362061 361139 360092 359270 358840 358919 359404 359833 359643 358479 356182 352774 348671
60884 348671 344618 341076 337822 334451 331063 328142 325913 324299 323517 324252 326934 331037 335341 338881 341585
60869 341585 344068 346944 350378 354237 358466 363123 368077 373001 377849 383071 389062 395430 401160 405547
60855 405547 408820 411771 414946 418249 421313 424177 427498 431915 437161 442118 445948 448969 452151 455939
60841 455939 459922 463485 466280 468144 469072 469475 470018 470953 472012 473124 474868 477895 482230 487522 493684
60826 493684 500852 509039 518302 529115 541960 556589 572265 588828 606935 627061 648866 671826
60814F71826K4046K4926K4665K2977K0992J9843J8970J6687J2317O997K278j457
60802H65067m897q623j2495j5932j8469k0000k0780k1220k1517k1502k0943j9883
60790F58806j8558j7103j5544j4042j2836j1964j1334j0984j1003j1143j0903
60779E13392j0154r319q729q171p322o269n238m180l121k639l285m585n361n151
60765D29868m703m828n359n657n667n909o646p558q164q227p786p052o251n408
60751C40653m402l330k563k270k143j824j381j027p17l59j95n40j314k228l161
60736C13199l959m166l590k859k654k585j683k1J228J511J639K357L172L300K972
60721C07861K852K831K343J480Q25M04k74j253k123k868l798m635m675l974l404
$$ plain form
60814 671826 695872 720798 745463 768440 789432 809275 828245 844932 857249 864246 866524 865067
60802 865067 860170 851547 839052 823120 804651 784651 763871 742651 721134 699632 678689 658806
60790 658806 640248 623145 607601 593559 580723 568759 557425 546441 535438 524295 513392
60779 513392 503238 493919 485190 477019 469697 463428 458190 454010 450889 448250 444965 440380 435019 429868
60765 429868 425165 420337 414978 409321 403654 397745 391099 383541 375377 367150 359364 352312 346061 340653
60751 340653 336251 332921 330358 328088 325945 324121 322740 321713 320996 320637 320442 319902 318588 316360 313199
60736 313199 309240 305074 301484 298625 295971 293386 291703 291682 292910 294421 296060 298417 301589 304889 307861
60721 307861 310713 313544 315887 317367 318192 318596 318322 317069 314946 312078 308280 303645 298970 294996 291592
60706B91592l284l002k348k180l000l855l603k631k191k509k683k281j820j584
60692B54621j091j88M15K28j60k1L15P0n56n18N72J896K483K171J316K49n81m92
60674B60729P04K144K654J996R33J41m07r15j177q62l7R04J676K227K597K926
60658B76233L398L994M475M784N190N700N773N097M389M685N815O399N622M253
60644C45807L428L016J982L0j913k913l075l144l498l919m146m301m685n258n519
60629C11892n020l995l249l259l612l574l026k486k308k265j971j370o46L3N82
60614B75726R24J022Q72M73o6m93o81q35j092j091m24N15P96K80m7M91J173R08
60596B78451j83j051j232j158j038m88M92J069O62k23o98n21L2P44J381J492J014
$$ plain form
60706 291592 288308 285306 282958 280778 277778 273923 270320 267689 265498 262989 260306 258025 256205 254621
60692 254621 253530 253342 253757 253985 253825 253804 254119 254189 253633 253115 253687 255583 258066 260237 261553 261802 261221 260729
60674 260729 261433 263577 266231 268227 269160 269301 268894 267979 266802 265940 265903 266807 268483 270710 273307 276233
60658 276233 279631 283625 288100 292884 298074 303774 309547 314644 319033 323718 329533 335932 341554 345807
60644 345807 349235 352251 354233 354263 352350 349437 346362 343218 339720 335801 331655 327354 322669 317411 311892
60629 311892 306872 302877 299628 296369 292757 289183 286157 283671 281363 279098 277127 275757 275111 275144 275726
60614 275726 276650 277672 278544 279017 278951 278458 277777 276942 275850 274759 274335 274850 275646 275926 275879 276370 277543 278451
60596 278451 278268 277217 275985 274827 273789 273301 273793 274862 275524 275301 274603 274082 274114 274858 276239 277731 278745
60579B78745P19J364K654L688M273M948N848O417O420O366O576O562N777M395
60565C44752K884J287m60k008k960l490l927l954k960j113N91J494J938K616L758
60550C38448N185O660P893Q604Q852R092R514R586Q576O403L690J081j127k820
60536D19637l945m633n109n288m779l503k094j390j543j899j777j122l34K50N43
60521C83014N41L66L96J068K339L562M050L783L431L734M873O474Q080R659J1628
60506D46998J4411J7967K1769K5150K7646K9178L0028L0531L0514K9135K5532
60495G28859J9642J2134L694n248j4068k1823k7772l1766l3877l4126l2812l0646
60483E32191k8204k5577k2811k0273j8125j5939j3489j1447j0547j0290r416p643
$$ plain form
60579 278745 279464 280828 283482 287170 291443 296391 302239 308656 315076 321442 328018 334580 340357 344752
60565 344752 347636 348923 348463 346455 343495 340005 336078 332124 329164 328051 328642 330136 332074 334690 338448
60550 338448 343633 350293 358186 366790 375642 384734 394248 403834 412410 418813 422503 423584 422457 419637
60536 419637 415692 411059 405950 400662 395883 392380 390286 388896 387353 385454 383677 382555 382221 382471 383014
60521 383014 383555 383921 384317 385385 387724 391286 395336 399119 402550 406284 411157 417631 425711 435370 446998
60506 446998 461409 479376 501145 526295 553941 583119 613147 643678 674192 703327 728859
60495 728859 748501 760635 764329 759081 745013 723190 695418 663652 629775 595649 562837 532191
60483 532191 503987 478410 455599 435326 417201 401262 387773 376326 365779 355489 346073 338430
60471C38430o035n431n410n124m426l621k752j756r71r31j692k703l306l181k502
60456B88589j805j475j320q61j36L08K90K94N71N58k93j533k213k121j920k151
60440B74782k627k788k271j146P8P25N82J20j20j61k95m15j84K78M34Q0m36p44
60422B65892p59m56J88R01J287J410J799K578L101K773J893J250J130J144R44
60407B85075O49N33N89N94M35K09J7j84m57o86o16j61L83N68K52j86j20Q00K267
60388B89961L440L559K591J305O43R64J827K363J970Q50r1j00O74J481J935K239
60372C15611K534K482J880J113O69N51N69P72J153J283Q89M76P14J415J855J967
60356C35933K394L294L952L812L139K368J491M35n09j181j846k583k845k231j314
$$ plain form
60471 338430 332395 326964 321554 316430 312004 308383 305631 303875 302904 301973 300281 297578 294272 291091 288589
60456 288589 286784 285309 283989 283128 282992 283300 283590 283884 284455 285013 284720 283187 280974 278853 276933 274782
60440 274782 272155 269367 267096 265950 266028 266753 267335 267455 267335 267174 266879 266464 266280 266558 266992 267072 266636 265892
60422 265892 265133 264677 264865 265766 267053 268463 270262 272840 275941 278714 280607 281857 282987 284131 285075
60407 285075 285724 286257 286846 287440 287875 288084 288101 287917 287460 286774 286158 285997 286380 286948 287200 287014 286894 287694 289961
60388 289961 293401 296960 299551 300856 301499 302463 304290 306653 308623 309473 309382 309282 309956 311437 313372 315611
60372 315611 318145 320627 322507 323620 324289 324840 325409 326181 327334 328617 329506 329982 330696 332111 333966 335933
60356 335933 338327 341621 345573 349385 352524 354892 356383 356818 356309 355128 353282 350699 347854 345623 344309
60341C44309j003j330j505j083m44j04q9j58k35m12p60j304j968k463k406j759
60325C27286r59n10m61m22r2L85O88Q90J468K628L860M498M627N025O164P732
60309C62807R248J0676J2140J3382J3860J3273J1661R207O154K700j228n721j0128
60296D48031j2987j3367j2091j0846j0181r149p104m946l996m213m283l335j857
60283C49676q63p27j051j318j360j388j771k603l369l237j970m18K33l54j499
60268C27981k492l205l638l424k342r86k54k47j95L92J143J572J789K040K023
60253C20157J335L52o3K44M83M7o68r14o30l23k59k40j61j77k76j25M09R53J136
60234C21280J043R18O76J91j34K63J225J967K162K354K964L502L272K459J895
$$ plain form
60341 344309 343306 341976 340471 339388 338944 338840 338751 338593 338358 337946 337186 335882 333914 331451 329045 327286
60325 327286 326327 325817 325356 324934 324842 325227 325915 326805 328273 330901 334761 339259 343886 348911 355075 362807
60309 362807 372055 382731 394871 408253 422113 435386 447047 456254 462408 465108 463880 458159 448031
60296 448031 435044 421677 409586 398740 388559 379410 372306 367360 363364 359151 354868 351533 349676
60283 349676 348813 348086 347035 345717 344357 342969 341198 338595 335226 331989 330019 329601 329834 329480 327981
60268 327981 325489 322284 318646 315222 312880 311894 311640 311393 311198 311590 312733 314305 316094 318134 320157
60253 320157 321492 321844 321781 322025 322508 322555 321887 320973 320343 320020 319761 319521 319360 319183 318907 318782 319191 320144 321280
60234 321280 322323 323241 323917 324108 323974 324237 325462 327429 329591 331945 334909 338411 341683 344142 346037
60219C46037J967K328K600K758K849K825K785K954L293L534L588L632L751L878
60205C88779M052M280M214L548K749K691L400L885L488K698K159J663P82q1j66
60190D28141M24Q15N66M0m33j025j885k725l161l109k688k097j661j637j877j932
60174D05756j602j071n85l17n38j406k415k615j651k97M21L27N8J07L48M30K29
60157C95179j10l32k76jJ88P5q0K56J198K146K472K352K575L429M279M414M039
60140D21803L932M334M712M643M360M284M430M531M380L754K428O26q19j230q32
60125D65336m13l86n47o15o21p76j178j667j812j299m60j02n61j298j769k191
60109D49641k914l484l196k317j831k005k096j652j194j273j625j707j471j095
$$ plain form
60219 346037 348004 350332 352932 355690 358539 361364 364149 367103 370396 373930 377518 381150 384901 388779
60205 388779 392831 397111 401325 404873 407622 410313 413713 417598 421086 423784 425943 427606 428388 428307 428141
60190 428141 428565 429380 429946 429986 429553 428528 426643 423918 420757 417648 414960 412863 411202 409565 407688 405756
60174 405756 404154 403083 402498 402181 401643 400237 397822 395207 393556 393259 393680 394007 394065 394172 394520 394950 395179
60157 395179 395069 394737 394461 394460 394648 394723 394643 394899 396097 398243 400715 403067 405642 409071 413350 417764 421803
60140 421803 425735 430069 434781 439424 443784 448068 452498 457029 461409 465163 467591 468217 467398 466168 465336
60125 465336 464923 464537 463990 463375 462754 461978 460800 459133 457321 456022 455562 455460 454899 453601 451832 449641
60109 449641 446727 443243 440047 437730 435899 433894 431798 430146 428952 427679 426054 424347 422876 421781
60095D21781m30P39K164L257L630L289K621K271K584L011K629J504Q44J412K378
60080D53684K431J449L87j08j29Q6L23R3r83k433l357l619l931m617n100m871
60064D29305m282l946l901l864l865m129m548m724m420l684k663j579p76n12o70
60049C81742q10m66N42J838K620K390J681J565K310L042L003K518K227J971J257
60034D07430M12K16M99J45j261k752l427l662m250n031n299n088n083n417n476
60019C61956n009m569m616m814m611l972l184k345j493q90p32p61n46k4N19Q61
60003C25770Q87M42m83j525k204k363k066j200L32K063L117L078K398J771J436
59988C31453J310J450J980K685L065K920K540K238J890J169J69n02l98J88N54
$$ plain form
60095 421781 421351 422090 424254 427511 431141 434430 437051 439322 441906 444917 447546 449050 449894 451306 453684
60080 453684 456115 457564 457951 457843 457714 457800 458123 458216 457233 454800 451443 447824 443893 439276 434176 429305
60064 429305 425023 421077 417176 413312 409447 405318 400770 396046 391626 387942 385279 383700 382924 382412 381742
60049 381742 380932 380466 381008 382846 385466 387856 389537 391102 393412 396454 399457 401975 404202 406173 407430
60034 407430 407842 408058 408557 408702 407441 404689 401262 397600 393350 388319 383020 377932 372849 367432 361956
60019 361956 356947 352378 347762 342948 338337 334365 331181 328836 327343 326453 325721 324960 324414 324390 324909 325770
60003 325770 326657 327099 326616 325091 322887 320524 318458 317258 317590 319653 322770 325848 328246 330017 331453
59988 331453 332763 334213 336193 338878 341943 344863 347403 349641 351531 352700 352869 352367 351969 352157 352711
59973C52711L35k53q42j168r75j08J046J668J380P00K91J19j73m10r4O66J131
59956C56024R36N01L01K90L09M81Q21R33N66J05Q6M63P85Q72Q47O18r9j282k470
59937C61087l202l328k918k216j695j705j996j940j320o34l45k42J48P85J153
59922C41632J046Q11P89Q58Q31R85J758L014L972M038L442L017L401M564N838
59907C79996O395N940N079M755N103N205M229K489R44Po20j083j096o61l83p34
59891D15565j407j691j263l56N68J129J259J340J819K545K818K282J417Q88P86
59876D27699P97P54O43L50j70p02j157j799k656l079k500j441r79j332j656j366
59860D11406q61o93p69p90r42j501k147k284j888j486j295r86m19r8n76j607k321
$$ plain form
59973 352711 353046 352793 351951 350783 349808 349700 350746 352414 353794 354494 354785 354904 354731 354321 354227 354893 356024
59956 356024 356960 357461 357762 358052 358361 358842 359663 360596 361162 361267 361353 361816 362601 363473 364320 364938 364839 363557 361087
59937 361087 357885 354557 351639 349423 347728 346023 344027 342087 340767 340133 339788 339546 339694 340479 341632
59922 341632 342678 343489 344278 345136 345967 346952 348710 351724 355696 359734 363176 366193 369594 374158 379996
59907 379996 386391 392331 397410 402165 407268 412473 416702 419191 420135 420142 419522 418439 417343 416682 416299 415565
59891 415565 414158 412467 411204 410848 411416 412545 413804 415144 416963 419508 422326 424608 426025 426913 427699
59876 427699 428496 429250 429893 430243 430073 429371 428214 426415 423759 420680 418180 416739 415760 414428 412772 411406
59860 411406 410545 409852 409083 408293 407351 405850 403703 401419 399531 398045 396750 395764 395345 395247 394671 393064 390743
59843C90743k218j691j437j581j596j050j49N04N72K42l4LK46L80K55J48M33R32
59825C84702Q40l96k205l258k843j623q85j168j818j854j080j83J77J16J89M65
59809C69176M41m7l18L14J488K089J567M56m67r94j269j284j048r29j327k059
59793C65789k565k613k451k144j366j16P68M35p47j442r76j64j82j001j570j288
59777C48367n87J3O38J452J941J475L60l56p9P80J490J754J631J224P32N56R40
59760C62331J653K229K450K407K220J944J730J751J952K079K038K031K216K462
59746C91493K620K844L307L717L543K801K151K017K053J802J512J683K113K155
59732D25811J825J851K475K894K359J160N5p10j282j552j322q65o60p30q22j028
$$ plain form
59843 390743 388525 386834 385397 383816 382220 381170 381021 381525 382097 382339 382305 382308 382554 382934 383189 383337 383770 384702
59825 384702 385542 385146 382941 379683 376840 375217 374332 373164 371346 369492 368412 368229 368406 368522 368711 369176
59809 369176 369617 369570 369252 369566 371054 373143 374710 375166 374699 373705 372436 371152 370104 369175 367848 365789
59793 365789 363224 360611 358160 356016 354650 354534 355302 355737 354990 353548 352572 352408 352226 351225 349655 348367
59777 348367 347780 347793 348431 349883 351824 353299 353659 353303 353224 354004 355494 357248 358879 360103 360835 361391 362331
59760 362331 363984 366213 368663 371070 373290 375234 376964 378715 380667 382746 384784 386815 389031 391493
59746 391493 394113 396957 400264 403981 407524 410325 412476 414493 416546 418348 419860 421543 423656 425811
59732 425811 427636 429487 431962 434856 437215 438375 438430 437720 436438 434886 433564 432699 432039 431309 430487 429459
59716D29459j587k176k082j197k46J07r1l69l15L49J608K912L574L507L205K911
59700D39569K383J606J139J439K284L160L727L678K677Q67r30j998k403k522k346
59685D52330j719r68o71q96j158j101q36o90r59j779k947l911m249m064l624k946
59669D19812k024j273j182j593j837j556r77m10O9L66L42J49K43Q88J874K800
59653D15691L368L416K960K292J680J010J4j120j847k026k137k532k947l014k878
59638D11930k916l145l230k952k377j737j367j530k075k456k342j954j615j278
59624C80956q79p86j396k428l166l374l418l521l455l072k531j865q35M18J168
59609C51816J001M95M45P57P63M39M73J107J695J696J423J324J130L58o75j141
$$ plain form
59716 429459 427872 425696 423614 422417 422171 422278 422187 421818 421503 421852 423460 426372 429946 433453 436658 439569
59700 439569 441952 443558 444697 446136 448420 451580 455307 458985 461662 462529 461599 459601 457198 454676 452330
59685 452330 450611 449643 448972 448076 446918 445817 444981 444291 443332 441553 438606 434695 430446 426382 422758 419812
59669 419812 417788 416515 415333 413740 411903 410347 409370 408960 409029 409395 409737 409886 410129 411017 412891 415691
59653 415691 419059 422475 425435 427727 429407 430417 430431 429311 427464 425438 423301 420769 417822 414808 411930
59638 411930 409014 405869 402639 399687 397310 395573 394206 392676 390601 388145 385803 383849 382234 380956
59624 380956 380077 379291 377895 375467 372301 368927 365509 361988 358533 355461 352930 351065 350230 350648 351816
59609 351816 352817 353312 353757 354514 355277 355716 356189 357296 358991 360687 362110 363434 364564 364922 364247 363106
59593C63106q64m69l24o2N27R16N91p3l76l77p06j395j787j666j736k466l224
59576C49615l154k493k204k478k543j998j490j582j710r91L41J131Q52J58j72
59561C31282j43p5J28P25J515K009K067J950J865J933K452L634N049N939O235
59546C66565O759Q135R954J1518J2979J5141J8060K0356K0099J6254R446J697
59534E16963m596p988q700q032p032n843m254k407o86P47J913K675K816K437J902
59519D79915J291K72j324l069m361n153n914o887p718p958p683p332p028o395
59505D10656n161l707k840l003l870m668m758l965k570j147k43n4k90n08m43n0
59489C73379O42J468K005J857J189P06R31J671K420L086L968N149O284P032P304
$$ plain form
59593 363106 362242 361773 361449 361387 361914 362830 363421 363348 362972 362595 361889 360494 358707 357041 355305 352839 349615
59576 349615 346461 343968 341764 339286 336743 334745 333255 331673 329963 328972 329313 330444 331296 331454 331282
59561 331282 331139 331064 331192 331917 333432 335441 337508 339458 341323 343256 345708 349342 354391 360330 366565
59546 366565 373324 381459 391413 402931 415910 431051 449111 469467 489566 505820 515266 516963
59534 516963 512367 504379 495679 487647 480615 474772 470518 468111 467425 468172 470085 472760 475576 478013 479915
59519 479915 481206 481478 480154 477085 472724 467571 461657 454770 447052 439094 431411 424079 417051 410656
59505 410656 405495 401788 398948 395945 392075 387407 382649 378684 376114 374967 374724 374670 374380 373872 373429 373379
59489 373379 374021 375489 377494 379351 380540 381246 382177 383848 386268 389354 393322 398471 404755 411787 419091
59474D19091O950N695L672J741P32M63j7j123k116j977o18J082K297K957L511
59459D42340M262N183O160P201Q274R095R264Q719P921P445P373P239O563N248
59445E42287L433J235j174l434n219o519p501q097q027p254o188n405n273n829
59431D77035o632o798n644l578j835r53K3K218N259P738R204J0677J3013J5737
59417E15464J8130K0570K3800K7192K8584K5931J8724Q205l022j1822j6124j6254
59405F39378j4219j1459p747k452L636Q150Q586L885m798j4512k2081k5850k6148
59392E34369k4316k1650j9034j6799j4574j1809q732o323n097m497l806l034k420
59379C92278j742p85PJ24r3J34Q95J558J743J646J598J803K416L246L673L432
$$ plain form
59474 419091 426041 431736 435408 437149 437881 438344 438327 437204 435088 433111 432493 433575 435872 438829 442340
59459 442340 446602 451785 457945 465146 473420 482515 491779 500498 508419 515864 523237 530476 537039 542287
59445 542287 545720 546955 545781 542347 537128 530609 523108 515011 506984 499730 493542 488137 482864 477035
59431 477035 470403 463605 457961 454383 452548 451595 451618 453836 459095 466833 476037 486714 499727 515464
59417 515464 533594 554164 577964 605156 633740 659671 678395 686600 683578 671756 655632 639378
59405 639378 625159 613700 605953 603501 607137 615287 623873 627758 622960 608448 586367 560517 534369
59392 534369 510053 488403 469369 452570 437996 426187 417455 411132 406035 401538 397732 394698 392278
59379 392278 390536 389751 389758 389882 389789 389923 390818 392376 394119 395765 397363 399166 401582 404828 408501 411933
59363D11933L226L764M528M435L541L062L647M740N789P018Q516R669J0108J0447
59349D94423J1385J2666J3562J3829J3630J2994J1980J0961J0185R315P932O122
59337F28984M134J913n07k567l796m571n622o980q047q545q760q906q828q407
59323E59495p742o901n859m739l920l773m430n629o717p078o743o417o581o946
59309D76020o930o358n383m179l115k780l229l643l213k135j097k69M87P86J12
59294D35074j036j394m84Q82J802K200K383K435K453K694L083L134K734K535L111
59279D61606M158M974N393N795O408P075P565P785P755P596P478P393P105O416
59265E54502N417M234K814J086p44k247l102l370l482l961m972o173p124p706
$$ plain form
59363 411933 415159 418923 423451 427886 431427 434489 438136 442876 448665 455683 464199 473868 483976 494423
59349 494423 505808 518474 532036 545865 559495 572489 584469 595430 605615 614930 622862 628984
59337 628984 633118 635031 634524 631957 628161 623590 617968 610988 602941 594396 585636 576730 567902 559495
59323 559495 551753 544852 538993 534254 530334 526561 522131 516502 509785 502707 495964 489547 482966 476020
59309 476020 469090 462732 457349 453170 450055 447275 444046 440403 437190 435055 433958 433689 434176 434962 435074
59294 435074 434038 432644 432160 433042 434844 437044 439427 441862 444315 447009 450092 453226 455960 458495 461606
59279 461606 465764 470738 476131 481926 488334 495409 502974 510759 518514 526110 533588 540981 548086 554502
59265 554502 559919 564153 566967 568053 567309 565062 561960 558590 555108 551147 546175 540002 532878 525172
59251E25172p951p671o728n538m776m513m177l443k610j876r01M93J750K285K340
59236D81856K569K982K969K289J387O40j29j187k402l510m502n431o073o238o245
59221D58975o571p015o796n744m908n286o253o065m122j821p80r05r99o23l86
59206D00701n55n18J70J080J661J984K317K496K204J482N98k21n90k2J373K586
59190D16746K772K288K154K657L225L507L872M577N169N100M561M224M306M391
59176D69549M187M056M480N239N524M944M038L630L944M661N477O173O349N683
59162E37934M471L350K454J358r7j533k744l957n120n684n491n215n348n393m794
59147E04191m039m007m577m891m690m433m214l605k664k110k171k143j493o28
$$ plain form
59251 525172 517221 509550 502822 497284 492508 487995 483818 480375 477765 475889 474988 475481 477231 479516 481856
59236 481856 484425 487407 490376 492665 494052 494692 494563 493376 490974 487464 482962 477531 471458 465220 458975
59221 458975 452404 445389 438593 432849 427941 422655 416402 410337 406215 404394 403614 402709 401710 401087 400701
59206 400701 400146 399628 399798 400878 402539 404523 406840 409336 411540 413022 413620 413399 412809 412787 414160 416746
59190 416746 419518 421806 423960 426617 429842 433349 437221 441798 446967 452067 456628 460852 465158 469549
59176 469549 473736 477792 482272 487511 493035 497979 502017 505647 509591 514252 519729 525902 532251 537934
59162 537934 542405 545755 548209 549567 549470 547937 545193 541236 536116 530432 524941 519726 514378 508985 504191
59147 504191 500152 496145 491568 486677 481987 477554 473340 469735 467071 464961 462790 460647 459154 458526
59133D58526j68j10j76l38m30J07J479K945L680L859M240M958N528N858O429P457
59117E03844Q532R364J0175J1121J1886J2200J2358J2760J3230J3279J2824J2249
59105F43822J1772J1239J0550R897R373Q592P021M693K326O71j76p01j299j906
59091G15874k315k549k715k679k298j913k218l434m989o262p298q486r784j0786
59077F48148j1365j1749j1945j1644j0838j0037r651r468r049q353p629o969o254
59064E23197n445m640l955l538l569m018m581m953n076m887m195l038j970j571
59050D67761j773j985j779j184m35K30N79N23J92k22n77n88J43J481K584K861
59034D67811K835L354M209M392L711L242L911N421O969Q322R712J1156J2427J3456
$$ plain form
59133 458526 458358 458248 458072 457734 457304 457411 458890 461835 465515 469374 473614 478572 484100 489958 496387 503844
59117 503844 512376 521740 531915 543036 554922 567122 579480 592240 605470 618749 631573 643822
59105 643822 655594 666833 677383 687280 696653 705245 712266 716959 719285 719956 719780 719079 717780 715874
59091 715874 713559 711010 708295 705616 703318 701405 699187 695753 690764 684502 677204 668718 658934 648148
59077 648148 636783 625034 613089 601445 590607 580570 570919 561451 552402 544049 536420 529451 523197
59064 523197 517752 513112 509157 505619 502050 498032 493451 488498 483422 478535 474340 471302 469332 467761
59050 467761 465988 464003 462224 461040 460605 460835 461414 461937 462129 461907 461330 460742 460885 462366 464950 467811
59034 467811 470646 474000 478209 482601 486312 489554 493465 498886 505855 514177 523889 535045 547472 560928
59020E60928J4308J4941J5203J4900J3775J1754R297P090N258L311J046j042k430
59007F68339l098l163k591j595p14j07O45J601K043J578R03P31O36j62j364k109
58991F61573k533l594n385o842p358p631q451r522j0049r886r457q905p933o422
58977E57605m798l670l120k448q86J327K914L023K322K132K728L241L125K820
58963E66315K934L530M482N701O688O581N161L305J973J212M94m48j650l290n336
58948E97652p143p994p952p623p228o394m917l222j970j521j927l106m835o622
58934E25198p825q024p343o363n555m834l875k793k148k194k438k193j364m10
58920D67839J96K97Pl84n76m74k17J40P23J490K150K643L392M653N922O492O494
$$ plain form
59020 560928 575236 590177 605380 620280 634055 645809 655106 662196 667454 670765 671811 670769 668339
59007 668339 665241 662078 659487 657892 657178 657071 657716 659317 661360 662938 663841 664572 665208 665046 663682 661573
58991 661573 659040 655446 650061 643219 635861 628230 619779 610257 600208 590322 580865 571960 564027 557605
58977 557605 552807 549137 546017 543569 542683 544010 546924 549947 552269 554401 557129 560370 563495 566315
58963 566315 569249 572779 577261 582962 589650 596231 601392 604697 606670 607882 608376 607928 606278 602988 597652
58948 597652 590509 582515 574563 566940 559712 553318 548401 545179 543209 541688 539761 536655 531820 525198
58934 525198 517373 509349 502006 495643 490088 485254 481379 478586 476438 474244 471806 469613 468249 467839
58920 467839 468035 468332 468339 467955 467379 466905 466688 466828 467551 469041 471191 473834 477226 481879 487801 494293 500787
58903E00787O793P740Q565Q303P017N678N028M889M701M390M468N360O848Q371
58889E88938R674J0936J2271J3403J3922J3732J3044J2033J0638Q746O404L890
58877G17631J559m19k249m370o953r565j1379j1843j1142j0031r191q684q094
58864F25270p116n981n165m853m830m843m858m942n100n296n506n716n953o287
58850E48824o680o818o364n410m461l859l440k931k565k891m012n209n605n126
58836D83453m530m405m429l927k988k464k753l165k911k246k016k368k623k317
58822D40311j716j135n10J76N91N99N85Q89J291J456J508J729J934J749J304J155
58806D51916J473J810J714J256P53L49j6m03q24j236j450j166k98P50J276Q89
$$ plain form
58903 500787 507580 515320 523885 532188 539205 544883 549911 554800 559501 563891 568359 573719 580567 588938
58889 588938 598612 609548 621819 635222 649144 662876 675920 687953 698591 707337 713741 717631
58877 717631 719190 718771 716522 712152 705199 695634 684255 672412 661270 651239 642048 633364 625270
58864 625270 618154 612173 607008 602155 597325 592482 587624 582682 577582 572286 566780 561064 555111 548824
58850 548824 542144 535326 528962 523552 519091 515232 511792 508861 506296 503405 499393 494184 488579 483453
58836 483453 478923 474518 470089 466162 463174 460710 457957 454792 451881 449635 447619 445251 442628 440311
58822 440311 438595 437460 436950 437126 437717 438316 438901 439790 441081 442537 444045 445774 447708 449457 450761 451916
58806 451916 453389 455199 456913 458169 458922 459271 459255 458852 458028 456792 455342 454176 453878 454628 455904 456793
58790D56793o0p17n19L05J061J356J455J880K797L838M441M395M086M103M587
58775D89801N059N024M472L595K254K49k033l744m494m728m995n238n055m427
58761D75740l856l805m146m165l241j609l06m4l19o2J023K279L162L717L968L593
58745D71929K589J590J125J053J123J512K286K936L052L060L691M988O405P557
58731E14896Q330Q531Q094P384O744N946M714L452K715K266J475N33L35J102K073
58716E78590K716L351M260N068N405N470N453N036M079L137K640K034M78j942
58702F25775m457o719q873j0613j1255j0963j1010j2200j3689j3991j2844j1343
58690D97818j0392r758q786p405o015m862l970l465l437l553l300k676k213k154
$$ plain form
58790 456793 456733 456016 455497 455802 456863 458219 459674 461554 464351 468189 472630 477025 481111 485214 489801
58775 489801 494860 499884 504356 507951 510205 510454 508421 504677 500183 495455 490460 485222 480167 475740
58761 475740 471884 468079 463933 459768 456527 454918 454612 454568 454249 454187 455210 457489 460651 464368 468336 471929
58745 471929 474518 476108 477233 478286 479409 480921 483207 486143 489195 492255 495946 500934 507339 514896
58731 514896 523226 531757 539851 547235 553979 559925 564639 568091 570806 573072 574547 575080 575415 576517 578590
58716 578590 581306 584657 588917 593985 599390 604860 610313 615349 619428 622565 625205 627239 627717 625775
58702 625775 621318 614599 605726 595113 583858 572895 561885 549685 535996 522005 509161 497818
58690 497818 487426 477668 468882 461477 455462 450600 446630 443165 439728 436175 432875 430199 427986 425832
58676D25832k072j440l33P32J395J699J934K468L502M830N970O763P564Q612R465
58661D76921R464Q528P071N305L084M85j966l795n000n789o153n937n206m325
58647D72687l641l147k566j726q72m06m15o02p38q84j123j333j359j210r25n55
58631D51185l59o92j379j611q63L33R65P38L01M39J349K600L535L778L672L993
58615D67984M969N859N814M912L906L288L038L024L034K618J512J66p09r62r33
58600E07520p51m21l10q11j557j815j608j548j628j138RR77J423K147L756N536
58584E09781O473O665O898P377P763Q042Q491Q951Q929Q363P633O933O186N579
58570F14064N529O100O920P741Q623R596J0587J1770J3486J5650J7664J9067J9951
$$ plain form
58676 425832 423760 422320 421987 422719 424114 425813 427747 430215 433717 438547 444517 451280 458844 467456 476921
58661 476921 486385 494913 501984 507289 510373 510858 508892 505097 500097 494308 488155 482218 477012 472687
58647 472687 469046 465899 463333 461607 460735 460329 459914 459312 458574 457690 456567 455234 453875 452665 451740 451185
58631 451185 450826 450134 448755 447144 446281 446614 447579 448317 448618 449057 450406 453006 456541 460319 463991 467984
58615 467984 472953 478812 484626 489538 493444 496732 499770 502794 505828 508446 509958 510124 509415 508453 507520
58600 507520 506769 506348 506038 505227 503670 501855 500247 498699 497071 495933 495942 496919 498342 500489 504245 509781
58584 509781 516254 522919 529817 537194 544957 552999 561490 570441 579370 587733 595366 602299 608485 614064
58570 614064 619593 625693 632613 640354 648977 658573 669160 680930 694416 710066 727730 746797 766748
58557G66748K0422K0017J8093J4744J0992P880N667M012K689J688O69j005l495
58544H69121o063p926r225j0645j2362j3906j4985j5747j6278j6433j6256j5909
58532G13386j5141j3535j1434r847r107q404p039n428m299l554k643j516m75M35
58518F21399J189J414J018Q85J931L655M523L841K453J465J027O51P6n71j109
58503F43847j531j972k556l083l092k514k046k409l309l719l161k129j206m11
58489F10709L76R39J059R80J224K099L595N489P387Q852R682J0009J0092J0104
58475F82596J0134J0094R669Q576O910N004K949O31j759l639m643n011n218n381
58461G10912n208m383k885j013P94K255L334M075M464M614M861N326N505M646
$$ plain form
58557 766748 787170 807187 825280 840024 851016 858896 864563 868575 871264 872952 873621 872616 869121
58544 869121 863058 855132 845907 835262 822900 808994 794009 778262 761984 745551 729295 713386
58532 713386 698245 684710 673276 663429 654322 645918 638879 633451 629152 625598 622955 621439 620964 621399
58518 621399 622588 624002 625020 625905 627836 631491 636014 639855 642308 643773 644800 645451 645527 644956 643847
58503 643847 642316 640344 637788 634705 631613 629099 627053 624644 621335 617616 614455 612326 611120 610709
58489 610709 611085 612024 613083 614063 615287 617386 620981 626470 633857 642709 652391 662400 672492 682596
58475 682596 692730 702824 712493 721069 727979 732983 735932 736563 734804 731165 726522 721511 716293 710912
58461 710912 705704 701321 698436 697423 698217 700472 703806 707881 712345 716959 721820 727146 732651 737297
58447G37297K556j89k813m819o019o471o375n815m611k729o95P69J473J775J933
58432G05267J989K181K860L895M751N372O342P902R372J0055J0200J0519J0993
58419G91698J0845R615P737N931M374K706O47j509l068l597l401l282l840n022
58405H09834o232o718n940l950j507M65J674K561L584M630N275N382N221N152
58391H19431N283N365N040M246L319K549J823J009M76P88J906L180M125M705M810
58376H68055M117K689J186J62l54l93K63J551K864L764M508N474O481P236P941
58361I15544Q864R647R804R553R472R516R145Q326P604P164O591N751N193N355
58347A027529N924O342O530O784P208P661Q097Q759J0009J1929J3998J5344J5636
$$ plain form
58447 737297 739853 739664 736851 732032 726013 719542 713167 707352 702741 700012 699317 700086 701559 703334 705267
58432 705267 707256 709437 712297 716192 720943 726315 732657 740559 749931 759986 770186 780705 791698
58419 791698 802543 812158 819895 825826 830200 832906 833553 832044 828976 825379 821978 818696 814856 809834
58405 809834 803602 796884 790944 786994 785487 785952 787626 790187 793771 798401 803676 809058 814279 819431
58391 819431 824714 830079 835119 839365 842684 845233 847056 848065 848541 849329 851235 854415 858540 863245 868055
58376 868055 872172 874861 876047 876209 875855 875462 875725 877276 880140 883904 888412 893886 900367 907603 915544
58361 915544 924408 934055 943859 953412 962884 972400 981545 989871 997475 1004639 1011230 1016981 1022174 1027529
58347 1027529 1033453 1039795 1046325 1053109 1060317 1067978 1076075 1084834 1094843 1106772 1120770 1136114 1151750
58334A151750J5564J6039J7011J7582J7202J6160J4866J3270J1326R393P857O749
58322A314769O031N856O197O705P207P917Q762R117Q721Q398R171J0975J2953
58309A422779J4614J5997J6945J7265J7559J8804K0826K2206K2134K1522K1539
58298A632190K1915K1532K0302J9344J9385J9909K0058J9709J9410J9692K0760
58287A854206K2494K4507K6358K7812K8861K9549L0093L1028L2729L4799L6358
58276B178794L7142L7837L9160M1057M3124M5315M7830N0559N3142N5414N7455
58265B686829N9351O1298O3700O6732O9924P2595P4700P6700P8711Q0258Q1033
58254C471831Q1456Q2315Q4142Q7063R0895R5179R9432J03650J08382J14099J20712
$$ plain form
58334 1151750 1167314 1183353 1200364 1217946 1235148 1251308 1266174 1279444 1290770 1300163 1308020 1314769
58322 1314769 1320800 1326656 1332853 1339558 1346765 1354682 1363444 1372561 1381282 1389680 1398851 1409826 1422779
58309 1422779 1437393 1453390 1470335 1487600 1505159 1523963 1544789 1566995 1589129 1610651 1632190
58298 1632190 1654105 1675637 1695939 1715283 1734668 1754577 1774635 1794344 1813754 1833446 1854206
58287 1854206 1876700 1901207 1927565 1955377 1984238 2013787 2043880 2074908 2107637 2142436 2178794
58276 2178794 2215936 2253773 2292933 2333990 2377114 2422429 2470259 2520818 2573960 2629374 2686829
58265 2686829 2746180 2807478 2871178 2937910 3007834 3080429 3155129 3231829 3310540 3390798 3471831
58254 3471831 3553287 3635602 3719744 3806807 3897702 3992881 4092313 4195963 4304345 4418444 4539156
58243D539156J27838J35315J43175J51295J59492J67875J76817J86530J96971
58234E984464K08261K20916K35388K51489K68656K86784L06490L28310L51962
58225H442720L76785M02798M30838M61682M95668N33530N76952O27763O86775
58216A3035511P53974Q29730R15359J012617J123365J250083J396367J566621
58208B1883627J765601J998964K273938K596952K966763L368600L779891M190948
58200D4825284M627312N152984N848439O780687P988740R491626J1306769J3461420
58192A09483261J5987847J8905196K2196332K5773792K9404715L2582067L4424425
58185B88757635L3780429K9647689K1755463J0925517j104449j2335369k1232763
$$ plain form
58243 4539156 4666994 4802309 4945484 5096779 5256271 5424146 5600963 5787493 5984464
58234 5984464 6192725 6413641 6649029 6900518 7169174 7455958 7762448 8090758 8442720
58225 8442720 8819505 9222303 9653141 10114823 10610491 11144021 11720973 12348736 13035511
58216 13035511 13789485 14619215 15534574 16547191 17670556 18920639 20317006 21883627
58208 21883627 23649228 25648192 27922130 30519082 33485845 36854445 40634336 44825284
58200 44825284 49452596 54605580 60454019 67234706 75223446 84715072 96021841 109483261
58192 109483261 125471108 144376304 166572636 192346428 221751143 254333210 288757635
58185 288757635 322538064 352185753 373941216 384866733 383762284 371426915 350194152
58178C50194152k7113139l0082000l0711689k9711689k7722353k5232425k2572892
58171A57047965j9946467j7466235j5188379j3135221j1310605r708981q319009
58164F1973068p124712o106950n245102m518165l905817l389768k954306k585743
58156B6142505k272244k004409j775062j577955j407292j258706j129632j017882
58148A3699323r20542q34764p58883o91907o32434n78842n30195m86158m46364
58139G819234m10436l78384l50206l25293l02811k82451k64160k47426k31625
58130E026442k16821k03415j91057j78843j66731j55800j46725j38784j30912
58121C497354j23085j16034j10045j04671r9428r4246q9310q4862q1061p7751
$$ plain form
58178 350194152 323081013 292999013 262287324 232575635 204853282 179620857 157047965
58171 157047965 137101498 119635263 104446884 91311663 80001058 70292077 61973068
58164 61973068 54848356 48741406 43496304 38978139 35072322 31682554 28728248 26142505
58156 26142505 23870261 21865852 20090790 18512835 17105543 15846837 14717205 13699323
58148 13699323 12778781 11944017 11185134 10493227 9860793 9281951 8751756 8265598 7819234
58139 7819234 7408798 7030414 6680208 6354915 6052104 5769653 5505493 5258067 5026442
58130 5026442 4809621 4606206 4415149 4236306 4069575 3913775 3767050 3628266 3497354
58121 3497354 3374269 3258235 3148190 3043519 2944091 2849845 2760535 2675673 2594612 2516861
58111B516861p4468p0976o7622o4855o2611o0470n8221n5903n3535n1178m9134
58100A847888m7522m5863m3649m1250l9578l8786l7958l6381l4453l2932l1792
58089A417724l0390k8420k6253k4397k3094k2329k1905k1524k1023k0491k0126
58078A157772k0107k0655k1810k3004k3285k2395k1198k0681k0772k0684k0046
58067I23135j9105j8031j6737j5340j4137j3100j1990j0973j0523j0622j0695
58056G71882j0507j0451j0758j1061j1072j0980j0864j0257q920p547p052p514
58044F54899q342r119r726r861r289q445q127q455q723q368p568o747n983n209
58030E40937m630m579n203o415p965r329r855r287q145p222o789o486o003n542
$$ plain form
58111 2516861 2442393 2371417 2303795 2238940 2176329 2115859 2057638 2001735 1948200 1897022 1847888
58100 1847888 1800366 1754503 1710854 1669604 1630026 1591240 1553282 1516901 1482448 1449516 1417724
58089 1417724 1387334 1358914 1332661 1308264 1285170 1262841 1240936 1219412 1198389 1177898 1157772
58078 1157772 1137665 1117010 1095200 1072196 1048911 1026516 1005318 984637 963865 943181 923135
58067 923135 904030 885999 869262 853922 839785 826685 814695 803722 793199 782577 771882
58056 771882 761375 750924 740166 729105 718033 707053 696189 685932 677012 669465 662413 654899
58044 654899 646557 637438 627712 617851 608562 600117 591990 583535 574812 566444 558876 552129 546146 540937
58030 540937 536307 531728 526525 520110 512145 502816 492961 483674 475529 468307 461518 455032 449029 443487
58016D43487n432n484n134m237l365l090l283l432l425l560l806l690l027k312
58002C90210k078k243k382k367k404k692l278m007m361l748k228o77J71M88P92
57987C59196J092J116J020J156J349J103M24k60q84j729k633l035k920k916l278
57972C48801l529l389l253l372l238k324r51J64P09P27K14o18j084o72L26J258
57956C29769J933K461K658K235J460R96J098J471J893K385K882L172L310L591
57942C61314M048M467M858N503O393P106P368P396P408P178O377N082L699K414
57928D40611R93r05l307n837p985r449j0254j0618j0769j0807j0646j0069r086
57915C41872q097p443o843n750m311l376l281l251k448j094J6O33R63Q91J86p17
$$ plain form
58016 443487 438055 432571 427437 423200 419835 416745 413462 410030 406605 403045 399239 395549 392522 390210
58002 390210 388132 385889 383507 381140 378736 376044 372766 368759 364398 360650 358422 357745 357916 358404 359196
57987 359196 360288 361404 362424 363580 364929 366032 366456 366196 365312 363583 360950 357915 354995 352079 348801
57972 348801 345272 341883 338630 335258 332020 329696 328745 328909 329618 330345 330559 329941 328857 328185 328511 329769
57956 329769 331702 334163 336821 339056 340516 341512 342610 344081 345974 348359 351241 354413 357723 361314
57942 361314 365362 369829 374687 380190 386583 393689 401057 408453 415861 423039 429416 434498 438197 440611
57928 440611 441604 440699 437392 431555 423570 414121 403867 393249 382480 371673 361027 350958 341872
57915 341872 333775 326332 319489 313739 309428 306052 302771 299520 297072 295978 295994 296627 297590 298481 298667 297950
57899B97950j038p60n90q06r36o27q5N48J477K619L430L577L187K260O23j259
57883C09570k316k170j673j693k117k519k987l609l913l635l425l907m616m768
57869B66222m522m467m357l541k358j825j986j777p07M79J106J466K011K531K710
57854B50985K792L147L656L999M035L585K341M15j466k591k845k520k096k313
57840B61124l608n197n512m056k217j541j836j711m77J272K696L406L367K849
57826B48559K481K706L115K899J901P49j8l97n36m47k28j63m44j099k138l453
57810B53487m642n295n404n180m594l598k539j946j876j999k194k544k825k653
57796B06198k140j774j559r82JP00O60L02K36N40J058J810K714L425L906M614
$$ plain form
57899 297950 296912 296152 295562 294756 293820 293193 293108 293656 295133 297752 301182 304759 307946 310206 310829 309570
57883 309570 307254 305084 303411 301718 299601 297082 294095 290486 286573 282938 279513 275606 270990 266222
57869 266222 261700 257233 252876 249335 246977 245152 243166 241389 240682 241161 242267 243733 245744 248275 250985
57854 250985 253777 256924 260580 264579 268614 272199 274540 274955 273489 270898 268053 265533 263437 261124
57840 261124 257516 252319 246807 242751 240534 238993 237157 235446 234969 236241 238937 242343 245710 248559
57826 248559 251040 253746 256861 259760 261661 262410 262392 261995 261459 261012 260784 260621 260177 259078 256940 253487
57810 253487 248845 243550 238146 232966 228372 224774 222235 220289 218413 216414 214220 211676 208851 206198
57796 206198 204058 202284 200725 199743 199744 200444 201104 201406 201642 202182 203240 205050 207764 211189 215095 219709
57780B19709N652O329O110N522N437N879O180N916M990L223Q36j090j632j446
57766B71615k067l739n082n217m985n449o214o184n369m807m972n245m991m340
57752B02954l687l108k569k274k415k758k811k314j478p30l51l22m71p17j040
57737A75909j323j436j515j800k116j863q38K29M73J5k41J44O68P41M38J68R7
57720A67750K35O99J428J829J309R4q52q43r0P31J146J033M56l19p54l71P39J889
57702A76109K467K505K494K685K799K480J742P92l96k000l816n178n584n159m374
57687A67566l472k435j362n33q9J71O50J668L268N182P036Q781J0838J3686J7311
57672B28266K1299K5454L0104L5639M1832M7501N0660M9008M0846K6221P488j1362
$$ plain form
57780 219709 225361 231690 237800 243322 248759 254638 260818 266734 271724 274947 275783 274693 273061 271615
57766 271615 269548 265809 260727 255510 250525 245076 238862 232678 227309 222502 217530 212285 207294 202954
57752 202954 199267 196159 193590 191316 188901 186143 183332 181018 179540 178810 178459 178137 177666 176949 175909
57737 175909 174586 173150 171635 169835 167719 165856 165018 165247 165720 165735 165494 165638 166306 167047 167485 167653 167750
57720 167750 167985 168684 170112 171941 173250 173344 172492 171649 171559 172290 173436 174469 174925 174606 173852 173481 174220 176109
57702 176109 178576 181081 183575 186260 189059 191539 193281 194073 193677 191677 187861 182683 177099 171940 167566
57687 167566 164094 161659 160297 159764 159675 159846 160496 162164 165432 170614 177650 186431 197269 210955 228266
57672 228266 249565 275019 305123 340762 382594 430095 480755 529763 570609 596830 604318 592956
57660E92956k6584l6397m1300m2792m1882l8876l4330k9540k5691k2857k0254
57649B32453j7361j4322j1398q658o322m879m462m495m220l358k058n81O65J129
57635A52133O60j13m46m49r15k150l442l831l131j978j129q79j039j274j473j801
57619A28743k335k762k667k065j438j117r55o93m71o55j252j731j580q99k96j99
57603A07628m19m56r4M55R04J085Q46J73n04n30J14N65O0j034j704j548r96m75
57585A04070l3K03l1n15n53K5M63O6q94j720k205k414k091j068M7M51K86L98R27
57566I5412J022K01q02j057o24k29k00l01l36l18k29p3m7k40l06O8N56N52J78
57547I3227K10R21J587J471Q13M10N04O47N25L83N53R45J185J098Q27N64K60l20
$$ plain form
57660 592956 566372 529975 488675 445883 404001 365125 330795 301255 275564 252707 232453
57649 232453 215092 200770 189372 180714 174392 169513 165051 160556 156336 152978 150920 150339 151004 152133
57635 152133 152793 152680 152234 151785 150870 148720 145278 141447 138316 136338 135209 134330 133291 132017 130544 128743
57619 128743 126408 123646 120979 118914 117476 116359 115404 114711 114240 113585 112333 110602 109022 108123 107827 107628
57603 107628 107209 106753 106659 107114 108018 109103 109949 110122 109618 109088 109202 109767 109827 108793 107089 105541 104545 104070
57585 104070 104037 104240 104209 103694 103141 103166 103629 103695 102801 101081 98876 96462 94371 93303 93350 93801 94087 94485 95412
57566 95412 96434 96635 95833 94776 94152 93923 93723 93422 93086 92768 92539 92466 92419 92179 91873 91941 92497 93049 93227
57547 93227 93437 94358 95945 97416 98229 98639 99143 99790 100315 100698 101251 102196 103381 104479 105306 105870 106130 105810
57529A05810j207j917j778p06N11R78O03j4m19o57p65n46mM21L84R9o7j67m27
57510A00132o63m36K86J094J714K184K423K146J369N54Kn00j195j863k098j802
57494A03347j120k26N28O15n8q18r87p41o73p09k27P72J376R99K03j12J88O13
57476A02970Q50Q23L20p57j855k115j323r2R40J619J942J762J101L54j63n41r49
57459A04886j214j128q89q31q58n80j5L74L79L84P42J182J204Q73P71J122J401
57442A07803R83Rp32o57K2O76R89J136J352J553J540J336J059N71l51j402j726
57425A14161q68M66J094P51K86L76O24L52k68n09k75k07n37o10Q6J022J325R45
57407A18214N79N56N30K07j79l40l57m08m58m36m54n09l37J43M76J58o19j114
$$ plain form
57529 105810 104603 102686 100908 100202 100713 101691 102294 102280 101861 101204 100439 99893 99889 100310 100694 100793 100726 100559 100132
57510 100132 99469 99033 99319 100413 102127 104311 106734 108880 110249 110803 110805 110305 109110 107247 105149 103347
57494 103347 102227 102001 102529 103144 103086 102268 101281 100540 99867 99158 98931 99703 101079 102078 102281 102169 102357 102970
57476 102970 103820 104643 104963 104206 102351 100236 98913 98821 99761 101380 103322 105084 106185 106539 106376 105835 104886
57459 104886 103672 102544 101655 100824 99966 99386 99371 99745 100124 100508 101250 102432 103636 104509 105280 106402 107803
57442 107803 108786 108795 108063 107406 107428 108104 109093 110229 111581 113134 114674 116010 117069 117640 117289 115887 114161
57425 114161 113293 113759 114853 115604 115890 116266 116890 117242 116974 116465 116190 115983 115446 114836 114922 115944 117269 118214
57407 118214 118793 119349 119879 120086 119907 119567 119210 118802 118344 117908 117454 116945 116608 116751 117227 117385 116766 115652
57389A15652q53jJ011J864K301K169J668J282J262J394J425J427J530J478R03
57374A34512o3p63o81R1J056J760J880J234pj191j611j152l62K19N64R76J531
57357A37993J963J974J547R25M81N07Q86J057N61l08p28l63K01K57o1p3L46M90
57339A47655j76j162j420n78N89R96M03l67m06K85Q75O91q9p61p81o3J087K053
57321A48831K169J314J64m30k17M39J079J391J206P73P64J454K000J323k44j053
57305A60963k03J285J883J472J153J625K512L133L172K668J894J356J361J596
57291A85870J516J174J215K015L279M558N665O469O700O301N721N528N877O430
57277B48318O701O403N669M963M592M269L369J736o9j346j869j790j317o79j85
$$ plain form
57389 115652 114799 114798 115809 117673 119974 122143 123811 125093 126355 127749 129174 130601 132131 133609 134512
57374 134512 134449 133686 133005 133096 134152 135912 137792 139026 139019 137828 136217 135065 134703 134922 135486 136462 137993
57357 137993 139956 141930 143477 144402 144883 145390 146276 147333 147894 147586 146858 146495 146696 146953 146892 146819 147165 147655
57339 147655 147479 146317 144897 144319 144908 145904 146307 145940 145534 145819 146694 147385 147296 146535 145754 145691 146778 148831
57321 148831 151000 152314 152478 152048 151831 152270 153349 154740 155946 156719 157483 158937 160937 162260 162016 160963
57305 160963 160760 162045 163928 165400 166553 168178 170690 173823 176995 179663 181557 182913 184274 185870
57291 185870 187386 188560 189775 191790 195069 199627 205292 211761 218461 224762 230483 236011 241888 248318
57277 248318 255019 261422 267091 272054 276646 280915 284284 286020 285951 284605 282736 280946 279629 278950 278765
57262B78765O2L51J024J962K709L125L629M530N400N460M630L821L931M792N543
57247C29734N821O071O619P100P137P033P337Q052Q831R597J0329J0531R704Q437
57233D42333Q205R763J2205J3909J4076J3187J2283J2054J2427J2810J2851J2870
57221E88973J3302J3939J4223J4139J4228J4638J4908J4860J4964J5480J5950
57210G49604J6021J6135J6771J7528J7685J7379J7448J8259J9321K0015K0209
57199I46375K0123K0052K0174K0258J9706J8342J6996J6787J7834J9223K0119
57188A155989K0482K0682K1071K2005K3641K5495K6681K6924K6866K7168K7666
57177A424670K7817K7580K7419K7607K8054K8694K9643L0852L1907L2385L2315
$$ plain form
57262 278765 278827 279178 280202 282164 284873 287998 291627 296157 301557 307017 311647 315468 319399 324191 329734
57247 329734 335555 341626 348245 355345 362482 369515 376852 384904 393735 403332 413661 424192 433896 442333
57233 442333 450538 460301 472506 486415 500491 513678 525961 538015 550442 563252 576103 588973
57221 588973 602275 616214 630437 644576 658804 673442 688350 703210 718174 733654 749604
57210 749604 765625 781760 798531 816059 833744 851123 868571 886830 906151 926166 946375
57199 946375 966498 986550 1006724 1026982 1046688 1065030 1082026 1098813 1116647 1135870 1155989
57188 1155989 1176471 1197153 1218224 1240229 1263870 1289365 1316046 1342970 1369836 1397004 1424670
57177 1424670 1452487 1480067 1507486 1535093 1563147 1591841 1621484 1652336 1684243 1716628 1748943
57166A748943L2175L2453L3296L4483L5662L6478L6639L6125L5385L5091L5431
57155B132161L5790L5393L4181L2868L2199L2389L3172L4021L4310L3706L2537
57144B502727L1523L0937L0325K9190K7691K6365K5399K4613K3909K3345K2767
57133B798791K1848K0611J9551J8956J8499J7821J7347J8056K0445K4137K8395
57122C024457L2627L6212L8383L8747L7733L6220L4963L4759L6739M1834M9819
57111C442493N9429O9570Q0114R1472J04000J18170J34964J55668J81349K12720
57101D649949K50377K94982L47356M08521M79585N61457O54674P59212Q74132
57092I280245R97394J126357J258378J390486J518359J635693J734161J803359
$$ plain form
57166 1748943 1781118 1813571 1846867 1881350 1917012 1953490 1990129 2026254 2061639 2096730 2132161
57155 2132161 2167951 2203344 2237525 2270393 2302592 2334981 2368153 2402174 2436484 2470190 2502727
57144 2502727 2534250 2565187 2595512 2624702 2652393 2678758 2704157 2728770 2752679 2776024 2798791
57133 2798791 2820639 2841250 2860801 2879757 2898256 2916077 2933424 2951480 2971925 2996062 3024457
57122 3024457 3057084 3093296 3131679 3170426 3208159 3244379 3279342 3314101 3350840 3392674 3442493
57111 3442493 3501922 3571492 3651606 3743078 3847078 3965248 4100212 4255880 4437229 4649949
57101 4649949 4900326 5195308 5542664 5951185 6430770 6992227 7646901 8406113 9280245
57092 9280245 10277639 11403996 12662374 14052860 15571219 17206912 18941073 20744432
57084B0744432J831119J804848J712762J544093J291018R55762N59100J40024
57076C0583158k57692o02516q82309j099100j260258j373734j447224j488171
57068B2172154j503675j500102j481789j449772j402846j340704j265667j181416
57060A1046183j091189r97769r04112q12907p25940o44615n70573n04947m47349
57051D346782l96322l50701l10090k74316k43144k16499j94340j76129j60703
57042B024538j46818j33748j21481j10361j00539r1691q3427p5794o9032o2976
57032A028671n7216n1852m7445m4077m1126l8131l5212l2435k9515k6670k4850
57021F00142k4434k4269k2971k0645j8520j7159j6077j4938j4095j3693j3153
$$ plain form
57084 20744432 22575551 24380399 26093161 27637254 28928272 29884034 30443134 30583158
57076 30583158 30325466 29722950 28840641 27741541 26481283 25107549 23660325 22172154
57068 22172154 20668479 19168377 17686588 16236816 14833970 13493266 12227599 11046183
57060 11046183 9954994 8957225 8053113 7240206 6514266 5869651 5299078 4794131 4346782
57051 4346782 3950460 3599759 3289669 3015353 2772209 2555710 2361370 2185241 2024538
57042 2024538 1877720 1743972 1622491 1512130 1411591 1319900 1236473 1160679 1091647 1028671
57032 1028671 971455 919603 872158 828081 786955 748824 713612 681177 651662 624992 600142
57021 600142 575708 551439 528468 507823 489303 472144 456067 441129 427034 413341 400188
57010D00188j2021j0749j0137j0277j0512j0317r871r602r407q630o998n262m463
56997B81942m623m746m176l333k848k567j933q70K88J399K517L583M527N499O475
56982B81134O976O570N336L386N00l176o501q291q660q640q715q612q226p737
56968B35344o854n049k741j152o54j44J439L780N904P574R291J1341J3334J4405
56954B85818J3590J0388N371o2m781q535j1347j2940j3113j2201j0727q926o971
56941B25564n174l602j849L45K665M801P043R770J2725J5374J7593J9298J9590
56928C24143J7243J2115N555q46o386j1114j5073j8033j9687j9874j8750j6863
56916B32430j4874j3150j1664j0284q999p788o545n146l601k122j124r68j546
$$ plain form
57010 400188 388167 377418 367281 357004 346492 336175 326304 316702 307295 298665 291667 286405 281942
56997 281942 277319 272573 268397 265064 262216 259649 257716 256846 257134 258533 261050 264633 269160 274659 281134
56982 281134 288110 294680 300016 303402 303902 300726 294225 285934 277274 268634 259919 251307 243081 235344
56968 235344 228490 223441 220700 219548 218894 218750 220189 223969 229873 237447 246738 258079 271413 285818
56954 285818 299408 309796 315167 315105 310324 301789 290442 277502 264389 252188 241461 232535 225564
56941 225564 220390 216788 214939 215284 217949 222750 229793 239563 252288 267662 285255 304553 324143
56928 324143 341386 353501 359056 358210 351824 340710 325637 307604 287917 268043 249293 232430
56916 232430 217556 204406 192742 182458 173459 165671 159126 153980 150379 148257 147133 146165 144619
56903A44619k228k424k098j570j008m10R3L20M11P36J392K139K895L994N817Q419
56887A61097J1560J4743J7157J7969J6912J4324J0558N790O90l329n226n480n458
56874B51307n705n504m229k322n16J277L680O785J0107J3461J7246K1741K6713
56861C34041L1781L6609M0412M1812L9611L3519K4013J2007r15j2483k0783k5364
56849E34260k6892k5999k3042j8804j4467j0525o368j277M658J0994J7778K5311
56837D65627L3402M1475M9219N6510O2546O5498O3228N4276L8546J7742m636k4456
56825I18977l8931m7695n2001n3148n1815m8371m3183l6576k9035k1511j4980
56814D81731r356l325M218J2791K0917K7944L4533M1047M6104M7092M1972L0434
$$ plain form
56903 144619 142391 139967 137869 136299 135291 134881 134974 135294 135705 136441 137833 139972 142867 146861 152678 161097
56887 161097 172657 187400 204557 222526 239438 253762 264320 270110 270800 267471 262245 256765 251307
56874 251307 245602 240098 235869 233547 233031 234308 237988 244773 254880 268341 285587 307328 334041
56861 334041 365822 402431 442843 484655 524266 557785 581798 593805 592890 580407 559624 534260
56849 534260 507368 481369 458327 439523 425056 414531 408163 406886 411544 422538 440316 465627
56837 465627 499029 540504 589723 646233 708779 774277 837505 891781 930327 948069 943433 918977
56825 918977 880046 832351 780350 727202 675387 627016 583833 547257 518222 496711 481731
56814 481731 472375 469050 473268 486059 506976 534920 569453 610500 656604 703696 745668 776102
56802G76102J3981m530k1752l5116m3668m7706m7933m5303m1206l6903l2608k7785
56790D05573k2374j7167j2657q266l201K326P371J1535J5345J9202K2416K3486
56778D43589K1255J5713P820j200j0249j8227k4058k7277k8456k8594k8138k6927
56766B95251k4981k2706k0229j7291j4069j1471j0102r407q493p371o715o599
56754A35817o243n081l434k036j315j286j645j866j611j215j372k203k995l070
56740A00445k566k122k082k234k146j479k50R91J440Q53j08n74l98p6J06L34P11
56723I0845R67R15P82P90P06K64k04j07N19R39P63N51R82J843K245J757Q16P6
56705A05449k66l79m06l84l61m13n86q32q93l75P68J847K001J261O32Q30J346
$$ plain form
56802 776102 790083 785553 763801 728685 685017 637311 589378 544075 502869 465966 433358 405573
56790 405573 383199 366032 353375 345109 341908 344234 351605 363140 378485 397687 420103 443589
56778 443589 464844 480557 488377 487177 476928 458701 434643 407366 378910 350316 322178 295251
56766 295251 270270 247564 227335 210044 195975 184504 174402 164995 156502 149131 142416 135817
56754 135817 129574 124493 121059 119023 117708 116422 114777 112911 111300 110085 108713 106510 103515 100445
56740 100445 97879 95757 93675 91441 89295 87816 87566 88557 89997 90850 90742 90168 89770 89694 89800 90134 90845
56723 90845 91812 92727 93509 94299 95005 95269 95065 94958 95477 96416 97179 97730 98712 100555 102800 104557 105373 105449
56705 105449 105183 104804 104398 104014 103653 103240 102654 101822 100929 100554 101322 103169 105170 106431 107063 107893 109239
56688A09239J199L42k89p1M68L92m27j213j245o68k13l54q72j201r48j18R29J591
56670A06541J379M38m20n78l06k24k94P0Q36J127M76l24j98P89J628J749J519
56653A14208J457J548J517J346J233J258J275J087O85L01K08M43Q55J366J963
56638A30750K334J993R57q5n60o43p36p14k43M59Q31P93P54Q66Q11L92k15q13
56620A36931j326j605j578j587j974k383k069j076l39m63r93j221j074q30n40
56605A17873k20r8j76n4L57M01l80j264j134nJ013J232J075J178J462J437R27
56588A23624J63n24r20j031j067j126q87j1J137J679J314P35O07O80M12M0K54
56571A25079R11J050L15l40J13J455K745L704M738N752N992N280M611M931N838
$$ plain form
56688 109239 110438 110780 110491 110420 110888 111280 110853 109640 108395 107727 107514 107160 106288 105087 104139 104021 104950 106541
56670 106541 107920 108358 107938 107360 107054 106830 106536 106606 107442 108569 109045 108721 108523 109312 110940 112689 114208
56653 114208 115665 117213 118730 120076 121309 122567 123842 124929 125614 125915 126123 126566 127421 128787 130750
56638 130750 133084 135077 136034 135949 135389 134746 134010 133296 133053 133512 134343 135136 135890 136756 137567 137959 137744 136931
56620 136931 135605 134000 132422 130835 128861 126478 124409 123333 122994 122531 121538 120317 119243 118413 117873
56605 117873 117653 117555 117379 117325 117682 118083 117703 116439 115305 115300 116313 117545 118620 119798 121260 122697 123624
56588 123624 123787 123263 122343 121312 120245 119119 118232 118221 119358 121037 122351 123086 123693 124373 124785 124825 125079
56571 125079 125990 127040 127355 127015 127128 128583 131328 135032 139770 145522 151514 156794 161405 166336 172174
56556A72174O095N137L455J815O51J73L51P65R47Q96Q66O91K4q52j176q85q57
56539A90270j548k182j900j098p72j026j086o88m24p23j289j840k554l388l641
56524A66111k879j797j467j845j847r11J86M16j18m84l34l08r04j626j700j244
56508A49249j094j599k171k160j612q68oR46J578J418N43n50j523k212k258j396
56492A36285j48L98j54r38q35K00J182J312P55K41K50P05J207J409J185O69J85
56475A43908Q7M90J082J288Q24N6l12M0P82J415J791K034K082J679Q06r4n46n62
56457A56850m97m63k18K73N47K28l16l73J22M77K30j84k9Q52J981K776K832J993
56439A67081O12m89p29m22l31o77j039j086r47q02o31m52l76l45j65J34L69O62
$$ plain form
56556 172174 178269 183406 186861 188676 189327 189500 189851 190616 191563 192459 193325 194016 194040 193188 192012 191127 190270
56539 190270 188722 186540 184640 183542 182770 181744 180658 179970 179546 178823 177534 175694 173140 169752 166111
56524 166111 163232 161435 159968 158123 156276 155365 155551 155967 155849 155365 155031 154723 153819 152193 150493 149249
56508 149249 148155 146556 144385 142225 140613 139745 139739 140685 142263 143681 144224 143674 142151 139939 137681 136285
56492 136285 136137 136535 136381 135443 134608 134808 135990 137302 138057 138298 138548 139253 140460 141869 143054 143723 143908
56475 143908 143995 144485 145567 146855 147679 147735 147423 147463 148245 149660 151451 153485 155567 157246 158052 157958 157412 156850
56457 156850 156353 155890 155672 155945 156492 156720 156404 156031 156153 156630 156860 156676 156647 157499 159480 162256 165088 167081
56439 167081 167693 167204 166475 166053 165722 165045 164006 162920 161973 161171 160540 160088 159712 159367 159202 159336 159705 160367
56421A60367J288J964J938J093L36M60J104J411J261J139J077N48n05j299j095
56406A71087n0J062J641J657J450J383J470J406J024O51O87R26P88K21j74m2J61
56389A85348r3n22l66N29J478J773J418R45P85R41J153J228J241J398J662J616
56373B00534R00k44r95p07M25J463J582P98p2k13M15J081J060M11q9J78R25J206
56355B08658N52l74n00L25J104R53J93j76K13Q31J186J374J530J360O59p0l5Q39
56337B18622J779K082J840J609J597J480R30J68k00J78J054J929K524K762K532
56322B40886J839J088Q28J083J327J206R75J001J224J436J681K057K312K086J457
56307B62486Q20L93K05M53J321K477L162K987K324J779J570J525J410J143Q18
$$ plain form
56421 160367 161655 163619 165557 166650 166986 167446 168550 169961 171222 172361 173438 173986 173481 172182 171087
56406 171087 171037 172099 173740 175397 176847 178230 179700 181106 182130 182781 183468 184394 185182 185403 185229 185187 185348
56389 185348 185255 184733 184367 184896 186374 188147 189565 190510 191295 192236 193389 194617 195858 197256 198918 200534
56373 200534 201434 201190 200195 199488 199913 201376 202958 203756 203684 203471 203886 204967 206027 206438 206349 206527 207452 208658
56355 208658 209210 208836 208336 208661 209765 210718 210911 210735 210948 211779 212965 214339 215869 217229 217888 217818 217783 218622
56337 218622 220401 222483 224323 225932 227529 229009 229939 230107 229907 230085 231139 233068 235592 238354 240886
56322 240886 242725 243813 244641 245724 247051 248257 249232 250233 251457 252893 254574 256631 258943 261029 262486
56307 262486 263306 263699 263904 264357 265678 268155 271317 274304 276628 278407 279977 281502 282912 284055 284873
56292B84873O65Q33J181J448J557J613J617J484J404J788K780L939M645M687M385
56277C18899M178M191M151L806L342L233L596M041M321M753N572O261O197N749
56263C82290N935O999Q135Q806R530J0938J2791J4486J5997J7664J9471K1169
56251E34211K2932K5229K8138L1204L4005L6417L8377L9751M0429M0363L9538
56240I10594L8136L6452L4354L1119K6182J9920J3283O774K93o098j1802j6245
56228A082962j9500k2169k4823k7639l0298l2153l2660l1844l0324k8874k7827
56217G74851k6857k5375k3300k1358k0247j9687j8732j7105j5514j4435j3326
56206E58915j1609r715q392p496o364n106m509m683m724l936k652j598j081r94
$$ plain form
56292 284873 285538 286371 287552 289000 290557 292170 293787 295271 296675 298463 301243 305182 309827 314514 318899
56277 318899 323077 327268 331419 335225 338567 341800 345396 349437 353758 358511 364083 370344 376541 382290
56263 382290 388225 395224 403359 412165 421695 432633 445424 459910 475907 493571 513042 534211
56251 534211 557143 582372 610510 641714 675719 712136 750513 790264 830693 871056 910594
56240 910594 948730 985182 1019536 1050655 1076837 1096757 1110040 1116814 1117107 1111009 1099207 1082962
56228 1082962 1063462 1041293 1016470 988831 958533 926380 893720 861876 831552 802678 774851
56217 774851 747994 722619 699319 677961 657714 638027 619295 602190 586676 572241 558915
56206 558915 547306 537591 529199 521703 515339 510233 505724 501041 496317 492381 489729 488131 487050 486056
56192D86056j126j198j000o83n23l99P6Q71J542J893K082K033J537J055J558L137
56176D96911M515M517L508K791L035L877M714N308N696O044O569P260P834Q165
56162E70744Q561R356J0416J1331J1899J2227J2624J3552J5396J7978K0670K3258
56150G38012K6305L0373L5267M0556M6474N3680O2320P1928Q2015R2073J00906
56139A379909J06640J07701J03625R4941Q2864O9340N6874M7652M2483M0487L9596
56128B172112L7439L2194K3334J1981M06r252j6280k1542k6434l1980l8997m8477
56116B084504o0803p4473q6472r4337r7561r6785r2444q4935p5559o6235n8053
56105A196847n0653m3139l5259k7639k1218j6509j3142j0127o823l608j355k98
$$ plain form
56192 486056 484930 483732 482732 482049 481526 481127 481203 482074 483616 485509 487591 489624 491161 492216 493774 496911
56176 496911 501426 505943 509451 512242 515277 519154 523868 529176 534872 540916 547485 554745 562579 570744
56162 570744 579305 588661 599077 610408 622307 634534 647158 660710 676106 694084 714754 738012
56150 738012 764317 794690 829957 870513 916987 970667 1032987 1104915 1186930 1279003 1379909
56139 1379909 1486549 1594250 1697875 1792816 1875680 1945020 2001894 2049546 2092029 2132516 2172112
56128 2172112 2209551 2241745 2265079 2277060 2277466 2268214 2251934 2230392 2203958 2171978 2132981 2084504
56116 2084504 2023701 1949228 1862756 1768419 1670858 1574073 1481629 1396694 1321135 1254900 1196847
56105 1196847 1146194 1103055 1067796 1040157 1018939 1002430 989288 979161 972338 968730 967375 967077
56093I67077J94Q23J698K600L439M277N108N871O544P067P323P318P270P424P797
56078A041830Q257Q784R479J0326J1091J1609J2070J2785J3648J4153J4069J3817
56066A181918J3949J4528J5309J6274J7495J8711J9599K0404K1570K2780K3080
56055A385617K2198K1044K0550K0623K0639K0408K0156J9975J9882K0121K0959
56044A612172K2334K4022K5847K7451K8327K8517K8884L0203L2310L4549L6655
56033A931271L8670M0372M1474M2155M2870M3795M4925M6432M8333N0180N1662
56022B422139N3274N5659N8502O0855O2509O4268O6827P0094P3679P7421Q1262
56011C146489Q5099Q8936R2854R6850J01019J05708J11032J16414J21300J26112
$$ plain form
56093 967077 967271 968094 969792 972392 975831 980108 985216 991087 997631 1004698 1012021 1019339 1026609 1034033 1041830
56078 1041830 1050087 1058871 1068350 1078676 1089767 1101376 1113446 1126231 1139879 1154032 1168101 1181918
56066 1181918 1195867 1210395 1225704 1241978 1259473 1278184 1297783 1318187 1339757 1362537 1385617
56055 1385617 1407815 1428859 1449409 1470032 1490671 1511079 1531235 1551210 1571092 1591213 1612172
56044 1612172 1634506 1658528 1684375 1711826 1740153 1768670 1797554 1827757 1860067 1894616 1931271
56033 1931271 1969941 2010313 2051787 2093942 2136812 2180607 2225532 2271964 2320297 2370477 2422139
56022 2422139 2475413 2531072 2589574 2650429 2712938 2777206 2844033 2914127 2987806 3065227 3146489
56011 3146489 3231588 3320524 3413378 3510228 3611247 3716955 3827987 3944401 4065701 4191813
56001D191813J31781J38384J45083J51549J58554J66805J76000J85592J95852
55992E641413K07641K21342K36665K53277K71159K90348L10685L32040L54623
55983H119193L78968M05666M35167M67832N04115N44517N89615O40312O97962
55974A2783347P63877Q38796R23187J018091J125362J247433J387556J550303
55966B1637952J741157J965780K230779K545454K922146L375130L920678M578632
55958D4917708N372496O327240P467994Q822180J0423331J2312723J4534951J7125161
55950A27303784K0089864K3380458K6838639L0086794L2401846L2725320K9971884
55943C22798589K3588518J4027234K745982q330742j7550940k4022679k7655783
$$ plain form
56001 4191813 4323594 4461978 4607061 4758610 4917164 5083969 5259969 5445561 5641413
55992 5641413 5849054 6070396 6307061 6560338 6831497 7121845 7432530 7764570 8119193
55983 8119193 8498161 8903827 9338994 9806826 10310941 10855458 11445073 12085385 12783347
55974 12783347 13547224 14386020 15309207 16327298 17452660 18700093 20087649 21637952
55966 21637952 23379109 25344889 27575668 30121122 33043268 36418398 40339076 44917708
55958 44917708 50290204 56617444 64085438 72907618 83330949 95643672 110178623 127303784
55950 127303784 147393648 170774106 197612745 227699539 260101385 292826705 322798589
55943 322798589 346387107 360414341 363160323 354829581 337278641 313255962 285600179
55936B85600179k8893831k8388986k6774261k4555483k2087688j9596807j7214903
55929A18088220j5010345j3010965j1223269r645122q269359p083283o069968
55922D7775909n210604m485238l873502l356973k920534k551078k236534j967241
55914B1174205j736666j539429j369623j222094j093820r82648q85785q00742
55906A1543398p26494o62249o05926n55308n09828m69870m34820m03199l74185
55897F801519l47684l23307l00493k79432k60715k44075k28485k13367j98929
55888D405032j85368j72598j60703j49957j40337j31566j23609j16620j10432
55879C113842j04614r9043r4015q9845q6548q3872q1424p8887p6213p3348o9856
$$ plain form
55936 285600179 256706348 228317362 201543101 176987618 154899930 135303123 118088220
55929 118088220 103077875 90066910 78843641 69198519 60929160 53845877 47775909
55922 47775909 42565305 38080067 34206565 30849592 27929058 25377980 23141446 21174205
55914 21174205 19437539 17898110 16528487 15306393 14212573 13229925 12344140 11543398
55906 11543398 10816904 10154655 9548729 8993421 8483593 8013723 7578903 7175704 6801519
55897 6801519 6453835 6130528 5830035 5550603 5289888 5045813 4817328 4603961 4405032
55888 4405032 4219664 4047066 3886363 3736406 3596069 3464503 3340894 3224274 3113842
55879 3113842 3009228 2910185 2816170 2726325 2639777 2555905 2474481 2395594 2319381 2246033 2176177
55868B176177o5400o0628n6830n4429n2511n0261m8088m6702m5880m4874m3497
55857A607077m1945m0089l7796l5622l4224l3261l1774k9570k7469k6249k6061
55846A243017k6756k8001k9044k9136k8326k7258k6136k4575k2567k0845j9965
55835I60408j9549j8851j7732j6747j6389j6443j6112j4785j2789j1103j0218
55824G89690r604q753q260r116j1119j2901j3596j3694j3957j4309j4261j3776
55812F46344j3014j1733r663p332n780n390n459n086m101k967k035j201k44P35
55798E73074J381J619J921K805M016M531L669K071J167J572K225J395j621n887
55784E93938r781j2272j3273j3163j2219j0483p902m496m99L597P048Q834P858
$$ plain form
55868 2176177 2110777 2050149 1993319 1938890 1886379 1836118 1788030 1741328 1695448 1650574 1607077
55857 1607077 1565132 1525043 1487247 1451625 1417401 1384140 1352366 1322796 1295327 1269078 1243017
55846 1243017 1216261 1188260 1159216 1130080 1101754 1074496 1048360 1023785 1001218 980373 960408
55835 960408 940859 922008 904276 887529 871140 854697 838585 823800 811011 799908 789690
55824 789690 780086 771333 763073 753957 742838 729937 716341 702647 688690 674381 660120 646344
55812 646344 633330 621597 611934 604602 598822 593432 587973 582887 578786 575819 573784 572583 572339 573074
55798 573074 574455 576074 577995 580800 584816 589347 593016 595087 596254 597826 600051 601446 599825 593938
55784 593938 584157 571885 558612 545449 533230 522747 514845 510349 509850 513447 520495 529329 537187
55771E37187L579l212j0479j6134j9295k0266j9595j7587j4701j1838r832q769
55759C89058q096p394o860o994p881q897r274q866q139p385o333m760l098j949
55745B93132j262n59J84M92J91m10j233k604m411n712n686m568l248k219j356
55730B60731n13R2j3j123k907m337m507l643k870k813k906k311r77O14K136L392
55714B38045M019L880L337K669J582j52j938k962l236l296l190k598j802j607
55700B32751k240l148m001n036o196o754o236n092m072l398k941k712k729k739
55686A75457k515k121j629q88N6P71J041J309K020K765K728J813P89K33q4n94
55670A81151j178j355j045p63r93j564j767j097J70J211J432R70L74oj89k67j44
$$ plain form
55771 537187 540766 537554 527075 510941 491646 471380 451785 434198 419497 407659 397827 389058
55759 389058 380962 373568 366708 359714 351833 342936 333662 324796 316657 309272 302939 298179 295081 293132
55745 293132 291870 291311 291495 291987 292178 291768 290535 287931 283520 277808 272122 267554 264306 262087 260731
55730 260731 260218 260310 260297 259174 256267 251930 247423 243780 240910 238097 235191 232880 231903 232517 234653 238045
55714 238045 242064 245944 249281 251950 253532 253380 251442 248480 245244 241948 238758 236160 234358 232751
55700 232751 230511 227363 223362 218326 212130 205376 199140 194048 189976 186578 183637 180925 178196 175457
55686 175457 172942 170821 169192 168304 168360 169131 170172 171481 173501 176266 178994 180807 181596 181829 181745 181151
55670 181151 179973 178618 177573 176810 175817 174253 172486 171389 171559 172770 174202 175172 175546 175540 175351 175084 174940
55653A74940L32J107J911K450K634K551K289J832J135K74n60j213j691k121k665
55638A83205l412m290m994n139m590l724l167l172l320l052k411j969j959j939
55624A36067j548j200j442j934j805r93m13n77q82p49o88j474k710l236k741k098
55608A11577j979k030j664j018o13n30m27j85p4l31q26j215j228q60l59k9j5k50
55590I7944n25n27N0J225K478L067K660J669R30J064K054L317M287M977N836O984
55574A37490P863P879P109O026M743L015Q97j076k509l520m438n435o463p279
55560A44302p500o976o110n466n044m372l340k510k352k635k826k731k493k218
55546H7729j870j344n15N69J453J611J139P43Q07R27O37J42q6p4j22j72L6L30
$$ plain form
55653 174940 175272 176379 178290 180740 183374 185925 188214 190046 191181 191455 190895 189682 187991 185870 183205
55638 183205 179793 175503 170509 165370 160780 157056 153889 150717 147397 144345 141934 139965 138006 136067
55624 136067 134519 133319 131877 129943 128138 127145 126732 126155 125273 124524 123836 122362 119652 116416 113675 111577
55608 111577 109598 107568 105904 104886 104273 103743 103316 103131 103057 102726 101900 100685 99457 98597 98238 98209 98194 97944
55590 97944 97419 96892 96942 98167 100645 103712 106372 108041 108971 110035 112089 115406 119693 124670 130506 137490
55574 137490 145353 153232 160341 166367 171110 174125 175022 173946 171437 167917 163479 158044 151581 144302
55560 144302 136802 129826 123716 118250 113206 108834 105494 102984 100632 97997 95171 92440 89947 87729
55546 87729 85859 84515 84000 84569 86022 87633 88772 89515 90322 91249 91886 92028 91942 91868 91746 91574 91610 91940
55528I1940K37k03m23k16p2m19j034j472j710j908j905j414n86M5K42K30J20l34
55510H1118j190j892j894j505j534k077k241j353J0O48J34q53j497j552j169n49
55494F2604rQ6k65n91n43l19k78l61k23J86N13N18L77L68N03N44L64P8j28k30
55474F3194l57n96q87j107j171j049p55l60O1M73P83P36K31l26l14K84P38N29
55456F0107J6j43P8K29J77K21M99Q17R57P33o8j231j894j491o95n82r47n61P95
55437E7017J795J484O10K84L12j02q05r60m49J03M27Q08J200J198Q46O79Q46R69
55419F6262R31J003J110P23j52o41o1J103J709J106m43k143l175l124k191r55
55403F1062J31Q21Q52J90n14l79N49J199Q55P6j99M4J13k24m93k99K14P35J026
$$ plain form
55528 91940 92177 91974 91551 91335 91263 90844 89810 88338 86628 84720 82815 81401 80815 80860 81102 81332 81452 81118
55510 81118 79928 78036 76142 74637 73103 71026 68785 67432 67442 68090 68224 67371 65874 64322 63153 62604
55494 62604 62595 62681 62416 61825 61282 60963 60685 60324 60101 60287 60800 61318 61695 62063 62566 63110 63474 63552 63424 63194
55474 63194 62837 62241 61354 60247 59076 58027 57272 56912 56973 57446 58229 58965 59196 58870 58556 58840 59578 60107
55456 60107 60123 59980 60058 60287 60464 60685 61184 62001 62958 63691 63623 62392 60498 59007 58312 57730 56783 56222 57017
55437 57017 58812 60296 60906 61190 61502 61400 60595 59635 59186 59289 59716 60524 61724 62922 63768 64447 65293 66262
55419 66262 67193 68196 69306 70029 69877 69236 69175 70278 71987 73093 72650 70507 67332 64208 62017 61062
55403 61062 61193 62014 62866 63056 62542 62163 62712 63911 64766 64842 64643 64687 64800 64576 64083 63784 63998 64733 65759
55384F5759Q00r6j177j569j051m26m89j015j256j090r82r00j96J100J703N40j599
55367E8056k724j946l17O87P47M28N2m52r01q03lR80J391Q45l53j374j501p76
55349E2036J58Q61J415J812J639P69j24l57j80l04q12j217j332j323j054k66O78
55332E2399J039P94O45Q25P38J04m66m68k87m29o64n56k69j11J60Q97J684J779
55314E7814J144L89j49o38j114j350j394j553j784j592p84J80P58Q88Q11O71N18
55297E2815M72O26Q68R78Q39N16J57j24l29m81m41j7P11J311J418J082N76O5l05
55278F0737k89J69O73P50L65j61o45j026j056m42O09J418J514J034M14m4l07n15
55260F3198q35j212j328j012n75l94l47l5N29R79J214J404J357O00o82j531j437
$$ plain form
55384 65759 66559 66463 65286 63717 62666 62240 61751 60736 59480 58390 57408 56508 56312 57412 59115 59655 58056
55367 58056 55332 53386 53069 53756 54503 54931 54983 54531 53630 52827 52824 53804 55195 56040 55687 54313 52812 52036
55349 52036 52194 53055 54470 56282 57921 58690 58566 58209 58029 57725 56913 55696 54364 53041 51987 51721 52399
55332 52399 53438 54232 54877 55702 56440 56544 56078 55610 55323 54894 54230 53674 53405 53294 53454 54351 56035 57814
55314 57814 58958 59347 59198 58560 57446 56096 54702 53149 51365 49773 48989 49169 49927 50815 51626 52297 52815
55297 52815 53287 53913 54781 55759 56598 57114 57271 57147 56818 56337 55896 55879 56590 57901 59319 60401 60977 61042 60737
55278 60737 60448 60617 61290 62040 62405 62244 61599 60573 59517 59075 59684 61102 62616 63650 64064 64020 63713 63198
55260 63198 62363 61151 59823 58811 58236 57842 57495 57460 57989 58968 60182 61586 62943 63543 62861 61330 59893
55243E9893j113j425k100k115j173m7M68L59J16J01L61P13Q37N52R8r9Q7M00O15
55224E6528P09N86P3o21q22j17R56J390Q54L7k50j5J29j22l87k00L83Q85R03L65
55204F1264m96j174j130l39N11P02K88p2k1K22L98N08M84J65j80R5J016J570Q59
55185F4670o76j746j640o63N72J593J967J524P26K19m3n91j323j405m88O33J044
55168F4373P53K86j64n72n80J45J206J795J685J316R85M92k61q68q42k05M90O24
55150G0658k2j096j891j908j237m16J8j78q10j241q83K6N09O2n58k67Q57J732
55132F3355J754J342J005O94L36K33N10P51O32M00K96O0l97m65K43Q64K04j456
55114G0361k469j937p23k3J66M77Q01N19k11m09K89R56N93n26j218q41J09P46
$$ plain form
55243 59893 58780 57355 55255 53140 51967 51920 52388 52747 52863 52964 53325 54038 54875 55427 55525 55426 55513 55913 56528
55224 56528 57237 57823 57896 57275 56453 56336 57292 58682 59536 59573 59323 59308 59437 59315 58928 58728 59111 59996 60899 61264
55204 61264 60768 59594 58464 58125 58636 59338 59626 59554 59533 59755 60153 60661 61145 61310 61130 61225 62241 63811 64670
55185 64670 63994 62248 60608 59945 60517 62110 64077 65601 66327 66546 66503 65912 64589 63184 62696 63329 64373
55168 64373 65126 65412 65248 64676 64096 64241 65447 67242 68927 70243 71228 71720 71459 70591 69749 69544 70034 70658
55150 70658 70636 69540 67649 65741 64504 64088 64106 63928 63118 61877 60994 61020 61529 61591 61033 60766 61623 63355
55132 63355 65109 66451 67456 68150 68486 68719 69229 69980 70612 71012 71308 71368 70971 70506 70749 71613 71817 70361
55114 70361 67892 65955 65232 65209 65375 65852 66653 67172 66961 66552 66841 67797 68390 67864 66646 65805 65914 66660
55096F6660O05k23j297j906j392J81J832K456J844P03j60m82m40k78j69k05l56
55079F7373n05n44m37k35j17k87p01j018j040j028j237j384j029l24J87M74J005
55062E9153J725J865J218P39J247K058J841M58r05j313r08j48Q13J698J904J237
55046G2682L46n4k9p7k79l10p3J64K17J24j27o30j189j291o58L10R14R26P63Q50
55026G2579J000O86j39q51r36o33n22o25l93M29J277J360N12o44j272r93j08O93
55008G1420Q75L19p74j964k530j860l15P08K71p36n88R14K054J534K45m7Q97J732
54990G2155J551Q59M46K34k63r22j090m78M30R27P95M96O41J270J710J308K90
54973H0359m19k55L41N34J41k44j07L21M50J01k87k42J99O03O63M78L41M23O12
$$ plain form
55096 66660 67265 67042 65745 63839 62447 62628 64460 66916 68760 69463 69303 68821 68381 68103 67934 67729 67373
55079 67373 66868 66324 65887 65652 65535 65248 64547 63529 62489 61461 60224 58840 57811 57487 57674 58148 59153
55062 59153 60878 62743 63961 64700 65947 68005 69846 70304 69399 68086 67178 67030 67843 69541 71445 72682
55046 72682 73028 72974 72945 72868 72589 72279 72206 72370 72587 72711 72584 71954 70765 69474 68816 69126 70040 70966 71729 72579
55026 72579 73579 74265 74126 73275 72339 71706 71184 70559 70166 70595 71872 73232 73744 73100 71828 70835 70727 71420
55008 71420 72295 72614 71840 69876 67346 65486 65171 65879 66150 65414 64826 65740 67794 69328 69573 69526 70423 72155
54990 72155 73706 74565 75011 75245 74982 74060 72970 72492 72922 73849 74644 75140 75781 77051 78761 80069 80359
54973 80359 79940 79685 80026 80560 80701 80457 80350 80671 81121 81222 80935 80693 80892 81495 82158 82636 82977 83400 84012
54954H4012O12K23l95q24q09m83r8K59M91L26l25r21p98l8N67M94l0o51j322j876
54934G8414j777p84N47J492J948K151K019J470J045J453K525L348L424L125K959
54919A03359L027L364M110N004N310M569L175J846Q34j20j370l024m764n856n753
54904A13711m870m196l987l448k123q45n99r91q66j54M1p34j461j115r8N06M78
54887H9249M36N99N27J35Q0P40J498J589J296J615K819M047M507M474M633M906
54871A23150M526L186J495J39q93j997l201m117m397l971k999j927j439j943l023
54856A02589l735l558k913k548k646k666k013p44M19O98l2j132j756j539p64N8
54840G7718O06Q28P86N58K29j08l58m36l15o6J85L52L81K62N5r1p1K8J7j47k70
$$ plain form
54954 84012 84624 84847 84452 83628 82819 82336 82238 82497 82988 83314 82989 82068 81270 81232 81799 82293 82263 81612 80290 78414
54934 78414 76637 75853 76400 77892 79840 81991 84010 85480 86525 87978 90503 93851 97275 100400 103359
54919 103359 106386 109750 113860 118864 124174 128743 131918 133764 134598 134478 133108 130084 125320 119464 113711
54904 113711 108841 104645 100658 97210 95087 94242 93643 92652 91786 91632 91673 90939 89478 88363 88265 88771 89249
54887 89249 89685 90284 90811 90946 91026 91766 93264 94853 96149 97764 100583 104630 109137 113611 118244 123150
54871 123150 127676 130862 132357 132496 131603 129606 126405 122288 117891 113920 110921 108994 107555 105612 102589
54856 102589 98854 95296 92383 89835 87189 84523 82510 81766 82185 82883 82851 81719 79963 78424 77660 77718
54840 77718 78324 79152 79938 80496 80725 80617 80259 79823 79508 79442 79627 79979 80360 80622 80677 80586 80515 80543 80560 80413 80143
54819H0143j13L22P11O05j14r98j333q85j37K96L50L44L38J37j64j40K23L40j41
54800G9784p84j000q73q13p06j56O20R17O34N11R66J412J195O31N19R25J112O35
54782H5529j40n74m43M2N40Q20R42J216J782K317K411K231K343K947L629L999
54766A09591M158M364M592M641M516M375M192L634K320K12k087l597l807l255
54752A33849k905l034l119k864k691l001l504l680l411k765j650k82M59j07j352
54737I9943j907j310l99PR0L95Q60R98P25M89O19R70J195J231J398K024K978L734
54719A14040L974L970M124M268L830K618R70q20k694m231m543l300j561r25j837
54704A17883l120l371k427j331j054j623k401k855k820k256j265l80l05j046j682
$$ plain form
54819 80143 80030 80352 81063 81668 81554 80556 79223 78338 78201 78497 78847 79191 79529 79666 79502 79362 79585 79925 79784
54800 79784 79000 78000 77127 76314 75608 75452 76072 76989 77623 78134 79100 80512 81707 82338 82857 83782 84894 85529
54782 85529 85389 84815 84372 84414 84954 85774 86716 87932 89714 92031 94442 96673 99016 101963 105592 109591
54766 109591 113749 118113 122705 127346 131862 136237 140429 144063 146383 146595 144508 140911 137104 133849
54752 133849 130944 127910 124791 121927 119236 116235 112731 109051 105640 102875 101225 100943 101402 101295 99943
54737 99943 98036 96726 96327 96334 96424 96819 97679 98677 99402 99891 100510 101480 102675 103906 105304 107328 110306 114040
54719 114040 118014 121984 126108 130376 134206 136824 137794 136974 134280 130049 125506 122206 120645 119720 117883
54704 117883 114763 111392 108965 107634 106580 104957 102556 99701 96881 94625 93360 92980 92675 91629 89947
54689H9947j459p66n20q50j050p65l95k01J29P28J030O45J20K21P58Q26K2j100
54671H7320j775j752j223m69K97R26J299J290Q82L42lk25o11r14m00R77K066J890
54653H9917R92O51J002J012J89o71p57l00M7J32N4l76j205j791j401k19Q56J337
54635H9469J548J807J815J160J01n91n98m87r68j848k148j334q4N27L52J79N07
54618H9407Q55N09m96j448j740j334n81J42O89J155J603J820J529Q31J47l02n92
54601I2194o98m06K78R91J456J641J375L90r54j621j072m8M38L73L92N55L99j
54583I5682j2M73Q06O91O72J135J544J180J71p73j207j161q20m40k70j52L88J231
54565I9138J403L78p91n59R67K036J487J06o86o14l80l29j69K37N65O03N78P43
$$ plain form
54689 89947 88488 87722 87202 86352 85302 84537 84142 83941 84070 84798 85828 86473 86593 86814 87572 88398 88420 87320
54671 87320 85545 83793 82570 82101 82398 83324 84623 85913 86795 87137 87134 86909 86298 85384 84984 85961 88027 89917
54653 89917 90909 91560 92562 93574 93763 93092 92335 92035 92082 92214 92268 91892 90687 88896 87495 87276 88132 89469
54635 89469 91017 92824 94639 95799 95900 95309 94711 94224 93256 91408 89260 87926 87842 88369 88721 88900 89407
54618 89407 90262 90771 90275 88827 87087 85753 85172 85314 86003 87158 88761 90581 92110 92941 93088 92786 92194
54601 92194 91496 91090 91368 92359 93815 95456 96831 97221 96267 94646 93574 93526 93964 94337 94729 95284 95683 95682
54583 95682 95670 96143 96949 97640 98312 99447 100991 102171 102342 101569 100362 99201 98381 97941 97671 97519 97907 99138
54565 99138 100541 100919 100128 99569 100536 102572 104059 104165 103479 102865 102485 102156 101987 102224 102789 103392 103970 104713
54547A04713J047J277J281J021O79O88J287K051K256J767J123O87K31l87p02l26
54531A18693K38J52n58r73n50J62K58m17j179j306o89J75O94P22N91N93N62J63
54513A17331m89r09q82o97o33o04m47k25r5l9J0K4k1o4j34l02m49l23P8M97Q95
54492A12522J473K075K144J561R61Q10P02J54m27l63J88N43P07J226K007K260
54476A28543J791J311J242J112N70P4L7O1l20p20m94J90O26O17N65P51J072J424
54458A38452J702J602R59J87j59j50k89o49p66m81k78o46j452k090k003j077J47
54441A33009O96Jj393k289k058j126l46j64m27o09k98L20N61J59j73L31J268J524
54423A28986Q70K49K93M50qq59j366j292r12m65j09j01m51p19n22l4M25Q86J409
$$ plain form
54547 104713 105760 107037 108318 109339 110018 110706 111993 114044 116300 118067 119190 119877 120108 119721 119019 118693
54531 118693 118931 119083 118525 117552 117002 117164 117422 117005 115826 114520 113831 114006 114700 115422 116013 116606 117168 117331
54513 117331 116842 115933 115051 114354 113721 113117 112670 112445 112350 112311 112321 112345 112324 112260 112126 111824 111375 111052 111130 111627 112522
54492 112522 113995 116070 118214 119775 120736 121546 122248 122402 121975 121612 121800 122343 123050 124276 126283 128543
54476 128543 130334 131645 132887 133999 134569 134643 134680 134741 134421 133701 133207 133397 134023 134640 135205 135956 137028 138452
54458 138452 140154 141756 142715 142902 142743 142593 142304 141655 140889 140408 140130 139484 138032 135942 133939 132862 133009
54441 133009 133705 133706 132313 130024 127966 126840 126494 126330 125903 125294 124996 125316 125877 126036 125863 126194 127462 128986
54423 128986 129856 130105 130398 130848 130840 129981 128615 127323 126411 125946 125837 125736 125285 124566 124044 124010 124435 125321 126730
54404A26730J642J255N71J87K28L75M61M50J55m39q29n60rP1m01r04j182j305
54386A26496r88R6J334J561O88m7J18M55R3n35n07P2L99L55M76P80P02K21O8N30
54366A32367Q93N35j19k23K69O00K94k82m45l7M28L67k45r13j233j297j371j393
54348A28195j090n60l63q39j549j647p71M93J167Q88K78J88O62R73P01L23L48
54331A27397M18j45j088j372o98m1l00j049j216o06j9p8n39r11j090j213j262
54314A16188j148r35p14l79J80P65R41N26k24q83j240j325j170p26l6O97J215
54297A11732J323R06M6p62q15L7J012J155M45k55m15l81n46n62J6Q11J002N40
54279A15289K38N50R28O57j86r59j260j068l83P42J833K151J444K87m70n23k25
$$ plain form
54404 126730 128372 129627 130198 130385 130613 130988 131449 131899 132054 131615 130786 130226 130217 130288 129887 128983 127801 126496
54386 126496 125508 125604 126938 128499 129187 129140 129258 129713 129806 129271 128764 128836 129235 129590 130066 130846 131548 131769 131837 132367
54366 132367 133260 133795 133676 133453 133722 134322 134616 134334 133889 133852 134280 134647 134402 133489 132256 130959 129588 128195
54348 128195 127105 126545 126182 125343 123794 122147 121376 121869 123036 123924 124202 124390 125052 126025 126726 127049 127397
54331 127397 127815 127670 126582 125210 124512 124471 124171 123122 121906 121300 121281 121203 120664 119753 118663 117450 116188
54314 116188 115040 114105 113391 113012 113192 113957 114898 115424 115200 114317 113077 111752 110582 109856 109820 110517 111732
54297 111732 113055 113961 114007 113245 112430 112467 113479 114634 115079 114824 114409 114028 113482 112920 112936 113747 114749 115289
54279 115289 115527 116077 117005 117662 117476 116517 115257 114189 113806 114548 116381 118532 119976 120263 119793 119270 119045
54262A19045N4L94R81J447J051k53j369j190k3P55M42k70n06l94n00o96l52N23
54244A19139J069N88p14k002k534k052r58n3J93Q9J91M37L37j57n53o39p26r35
54226A10720q82l83J14J96R8J62J87j72o83q02m84j57j2K01O69J199J436J150
54208A12557M00l53m78J49Q34Q51L29p9j95m07q26j046q52n81n31m97k01K14M06
54189A09694K94Nl23m74j96L95P52N33J13O3L30L47j30p22j001r68q23n32K9O59
54169A08045R22P04M15M00L88j23r37j184m06P43J358J441J594J805J374J53r18
54152A15774j038o41o74j117r64K77J734K080J034l42p36J58J465K077J644O60
54136A21391j77m74k06L17M84j20j118j610j261p58q18j206j162o00j88l55p23
$$ plain form
54262 119045 119099 119493 120474 121921 122972 122719 121350 120160 120137 120892 121334 121064 120558 120164 119664 118968 118616 119139
54244 119139 120208 120796 120082 118080 115546 113494 112536 112483 112676 112765 112956 113393 113730 113573 113020 112381 111655 110720
54226 110720 109838 109455 109569 109765 109863 110025 110212 110040 109357 108555 108071 107914 107902 108103 108772 109971 111407 112557
54208 112557 112957 112604 112126 112275 113109 113960 114289 114210 114015 113608 112782 111736 110884 110303 109772 109275 109074 109288 109694
54189 109694 109988 109993 109670 109196 109000 109395 110147 110680 110793 110856 111186 111533 111403 110681 109680 108712 107889 107357 107386 108045
54169 108045 108967 109671 110086 110486 110874 110751 109814 108630 108224 108967 110325 111766 113360 115165 116539 116692 115774
54152 115774 114736 114095 113421 112304 111340 111617 113351 115431 116465 116123 115387 115545 117010 119087 120731 121391
54136 121391 121214 120740 120534 120851 121335 121215 120097 118487 117226 116468 115650 114444 113282 112682 112494 112139 111416
54119A11416o95j57N71J173J472J388R76M40l5l65n25m70k03J76M93N50K39k67
54101A16177n58m21j48j62m06l94J23Q04J122Q50R5q00j254p76L91J262J129M38
54083A17472J34L12J86n26r81m73M08O09K04J60O59P85J62k24M99J636J939J393
54065A24354R60R20O69N4k82o2J85J73L60R48J350J204J053J343J545J108N80
54048A36462Q41J697K181J964J612J617J953K458K894K899K521K556L593N040
54034A70288N918O329P035P880P849O769N536M418K482o86l855n627o184o632
54020B01520p296p595p128o014m488k966k196k588l445l643l008k366k283k380
54006A44124k073j399q62q35j290j853j981j306p7Q71Q09j60j116j190m10L96
$$ plain form
54119 111416 110721 110564 111135 112308 113780 115168 116144 116584 116549 116184 115659 115189 114986 115162 115655 116205 116444 116177
54101 116177 115619 115198 115050 114888 114482 114088 114211 115015 116137 116987 117082 116282 115028 114252 114643 115905 117034 117472
54083 117472 117606 117918 118104 117578 116597 116124 116532 117141 117345 117505 118164 118949 119111 118887 119386 121022 122961 124354
54065 124354 125314 126234 126903 126957 126675 126613 126798 126971 127331 128279 129629 130833 131886 133229 134774 135882 136462
54048 136462 137303 139000 141181 143145 144757 146374 148327 150785 153679 156578 159099 161655 165248 170288
54034 170288 176206 182535 189570 197450 205299 212068 217604 222022 224504 223818 219963 214336 208152 201520
54020 201520 194224 186629 179501 173487 168999 166033 163837 161249 157804 154161 151153 148787 146504 144124
54006 144124 142051 140652 139790 138955 137665 135812 133831 132525 132448 133319 134128 133968 132852 131662 131252 131648
53990A31648O20M94N58Q05Q17N14J50k82r97j682j613p56j9j7k30P5P21J004P94
53971A32604N04L65L13M45Q61J222J055M72Q6K15N74O79L05l92q64n22N92J718
53953A40232K241K300K232J902J110K64j11j24j38PN68J079R35N69R98K195L131
53936A59390L467L995N026N589M926L735L065K759K045J024N46P89J008P01J95
53921A98260n4r8j81k50r2K67N38N07K62R7J08j3n76j336j646j243n72k05k32
53902A93541m09n40m46L8P59J207J091P66Q11J362K153K895L338L244K669K029
53886B14508J619J329J192J744L301N164O189N960M740K493j078n378q756j0035
53872B22992r663q907q388p922p313o620n740m418k846j796j839k630l169k774
$$ plain form
53990 131648 132268 132762 133320 134125 134942 135456 135606 135324 134327 132645 131032 130276 130257 130240 130010 130085 130806 131810 132604
53971 132604 133108 133473 133786 134231 135092 136314 137369 137841 137927 138142 138716 139395 139700 139308 138444 137922 138514 140232
53953 140232 142473 144773 147005 148907 150017 150281 150170 150046 149908 149915 150483 151562 152497 153066 154064 156259 159390
53936 159390 162857 166852 171878 177467 182393 186128 189193 191952 193997 195021 195567 196356 197364 198065 198260
53921 198260 198206 198108 197927 197677 197585 197852 198390 198897 199159 199256 199364 199351 198775 197439 195793 194550 193978 193773 193541
53902 193541 193132 192592 192146 192184 192943 194150 195241 196007 196818 198180 200333 203228 206566 209810 212479 214508
53886 214508 216127 217456 218648 220392 223693 228857 235046 241006 245746 248239 247161 241783 233027 222992
53872 222992 213329 204422 196034 188112 180799 174179 168439 164021 161175 159379 157540 154910 151741 148967
53858A48967j704p82n19o75p39o47p03r33r35n16j09j86n53o63l87n0K64P91J396
53839A41317J411N36m99p41j51M94O45M18Q7k37l11J82J050J527J178M79J09N0
53821A47544j42m46l75K28Q95J134R40N95L36K42K78L78O78J446K536L151K709
53804A62127J773J470K028K545K292J479N46m27j173r73K84J462J450O56L57Q56
53788A76752J264R58K51m32j061j476j275o04k56n25p16l77k87j360l035l749
53772A64072k835j181K1L87J37m41r83j063o77l54m59p09o75m57m07m02J7Q45
53754A54836J408J163L53l78p06p73p21m84p1K23J02k83m59k25Q1J09J25O75J669
53735A56644K259J913J190R58J207J264J037J229K127K939K815J994J398J422
$$ plain form
53858 148967 147263 146481 145962 145287 144548 143901 143198 142265 141330 140814 140705 140519 139966 139303 138916 138866 139130 139921 141317
53839 141317 142728 143264 142765 142024 141873 142367 143012 143430 143517 143280 142969 143151 144201 145728 146906 147385 147494 147544
53821 147544 147402 146956 146581 146809 147704 148838 149778 150373 150709 150951 151229 151607 152285 153731 156267 159418 162127
53804 162127 163900 165370 167398 169943 172235 173714 174260 173833 172660 171687 171971 173433 174883 175539 175896 176752
53788 176752 178016 178974 179225 178793 177732 176256 174981 174377 174121 173596 172880 172503 172216 170856 167821 164072
53772 164072 161237 160056 160077 160464 160601 160160 159177 158114 157437 157083 156624 155915 155240 154783 154376 153974 153991 154836
53754 154836 156244 157407 157760 157382 156676 155903 155182 154698 154627 154850 154952 154669 154210 153985 154066 154175 154300 154975 156644
53735 156644 158903 160816 162006 162964 164171 165435 166472 167701 169828 172767 175582 177576 178974 180396
53721A80396J739K026K253K349K109J598J150R71J040J364J978K666L074L142
53707B07855L063K922K717K685L054L521L526L103K823K823K644K272K494L665
53693B49167M821M780L722K842K741K906K653J911R49l5q35j151q51j88K72l4
53677B73670j161k301k350j163Q8K75l35p18o92r22j495j530o30K72R5r61j829
53660B58313j972j720j481j264r79o98m91l43k44k56l71m97m82j39N76J316J496
53643B50764R76L26J76M41N89M62L82M55L84J66M29J647L218L931L346K319J930
53626B71941K304K795L023L238L649L921L640K964K510K686L375M204M858N121
53612C20229M889M235L368K576K218K638L808N067N536M860L516K330J849K058
$$ plain form
53721 180396 182135 184161 186414 188763 190872 192470 193620 194591 195631 196995 198973 201639 204713 207855
53707 207855 210918 213840 216557 219242 222296 225817 229343 232446 235269 238092 240736 243008 245502 249167
53693 249167 253988 258768 262490 265332 268073 270979 273632 275543 276492 276457 275622 274471 273620 273432 273704 273670
53677 273670 272509 270208 267858 266695 266783 267058 266723 266005 265313 264391 262896 261366 260736 261008 261103 260142 258313
53660 258313 256341 254621 253140 251876 250897 250199 249708 249365 249121 248865 248494 247997 247515 247376 247952 249268 250764
53643 250764 251740 252066 252242 252683 253272 253734 254116 254571 254955 255121 255550 257197 260415 264346 267692 270011 271941
53626 271941 274245 277040 280063 283301 286950 290871 294511 297475 299985 302671 306046 310250 315108 320229
53612 320229 325118 329353 332721 335297 337515 340153 343961 349028 354564 359424 362940 365270 367119 369177
53598C69177K501K661K392J979J692J375P65R0k4O89J755K452K445J872J075L98
53582C93294%k61o75j297k013k874m042n234n698n085m034l500l632l762l378
53567C47809k677k114j792j514j152p26k49K72O92P70M97J89J47K84K97J91L52
53550C41276R38J489J476J055Q90J335K128K916L632M323M990N754O752P787Q401
53535C95142Q521Q577Q839R031R011R341J0636J2582J4160J4784J4840J5068J5863
53522E46395J7117J8455J9536K0347K1196K2245K3228K3907K4532K5485K6591
53511G89034K7349K7721K8167K8812K9207K9142K9060K9339K9623K9413K8928
53500A105795K8780K8969K8861K8203K7590K7579K7835K7555K6500K5172K4037
$$ plain form
53598 369177 371678 374339 376731 378710 380402 381777 382542 382632 382608 383297 385052 387504 389949 391821 392896 393294
53582 393294 393294 393033 392358 391061 389048 386174 382132 376898 371200 366115 362081 358581 354949 351187 347809
53567 347809 345132 343018 341226 339712 338560 337834 337585 337857 338549 339319 339816 340005 340152 340436 340733 340924 341276
53550 341276 342214 343703 345179 346234 347124 348459 350587 353503 357135 361458 366448 372202 378954 386741 395142
53535 395142 403663 412240 421079 430110 439121 448462 459098 471680 485840 500624 515464 530532 546395
53522 546395 563512 581967 601503 621850 643046 665291 688519 712426 736958 762443 789034
53511 789034 816383 844104 872271 901083 930290 959432 988492 1017831 1047454 1076867 1105795
53500 1105795 1134575 1163544 1192405 1220608 1248198 1275777 1303612 1331167 1357667 1382839 1406876
53489A406876K3098K2288K1834K1893K2108K1976K1498K1078K0829K0403J9607
53478A643488J8635J7487J5634J2702R224O222M039K049n33l849p503j1067j4266
53465A692262j6857j8640j9606k0020k0261k0657k1362k2451k3944k5720k7403
53454A455341k8504k8734k8155k7103k6100k5698k6024k6461k6146k4891k3265
53443A164260k1688j9977j7985j6062j4450j2728j0446p940n854m190k551r94
53431A029395J71J293L170N850Q511J0589J2293J3867J5275J6808J8980K1438
53419A157640K3007K3396K3937K5801K8346L0224L1360L2674L4407L6063L7727
53408A484582M0068M2929M5263M6795M8631N1683N5447N8932O1893O4514O6575
$$ plain form
53489 1406876 1429974 1452262 1474096 1495989 1518097 1540073 1561571 1582649 1603478 1623881 1643488
53478 1643488 1662123 1679610 1695244 1707946 1717170 1723392 1727431 1729480 1728947 1725098 1717595 1706528 1692262
53465 1692262 1675405 1656765 1637159 1617139 1596878 1576221 1554859 1532408 1508464 1482744 1455341
53454 1455341 1426837 1398103 1369948 1342845 1316745 1291047 1265023 1238562 1212416 1187525 1164260
53443 1164260 1142572 1122595 1104610 1088548 1074098 1061370 1050924 1042984 1037130 1032940 1030389 1029395
53431 1029395 1029566 1030859 1034029 1039879 1048390 1058979 1071272 1085139 1100414 1117222 1136202 1157640
53419 1157640 1180647 1204043 1227980 1253781 1282127 1312351 1343711 1376385 1410792 1446855 1484582
53408 1484582 1524650 1567579 1612842 1659637 1708268 1759951 1815398 1874330 1936223 2000737 2067312
53397B067312O7811O8571O9351P0038P0380P0746P1505P1907P0673O7791O4737
53386B830822O2590O0813N8336N5072N1624M8112M4216M0156L6672L3885L0887
53375C353185K6874K2131J7380J2465O209k327j2806k3899l4328m3597n1824n9118
53363C210345o5209o9683p2443p3779p4046p3514p2563p1712p1166p0483o9008
53352B426739o6619o3846o1404n9836n9456o0113o1011o1159o0168n8371n6045
53341A758711n2991m9139m5101m1675l8936l6217l2957k9278k5753k2859k0677
53330A363128j8955j7451j6305j5888j6155j6397j5937j4847j3690j2643j1375
53319A193485r705p942o415n084l753k330p71R75K703L968M624N230O558Q827
$$ plain form
53397 2067312 2135123 2203694 2273045 2343083 2413463 2484209 2555714 2627621 2698294 2766085 2830822
53386 2830822 2893412 2954225 3012561 3067633 3119257 3167369 3211585 3251741 3288413 3322298 3353185
53375 3353185 3380059 3402190 3419570 3432035 3438244 3435917 3423111 3399212 3364884 3321287 3269463 3210345
53363 3210345 3145136 3075453 3003010 2929231 2855185 2781671 2709108 2637396 2566230 2495747 2426739
53352 2426739 2360120 2296274 2234870 2175034 2115578 2055465 1994454 1933295 1873127 1814756 1758711
53341 1758711 1705720 1656581 1611480 1569805 1530869 1494652 1461695 1432417 1406664 1383805 1363128
53330 1363128 1344173 1326722 1310417 1294529 1278374 1261977 1246040 1231193 1217503 1204860 1193485
53319 1193485 1183780 1175838 1169423 1164339 1160586 1158256 1157485 1158460 1161163 1165131 1169755 1174985 1181543 1190370
53305A190370J1546J4072J6102J7727J9298K1194K3518K5910K7842K9194L0461
53294A427234L2194L4274L5878L6274L5492L4125L2599L0915K9083K7405K6112
53283A781585K4989K3624K1797J9327J5849J1253O289K134p32k857n006p513j0564
53270A880175j4419j8947k3360k6947k9805l2454l4947l6909l8303l9548m0805
53259A543731m1647m1660m1014m0198l9402l8404l6981l5212l3461l2162l1628
53248A131962l1908l2737l3580l3843l3283l2272l1495l1246l1105l0391k8800
53237G81302k6431k3472k0238j7355j5449j4505j3798j2667j1150r818r068q819
53225E98532q789q930r471j0538j1780j2602j2772j2590j2362j2005j1478j1260
$$ plain form
53305 1190370 1201916 1215988 1232090 1249817 1269115 1290309 1313827 1339737 1367579 1396773 1427234
53294 1427234 1459428 1493702 1529580 1565854 1601346 1635471 1668070 1698985 1728068 1755473 1781585
53283 1781585 1806574 1830198 1851995 1871322 1887171 1898424 1904713 1906847 1906115 1903258 1898252 1890739 1880175
53270 1880175 1865756 1846809 1823449 1796502 1766697 1734243 1699296 1662387 1624084 1584536 1543731
53259 1543731 1502084 1460424 1419410 1379212 1339810 1301406 1264425 1229213 1195752 1163590 1131962
53248 1131962 1100054 1067317 1033737 999894 966611 934339 902844 871598 840493 810102 781302
53237 781302 754871 731399 711161 693806 678357 663852 650054 637387 626237 616419 607351 598532
53225 598532 589743 580813 571342 560804 549024 536422 523650 511060 498698 486693 475215 463955
53213D63955j1783j2523j2280j0621q553p364p250p403p224o922o950p351p775
53200C49956p928p772p408o903o346n928n855o029n973n326m361l721l635l653
53186B69118l314k717k240j968j717j463j347j378j421j491j771k266k658k604
53172B40763k076j360q40p54j042j376j439j240j047j049j124j035p28m63n49
53157B24641r80j430j655j806k082k200j604l01Q30R15M1r50j420j392j159q50
53141B08598m34Q2N54P83O96N47P16J183J390R03J02k18J89P34P13K9q38j297
53123B14432j066l74J87K43L7P6M23N98J80p93j941k787k959k506k007j967k139
53106A97637j868j026j69L04M90M62Q9l72k69M10P09J3q78q28k1L65p4n16k98
$$ plain form
53213 463955 452172 439649 427369 416748 408195 400831 393581 386178 378954 372032 365082 357731 349956
53200 349956 342028 334256 326848 319945 313599 307671 301816 295787 289814 284488 280127 276406 272771 269118
53186 269118 265804 263087 260847 258879 257162 255699 254352 252974 251553 250062 248291 246025 243367 240763
53172 240763 238687 237327 236487 235733 234691 233315 231876 230636 229589 228540 227416 226381 225653 225190 224641
53157 224641 223661 222231 220576 218770 216688 214488 212884 212583 213413 214328 214369 213419 211999 210607 209448 208598
53141 208598 208164 208246 208800 209583 210279 210826 211542 212725 214115 215018 215120 214902 215091 215825 216538 216567 215729 214432
53123 214432 213366 212992 213179 213422 213459 213535 213958 214556 214736 213943 212002 209215 206256 203750 201743 199776 197637
53106 197637 195769 194743 194574 194878 195368 195830 195919 195547 195278 195688 196397 196410 195532 194704 194683 195048 194974 194458 194160
53087A94160K08M36N75J134J990K440K041J029L3l92j02M76O65J88n47r60r42
53070B02432p73n79k62P0oo64j415j553r85k88O3K13M68O50L74j74k56L83R54
53051A98652M63j043k405k545j529l90p2o22j365j799k082k529k837k332r74L53
53035A76944Q05M40j02m08m22j64K47M81L32M0p2mJ48M56P84O13j30m73M66J933
53015A81914K223R17n49q50l64k54q10j376j372o67N78J822K198J333j10j138
52999A83495j540j725j792j442o65J23P29J293J769J837J510J318J557J776J385
52984A89628M96j93l23k73n94j255j646j281k78Q84J829K342K178J354N24N40
52968A93932J351J869J257n3r95j161r16n41lM81M01l72j341j945k036j692j059
$$ plain form
53087 194160 194368 194804 195379 196513 198503 200943 202984 204013 204046 203654 203552 204028 204693 204881 204334 203374 202432
53070 202432 201659 201080 200818 200888 200882 200218 198803 197250 196265 195977 196040 196253 196721 197371 197745 197571 197315 197698 198652
53051 198652 199115 198072 195667 193122 191593 191203 191131 190509 189144 187345 185263 182734 179897 177565 176591 176944
53035 176944 177749 178189 178087 177679 177257 177093 177340 177821 178153 178193 178121 178117 178265 178721 179505 180118 179988 179515 179981 181914
53015 181914 184137 185054 184505 183655 183291 183037 182227 180851 179479 178812 179390 181212 183410 184743 184633 183495
52999 183495 181955 180230 178438 176996 176331 176454 177183 178476 180245 182082 183592 184910 186467 188243 189628
52984 189628 190124 189931 189608 189335 188741 187486 185840 184559 184281 185165 186994 189336 191514 192868 193392 193932
52968 193932 195283 197152 198409 198356 197361 196200 195284 194743 194740 195221 195622 195250 193909 191964 189928 188236 187177
52951A87177n61p05j438k017j855j172n84l31k46j70l6K73P54J110J090R02R32
52934A83123J144J116O50K7m08n89o05n26m95o57q10n04L18R95Q63J08m94n91
52916A82665n55p41r35p85l81q2n0k42o24j038j078n93j04k34p85j003o98m55
52898A72282n69n15J27Q42Q52K09l76m43j6P57J592J882J287L65K0L23N89N34
52880A79742N91Q80P92N4n44j46Q87J378Q54M3j01O35J683K263J911Q08l07p80
52862A90643n77j34K06L76K89k38j213k353l307l830l770l131k274j702j492j080
52846A66413J0J321J725P20q19j535j068k49J28J30J09k6m02n17J41J016Q98l48
52828A67647j416j241l36J48L1o1P1J7k69k48L01Q53Q80N39M18Q32J596K147J910
$$ plain form
52951 187177 186616 185911 184473 182456 180601 179429 178845 178514 178268 178098 178062 178335 179089 180199 181289 182191 183123
52934 183123 184267 185383 186033 186060 185652 185063 184458 183932 183437 182780 181970 181466 181784 182779 183642 183750 183256 182665
52916 182665 182110 181369 180434 179649 179268 179186 179136 178894 178270 177232 176154 175561 175457 175223 174438 173435 172737 172282
52898 172282 171713 171198 171325 172167 173019 173228 172852 172409 172393 173150 174742 176624 177911 178276 178296 178619 179208 179742
52880 179742 180333 181213 182005 182059 181515 181369 182256 183634 184488 184531 184430 185065 186748 189011 190922 191730 191423 190643
52862 190643 190066 189932 190138 190514 190803 190565 189352 186999 183692 179862 176092 172961 170687 168985 167493 166413
52846 166413 166423 167744 169469 170189 169370 167835 166767 166518 166646 166776 166885 166859 166457 165940 166081 167097 167995 167647
52828 167647 166231 164990 164654 164802 164833 164772 164843 164860 164591 164343 164644 165497 166377 166916 167334 168166 169762 171909 173819
52809A73819Q76k07o02m77n16p44n05K48M91m17j639j926j287p61q30r76p53l77
52791A63417r0K65P51J007Q33N50M60L72J09mL71R15J006N95J69m4k77n82n32
52772A69291K24J399K296K436J890J195R75J464K351L172L793M381N017N724O757
52757B12365Q347J0038J0736R677P136L953P26k310m909o739p663p839p562p053
52743B18903o354n362m174l273l027l009k343q56N20R13M68j71p78j398j740j529
52727A86790j141j097j176q00j68o9n35p57m89n22j332k165k188j777j827k295
52711A68452k318j524m55K65N95Q27J168J552J690J313O16K20L81N94L19j81k82
52694A73232N1L61N29Q30J214J249R41Q36J105J123L78o63j092o92j12Ll11n19
$$ plain form
52809 173819 174695 174488 173886 173409 172893 172149 171644 171892 172383 171966 170327 168401 167114 166353 165523 164547 163794 163417
52791 163417 163327 163592 164343 165350 166183 166733 167193 167565 167674 167670 168041 168956 169962 170557 170726 170682 170405 169823 169291
52772 169291 169515 170914 173210 175646 177536 178731 179706 181170 183521 186693 190486 194867 199884 205608 212365
52757 212365 220712 230750 241486 251163 258299 262252 262978 260668 255759 249020 241357 233518 225956 218903
52743 218903 212549 207187 203013 199740 196713 193704 191361 190505 191025 191938 192406 192235 191457 190059 188319 186790
52727 186790 185649 184552 183376 182576 182408 182339 181804 181047 180558 180036 178704 176539 174351 172574 170747 168452
52711 168452 166134 164610 164155 164420 165015 165842 167010 168562 170252 171565 172181 172401 172782 173376 173695 173514 173232
52694 173232 173283 173644 174173 175003 176217 177466 178407 179243 180348 181471 181849 181186 180094 179402 179290 179293 178982 178463
52676A78463k56K67M80Q2o04j010r70p87p07o44m61j99Q2M72J033J624K067K344
52658A81276K489K416J953J049j29j211j788j712j267q95p57p01o60p29q33o42
52642A77859j8O46Q11M46N9J04M60N88J69m27m14N58J846K328J544K49l81lN37
52623A86961K01j007j979j758o06L80O04M24L15K27Jo6L20Q42R50O55L25K3l54
52604A86458m43J91J094J281P13M95J259K160K056R88j18o48n77n1N83P09J56
52587A96306l08J11J041J367P51j3k43j58k66n52o79n42l52l00l83m67m29l49
52569A94535m08n22l29K18M66j59j221j659j102k27K39K82K43K53M00R25J799
52552A93733K371J947O47o49j208j088q47q11p58l28L57P47N94L23M84R96J310
$$ plain form
52676 178463 178207 178474 178954 179036 178432 177422 176452 175665 174958 174314 173853 173654 173736 174208 175241 176865 178932 181276
52658 181276 183765 186181 188134 189183 189054 187843 186055 184343 183076 182181 181424 180723 180063 179334 178501 177859
52642 177859 177841 178487 179298 179744 179803 179907 180367 180955 181124 180697 180283 180841 182687 185015 186559 186808 186427 186424 186961
52623 186961 187162 186155 184176 182418 181812 182192 182796 183220 183535 183762 183763 183697 184017 184859 185809 186464 186789 186812 186458
52604 186458 186015 186206 187300 188581 189294 189789 191048 193208 195264 196252 196134 195486 194909 194858 195441 196150 196306
52587 196306 195998 196109 197150 198517 199268 199255 199012 198854 198588 198036 197357 196815 196463 196163 195780 195313 194884 194535
52569 194535 194127 193605 193276 193494 193960 193801 192580 190921 189819 189592 189831 190113 190356 190609 191009 191934 193733
52552 193733 196104 198051 198698 198049 196841 195753 194906 194095 193337 193009 193366 194113 194707 195030 195514 196510 197820
52535A97820J090L96n65j426j645j145p83j416k520k661j462j54J89N8M47J237
52519A87460J522J070N46M39O13P94R08R95J231J890K824L214K495J263O59R94
52503B08917J620J903J607N48j134k470k476j633j476k438l166k476r51J29N80
52488A97084J018J486J425P80J85M1K21N29Q78J015P07K22J2Oj84m38j85O18J252
52469B06672J176O74L52M63R23J537K004K056J853J783J754J193mj045j177o14
52453B19600j63k09n55r70j372j619j556j323j252j451j701j730j431r01m02j74
52437B02791j20N0L19K70k35o23l15M35R11R55J075J544K014K097J901J711J610
52420B16390J611J880K558L557M721O028P443Q720R481R393Q215N895K694q25
$$ plain form
52535 197820 198910 199306 198741 197315 195670 194525 193742 192326 189806 187145 185683 185529 185718 185776 186223 187460
52519 187460 188982 190052 190598 191037 191650 192444 193352 194347 195578 197468 200292 203506 206001 207264 207923 208917
52503 208917 210537 212440 214047 214595 213461 210991 208515 206882 205406 202968 199802 197326 196375 196504 197084
52488 197084 198102 199588 201013 201793 201978 202019 202240 202769 203647 204662 205369 205591 205603 205609 205425 204987 204802 205420 206672
52469 206672 207848 208522 208874 209337 210260 211797 213801 215857 217710 219493 221247 222440 222436 221391 220214 219600
52453 219600 219437 219228 218673 217703 216331 214712 213156 211833 210581 209130 207429 205699 204268 203367 202965 202791
52437 202791 202671 202721 203040 203310 203075 202452 202137 202572 203483 204438 205513 207057 209071 211168 213069 214780 216390
52420 216390 218001 219881 222439 225996 230717 236745 244188 252908 262389 271782 279997 285892 288586 287761
52406B87761l981o147o933o519n684n107m675l825k579j646j392j293p80p7K51
52391B37374K35L30N49M06k52q67q05j2J021J747J937J823J928K513L240L579
52375B54746L506L449L575L615L471L545M094M626M441L639L054L152L396K984
52361C05293J911J041J108J964K857L223L107K901K959L421M309N538O934Q250
52347C54816R250R783R890R835R961J0428J1200J2278J3780J5636J7428J8660
52335E02945J9220J9363J9376J9445J9784K0482K1163K1178K0411J9624J9623
52324G22614K0144K0021J8526J6234J4324J3276J2530J1291R339P032M813K924
52312H73068J395J29j093k473m033n543o634p076p008o800o611o240n555m852
$$ plain form
52406 287761 283780 277633 270700 264181 258497 253390 248715 244890 242311 240665 239273 237980 237200 237123 237374
52391 237374 237609 237939 238488 238894 238642 237775 236970 236958 237979 239726 241663 243486 245414 247927 251167 254746
52375 254746 258252 261701 265276 268891 272362 275907 280001 284627 289068 292707 295761 298913 302309 305293
52361 305293 307204 308245 309353 311317 314174 317397 320504 323405 326364 329785 334094 339632 346566 354816
52347 354816 364066 373849 383739 393574 403535 413963 425163 437441 451221 466857 484285 502945
52335 502945 522165 541528 560904 580349 600133 620615 641778 662956 683367 702991 722614
52324 722614 742758 762779 781305 797539 811863 825139 837669 848960 858299 865331 870144 873068
52312 873068 874463 874592 873499 871026 866993 861450 854816 847740 840732 833932 827321 821081 815526 810674
52298H10674m397l767k303k63J133J267J060J785L352M632N217N869P212Q967
52284H40438J0732J2646J4672J6005J5951J5007J4368J4537J4982J4961J4121
52273I98420J2443J0173P829N823M014K030l2j679k731l529m382n291o268p397
52259A009423q427q850q612q374q677r237r442r252r087r033q702q006p512p685
52245H88527q094p808o479m697l231k324j838j668j606j150M1J563K625L014L177
52230H60052L371L346L090L186L952M837N232N440O114P167P946Q257Q404Q336
52216I38730P681O662O060O068N927N129M279M234M867N235M725L623K714K557
52202A008491L050L440L055K082J347J282J538J717J891K138K093J425L64o64
$$ plain form
52298 810674 806277 802510 800207 799944 801077 802344 803404 805189 808541 813173 818390 824259 831471 840438
52284 840438 851170 863816 878488 894493 910444 925451 939819 954356 969338 984299 998420
52273 998420 1010863 1021036 1028865 1034688 1038702 1040732 1040700 1039021 1036290 1032761 1028379 1023088 1016820 1009423
52259 1009423 1000996 992146 983534 975160 966483 957246 947804 938552 929465 920432 911730 903724 896212 888527
52245 888527 880433 872625 866146 861449 858218 855894 854056 852388 850782 849632 849673 851236 853861 856875 860052
52230 860052 863423 866769 869859 873045 876997 881834 887066 892506 898620 905787 913733 921990 930394 938730
52216 938730 946411 953073 959133 965201 971128 976257 980536 984770 989637 994872 999597 1003220 1005934 1008491
52202 1008491 1011541 1014981 1018036 1020118 1021465 1022747 1024285 1026002 1027893 1030031 1032124 1033549 1033913 1033249
52188A033249j615k627l538m080m282m377m511m925n987p507q399p620n382k918
52174I65481j155k32k3m38j073j257p40J13R31J757K642L282L380L064K700K460
52158I80892K334K333K479K693K905L230L819M612N311N689N835O116O823P864
52144A042935Q885R700J0457J1230J1741J1757J1624J1960J2910J4028J4951J5754
52132A187932J6533J7036J7060J6933J7179J7808J8239J7976J7013J5560J3695
52121A372964J1578R789Q948Q865Q449O796M177J615l73k117l923n401o033n995
52107A409339o066o823q186r623j0486j0306r041p137n180l574k505j979j723
52094A326710j321o07K40J137K332L994N875P642R224J0547J1402J1949J2940
$$ plain form
52188 1033249 1031634 1029007 1025469 1021389 1017107 1012730 1008219 1003294 997307 989800 981401 973781 968399 965481
52174 965481 964326 964094 964071 963633 962560 961303 960563 960676 961607 963364 966006 969288 972668 975732 978432 980892
52158 980892 983226 985559 988038 990731 993636 996866 1000685 1005297 1010608 1016297 1022132 1028248 1035071 1042935
52144 1042935 1051820 1061520 1071977 1083207 1094948 1106705 1118329 1130289 1143199 1157227 1172178 1187932
52132 1187932 1204465 1221501 1238561 1255494 1272673 1290481 1308720 1326696 1343709 1359269 1372964
52121 1372964 1384542 1394331 1403279 1412144 1420593 1427389 1431566 1433181 1432808 1430691 1426768 1421367 1415334 1409339
52107 1409339 1403273 1396450 1388264 1378641 1368155 1357849 1348808 1341671 1336491 1332917 1330412 1328433 1326710
52094 1326710 1325389 1324782 1325022 1326159 1328491 1332485 1338360 1346002 1355226 1365773 1377175 1389124 1402064
52081A402064J4825J6964J8279J8510J8178J7558J6472J5015J3643J2375J0669
52070A574552Q241N432K573l78l352n922p893r606j1396j3236j5127j7273j9473
52057A487142k0953k1266k1010k1124k1874k2843k3638k4147k4383k4449k4442
52046A237013k4117k2966k0976j8917j7402j6075j4180j1627q961o565m520l039
52034A067668k371k326k400k440k708l320m100m995o081p172p882q208q587r208
52020I95870r790j0187j0773j1884j3235j4238j4724j4992j5264j5471j5573j5785
52008H33954j6310j6990j7398j7346j7117j7042j6907j6035j4151j1898j0288
51997F62472r739r794r727r231q546q115q036p893p213o164n523n780o578p359
$$ plain form
52081 1402064 1416889 1433853 1452132 1470642 1488820 1506378 1522850 1537865 1551508 1563883 1574552
52070 1574552 1582793 1588225 1590798 1590420 1587068 1581146 1573253 1563647 1552251 1539015 1523888 1506615 1487142
52057 1487142 1466189 1444923 1423913 1402789 1380915 1358072 1334434 1310287 1285904 1261455 1237013
52046 1237013 1212896 1189930 1168954 1150037 1132635 1116560 1102380 1090753 1081792 1075227 1070707 1067668
52034 1067668 1065297 1062971 1060571 1058131 1055423 1052103 1048003 1043008 1036927 1029755 1021873 1013665 1005078 995870
52020 995870 986080 975893 965120 953236 940001 925763 911039 896047 880783 865312 849739 833954
52008 833954 817644 800654 783256 765910 748793 731751 714844 698809 684658 672760 662472
51997 662472 652733 642939 633212 623981 615435 607320 599284 591391 584178 578014 572491 566711 560133 552774
51983E52774q184r401j0734j1334j0866r949r276q721p689o076m475l470k969
51970D49630k343j167K57J195J357J251J533K155K450K013J133K66n30j512k795
$$ plain form
51983 552774 544590 535189 524455 513121 502255 492306 483030 474309 466620 460544 456069 452599 449630
51970 449630 447287 446120 446377 447572 448929 450180 451713 453868 456318 458331 459464 459730 459200 457688 454893
$$ [...]
##END NTUPLES=NMR SPECTRUM
##END=
