##TITLE=AC1471_13FE002653_8027014_YZZf2qlXnJ
##JCAMPDX= 6.0         $$ Bruker NMR JCAMP-DX V2.0
##DATA TYPE= NMR SPECTRUM
##DATA CLASS= NTUPLES
##ORIGIN= BRUKER
##OWNER= Administrator
$$ 1.72 TOPSPIN		Version 2.1
$$ 2013-07-18 17:19:51.985 -0700  Administrator@X
$$ Compression mode = diff/dup
##.OBSERVE FREQUENCY= 400.02188249412
##.OBSERVE NUCLEUS= ^1H
##.ACQUISITION MODE= SIMULTANEOUS (DQD)
##.ACQUISITION SCHEME= undefined
##.AVERAGES= 8
##.DIGITISER RES= 22
##SPECTROMETER/DATA SYSTEM= spect
##.PULSE SEQUENCE= zg30
##.SOLVENT NAME= COFFEE_meoh
##.SHIFT REFERENCE= INTERNAL, COFFEE_meoh, 1, 14.98509
##AUDIT TRAIL= $$ (NUMBER, WHEN, WHO, WHERE, PROCESS, VERSION, WHAT)
$$ ##TITLE= Audit trail, TOPSPIN		Version 2.1
$$ ##JCAMPDX= 5.01
$$ ##ORIGIN= Bruker BioSpin GmbH
$$ ##OWNER= Administrator
$$ $$ E:\/data/COFFEE/nmr/AC1471_13FE002653_8027014_YZZf2qlXnJ/20/pdata/1/auditp.txt
$$ ##AUDIT TRAIL=  $$ (NUMBER, WHEN, WHO, WHERE, PROCESS, VERSION, WHAT)
(   1,<2013-07-18 17:19:45.532 -0700>,<Administrator>,<X>,<go>,<TOPSPIN 2.1>,
      <created by zg
	started at 2013-07-18 17:18:39.438 -0700,
	POWCHK enabled, PULCHK disabled,
       configuration hash MD5:
       C8 4E 4E 5D D3 5C D8 9E 9F 52 82 E0 59 8A DE 15
       data hash MD5: 64K
       48 FB DE 32 BF 71 FE 3D CE 8E 19 6F B4 14 51 D6>)
(   2,<2013-07-18 17:19:48.438 -0700>,<Administrator>,<X>,<proc1d>,<TOPSPIN 2.1>,
      <Start of raw data processing
       efp LB = 0 FT_mod = 6 PKNL = 1 PHC0 = 0 PHC1 = 0 SI = 32K 
       data hash MD5: 32K
       00 95 9F 24 08 50 FC 6B FC 1E 7E 76 29 92 01 6C>)
(   3,<2013-07-18 17:19:48.688 -0700>,<Administrator>,<X>,<proc1d>,<TOPSPIN 2.1>,
      <pk PHC0 = 97.94312 PHC1 = 0 
       data hash MD5: 32K
       E8 74 02 F9 87 D9 1E 37 0D BE E3 4F A0 F1 C8 E5>)
(   4,<2013-07-18 17:19:48.798 -0700>,<Administrator>,<X>,<proc1d>,<TOPSPIN 2.1>,
      <abs ABSG = 1 
       data hash MD5: 32K
       47 4E 45 0C 38 1A C7 24 63 98 3F CA 2A 41 A1 98>)
(   5,<2013-07-18 17:19:48.876 -0700>,<Administrator>,<X>,<proc1d>,<TOPSPIN 2.1>,
      <abs ABSG = 2 
       data hash MD5: 32K
       63 FB BD EB 21 31 86 91 8F F1 B8 11 39 1C C1 07>)
(   6,<2013-07-18 17:19:48.923 -0700>,<Administrator>,<X>,<proc1d>,<TOPSPIN 2.1>,
      <abs ABSG = 3 
       data hash MD5: 32K
       6E 1E BC AB 14 F8 D4 B4 58 7B 98 EA 8B FD D4 5C>)
(   7,<2013-07-18 17:19:48.985 -0700>,<Administrator>,<X>,<proc1d>,<TOPSPIN 2.1>,
      <abs ABSG = 4 
       data hash MD5: 32K
       D5 C7 9F 5E C9 6C EF BF C9 2A 1E 7B C2 69 F8 DC>)
(   8,<2013-07-18 17:19:49.032 -0700>,<Administrator>,<X>,<proc1d>,<TOPSPIN 2.1>,
      <abs ABSG = 5 
       data hash MD5: 32K
       A6 1D 7C 37 8D 06 77 9D 1E 59 BF 38 B8 7D 4F 6F>)
$$ ##END=
$$ 
$$ $$ hash MD5
$$ $$ 1B D7 CA 19 C5 25 E0 D8 AA 35 35 01 F1 86 49 FC
##$RELAX= 
##$RELAX= 
##$RELAX= 
##$RELAX= 
##$RELAX= 
##$RELAX= 
##$RELAX= 
$$ Bruker specific parameters
$$ --------------------------
##$DU= <E:\>
##$EXPNO= 20
##$NAME= <AC1471_13FE002653_8027014_YZZf2qlXnJ>
$$ [...]
150 150 150 150 150 150 150 150
##$TP07= 0
##$TPNAME0= <>
##$TPNAME1= <>
##$TPNAME2= <>
##$TPNAME3= <>
##$TPNAME4= <>
##$TPNAME5= <>
##$TPNAME6= <>
##$TPNAME7= <>
##$TPOAL= (0..7)
0.5 0.5 0.5 0.5 0.5 0.5 0.5 0.5
##$TPOFFS= (0..7)
0 0 0 0 0 0 0 0
##$TUNHIN= 0
##$TUNHOUT= 0
##$TUNXOUT= 0
##$USERA1= <user>
##$USERA2= <user>
##$USERA3= <user>
##$USERA4= <user>
##$USERA5= <user>
##$V9= 5
##$VALIST= <valist>
##$VCLIST= <CCCCCCCCCCCCCCC>
##$VD= 0
##$VDLIST= <DDDDDDDDDDDDDDD>
##$VPLIST= <PPPPPPPPPPPPPPP>
##$VTLIST= <TTTTTTTTTTTTTTT>
##$WBST= 1024
##$WBSW= 4
##$XGAIN= (0..3)
0 0 0 0
##$XL= 0
##$YL= 0
##$YMAX_a= 650596
##$YMIN_a= -553928
##$ZGOPTNS= <>
##$ZL1= 120
##$ZL2= 120
##$ZL3= 120
##$ZL4= 120
##$ABSF1= 14.98509
##$ABSF2= -5.573092
##$ABSG= 5
##$ABSL= 3
##$ALPHA= 0
##$AQORDER= 0
##$ASSFAC= 0
##$ASSFACI= 0
##$ASSFACX= 0
##$ASSWID= 0
##$AUNMP= <proc_prof1d_extract_pilot.lims>
##$AXLEFT= 0
##$AXNAME= <>
##$AXNUC= <1H>
##$AXRIGHT= 0
##$AXTYPE= 0
##$AXUNIT= <>
##$AZFE= 0.1
##$AZFW= 0.1
##$BCFW= 0
##$BC_mod= 0
##$BYTORDP= 0
##$COROFFS= 0
##$CY= 15
##$DATMOD= 1
##$DC= 0
##$DFILT= <>
##$DTYPP= 0
##$F1P= 0
##$F2P= 0
##$FCOR= 0.5
##$FTSIZE= 32768
##$FT_mod= 6
##$GAMMA= 0
##$GB= 0
##$INTBC= 1
##$INTSCL= 1
##$ISEN= 128
##$LB= 0
##$LEV0= 0
##$LPBIN= 0
##$MAXI= 10000
##$MC2= 0
##$MEAN= 0
##$ME_mod= 0
##$MI= 0
##$NCOEF= 0
##$NC_proc= -8
##$NLEV= 6
##$NOISF1= 0
##$NOISF2= 0
##$NSP= 0
##$NTH_PI= 0
##$NZP= 0
##$OFFSET= 14.98509
##$PC= 1
##$PHC0= 97.94312
##$PHC1= 0
##$PH_mod= 1
##$PKNL= yes
##$PPARMOD= 0
##$PPDIAG= 0
##$PPIPTYP= 0
##$PPMPNUM= 2147483647
##$PPRESOL= 1
##$PSCAL= 4
##$PSIGN= 0
##$PYNMP= <proc.py>
##$REVERSE= no
##$SF= 400.02
##$SI= 32768
##$SIGF1= 0
##$SIGF2= 0
##$SINO= 400
##$SIOLD= 32768
##$SPECTYP= <>
##$SREGLST= <1H.CDCl3>
##$SSB= 0
##$STSI= 32768
##$STSR= 0
##$SW_p= 8223.68421052631
##$SYMM= 0
##$S_DEV= 0
##$TDeff= 65536
##$TDoff= 0
##$TI= <>
##$TILT= no
##$TM1= 0
##$TM2= 0
##$TOPLEV= 0
##$USERP1= <user>
##$USERP2= <user>
##$USERP3= <user>
##$USERP4= <user>
##$USERP5= <user>
##$WDW= 1
##$XDIM= 32768
##$YMAX_p= 439123334
##$YMIN_p= -621409
##$CURPLOT= <Network HP LaserJet P1505>
##$CURPRIN= <$Network HP LaserJet P1505>
##$DFORMAT= <normdp>
##$LAYOUT= <+/1D_H.xwp>
##$LFORMAT= <normlp>
##$PFORMAT= <normpl>
##$SURQMSG= 1
$$ End of Bruker specific parameters
$$ ---------------------------------
##NTUPLES= NMR SPECTRUM
##VAR_NAME=  FREQUENCY,     SPECTRUM/REAL,   SPECTRUM/IMAG
##SYMBOL=    X,             R,               I
##VAR_TYPE=  INDEPENDENT,   DEPENDENT,       DEPENDENT
##VAR_FORM=  AFFN,          ASDF,            ASDF
##VAR_DIM=   32768,         32768,           32768
##UNITS=     HZ,            ARBITRARY UNITS, ARBITRARY UNITS
##FACTOR=    0.250966925370066, 1,           1
##FIRST=     8223.43324360094, 133795,       -58348
##LAST=      0,             -57671,          -233684
##MIN=       0,             -621409,         0
##MAX=       8223.43324360094, 439123334,    0
$$ Real data points
##PAGE= N=1
##DATA TABLE= (X++(R..R)), XYDATA
$$ [...]
19529a49167b8526p3579B41409H6736a53116K344q3754C34253a54454a3123k81595
19518b94718a34681k6604B59418q8419A869N8566b6290j68095k97630a19230A88329
19506a27795g850l30366A81992H8979a9104D4683a39374A75203a25149C3496a15742
19494h568A68161A626N1794c49500I2280B6788M971c44226N4520A33783e5293
19482b6973j60084I093a91561A25006c35879E4026g0177E1892b33621M2870a0509
19470a4058j08123j09257c6529n6005B34138b77622A4196a84259B4301d4295k0368
19459f4663E1290e2357a6864F6485a88331B0416J11833f2139k7542M1128H5505
19447d5306A8685R8018n2424b32399I5915a50641M6935n3679j53987a06118l598
$$ y = [-149167, -28526, -102105, 241409, 86736, -153116, -150772, -234526, 334253, -154454, -13123, -294718, -134681, -161285, 259418, 170999, 1869, 60435, -26290, -194385, -492015, -119230, 188329, -127795, -7850, -338216, 181992, 88979, -19104, 44683, -139374, 175203, -125149, 33496, -115742, -8568, 168161, 1626, 53420, -349500, 92280, 26788, 31759, -344226, -289706, 133783, -55293, -26973, -187057, 9093, -191561, 125006, -335879, 54026, -70177, 51892, -233621, -190751, -10509, -14058, -122181, -231438, -36529, -92534, 234138, -277622, 14196, -184259, 24301, -44295, -64663, 51290, -52357, -16864, 66485, -188331, 20416, 132249, -62139, -89681, -48553, 85505, -45306, 18685, 116703, 64279, -232399, 95915, -150641, -103706, -157385, -311372, -106118, -109716]
19436a09716l5738A7074c44558O9088O2667N7660d7008J5266k4245l3902a0629
19424a73977A29321i6940c4408A4170d4632A78488a87329L6776m1339A27460h9888
19412f8397l4041A35727a67118A58134c8698j37295L4234O8340b5517C8490h623
19400b00877C62052A45313d2567k66365C70042a44886C32490A32210b59662m9209
19390c08871a12104k497j30485b5001H2260b52111B1468i6407o3969d2751q3749
19379a26500M6714G8008c29766b4324k7100A01140m6628A313b62258d2476o5430
19368a07906C95374H2024d20489A95213g1940j9563C3551L3289M7506a44698M6625
19357i8073J2945J7769l1051M8857A90764a34903e5344A12079B1289c66967M2017
$$ y = [-109716, -145454, 17074, -344558, -275470, -212803, -155143, -47008, -31742, -55987, -89889, -10629, -173977, 129321, -96940, -34408, 14170, -44632, 178488, -187329, -150553, -191892, 127460, -89888, -68397, -102438, 135727, -167118, 158134, -38698, -175993, -141759, -73419, -25517, 38490, -8623, -200877, 362052, 145313, -42567, -308932, 370042, -144886, 332490, 132210, -259662, -308871, -112104, -114601, -245086, -25001, 82260, -252111, 21468, -96407, -160376, -42751, -126500, -79786, 78008, -329766, -24324, -51424, 101140, 54512, 1313, -262258, -42476, -107906, 395374, 82024, -420489, 195213, -71940, -91503, 33551, 66840, 114346, -144698, -98073, -85128, -67359, -98410, -49553, 190764, -134903, -55344, 112079, 21289, -366967, -324950]
19346c24950a26762q1608G8965k2992e7407l3530D3681K36490c9866l17261D9168
19334g7662k50778B2019J04990a48439B17868K23363b61630i9180j14731A16029
19323I6994Q762h8770p672B7380K352D656d6994D6294g2751k72521f3086j63959
19311b27045p5115B0988K16251A17391c07789J00192m4252J6551m2682l3207N7564
19300b53623a16923k24159I9153a96220m1137b9682j37529D31632F3154a27012
19289G4710a18543f796B0196K31240a84650o6230a18629A08840a33992l05230
19279d39222A81736b9824n0190D4289J29316o7945J339c79651a77428d5876q4146
19268a30022d1287H4767A7196b01680i7653j10465A90580a13281a0153m1660A65128
$$ y = [-324950, -126762, -208370, 78965, 55973, -57407, -90937, 43681, 280171, -39866, -357127, 49168, -77662, -328440, 22019, 127009, -148439, 217868, 441231, -261630, -99180, -213911, 116029, 96994, 105756, -88770, -96442, 27380, 29732, 4656, -46994, 46294, -72751, -345272, -63086, -227045, -302160, 20988, 237239, 117391, -307789, -207597, -251849, -235298, -277980, -311187, -253623, -116923, -341082, 99153, -196220, -237357, -29682, -167211, 431632, 63154, -127012, 74710, -118543, -6796, 20196, 251436, -184650, -250880, -118629, 108840, -133992, -439222, 181736, -29824, -80014, 44289, 173605, 105660, 106999, -379651, -177428, -45876, -130022, -41287, 84767, 17196, -201680, -97653, -208118, 190580, -113281, -10153, -51813, 165128]
19256A11637c18862f2393k4854p550B663d132k05335e6345q2905A804O0612g3540
19243F1033a49658j91589A55460b9212j80541c8846k12176B3388P0644c43544
19232H5834J12774g2288K8091J7960n3738n3526q0479k30040J21532a43148L098
19221a40050L48e6462A46119a79936B8353a56342A43222F9294L3288a25591g692
19209a54176j11856f8700j32263B08262E9220L0757g9495B16177A2161a1469j32668
19198a44137e9419k04294D32914b02757A96530e093F638a54212L1016H6166f0504
19186b33495P0065r873p7466A66471b25800N8021H3298d1863A53842a19485H1802
19174C0964E351N6090h9472B03325B8567K2153J61661E0281j1791a43956A29239
$$ y = [111637, -318862, -62393, -87247, -94797, 2663, -4132, -209467, -56345, -139250, 1804, 62416, -73540, 61033, -149658, -341247, 155460, -29212, -209753, -38846, -251022, 23388, 94032, -343544, 85834, 198608, -72288, -44197, -26237, -79975, -133501, -213980, -444020, -322488, -143148, -140050, -139702, -56462, 146119, -179936, 28353, -156342, 143222, 69294, 102582, -125591, -7692, -154176, -266032, -68700, -200963, 208262, 59220, 89977, -79495, 216177, 12161, -11469, -144137, -59419, -263713, 432914, -202757, 196530, -5093, 6638, -154212, -123196, 86166, -60504, -233495, -163430, -173303, -250769, 166471, -225800, -167779, 83298, -41863, 153842, -119485, 81802, 30964, 5351, 61441, -89472, 203325, 28567, 50720, 212381, 50281, 38490, -143956, 129239]
19162c14362g6811j01291d6220J3343k7511k9329k17650n2637f8476j70882J8235
19151b21123q4590P4261A5505b57570B36688a18450c8884j98189A60682h9698
19140G750Q7077Q1233b62248A5202J03174d6838f66o2324j98000c6743H9144a63476
19127a75025B910a08892m3414N957A00540b20342f2194B35756c48250A53899A4255
19115B4217d9339A7632b03848B64985b45558n4628E3261h4377N822J5520B26181
19103B19864a07044A31712o0522a09394A03323C593a17245j29725a2528A22571
19092a86350K2930k54922a10226e4933k2122k75031A33022B9488J46503i2095
19081I80g2607k1720j42712d2093m8443j50310H5982b07694j55685a35017E9318
$$ y = [-314362, -76811, -178102, -46220, -32877, -60388, -89717, -307367, -360004, -68476, -239358, -221123, -305713, -231452, 15505, -257570, 236688, -118450, -38884, -237073, 160682, -89698, 7750, 94827, 176060, -262248, 15202, 118376, -46838, -666, -62990, -260990, -36743, 89144, -163476, -175025, 2910, -108892, -152306, -146349, 100540, -220342, -62194, 235756, -348250, 153899, 14255, 24217, -49339, 17632, -203848, 264985, -245558, -300186, 53261, -84377, -78555, -63035, 226181, 219864, -107044, 131712, 71190, -109394, 103323, 3593, -117245, -246970, -12528, 122571, -186350, -163420, -418342, -110226, -54933, -77055, -352086, 133022, 29488, 175991, -92095, 980, -72607, -94327, -237039, -42093, -90536, -240846, 85982, -207694, -363379, -135017, 59318]
19069a18657B4787D868g465k94797m0274C1275Q1358D9642N4364b55393C0528
19057g900m095j61386K5188B94857b38744A56784p4219a68384L2690A16184f3659
19045B0601J7880a58153r0732N9674l2422B0040b3935j474j75851o8143L7294
19034b32109a3975G1766Q0215a2508D7322N700D652e1947B456N7047J32373L0996
19022B22872G1874c66729C37458I2287a03787E8345b97271A47639J59062B9235
19011A4262f676j0968m18258J86052i5203m2622N5394I7437C6063e4875D5574
18999B16824a53001e9435A43875a20455e6217j51685c4690A51147A0098J17240
18989A27338b2717B42835a11605P70L5256C0055b26323g5911j63748e1704j09209
$$ y = [-118657, 24787, 4868, -7465, -302262, -342536, 31275, 112633, 49642, 104006, -255393, 30528, -7900, -11995, -173381, -148193, 294857, -238744, 156784, 82565, -168384, -135694, 116184, -63659, 20601, 38481, -158153, -248885, -189211, -221633, 20040, -23935, -25409, -201260, -269403, -232109, -13975, 71766, 151981, -12508, 47322, 53022, 4652, -51947, 2456, 59503, 191876, 222872, 71874, -366729, 337458, 92287, -103787, 58345, -297271, 147639, 306701, 29235, 14262, -6676, -17644, -435902, -249850, -95203, -137825, -82431, 97437, 36063, -54875, 45574, 216824, -153001, -59435, 143875, -120455, -56217, -207902, -34690, 151147, 10098, 127338, -22717, 242835, -111605, -110835, -75579, 30055, -226323, -75911, -239659, -51704, -160913]
18978a60913a667H1171a71191r4179a681A1470K05737g0709A27009K9826c73414
18966I4286a43054A16189e069A21055a26129J0638m6599A47779c581j70106A6125
18954e0525j29458f8299q057H042i6688G3129C3108b8755o6945A83882a14220
18942d47132b02828A40881j0573a72093j44245A47355D3199a37166A32748E1112
18931a91025C405a67765f2739K8942l47317a9628A63522e3688A28295a59423j11545
18920b70968M5865A15332b25425q9166R9207j7179I5476O729a55112c1365k12383
18909b43748F0820b3053k64739A45552o4901l0154b20614A76551a19216f069m7392
18898e3461l9524n6733O5443j33038R7837J6084A43392E9416a24499k8426g0292
$$ y = [-160913, -1667, 81171, -171191, -265370, -1681, 11470, 217207, -70709, 127009, 156835, -373414, 94286, -143054, 116189, -5069, 121055, -126129, -115491, -162090, 147779, -3581, -173687, 16125, -50525, -179983, -68299, -76356, 8042, -96688, 73129, 33108, -28755, -95700, 183882, -114220, -447132, -202828, 140881, 130308, -172093, -316338, 147355, 43199, -137166, 132748, 51112, -191025, 3405, -167765, -62739, -33797, -381114, -19628, 163522, -53688, 128295, -159423, -270968, -225103, 115332, -225425, -314591, -215384, -232563, 95476, 102205, -155112, -31365, -243748, 60820, -23053, -287792, 145552, 80651, 50497, -220614, 176551, -119216, -6069, -53461, -92985, -149718, -84275, -217313, -119476, -103392, 143392, 59416, -124499, -152925, -70292]
18886e98670a14855k2639I4444J74166i0041I1751D0593a24603F8363Q0324i0813
18874A62094a59704A54569G326a41452C3722a69254D68549A38317b00745j43249
18864c43994h232C1653a35500j85327B08755r4123e7093F931f2950j16488B88770
18852E3922j9910K74716r9091A02460a83409P3895e857l33509i9506r9124k6835
18841b25465g4248o0777k46823f0280A48714F5025a9597k8920D1301h8901A9436
18829a22499F6165j9814c5715l47723C1984J29919c402m5251A5280a59892A53526
18817c2091k78808A09979d530j99248C64785b07341B00075g5116A40594a91287
18806B7210e6647o9776A00693d4691J6374k86671C9914J4829c0760j20835B93828
$$ y = [-598670, -114855, -137494, 94444, 268610, -90041, 91751, 40593, -124603, 68363, 148687, -90813, 162094, -159704, 154569, 7326, -141452, 33722, -169254, 468549, 138317, -200745, -343994, -8232, 31653, -135500, -320827, 208755, 114632, -57093, 6931, -62950, -179438, 288770, 53922, 34012, 308728, 209637, 102460, -183409, -109514, -5857, -339366, -99506, -198630, -225465, -74248, -135025, -381848, -60280, 148714, 65025, -19597, -48517, 41301, -88901, 19436, -122499, 66165, 46351, -35715, -383438, 31984, 161903, -3402, -48653, 15280, -159892, 153526, -32091, -310899, 109979, -4530, -203778, 364785, -207341, 200075, -75116, 140594, -191287, 27210, -56647, -126423, 100693, -44691, -28317, -314988, 39914, 54743, -30760, -151595, 293828]
18794b07446l2910Q6411A61886F1201h5826J7012m27A43301E5967e2678k9406
18783h2084e177k78170J24798m839A98310P394D3892d4113k04567C50778a5007
18771d52598d3714m21680a39400k03372C7111d7353l9432L101m6246A60252a35780
18759g5119L3114l2032c4972k9674j84256I96b13829A3919c51237O6232A47821
18747f7501l897A9015f7063B5751L6863g6517A62565a42991f6721A44500i872
18735A30626A8310J41673a32324F2291c3835m87967B21080k3135Q857a21619j46849
18724b68468B56633d0767j87658n778j29B15294g6526A25606f8142k32388N9969
18713b40561h9560C7983c05209a4102k09992B41914a88280M5416c4475A0503c45774
$$ y = [-207446, -240356, -153945, 161886, 61201, -85826, -68814, -69241, 143301, 55967, -52678, -82084, -5177, -283347, -158549, -163388, 198310, 205704, 43892, -44113, -248680, 350778, -15007, -452598, -43714, -465394, -139400, -342772, 37111, -47353, -86785, -83684, -129930, 160252, -135780, -75119, -42005, -74037, -34972, -64646, -248902, 996, -213829, 13919, -351237, -285005, 147821, -67501, -71398, 19015, -67063, 25751, 62614, -76517, 162565, -142991, -66721, 144500, -9872, 130626, 18310, 159983, -132324, 62291, -33835, -521802, 221080, 197945, 206802, -121619, -268468, 256633, -40767, -228425, -234203, -234332, 215294, -76526, 125606, -68142, -300530, -240561, -89560, 37983, -305209, -14102, -224094, 241914, -188280, -142864, -34475, 10503, -345774]
18701A79994d2516B48837f3184m6820M1873o8245H0881b38261C1891K3955c0570
18689a85986j28770Q1286J01051C41875c4583k04335g2768B39308A8460b03774
18678B65570g6364A5959J01210h2657c5619A69467a59536H1666J6112i0992p4814
18667a65806J9513j74959L5757b4481A53449A2385b00088M4672L5321M9782A53025
18655I8475i8579r0395h8545E3771b17176A17165f0823C61909A3976J95311d3180
18643f1055j44764l2373I4758C649K594c51264a56161O2685G6654N9882a37562
18631a27041n3666l1221A10995C7287a1827j71596E1846b1339E9599J80956b17146
18619A42863a53882d8867I8191j0874B536Q1526N2201a20603m8738m6468R5427
$$ y = [179994, -42516, 248837, -63184, -110004, -68131, -136376, 80881, -238261, 31891, 55846, -30570, -185986, -314756, -233470, -132419, 341875, -34583, -238918, -72768, 239308, 18460, -203774, 265570, -76364, 15959, 117169, -82657, -35619, 169467, -159536, 81666, 97778, -90992, -165806, -146293, -321252, -285495, -24481, 153449, 12385, -200088, -155416, -120095, -70313, 153025, 98475, -98579, -188974, -88545, 53771, -217176, 117165, -60823, 361909, 13976, 209287, -43180, -61055, -205819, -238192, 94758, 3649, 6243, -351264, -156161, -93476, 76654, 136536, -137562, -127041, -180707, -211928, 110995, 37287, -11827, -183423, 51846, -21339, 59599, 240555, -217146, 142863, -153882, -48867, 98191, 87317, 2536, 84062, 136263, -120603, -169341, -215809, -120382]
18608a20382B0461R9026K82500a30646J5336l41367A57897d64j65107B34509a34333
18596a38390b6660e490n6656a1058k8371A51485J1869F9429M5318l8444b80108
18584B08985b44124O6999a4311k7998l258o078A23386F166L42582K4229n4135
18573C18842d08308a12265L2454A69030a43490j50904h3061J2888j64945D9616
18562h3913A36581Q6522a41210l53283D8357a82471a7589A23498a16870A97113
18551a74807j55734a41216B58886c9961k8612j6684k21015a0792j82381K3202
18541a69971d4435l074j07255j65520A77169N4114a00082A143L8134d5967j32744
18530a78711L1712M0064B07372n2830E4331j3098g1234b5656o2031A44898g430
$$ y = [-120382, 20461, 119487, 401987, -130646, -115310, -456677, 157897, -464, -165571, 234509, -134333, -138390, -26660, -5490, -62146, -11058, -39429, 151485, 163354, 69429, 114747, 76303, -280108, 208985, -244124, -177125, -14311, -42309, -45567, -51645, 123386, 6166, 348748, 372977, 318842, -408308, -112265, -79811, 169030, -143490, -294394, -83061, -70173, -235118, 49616, -83913, 136581, 223103, -141210, -494493, 48357, -182471, -17589, 123498, -116870, 197113, -174807, -330541, -141216, 258886, -39961, -68573, -85257, -306272, -10792, -193173, -169971, -44435, -47509, -154764, -320284, 177169, 231283, -100082, 1143, 39277, -45967, -178711, -146999, -106935, 207372, 154542, 54331, 41233, -71234, -25656, -87687, 144898, -7430]
18518B7607O6588e198q4951b5022k52675a33003E0034a65833O01F1705c36495
18506b43133g8599a5153B46907E2656b2812J0223k0301j03128A4184i8901n7260
18495a56161q9466I5113a18942k2428J8943B3641c34103B6155a79124B6614J17178
18484A43792p0155c88112g3371B520J0382c1799B12146G7594g4349C23333I8115
18472b35998B35911g4414D5929b30618a15090A38967b26295a04260a8107j56583
18462a74690a4583j50598g2033j16517j7508c9657K27m7075L7734B76050a03478
18450b8230a1194m7565m72030b39553i0761C8299A862a29455r6030e018k3599
18439b8617B5671a39722j6999I0263R6468b95030B41608a66064k3209B07622d4901
$$ y = [27607, 94195, -5198, -90149, -25022, -277697, -133003, 50034, -165833, -165232, 61705, -336495, -243133, -78599, -15153, 246907, 52656, -22812, -12589, -32890, -136018, 14184, -98901, -156161, -245627, 95113, -118942, -141370, -122427, 23641, -334103, 26155, -179124, 26614, 143792, 73637, -388112, -73371, 2520, 12902, -31799, 212146, 77594, -74349, 323333, 98115, -235998, 235911, -74414, 45929, -230618, -115090, 138967, -226295, -104260, -18107, -174690, -14583, -165181, -72033, -188550, -206058, -39657, -39430, -86505, -48771, 276050, -103478, -28230, -11194, -58759, -530789, -239553, -90761, 38299, 1862, -129455, -225485, -5018, -28617, 25671, -139722, -156721, 90263, 186731, -295030, 241608, -166064, -189273, 207622, -44901]
18427h9135j92618c3642D3280N9190c99782C992J57636a23295j40463a09241A69044
18415c2476h044m71077D295a33639C5812d2012p0059d5552A32268o4034e0703
18403a38117B33352o1312B5930g3481j34478h6906A786d9342k8515q8557O5639
18392a00775C09489j49384a20975B97847c88275e7998j39239A65010q016G7691
18381A51140A6616c2416l00003O2896i0656a4961j06082C2368a67026d1509A22850
18369a08545A62951d2854A91092d1512A69404E5104a87727M2644k50186i8021
18358a26831A32609h485r4305j44780A11894b14806C61214b81376c11A58307d82321
18346b04828b2866j46562j0793e8563A6754g1816G587a27400K0952I8546d493
$$ y = [-89135, -281753, -33642, 43280, 102470, -399782, 3992, 161628, -123295, -263758, -109241, 169044, -32476, -8044, -479121, 4295, -133639, 35812, -42012, -112071, -45552, 132268, 68234, -50703, -138117, 233352, 172040, 25930, -73481, -207959, -86906, 1786, -49342, -77857, -166414, -100775, 309489, 160105, -120975, 297847, -388275, -57998, -197237, 165010, 156994, 77691, 151140, 16616, -32416, -332419, -269523, -90656, -14961, -121043, 32368, -167026, -41509, 122850, -108545, 162951, -42854, 191092, -41512, 169404, 55104, -187727, -145083, -395269, -98021, -126831, 132609, -8485, -102790, -247570, 111894, -214806, 361214, -281376, -311, 158307, -482321, -204828, -22866, -169428, -180221, -58563, 16754, -71816, 7587, -127400, -106448, 98546, -4493]
18334H7274l7540a58101j538K8034c3029C51798j73948d2267F2962g4992K3136
18323e1856k29184A92999b86534C1913K0403h0619k10368G6187a13447k13959
18313c27406i2923L9070B78217b5188o9240j67883a4997m7702J0974A60594E700
18301b14607P4678R195E8316J2344e5223j2244L2583J2394r0603p7257R1753E6065
18288B6021J8915a11447p618j28537B36590a83024e7768G2260a10656G8723Q8246
18277A66969e3437l8063H8354e2690k08971B07562J23905c28586A9034i0629J7098
18266g3531D8283h6823B98708i8763A56435a66180e4242B46458o9449h1969A53055
18254b35846j36702e6907r1943k05471D1184i2507j2057j15671D0397a1420o8814
$$ y = [87274, 49734, -158101, -159639, -131605, -33029, 351798, 177850, -42267, 62962, -74992, -51856, -281040, 192999, -286534, 31913, 52316, -80619, -290987, 76187, -113447, -327406, -92923, -53853, 278217, -25188, -94428, -262311, -14997, -62699, -51725, 160594, 5700, -214607, -139929, -130734, 58316, 70660, -55223, -67467, -34884, -22490, -113093, -190350, -98597, 56065, 26021, 44936, -111447, -119065, -247602, 236590, -183024, -57768, 72260, -110656, 78723, 166969, -53437, -91500, 88354, -52690, -261661, 207562, 331467, -328586, 19034, -90629, -73531, 48283, -86823, 298708, -98763, 156435, -166180, -54242, 246458, 177009, -81969, 153055, -235846, -372548, -56907, -148850, -354321, 41184, -92507, -104564, -220235, 40397, -11420, -80234]
18243h0234k43683R9765J04798d974K458F8448a51185A8296g85A92396c075A02996
18230f1039l33657F9029c04264a22371B08559b43910d0563a661q023j77155A83098
18218a19213k5592F3823a2469D03046h9559A19947K4257c0294A92524a99592J8453
18207a81139j51363J28498P7165H9680h5330k3508b7021C01530A06279n1264j715
18196E3300K21199a90692d4428q9715J703l5952f8003j60985i6441C2083J45081
18185A77164a07427k24643a65723j48040a7683C47104r4039I2797b44103c7415
18174H8377k9261a38400l4171A91727B7940a60474K5279j66221G9541h7231l9850
18163a27081b5095A39850b09173A24904D1934J37876a45799j62024b9840p6512
$$ y = [-80234, -323917, -224152, -119354, -4974, -2516, 68448, -151185, 18296, -785, 192396, -3075, 102996, -61039, -394696, 69029, -304264, -122371, 208559, -243910, -40563, -1661, -9684, -186839, 183098, -119213, -144805, 63823, -12469, 403046, -89559, 119947, 144204, -30294, 192524, -199592, -181139, -332502, -204004, -126839, 89680, -85330, -108838, -27021, 301530, 106279, 55015, 53300, 274499, -190692, -44428, -134143, -132440, -168392, -68003, -228988, -96441, 32083, 177164, -107427, -332070, -165723, -313763, -17683, 347104, 253065, 92797, -244103, -37415, 88377, 59116, -138400, -172571, 191727, 27940, -160474, -135195, -301416, 79541, -87231, -127081, -25095, 139850, -209173, 124904, 41934, 179810, -145799, -307823, -29840, -106352]
18153a06352c4914b699A09476o906j5000c5106A86653B0207M07541a75919I2397
18141C3459K21288b50502i074k07724B42112b51647J16203A2063A456a27554F0663
18129a33339n428O1933J6352c094A97077a63229A52410J3426L2005b47285c7748
18117C3845i5056j83849E46952B20461E5484b1559j52492P2568j27105A42804
18106A45737a2858k8610l9370A85617c8098j25404K7515B01428k0009a23065B70532
18094D8798J31482d547A06975g9896l84311R3297A60711b62950d7902A53675G815
18082b2305j85410i5285j17674k6402a4326A61250G271g930j3679j34526A81021
18070a83134e3774A00588a84191F0011K4632a63742f9145B95197j27226C5107
$$ y = [-106352, -34914, -2699, 109476, 102570, 87570, -35106, 186653, 20207, 427748, -175919, 92397, 33459, 254747, -250502, -9074, -216798, 242112, -251647, -135444, 12063, 1456, -127554, 60663, -133339, -138767, -76834, -60482, -3094, 197077, -163229, 152410, 165836, 197841, -247285, -37748, 33845, -95056, -278905, 546952, 220461, 55484, -21559, -174051, -101483, -228588, 142804, 145737, -12858, -41468, -80838, 185617, -38098, -163502, -135987, 201428, 181419, -123065, 270532, 48798, 180280, -4547, 106975, -79896, -464207, -370910, 160711, -262950, -47902, 153675, 7815, -22305, -207715, -95285, -212959, -239361, -14326, 161250, 7271, -7930, -21609, -156135, 181021, -183134, -53774, 100588, -184191, 60011, 84643, -163742, -69145, 295197, 167971, 35107]
18059b11228P4433A61105J02494a69460l8008B20358q8986f4201n8294D0729f0840
18047B08564D1425E592b04612c1871k3918m5513D8772K1242i592k80233A24706
18035d29942a89909B51163c62515J20714I2157L0336h6281O33k83062a46526B87671
18023a14041m2147i744n03980A04057a76024o6993b8102A14703b31090m7410B8635
18011B44803E772K8011J4042j5111b95835C545h325A54239M6874c19049F8578
17999D5953K16874G7888K53989e9409j61215B24175H4434B6644J53160b0289l9465
17988e9754I1844L3438h8552r3407O6486j68302K2361A25164l2425J318a32359
17976a31390A55209f8838c0762B6443J58680f7548j03298B6211h8325j01061b3097
$$ y = [-211228, -136795, 161105, 263599, -169460, -207468, 220358, 131372, -64201, -122495, 40729, -60840, 208564, 41425, 5592, -204612, -31871, -55789, -101302, 48772, 70014, -9592, -289825, 124706, -429942, -189909, 251163, -362515, -241801, 92157, 122493, -86281, -85648, -368710, -146526, 287671, -114041, -156188, -9744, -513724, 104057, -176024, -243017, -28102, 114703, -231090, -278500, 28635, 244803, 5772, 33783, 47825, 32714, -295835, 3545, -8325, 154239, 201113, -319049, 68578, 45953, 262827, 77888, 331877, -59409, -220624, 224175, 84434, 26644, 179804, -20289, -59754, 91844, 125282, -88552, -181959, -115473, -283775, -261414, 125164, 92739, 94057, -132359, -131390, 155209, -68838, -30762, 26443, 185123, -67548, -170846, 26211, -88325, -189386, -23097]
17964C8086f4875k26359a14928r021A67468c31995i5597L7268b6748D830b3527
17952A92076i2929J6008k19002l6943F0787d8662A29758c4187R281j85766A67491
17940C9939K21000e5821j35466C1336c69674C1003c01123a50557A13380c79791
17929h5671o2402c0709C0379K59110l4039a1879A42127R910a403n2264K3765l21953
17917c51855i7031A43825b01783C22664B8885m030b60775C84482a41174O5132
17907g6042A56883a09982r1462A10587l0185B8739N5228c349j22151k5855j28757
17896b80112R6172C9285L5125b8262A65456J55372j60046D8397a70545j33350
17886c03895d1221B91228H5168a44312B58095b05845B59577j318l5303a5950k60674
$$ y = [38086, -64875, -291234, -114928, -123949, 167468, -331995, -95597, -58329, -26748, 4830, -23527, 192076, -92929, -76921, -295923, -332866, 60787, -48662, 129758, -34187, -24906, -210672, 167491, 39939, 260939, -55821, -191287, 31336, -369674, 31003, -301123, -150557, 113380, -379791, -85671, -148073, -30709, 30379, 289489, 255450, -11879, 142127, 152037, -1403, -53667, -29902, -351855, -97031, 143825, -201783, 322664, 28885, 24855, -260775, 384482, -141174, -76042, 156883, -109982, -201444, 110587, 80402, 28739, 83967, -3349, -125500, -151355, -280112, -183940, 39285, 74410, -28262, 165456, 320828, 160782, 48397, -170545, -303895, -41221, 291228, 85168, -144312, 258095, -205845, 259577, 258259, 222956, -15950, -276624]
17875b76624A64821B1889c37770q4323a38631A89310c1897q9892A9746M33147
17865D52893a31253B90630c90149E135d4709q5214B08246a34497f3308K1293l34462
17854c76477F8652A0029a24258A44270d20765B26487b68981d73l02585d4670C48152
17842A95540C1765b47829j75756A59356N8752r6849N8976r726a45728O8057K8807
17831d8864A90480d5003l8696j19744i8194b9599l10887B56958a3050I0217b52891
17819A76321b24120B16110a56964E2846i7130G9201K44615J1282a94546G9584
17808e4206j42088C02592b15346B50889q5656h8413j77256I323h7370l8478E8901
17796B40126h7507j8815E0222f6329A27764l0591a07402C2251c4905F3459B1863
$$ y = [-276624, 164821, 21889, -337770, -422093, -138631, 189310, -31897, -121789, 19746, 452893, -131253, 290630, -390149, 5135, -44709, -129923, 208246, -134497, -63308, -42015, -376477, 68652, 10029, -124258, 144270, -420765, 226487, -268981, -473, -303058, -44670, 348152, 195540, 31765, -247829, -423585, 159356, 218108, 121259, 180235, 170509, -145728, -77671, -48864, 190480, -45003, -83699, -203443, -98194, -29599, -340486, 256958, -13050, 90217, -252891, 176321, -224120, 216110, -156964, 52846, -97130, 79201, 323816, 335098, -194546, 79584, -54206, -196294, 302592, -215346, 250889, 165233, -88413, -265669, 9323, -87370, -125848, 58901, 240126, -87507, -106322, 50222, -66329, 127764, 97173, -107402, 32251, -34905, 63459, 21863]
17784e5801A08340M2010M0241h0878B1351b36098m6194J15188A77097K4260c49377
17772a25103H6904l1369f2914H6688L57262g3677f850r4768e0559r572E6684K45017
17760C01701b55496f9504j39528A31853D5614a23296A7957M2567J24176B66b26329
17748a90324C46574a85825K0337A68883J94494A52716c50504G8817f448j13250
17738a19698D3904c8324B11594a3820j26063M9742n9002I8689b94213O0645O849
17727b26719k09293B41337I0276i5099l5895C3336g9374j04664R511m4027A77702
17715b50334h4027A2639b3300D02860b07219j30306C9002L60015A70209a47273
17704H0486h4768J9173B1499J24967o2598K7771l2786Q4699b04711E5324J14280
$$ y = [-55801, 108340, 150350, 190591, -80878, 21351, -236098, -282292, -167104, 177097, 201357, -349377, -125103, 86904, 55535, -62914, 86688, 443950, -73677, -6850, -101618, -50559, -60131, 56684, 301701, -255496, -69504, -209032, 131853, 45614, -123296, 17957, 60524, 184700, 266, -226329, -190324, 346574, -185825, -165488, 168883, 363377, 152716, -350504, 78817, -6448, -119698, 43904, -38324, 211594, -13820, -139883, -90141, -149143, 98689, -294213, -233568, -226719, -436012, 241337, 90276, -95099, -130994, 33336, -79374, -184038, -174527, -218554, 177702, -250334, -84027, 12639, -23300, 402860, -207219, -337525, 39002, 399017, 170209, -147273, 80486, -84768, -65595, 21499, 146466, 83868, 111639, 78853, 163552, -204711, 55324, 169604]
17693A69604b8372B44663A08623A8743g132r6140A54570K22777A27494o0788a8594
17681a80117n4461f0804k21783d5141A79772a29167A7253P2122K29475b0570A91484
17669A53433a26126B43665j04739J27294a29636f4631I7774E296a47493C78221
17658D09198I5609e7770a9778B08828R0519L5007b57448j10523C26368j16253
17648B10115h4944j12431D45140A26581D5266h3189j08921h4733A40532b26448
17637A62095A1797d7450A81202I0436b865o7630b1295A08875j5790G909J33022
17626A40931o9672M0404F991d362A27504f4437a9442k44578A50988n4778a47049
17614f5659B11096b05546G5498a15064A36497c9337n7828j51433b5314m3424H7665
$$ y = [169604, -28372, 244663, 108623, 18743, -7132, -103272, 154570, 377347, 127494, 66706, -18594, -180117, -234578, -60804, -282587, -45141, 179772, -129167, 17253, 89375, 318850, -20570, 191484, 153433, -126126, 243665, 138926, 266220, -129636, -64631, 97774, 5296, -147493, 378221, 409198, 95609, -57770, -19778, 208828, 299347, 334354, -257448, -367971, 326368, 210115, -84944, -197375, 445140, 126581, 45266, -83189, -192110, -84733, 140532, -226448, 162095, 11797, -47450, 181202, 90436, -2865, -70495, -21295, 108875, 93085, 7909, 140931, 71259, 111663, 6991, -4362, 127504, -64437, -19442, -264020, 150988, 96210, -147049, -65659, 211096, -205546, 75498, -115064, 136497, -39337, -97165, -248598, -25314, -68738, 87665]
17602A04660b347E09191A94091r6671h4342H9182L3071m9356e48163I1560B7650
17590g6209B5361d2509j7861n8485c4177l152j429k34090R4866q6315h986C12461
17577B97220j03348m8020J43396d5480G3621b15943B27330c20838A06554J64318
17567B70872C187J5278J42765J96788A3941R5161K61938C3696A5320K2248h2848
17555B89210q0079B2590J55469o6928k5225J40775b31023a1133m8950A15812C9776
17543A24752f4635C2786J05611k3029J98792e0206o9645A49470O5250M3503Q7541
17532C45764A4840O7668L8950a56557E7025L3653l3425b71480E7888C911K10688
17521B14599D4351m953f6924A64931G3322K22283a6681A25730E4499k2894O584
$$ y = [104660, -2347, 509191, 194091, 97420, -84342, 89182, 122253, 72897, -548163, 91560, 27650, -76209, 25361, -42509, -60370, -118855, -34177, -37329, -38758, -272848, -177982, -264297, -8986, 312461, 297220, 193872, 145852, 289248, -45480, 73621, -215943, 227330, -320838, 106554, 270872, 3187, 18465, 161230, 358018, 13941, 109102, 371040, 33696, 15320, 37568, -82848, 289210, 209131, 22590, 178059, 111131, 85906, 226681, -231023, -11133, -60083, 115812, 39776, 124752, -64635, 32786, 138397, 115368, 314160, -50206, -119851, 149470, 214720, 258223, 345764, 14840, 82508, 121458, -156557, 57025, 90678, 57253, -271480, 57888, 3911, 214599, 44351, 39398, -66924, 164931, 73322, 295605, -16681, 125730, 54499, 31605, 38189]
17510C8189K0701a74332B33902m5576a00073D1923a7362C26850H6564b0112p1349
17499i1461C48963g1505k86730C04885C2503N8414C3254A0405J80397G1257M79896
17488E51153k32798A18709n9353h6324C20003p9715r7181F5453I251a18597D45909
17476a48049J9341B68391A12959c96159A04077R3468q1442a29885D26926o1073
17466C65853b16882B93741F4482a53437D5567N8734E648a10070e4295j06509N9941
17455a00863B78278j19479J78953j18391L24821k20528I8650L0764L30110j38786
17445C20738G5378A9576M11577N7479b1631D89283q9305j51761i6131C42375j8087
17434C24288m4419r2782r1198Q2984K31077c3705I1654K94401j62322J73656j52669
$$ y = [38189, 58890, -174332, 233902, 188326, -100073, 41923, -17362, 326850, 86564, -20112, -91461, 348963, -71505, -358235, 304885, 32503, 90917, 33254, 10405, 190802, 71257, 551153, 318355, 118709, 59356, -86324, 320003, 240288, 143107, 65453, 9251, -118597, 445909, -148049, -128708, 268391, 112959, -396159, 104077, 197545, 116103, -129885, 426926, 365853, -216882, 293741, 64482, -153437, 45567, 104301, 5648, -110070, -54295, -160804, -100863, 278278, 158799, 337752, 219361, 544182, 323654, 98650, 129414, 459524, 320738, 75378, 19576, 431153, 488632, -21631, 489283, 399978, 248217, -96131, 342375, 324288, 279869, 187087, 95889, 178873, 409950, -33705, 91654, 386055, 223733, 397389, 244720]
17423B44720J22417a70488A49510J93558A34572a24067E06908n7229j01885J07870
17413D55664j25587l9777K4353a32323E2740L9200J17250a29040n746A58517d1166
17401A98944L3669a4374I7086N478m6702K58730j06073b3256J1447n1237k44848
17390c07894C10897q4812g5227C61119I5341J15860e5431C33542A17598M00634
17380E18232A58077L0300m2143J68244A12229K68372I2143m2228a49741B55757
17369B94448j08664j1745Q0858f120C43454J20332B12968K0477M0454D411Q5363
17358H9774M7028a07044E97091E8538J62719p3309D7818Q9189K1367b71116J28798
17347a42318J6953A39839C2712c4675A95596K91286c1517B36126J17867C9632
$$ y = [244720, 367137, -170488, 149510, 343068, 134572, -124067, 506908, 449679, 347794, 455664, 330077, 290300, 314653, -132323, 52740, 91940, 209190, -129040, -134786, 158517, -41166, 198944, 232613, -14374, 97086, 102564, 55862, 314592, 208519, -23256, -11809, -63046, -307894, 310897, 226085, -75227, 361119, 95341, 211201, -55431, 333542, 117598, 518232, 158077, 188377, 146234, 314478, 112229, 380601, 92143, 49915, -149741, 255757, 294448, 185784, 174039, 254897, -6120, 343454, 463786, 212968, 233445, 273899, 4411, 89774, 136802, -107044, 597091, 58538, 221257, 147948, 47818, 137007, 158374, -271116, -142318, -125365, 139839, 32712, -34675, 195596, 486882, -31517, 236126, 353993, 39632]
17336E6272d2016p4799A1134J70642J25022j31278J6055Q1135b32015B65028r2586
17325A72442e8163A66190a17118C2855M5768J18146J78915a27123A51J48598G2367
17313C02189A30809a13249B4156L8622k1296J7322J22397G1113P8468p239R8993
17302B41335i4574A37289J27144G2520c7904C41785A47929J48964E1737a83528
17291B64323j29475J19793q3966D1033J91374h0738A66086J28338o1654k0186
17281B12584A012J81405H2259J9341K601K91128C620K58415m0574l3570K491D7038
17268a9991A85294K6735D0900N31054A3227b65739C61067L8681j63327D8796K64383
17257C13179D9226L1930Q5665J88689j31624M9523j15523L6480o9006g2421E77897
$$ y = [56272, -42016, -116815, 11134, 181776, 306798, 175520, 191575, 272710, -232015, 265028, 172442, -58163, 166190, -117118, 32855, 78623, 196769, 375684, -127123, 151, 148749, 72367, 302189, 130809, -113249, 24156, 62778, 41482, 58804, 181201, 71113, 149581, 142342, 241335, -94574, 137289, 264433, 72520, -37904, 341785, 147929, 296893, 51737, -183528, 264323, 134848, 254641, 170675, 41033, 232407, -80738, 166086, 294424, 232770, 212584, 1012, 182417, 82259, 101600, 104201, 395329, 3620, 262035, 221461, 187891, 190382, 47038, -19991, 185294, 212029, 40900, 571954, 13227, -265739, 361067, 399748, 236421, 48796, 313179, 49226, 81156, 166821, 355510, 223886, 273409, 157886, 194366, 125360, -72421, 577897]
17245B73027A7500P1309l0429e7477A55902E5317g922C77407J07737h967B72444
17233B09796m4935k7085J89322L47347k26770j67114H0213O604i7524B09413a47210
17221D81447e7975A69400b23663B24204j5972N5536L800C6816b3565C05580P9522
17210C85102d2471D39219A60438j7882J5024J63497Q7886A68935J5854M9777m8964
17199A85602l8383F3789J97301J43849A8139M36386r8820j22836m60K7869L043
17188B63321K9093A40970K00919m6960K96526B21989J53718a12239C76911j86678
17178A90233j1755J18407a5001B21468J80832J38493A58919K50688A62684G1526
17167B85977b3679C50614o2787k1310c0444C31926j10614L37053b86111C01234
$$ y = [273027, 17500, 88809, 58380, -57477, 155902, 55317, -7922, 377407, 485144, -8967, 272444, 209796, 164861, 137776, 327098, 674445, 447675, 280561, 80213, 86817, -97524, 209413, -147210, 481447, -57975, 169400, -223663, 224204, 208232, 263768, 267568, 36816, -23565, 305580, 385102, -42471, 439219, 160438, 142556, 157580, 321077, 408963, 168935, 184789, 234566, 185602, 147219, 63789, 261090, 404939, 18139, 454525, 355705, 232869, 232409, 260278, 263321, 292414, 140970, 341889, 294929, 591455, 221989, 375707, -112239, 376911, 190233, 178478, 296885, -15001, 221468, 402300, 540793, 158919, 409607, 162684, 71526, 285977, -23679, 350614, 287827, 266517, -30444, 331926, 221312, 558365, -286111, 301234]
17156B46046J28379n028L36207B49226F4708K62478K03100A52189h5913G33999
17145B82452b3558C95861k6831o7935J75108p2965j47658P3077a274D36404A82453
17133B80984L6867O6749O5182A65179J76080k2962r8110G7701J58600j0600N18244
17122G43945j6130A71332k3430M30840k32911A62410O6535o8552R3057o5469k2968
17111A65013J29464P8980D7396O27817B36244J38964Q9431r4805L3958A17081
17100A60355L941K61433J56221j41443M1917j26965J29981M07326B73008K32917
17090E05925D0370P18325B91362K16899j92625m850N2194F366L53932J2976K22422
17079E95696j79397G0388K31774J87382O1788q1182J45598k30744k5592N4635
$$ y = [246046, 374425, 369397, 705604, 249226, 64708, 327186, 530286, 152189, -85913, 733999, 282452, -23558, 395861, 369030, 301095, 476203, 403238, 255580, 328657, -1274, 436404, 182453, 280984, 317851, 384600, 449782, 165179, 341259, 318297, 220187, 77701, 236301, 225701, 743945, 727815, 171332, 147902, 578742, 345831, 162410, 228945, 160393, 253450, 187981, 165013, 294477, 373457, 47396, 675213, 236244, 375208, 464639, 369834, 403792, 117081, 160355, 164296, 425729, 581950, 440507, 482424, 355459, 485440, 892766, 273008, 505925, 40370, 758695, 291362, 508261, 315636, 310786, 362980, 6366, 360298, 373274, 595696, 416299, 70388, 302162, 489544, 551332, 470150, 615748, 385004, 359412, 414047]
17069D14047K7567J13488A65751K47314n1695K52975l0610j06363R7784J40733
17059G15889J31717j85587j42797q9398K49028n5116k2158K0593L21064k83399
17049F59836k15665l6012P3015J76256B52893K75545O3105M0471k27174L20832
17039G25672k09798J47640k57820J74694o2204K74061C56045K31193J41447k57766
17029D70919K64751q0652q1153o4246N6022O2346P2808O3341k0723l43377J61318
17018E61354M62983n08672K55241J74154p3071L25990E55725L53495Q1644j77748
17008H13116n4818R9038l85071O7706K23517P001j69800M60490N7616m87890M28757
16997A059662L5702j92739k8383O5773q5248k492p3596n2521J27855k70736J80887
$$ y = [414047, 441614, 555102, 165751, 413065, 361370, 614345, 583735, 477372, 575156, 715889, 847606, 662019, 519222, 429824, 678852, 623736, 601578, 622171, 943235, 659836, 444171, 408159, 481174, 657430, 252893, 528438, 591543, 632014, 404840, 725672, 515874, 663514, 405694, 580388, 518184, 792245, 356045, 587238, 728685, 470919, 735670, 655018, 573865, 509619, 565641, 627987, 700795, 764136, 743413, 400036, 561354, 1024337, 515665, 770906, 945060, 871989, 1197979, 555725, 909220, 990864, 813116, 758298, 857336, 472265, 539971, 763488, 770489, 600689, 1061179, 1118795, 630905, 1059662, 1095364, 902625, 874242, 940015, 854767, 852275, 778679, 726158, 854013, 583277, 764164]
16986G64164K93687j33884j08037k9222l2089Q949J30660j41828K8235J45685
16976I26320J28318R1604l34519P0766J17171m6396j41976p2814M95263k61467
16966I72270n5270K55417k14382p8315j33166K10971M00052k07563N0973l57890
16956H43097K49600J41911m23080N42366l89194J78793p426L25214k26364J2393
16946A247310j62617L3031O2902L10554p0930j79810K8203J38681j33776L80761
16936A654309n02044L14416k31913J61787K63910m3291j50899l1762M0658K18870
16926A694041k16437l5222k1479K34624J3623j39051P7252L16450l26687L73042
16916A970156j91727L5061J75268k80896L11130k54294L7833K94962j45124Q3001
$$ y = [764164, 1057851, 923967, 815930, 786708, 754619, 763568, 894228, 752400, 780635, 926320, 1054638, 1146242, 811723, 882489, 999660, 953264, 811288, 738474, 1233737, 972270, 917000, 1172417, 958035, 879720, 746554, 957525, 1357577, 1150014, 1200987, 843097, 1092697, 1234608, 811528, 1353894, 964700, 1143493, 1136067, 1461281, 1234917, 1247310, 1084693, 1117724, 1180626, 1491180, 1420250, 1240440, 1268643, 1407324, 1273548, 1654309, 1152265, 1466681, 1234768, 1396555, 1660465, 1617174, 1466275, 1434513, 1475171, 1694041, 1477604, 1442382, 1420903, 1655527, 1669150, 1530099, 1607351, 1923801, 1597114, 1970156, 1778429, 1813490, 1988758, 1707862, 2018992, 1764698, 1802531, 2097493, 1952369, 2035370]
16906B035370k04002l60699L27815k58127N26249l64369L04918p8913j4628K41789
16896B155403M0592m8993j40128J75440o4727L13186j56839P3308j19891j32136
16886B095215M20996j58176j09271o9395L91561m11179N15970q465j80490M14549
16876B901315m5776o2565r8497J06502O7297M4908K4896p2609n0566m9399O2981
16865B828487O076M06421l44818L45502M7784K12919l5607O9019L1843P372L6038
16854C611036J15968j85721L1038J85199R5367j2521J13592J46927k8342k4555
16844D047988P6392K80328l01100M26797q532k6056J18666N6708k3609J59568
16834D807150Q2848L58218p2284K89591J16914k76168O27206n30390K88697K06955
$$ y = [2035370, 1831368, 1470669, 1798484, 1540357, 2066606, 1702237, 2007155, 1928242, 1913614, 2155403, 2195995, 2147002, 2006874, 2182314, 2117587, 2430773, 2273934, 2347242, 2227351, 2095215, 2516211, 2358035, 2248764, 2179369, 2570930, 2159751, 2675721, 2667256, 2486766, 2901315, 2855539, 2792974, 2694477, 2800979, 2868276, 2913184, 2938080, 2865471, 2814905, 2765506, 2828487, 2834563, 3240984, 2896166, 3241668, 3289452, 3502371, 3466764, 3535783, 3567626, 3574998, 3611036, 3727004, 3541283, 3572321, 3757520, 3852887, 3840366, 3953958, 4100885, 4072543, 4047988, 4124380, 4404708, 4103608, 4530405, 4521873, 4495817, 4614483, 4671191, 4647582, 4807150, 4889998, 5248216, 5175932, 5465523, 5582437, 5306269, 5933475, 5403085, 5691782, 5898737]
16824E898737M0740J93603J50914J59612L3043K22319L85398k32725L14702J42782
16814G309125M3595O0242J82325P0006N93126j31547K70341R1486J02848J10037
16804H701584K61411M28080j45215N59600L72069L07603M8336L83970M47099J07348
16794A1471885L10590J76255J79721N73761R2234K29325P10276M12824j83958
16785A3972913R33938M22772N62345J23552O85193L21018P48439L21590N94488
16776A8686248M98138P49686P57503Q46635L71811J038014N16377J007747Q46738
16767B5318897Q16635J075854J084402J453107R77653J147635J737256P40053
16759C4351492J751097J475464J753771J414090J600674J881841K166505J810342
$$ y = [5898737, 5939477, 6133080, 6283994, 6443606, 6476649, 6698968, 7084366, 6851641, 7166343, 7309125, 7352720, 7412962, 7595287, 7665293, 8258419, 8126872, 8397213, 8488699, 8591547, 8701584, 8962995, 9391075, 9245860, 9805460, 10177529, 10485132, 10533468, 10917438, 11364537, 11471885, 11782475, 11958730, 12138451, 12712212, 12804446, 13033771, 13744047, 14156871, 13972913, 14906851, 15329623, 15891968, 16015520, 16700713, 17021731, 17770170, 18091760, 18686248, 19184386, 19934072, 20691575, 21538210, 21910021, 22948035, 23464412, 24472159, 25318897, 26135532, 27211386, 28295788, 29748895, 30726548, 31874183, 33611439, 34351492, 36102589, 37578053, 39331824, 40745914, 42346588, 44228429, 46394934, 48205276]
16751D8205276K744592K136489K827122K726287K782683K956381L648696L358848
16743G1386374L573375L793169M161728M714691M089278M972001M637421N417951
16735A06745988N478136N402557N850356N748553N550655N884990N218719N259647
16727A51139601M736184M225447L826524L092332K005131J761879K89305k96335
16719A70780068j393284k021639l198000l233823m418156n086699n019100n308893
16711A41100474n656234n898933n845954n764518n913641n477615n332113n267319
16703I5944147n278399m337500m368276m193076m522994l705966l183344l339730
16695F3014862l295123l142504k588028k523215k256866k330427k288368k355715
$$ y = [48205276, 50949868, 53086357, 55913479, 58639766, 61422449, 64378830, 68027526, 71386374, 74959749, 78752918, 82914646, 87629337, 91718615, 96690616, 101328037, 106745988, 112224124, 117626681, 123477037, 129225590, 134776245, 140661235, 145879954, 151139601, 155875785, 160101232, 163927756, 167020088, 169025219, 170787098, 171076403, 170780068, 169386784, 167365145, 164167145, 160933322, 156515166, 151428467, 146409367, 141100474, 135444240, 129545307, 123699353, 117934835, 112021194, 106543579, 101211466, 95944147, 90665748, 86328248, 81959972, 77766896, 73243902, 69537936, 66354592, 63014862, 59719739, 56577235, 53989207, 51465992, 49209126, 46878699, 44590331, 42234616]
16687D2234616j775774j708414j587320j537880j788501j379326j316154q89658
16679C0251589j312169j056498j057204j225055r13938o80168j325745r75258
16671B1705554m20267o19711o15607q13093p13105l53265j012685o25031j65721
16662A6367069l47850p71238m59006r9360o80835n98956r6624k79005n97052j57003
16652A2280140l81777n15481j21541r0489l06861o91723j80683k16096j4375m68917
16642I292197o4428N2657n88589n8152j80857r7617j45191o99286L76912p46756
16632G140890J09842J51329k34858k74820j55892k56989J479L5001n03913J86955
16622F199024l54849l52552K10272j26566k91613L4997L0474m61499m7829J91143
$$ y = [42234616, 40458842, 38750428, 37163108, 35625228, 33836727, 32457401, 31141247, 30251589, 28939420, 27882922, 26825718, 25600663, 24686725, 24006557, 22680812, 21705554, 21285287, 20665576, 20049969, 19236876, 18523771, 18170506, 17157821, 16532790, 16367069, 16019219, 15247981, 14788975, 14689615, 14008780, 13409824, 13313200, 13034195, 12437143, 12280140, 11898363, 11382882, 11261341, 11170852, 10863991, 10172268, 9991585, 9775489, 9761114, 9292197, 9227769, 9280426, 8691837, 8633685, 8452828, 8355211, 8210020, 7510734, 7887646, 7140890, 7250732, 7402061, 7167203, 6892383, 6736491, 6479502, 6480981, 6515982, 6012069, 6199024, 5844175, 5491623, 5701895, 5575329, 5283716, 5318713, 5349187, 4887688, 4839859, 5031002]
16612E031002j84495K96008m50379m1443q7959l03283Q3536j92729j41549R4057
16602D102766J02988k90037l4595m5644m7835P3349k7101j96268k1006K4971j18810
16591C522778l42287M46752l80492O2799k2230o3837q7972q7869O3235m56042
16581B654835K04055M8547j39916M80209l28485k36532l4348r0086J1106K11039
16571B780424j29246n8991k33276K83452j19135l21826L32260j75339J2394j7853
16561B352864l85057K33796L0622L39163l47920k49357j13109R6159K25272l06586
16551A875847J69106n5087j99276k2521O17593j84950o579k69041k73624Q5712
16541A737180o147l05571N13044j16375m06303O2420J45092K14176J58438l76370
$$ y = [5031002, 4846507, 5142515, 4692136, 4650693, 4562734, 4259451, 4342987, 4150258, 4008709, 4102766, 4205754, 3915717, 3881122, 3835478, 3787643, 3860992, 3833891, 3637623, 3616617, 3641588, 3522778, 3180491, 3627243, 3246751, 3309550, 3287320, 3223483, 3135511, 3047642, 3110877, 2654835, 2858890, 2907437, 2767521, 3247730, 2919245, 2682713, 2648365, 2558279, 2569385, 2780424, 2651178, 2592187, 2358911, 2642363, 2523228, 2201402, 2533662, 2358323, 2370717, 2352864, 1967807, 2201603, 2232225, 2571388, 2223468, 1974111, 1861002, 1957161, 2182433, 1875847, 2044953, 1989866, 1790590, 1768069, 2385662, 2200712, 2194133, 1925092, 1651468, 1737180, 1731033, 1425462, 1938506, 1822131, 1415828, 1478248, 1623340, 1837516, 1995954, 1619584]
16531A619584M8007N8548L14907j97104j01316k03907K02901j70115K410j17418
16521A456497k52568Q4331K62752j8323l6958n8571k35591N0256J45344o0518
16511A336651J76033l20579L10974R7039j90335o494k41467M16410o4181n60083
16501I53968j22673N19698k2888k88950r459J72053q4206K07071j65865Q7876
16491A246625j9242l06013o4126K43229K05202k98306j10856j41912K3960L89724
16481A168285k08882R387J89143j07803j23673L56688j80200l03337l9124J64845
16471I25329q5225J55892C03774O86245K33592m65601M72555E75282M25829J16696
16461A117807j14719j27342j65976J84656R2593J36510j92759k86218r5899J77961
$$ y = [1619584, 1667591, 1726139, 2041046, 1843942, 1742626, 1538719, 1741620, 1571505, 1573915, 1456497, 1203929, 1288260, 1551012, 1532689, 1495731, 1437160, 1201569, 1251825, 1397169, 1336651, 1512684, 1192105, 1503079, 1600118, 1409783, 1403289, 1161822, 1578232, 1514051, 953968, 831295, 1350993, 1328105, 1039155, 1029696, 1201749, 1117543, 1324614, 1158749, 1246625, 1227383, 921370, 857244, 1100473, 1305675, 1007369, 896513, 754601, 778561, 1168285, 959403, 968790, 1157933, 1050130, 926457, 1283145, 1102945, 799608, 760484, 925329, 840104, 995996, 303774, 990019, 1223611, 758010, 1230565, 575282, 1001111, 1117807, 1003088, 875746, 709770, 894426, 987019, 1123529, 930770, 644552, 548653, 726614]
16451G26614K21289l8195p3779j81103J8904J59780k41897K35696k94585L24526
16441H57250m11998K09177J28226K6365k82911J93695Q1157j58704K39534l31400
16431E50391O9142J36373o2360m9085R1717k63475J94407N5534J62199k41922
16421F42921O9400k1560k33759L21489k69860L48935J41220l87639B51017L94135
16411F45152K19010l54054j52579l8427M04966R0744m00581K59009R9982k73008
16401E00214K23887k57903K20399k73260L15066O2713j12861r9843Q6695j22247
16391E42860L05603j65655k04197k1542L64039l25722K22279p3356k38930K73239
16381F78618l35561J29830J62893B87886O73379l91315j30423j40151K17058J46963
$$ y = [726614, 947903, 909708, 835929, 654826, 673730, 833510, 591613, 827309, 532724, 857250, 445252, 654429, 782655, 809020, 526109, 719804, 800961, 642257, 881791, 550391, 619533, 755906, 693546, 644461, 736178, 472703, 667110, 722644, 884843, 642921, 712321, 690761, 457002, 778491, 508631, 857566, 998786, 611147, 251017, 645152, 864162, 510108, 357529, 319102, 724068, 814812, 414231, 673240, 773222, 500214, 724101, 466198, 686597, 413337, 728403, 791116, 678255, 578412, 665107, 542860, 848463, 682808, 478611, 457069, 821108, 495386, 717665, 644309, 405379, 678618, 343057, 472887, 635780, 287886, 961265, 569950, 439527, 299376, 516434, 663397]
16371F63397k58581P0314J73356j81108j2467j24541L03397B42772J23781l5190
16361C31363J90338J83764K06841j98376k53121J00314N8280J6104j13363O4803
16351E86947l6036j59164p9064j5958J74949L17509l48592G4120K61721m0073
16341B95768K90869j87339j08983n8576J32304e2877B90767K49202k29858j16977
16331A93134K44918j60278J46982p5695o0258R0622J94349j60623j80980n8245
16321A73926J93036L6547J19261A33967R5774K95184j54723N2176j4490m2899
16311C64989J89775j95549J32239B26511j11883J94027J81450m5575K7012k02267
16301B69275J38819l9664l8360J49912M2605k08839K04101j2033j16484K03036
$$ y = [663397, 404816, 475130, 648486, 467378, 454911, 330370, 633767, 242772, 366553, 331363, 521701, 705465, 912306, 713930, 460809, 561123, 619403, 635507, 522144, 586947, 550911, 391747, 312683, 296725, 471674, 789183, 440591, 74120, 335841, 295768, 586637, 399298, 290315, 231739, 364043, -52877, 290767, 539969, 310111, 193134, 438052, 277774, 424756, 349061, 288803, 379425, 573774, 413151, 232171, 173926, 366962, 403509, 522770, 133967, 229741, 524925, 370202, 422378, 407888, 364989, 554764, 359215, 491454, 226511, 114628, 308655, 490105, 444530, 471542, 269275, 408094, 368430, 330070, 479982, 522587, 313748, 517849, 505816, 389332, 592368]
16291E92368k44900r902j62046K51629o8906J96384b9859I5951L75909m2449A80932
16279d1982D52527B5256N86786l01074o5167k2035M86930A52271M89185j86007
16269D55449i3333B76852J02078A81719K04387A77356J40818O4630j08237j30563
16259A44004K61502P6024p3117o9994A6229K74771i1591B26618J70208A6850J89492
16248B06342a32225G1365J73964j01468L4156R4559l3812L9135I6518Q0455n9675
16237A17298L08834B359K14622J26698I5255O9622O0582L30597F3380L99279a01
16225B07686L20933A76339K7728M376J79829j68141G8673e8590m02B41956J06521
16214C48477L994j27461D3363L47409g1833C20689M6480A16727a24569H2089L01825
$$ y = [592368, 347468, 337566, 175520, 427149, 358243, 554627, -29859, 95951, 471860, 429411, 180932, -41982, 452527, 25256, 612042, 310968, 245801, 223766, 710696, 152271, 641456, 455449, -93333, 276852, 378930, 181719, 386106, 177356, 318174, 382804, 274567, 144004, 405506, 481530, 408413, 338419, 16229, 291000, -91591, 226618, 396826, 16850, 206342, -132225, 71365, 245329, 143861, 178017, 272576, 238764, 277899, 96518, 176973, 117298, 426132, 2359, 216981, 343679, 95255, 164877, 225459, 556056, 63380, 462659, -101, 207686, 528619, 176339, 204067, 208443, 388272, 220131, 78673, -58590, -58992, 241956, 348477, 352471, 225010, 43363, 390772, -71833, 320689, 367169, 116727, -124569, 82089, 383914]
16203C83914A2008J35356J89982A00732i7737H1148a22115B68878A31214K13864
16193C45078p6063J68221c0933A89102M6379N3330J49724j01197F1755O2315N2409
16182A76479m6118q300K01869c7921A42925O9864o2732a09447A16719c6648C31718
16170a51973I3137J63302I2721J47261C5462K70938H3826N7638G818J05182J86688
16159B99688p0703I9448J79595p0185H6130M3047P2517J39356K32540a34792A18872
16147e3045B48214j15912k6409a27194D95368j54533I4973j7295b01984A27552
16136a05056h527B40437b04495C09999A48951L8451A284c54706i7666O6l881H9314
16123A04140B6457K34924F5319J31305n2756E6081J59320E1685m144K88993h3415
$$ y = [383914, 12008, 147364, 337346, 100732, -97737, 81148, -122115, 268878, 131214, 345078, 269015, 437236, -30933, 189102, 235481, 288811, 438535, 337338, 61755, 124070, 176479, 130361, 122061, 323930, -37921, 142925, 212789, 150057, -109447, 116719, -36648, 331718, -151973, 93137, 256439, 92721, 239982, 35462, 306400, 83826, 141464, 7818, 113000, 299688, 228985, 99448, 279043, 208858, 86130, 129177, 201694, 341050, 573590, -134792, 118872, -53045, 248214, 132302, 105893, -127194, 495368, 340835, 94973, 77678, -201984, 127552, -105056, -8527, 240437, -204495, 309999, 148951, 187402, 1284, -354706, -97666, -97600, -101481, 89314, 104140, 26457, 261381, 65319, 196624, 143868, 56081, 215401, 51685, 47541, 336534, -83415]
16111E01293a64691b8368n7321A67329J42230H5471l3601K37292l7262a69276
16100A49401j7397E4262f538A7390M1911A5977M3046J57204l5016o1983Q1473
16089B00701a45031B0410a55286B29084H6887k1030a55173b9698j64519B46455
16078A6499a87873A56032c4125A77342J58797A48419a60417A61594J87915b9405
16067b4634j39868F4332Q8538J09995g4421j44045B23085r5634K52491j80108
16057A99834b6414k07120A2167K19690g1340o4500j6406A52171h600B17293o1798
16046A55495e5630J9421j02766B9747K1627a58256P3827E1613a2183A264J7918
16035A9182a01082J6662D68507d32741g6109p7945M9520E2769m866M8795j6827
$$ y = [501293, -164691, -28368, -85689, 167329, 309559, 85471, 51870, 289162, 251900, -169276, 149401, 132004, 54262, -6538, 17390, 59301, 15977, 59023, 216227, 181211, 119228, 200701, -145031, 20410, -155286, 229084, 86887, 65857, -155173, -29698, -194217, 246455, 16499, -187873, 156032, -34125, 177342, 336139, 148419, -160417, 161594, 349509, -29405, -24634, -164502, 64332, 152870, 262865, -74421, -218466, 223085, 127451, 379942, 199834, -26414, -233534, 12167, 231857, -71340, -135840, -152246, 152171, -8600, 217293, 155495, -55630, -36209, -138975, 29747, 51374, -158256, -84429, 51613, -12183, 1264, 19182, -101082, -84420, 468507, -432741, -76109, -154054, -104534, 52769, 47903, 96698, 79871]
16024G9871K5567a86571P2094j66197k4353A82689O9829a1892A65614a02181A38668
16012i4955B29266A6547P2297J67616A10783d7311r3573A16967a74841j6991d7576
16000C5315b91343b0054l9876j33646j846l1696B74106j10038A1561c37455e9875
15988a64009B32462b02085d9962A31280A6852O0134K22734K7714J31956B6518
15977H4513a94798A6665a41409O6374m2667c3709o3472A07156h0811G294i4608
15965E5049E171c6379B78373B2766a20459B38275I9669L5431l9634b96817A47130
15953A44002E6496J01082a75373d204j70936b6890A42686o2570e6877l7793K5081
15942f9589C7991g9965a7149o2849j1726C156J00924a36607D9055b88192D2279
$$ y = [79871, 105438, -186571, -114477, -280674, -305027, 182689, 252518, -11892, 165614, -102181, 138668, -94955, 229266, 16547, 88844, 256460, 110783, -47311, -140884, 116967, -174841, -191832, -47576, 35315, -291343, -20054, -59930, -193576, -195422, -227118, 274106, 164068, 11561, -337455, -59875, -164009, 232462, -202085, -49962, 131280, 16852, 76986, 299720, 327434, 459390, 26518, 84513, -194798, 16665, -141409, -75035, -117702, -33709, -97181, 107156, -80811, 7294, -94608, 55049, 5171, -36379, 278373, 22766, -120459, 238275, 99669, 135100, 95466, -296817, 147130, 144002, 56496, 157578, -175373, -4204, -175140, -26890, 142686, 80116, -56877, -94670, -69589, 37991, -79965, -17149, -79998, -91724, 3156, 104080, -136607, 49055, -288192, 42279]
15930b60106A29936a4011H2014b05397J3849R2294j50468h1914r8235A05648O9579
15919A75227a29797q1294h2733m7300p9296L5237k6285H1011a95996n0476r7718
15908c44190A80798C1915R8700L6582a21204B9048b26544A29601a79736C0459
15897A33571F1261c7239C23299c2355k19673C05896b99627P2816i9351g575q8007
15886i5582H1460b57096b0307E0066J6515a38455A83960d3989k98404e8421l084
15875f1505D6277a10404B3976J26717a13452A80430J230b54307A42082a97169
15864A79359F8780a20087b8882P348k71912B2816a12822K5961A29440c4519B35565
15852H2614a72679E7974K0807J64436a65717d2706J6754l49176A08855Q9676a62765
$$ y = [-260106, 129936, -14011, 82014, -205397, -191548, -99254, -249722, -81914, -180149, 105648, 175227, -129797, -211091, -82733, -130033, -209329, -174092, -200377, 81011, -195996, -246472, -344190, 180798, 31915, 130615, 167197, -121204, 29048, -226544, 129601, -179736, 30459, 133571, 61261, -37239, 323299, -32355, -252028, 305896, -299627, -226811, -99351, -7575, -95582, 81460, -257096, -20307, 50066, 66581, -138455, 183960, -43989, -342393, -58421, -61505, 46277, -110404, 23976, 150693, -113452, 180430, 181660, -254307, 142082, -197169, 179359, 68780, -120087, -28882, -21534, -293446, 22816, -112822, -86861, 129440, -34519, 235565, 82614, -172679, 57974, 78781, 243217, -165717, -42706, -25952, -375128, 108855, 198531, -162765]
15840f074k12124a1421A10797c69701A06171e3095j18484A65921a76478A08548
15829a17901k88162E8617d1553m47511A00992P4087F8138J11921c09297a09917
15818b6921j17455p9927A87772O3948c43826a27128j73547d1167C1812P4879d2236
15806B68285c00091I3573c73461E9753N1427P8657j2559c66945H1710B7975L14467
15795C42442A13759n2099A5672c24791H1195i2644j51529D04400c91376A09305
15784d44719A02143d50822A51167J83856a75995L3958n3131c4401k66899k45593
15774e46893E9322J18051c4738k74119k6527a44467G6724O3905G172l391b6858
15762b5033j29337A40640a27483a0074A67984J2150i2470j42323E4893K14040
$$ y = [-6074, -218198, -11421, 110797, -369701, 106171, -53095, -171579, 165921, -176478, 108548, -117901, -406063, 58617, -41553, -489064, 100992, 175079, 68138, 180059, -309297, -109917, -26921, -144376, -224303, 187772, 251720, -343826, -127128, -300675, -41167, 31812, 106691, -42236, 268285, -300091, 93573, -373461, 59753, 111180, 189837, 177278, -366945, 81710, 27975, 342442, 113759, 61660, 15672, -324791, 81195, -92644, -244173, 404400, -391376, 109305, -444719, 102143, -450822, 151167, 335023, -175995, -142037, -195168, -34401, -301300, -546893, 59322, 177373, -34738, -308857, -335384, -144467, 76724, 140629, 7172, 3781, -26858, -25033, -154370, 140640, -127483, -10074, 167984, 180134, -92470, -234793, 54893, 268933]
15752B68933j29634J31624k2527E264g6243A83107l6862L5950a79653d1721D7199
15740A23950c8202B86217b0691m7867B3865K25646c80798h242A22602N3304K0178
15729A96084r1327J11269a55958G2730b51807l32217b88919d0980D59129e0836
15718c44505B17890i6506L9205G9513l6725a60004O1460k74911B07176m5506b85013
15706i2885b1486p0922p9736C21b62310K4370O8293A8931J44630D9520N0597n921
15694I4196e6328b2653A45377a73571N834C189f7259j401j45983j12120A55081
15682a0782G9028K53902d9139o1002B42114I3364a55517A46701f7203j7780B0680
15670a26299J8518G933b63658J7679B3236b93452J32962g9967A02888k619J9623
$$ y = [268933, 139299, 270923, 248396, 5264, -76243, 183107, 146245, 182195, -179653, -41721, 47199, 123950, -38202, 286217, -20691, -68558, 23865, 249511, -380798, -8242, 122602, 175906, 196084, 104757, 216026, -155958, 72730, -251807, -584024, -288919, -40980, 459129, -50836, -344505, 217890, -96506, -57301, 79513, 42788, -160004, -98544, -373455, 207176, 161670, -285013, -92885, -21486, -92408, -172144, 321, -262310, -237940, -169647, 18931, 163561, 49520, 100117, 94196, -56328, -22653, 145377, -173571, -167737, 3189, -67259, -68660, -214643, -326763, 155081, -10782, 79028, 332930, -49139, -110141, 242114, 93364, -155517, 146701, -67203, -84983, 20680, -126299, -107781, 7933, -263658, -245979, 23236, -293452, -160490, -79967, 102888, 100269, 119892]
15659A19892C1952i657j01902r3593g5373A99405h2220H164b06107g7563C7150
15647B67246e5401j12706g0155A42083c9436A1599J30914f6788p7936A88942a42548
15635b8199j36986k33501A97012j950a20290j32035a13999H9154M290l2494H735
15623H1994l6647d7402r6799H6242d6989A28241c03311c3848q1051D7271b59462
15611a2321B24160a38530A88429a62092A08561e4376k64655D4742c10775D3037
15600a91863A48414c49897A84425D263b2610A74629J8534J28673a61159P2638
15590h8521L9899B9484a48991L6146B44123A12915a84558e3062D03893E1854N2858
15579A04712i660m6118j10397g3778F3371a0754r2145j59599h8991A6538L8232
$$ y = [119892, 31952, -9657, -111559, -205152, -75373, 199405, -82220, 8164, -206107, -77563, 37150, 267246, -55401, -168107, -70155, 142083, -39436, 11599, 142513, -66788, -144724, 188942, -142548, -28199, -165185, -398686, 197012, 195062, -120290, -252325, -113999, 89154, 93444, 60950, 8735, 81994, 45347, -47402, -144201, 86242, -46989, 128241, -303311, -33848, -114899, 47271, -259462, -12321, 224160, -138530, 188429, -162092, 108561, -54376, -319031, 44742, -310775, 43037, -191863, 148414, -349897, 184425, 4263, -22610, 174629, 193163, 321836, -161159, -88521, -48622, 29484, -148991, -112845, 244123, 112915, -184558, -53062, 403893, 51854, 104712, -9660, -55778, -166175, -73778, 63371, -10754, -102899, -262498, -88991, 16538, 54770]
15568E4770K71456c36784b1494G1064g3928j60392o100A31077K23580f3792n2570
15557a16362j9630d0788j71031A08918a91817j92373A348e1757j55211d527l44990
15546c49517A98654e1216q7617H5364J48069A1671J10387j210E3736b04326k79786
15535d84112D928b33494i9073A58L7176j3858n031Q3619a47489k601m437k5026
15523a79553e2186E56d3180o0576g849B05368a07703j68598a15864k9665l0562
15512a76091m0068D0686J01893i0118l1741F5423b24888A4177a72157C62437a0105
15500B67397j10615A342K2217J12033C6670a26267k54479A583J322O2335B7893
15488a57229B52933i6402j50210A11964c14093a11039D34375b03998k9872A6113
$$ y = [54770, 326226, -336784, -21494, 71064, -73928, -234320, -240420, 131077, 354657, -63792, -116362, -135992, -40788, -211819, 108918, -191817, -384190, 1348, -51757, -206968, -4527, -349517, 198654, -51216, -138833, 85364, 233433, 11671, 122058, 120848, 53736, -204326, -484112, 4928, -233494, -99073, 158, 37334, 23476, 18445, 102064, -147489, -150090, -154527, -179553, -52186, 556, -43180, -103756, -7849, 205368, -107703, -276301, -115864, -145529, -176091, -216159, 40686, 142579, -90118, -121859, 65423, -224888, 14177, -172157, 362437, -10105, 267397, 156782, 1342, 23559, 135592, 36670, -126267, -380746, 1583, 2905, 65240, 27893, -157229, 252933, -96402, -246612, 111964, -314093, -111039, 434375, -203998, -233870, 16113]
15477h9598c0219j26247B15491a43956p1274C755a79556G7208b15193F2969d7769
15465E4447K11578D8825b880j48790A57595R7079e0356D7387O50a28987C38169
15453D4936P9147c9973A77176H1673l0517f2870r2785O4248E8380a93401d8771
15441C18671A960L4578L1859d9633B02480q1027b68479B9807J38250b43323A71381
15429B7917i9283q3899A63604o5112j4370h0830m218j33249R9025B07635a12661
15417c22012C23271A09200c9486j95742I472P5240f4023F1956N5665M7468l6925
15406A28164b20931a05721n5650L499L4427o4998a5797o4608j86347O7856g0436
15394B54604b55655i8000F5868K560B7472j3066m475d3613K037j47974L977B19293
$$ y = [-89598, -30219, -156466, 215491, -143956, -215230, 3755, -179556, 77208, -215193, 62969, -47769, 54447, 266025, 48825, -2880, -151670, 157595, 254674, -50356, 47387, 48037, -128987, 338169, 44936, 124083, -39973, 177176, 81673, 51156, -62870, -155655, -91407, 58380, -193401, -48771, 318671, 1960, 36538, 68397, -49633, 202480, 121453, -268479, 29807, 168057, -243323, 171381, 27917, -99283, -183182, 163604, 98492, 84122, -80830, -85048, -218297, -119272, 207635, -112661, -322012, 323271, 109200, -39486, -235228, 9472, 84712, -64023, 61956, 117621, 165089, 128164, -220931, -105721, -161371, -157872, -123445, -188443, -15797, -80405, -266752, -198896, -70436, 254604, -255655, -98000, 65868, 68428, 27472, 14406, 9931, -43613, -41576, -189550, -185573, 219293]
15381E309L76071b59475a09763B9410J55014i941C2709J27298p9178k7748a18563
15369i7822E0257a35094R025j07732h0249A31086n9254K03577A28592a16114K3449
15358i2665C2129e9857j03344A26824b27412d3070G0473a24240j24987b951A49790
15346a68616A71038a39350a6842r7816j16641B9451a11059A43572k8630h3737
15335b22170C36694g7328j04672A89195a60372B02229I0586a34580p7438A61891
15324a14354J0518l2203b4945H2668P8065B0348L27172R757B5562a59607D33181
15312b1659A93683n5062g5397A35704a47522A84870a03163r755I8446h2005A41015
15300d1569j97240M4776o4002H2891R6056F291a47069A57433i7094A08087L38637
$$ y = [5309, 381380, -259475, -109763, 29410, 184424, -9941, 32709, 160007, 80829, 53081, -118563, -97822, 50257, -135094, -126069, -233801, -80249, 131086, 71832, 275409, 128592, -116114, -92665, 32129, -59857, -163201, 126824, -227412, -43070, 70473, -124240, -249227, -2951, 149790, -168616, 171038, -139350, -16842, -114658, -231299, 29451, -111059, 143572, 114942, -83737, -222170, 336694, -77328, -182000, 189195, -160372, 202229, 90586, -134580, -212018, 161891, -114354, -103836, -136039, -24945, 82668, 160733, 20348, 347520, 357277, 25562, -159607, 433181, -21659, 193683, 138621, -75397, 135704, -147522, 184870, -103163, -112918, 98446, -82005, 141015, -41569, -238809, -194033, -258035, 82891, 178947, 6291, -147069, 157433, -97094, 108087, 446724]
15289D46724A35588g7281A58637a64216F7194j2082d2299k44241J26718A7591
15278D15727e8681q610j94134B11171E9853b45168A51432P8261a00028F1840R8728
15267A60568a1030B8457J12328J35177D577J40070e1082E9499J32819d2224m8919
15256i1143B10704O7864a04924E4957N7557k959K53371j9097q9467q1931o5576
15245A06855K10359D4242J20030b30694G4501B2093i1431A12482a99175A68751
15234F7494a18745C00378I1346J31514A08948c466A00287a06983D7514N8283K96721
15223D02518b29006F9064J85134b65933A33980a08058H3593d68724B24128H9887
15212c64456G1339a9299A9833K08620j07481o681o215l1187M0558K15169i3609
$$ y = [446724, 135588, -77281, 158637, -164216, 67194, 55112, -42299, -286540, -159822, 17591, 415727, -58681, -67291, -261425, 211171, 59853, -245168, 151432, 229693, -100028, 61840, 160568, -11030, 28457, 140785, 275962, 4577, 144647, -51082, 59499, 192318, -42224, -91143, 210704, 278568, -104924, 54957, 112514, 109555, 362926, 343829, 254362, 172431, 106855, 317214, 44242, 164272, -230694, 74501, 22093, -91431, 112482, -199175, 168751, 67494, -118745, 300378, 91346, 222860, 108948, -3466, 100287, -106983, 47514, 105797, 402518, -229006, 69064, 254198, -265933, 133980, -108058, 83593, -468724, 224128, 89887, -364456, 71339, -19299, 19833, 228453, 120972, 114291, 108076, 76889, 117447, 332616, -93609]
15200C0028L1241c4395B32820f2003A02028a87911C22185a23831A72421b6310
15189D206a081B90383a33337A59005f398n2780B01683c3681C06670a08407l2932
15178a41339A45183A6283K55969f4891k0770k072c1952A70593L3174a07835C02198
15166E65680h8156D09154G070J30734k5517a35854A66731b18133H5756J12126
15156A97882E5777a74k15318F2447L3156J44493m1595J60373a39516D5824a6018
15144b9143B39405K8676D4893a13653C9729a2725n0073A49725J7454J23762A05122
15132a1457B26430m6240q4039d9206A17293a30836K4393C30361a93593e0507A73393
15120a39414B44516C366e8422l464C2460m766p43K91015j4512B6826C26J28599
$$ y = [30028, 61269, -34395, 232820, -62003, 102028, -187911, 322185, -123831, 172421, -26310, 4206, -1081, 290383, -133337, 159005, -6398, -59178, 201683, -33681, 306670, -108407, -141339, 145183, 16283, 272252, -64891, -85661, -87733, -31952, 170593, 203767, -107835, 302198, 565680, -88156, 409154, 7070, 137804, 112287, -135854, 166731, -218133, 85756, 197882, 55777, -174, -215492, 62447, 95603, 240096, 198501, 358874, -139516, 45824, -16018, -29143, 239405, 268081, 44893, -113653, 39729, -12725, -62798, 149725, 167179, 290941, 105122, -11457, 226430, 180190, 96151, -49206, 117293, -130836, -106443, 330361, -193593, -50507, 173393, -139414, 244516, 3366, -58422, -61886, 32460, 27694, 26951, 317966, 303454, 26826, 326, 128925]
15108A28925B650g562m1938q7167C51023A35910E5745P3161J93481K9633a9962
15096C12348C5054K86671A59779m4122J52925K2121D6708J29510J43881r6097
15086B24002P5907H2014a20872B1426a10108C04296E4317N72848B37431F651J05994
15075A12645L232a9967l6072m3572C4180K29353k5560o9332k7068J38094r6607
15064A83060M8098G8492k8610a8468E7827k3723M80468D4286e513r78j56920B78547
15051C41285K1865A24677a508A49197P7283j08589K7117L6950L9133N8687A22767
15039f432B27179Q4663j7608f2653b5019C2673M05530A33501M2100Q1489j12445
15028A44645K25376L579j05592I8974J46398j04713Q3213a78307I6998J39485
$$ y = [128925, 2650, -7562, -49500, -136667, 351023, 135910, 55745, 128906, 322387, 352020, -19962, 312348, 35054, 321725, 159779, 115657, 268582, 290703, 46708, 176218, 320099, 224002, 299909, 82014, -120872, 21426, -110108, 304296, 54317, 627165, 237431, 6651, 112645, 115877, -19967, -56039, -99611, 34180, 263533, 237973, 168641, 141573, 279667, 183060, 231158, 78492, 49882, -18468, 57827, 34104, 514572, 44286, -5513, -6491, -163411, 278547, 341285, 363150, 124677, -1508, 149197, 226480, 117891, 145008, 181958, 221091, 279778, 122767, -6432, 227179, 311842, 294234, -62653, -25019, 32673, 438203, 133501, 175601, 257090, 144645, 370021, 373600, 268008, 98974, 245372, 140659, 223872, -178307, 96998, 236483]
15018B36483J6509F230K60411J03769q2941e2120D81356j80910a2220B36103L8226
15007B74329j31506a880A16465B578L91243A69033J42182j02608Q582N4042c2700
14995G9725J25954h6128C68617A75471F5145L06921K93508A65757O2601j06982
14985A21376K39724k3056j23462F7450J13804L66182C520N77471A07390L48258
14975D55648C022M59964j35359M346F1843J90894J19815N3553E8293K09403E207
14963D5846b4516B83359o2601R0080Q1733j86380L3641K6701l8457n0271J40930
14952C18735p4685J29017I4868K82952j34221a8152H1993K49560A19023M67494
14942E86517A15126K43380k4817o3262P6138L32974B02936p0754J26489r3817
$$ y = [236483, 252992, 6230, 266641, 370410, 287469, -52120, 481356, 300446, -12220, 236103, 274329, 142823, -1880, 116465, 2578, 393821, 169033, 311215, 208607, 217189, 271231, -32700, 79725, 205679, -86128, 368617, 175471, 65145, 372066, 665574, 165757, 228358, 121376, 361100, 338044, 214582, 67450, 181254, 547436, 3520, 580991, 107390, 455648, 3022, 462986, 327627, 331973, 61843, 252737, 372552, 426105, 58293, 267696, 5207, 45846, -24516, 283359, 220758, 310838, 392571, 206191, 239832, 266533, 228076, 177805, 318735, 244050, 373067, 94868, 377820, 243599, -18152, 81993, 331553, 119023, 586517, 115126, 358506, 333689, 270427, 346565, 679539, 202936, 132182, 258671, 164854]
14932A64854q1199P6614L1056J78983H7162c4129C97357j69357R4264C8601N00091
14921E38692A84719J90826m0967j18182R0508K52536B48521J27940r1246J6742
14911C01957A44805L12826j87269n2308J57735A09866M5829J21508D5914O39459
14901F85373C00260l8536J40352A99402R4874j14778J82506k3982j28398O0097
14891B69721J07648A00653J73877J0766K25378p4118r2354j68997L71740J16149
14881F63094k05125j58606J51487n665I2412K71015L24407j12961j91246K55375
14871F39002l09928J76474J9092k41939L68229j44426E693L87078K037L58863
14861G53671k95093A16124N5157C6116L30900j10382R6395A74265O49326B80605
$$ y = [164854, 83655, 160269, 191325, 370308, 87162, -34129, 397357, 228000, 322264, 38601, 538692, 184719, 375545, 334578, 216396, 306904, 559440, 248521, 376461, 285215, 301957, 144805, 457631, 270362, 218054, 375789, 109866, 155695, 277203, 45914, 685373, 300260, 261724, 402076, 199402, 294276, 179498, 362004, 338022, 209624, 269721, 377369, 100653, 274530, 285296, 510674, 436556, 344202, 175205, 546945, 663094, 457969, 299363, 450850, 445185, 92412, 363427, 687834, 574873, 383627, 639002, 329074, 505548, 524640, 282701, 650930, 506504, 5693, 392771, 394808, 753671, 458578, 116124, 171281, 36116, 367016, 256634, 353029, 174265, 823591, 280605]
14850D76507j30397P3755M15337l50414B27768B8735O98365A98235L19265r3307
14840D24193A97242L1720L01990J16051B40668K4187j30571M12657J07393B01252
14829E75171O4580j69843J7587J90651B81429J9616J49189K20086k22642Q018
14819D55696k16777K69862m5547N03104m75191k04296M15957q270j13712J83053
14809G63879B88171N2042L83008l10003J18371K27427l58508L24623C51177L90563
14799G41740k77094Q4697m3789O9631K10713l58751J76291J23758B67859L13793
14789E81652j30888J13461R778l4856K18510k16251j08501j70566M78632k12895
14779E28076M31259D37572J28627K49508j33558j72109n1353L16294k56206m4204
$$ y = [476507, 346110, 419865, 835202, 484788, 227768, 28735, 727100, 198235, 517500, 424193, 197242, 228962, 530952, 647003, 240668, 264855, 134284, 546941, 654334, 201252, 575171, 639751, 469908, 487495, 678146, 281429, 301045, 450234, 670320, 447678, 455696, 238919, 508781, 463234, 966338, 491147, 286851, 702808, 694538, 580826, 763879, 288171, 340213, 723221, 413218, 531589, 759016, 400508, 725131, 351177, 741740, 464646, 549343, 505554, 575185, 785898, 427147, 603438, 727196, 267859, 581652, 450764, 564225, 574003, 539147, 757657, 541406, 432905, 262339, 740971, 528076, 959335, 437572, 566199, 815707, 682149, 510040, 458687, 774981, 518775, 474571]
14769D74571j30742K34969J47596k06528J71543n2416R5032J26998l98202O6290
14759E29111L05262J6218j32467j96686K05285J08364j60461R8716L6311l29013
14749D80640M08799l81466O5512l217J21234P9952r0008j98818K62019J11602
14739H56249J72880j38430l15607J07620M30349p1421j72167o8389C87380M55165
14729H42545j0644l02421L7608K46146L5497k028L55429m88164J19719j72355
14719F61332j7227M47128k92052k6265K58807m22678J08682M16090p1646m37830
14709F24341j48638L34132J86869m6975m1466m2370j54465K21653o3625j37812
14699G31644L64976q4458J00783l97585j51122M30200k31375J17503j71470K55202
$$ y = [474571, 343829, 578798, 726394, 519866, 691409, 638993, 734025, 861023, 462821, 529111, 834373, 850591, 718124, 521438, 726723, 835087, 674626, 773342, 809653, 480640, 889439, 507973, 573485, 570268, 691502, 771454, 681446, 482628, 744647, 856249, 1029129, 890699, 575092, 682712, 1113061, 1041640, 869473, 801084, 387380, 842545, 831901, 529480, 567088, 813234, 848731, 846703, 1202132, 713968, 833687, 661332, 644105, 1091233, 799181, 772916, 1031723, 609045, 717727, 1133817, 1062171, 624341, 475703, 809835, 996704, 949729, 908263, 865893, 711428, 933081, 869456, 731644, 1096620, 1012162, 1112945, 715360, 564238, 994438, 763063, 880566, 709096, 964298]
14689I64298k821K16141k32019k24281L48070J94896k79860j78202J19028j48369
14679G76881K61342J76948l24068D29504N14557K67989j16806j02914J74845P844
14669A175019k36530K85385Q7874k4204k54478L02472j46107j29811J078L23716
14659A384414k87321K30961k57903k28110N84716m16322K14791J15361l41497
14650I99090J99096L34847l20051J57855M7321j86294K00088k36087k24012J21051
14640A092904M11785k71246j25857K85890m2168K9009J83800p3014l207k98656
14630A189240L66889j79751K51662q9372R8865j72364K43665N2595j6797m02684
14620A341948M13893j97488k07387P6889J6099l0198J14153P8767J37787m22174
$$ y = [964298, 961477, 1177618, 945599, 721318, 1069388, 1264284, 984424, 806222, 925250, 776881, 1038223, 1215171, 891103, 429504, 944061, 1212050, 1095244, 992330, 1167175, 1175019, 938489, 1223874, 1311748, 1287544, 1033066, 1335538, 1189431, 1059620, 1060698, 1384414, 1097093, 1328054, 1070151, 842041, 1426757, 1010435, 1225226, 1340587, 999090, 1198186, 1533033, 1212982, 1370837, 1418158, 1231864, 1431952, 1195865, 971853, 1092904, 1504689, 1233443, 1107586, 1393476, 1351308, 1380317, 1564117, 1491103, 1487896, 1189240, 1556129, 1376378, 1628040, 1538668, 1637533, 1465169, 1708834, 1761429, 1744632, 1341948, 1755841, 1558353, 1350966, 1427855, 1443954, 1413756, 1527909, 1606676, 1744463, 1322289]
14610A322289M69573k16455L4230j82272K98005k03401K66342j77678l00067K77453
14600A588019J63276K4809j36397K91689Q4670k49235N87641k28668l58811j25356
14590A641637K8579J87298L40545l22483M45597j43858k95277L72936j44834K52051
14580B362191k57715L50342m1112j39490p6427L52345k31702O4215r31j46431
14570B235285J46970J77102J05926L2982q7749o5801J33370q6736l0248K09142
14560B770243J86023J96233J60684j98152O29296J73058m7113L57417M02005J017663
14550E647357P19418K650365L575056Q769587J3072203j264157j2319175r352201
14542A1498453m988865k575343q14334n07000k07501K9849k38128O1024l7424
$$ y = [1322289, 1791862, 1575407, 1609637, 1427365, 1725370, 1521969, 1788311, 1610633, 1310566, 1588019, 1751295, 1776104, 1639707, 1931396, 2016066, 1766831, 2354472, 2125804, 1766993, 1641637, 1670216, 1857514, 2198059, 1875576, 2321173, 2177315, 1882038, 2254974, 2110140, 2362191, 2104476, 2454818, 2413706, 2274216, 2197789, 2550134, 2318432, 2382647, 2381716, 2235285, 2382255, 2559357, 2665283, 2698265, 2610516, 2544715, 2678085, 2591349, 2561101, 2770243, 2956266, 3152499, 3313183, 3115031, 3744327, 3917385, 3870272, 4227689, 4629694, 5647357, 6366775, 9017140, 12592196, 21361783, 34433986, 33169829, 20850654, 11498453, 6509588, 3934245, 3119911, 2612911, 2405410, 2435259, 2197131, 2258155, 2220731]
14533B220731l7380J85337J29107j60687J60680J25426J46734l11141R3751j53092
14523B399466M0376L43973M646l0997K3979R0791J0880j667j4965J35418j15025
14512B886875M95664Q7528p16219J16465L5520M49151l41491L57323j19494M3863
14502C295185J21153j75658K17669J79083k43208K47858j73119j92798K23578
14493C499743L84735j05267n7696N2675j2911J74293K23954k44623K25166n8879
14483D081190P7207K25393k2706k42045L47665p8064O2756k02120k7147K45121
14473D467250N0787M6888J8194J57905J65399o8890J37243n9365j1284J53825
14463E057952J68171J3654J57344p5442K88288k82127L5201O5005m0800P75660
$$ y = [2220731, 2183351, 2368688, 2497795, 2337108, 2497788, 2623214, 2769948, 2458807, 2552558, 2399466, 2439842, 2783815, 2788461, 2757464, 2781443, 2872234, 2883114, 2881447, 2866482, 3001900, 2886875, 3382539, 3470067, 2753848, 2870313, 2905833, 3354984, 3013493, 3370816, 3251322, 3295185, 3416338, 3240680, 3458349, 3637432, 3394224, 3642082, 3468963, 3276165, 3499743, 3884478, 3779211, 3721515, 3774190, 3761279, 3935572, 4159526, 3914903, 4140069, 4081190, 4158397, 4383790, 4361084, 4119039, 4466704, 4388640, 4451396, 4249276, 4222129, 4467250, 4518037, 4564925, 4583119, 4741024, 4906423, 4837533, 4974776, 4915411, 4904127, 5057952, 5226123, 5239777, 5397121, 5321679, 5609967, 5327840, 5363041, 5428046, 5387246, 6162906]
14453F162906l53942k9257K65179J03036k05647J52607J5871L04809l73659K51592
14443F293495J03675K49653J2570L05940o1293J19351Q868L41749m4402J6516
14433G346122M6155J66525K35654p4867L7153j26539J02870q7676Q83035j00838
14423H427594l47401J13516K26776K30364L40520J05922j86418K76394J40280
14414I327547K14050J66028J05219L01966k2803L27553o4703k6215L81150J8543
14404A0728335J30874L36392L31776J2080L66464j7328M11198j391M11000K33196
14394A2942596j22409M31310l1381J24080O33156J04987K67248l3819O71030k19967
14384A4766831L44067L44528L95613n8336N65150M07115K66604J72162O04710
$$ y = [6162906, 5808964, 5779707, 6044886, 6147922, 5942275, 6094882, 6110753, 6415562, 6041903, 6293495, 6397170, 6646823, 6659393, 6965333, 6904040, 7023391, 7032259, 7374008, 7329606, 7346122, 7392277, 7558802, 7794456, 7719589, 7756742, 7630203, 7733073, 7645397, 8528432, 8427594, 8080193, 8193709, 8420485, 8650849, 8991369, 9097291, 8910873, 9187267, 9327547, 9541597, 9707625, 9812844, 10114810, 10092007, 10419560, 10354857, 10328642, 10709792, 10728335, 10859209, 11195601, 11527377, 11539457, 11905921, 11888593, 12299791, 12298400, 12709400, 12942596, 12820187, 13251497, 13220116, 13344196, 13977352, 14082339, 14349587, 14315768, 14986798, 14766831, 15110898, 15455426, 15851039, 15792703, 16357853, 16764968, 17031572, 17203734, 17808444]
14375A7808444K35503P8517N43109N73284K32984K38950N32117J10055P32809
14366B1085772K18236N75115M88296L39113L43004O14216O01046L60730P43944
14357B5369472J34228R78180L31476N68665Q57066R60846M06015O29291J201408
14348C1436647j23922J332173M32425R74126R62152Q19352J007183R41539J053510
14339C8835185Q11380J519645O43792J554284O89734J103601J709487J266818
14331D8133926J257339J562588J288650J666823J771795K040803J672650J733790
14323F1128364K036644K039635K000919K676122J913899K632641K632032K551085
14315G9611341L050568L002538L297847L220948L395661L725605L735827M277510
$$ y = [17808444, 18043947, 18122464, 18665573, 19238857, 19471841, 19710791, 20242908, 20352963, 21085772, 21304008, 21879123, 22367419, 22706532, 23049536, 23663752, 24264798, 24625528, 25369472, 25503700, 26481880, 26813356, 27382021, 28239087, 29199933, 29605948, 30235239, 31436647, 31312725, 32644898, 33077323, 34051449, 35013601, 35832953, 36840136, 37781675, 38835185, 39646565, 41166210, 41810002, 43364286, 44054020, 45157621, 46867108, 48133926, 49391265, 50953853, 52242503, 53909326, 55681121, 57721924, 59394574, 61128364, 63165008, 65204643, 67205562, 69881684, 71795583, 74428224, 77060256, 79611341, 82661909, 85664447, 88962294, 92183242, 95578903, 99304508, 103040335, 107317845]
14307A07317845M248553M531686M816516M958128N494207N481144N889954O188519
14299A48926552O696568P076557P177472P572630Q303488Q880662Q629153R867267
14291B13130349R706867J0791380J0664298J1529874J2081349J2344802J3150276
14284B93399195J2979472J3257484J3492482J3534345J3904880J3101089J2835016
14277C86503963J2450952J1631260J0258714Q616355O047386K822611P92093j409457
14269D37713877r53172k161925k073572k568513m357370q205922j0299701j1927357
14261C95166345j3240660j3675292j4215372j4561059j4279141j4582166j4052138
14254B96560517j3586896j3482007j2611749j2313644j1830032j1093513j0853137
$$ y = [107317845, 111566398, 116098084, 120914600, 125872728, 131366935, 136848079, 142738033, 148926552, 155623120, 162699677, 169877149, 177449779, 185753267, 194633929, 203263082, 213130349, 222837216, 233628596, 244292894, 255822768, 267904117, 280248919, 293399195, 306378667, 319636151, 333128633, 346662978, 360567858, 373668947, 386503963, 398954915, 410586175, 420844889, 429461244, 435508630, 438331241, 439123334, 437713877, 436760705, 434598780, 432525208, 429956695, 425599325, 417393403, 407093702, 395166345, 381925685, 368250393, 354035021, 339473962, 325194821, 310612655, 296560517, 282973621, 269491614, 256879865, 244566221, 232736189, 221642676, 210789539]
14247B10789539j0060659r192049r033440q082302q349505p726390p237206o645260
14239A44462728o442998n998519n352243n564951n067894m915792m449225m421122
14231A02249984l739508l532001m064714l316303l350633l165166l233613k986965
14223G4861081k090652k933181k325985k198094k205357j953828j986706k058567
14215E7108711j785794j545374j747132j617814j593259j318681j384514j048924
14207D5067219j308923j011511r44343j637495j242938j028269q49767o63863
14199C6380110j287475p30158r21115r87963p58904m73191j110785q97475l06265
14190B8906779r68439o84748m88209r65668m73757n21337l86796p85608m16072
$$ y = [210789539, 200728880, 191536831, 182503391, 174421089, 166071584, 158345194, 151107988, 144462728, 138019730, 132021211, 126668968, 121104017, 116036123, 111120331, 106671106, 102249984, 98510476, 94978475, 90913761, 87597458, 84246825, 81081659, 77848046, 74861081, 72770429, 69837248, 67511263, 65313169, 63107812, 61153984, 59167278, 57108711, 55322917, 53777543, 52030411, 50412597, 48819338, 47500657, 46116143, 45067219, 43758296, 42746785, 41802442, 40164947, 38922009, 37893740, 37043973, 36380110, 35092635, 34362477, 33441362, 32453399, 31694495, 31221304, 30110519, 29213044, 28906779, 27938340, 27253592, 26765383, 25799715, 25325958, 24804621, 24417825, 23632217, 23216145]
14181B3216145o38940j42838n07044m80516r04751N3519o21848q5581n74440n55057
14171A8758649l24607j05018m65046m78437P6729q22651k12579m11015k63734
14162A5752291J9979m17385n22553K2610k84453O2378p71677J62600n19596n19002
14152A2985192J96208l36899p7981l93719k48842K25798m75711R1955k77155m70914
14142A1217932j22729l45629L66503k97692q8412k49221k16762j25727k79893
14133I858370K51418k93064p7351j33901m46640K56117m48310o5307l36643K19431
14123H784120l16048n9830m19975J39782L54125l61997n6176l05754k86487P9656
14113G551416j75989k7150J52518l81150j06832k00241m5582K76605k47156j44194
$$ y = [23216145, 22577205, 22434367, 21927323, 21446807, 20542056, 20595575, 19973727, 19888146, 19313706, 18758649, 18434042, 18329024, 17863978, 17385541, 17462270, 16639619, 16427040, 16016025, 15752291, 15772270, 15354885, 14832332, 14854942, 14570489, 14632867, 13861190, 14023790, 13504194, 12985192, 13181400, 12844501, 12766520, 12372801, 12123959, 12349757, 11874046, 11966001, 11688846, 11217932, 11095203, 10749574, 11116077, 10818385, 10729973, 10480752, 10263990, 10138263, 9858370, 10109788, 9816724, 9739373, 9605472, 9158832, 9414949, 8966639, 8901332, 8564689, 8784120, 8468072, 8408242, 7988267, 8128049, 8482174, 8120177, 8064001, 7758247, 7471760, 7551416, 7375427, 7348277, 7500795, 7119645, 7012813, 6812572, 6766990, 7043595, 6796439, 6652245]
14103F652245k68496K27282q2738r5337j00863J5928K1841k80896M4249o20355
14093E512860K98042R6541l40010j19109p5390K06475Q3665j62798j60023r8131
14083E242122J07082j00419m66574M60836l83955L33088k60553n7644j24081J55868
14073D905770j33947K0019J71301o07647J20494p3546K41071r525l80090j56666
14063D097234L34502j97828R2778J61280l18769k5459q1208r312O224l48936Q1967
14052C792473J47467l43450L4322J53443J0709o1313j23950K63269k25339j51896
14042C495735j97398J3436L72084k84407Q4319n2273k70296k4344J91460J03893
14032C432209j77435J03455k27944K26512k38310m0585L20684m18288N4771j94864
$$ y = [6652245, 6383749, 6611031, 6528293, 6432956, 6332093, 6348021, 6369862, 6088966, 6133215, 5512860, 5810902, 5907443, 5567433, 5448324, 5372934, 5579409, 5663074, 5500276, 5340253, 5242122, 5349204, 5248785, 4782211, 5243047, 4859092, 5192180, 4931627, 4873983, 4749902, 4905770, 4771823, 4791842, 4963143, 4355496, 4475990, 4402444, 4643515, 4633990, 4253900, 4097234, 4431736, 4233908, 4326686, 4487966, 4169197, 4143738, 4062530, 4053218, 4059442, 3710506, 3792473, 3939940, 3596490, 3630812, 3784255, 3794964, 3733651, 3609701, 3872970, 3647631, 3495735, 3298337, 3311773, 3683857, 3399450, 3483769, 3431496, 3161200, 3136856, 3328316, 3432209, 3254774, 3358229, 3130285, 3356797, 3118487, 3077902, 3398586, 2980298, 3035069, 2840205]
14022B840205J2773J7010m2402K98713l17159L1817j14876l0757J92406j9410
14012B868320k63494M3637k01556P2911j0605r6248m091L34323k57664j70692
14002B314841J77890j3982j79208P5835K57648l50772J17809J23524p249K3282
13992B539618M6110M92468L62860J059052L055445P386134J5086055M805977r103503
13983B5730216r805700n577728l192543j889426q32105p02494k57670O0640l49163
13974C184027O9301k57839j92443K1085L2366Q3866j19876l0341l98785L28801
13964B720162k90892J61385l85644J11046J74727q2154j74193q9778k45063M76518
13954B376114j22889k06106J37241j41454j06845O474K12597l53265L42012K5670
$$ y = [2840205, 2852978, 2869988, 2827586, 3126299, 2809140, 2840957, 2726081, 2695324, 2887730, 2868320, 2604826, 2648463, 2446907, 2519818, 2509213, 2412965, 2408874, 2743197, 2485533, 2314841, 2492731, 2478749, 2299541, 2375376, 2633024, 2282252, 2400061, 2523585, 2516336, 2539618, 2585728, 3078196, 3441056, 4500108, 7555553, 14941687, 30027742, 34833719, 25730216, 15924516, 10346788, 7154245, 5264819, 4432714, 3730220, 3472550, 3533190, 3184027, 3253328, 2995489, 2803046, 2824131, 2856497, 2940363, 2820487, 2790146, 2391361, 2720162, 2429270, 2590655, 2205011, 2316057, 2490784, 2408630, 2234437, 2144659, 1899596, 2376114, 2253225, 2047119, 2184360, 2042906, 1936061, 1942535, 2155132, 1801867, 2143879, 2169549]
13944B169549m54261M2244K97321J20232o22411N52343l54741L4661j03331l20018
13934A361588O82608j57669J00875o0240l80436R8143J18K55027k79979p8905
13924A541130j51405l3155J18510J44356J70277k25131J39657k40431M8521J00240
13914A612569J69689j63972J83938l71168l09361O23899m23196L81062j45173
13905A558287j64914k14218K68415k28002P6857L56840m25865L00540n8365j07344
13895A362231k70166L78909j90084K10407j00168R0522P5439p06572L50461K65682
13885A466661k56527J92982l83991M15915l12984M67523n12154J01320n1873L32883
13875A459755j70477K03100j75476k33362L01156k86261J21774J87637P3831k01327
$$ y = [2169549, 1715288, 1757532, 2054853, 2175085, 1552674, 2105017, 1750276, 1784937, 1681606, 1361588, 2044196, 1886527, 1987402, 1927162, 1546726, 1644869, 1644987, 1900014, 1620035, 1541130, 1389725, 1356570, 1475080, 1619436, 1789713, 1564582, 1704239, 1463808, 1512329, 1612569, 1782258, 1618286, 1802224, 1431056, 1121695, 1745594, 1322398, 1703460, 1558287, 1393373, 1179155, 1447570, 1219568, 1296425, 1653265, 1227400, 1527940, 1469575, 1362231, 1092065, 1470974, 1280890, 1491297, 1391129, 1481651, 1557090, 850518, 1200979, 1466661, 1210134, 1403116, 1019125, 1435040, 1122056, 1589579, 1077425, 1178745, 1126872, 1459755, 1289278, 1492378, 1316902, 1083540, 1384696, 1098435, 1220209, 1407846, 1481677, 1280350]
13865A280350l57146K48087j8617K54499m94258N81545m41949N2754J97061k26485
13855A075841N1998J59428m39964P5010L52070j13497j00525K85154l75655k0408
13845I49452O608K7705K30877j41972R5115K77790l45868K64474k91143q871N228
13834A069395p655k81678K51041j79387l17810M65201j91661K42565q10J47620
13824A196821m51835N856Q0806L64420E67453Q14905l74922O274O0454p6185P9647
13813A077626n12872O90401D57358K81594K52400j89011k38676K03138L2396J26511
13803I25710k2932N482K10356k78314p2171K26522J16185j82058K48767m12934
13793G64613J59080Q9886k11687J4543n9356k54243P6858J31758j14180N62287
$$ y = [1280350, 923204, 1171291, 1152674, 1407173, 912915, 1494460, 1052511, 1105265, 1302326, 1075841, 1127839, 1287267, 847303, 922313, 1274383, 1160886, 1060361, 1345515, 969860, 949452, 956060, 983765, 1214642, 1072670, 1167785, 1445575, 1099707, 1364181, 1073038, 1064167, 1069395, 1061740, 780062, 1031103, 851716, 533906, 999107, 807446, 1050011, 1049201, 1196821, 744986, 750842, 831648, 1196068, 567453, 1382358, 1007436, 1013710, 1074164, 997979, 1077626, 564754, 1255155, 457358, 738952, 991352, 802341, 563665, 766803, 799199, 925710, 902778, 908260, 1118616, 840302, 768131, 994653, 1110838, 928780, 1177547, 764613, 923693, 1013579, 801892, 816435, 757079, 502836, 579694, 711452, 597272, 1159559]
13783A159559m12059j45223K16971K64435m06592r8753M9104k575o2835K16682
13773G78714k85535K52157j6307j07368j9684P3675L38678l07956r6869M8484
13763F57989o800M01733D00068K03232p1177M39485k21781J08010q2602j44428
13753F30807J57492o2958J81966q1127C80902L84005j77573j4352j6596K59570
13743H15956K45416l62528P3327R6541l43753L54448k43072k30861M84428r1990
13733G97912o5768j82681n5681B35245J77616J52714j89654N7565K38998j43059
13723E29425M0543J90263k49482K36173j84518J69591k61402L53202j67246N8465
13713G15014j12539j52675P4417J25566k01309K41357j51357q5921j6842J88073
$$ y = [1159559, 747500, 602277, 819248, 1083683, 677091, 578338, 627442, 624867, 562032, 778714, 493179, 745336, 729029, 621661, 601977, 675652, 1014330, 706374, 609505, 657989, 651189, 1052922, 400068, 603300, 532123, 971608, 749827, 857837, 775235, 630807, 788299, 725341, 907307, 826180, 380902, 764907, 587334, 572982, 556386, 815956, 1061372, 698844, 772171, 868712, 524959, 879407, 636335, 405474, 889902, 797912, 732144, 549463, 493782, 235245, 412861, 565575, 375921, 433486, 672484, 529425, 569968, 760231, 510749, 746922, 562404, 731995, 470593, 823795, 656549, 715014, 602475, 449800, 524217, 649783, 448474, 689831, 538474, 452553, 435711, 623784]
13703F23784j23479P6759j54391K30372P9253C44368O0971K31526j1892K39323
13693H64296k84878R3666C00728K25481K60219l70464J84406j80360J94816l0549
13683E84277L21586k88670q720q5508j8699J2903Q8567o3302J01569q9053J37164
13672F92114l03866N1665J21599j50050J5123K35206C08737L85436C23685A40519
13661H28329B55699O27960m10413k11441J87355J11574O4501O3248k05737l7943
13651D44803j75117J76274P1264K0220m1976r4779O927p2712J20011q7331N8585
13640D26169r007M01939C57275K00600B06578J02822J74178J06482n6691k18324
13630C15045j4553N2142J03950A09626J28975J58525K30470k26919K36617P4269
$$ y = [623784, 500305, 577064, 422673, 653045, 732298, 344368, 405339, 636865, 624973, 864296, 579418, 673084, 300728, 526209, 786428, 415964, 600370, 420010, 614826, 584277, 905863, 617193, 608473, 522965, 504266, 517169, 605736, 542434, 644003, 554950, 692114, 388248, 439913, 561512, 411462, 426585, 661791, 308737, 694173, 323685, 140519, 828329, 255699, 883659, 473246, 261805, 449160, 560734, 625235, 688483, 482746, 444803, 269686, 445960, 517224, 537444, 495468, 400689, 407616, 334904, 454915, 367584, 426169, 417162, 819101, 357275, 557875, 206578, 309400, 483578, 590060, 533369, 315045, 300492, 352634, 456584, 109626, 238601, 397126, 627596, 400677, 637294, 711563]
13620G11563k10747j19519n7869J23719m4609J50968B67846J97708A62369K81141
13610D43510H3100L31940m1691J94907O1026k17266j19026r5404L44312n3965
13600D87933L7865B25261J10891A1564N52990q1124J00557o4146N4703N2124B11077
13588F22677j95575B04178L10853A62828L24595N6278j06279q9675j6400L8439
13578C69786J3376E114K22138K25294M8980E0075L04087L379H4767K88113r1122
13567B81758K67040B06063J64356P8493j13714j0967n3458K63204B26854K71579
13557D98433A87527l4181K54127k3162o3742K00969m6181j81920D3573O185J99452
13546B49210m1055k0893n5949D863K91224K6663j056e2607C90203K4746j98130
$$ y = [711563, 500816, 381297, 323428, 447147, 402538, 553506, 267846, 465554, 162369, 443510, 83100, 415040, 373349, 568256, 629282, 412016, 292990, 197586, 541898, 487933, 525798, 225261, 336152, 11564, 564554, 483430, 583987, 519841, 574544, 626668, 211077, 622677, 427102, 204178, 515031, 162828, 487423, 543701, 437422, 347747, 331347, 369786, 383162, 5114, 227252, 452546, 501526, 50075, 354162, 357541, 84767, 372880, 281758, 548798, 206063, 370419, 448912, 335198, 324231, 270773, 533977, 226854, 498433, 187527, 153346, 407473, 384311, 320569, 521538, 475357, 293437, 43573, 49758, 249210, 208155, 187262, 131313, 4863, 296087, 322750, 321694, -52607, 390203, 414949, 216819]
13535B16819J34899g241D41469A22334L75124N3746j81254K38071p8054A21547
13524B74271k0695C9753L55466r6866M223A28969K29928g5403C47362o714R103
13513C49751j28777c0512C80033c4062B81764h623B85251r158k8043j1331Q9418
13502C26137A07924M44358b8251E33430B9581M66867i058C40092j8072l4908j14618
13491A72494k6270L87412B36400a35454E02674N5005A62095N9300N661J10377
13481C37433g1979F587K52440M3609K732K53039A41107L63571A85698g2004D45569
13469D12696o7058l0351J87626n5593j48937l1219L86497f3581A94814J78183
13459C72997j82795a2865C37038K4320c0782B55540J80732j07139A48954Q6289
$$ y = [216819, 351718, -7241, 441469, 122334, 497458, 551204, 369950, 608021, 529967, 121547, 274271, 253576, 39753, 395219, 298353, 302576, 128969, 358897, -75403, 347362, 340648, 349751, 220974, -30512, 380033, -34062, 281764, -8623, 285251, 276093, 248050, 236719, 326137, 107924, 552282, -28251, 533430, 29581, 496448, -9058, 340092, 322020, 287112, 172494, 146224, 533636, 236400, -135454, 502674, 557679, 162095, 221395, 227056, 337433, -71979, 6587, 259027, 302636, 305368, 558407, 141107, 504678, 185698, -72004, 445569, 412696, 345638, 315287, 502913, 447320, 298383, 267164, 653661, -63581, 194814, 372997, 190202, -12865, 337038, 361358, -30782, 255540, 436272, 329133, 148954, 235243]
13449B35243n3284L8634n8456K55004J19114A20754M0793K37092q5376j1613p373
13438B94277J35530A06922J03354G7073M7752J08387l4707j4782l3227K31981
13428C82477j1712J627j69937j640a61270A64370J83877b0274B67604J74287A74699
13416C40698A00057O7510L20559C9033A9209L81870N9871k11434J45290j85917
13406B08889Q7989J44088h5098B31035Q2027c18835D68566A98646J30984K20671
13396E50301B54732A18447J36566K30742k03520a29068D75756B34853j1157F6563
13385B81390N4160m2326j19313K18869n8424o490H7372Q5133E7383N14391A81869
13373g1097I8361M68082e8122a2427A62866C9162K49165K79375k07125r1070p6987
$$ y = [235243, 181959, 220593, 162137, 417141, 536255, 120754, 161547, 398639, 313263, 301650, 294277, 429807, 106922, 210276, 77073, 124825, 233212, 198505, 183723, 150496, 382477, 370765, 372392, 202455, 200815, -161270, 164370, 348247, -20274, 267604, 441891, 174699, 340698, 100057, 167567, 488126, 39033, 19209, 401079, 460950, 249516, 394806, 208889, 296878, 440966, -85098, 231035, 313062, -318835, 468566, 198646, 329630, 550301, 254732, 118447, 255013, 485755, 282235, -129068, 475756, 234853, 223696, 66563, 281390, 335550, 293224, 173911, 392780, 334356, 327866, 87372, 172505, 57383, 571774, 181869, -71097, 98361, 566443, -58122, -12427, 162866, 39162, 288327, 567702, 360577, 269507, 192520]
13362A92520c6372B01915M1818J3027k9754M7015b5101A19651K52105G9080K61042
13351C40122J35118q3598Q463J25589B34062M2372K07281k11547K23577m8959
13341D46786F2933J10630L1569J32193G8928P7609K96913N3281H3725R8093K44816
13330D26634A76270J84438A45333g9516A84362C3941K46921Q6546j37435L1500
13320B61473A0884K42555C8425L98537J50254A46211O7227n929J07299B9785L31462
13309C61247J0419Q702b4697E14473b04378E173J74212L10377C8960M22224I7401
13297B52972n0382N4554Q8608A59576J67033d4722K0957C35214A56302a32218
13286C33304L6437D2964I421Q2562L85889A99037J3914K32226A30264J56508L22366
$$ y = [192520, -36372, 201915, 243733, 256760, 227006, 274021, -25101, 119651, 371756, 79080, 340122, 475240, 391642, 400105, 525694, 234062, 276434, 483715, 272168, 495745, 446786, 62933, 173563, 205132, 337325, 78928, 156537, 453450, 506731, 83725, 181818, 426634, 176270, 360708, 145333, -79516, 184362, 33941, 280862, 367408, 229973, 261473, 10884, 253439, 38425, 436962, 587216, 146211, 213438, 207509, 314808, 29785, 361247, 371666, 380368, -24697, 514473, -204378, 5173, 179385, 489762, 38960, 461184, 97401, 252972, 202590, 257144, 345752, 159576, 326609, -44722, -23765, 335214, 156302, -132218, 333304, 369741, 42964, 9421, 91983, 477872, 199037, 212951, 445177, 130264, 286772, 609138]
13275F09138A2591K65067l6339m7627l5658l9734J66856b9353A53981j8860K31535
13264C66656a65989C34624b5974A10330K10889d7985C20639j41652P741f4887
13253a6853B24714A188K44736K8876o4764E4076i3544j2885B50843p9934A7859
13241g5152j543C6640L50934g344C8922J22269J54178A48872L01965i3373I990
13229A77871h5867C82652c0406B73850a71271H7953J17774d497C37718E7718K76710
13218C34428j21426a40429D8147J66859r2974J600K0952L6893A3381K41689H7676
13206a03107E30030B11288F344K07693b6483a2052j14467D97684A29658K2243
13196A51901K3812i03j42606B50532J4978j11422i5661b5962E2763H21J83644
$$ y = [609138, 12591, 277658, 241319, 193692, 158034, 118300, 285156, -29353, 153981, 135121, 366656, -165989, 334624, -25974, 110330, 321219, -47985, 320639, 178987, 186728, -64887, -16853, 224714, 1188, 245924, 274800, 210036, 54076, -93544, -106429, 250843, 170909, 17859, -75152, -76695, 36640, 387574, -7344, 38922, 161191, 315369, 148872, 450837, -93373, 9990, 177871, -85867, 382652, -30406, 273850, -171271, 87953, 205727, -4497, 337718, 57718, 334428, 213002, -140429, 48147, 215006, 122032, 123632, 144584, 181477, 13381, 255070, 87676, -103107, 530030, 211288, 6344, 214037, -26483, -12052, -126519, 497684, 129658, 151901, 175713, -903, -143509, 250532, 265510, 154088, -95661, -25962, 52763, 821, 184465]
13185A84465k4293j5833c0331o2906A10068D4382R3719l8957J97849b8006D3269
13173f7590o5091D7757R2325a33188A52210F3520J45565k0325a21449B65458a99000
13161G7811P3692R3600J0360j05045C572f9362l4148D1887P1720C057P9046J14237
13149A96340i0539A87596J05442b7152A74806K01903q1498d8081C8198a94708
13138C21619h2789j37275C5573R3967n2590J13389q711n3643d2761H2627C0265
13126C13633Q0932j92938K98378B34887a33966F848J86629Q2640E828e4314D1002
13114a75985A93596a48774g4054B39918Q4774K0470F0172B5971a84526H1574B1252
13102c2067A89278F1647g6938D9616i590C12799I1587l3757L8073A8789h1760
$$ y = [184465, 160172, 144339, -30331, -93237, 110068, 44382, 138101, 99144, 296993, -28006, 43269, -67590, -132681, 47757, 140082, -133188, 152210, 63520, 209085, 188760, -121449, 265458, -199000, 77811, 151503, 245103, 255463, 150418, 3572, -69362, -103510, 41887, 113607, 3057, 82103, 196340, -90539, 187596, 293038, -27152, 174806, 376709, 295211, -48081, 38198, -194708, 321619, -82789, -220064, 35573, 129540, 76950, 190339, 181628, 127985, -42761, 82627, 30265, 313633, 394565, 201627, 500005, 234887, -133966, 6848, 193477, 276117, 5828, -54314, 41002, -175985, 193596, -148774, -74054, 239918, 324692, 345162, 60172, 25971, -184526, 81574, 21252, -32067, 189278, 61647, -76938, 49616, -9590, 312799, 91587, 57830, 95903, 18789, -81760]
13090c6699k32658c5071B40084G2124K86371c0587C1638M37167b4445B27840H3819
13078b75607b6240B77172o5729k0014G8040O9486B5775J02642a86722A33872J15122
13067B48994c1067R734C8758K67304q8524N2547R2346A61356o0810h2528n539
13056h8067E34679A6940K33629P0358A25362E5121a40281M8001c610H3278e3870
13044C26629G77J6069L1260J2980q310O2491g1363A54793J541a23270A82500Q7657
13032B70157A24516M9430L5903K33793A43826P9639A8316h5598B69622b03410
13021C32353m7913j02352L2071a76603B91194H5781J57897J6651j09882a877H4803
13009a28028B0635h4342j0890A30042M5079f4312d375k0721H2574h8079D6829
$$ y = [-36699, -269357, -35071, 240084, 72124, 358495, -30587, 31638, 468805, -24445, 227840, 83819, -275607, -26240, 277172, 211443, 191429, 78040, 147526, 25775, 128417, -186722, 133872, 248994, -31067, -21333, 38758, 306062, 217538, 270085, 362431, 161356, 100546, -82528, -88067, 534679, 16940, 250569, 320927, 125362, 55121, -140281, -92280, -3610, 83278, -53870, 326629, 777, 16846, 48106, 61086, 52776, 115267, -71363, 154793, 156334, -123270, 182500, 270157, 124516, 173946, 209849, 443642, 143826, 223465, 18316, -85598, 269622, -203410, 332353, 284440, 182088, 214159, -176603, 291194, 85781, 243678, 260329, 150447, -1877, 84803, -128028, 20635, -84342, -95232, 130042, 175121, -64312, -4375, -25096, 82574, -88079, 46829]
12997B26661L4533f2831h761I4429a36041B69618A27094l5502l5440J38578C2436
12985b19471B4883P5719l7681Q061A8089L4871b60403h0989A47061d8991C57244
12973A76762g0051b7693C7602J6203N8051O7299a10553D1800M7391J47312n1697
12962A84806F3828K92043A52499g17p0020C64581m6920r1133k7765G9187a38669
12950d2177r1342K6082A10517J65456a86429C7880K50135c43904A75709B5046
12939A42258b1766B2386K66025A00548K00936h2368I5101M8331J97854G0179D137
12927B14352n466E7283J42521h2447r5149C16977c40734A65250b14513H9179f8649
12915a05905d4736B70268b4898p5610A14945i5306A78991l3301o9662k8951a03657
$$ y = [226661, 261194, -62831, -8761, 94429, -136041, 269618, 127094, 91592, 56152, 194730, 32436, -219471, 24883, 100602, 62921, 70982, 18089, 52960, -260403, -80989, 147061, -48991, 357244, 176762, -70051, -27693, 37602, 53805, 111856, 179155, -110553, 41800, 89191, 236503, 184806, 63828, 355871, 152499, -717, -70737, 364581, 317661, 226528, 198763, 79187, -138669, -42177, -133519, -107437, 110517, 275973, -186429, 37880, 288015, -343904, 175709, 25046, 142258, -21766, 22386, 288411, 100548, 301484, -82368, 95101, 143432, 341286, 70179, 4137, 214352, 208886, 57283, 199804, -82447, -177596, 316977, -340734, 165250, -214513, 89179, -68649, -105905, -44736, 270268, -24898, -100508, 114945, -95306, 178991, 145690, 76028, 47077, -103657]
12903a5285C7567a81735B44941r5522J30503F3501K16784a76117B56082f496A66312
12891g1936A1267a59860D34517A01528a19214B16537G0044c0198j4154A6426J44164
12880A60590G6182J25016K72163A31235m7027K21025B039R4161J32663O2337d6983
12868A52900D5125h2222C3399c6234E3611b083l881E5070N5668D4811J56173a79388
12855A41066A3115J63698F1746J82035a5765B9855c34214a40155B29181m6278
12845A82903j7132E3846L61119i5473A60059D0779J05729a47213d1778C9258Q381
12834D7639a93131k68930A80427a77313j35749B85654c6899D9946P5071b95144
12823B35501e5674j27972A15468a00908A39949M2005n9044M5992M9773b3621o0556
$$ y = [-15285, 37567, -181735, 244941, 149419, 279922, 63501, 280285, -176117, 256082, -6496, 166312, -71936, 11267, -159860, 434517, 101528, -119214, 216537, 70044, -30198, -44352, 16426, 160590, 76182, 201198, 473361, 131235, 84208, 305233, 2039, 96200, 228863, 291200, -46983, 152900, 45125, -82222, 33399, -36234, 53611, -2083, -5964, 55070, 110738, 44811, 200984, -179388, 141066, 13115, 176813, 61746, 243781, -15765, 29855, -334214, -140155, 229181, 182903, 165771, 53846, 414965, -95473, 160059, 40779, 146508, -147213, -41778, 39258, 47639, -193131, -462061, 180427, -177313, -313062, 285654, -36899, 49946, 125017, -295144, 235501, -55674, -183646, 115468, -100908, 139949, 181954, 122910, 168902, 218675, -23621, -84177]
12812h4177p8017F6389i7301I093c2377a2645B89223A43858b12200R7925A93820
12800c0121j30003B5243b71231C4219d5520C03446q4298J7218n0005K31133r5684
12789C21810b52044m2586A2032a10421A1007J76836a03343D9440J11297D966K15412
12778B20378E2881a60705L0273B66332c9958m1059k16482A01230c47939a6417
12767i6186B71856A24341l2966a98802f9312r2335m046j50413c7138H5657a38388
12755A76755f0979A73101H4790H211b66572i7004G7596f0588B90495a71341A4286
12743a24046O1343A63242N0908B0738J92904f7740j28863A04125j5093a46994
12732C60513E2553b42878M3797A8476K44400F8666J74139b56700O4441A41783
$$ y = [-84177, -162194, 66389, -97301, 9093, -32377, -12645, 289223, 143858, -212200, -114275, 193820, -30121, -160124, 25243, -271231, 34219, -45520, 303446, 219148, 236366, 186361, 417494, 321810, -252044, -294630, 12032, -110421, 11007, 187843, -103343, 49440, 160737, 4966, 220378, 52881, -160705, -130432, 266332, -39958, -81017, -297499, 101230, -347939, -16417, -96186, 271856, 124341, 91375, -198802, -69312, -161647, -165693, -316106, -37138, 85657, -138388, 176755, -60979, 173101, 84790, 8211, -266572, -97004, 77596, -60588, 290495, -171341, 14286, -124046, -62703, 163242, 214150, 20738, 213642, -67740, -196603, 104125, 89032, -146994, 360513, 52553, -242878, -199081, 18476, 262876, 68666, 242805, -256700, -192259, 141783]
12721h4020C2006h1611L3622C21010A08759h1926A84964B6799L5762J66656C3292
12709A61486J06496K6555E9673K12148A26333l8658L00286R140c75329G2185K17871
12698B90056r1351k3768p7581P7658c6916B00720A5062b64830C61110B6109L220
12687B9329L4483c7786J1430B38323J00526j06152A09931j1560i8517F9069f290
12675b8502A56925k1863K37556A62100b95969C5826c47864G1639L22843C2118
12664B44108p9394J4112n999P070o6428a54936E5200J511K32753e5174j21320
12653a76494C4173a71672A72272p214J04804K6411E1243M7861Q1542b26722a1090
12641A40598f6929B37832J25154A09351B4598J5014J32963o4141K75496A16282
$$ y = [-84020, 32006, -81611, -47989, 321010, 108759, -81926, 184964, 26799, 62561, 229217, 33292, 161486, 267982, 294537, 59673, 271821, 126333, 87675, 387961, 397101, -375329, 72185, 290056, 198705, 174937, 97356, 175014, -36916, 200720, 15062, -264830, 361110, 26109, 29329, 63812, -37786, -26356, 238323, 338849, 232697, 109931, 98371, -98517, 69069, -6290, -28502, 156925, 135062, 372618, 162100, -295969, 35826, -347864, 71639, 394482, 32118, 244108, 164714, 178826, 172827, 179897, 113469, -154936, 55200, 56711, 289464, -55174, -176494, 34173, -171672, 172272, 165058, 269862, 296273, 51243, 99104, 180646, -226722, -11090, 140598, -66929, 237832, 362986, 109351, 24598, 39612, 172575, 108434, 383930, 116282]
12630A63381j2078a8836B7553K49146i4835A66979K1184J3371M4691j11865K55721
12619C90081A00659J14076a17145c9027A04511J37738a08253G4361b97320B12722
12608A10771J01218n8587G3780g6895A39615l7470J51298i3496B06820J9686B6937
12596a18146a0098A46227R260b41349A56062a6691A74486A2399J84153a05915
12585B13246B3581h3021B748a61438G8647e8590C1733a80662Q8180K2247C01788
12573B66651I9633J4980a9157A29209C1270N466m276J30023n0077M3905K13004
12562C69315b19811H6865N8456b89012D9081a77373c9510C72J36220A6138d5190
12550a49653C0045J03844k2321j4695B6912J45353H4518J8662D9563B3770a50506
$$ y = [163381, 151303, -18836, 27553, 276699, -94835, 166979, 188163, 201534, 246225, 134360, 390081, 100659, 214735, -117145, -39027, 104511, 242249, -108253, 74361, -297320, 212722, 110771, 211989, 153402, 73780, -76895, 139615, 102145, 253443, -93496, 206820, 226506, 26937, -118146, -10098, 146227, 155487, -241349, 156062, -16691, 174486, 12399, 196552, -105915, 213246, 23581, -83021, 2748, -161438, 78647, -58590, 31733, -180662, -92482, -70235, 301788, 266651, 99633, 114613, -19157, 129209, 31270, 36736, 32460, 162483, 112406, 156311, 369315, -219811, 86865, 145321, -289012, 49081, -177373, -39510, 372, 136592, 16138, -45190, -149653, 30045, 133889, 111568, 96873, 26912, 172265, 84518, 103180, 49563, 23770, -150506]
12538h2808k337L3686a3083A8764a31620O2249q6733B62964j24077a04078a8945
12526A53551L3924m8424k9508b2226A82519J24101i1303o8204D79985c52793I4389
12514C8399L42664d2277B81678b33742A7168M5577a74109A32969f9340a0059A2841
12502h0527A3130K89071b35836D39073a07305j56517J28513A90522o1025i0142
12491B84386b6186k96069B23847O521a54498G4197J96693b20146k67220b7042
12480A91316C692K10957a7652A5517P521a007l97521B13885R060q2806J544a30467
12467b07656B2075K05707n1462I930J45904a19044A04724E363e2636q8617l7655
12456a78908H3362l6378c5896O077o5368j28922E8627L42429A73294h9875A14235
$$ y = [-82808, -85145, -51459, -13083, 18764, -131620, -69371, -156104, 262964, 138887, -104078, -18945, 153551, 187475, 139051, 109543, -22226, 182519, 306620, -91303, -159507, 479985, -352793, 94389, 38399, 381063, -42277, 281678, -233742, 17168, 62745, -174109, 132969, -69340, -10059, 12841, -80527, 13130, 302201, -235836, 439073, -107305, -263822, -135309, 190522, 129497, -90142, 284386, -26186, -322255, 223847, 230368, -154498, 74197, 270890, -220146, -487366, -27042, 191316, 3692, 214649, -17652, 15517, 23038, -1007, -398528, 213885, 222945, 140139, 141683, -130467, -207656, 22075, 227782, 176320, 9930, 155834, -119044, 104724, 5363, -52636, -141253, -178908, 83362, 46984, -35896, -29819, -95187, -224109, 58627, 401056, 173294, -89875, 114235]
12444E3810P2550h7580D52561A01485a70953I6022g3708k84278a24695A15746
12433D2739K23490r3367a4245A28437b29826A43330d43177A0107e5570A89256
12422a14448j08712K1648A30011f2355j21090c1483A50146m8718g9401B12021
12411C49496C6882e8124j90342f0017H5315a46690d317k64610a1724j69905E9783
12399b1769n4577A09227J68412p1307J49731b16420L9870J3044C0056N38637a5426
12387G328a81526F3445C570a56405C5842a45077C92614f1647A81940c5769A72248
12375b08587B62858A28839c39217a45692n9772B10192a5371E1105a58701C41306
12364H9360f8359b939G0293a1192k10598B81917q9241a57851E5157N7245b1652
$$ y = [53810, 126360, -87580, 452561, 101485, -170953, 96022, -73708, -357986, -124695, 115746, 42739, 266229, 172862, -14245, 128437, -229826, 143330, -443177, 10107, -55570, 189256, -114448, -223160, -201512, 130011, -62355, -183445, -31483, 150146, 101428, -79401, 212021, 349496, 36882, -58124, -248466, -60017, 85315, -146690, -4317, -268927, -11724, -181629, 59783, -21769, -76346, 109227, 277639, 206332, 356063, -216420, -176550, -163506, 30056, 568693, -15426, 7328, -181526, 63445, 3570, -156405, 35842, -145077, 392614, -61647, 181940, -35769, 172248, -208587, 262858, 128839, -339217, -145692, -205464, 210192, -15371, 51105, -158701, 341306, 89360, -68359, -2939, 70293, -11192, -221790, 281917, 192676, -157851, 55157, 112402, -21652]
12352c4500D82a32638B30751J13306C3254f8616J55J1870b1582F6537h3741j01319
12340a85060e7426D486d7693A81507G3443a74915j0621I4630c90824f2737j05398
12329a68135A24064m1708R9935a08358M9848n4654E3253a22534e227q2978A80017
12317a05605r3302O2895n5631K862e9464j03679m192k27529A93815Q9565m9565
12306B33815D2363L1612a59361j01317G549e4404A00933K43247c43281G3116c51476
12294B63587r8379a05898r5392D64391b5263F0529a07185B0454a25344j8273I3228
12282A43024A7209b957j14461r2544g012A14585l806P9225j8544b93758D64923
12270C97030G5752k2893K48357G2577i2876A84554M2234Q7751j30911E2534b07222
$$ y = [-34500, 482, -132638, 230751, 344057, 33254, -68616, -68461, -56591, -21582, 66537, -83741, -185060, -57426, 4486, -47693, 181507, 73443, -174915, -185536, 94630, -390824, -62737, -168135, 124064, 82356, 182291, -108358, -58510, -113164, 53253, -122534, -5227, -88205, 180017, -105605, -198907, -136012, -191643, -188781, -59464, -163143, -167335, -394864, 193815, 283380, 233815, 42363, 73975, -159361, -260678, 7549, -54404, 100933, 344180, -343281, 73116, -351476, 263587, 165208, -105898, -201290, 464391, -25263, 60529, -107185, 20454, -125344, -143617, 93228, 143024, 17209, -2957, -117418, -209962, -7012, 114585, 110779, 190004, 171460, -293758, 464923, 397030, 75752, 52859, 301216, 72577, -92876, 184554, 226788, 314539, 183628, 52534, -207222]
12258A65718c3593m8073B5536a32875o848A47672J09641r8760p5736L33653g6078
12246E1970Q7348K66115A70913M3778o9623g4470j43557B3763f86p7145C5227
12234A65869M2959J80586j23798O2816B8763J50328n9072M00825k28777J79937
12224D72004j78932m6011J20963C9677J59460M44900B70394Q9107j75421q646
12214A75434o6691J4404a37865C495i6902A33125o0318K41000A3685L28544A28311
12202A34207J02624A03093B7562J65762H5135L46822D2035L68149A48249h116
12191B9251L7154J63874r9049a86520O8661C24525A15338J8425a37361B36295
12180C40084G4334J73484l510a03439D6317Q2438K87233A72505M8322h2669A79119
$$ y = [165718, -33593, -81666, 25536, -132875, -139723, 147672, 257313, 158553, 82817, 416470, -76078, 51970, 139318, 405433, 170913, 214691, 145068, -74470, -218027, 23763, -686, -77831, 35227, 165869, 208828, 389414, 265616, 328432, 28763, 179091, 120019, 520844, 292067, 472004, 293072, 247061, 368024, 39677, 199137, 644037, 270394, 359501, 184080, 175434, 108743, 123147, -137865, 3495, -96902, 133125, 72807, 313807, 13685, 342229, 128311, 134207, 236831, 103093, 27562, 193324, 85135, 431957, 42035, 410184, 148249, -8116, 29251, 66405, 230279, 131230, -186520, -117859, 324525, 115338, 133763, -137361, 236295, 340084, 74334, 247818, 244308, -103439, 46317, 128755, 415988, 172505, 220827, -82669, 179119]
12168h7052C0936O8929K21626G5832O3435K46863j39635a2660r2923k466d5596
12156D33089F579d0096j53737E5624O172J00594m5982K1166b67003A20761g2855
12144H5265e2063j25303G3644a33816O6599A98451b17395e4930B28945l7143b15227
12132b1701q7628B00535r3390A1738b38502B60605G9689K4131d6363E2219K1222
12121G3441a93571L9617G8675a56443C43434a66999A77414a94871J695b1504A29769
12109A02884E21h9928P640J7159l87766a63634d9185A18621a42104I5007b95992
12097f3057d942D59807E9600c9074A82516a2093j62533C42203B1805Q7594k348
12086A07051b3103G94e5876A7193e2007B41841a45905A64529b2875A96576D9989
$$ y = [-87052, 30936, 99865, 321491, 75832, 139267, 386130, 246495, -12660, -105583, -108049, -45596, 433089, 6579, -40096, -193833, 55624, 61796, 162390, 116408, 137574, -267003, 120761, -72855, 85265, -52063, -177366, 73644, -133816, -67217, 198451, -217395, -54930, 228945, 191802, -215227, -21701, -109329, 200535, 107145, 11738, -238502, 260605, 79689, 103820, -46363, 52219, 73441, -193571, -153954, 78675, -156443, 343434, -166999, 177414, -194871, -193176, -21504, 129769, 102884, 521, -89928, -82288, -65129, -452895, -163634, -49185, 118621, -142104, 95007, -295992, -63057, -4942, 459807, 59600, -39074, 182516, -12093, -174626, 342203, 21805, 109399, 107051, -23103, 794, -55876, 17193, -52007, 241841, -145905, 164529, -22875, 196576, 49989]
12074e4777A8342J55694a49155F007J74837a18941H21585L11655L27695E06342
12063E14761k41047k3843e3280A78957c2198I1306a78896o568e0159j51881J4057
12052a87983P5853M6309k97895A05627a07994d107C23802d5688k812r1283n4996
12041a94779D9183a16232A69708e5086n9537D8867N695a08003r6687A4498g4819
12029A15909a77025H4067E208c1421A0817J02640B8558J07443l854a63174G4982
12017b37818P3065h772F9867P6533C6308c58533B13707a60525O9976A11045m5065
12006F5980i5548J495I7006b83246C12745a61624k09001e5513n9476K5577F7272
11994e7292o9790a2537j75119g9152j94172K1261e5179F0141c82051a9056F9494
$$ y = [-54777, 18342, 174036, -149155, 6007, 180844, -118941, 821585, 1133240, 1460935, 506342, 514761, 273714, 249871, -53280, 178957, -32198, 91306, -178896, -185464, -50159, -202040, -187983, -112130, -65821, -363716, 105627, -107994, -4107, 323802, -45688, -48500, -139783, -194779, 49183, -116232, 169708, -55086, -114623, 48867, 54562, -108003, -204690, 14498, -74819, 115909, -177025, 84067, 5208, -31421, 10817, 113457, 28558, 136001, 132147, -163174, 74982, -237818, -164753, -8772, 69867, 146400, 36308, -358533, 213707, -160525, -90549, 111045, 65980, -95548, -94053, 97006, -283246, 312745, -161624, -370625, -55513, -114989, -89412, 67272, -57292, -127082, -12537, -187656, -79152, -273324, -252063, -55179, 60141, -382051, -19056, 69494]
11982a12045A5171j398J62557a03220I1805C9823J35497C8860e4430k88048a61354
11970H349a98843n5297B18229c9037B55673a03358j717A44411c67395a58982B72431
11958A47935d3797j14403c7213B841e2077I7797B2979b94532I8545c65471L1567
11947c33904A3973h4357C32264A29285a52495C4490J5678b1890A99840C4634O8997
11936A03631C4204P313K20393f5784D9309b525D5234h045B55g1001B26896i0034
11923A32404h7662r4080d0890l659D9424b55081l5524N9581O9031I9157H018d3643
11910E8710a01258M5152A03291N4340m0877b0419A17977N7888a01680D9584A6396
11898A12765a28058A19757c38969D5159a79155j07984K2418G037b59356F0787
$$ y = [-112045, 15171, 13773, 176330, -103220, 91805, 39823, 175320, 38860, -54430, -342478, -161354, 8349, -198843, -254140, 218229, -39037, 255673, -103358, -105075, 144411, -367395, -158982, 272431, 147935, -43797, -158200, -37213, 2841, -52077, 97797, 22979, -294532, 98545, -365471, -333904, 13973, -84357, 332264, 129285, -152495, 34490, 50168, -21890, 199840, 34634, 103631, 34204, 41517, 261910, -65784, 49309, -2525, 45234, -8045, 255, -71001, 226896, -90034, 132404, -87662, -181742, -40890, -44549, 49424, -255081, -290605, -231024, -161993, 99157, 8018, -43643, 58710, -101258, -56106, 103291, 157631, 116754, -20419, 117977, 175865, -101680, 49584, 16396, 112765, -128058, 119757, -338969, 45159, -179155, -287139, -264721, 7037, -259356, 60787]
11887a91967C99690b36057f5960C16744A33626i6393K9792G5502a06140q7714
11877a93854C15603B3110a34667K7308j28636I1714a97827G7288a15492A51694
11866a42144G447e6919b1870l44179J63171A58930C8867a87022B45056A07969
11855A23250C7374b14853A93735b267j21872B17095c5324m8431A15956a08234
11844a92956A02185C6392b07370B39181A04099l7722O9297f2802I7294d08568
11833i9535a1638j9718p7660A17390g8325G6550b13109f2511I5371D0887b50888
11821C9280c3016q5885r4513C1959c27197d1300j1660l5902E5851K2001L3189
11810A11041J77756K3897i8061B15608g0569B13951a18773C46308j58249e4383
$$ y = [-191967, 399690, -236057, -65960, 316744, 133626, -96393, -66601, 75502, -106140, -193854, 315603, 23110, -134667, -107359, -235995, 91714, -197827, 77288, -115492, 151694, -142144, 7447, -56919, -21870, -366049, -202878, 158930, 38867, -187022, 245056, 107969, 123250, 37374, -214853, 193735, -2267, -124139, 217095, -35324, -83755, 115956, -108234, -192956, 102185, 36392, -207370, 239181, 104099, 66377, 135674, -62802, 97294, -408568, -99535, -11638, -31356, -109016, 117390, -78325, 76550, -213109, -62511, 95371, 40887, -250888, 39280, -33016, -118901, -213414, 31959, -327197, -41300, -52960, -88862, 55851, 77852, 111041, 288797, 312694, -98061, 215608, -70569, 213951, -118773, 346308, 188059, -54383]
11799d4410F8799a09703k24661i9600r4497B48332d62665d2435k70370a0317C707
11787a93185B97798a12924D9239b59925R3304B47271a51398A98872a39716o8316
11777b08032K1596B45449h614k3842j1459H0991b9094p5313G4816b2835B2749
11765c5762B70253a86204P9179j31354B2902g7281j60867E5758c09524l9922j71063
11754e20509H452O1995B2558a23270L9722L2126p2814B77576A18573J21787A11407
11742B36286a12399K8117B25232r9130b52563h2142D1674J42910i5228r0234e228
11730D51123k04439a71436A38925m0927a44450d1075l13435A45578d4858B43761
11719b39257G0279R3240a44115a36E612e4333D8267Q4547K9103b37386e0244a413
$$ y = [-44410, 68799, -109703, -334364, -99600, -194097, 248332, -462665, -42435, -312805, -10317, 3707, -193185, 297798, -112924, 49239, -259925, -166621, 247271, -151398, 198872, -139716, -208032, -186436, 245449, -8614, -32456, -43915, 80991, -29094, -104407, 74816, -22835, 22749, -35762, 270253, -186204, -107025, -238379, 22902, -77281, -238148, 55758, -309524, -349446, -520509, 8452, 70447, 22558, -123270, -83548, -51422, -124236, 277576, 118573, 240360, 111407, 236286, -112399, -84282, 225232, 126102, -252563, -82142, 41674, 184584, -95228, -185462, -5228, 451123, 246684, -171436, 138925, 97998, -144450, -41075, -354510, 145578, -44858, 243761, -239257, 70279, 163519, -144115, -136, 5612, -54333, 48267, 132814, 161917, -237386, -50244, -1413]
11706a07306A24124B1264J15853l6188M3415m0287R5939G9042b53687I0662D1785
11694A1521K7690J92527c5022B22939e8171C4707A2371J70818a68189D2667P3307
11683A15974k3004d5399A83105h248A73276d2925F3746b08324D01767C8725a57319
11671A57632K9694I3331A730b43893C0964a9153n3076B20435q2050a93682B36515
11659b09944e8606B23723E9367K6395b765l01462B70307I542L51379a44046E6522
11647B63210e8413G876b97197H3506b52632D0986K38747H7306O1299R0735A14371
11635A73901B075b61623A95472F6549a47543A6855Q9319K46084o821a36190a8164
11623c7790j88857i9318l01116C16108b41702A52843K61573d4299A13075N29a55446
$$ y = [-107306, 124124, 21264, 137117, 100929, 144344, 104057, 199996, 79042, -253687, 90662, 41785, 11521, 39211, 231738, -35022, 222939, -58171, 34707, 12371, 183189, -168189, 42667, 115974, 92970, -45399, 183105, -8248, 173276, -42925, 63746, -208324, 401767, 38725, -157319, 157632, 187326, 93331, 1730, -243893, 30964, -19153, -72229, 220435, 138385, -193682, 236515, -209944, -58606, 223723, 59367, 85762, -2765, -304227, 270307, 9542, 360921, -144046, 56522, 263210, -58413, 7876, -297197, 83506, -252632, 40986, 279733, 87306, 148605, 239340, 114371, 173901, 2075, -261623, 195472, 66549, -147543, 16855, 106174, 352258, 345437, -136190, -18164, -37790, -226647, -99318, -400434, 316108, -241702, 152843, 414416, -44299, 113075, 113604, -155446]
11611F8008P0125J01011l3239R8830E9833J30305E9038j4728J10758d7261E8639
11599C15605a6328A7323a14809A27889m2492d8693A30248D1310c25930J40967
11589a84963A16149J52613A18557N20219a25999o7210a8282A20245l0392k5864
11579F3989K9995j1902L9823n6128n087c7343g213k16821A6832e1668A87601J0035
11567A97636n9588F2106R4302O1818j9341I4533e0929b2328I4796e4140D7812
11555d4065A17643r91P8148K2208c6172A85237L29735A37586e8715Q200A63089
11543C6905M1751J6374a04920A79169a40824C7147J03773F0929a79346f8239B19920
11531f1744l4545H8694d7110J4070C03215b94594C15678j19552q2634J38793j9462
$$ y = [68008, 138133, 239144, 205905, 304735, 59833, 190138, 59038, 44310, 155068, -47261, 58639, 315605, -16328, 17323, -114809, 127889, 85397, -48693, 130248, 41310, -325930, -184963, 116149, 268762, 118557, 638776, -125999, -193209, -18282, 120245, 89853, 63989, 93984, 82082, 121905, 65777, 60690, -37343, -7213, -224034, 16832, -51668, 187601, 197636, 138048, 62106, 156408, 218226, 198885, 94533, -50929, -22328, 94796, -54140, 47812, -44065, 117643, 116652, 194800, 217008, -36172, 185237, 514972, 137586, -58715, -50515, 163089, 36905, 78656, 95030, -104920, 179169, -140824, 37147, 140920, 60929, -179346, -68239, 219920, -61744, -96289, 88694, -47110, -33040, 303215, -294594, 315678, 196126, 113492, 252285, 232823]
11520B32823q6010D5349a9813E2482J37977a94912B58934J61413l1386j61293
11510B27668H4157J74486j922K5699l9978A09294D4914R5341J45410a2181a229
11498b3744E6799J63636L0942A00241O9354F6379e2392k60709B22404J02017j19581
11487B04840J7884J47441A25997n9838Q6971A473d227I0848b58639D0744J77003
11476B17747N1908J47731a335A5292Q258K72047a0696A56205J28602l7574a98873
11464D8724a2553m0837B18373A6265J68179q6685K72440A58335Q365L1273G9073
11452B0688o097J73064a46092H5923k3275l906L05692a97356A65185i2338A29556
11440C16137c12776C69402A25603a9004A73164a71049K2047a8226B46334d35747
$$ y = [232823, 146813, 45349, -19813, 52482, 190459, -194912, 258934, 420347, 388961, 227668, 84157, 258643, 256721, 282420, 242442, 109294, 44914, 140255, 285665, -12181, -1229, -23744, 56799, 220435, 251377, 100241, 169595, 66379, -52392, -313101, 222404, 324421, 204840, 222724, 370165, 125997, 66159, 153130, 1473, -4227, 90848, -258639, 40744, 217747, 269655, 417386, -1335, 15292, 23550, 295597, -10696, 156205, 284807, 247233, -198873, 48724, -12553, -53390, 218373, 16265, 184444, 97759, 370199, 158335, 166700, 197973, 79073, 20688, 14591, 187655, -146092, 85923, 62648, 58742, 364434, -197356, 165185, -92338, 129556, 316137, -312776, 369402, 125603, -19004, 173164, -171049, -149002, -18226, 246334, -435747]
11429C71340A71997M810a64963B17103J13986b24032i1911j27416a6706j36467
11419a53173E3302L55385e0234A37484b6771p3401L69D2577D317a34727L9439
11408i5288j02028B05246P8140I0146J00803k4502m0791a23556A79401K4775c42572
11396A02242b99180A33596c0122D9870g3359p3676K2312M8430n8765l2813g647
11384H6073B4413a55652A95365H6923i6012F367c8126A7021b18958B59400A24973
11372e1537r774D298J05884b31505j12916h2485j09952c9572G7363J55442a19972
11360a93894H3229b5264J0273A13651a80216B8168P8799J174a41774J122A78566
11348B19512D3018i9009E4961K85940a05621b9683r6891P112B58028A173J5685
$$ y = [371340, 171997, 176807, -164963, 217103, 331089, -224032, -91911, -219327, -16706, -153173, 53302, 408687, -50234, 137484, -26771, -100172, -99803, 42577, 4317, -134727, -95288, -197316, 205246, 283386, 90146, 190949, 166447, 125656, -123556, 179401, 204176, -342572, 102242, -299180, 133596, -30122, 49870, -73359, -147035, -124723, -76293, -135058, -167871, -7647, 86073, 24413, -155652, 195365, 86923, -96012, 6367, -38126, 17021, -218958, 259400, 124973, -51537, -61311, 4298, 110182, -231505, -344421, -82485, -192437, -39572, 77363, 232805, -119972, -193894, 83229, -25264, -14991, 113651, -180216, 28168, 106967, 108141, -141774, -140652, 178566, 219512, 43018, -99009, 54961, 340901, -105621, -29683, -126574, -119462, 258028, 1173, 16858]
11337A6858J06158n2365d9118A92150H8369a0799B36555a4807D3782A4317A890
11325a32494J9896G8067O161a933G5540C618c99544C02289a90940A23595b4179
11313A41245b16911a6268q0438A65620D6848J85905b08679B13619K38999b43606
11302a45664C68L62043A09529a98412F124c6460k07097i3227j17303a4157I1786
11290B34560A2764N0300M5361a41117f7685b1193K31j5518B5214a11158n254k23472
11278c39884A46050a96083C78689C6529P336a82765R0587B20372a24177k1930
11268a46107o076B12600a42120A32832J3160a84504D6114b36822e2952A25769
11257A7215b91245a30894b3253A21666a27463j28325d8617o3951C1353b78979
$$ y = [16858, 123016, 70651, -49118, 192150, 88369, -10799, 236555, -14807, 43782, 14317, 1890, -132494, -112598, 78067, 84228, -1933, 75540, 3618, -399544, 302289, -190940, 123595, -24179, 141245, -216911, -16268, -96706, 165620, 46848, 232753, -208679, 213619, 452618, -243606, -145664, 368, 362411, 109529, -198412, 6124, -36460, -243557, -93227, -210530, -14157, 91786, 234560, 12764, 63064, 108425, -141117, -67685, -21193, -20962, -36480, 25214, -111158, -116412, -339884, 146050, -196083, 378689, 36529, 43865, -182765, -92178, 220372, -124177, -146107, -152183, 212600, -142120, 132832, 145992, -184504, 46114, -236822, -52952, 125769, 17215, -291245, -130894, -23253, 121666, -127463, -255788, -48617, -112568, 31353, -278979]
11246d38726a85875A38866M3181H2588h418j68503B09506q8770b0759r465l9636
11235f9860j31330A51203g8466G0932g6478j05205j19003b7064l1911A20431a49253
11223a17600k9636C3861a51147g2104G8912d7949C63130H0220h4758A24320h70
11211b05262F6158B1067a58543b1239D4022b24713A17611a70051E0340g8700L7687
11200d1013A82784h0360k49784L8831A62534a9585l4385l5451A91166b65521A25801
11188A52520E4988a71429k8065l7029P0690C51364a6055j6123k26773d4712j06647
11177a51359L7714K8685H1197a6263B20809F6557b20159J07550q057m492A72296
11165G29K59351K6256e0990k78869J24194c1929A6840k231K7786b8246k51707
$$ y = [-438726, -185875, 138866, 182047, 82588, -8418, -176921, 209506, 120736, -20759, -30224, -69860, -201190, 151203, -78466, 70932, -76478, -181683, -300686, -27064, -58975, 120431, -149253, -117600, -147236, 33861, -151147, -72104, 78912, -47949, 363130, 80220, -84758, 124320, -870, -205262, 66158, 21067, -158543, -21239, 44022, -224713, 117611, -170051, 50340, -78700, -41013, 182784, -80360, -330144, -291313, 162534, -19585, -53970, -89421, 191166, -265521, 125801, 152520, 54988, -171429, -199494, -236523, -165833, 351364, -16055, -32178, -258951, -44712, -151359, -113645, -84960, 81197, -16263, 220809, 66557, -220159, -112609, -120666, -125158, 172296, 729, 260080, 286336, -50990, -329859, -205665, -31929, 16840, 14609, 42395, -28246, -279953]
11154b79953C000c09432K016J41207o7087J10836m0684k7006N4437K6289k20050
11143c29474P4636k1514a8983A44215J93424E0274K04048h7459B4449b83j59380
11132a59663A68821c02516A18573l1222o31j9440c9730k17523A1792J61687b2797
11120G6127c79965B21304f4755b0416A95622i4919A46946R8376q9424g3883m5968
11109a19851D92623B44999j07223g2408C82253A87736I937a62577D83516q6735
11099C96781j26301p1074p1088R5553o7122N7237M0477j18585n7804L06011A81319
11087B18293J85663j73407G8756Q3505K36543j04067J77418A12748J15658L8791
11077B67197j1593m8892N4303K8144K6574j36094K86932j2340n5108R119k0030
$$ y = [-279953, 3000, -309432, -307416, -166209, -233296, -122460, -163144, -190150, -135713, -109424, -329474, -254838, -276352, -18983, 144215, 337639, 50274, 254322, -87459, 24449, -283, -159663, 168821, -302516, 118573, 87351, 86720, 67280, -39730, -257253, 11792, 173479, -22797, 76127, -379965, 221304, -64755, -20416, 195622, -94919, 146946, 245322, 155898, -73883, -119851, 492623, 244999, 137776, -72408, 382253, 187736, 9937, -162577, 483516, 396781, 270480, 199406, 128318, 223871, 156749, 213986, 254463, 135878, 78074, 384085, 181319, 218293, 403956, 230549, 78756, 162261, 398804, 294737, 472155, 112748, 228406, 267197, 255604, 206712, 261015, 289159, 315733, 179639, 466571, 454231, 399123, 408242, 388212]
11066C88212r9707J59000L8119q7204L95296k9720l64273M49760l6787q1130n1411
11055F80155m2376k14883P38730E80590J78194r207n2356Q5973J58154k87019
11045F54329J39366M73022l53003J46939k74725j9899K92112m85548K31528j53094
11035F51027L53707r4033M1792k02323N0876r4621N6050k86597K56398P9626J36942
11024I48844k42897P4380O1059j52917k47170K09593J08735k22217K78612J73061
11014I89083j94185J18360l40612j1948L22364l26981J92357j05983J87189j8293
11004H11351j70334J56447r6647p9839N17810l77102J97580N7403o0194K99707
10994A256182n01515P1559m1764Q9357R5270l27531K87488K2959j83481M77654
$$ y = [388212, 288505, 447505, 485624, 398420, 793716, 763996, 399723, 849483, 812696, 731566, 680155, 637779, 422896, 1161626, 580590, 758784, 749577, 697221, 783194, 941348, 654329, 793695, 1266717, 913714, 1060653, 785928, 766029, 1058141, 572593, 804121, 651027, 1004734, 910701, 952493, 750170, 801046, 706425, 762475, 475878, 732276, 811902, 948844, 705947, 780327, 841386, 688469, 441299, 650892, 759627, 537410, 816022, 989083, 794898, 913258, 572646, 560698, 883062, 556081, 748438, 642455, 829644, 811351, 641017, 797464, 700817, 620978, 1138788, 761686, 959266, 1016669, 956475, 1256182, 754667, 826226, 784462, 873819, 969089, 641558, 929046, 952005, 768524, 1246178]
10984A246178j50854J63674K55627R8511j59421K23924N93425k73274J38124O09059
10974B744973k19652M70214p5576Q8232N11651m17190k63073M619p45342K42561
10964B341417o19223q139p3903j96951l9826L13050L0024k48830J01225M2722
10954A641566n09189K6037m37963L21238l29852k26665A78628K56425q9889A46472
10943A86386Q8767j8882Q64A11932a03269B11736a04826d8924B81817J41559a92759
10931A73609a00067B28094b96474a33550A02331j1761c7703k5559I6236b31767
10920A33777J47861d37913A08643J2323d8604j07973A93331j6672J04498d64840
10909A1328a36763F0065K45317H822a22477G9734e5316p3130M8709k17792e205
$$ y = [1246178, 1095324, 1258998, 1514625, 1613136, 1453715, 1677639, 2271064, 1997790, 2135914, 2744973, 2525321, 2995535, 2919959, 3008191, 3519842, 3102652, 2839579, 2844198, 2098856, 2341417, 1722194, 1714055, 1640152, 1443201, 1403375, 1716425, 1746449, 1497619, 1598844, 1641566, 1132377, 1158414, 720451, 1041689, 711837, 485172, 178628, 435053, 345164, 146472, 186386, 275153, 256271, 257135, 111932, -103269, 211736, -104826, -48924, 281817, 423376, -192759, 173609, -100067, 228094, -296474, -133550, 102331, 90570, -37703, -63262, 96236, -231767, 133777, 281638, -437913, 108643, 120966, -48604, -156577, 193331, 176659, 281157, -464840, 11328, -136763, 60065, 305382, 8822, -122477, 79734, -55316, -128446, -79737, -297529, -5205]
10897a93963A98610m8209h1554A86520H1408P360g5146C3981K81476g4914D0257
10885A2628b26628a01026K4869I7118b0960j8582r2608q4598A12344d9622B06023
10873B03303b70310B9129O976b7840A13735b91140A79437K9356C3185f6996A08794
10861b71315D86c0492I0798P642b58969d3333j09997E1954a9110B60K04688J20
10849B05068i6495B61670j03551H63L07798A01066a14128A35483l8696b56961
10838A19156a88732l9510h112q3391B64598A24068a0652C9472b36027f7284B6598
10826i5497m413p2923E1688b37237Q3322j04446C8907o606J34888h107k5071j25741
10814a58919R349F7811j3405c556k49625G7680Q0318C1846L4653N6986h3065B19773
$$ y = [-193963, 198610, 150401, -81554, 186520, 81408, 88768, -75146, 33981, 315457, -74914, 40257, 12628, -226628, -101026, -76157, 97118, -20960, -39542, -132150, -216748, 112344, -49622, 206023, 203303, -270310, 29129, 36105, -27840, 113735, -291140, 179437, 208793, 33185, -66996, 108794, -271315, 486, -30492, 90798, 98440, -258969, -43333, -153330, 51954, -19110, 260, 204948, 205068, -96495, 261670, 158119, 863, 308661, 101066, -114128, 135483, 96787, -256961, 119156, -188732, -228242, -8112, -91503, 264598, 124068, -10652, 39472, -236027, -67284, 26598, -95497, -99910, -172833, 51688, -237237, -153915, -258361, 38907, 32301, 167189, -8107, -33178, -158919, -149570, 67811, 54406, -3556, -253181, 77680, 157998, 31846, 66499, 123485, -83065, 219773]
10801b32384B4669P1924A5667a83618D3864c0047f430D1249i4087a048l1381o873
10789c9302A51428E0790a34072D9536J48710h0981l5790A43570a30727A25218
10778f2766k44296A5506b37670A7814a89229d2001A89105a92136b2432k87232
10768c09664A6658J55373a35310c9092l83747e0580o8442j17428M2296A64347
10757E1581i6617r5120J6265A83971j9878a59896q953B88061b42740A09581e9825
10745B24726L2880D8983a38942j45214A84397b72709O1590e2660o3667l66430
10735d82757g1167I3007a59652l0473B05440a03943A51526a23475A38098b77896
10724i2040O732E9756J07026c5221j80772e3889A6057J367K1740b84111D6072
$$ y = [-232384, 24669, 96593, 15667, -183618, 43864, -30047, -6430, 41249, -94087, -1048, -32429, -39302, 151428, 50790, -134072, 49536, 198246, -80981, -116771, 143570, -130727, 125218, -62766, -307062, 15506, -237670, 17814, -189229, -42001, 189105, -192136, -22432, -309664, 16658, 172031, -135310, -39092, -422839, -50580, -119022, -236450, -194154, 164347, 51581, -96617, -191737, -175472, 183971, 164093, -159896, -168849, 288061, -242740, 109581, -59825, 224726, 257606, 48983, -138942, -284156, 184397, -272709, -211119, -52660, -116327, -482757, -71167, 93007, -159652, -190125, 205440, -103943, 151526, -123475, 138098, -277896, -92040, -85308, 59756, 166782, -35221, -215993, -53889, 16057, 17424, 39164, -284111, 46072]
10712C01916i7740j15816f052k11641M4224e3457E331h4530c3967q8115m1561
10701a63643E2764G129e7793C362a26647j1020E39b83207j6916A15294b65709
10689E097J32854J8903b50021M0722C6527L8249a54877N8669k14522a099A0635
10677a63463a3839m74460B04147a37915e2542C87551b42739A65836a34353A37507
10666C3053M913K05783a68340p0589c7772l84573a84327A34598b2809j90029a03045
10654a87157h9700p99B65489c4734H2423a34726A21986g5154A98636a58567j82570
10643c41137i4900B39375a69792A3072d4452k31599j27612C34233a86589k7994
10633b14583B12475c08869h8119j44870B84718A0861Q5969A1034J47428K05014
$$ y = [301916, -97740, -213556, -6052, -217693, -173469, -53457, 5331, -84530, -33967, -122082, -163643, 52764, 7129, -57793, 3362, -126647, -137667, 539, -283207, -300123, 115294, -265709, 5097, 137951, 156854, -250021, -209299, 36527, 74776, -154877, -96208, -310730, -1099, 10635, -163463, -13839, -488299, 204147, -137915, -52542, 387551, -242739, 165836, -134353, 137507, 33053, 37966, 243749, -168340, -238929, -37772, -422345, -184327, 134598, -22809, -212838, -103045, -187157, -89700, -90499, 265489, -34734, 82423, -134726, 121986, -75154, 198636, -158567, -341137, -94900, 239375, -169792, 13072, -44452, -276051, -403663, 334233, -186589, -214583, 212475, -308869, -88119, -232989, 284718, 10861, 96830, 11034, 158462, 363476]
10623C63476a59368P3672m1857l02538a32894K0981m6279b8716G6413B9930e2838
10611F0406a69121b823k35900P5814m509B3022m065a0370E0100J60532p9484d21527
10598B66715b31928a08037A38636c78440J88350A01480J02330h5703b1561B54414
10587C662d2268j5845Q099q7535d9839F012c37296D09750F3115d7696B19073b17031
10574A18891D579a8881l48280e2401K3695l9497E3187e0415P6m3235k6434A57509
10561a16256A33575B6385R1658g5564l81731B99345q8380B7853c2374j53893A02262
10549a9528B70856a3789H9598h732q4232k24494H6423a90495l4379j44864D49095
10537c89115g1552k4628J2259k6554r5265Q1558e9560B86844g6419C2806m406
$$ y = [363476, -159368, -85696, -127553, -430091, -132894, -111913, -158192, -28716, 76413, 29930, -52838, 60406, -169121, -2823, -238723, -162909, -167418, 23022, 18957, -10370, 50100, 210632, 131148, -421527, 266715, -231928, -108037, 138636, -378440, -190090, 101480, 203810, -85703, -21561, 254414, 3662, -42268, -58113, -50014, -137549, -49839, 6012, -337296, 409750, 63115, -47696, 219073, -217031, 118891, 4579, -18881, -367161, -52401, -28706, -68203, 53187, -50415, -50339, -93574, -120008, 157509, -116256, 133575, 26385, 118043, -75564, -457295, 299345, 210965, 27853, -32374, -186267, 102262, -19528, 270856, -13789, 89598, -8732, -92964, -317458, 86423, -190495, -224874, -369738, 449095, -389115, -71552, -96180, -83921, -110475, -205740, -124182, -59560, 286844, -76419, 32806, 28400]
10526B8400c3322g409j51019e648m6767F1521c08805I2054h7412A95113F530b9557
10513A25021L3126a77635B06951c8666A318c22351J23319B91666E6027a26192
10502d4937j28206j04653Q2406P0236B20343G2410a49173G0336e4165m1187F2831
10490A20909Q8597g8916m33675A09245n2594J218L05009K19571B68366J64495
10480D32861E1321L87437a60908B67320D8513Q6123a46636O3572k2665L0109p5844
10469a51464c7633m193A91930e3817j64803B40068c8195C2488J02429c00331C5102
10457a39593A2478b38559e1590p2006B5260Q7211b03454a00325j61408j15994
10447c77727a65570K8845c7513j68940D3234L63031d0406k12707a12342M6783
$$ y = [28400, -33322, -7409, -158428, -5648, -52415, 61521, -308805, 92054, -87412, 195113, 6530, -29557, 125021, 158147, -177635, 206951, -38666, 1318, -322351, -199032, 291666, 56027, -126192, -44937, -173143, -277796, -195390, -125154, 220343, 72410, -149173, 70336, -54165, -95352, 62831, 120909, 209506, -78916, -512591, 109245, 56651, 57869, 362878, 582449, 268366, 432861, 51321, 438758, -160908, 267320, 48513, 134636, -146636, -83064, -105729, -75620, -151464, -37633, -41826, 191930, -53817, -218620, 240068, -38195, 32488, 134917, -300331, 35102, -139593, 12478, -238559, -51590, -123596, 25260, 112471, -203454, -100325, -261733, -377727, -165570, -136725, -37513, -206453, 43234, 406265, -40406, -253113, -112342, -65559]
10437f5559B19345d7521B20602a25302H63L04987a45953k05470J28092Q7699H10
10425c2704l71142f3188j58852d4617Q100C6072A2196J97655c00940A1606J11063
10414A22669a84238e0634j91633A17497a43037A2888b4745F7537K7960H34d5593
10402B44650c08210o3759i4468J9344r0254G8751J15564a9776B51569K07849A19679
10390c1039B91140F5905A883J29685J21562r2060i0985C77472j88378a92724A88451
10378d5674D03076H5666l0500L86402j65260N8956n465O9647j13024B525M31894
10367D34419L12495B59974K06802J9655o4724q2603j37720h1120B83999j293G6105
10355E57300F3100L33246o1822J38757j35492K8194L65771k18531j20623A21039
$$ y = [-65559, 219345, -47521, 220602, -125302, 863, 305850, -145953, -351423, -223331, -135632, 810, -32704, -403846, -63188, -222040, -44617, -36517, 36072, 12196, 209851, -300940, 11606, 122669, -184238, -50634, -242267, 117497, -143037, 12888, -24745, 67537, 95497, 834, -45593, 244650, -308210, -371969, -94468, -75124, -165378, 78751, 194315, -19776, 251569, 459418, 119679, -31039, 291140, 65905, 1883, 131568, 253130, 161070, -90985, 377472, 189094, -192724, 188451, -45674, 403076, 85666, 55166, 441568, 276308, 335264, 329799, 399446, 286422, 2525, 434419, 746914, 259974, 466776, 486431, 421707, 339104, 201384, -81120, 283999, 282706, 76105, 557300, 63100, 396346, 334524, 473281, 337789, 365983, 731754, 513223, 392600, 121039]
10344D38340A07597K83698j21855O5509A25984d8081D25298j10480n3050K25088
10334D86856a9475A3347J91567a45448I8569J64488r6383g365B50528N0604m6172
10323B54960L9124C9505P2005i7282d5901A25368L80815e0279C8482K13824h9573
10311A2512i577C9898O4306i2622j76615C35061e3701n5116n6387r888E9363a21722
10298a63820A68261a61794j34322a03027A94977o8949l9288P710r491e5118B39693
10286A99948l7789e746l69075a78493A47830b85695G7877p411b41963c2145j14879
10275a47024H0469K27274G4642e696j46712A0789a86222N6970F5544J97499A03475
10263D60278h5364A35894J23416J94990B07768K10342m8556B6628Q5615G388K8958
$$ y = [438340, 107597, 391295, 269440, 334949, 125984, -48081, 425298, 314818, 261768, 486856, -19475, 13347, 204914, -145448, 98569, 263057, 166674, -7365, 250528, 301132, 254960, 294084, 39505, 111510, -97282, -45901, 125368, 506183, -50279, 38482, 252306, -89573, 12512, -9577, 39898, 104204, -92622, -269237, 335061, -53701, -108817, -165204, -175092, 59363, -121722, -163820, 168261, -161794, -296116, -103027, 194977, 126028, 86740, 94450, 84959, -55118, 239693, 199948, 162159, -5746, -374821, -178493, 147830, -285695, 77877, 70466, -241963, -32145, -147024, 80469, 307743, 74642, -5696, -152408, 10789, -186222, -129252, 65544, 263043, 103475, 460278, -85364, 135894, 259310, 454300, 207768, 418110, 369554, 26628, 112243, 7388, 36346]
10252C6346a85820f7371J4869k27390B57675a34474J667A6231J88083a27276B69817
10240f1329l28421B7950p634b75150m5184C74772f1892c0009j44781A54339e80792
10228c09493C8621b11215B87529D4791J11801n7379D2901c91893a85159J8289
10218a66870C7340b31259l67A67060c45534J57188H2406b58939A26977f9982p0116
10207a40098H6235A3581f8305A64036a7574o2158A95973B4744c72974a72888O9202
10196a03686b8220k33189C53133C0537c0813F7377K3862A2501k923b01603h815
10184g8582A98496f2546j40385j13273J41443C45645g3173B98024i4916C1312
10173b8042j37708l08358a55784a9165j09708b4147j62277a3668l51263P5265
$$ y = [36346, -185820, -67371, -52502, -279892, 257675, -134474, -132807, 16231, 204314, -127276, 269817, -61329, -389750, 27950, 20316, -275150, -320334, 374772, -61892, -30009, -174790, 154339, -580792, -309493, 38621, -211215, 287529, 44791, 156592, 99213, 42901, -391893, -185159, -166870, 37340, -231259, -231626, 167060, -345534, -188346, 82406, -258939, 126977, -69982, -140098, 86235, 13581, -68305, 164036, -17574, -79732, 195973, 24744, -372974, -172888, -103686, -28220, -261409, 353133, 30537, -30813, 67377, 91239, 12501, 9578, -201603, -8815, -78582, 198496, -62546, -202931, -316204, -174761, 345645, -73173, 298024, -94916, 31312, -28042, -165750, -474108, -155784, -19165, -128873, -24147, -186424, -13668, -364931, -289666]
10163b89666A13578k3563J61747A21736h5039C57424C7983M7428b91066A69498
10152b2145q8303n8608g8151n526C8338a6234p0983J6620j42333A23035a68254
10140D8339J59718b33880G3107a29536k85043a60420B00122a45807p0067R1028
10130a24846e6462k89876l4419h788m4914k44030A22068E000i0873b1705k49743
10119b71448E2803b48316A80706b11112A20004J84260b95268a07951K2725b4471
10108A18696c1978k81627J43581J3723B6804c03302a49343i524j17315K5722L505
10097i7612j25014A52349b39481M2867B34313C0821q79a30331H9133O7713a37714
10085c59613I6601g0570A8810g3540H1116b91133a23381J4618C56987a51401j50127
$$ y = [-289666, 113578, 90015, 251762, 121736, -85039, 357424, 37983, 85411, -291066, 169498, -22145, -110448, -169056, -78151, -83677, 38338, -16234, -87217, -70597, -212930, 123035, -168254, 48339, 208057, -233880, 73107, -129536, -414579, -160420, 200122, -145807, -215874, -124846, -56462, -346338, -380757, -8788, -53702, -297732, 122068, 5000, -90873, -21705, -271448, 52803, -248316, 180706, -211112, 120004, 304264, -295268, -107951, -85226, -24471, 118696, -31978, -313605, -170024, -156301, 26804, -303302, -149343, -9524, -126839, -101117, -97612, -222626, 152349, -239481, -196614, 234313, 30821, 29942, -130331, 89133, 156846, -137714, -359613, 96601, -70570, 18810, -73540, 81116, -291133, -123381, -108763, 356987, -151401, -301528]
10074c01528c0349C46845e524k83516d0906r4343B25097h2807F4408N2839D5934
10062d514B780a0440A00370a02144A03800K38656b45705A49206b07301D5061L6544
10051H1605q263a25303A24570a27965q7776f5458l7883j46263F1977d4250m5215
10040h9465H4832J1489m6346h267H3097a38244j26421l1438M7526k3227H2184
10028h3490r033C7700A4845c95858J34771K7125A41015C3339a41186b9471m2815
10017g2286A13998b85605N2631p2679A29741a7376j07797k46979Q2270d0512k80493
10006c21005i8842A25464a90333d0534E9822J46077a1908m39422A02729a25300
9995E7296p568J78003a46925B14681b29592A13755a4835F6425M5530J9738c04995
$$ y = [-301528, -30349, 346845, -5524, -289040, -40906, -135249, 225097, -82807, 64408, 117247, 45934, -4514, 2780, -10440, 100370, -102144, 103800, 342456, -245705, 149206, -207301, 45061, 81605, 73342, -125303, 124570, -127965, -215741, -65458, -103341, -249604, 61977, -44250, -89465, 84832, 96321, 49975, -8267, 83097, -138244, -264665, -296103, -248577, -271804, 82184, -83490, -92523, 37700, 14845, -395858, -261087, -233962, 141015, 33339, -141186, -29471, -72286, 113998, -285605, -232974, -305653, 129741, -17376, -125173, -372152, -289882, -40512, -321005, -98842, 125464, -190333, -40534, 59822, 205899, -11908, -451330, 102729, -125300, 57296, 49728, 227731, -146925, 214681, -229592, 113755, -14835, 66425, 111955, 131693, -304995]
9983a0414A72594m9646b86712a3805p5159k2247c0695B68830b29104c4549J1458
9972b3091k66451G2609d80938A11001l9735a6020j23205c848A16646a43987M0070
9961a03917E04518a56890H4866c14753a22260a0310L061n640B6650b70295C101
9949C6894J16498a13909q6932A39871f9585j86179h6905R594C7729F54i8879j5377
9937a14256R80b6228l62778J25968B78592q3308a81271J4585c5903n6363L2620
9926e9646K1907H5624h5433j23123M8393o1604k55665K33969B61265B0190a94377
9914i3781n8761k7237n8347j46119J14939P5410j53266f5386A66676a5587j06659
9903a22246B4753b61936A99261b62219p3795a36964b8829n5699L2995j89902C84071
$$ y = [-10414, 172594, 122948, -286712, -13805, -88964, -111211, -30695, 268830, -229104, -34549, -23091, -289542, 72609, -480938, 111001, 71266, -16020, -139225, -3848, 116646, -143987, -103917, 504518, -156890, 84866, -314753, -122260, -10310, -7249, -12889, 26650, -270295, 3101, 36894, 153392, -113909, -200841, 139871, -69585, -255764, -86905, -77311, 37729, 654, -98879, -114256, -113276, -26228, -389006, -263038, 278592, 195284, -181271, -166686, -35903, -92266, -59646, -37739, 85624, -85433, -208556, -160163, -221767, -477432, -243463, 261265, 20190, -194377, -93781, -152542, -179779, -238126, -384245, -269306, -193896, -347162, -65386, 166676, -15587, -122246, 24753, -261936, 199261, -262219, -336014, -136964, -28829, -84528, -51533, -241435, 384071]
9891B14434b12511A54634c54842a1908j83186A5027b13361P7615r1646A08399
9880A83199d146j0705k05967M4733Q5694m2589I2511a27931a651j54245E1695
9868A26640D5430j6998b01377B881P450J11239d7656B1235Q773R8265B5117d5826
9855a53064k6815A35815a9302i172A18046L4250K53571a78793A06064n141d8115
9843A40109l8527N2237n8491J03346k4510a71026l01289g4102G9458b00675B1692
9831a82403A4256N1527g5442D680J05393a05860q3484J7199J9675J4389j39923
9820b78004o5004J24476G374J75337a32461F4402k4690a22512j57330C05109j47874
9809A57235n8901b24729h6482G3278a67779h3419k8570A97793d2013k95296E0043
$$ y = [214434, -212511, 154634, -354842, -11908, -195094, 15027, -213361, -135746, -227392, 108399, 183199, -4146, -14851, -220818, -176085, -90391, -132980, 92511, -127931, -1651, -155896, 51695, 126640, 45430, 28432, -201377, 2881, 10331, 121570, -47656, 21235, 30008, 128273, 25117, -45826, -153064, -179879, 135815, -19302, -9172, 118046, 152296, 405867, -178793, 106064, 100923, -48115, 140109, 101582, 153819, 95328, 198674, 174164, -171026, -472315, -74102, 79458, -200675, 21692, -182403, 14256, 65783, -75442, 4680, 110073, -105860, -189344, -172145, -152470, -138081, -278004, -343008, -218532, 7374, 182711, -132461, 64402, 39712, -122512, -279842, 305109, 157235, 98334, -224729, -86482, 73278, -167779, -83419, -111989, 197793, -42013, -337309, 50043]
9797a37644j09457O9597Q8540c4739k98091A67528m6132g1438j13895B3333k999
9786B0334a81210A17780K6808b30336j04772J41924G0881a94739F1456e86585
9775I3017a9370A64786e162m11977i7835A52091D6115J46603j3553J01143g9021
9763H3611c96383c823F2884L4891i2421E3163J79862a98265A46620f786j56596
9752a63382E0599m635h3262P128c2323j57110L0636L0M5805H2089e0392p7003
9740a27395C06507B6412K83506b35164G6191j9418f0459l8981B29272b52168a3749
9728g4345k51633D3018J89391A03890a73293m9029Q9568j9341e2321a8914r449
9717b8363B0520q775b78298J2901n3220a55906b9988j57550J054K7786A55371
$$ y = [-137644, -247101, -177504, -88964, -34739, -332830, 167528, 121396, -71438, -185333, 23333, 20334, -181210, 117780, 144588, -230336, -335108, -193184, 70881, -194739, 61456, -586585, 93017, -19370, 164786, -5162, -417139, -97835, 152091, 46115, 192718, 179165, 280308, -79021, 83611, -396383, -3823, 62884, 97775, -92421, 53163, 233025, -198265, 146620, -6786, -163382, 50599, 45964, -83262, -76134, -32323, -189433, -158797, -158767, -112962, 82089, -50392, -127395, 306507, 26412, 309918, -235164, 76191, 56773, -60459, -99440, 229272, -252168, -13749, -74345, -325978, 43018, 232409, 103890, -173293, -222322, -132754, -152095, -52321, -18914, -28363, 20520, 11745, -278298, -265397, -318617, -155906, -29988, -187538, -186484, -158698, 155371]
9705a33858o7751o1967l5261J07972f2346A66339B90a60300f8485A1020b170j49378
9693a51548A20918a68691G1198l4502d6839H1158a59189j68812C03047l8393a16321
9681A6187b90601i9941C5878d60274B13299i1642d5300m0066n2089q2249D8839
9669c47590a68348A66820a09981l48778J83977e2899p6716A43874a35974O7667
9659f8307A70456D8404J02512B2580R9215b31304N232l1461e2946C80365a28755
9647e0802m4648j87949g3788j24A74411b91632J21837F4513J56278k0988a67298
9635b05415E9884a02815J8278F2422f4950j1466n8845E6608b28867f698k24697
9624b31395B3849e91484b38710A84510E9436d8016j19278C6804L00675g7576A74041
$$ y = [-133858, -201609, -263576, -298837, -190865, -62346, 166339, 290, -160300, -68485, 11020, -2170, -151548, 120918, -168691, 71198, 36696, -46839, 81158, -159189, -328001, 303047, 264654, -116321, 16187, -290601, -99941, 35878, -460274, 213299, -91642, -45300, -85366, -137455, -219704, 48839, -347590, -168348, 166820, -109981, -458759, -274782, -52899, -129615, 143874, -135974, -68307, 170456, 48404, 150916, 22580, 121795, -231304, -226072, -257533, -52946, 380365, -128755, -50802, -95450, -283399, -73788, -73912, 174411, -291632, -169795, 64513, 220791, 199803, -167298, -205415, 59884, -102815, -84537, 62422, -64950, -76416, -135261, 56608, -228867, -6698, -231395, 23849, -591484, -238710, 184510, 59436, -48016, -167294, 36804, 337479, -77576, 174041]
9612A01015a56441C55328c12764a9057A95142C181b48763J848H5497c30795a22675
9600A8190a97384A74603c31015b6533H3325c05894A34624h9718E8794A7688c94858
9588A78092D9059e1429Q336J7579k44186a12868J9911n8476A33149D2244M5865
9577H8109a9330D4071c4582A9420J12722h4620A10796a21053j53580b1033n14522
9566e35555J96582O2443J01477K2654B09366b386j57097g3526k15236a13979C03617
9554a3874m8122B08476n749c31650O0972J27397G0647q144b92030R6343g0551
9542e409J165B9290a94173b4994k9827A16369f5425j18666B8565a36950k05817
9531c42767e7280j04696o1038B16878o6759a32690A93376L1147J89J64829g9403
$$ y = [101015, -156441, 355328, -312764, -19057, 195142, 3181, -248763, -246915, 85497, -330795, -122675, 18190, -197384, 174603, -331015, -26533, 83325, -305894, 134624, -89718, 58794, 17688, -394858, 178092, 49059, -51429, -43093, -25514, -269700, -112868, -92957, -151433, 133149, 42244, 88109, -19330, 44071, -34582, 19420, 132142, -84620, 110796, -121053, -274633, -21033, -535555, -338973, -276530, -175053, -152399, 209366, -2386, -159483, -73526, -288762, -113979, 303617, -13874, -61996, 208476, 202727, -331650, -270678, -143281, 70647, 62503, -292030, -195687, -70551, -5409, -4244, 29290, -194173, -24994, -54821, 116369, -65425, -184091, 28565, -136950, -342767, -57280, -161976, -223014, 216878, 150119, -132690, 193376, 224523, 224712, 389541, -79403]
9519a24665k77717d6365m248k79979F1492b7790l1329j43014A2626h6213q2692
9508a68905M9200k5956L1595L8346k5270j02156O7450q0442H8371B2612c28677
9496A12614B8420A0126L91205a11723J8923A33922b91506j15311d9441p9656H7148
9484b5556j03506H7778R6480A8556b79242a7688A44398C666J33861a48130L8910
9473a09220J4562E5275c7379n2493A9961a50834a6964q9349H6335a13812L0127
9462h3685l90592A36708i5252r534H3570F387a65468I257c2599C5997b6110C5570
9449b58574f2993A23783c59796i8962n9515e4032K964A23918b32587J13978G5754
9437A26388a04879K1342r3596B93836q8634a48900j90629J7699a30909k1228C82947
$$ y = [-124665, -402382, -46365, -50613, -330592, 61492, -27790, -59119, -202133, 12626, -86213, -168905, -119705, -145661, -114066, -75720, -100990, -203146, -135696, -216138, 88371, 22612, -328677, 112614, 28420, 10126, 401331, -111723, -92800, 133922, -291506, -406817, -49441, -129097, 87148, -25556, -129062, 87778, 184258, 18556, -279242, -17688, 144398, 3666, 137527, -148130, -109220, -94658, 55275, -37379, -89872, 19961, -150834, -16964, -106313, 86335, -113812, -83685, -474277, 136708, -95252, -104786, 83570, 6387, -165468, 9257, -32599, 35997, -26110, 35570, -258574, -62993, 123783, -359796, -98962, -158477, -54032, -51068, 123918, -232587, -118609, 75754, 126388, -104879, -83537, -177133, 293836, 205202, -148900, -339529, -321830, -130909, -152137, 382947]
9425f5214B36179c60182d3044j64889p3686B3124J05072G333d9974A00465c1545
9413c671I2218i3903q6529B90760c26204B34439c07392a08552j82366I8256M914
9402A03170C7714j0133Q079b13331M6448b268k17938a7041k28789H0004i3717
9390a78623F5004J54767A7450M6706J3656B6045a64681A826J4351a68588A39619
9378A20222a14597b9453j10821N8959j3731A82205D700O4885g6121o0036p6109
9367b12266k9336p4150h3789r0372A32497c62282B59524h1390A18964C7746a6632
9355b8273B33782b17570G034J6287J54682b17778R1426j85980m2343J37011j73238
9344c90902A07519d486C13517A5562Q5859e8499B21109B9135l726B094M29R5334
$$ y = [-65214, 236179, -360182, -43044, -207933, -281619, 23124, 128196, 7333, -49974, 100465, -31545, -3671, 92218, -93903, -180432, 290760, -326204, 234439, -307392, -108552, -290918, 98256, 103170, 37714, 27581, 35660, -213331, -166883, -2268, -220206, -17041, -245830, 80004, -93717, -178623, 65004, 219771, 17450, 64156, 77812, 26045, -164681, 1826, 16177, -168588, 139619, 120222, -114597, -29453, -140274, -81315, -95046, 182205, 4700, 69585, -76121, -136157, -212266, -241602, -315752, -83789, -174161, 132497, -362282, 259524, -81390, 118964, 37746, -16632, -28273, 233782, -217570, 7034, 23321, 178003, -217778, -126352, -312332, -354675, -217664, -390902, 107519, -4486, 313517, 15562, 101421, -58499, 221109, 29135, 25409, 2094, 2523, 97857]
9332I7857a100A75896o1688k3639b02755F3302N6970a87255c0988A55182j7829
9321A37353b43018A68078a92047A31562a8478A36365N632d4388B4008a74634B15397
9309c47560H3569d08620a14832A41281c00896B61829A26633B2921K18407A12510
9298a39254A4381a69989a1560G52a28311C8637c53645d7782H644h4125A3886P2842
9286H6728f0632B31604d14707a90640k16904K1944A33594d12031f5909F9856K7355
9275I7211N0070i2413A71907D6207K75473a30188B17472b65117A69769C8393f2094
9263h259j81879B31831r1038a64105k838o9081g8131n3692k24134H8503Q410R8217
9251A95130E6920A9239M6767b5128C01771a12922q8247k8808j7144G1233g521
$$ y = [97857, -1100, 175896, 114208, 90569, -202755, 63302, 120272, -187255, -30988, 155182, 137353, -243018, 168078, -192047, 131562, -18478, 136365, 141997, -44388, 24008, -174634, 215397, -347560, 83569, -408620, -114832, 141281, -300896, 261829, 126633, 22921, 241328, 112510, -139254, 14381, -169989, -11560, 752, -128311, 38637, -353645, -47782, 8644, -84125, 13886, 86728, -60632, 231604, -414707, -190640, -407544, -385600, 133594, -412031, -65909, 69856, 97211, 147281, -92413, 171907, 46207, 321680, -130188, 217472, -265117, 169769, 38393, -62094, -8259, -190138, 231831, 140793, -164105, -166943, -236024, -78131, -131823, -355957, 88503, 96913, 195130, 56920, 19239, 66006, -25128, 301771, -112922, -201169, -229977, -247121, 71233, -7521]
9239A00504b19418a6445B9482J13247f5369I9120a47739j27333J16058n6912j385
9228b17311A24028O5372a86136P8381m2190j49157c8210C0549R1659P0854a23748
9216b14943G1700d45663A82030J39341h1375l38946D8232M2132b72753o863P3078
9205b06538e6421E3244d0552I6449B80N8843P8266n330A3293Q78j391J93494a51791
9191A68648b72594i7374r090d0213k63574B70132E7750J008c8184l29649a41749
9179D3139a23922p4557B61777d6679j5939B84658C6052J92072c71923D5901J11318
9168A57219E7812b2589C8451b77144C9829c9807p5923N023c5786J4041k03560
9157b25305l30468B08390h7072n561j26271B20279C6951N6286c33791a8721A23949
$$ y = [100504, -219418, -16445, 29482, 142729, -65369, 99120, -147739, -275072, -159014, -215926, -217311, 124028, 189400, -186136, -107755, -149945, -299102, -38210, 30549, 122208, 193062, -123748, -214943, 71700, -445663, 182030, 321371, -81375, -420321, 48232, 90364, -272753, -279616, -206538, -56421, 53244, -40552, 96449, 280, 59123, 137389, 132059, 13293, 14171, 12780, 206274, -151791, 168648, -272594, -97374, -106464, -40213, -303787, 270132, 57750, 58758, -38184, -367833, -141749, 43139, -123922, -198479, 261777, -46679, -62618, 284658, 36052, 228124, -371923, 45901, 157219, 57812, -22589, 38451, -277144, 39829, -39807, -115730, -110707, -35786, -21745, -225305, -555773, 208390, -87072, -92633, -218904, 220279, 36951, 93237, -333791, -18721, 123949]
9145a43121j04026i4650A16013a05768B32341a43758j8660F5623M2280c6834j0736
9134d7570A40440a34627H1849a36174a624A35318B7209K62509a83658B09859a44790
9122D5022Q8198G027a34144q4592i918j03193J7927k29554a40873j0901P4576
9111g7198j68232h0747r325c1006j63647G5516e9499L154H0114c77608A84102
9099e9748m05834C9142e0082k33180g1602k0666E3552L07515F4271B3932N3274
9088G7206J0617a70429q908f2069B52725a06287A23794c17901k1569B68632j11347
9077A57285d9173p0278L4657p4219K5925A01611G791J12299J04790a92458B11731
9065b29184A0697a9043k7775G1017b4436j98961f7335b9241D79379B8816e4196
$$ y = [-143121, -247147, -94650, 116013, -105768, 232341, -143758, -162418, 65623, 107903, -36834, -47570, 140440, -134627, 81849, -136174, -1624, 135318, 27209, 289718, -183658, 209859, -144790, 45022, 133220, 7027, -134144, -218736, -9918, -113111, -95184, -324738, -140873, -151774, -77198, -245430, -80747, -90072, -31006, -194653, 75516, -59499, -56345, 80114, -377608, 184102, -59748, -465582, 39142, -50082, -283262, -71602, -92268, 53552, 361067, 64271, 23932, 77206, 87823, -170429, -179337, -62069, 252725, -106287, 123794, -317901, -339470, 268632, 157285, -49173, -119451, -84794, -159013, -133088, 101611, 7791, 120090, 224880, -192458, 211731, -229184, 10697, -19043, -46818, 71017, -24436, -223397, -67335, -29241, 479379, 28816, -54196]
9053G9368H496O2604J36413q6313K24608c0293C1413b83307a07744b8279B70051
9041h527k73359B43991a5186r5102l8241H1892b40352O9373H2017K06312d52083
9029A92024b5293m8765f035l88033E9473b25273I5103J28501a1949C42726F0709
9017c28698b80q1271q8799f9062A11249A8948a49355A46059C4990j0812a13874
9005b97406B21565d1648l6408A64735a77994H2910j5897a50757P5312F8785i3349
8993b20647n6258R8115F2980a23038D8391e5164C48843a09669I4543c44388k8949
8982c73337A17698C2173c48189A52345E8250b62954e9676F3032g7049m4444c7117
8970b27845F3422L6883e0791A69170a64757N4432j58420k6917m8008g5644r9772
$$ y = [79368, 8496, 71100, 207513, 121200, 345808, -30293, 31413, -283307, -107744, -28279, 270051, -8527, -281886, 243991, -15186, -110288, -148529, 81892, -240352, -170979, 82017, 288329, -452083, 192024, -25293, -74058, -6035, -394068, 59473, -225273, 95103, 223604, -11949, 342726, 60709, -328698, -280, -81551, -170350, -69062, 111249, 18948, -149355, 146059, 34990, 24178, -113874, -297406, 221565, -41648, -78056, 164735, -177994, 82910, 67013, -150757, -75445, 68785, -93349, -220647, -276905, -178790, 62980, -123038, 48391, -55164, 348843, -109669, 94543, -344388, -373337, 117698, 32173, -348189, 152345, 58250, -262954, -59676, 63032, -77049, -121493, -37117, -227845, 63422, 100305, -50791, 169170, -164757, -110325, -268745, -295662, -343670, -75644, -175416]
8959a75416p1524B47118I8061N1740a5203B9424h3216c5944B85093E9946J39531
8948A99477m1363n4022b88248b6185C6219M59232a48353E8602b5592C28268H9234
8936c56440E29236j74193A1535J28354o7869h9107B04247j00802b16872E46087
8925E29770K52775J340000L913886J2095890n138725E584167B441109A121646
8916H12655l72962j44717A14878J49047A25708H097M76055j57884j11268b13686
8905A73282b067j50352B05691o1776J37422j35937D9635J90018b56834A8322b17135
8893c87877e3733C9429a01028p5862q2229D3667J08087a96899c1470A36769c04338
8881c52106f4916l2019d1690k5696k14633d6350k7061I2514d7319j0524j36113
$$ y = [-175416, -246940, 247118, 98061, 149801, -15203, 29424, -83216, -35944, 285093, 59946, 199477, 158114, 104092, -288248, -26185, 36219, 495451, -148353, 58602, -25592, 328268, 89234, -356440, 529236, 355043, 11535, 139889, 72020, -89107, 204247, 103445, -216872, 546087, 529770, 782545, 2122545, 6036431, 18132321, 12993596, 5584167, 2441109, 1121646, 812655, 439693, 294976, 114878, 263925, 125708, 8097, 484152, 326268, 215000, -213686, 173282, -2067, -152419, 205691, 143915, 281337, 145400, 49635, 239653, -256834, 18322, -217135, -387877, -53733, 39429, -101028, -176890, -259119, 43667, 151754, -196899, -31470, 136769, -304338, -352106, -64916, -96935, -41690, -67386, -282019, -46350, -73411, 92514, -47319, -57843, -193956]
8870a93956F3884d4858j14770a5479B38419a48882a1466k14709g6260B5038g0497
8858d4782M109A38825b18821b8674j02489H3722b56182c8020f99B7144J30860
8847A58004b98144R1508C46446C496b51080c992m2593k47478N6046J06631F9437
$$ y = [-193956, 63884, -44858, -159628, -15479, 238419, -148882, -11466, -226175, -76260, 25038, -70497, -44782, -40673, 138825, -218821, -28674, -131163, 83722, -256182, -38020, -699, 27144, 158004, -298144, -206636, 346446, 3496, -251080, -3992, -46585, -294063, -238017, -131386, 69437]
$$ [...]
##END NTUPLES=NMR SPECTRUM
##END=
