##TITLE=AC1471_13FE002653_8027014_YZZf2qlXnJ
##JCAMPDX= 6.0         $$ Bruker NMR JCAMP-DX V2.0
##DATA TYPE= NMR SPECTRUM
##DATA CLASS= NTUPLES
##ORIGIN= BRUKER
##OWNER= Administrator
$$ 1.72 TOPSPIN		Version 2.1
$$ 2013-07-18 17:32:49.813 -0700  Administrator@X
$$ Compression mode = diff/dup
##.OBSERVE FREQUENCY= 400.02188249412
##.OBSERVE NUCLEUS= ^1H
##.ACQUISITION MODE= SIMULTANEOUS (DQD)
##.ACQUISITION SCHEME= undefined
##.AVERAGES= 64
##.DIGITISER RES= 22
##SPECTROMETER/DATA SYSTEM= spect
##.PULSE SEQUENCE= noesygpps1d.comp
##.SOLVENT NAME= COFFEE_meoh
##.SHIFT REFERENCE= INTERNAL, COFFEE_meoh, 1, 14.96075
##AUDIT TRAIL= $$ (NUMBER, WHEN, WHO, WHERE, PROCESS, VERSION, WHAT)
$$ ##TITLE= Audit trail, TOPSPIN		Version 2.1
$$ ##JCAMPDX= 5.01
$$ ##ORIGIN= Bruker BioSpin GmbH
$$ ##OWNER= Administrator
$$ $$ E:\/data/COFFEE/nmr/AC1471_13FE002653_8027014_YZZf2qlXnJ/22/pdata/1/auditp.txt
$$ ##AUDIT TRAIL=  $$ (NUMBER, WHEN, WHO, WHERE, PROCESS, VERSION, WHAT)
(   1,<2013-07-18 17:32:44.876 -0700>,<Administrator>,<X>,<go>,<TOPSPIN 2.1>,
      <created by zg
	started at 2013-07-18 17:21:15.407 -0700,
	POWCHK enabled, PULCHK disabled,
       configuration hash MD5:
       C8 4E 4E 5D D3 5C D8 9E 9F 52 82 E0 59 8A DE 15
       data hash MD5: 64K
       83 94 89 D5 DF 10 32 07 3B 24 F4 16 0D 31 12 FA>)
(   2,<2013-07-18 17:32:47.860 -0700>,<Administrator>,<X>,<proc1d>,<TOPSPIN 2.1>,
      <Start of raw data processing
       efp LB = 0.3 FT_mod = 6 PKNL = 1 PHC0 = 0 PHC1 = 0 SI = 128K 
       data hash MD5: 128K
       3B 27 7B 2D 22 C7 92 1D 67 1D 99 73 6A 0D 7D 52>)
(   3,<2013-07-18 17:32:48.766 -0700>,<Administrator>,<X>,<proc1d>,<TOPSPIN 2.1>,
      <pk PHC0 = -79.67834 PHC1 = 0 
       data hash MD5: 128K
       D0 0C 21 E9 06 FE B7 60 9C 9F 30 31 1E 16 C8 C4>)
(   4,<2013-07-18 17:32:49.173 -0700>,<Administrator>,<X>,<proc1d>,<TOPSPIN 2.1>,
      <abs ABSG = 1 
       data hash MD5: 128K
       91 4F 1F 37 B8 84 D9 6D CB 6C 2B BA 6A 55 DC 6D>)
(   5,<2013-07-18 17:32:49.282 -0700>,<Administrator>,<X>,<proc1d>,<TOPSPIN 2.1>,
      <abs ABSG = 2 
       data hash MD5: 128K
       47 DE CC 0E 2B 83 D2 57 59 5F 2B AB B4 8B CA FF>)
(   6,<2013-07-18 17:32:49.360 -0700>,<Administrator>,<X>,<proc1d>,<TOPSPIN 2.1>,
      <abs ABSG = 3 
       data hash MD5: 128K
       8B DE 3C 4C 30 C9 E2 80 25 EB 45 7A 95 DE 68 15>)
(   7,<2013-07-18 17:32:49.438 -0700>,<Administrator>,<X>,<proc1d>,<TOPSPIN 2.1>,
      <abs ABSG = 4 
       data hash MD5: 128K
       E3 93 33 2C 37 6A 20 B0 8C 35 55 B9 7A C5 3E 5A>)
(   8,<2013-07-18 17:32:49.594 -0700>,<Administrator>,<X>,<proc1d>,<TOPSPIN 2.1>,
      <abs ABSG = 5 
       data hash MD5: 128K
       3A D2 79 6B 80 65 D4 71 7F D5 A0 0C 0D C4 4A A4>)
$$ ##END=
$$ 
$$ $$ hash MD5
$$ $$ 4B A9 50 9C 9A 6C F0 F2 FC 04 C2 E9 8E 6E 93 9F
##$RELAX= 
##$RELAX= 
##$RELAX= 
##$RELAX= 
##$RELAX= 
##$RELAX= 
##$RELAX= 
##$RELAX= 
$$ Bruker specific parameters
$$ --------------------------
##$DU= <E:\>
##$EXPNO= 22
$$ [...]
##$TP07= 0
##$TPNAME0= <>
##$TPNAME1= <>
##$TPNAME2= <>
##$TPNAME3= <>
##$TPNAME4= <>
##$TPNAME5= <>
##$TPNAME6= <>
##$TPNAME7= <>
##$TPOAL= (0..7)
0.5 0.5 0.5 0.5 0.5 0.5 0.5 0.5
##$TPOFFS= (0..7)
0 0 0 0 0 0 0 0
##$TUNHIN= 0
##$TUNHOUT= 0
##$TUNXOUT= 0
##$USERA1= <user>
##$USERA2= <user>
##$USERA3= <user>
##$USERA4= <user>
##$USERA5= <user>
##$V9= 5
##$VALIST= <valist>
##$VCLIST= <CCCCCCCCCCCCCCC>
##$VD= 0
##$VDLIST= <DDDDDDDDDDDDDDD>
##$VPLIST= <PPPPPPPPPPPPPPP>
##$VTLIST= <TTTTTTTTTTTTTTT>
##$WBST= 1024
##$WBSW= 4
##$XGAIN= (0..3)
0 0 0 0
##$XL= 0
##$YL= 0
##$YMAX_a= 6656435
##$YMIN_a= -13330978
##$ZGOPTNS= <>
##$ZL1= 120
##$ZL2= 120
##$ZL3= 120
##$ZL4= 120
##$ABSF1= 14.96075
##$ABSF2= -5.597432
##$ABSG= 5
##$ABSL= 3
##$ALPHA= 0
##$AQORDER= 0
##$ASSFAC= 0
##$ASSFACI= 0
##$ASSFACX= 0
##$ASSWID= 0
##$AUNMP= <proc_prof1d_extract.lims>
##$AXLEFT= 0
##$AXNAME= <>
##$AXNUC= <1H>
##$AXRIGHT= 0
##$AXTYPE= 0
##$AXUNIT= <>
##$AZFE= 0.1
##$AZFW= 0.1
##$BCFW= 0
##$BC_mod= 0
##$BYTORDP= 0
##$COROFFS= 0
##$CY= 15
##$DATMOD= 1
##$DC= 0
##$DFILT= <>
##$DTYPP= 0
##$F1P= 0
##$F2P= 0
##$FCOR= 0.5
##$FTSIZE= 131072
##$FT_mod= 6
##$GAMMA= 0
##$GB= 0
##$INTBC= 1
##$INTSCL= 1
##$ISEN= 128
##$LB= 0.3
##$LEV0= 0
##$LPBIN= 0
##$MAXI= 10000
##$MC2= 0
##$MEAN= 0
##$ME_mod= 0
##$MI= 0
##$NCOEF= 0
##$NC_proc= -2
##$NLEV= 6
##$NOISF1= 0
##$NOISF2= 0
##$NSP= 0
##$NTH_PI= 0
##$NZP= 0
##$OFFSET= 14.96075
##$PC= 1
##$PHC0= -79.67834
##$PHC1= 0
##$PH_mod= 1
##$PKNL= yes
##$PPARMOD= 0
##$PPDIAG= 0
##$PPIPTYP= 0
##$PPMPNUM= 2147483647
##$PPRESOL= 1
##$PSCAL= 4
##$PSIGN= 0
##$PYNMP= <proc.py>
##$REVERSE= no
##$SF= 400.020009738689
##$SI= 131072
##$SIGF1= 0
##$SIGF2= 0
##$SINO= 400
##$SIOLD= 131072
##$SPECTYP= <>
##$SREGLST= <1H.CDCl3>
##$SSB= 0
##$STSI= 131072
##$STSR= 0
##$SW_p= 8223.68421052631
##$SYMM= 0
##$S_DEV= 0
##$TDeff= 65536
##$TDoff= 0
##$TI= <>
##$TILT= no
##$TM1= 0
##$TM2= 0
##$TOPLEV= 0
##$USERP1= <user>
##$USERP2= <user>
##$USERP3= <user>
##$USERP4= <user>
##$USERP5= <user>
##$WDW= 1
##$XDIM= 131072
##$YMAX_p= 354524513
##$YMIN_p= -16845
##$CURPLOT= <Network HP LaserJet P1505>
##$CURPRIN= <$Network HP LaserJet P1505>
##$DFORMAT= <normdp>
##$LAYOUT= <+/1D_H.xwp>
##$LFORMAT= <normlp>
##$PFORMAT= <normpl>
##$SURQMSG= 1
$$ End of Bruker specific parameters
$$ ---------------------------------
##NTUPLES= NMR SPECTRUM
##VAR_NAME=  FREQUENCY,     SPECTRUM/REAL,   SPECTRUM/IMAG
##SYMBOL=    X,             R,               I
##VAR_TYPE=  INDEPENDENT,   DEPENDENT,       DEPENDENT
##VAR_FORM=  AFFN,          ASDF,            ASDF
##VAR_DIM=   131072,        131072,          131072
##UNITS=     HZ,            ARBITRARY UNITS, ARBITRARY UNITS
##FACTOR=    0.0627417313425164, 1,          1
##FIRST=     8223.62146879497, -385,         -67374
##LAST=      0,             1512,            -67794
##MIN=       0,             -16845,          0
##MAX=       8223.62146879497, 354524513,    0
$$ Real data points
##PAGE= N=1
##DATA TABLE= (X++(R..R)), XYDATA
$$ [...]
63971C56124R274Q749Q291Q542R106R771J1096J3214J5225J6488J7644J9592K2223
$$ 356124 365398 374147 382438 390980 400086 409857 420953 434167 449392 465880 483524 503116 525339
63958E25339K4943K7803L1291L5406L9843M4723N0477N7180O4693P3173Q2728
$$ 525339 550282 578085 609376 644782 684625 729348 779825 837005 901698 974871 1057599
63947A057599R2809J02657J12221J21858J31220J39259J45388J49831J52652J53203
$$ 1057599 1150408 1253065 1365286 1487144 1618364 1757623 1903011 2052842 2205494 2358697
63937B358697J50840J45603J37706J26893J12831R5810P6674N6210L4926J3184
$$ 2358697 2509537 2655140 2792846 2919739 3032570 3128380 3205054 3261264 3296190 3309374
63927C309374q810l0970n2974p3988r2989j09352j22925j33674j41427j46005
$$ 3309374 3300564 3269594 3216620 3142632 3049643 2940291 2817366 2683692 2542265 2396260
63917B396260j47433j46059j42534j37586j31705j25056j17614j09320j00209
$$ 2396260 2248827 2102768 1960234 1822648 1690943 1565887 1448273 1338953 1238744
63908A238744r0672q1532p3512o6486n9585n2271m5046l8844l4047l0277k6987
$$ 1238744 1148072 1066540 993028 926542 866957 814686 769640 730796 696749 666472 639485
63897F39485k3895k0904j7972j5059j2170r454p303o035n320m301k550o37P57
$$ 639485 615590 594686 576714 561655 549485 540031 532728 526693 521373 517072 514522 513885 514642
63884E14642J936L772O307Q570R945J1089J3004J5688J8199J9809K0631K1203
$$ 514642 516578 520350 526657 535227 545172 556261 569265 584953 603152 622961 643592 664795
63872F64795K1944K3012K4319K5485K6043K5769K4749K3104K0829J7861J4296
$$ 664795 686739 709751 734070 759555 785598 811367 836116 859220 880049 897910 912206
63861I12206J0435O737L561Q44j946n312r201j3103j6624j9669k2080k3504k3922
$$ 912206 922641 929378 932939 933783 931837 926525 917324 904221 887597 867928 845848 822344 798422
63848G98422k3999k4470k5279k5749k5603k5383k5689k6373k6792k6582k5803
$$ 798422 774423 749953 724674 698925 673322 647939 622250 595877 569085 542503 516700
63837E16700k4487k2552k0204j8026j6478j5538j4985j4691j4442j3833j2642
$$ 516700 492213 469661 449457 431431 414953 399415 384430 369739 355297 341464 328822
63826C28822j1221j0165r606r161q502p728p093o656o267n757n015m129l456l347
$$ 328822 317601 307436 297830 288669 280167 272439 265346 258690 252423 246666 241651 237522 234066 230719
63812B30719l673l845l452k689k038j660j386j146j096j344j823k426l010l234
$$ 230719 227046 223201 219749 217060 215022 213362 211976 210830 209734 208390 206567 204141 201131 197897
63798A97897k708j488k43L54K35k18p79j462k055k083j418o26l39n18o87p47j062
$$ 197897 195189 193701 193458 193812 194047 193829 193050 191588 189533 187450 186032 185406 185067 184549 183862 183115 182053
63781A82053j687k048j676r05m82o24r17r80q70p50n38j13L42N02L01M0L5K94
$$ 182053 180366 178318 176642 175737 175255 174631 173714 172734 171864 171114 170576 170463 170805 171307 171608 171648 171683 171977
63763A71977N49N89N30O91J151J566J506R82M83M18O77Q15N82J78n1K8K88O10
$$ 171977 172526 173115 173645 174336 175487 177053 178559 179541 180024 180442 181119 181934 182516 182694 182643 182671 182959 183569
63745A83569R88J365J528J351J108J212J689K111K171K029J966K037K289K966
$$ 183569 184557 185922 187450 188801 189909 191121 192810 194921 197092 199121 201087 203124 205413 208379
63731B08379M069M967N043M598M572N299O174O617O741O746O319N166L729K728
$$ 208379 212448 217415 222458 227056 231628 236927 243101 249718 256459 263205 269524 274690 278419 281147
63717B81147K210J575M52r25k160l080l599l692l570l626l999m390m348l631k393
$$ 281147 283357 284932 285384 284459 282299 279219 275620 271928 268358 264732 260733 256343 251995 248364 245971
63702B45971j251r85j747k601k346r14M83P77K45QP05K044L381M319M740M698
$$ 245971 244720 243735 241988 239387 237041 236127 236610 237387 237632 237640 238345 240389 243770 248089 252829 257527
63686B57527M317L752L137K673K613K946L222K941K136J357J112J449K055K544
$$ 257527 261844 265596 268733 271406 274019 276965 280187 283128 285264 286621 287733 289182 291237 293781
63672B93781K642K362K068K170K642L026L020K840K758K527J572k26k258l785
$$ 293781 296423 298785 300853 303023 305665 308691 311711 314551 317309 319836 321408 321182 318924 315139
63658C15139m649n244n906o469o483n816m989m731n111n302m490k923j664j268
$$ 315139 310490 305246 299340 292871 286388 280572 275583 270852 265741 260439 255949 253026 251362 250094
63644B50094j188o44L28J133J578J944K337K484K350K340K775L448L952M145M225
$$ 250094 248906 248262 248590 249723 251301 253245 255582 258066 260416 262756 265531 268979 272931 277076 281301
63629B81301M575N578P200Q695R240Q989R012R961J1362J2607J3961J5974J8264
$$ 281301 285876 291454 298654 307349 316589 325578 334590 344551 355913 368520 382481 398455 416719
63616D16719J9837K0376K0564K1121K2177K3573K5039K5977K5711K4247K2239
$$ 416719 436556 456932 477496 498617 520794 544367 569406 595383 621094 645341 667580
63605F67580K0053J7344J3820R851O000K454p13l130m538n241n772o285o739p420
$$ 667580 687633 704977 718797 728648 734648 737102 736389 733259 728721 723480 717708 711423 704684 697264
63591F97264q815j0984j3469j5763j7599j8810j9309j9185j8596j7611j6333j5018
$$ 697264 688449 677465 663996 648233 630634 611824 592515 573330 554734 537123 520790 505772
63579E05772j3800j2448j0732q900p372o045m369k223j65J287K198K910L609M527
$$ 505772 491972 479524 468792 459892 452520 446475 442106 439883 439718 441005 443203 446113 449722 454249
63565D54249O092Q394J0710J2117J2572J2863J3583J4577J5612J6978J9041K1472
$$ 454249 460341 468735 479445 491562 504134 516997 530580 545157 560769 577747 596788 618260
63553F18260K3555K5148K6902K9312L1947L3723L3668L1287K6585K0166J3162
$$ 618260 641815 666963 693865 723177 755124 788847 822515 853802 880387 900553 913715
63542I13715O663J184l204o445q485r552r953r666q524o937n875n968o957q377
$$ 913715 920378 921562 918358 911913 903428 893876 883923 874257 865733 858796 852921 846953 839996 831619
63528H31619j0395j3554j7720k1819k4730k6280k7143k7894k8375k8103k7082
$$ 831619 821224 807670 789950 768131 743401 717121 689978 662084 633709 605606 578524
63517E78524k5874k4806k3524k1589j9203j6953j5071j3436j2103j1170j0203
$$ 578524 552650 527844 504320 482731 463528 446575 431504 418068 405965 394795 384592
63506C84592q567o496n034m663m649m198l473k991k605j923j227j122j470j476
$$ 384592 376025 369529 364495 359832 355183 350985 347512 344521 341916 339993 338766 337644 336174 334698
63492C34698p96J35Q49J281J465J413J374J736K517L345L967M433M798N060N307
$$ 334698 333902 334037 334886 336167 337632 339045 340419 342155 344672 348017 351984 356417 361215 366275 371582
63477C71582N471N114L955K557J796J642J129l99k591m737o424p433p654p407
$$ 371582 377053 382167 386122 388679 390475 392117 393246 392847 390256 385519 379095 371662 364008 356601
63463C56601p254p242o812n742m558l789l354k973k548j797k99J686L067L294
$$ 356601 349347 342105 335293 329551 324993 321204 317850 314877 312329 310532 310233 311919 314986 318280
63449C18280L239M049N631P074Q167R565J1686J4246J6968J9965K3327K6778K9770
$$ 318280 321519 325568 331199 338273 346440 356005 367691 381937 398905 418870 442197 468975 498745
63436D98745L1496L0984K7847K2937J7773J3284R563O657M913M438M924O161Q260
$$ 498745 530241 561225 589072 612009 629782 643066 652629 659286 664199 668637 673561 679722 687982
63423F87982J1144J4361J7611K0988K4370K7056K8319K8041K6460K3657J9637
$$ 687982 699126 713487 731098 752086 776456 803512 831831 859872 886332 909989 929626
63412I29626J4800R895N460J533k017n056p234q466r224j0162j1482j2939j4478
$$ 929626 944426 954321 959781 961314 959297 954241 947007 938541 929317 919155 907673 894734 880256
63399H80256j6450j8967k1527k3670k5528k7198k7994k7251k5591k4409k3993
$$ 880256 863806 844839 823312 799642 774114 746916 718922 691671 666080 641671 617678
63388F17678k3180k1174j8711j6826j5316j3217j0288p189m489k291o99J83P11
$$ 617678 594498 573324 554613 537787 522471 509254 498966 491777 487288 484997 484298 484481 485192
63375D85192J604L158N043O880Q685J0605J2587J4444J6025J7280J8354J9620
$$ 485192 486796 489954 494997 501877 510562 521167 533754 548198 564223 581503 599857 619477
63363F19477K1313K3140K4565K5497K6346K7303K7975K7982K7444K6462K4403
$$ 619477 640790 663930 688495 713992 740338 767641 795616 823598 851042 877504 901907
63352I01907K0400J4676Q787M169Q22k129m962p089q213q934r863j0889j1792
$$ 901907 922307 936983 945770 949939 950761 948632 943670 936581 928368 919434 909571 898682 886890
63339H86890j3052j5283j8195k0865k2905k4572k5767k5872k4785k3299k2055
$$ 886890 873838 858555 840360 819495 796590 772018 746251 720379 695594 672295 650240
63328F50240k0757j8761j5918j2434q575n066l206l784o145q848j1101j3015j4743
$$ 650240 629483 610722 594804 582370 573795 568729 565523 561739 555594 546746 535645 522630 507887
63315E07887j6016j6472j6053j5021j3862j2963j2136j0779q823p105o355o273
$$ 507887 491871 475399 459346 444325 430463 417500 405364 394585 385762 378657 372302 366029
63303C66029o104n686n255m694l834l124l112l448l378l103l487m422m641l483
$$ 366029 359925 354239 348984 344290 340456 337332 334220 330772 327394 324291 320804 316382 311741 308258
63289C08258j913j256j727k576k982k393q54O02O52p16k032k232j896j954k125
$$ 308258 306345 305089 303362 300786 297804 295411 294557 295159 295811 295095 293063 290831 288935 286981 284856
63274B84856j538k91P21J161J414J631J520J058O13L28M6j97j64J62O38J299K136
$$ 284856 283318 283027 283748 284909 286323 287954 289474 290532 291145 291473 291519 291322 291158 291320 291958 293257 295393
63257B95393K760K886K932L419M052M173L961M280N336O425P111P792Q814R940
$$ 295393 298153 301039 303971 307390 311442 315615 319576 323856 329192 335617 342728 350520 359334 369274
63243C69274J0959J2113J3453J4515J5073J5607J6560J7677J8577J9405K0399
$$ 369274 380233 392346 405799 420314 435387 450994 467554 485231 503808 523213 543612
63232E43612K1310K1781K1924K1972K1730K1006K0284K0255K0816K1160K0864
$$ 543612 564922 586703 608627 630599 652329 673335 693619 713874 734690 755850 776714
63221G76714K0324K0061K0062J9941J9324J7954J5657J2371Q188L338j807o846
$$ 776714 797038 817099 837161 857102 876426 894380 910037 922408 930596 933934 932127 925281
63209I25281j1570j5963j9812k2679k4439k5599k6657k7315k6760k4760k2041
$$ 925281 913711 897748 877936 855257 830818 805219 778562 751247 724487 699727 677686
63198F77686j9483j7202j4687j1595q188m983k143N78L319N852P996J0020J2190
$$ 677686 658203 641001 626314 614719 606531 601548 599405 599983 603302 609154 617150 627170 639360
63185F39360J4184J5578J6783J8656K0933K2054K1199J9684J9384K0304K0834
$$ 639360 653544 669122 685905 704561 725494 747548 768747 788431 807815 828119 848953
63174H48953K0152J9084J8388J7447J5339J2294R192O092K144l059q831j4155
$$ 848953 869105 888189 906577 924024 939363 951657 960849 966941 969085 966026 957195 943040
63162I43040j8637k2418k5609k8127k9983l1368l2375l2865l2682l1859l0467
$$ 943040 924403 901985 876376 848249 818266 786898 754523 721658 688976 657117 626650
63151F26650k8474k6020k3647k1859k0472j8848j6836j4969j3595j2348j0849
$$ 626650 598176 572156 548509 526650 506178 487330 470494 455525 441930 429582 418733
63140D18733r307q038o878n664m767m405l942k775j579j547k504k933k105j005
$$ 418733 409426 401388 394510 388846 384079 379674 375732 372957 371378 369831 367327 364394 362289 361284
63126C61284o76p43k89O06J139J085R81J216J639J997K308K675L071L243K793
$$ 361284 360608 359865 359576 360182 361321 362406 363387 364603 366242 368239 370547 373222 376293 379536 382329
63111C82329J672N97N16J455K406K599K280J913J397O24J54M78J097J240J066
$$ 382329 384001 384598 385114 386569 388975 391574 393854 395767 397164 397788 397942 398420 399517 400757 401823
63096D01823J289J855J986J470R99J086J488J834K074K146J905J551J556J974
$$ 401823 403112 404967 406953 408423 409422 410508 411996 413830 415904 418050 419955 421506 423062 425036
63082D25036K409K787L485M516N319N624N878O472P191P819Q597R634J0468J0796
$$ 425036 427445 430232 433717 438233 443552 449176 455054 461526 468717 476536 485133 494767 505235 516031
63068E16031J1194J2415J4314J6122J7524J8904K0643K2696K4817K6830K8724
$$ 516031 527225 539640 553954 570076 587600 606504 627147 649843 674660 701490 730214
63057G30214L0771L3330L6323L9105M1247M3075M5057M7013M8434M9274M9762
$$ 730214 760985 794315 830638 869743 910990 954065 999122 1046135 1094569 1143843 1193605
63046A193605M9723M8854M7630M7135M7750M8720M9233M9326M9397M9319M8569
$$ 1193605 1243328 1292182 1339812 1386947 1434697 1483417 1532650 1581976 1631373 1680692 1729261
63035A729261M6895M4346M0846L6103K9938K2349J3305K864q373j9202k8544l6266
$$ 1729261 1776156 1820502 1861348 1897451 1927389 1949738 1963043 1965907 1957534 1938332 1909788 1873522
63023A873522m3082m9475n4879n8196n9085n8284n6586n3970n0140m5421m0461
$$ 1873522 1830440 1780965 1726086 1667890 1608805 1550521 1493935 1439965 1389825 1344404 1303943
63012A303943l5269k9259k2409j5568r421l684K256Q350J3993J8800K2875K6454
$$ 1303943 1268674 1239415 1217006 1201438 1192017 1188333 1190589 1198939 1212932 1231732 1254607 1281061
63000A281061K9662L2463L4588L5665L5783L5729L6297L7383L8132L7855L6461
$$ 1281061 1310723 1343186 1377774 1413439 1449222 1484951 1521248 1558631 1596763 1634618 1671079
62989A671079L4016L0401K5590J9933J3898P587O96p105j5776k4810l3475m1244
$$ 1671079 1705095 1735496 1761086 1781019 1794917 1802504 1803200 1796095 1780319 1755509 1722034 1680790
62977A680790m8052n4023n9066o2820o5086o6003o5856o4766o2729n9775n6034
$$ 1680790 1632738 1578715 1519649 1456829 1391743 1325740 1259884 1195118 1132389 1072614 1016580
62966A016580n1768m7407m3389l9826l6426l2906k9446k6567k4543k3098k1708
$$ 1016580 964812 917405 874016 834190 797764 764858 735412 708845 684302 661204 639496
62955F39496k0141j8539j7099j5867j4856j4181j3857j3588j2987j2044j1179
$$ 639496 619355 600816 583717 567850 552994 538813 524956 511368 498381 486337 475158
62944D75158j0747j0614j0345r673q630p364o062n032m589m765n164n226m658
$$ 475158 464411 453797 443452 433779 425149 417785 411723 406691 402102 397337 392173 386947 382289
62931C82289l694k993l141m066m999n153m399l205k074j242q82j138j808k294
$$ 382289 378595 375602 372461 368395 363396 358243 353844 350639 348565 347323 346441 345303 343495 341201
62917C41201k139j565j302j784k676l160k733j693q12n49o72o81m33j46J7P4J4
$$ 341201 339062 337497 336195 334411 331735 328575 325842 324149 323337 322788 322116 321435 321002 320856 320873 320947 320961
62900C20961k24n66q11q75p46l57K45O05L12k83l33L13P84L98l97o91k90L28Q14
$$ 320961 320737 320171 319360 318485 317739 317382 317627 318232 318544 318261 317928 318241 319025 319423 319026 318335 318045 318373 319187
62881C19187J056Q74K96n6K98P73L72p26j183l50Q12J152P94N88O50L61m59j134
$$ 319187 320243 321117 321413 321357 321655 322428 322800 322074 320891 320541 321353 322505 323299 323887 324537 324898 324439 323305
62863C23305r97j21Q22J184P85J01j35K86P16M40l58p80l02O39J214J020L69r7
$$ 323305 322308 322187 323009 324193 324978 325079 324944 325230 325946 326386 326028 325248 324946 325585 326799 327819 328188 328091
62845C28091qL55M17Q9l4M91J188J188L90l52k77M72J186J364J035O27O45J238
$$ 328091 328083 328438 328855 328944 328910 329401 330589 331777 332167 331815 331538 332010 333196 334560 335595 336222 336867 338105
62827C38105J961K217J950J658J674J791J785J898K506L541M520N073N227N235
$$ 338105 340066 342283 344233 345891 347565 349356 351141 353039 355545 359086 363606 368679 373906 379141
62813C79141N338N583N816N901O005O464P285Q053Q477Q753R246J0020J0981J2172
$$ 379141 384479 390062 395878 401779 407784 414248 421533 429586 438063 446816 456062 466082 477063 489235
62799D89235J3589J4866J5586J5896J6447J7729J9712K2166K4939K7853L0744
$$ 489235 502824 517690 533276 549172 565619 583348 603060 625226 650165 678018 708762
62788G08762L3783L7433M1927M6935N1994N6962O1885O6668P1149P5264P8783
$$ 708762 742545 779978 821905 868840 920834 977796 1039681 1106349 1177498 1252762 1331545
62777A331545Q1105Q1725Q0747P8420P4302O7510N7953M6632L4477K1562P906
$$ 1331545 1412650 1494375 1575122 1653542 1727844 1795354 1853307 1899939 1934416 1955978 1963884
62766A963884n650j8218k9994m1618n2549o1176o6723p0059p2333p3661p3715
$$ 1963884 1958234 1940016 1910022 1868404 1815855 1754679 1687956 1617897 1545564 1471903 1398188
62755A398188p2708p1011o8491o5099o1549n8473n5312n1115m6226m1973l8723
$$ 1398188 1325480 1254469 1185978 1120879 1059330 1000857 945545 894430 848204 806231 767508
62744G67508l5457l1588k7927k5278k3170k0774j8264j6308j4774j2973j0920
$$ 767508 732051 700463 672536 647258 624088 603314 585050 568742 553968 540995 530075
62733E30075r300q294p285n821m153k671j376j50R45J817K552L297M228N564P326
$$ 530075 520775 512481 505196 499375 495222 492551 491175 491025 491970 493787 496339 499636 503864 509428 516754
62718E16754R103J0504J1706J3177J4916J6586J8345K0851K4185K7546L0399L3325
$$ 516754 525857 536361 548067 561244 576160 592746 611091 631942 656127 683673 714072 747397
62706G47397L7210M2010M6924N1471N5737N9784O3446O6747O9843P2504P4078
$$ 747397 784607 826617 873541 925012 980749 1040533 1103979 1170726 1240569 1313073 1387151
62695A387151P4148P2799P0091O5700N9305N0966M0871K9090J5899K147j1219
$$ 1387151 1461299 1534098 1604189 1669889 1729194 1780160 1821031 1850121 1866020 1868167 1856948
62684A856948k3902l6109m7640n7562o4966o9829p2801p4368p4508p3164p0744
$$ 1856948 1833046 1796937 1749297 1691735 1626769 1556940 1484139 1409771 1335263 1262099 1191355
62673A191355o7934o5086o1926n7946n3065m7959m3637m0634l8526l6279l3124
$$ 1191355 1123421 1058335 996409 938463 885398 837439 793802 753168 714642 678363 645239
62662F45239k9186k5396k2737k1405k0547j8914j6019j2690j0314r508r644r653
$$ 645239 616053 590657 567920 546515 525968 507054 491035 478345 468031 458523 448879 439226
62650D39226r055q082p124o328n679n123m563l891l106k287j541j023r40j287
$$ 439226 430171 422089 414965 408637 402958 397835 393272 389381 386275 383988 382447 381424 380484 379197
62636C79197j636j493r67o83r06j067n70K14K93n96j559j622p96K68J195J969
$$ 379197 377561 376068 375101 374418 373512 372445 371875 372089 372382 371786 370227 368605 367809 368077 369272 371241
62620C71241K416K329K072K341L181L879M069M311N097N957O220O261P134R099
$$ 371241 373657 375986 378058 380399 383580 387459 391528 395839 400936 406893 413113 419374 426508 435607
62606D35607J1288J2908J4084J5397J7259J9889K3282K6885K9857L2007L3955
$$ 435607 446895 459803 473887 489284 506543 526432 549714 576599 606456 638463 672418
62595F72418L6125L8085L9204L9393L8766L7091L4143L0123K5299J9563J2964
$$ 672418 708543 746628 785832 825225 863991 901082 935225 965348 990647 1010210 1023174
62584A023174O155l68o988j4120k0922k5848k8489k9999l1570l3308l4678l5301
$$ 1023174 1029329 1028961 1021973 1007853 986931 961083 932594 902595 871025 837717 803039 767738
62572G67738l5026l3862l2183l0478k8696k6384k3606k1130j9408j8016j6449
$$ 767738 732712 698850 666667 636189 607493 581109 557503 536373 516965 498949 482500
62561D82500j4850j3520j2260j0746r172p945p051o191n298m521l906l404k942
$$ 482500 467650 454130 441870 431124 421952 414007 406956 400765 395467 390946 387040 383636 380694
62548C80694k274j164K4M77J00o1Q44K232K878K586K134J962J890K055K960M393
$$ 380694 378420 377256 377280 377757 377857 377796 378640 380872 383750 386336 388470 390432 392322 394377 397337 401730
62532D01730N344N435N613O856Q814J0465J1570J2778J4501J6492J8527K0835
$$ 401730 407074 412509 418122 424978 433792 444257 455827 468605 483106 499598 518125 538960
62520E38960K3600K6482K9007L1227L3638L6419L8988M0506M0746M0219L9387
$$ 538960 562560 589042 618049 649276 682914 719333 758321 798827 839573 879792 919179
62509I19179L7981L5290L1035K5626J9583J3018N840j707q936j5162k0169k4197
$$ 919179 957160 992450 1023485 1049111 1068694 1081712 1087552 1085845 1076909 1061747 1041578 1017381
62497A017381k7481k9868l1003l0852k9822k8283k6219k3550k0605j7870j5424
$$ 1017381 989900 960032 929029 898177 868355 840072 813853 790303 769698 751828 736404
62486G36404j2840r719o066k218J340M116N892O925P724Q472Q861Q438P012M785
$$ 736404 723564 713845 707779 705561 706901 711017 716909 723834 731558 740030 748891 757329 764341 769126
62472G69126K200m23l168o316r683j2577j4662j6524j8787k1059k2433k2891k3382
$$ 769126 771326 770903 767735 761419 751736 739159 724497 707973 689186 668127 645694 622803 599421
62459E99421k4357k5064k4557k2753k0213j7525j5266j3928j3300j2429j0689
$$ 599421 575064 550000 525443 502690 482477 464952 449686 435758 422458 410029 399340
62448C99340q551o897n952n370m875m271l292k016j158j198j575j356n23J27J71
$$ 399340 390789 383892 377940 372570 367695 363424 360132 358116 356958 355760 354185 352829 352306 352433 352604
62433C52604j26n48j173j829k065j876j782k023k289k363k405k469k368k208k336
$$ 352604 352478 351930 350757 348928 346863 344987 343205 341182 338893 336530 334125 331656 329288 327080 324744
62418C24744k524k039q78j77p47j893k380k101j878k013j965j415q27o89q08o49
$$ 324744 322220 320181 319303 319126 318379 316486 314106 312005 310127 308114 306149 304734 303907 303218 302410 301761
62402C01761n0N78O53O2m69Q5J823L484L753K826K118K462L290L661L434L052
$$ 301761 301711 302289 302942 303004 302535 302620 304443 307927 311680 314506 316624 319086 322376 326037 329471 332523
62386C32523K777K615K680L118L781M340M735N212N973O979Q093R207J0199J0935
$$ 332523 335300 337915 340595 343713 347494 351834 356569 361781 367754 374733 382826 392033 402232 413167
62372D13167J1405J1783J2325J3159J4201J5335J6618J8273K0407K2902K5615
$$ 413167 424572 436355 448680 461839 476040 491375 507993 526266 546673 569575 595190
62361E95190K8548L1623L4558L7177L9782M2768M5963M8585M9875M9518M7502
$$ 595190 623738 655361 689919 727096 766878 809646 855609 904194 954069 1003587 1051089
62350A051089M3962L9220L3613K7214J9996J2332M917j879q273j4487k0314k5429
$$ 1051089 1095051 1134271 1167884 1195098 1215094 1227426 1232343 1230464 1222191 1207704 1187390 1161961
62338A161961k9773l3428l6425l8814m0578m1282m0345l7954l5241l3124l1380
$$ 1161961 1132188 1098760 1062335 1023521 982943 941661 901316 863362 828121 794997 763617
62327G63617k9325k6951k4772k2963k1359k0092j9399j8886j7790j6096j4680
$$ 763617 734292 707341 682569 659606 638247 618155 598756 579870 562080 545984 531304
62316E31304j4185j4291j4338j3980j3112j1723j0156q997q382p872p252o877
$$ 531304 517119 502828 488490 474510 461398 449675 439519 430522 422140 414268 407016 400139
62304D00139o841o437n032l134j882j688j955j992j666j140n80j64LJ81Q22J999
$$ 400139 393298 386861 381829 378695 376813 375125 373170 371178 369512 368372 367792 367628 367631 367812 368634 370633
62288C70633L162L650L335K696K376K686L457M352N197N869O019N383M461M329
$$ 370633 373795 377445 380780 383476 385852 388538 391995 396347 401544 407413 413432 418815 423276 427605
62274D27605N365O653P170P236Q014R769J1514J2513J3282J4730J6968J9533K2286
$$ 427605 432970 439623 446793 454029 462043 471812 483326 495839 509121 523851 540819 560352 582638
62261E82638K5516K9296L3292L7163M0747M3948M6755M9248N1227N1966N0762
$$ 582638 608154 637450 670742 707905 748652 792600 839355 888603 939830 991796 1042558
62250A042558M7671M3271L7770L0946K3093J5267Q114J076o593j4360k0881k5827
$$ 1042558 1090229 1133500 1171270 1202216 1225309 1240576 1248690 1249766 1243173 1228813 1207932 1182105
62238A182105l0326l5288m0153m3786m5948m7128m7413m6476m4504m2154l9513
$$ 1182105 1151779 1116491 1076338 1032552 986604 939476 892063 845587 801083 758929 719416
62227G19416l6036l1800k7964k5422k3673k1676j9351j7386j5950j4457j2601
$$ 719416 683380 651580 623616 598194 574521 552845 533494 516108 500158 485701 473100
62216D73100j0825r582q830q424q383q441p888o379m569l384k836k131q83L23
$$ 473100 462275 452693 443863 435439 427056 418615 410727 404348 399779 396395 393559 391428 390545 390868
62202C90868P85P02R19J856L088L988M495N001N748O658P644Q747R880J0788J1451
$$ 390868 391653 392355 393274 395130 398218 402206 406701 411702 417450 424108 431752 440499 450379 461167 472618
62187D72618J2275J3626J5265J6520J6902J6403J5305J3983J2885J2361J2416
$$ 472618 484893 498519 513784 530304 547206 563609 578914 592897 605782 618143 630559
62176F30559J2734J2989J3082J3184J3632J4744J6565J8848K1514K4788K8678
$$ 630559 643293 656282 669364 682548 696180 710924 727489 746337 767851 792639 821317
62165H21317L2425L4957L5957L6105L6087L5637L3792K9868K4033J7087R915L129
$$ 821317 853742 888699 924656 960761 996848 1032485 1066277 1096145 1120178 1137265 1147180 1150309
62153A150309k966q268j2750j6548k0017k3564k7326l1052l4320l6798l8319l8739
$$ 1150309 1147343 1139075 1126325 1109777 1089760 1066196 1038870 1007818 973498 936700 898381 859642
62141H59642l7875l5652l2369k8681k5088k1585j8038j4806j2497j1059r650p644
$$ 859642 821767 786115 753746 725065 699977 678392 660354 645548 633051 621992 612342 604698
62129F04698n258k927o67J391K538K422J953K298L190L377K724K558L578M609
$$ 604698 599440 596513 595846 597237 599775 602197 604150 606448 609638 613015 615739 618297 621875 626484
62115F26484M223K700J430R25M49o04j876k740l076l182l203k971k263j179j60
$$ 626484 630707 633407 634837 635762 636211 635607 633731 630991 627915 624733 621530 618559 616296 615117 614957
62100F14957N22J204K408L976N146N651O208P461Q929R614R386R100R510J0543
$$ 614957 615479 616683 619091 623067 628213 633864 640072 647533 656462 666076 675462 684562 694072 704615
62086G04615J1675J2533J3155J3914J5161J6723J7954J8568J9123K0245K1670
$$ 704615 716290 728823 741978 755892 771053 787776 805730 824298 843421 863666 885336
62075H85336K2600K2907K3283K4117K4873K4730K3452K1432J9361J7983J7765
$$ 885336 907936 930843 954126 978243 1003116 1027846 1051298 1072730 1092091 1110074 1127839
62064A127839J8412J9068J9178J9005J8959J8734J7454J4697J0995P275L938O84
$$ 1127839 1146251 1165319 1184497 1203502 1222461 1241195 1258649 1273346 1284341 1291616 1295554 1296238
62052A296238k921o898j0929j4719j8191k1405k4550k7871l1310l4291l6249l7350
$$ 1296238 1293317 1286419 1275490 1260771 1242580 1221175 1196625 1168754 1137444 1103153 1066904 1029554
62040A029554l8247l9014l8872l7318l5008l3032l1638l0116k7809k4733k1371
$$ 1029554 991307 952293 913421 876103 841095 808063 776425 746309 718500 693767 672396
62029F72396j8256j5754j3836j2151j0461q930p777o948o401o348o878p594q070
$$ 672396 654140 638386 624550 612399 601938 593008 585231 578283 571882 565534 558656 551062 542992
62016E42992q380q687q663p992p095o631o388n458l524j297M49J657K716L860
$$ 542992 534612 525925 517262 509270 502175 495544 489156 483698 480174 478877 479326 480983 483699 487559
62002D87559N000N749N724N181N038N647N948M730K472P03k82j682l978o009o863
$$ 487559 492559 498308 504032 509213 514251 519898 525846 530576 533048 533751 533469 531787 527809 521800 514937
61987E14937p347q521r975j0703j0765j0839j0759r905q610p831p543o813n526
$$ 514937 507590 499069 489094 478391 467626 456787 446028 436123 427513 419682 412139 405326 399800
61974C99800m721m931n286m815l710k722k004j267n41j20O1L92R46J369J408J290
$$ 399800 395079 390148 384862 380047 376337 373615 371611 370344 369803 369683 369744 370136 371082 372451 373859 375149
61958C75149J471K120K937L505L841M490N955Q033R943J1125J1724J2295J3255
$$ 375149 376620 378740 381677 385182 389023 393513 399468 407501 417444 428569 440293 452588 465843
61945D65843J4735J6769J9362K2411K5623K8582L0885L2330L3052L3518L4201
$$ 465843 480578 497347 516709 539120 564743 593325 624210 656540 689592 723110 757311
61934G57311L5062L5410L4479L2318K9833K7718K5604K2668J8853J4956J1464
$$ 757311 792373 827783 862262 894580 924413 952131 977735 1000403 1019256 1034212 1045676
61923A045676P957L847q13n446r379j1964j2780j2178j1119r997q088m626n8M431
$$ 1045676 1053633 1057480 1056667 1051221 1041842 1029878 1017098 1004920 993801 983804 975716 971090 971032 975463
61909I75463Q319J1951J5479J8376K0081K0572K0060J8506J5626J1216N484p60
$$ 975463 983782 995733 1011212 1029588 1049669 1070241 1090301 1108807 1124433 1135649 1141133 1140373
61897A140373o398j0814j4337j7661k0968k3950k6357k8047k8712k8187k6965
$$ 1140373 1133975 1123161 1108824 1091163 1070195 1046245 1019888 991841 963129 934942 907977
61886I07977k5836k4955k3826k2209k0522j9196j8206j7422j6944j6754j6447
$$ 907977 882141 857186 833360 811151 790629 771433 753227 735805 718861 702107 685660
61875F85660j5606j4274j2791j1340r836q181o474m896l377j516R57L574N513
$$ 685660 670054 655780 642989 631649 621813 613632 607158 602262 598885 597369 598326 601900 607413
61862F07413O791Q487J1349J4683J7480K0065K3635K8276L2648L5807L8272M0882
$$ 607413 614204 622691 634040 648723 666203 686268 709903 738179 770827 806634 844906 885788
61850H85788M3560M5819M7731M9618N1190N1546M9933M6264M1184L5726L0320
$$ 885788 929348 975167 1022898 1072516 1123706 1175252 1225185 1271449 1312633 1348359 1378679
61839A378679K4082J5816O044k855r046j2986j6059j8344j8709j6692j3112q929
$$ 1378679 1402761 1418577 1424621 1421766 1412720 1399734 1383675 1365331 1346622 1329930 1316818 1307889
61827A307889m445K99N116R743J3699J6135J6356J4526J1194O267q55r958j9611
$$ 1307889 1303444 1303743 1308859 1318602 1332301 1348436 1364792 1379318 1390512 1396779 1395924 1385966 1366355
61814A366355k8340l5696m1939m7165n1103n3488n4287n3717n2208n0154m7627
$$ 1366355 1338015 1302319 1260380 1213215 1162112 1108624 1054337 1000620 948412 898258 850631
61803H50631m4472m0688l6517l2261k8246k4886k2417k0613j9078j7716j6532
$$ 850631 806159 765471 728954 696693 668447 643561 621144 600531 581453 563737 547205
61792E47205j5145j3140j0931r527r227r134q331p016o119o077o457o510n776
$$ 547205 532060 518920 507989 498462 489235 480101 471770 464754 458635 452558 446101 439591 433815
61779D33815m370l031k590l103l684l521k809k309k239k074j392l59O18J338J754
$$ 433815 429445 426414 423824 420721 417037 413516 410707 408398 406159 404085 402693 402334 402952 404290 406044
61764D06044J811J597J445J631K037K257K078J784J860K373K772K445J512P20
$$ 406044 407855 409452 410897 412528 414565 416822 418900 420684 422544 424917 427689 430134 431646 432366
61750D32366N78Q52J030R49O43o9j316k603l110k679k006j729j696j436r12m31
$$ 432366 432944 433796 434826 435775 436418 436349 435033 432430 429320 426641 424635 422906 421210 419774 418862 418431
61734D18431j53l5j29m26m99J32J269K120K271K114K139K229K039J731J821K425
$$ 418431 418278 418243 418114 417688 417189 417321 418590 420710 422981 425095 427234 429463 431502 433233 435054 437479
61718D37479L125L482L390K977K550K506K876K990K123M95r44j846k870m498o082
$$ 437479 440604 444086 447476 450453 453003 455509 458385 461375 463498 463993 463049 461203 458333 453835 447753
61703D47753o715o465o090n846n400m736m270m035l561k836k555l072l655l424
$$ 447753 441038 434573 428483 422637 417237 412501 408231 404196 400635 397799 395244 392172 388517 385093
61689C85093k551j973k158k700l045l043k764k247j570r22m47k28l61q03j200
$$ 385093 382542 380569 378411 375711 372666 369623 366859 364612 363042 362120 361673 361445 361084 360281 359081
61674C59081j151p28m13m36m91k25K82P83J285J876K304K159J507R39R13J302
$$ 359081 357930 357202 356789 356353 355862 355637 355919 356702 357987 359863 362167 364326 365833 366772 367685 368987
61658C68987J759K213K746L193L194K662J993J731K130K951L651L834L657L689
$$ 368987 370746 372959 375705 378898 382092 384754 386747 388478 390608 393559 397210 401044 404701 408390
61644D08390M222M894N211N210N242N230M664L398J908N45r27k683m208m866m848
$$ 408390 412612 417506 422717 427927 433169 438399 443063 446461 448369 448914 447987 445304 441096 436230 431382
61629D31382m959n578o295o614o453n924n024l743k198n30J099K339K769K328
$$ 431382 426423 420845 414550 407936 401483 395559 390535 386792 384594 384064 385163 387502 390271 392599
61615C92599J452O94L41L52M15O8q94k136l191m085n175o406p239p461p477p582
$$ 392599 394051 394745 395086 395438 395853 395921 395027 392891 389700 385615 380440 374034 366795 359334 351857 344275
61599C44275p503o973o267n746n342m910m675m743m567l636k384j743j882k191
$$ 344275 336772 329799 323532 317786 312444 307534 302859 298116 293549 289913 287529 285786 283904 281713
61585B81713k362k701l253l515l274k978k899k665k076j707k058k621k535j831
$$ 281713 279351 276650 273397 269882 266608 263630 260731 258066 255990 254283 252225 249604 247069 245238
61571B45238j318j382j668j818j826j633j034j98L31L73K63J57k84j078j455p38
$$ 245238 243920 242538 240870 239052 237226 235593 234559 234361 234692 235065 235328 235485 235201 234123 232668 231930
61555B31930O26J542J562J167R08Q58R29J115J260J073O45M96Q15J066P35J58
$$ 231930 232556 234098 235660 236827 237735 238593 239522 240637 241897 242970 243615 244111 244926 245992 246727 246885
61539B46885J30P94J453J472R85O08Q40J822L234M232L884K103k3j238j345j091
$$ 246885 247015 247809 249262 250734 251719 252327 253167 254989 258223 262455 266339 268442 268419 267181 265836 264745
61523B64745j031j070j136j571k477l187l028k305j898j989j877j171m57m28q67
$$ 264745 263714 262644 261508 259937 257460 254273 251245 248940 247042 245053 243176 242005 241548 241120 240253
61508B40253j030o83j98K07O69J168J305Q69J61m32q50j174j290j045n17N0N18
$$ 240253 239223 238540 238342 238549 239218 240386 241691 242560 242721 242289 241439 240265 238975 237930 237413 237463 237981
61491B37981Q26Q63O21L30K29K34J03r3J1N68J173J277P74N0m67o38m85k3O56
$$ 237981 238807 239670 240291 240621 240850 241084 241187 241094 241105 241673 242846 244123 244897 244947 244480 243842 243357 243334 243990
61472B43990J197J187N98j57o73q97r16o83k45O2j0j35K82J289K265K558J971
$$ 243990 245187 246374 246972 246815 246142 245245 244329 243646 243401 243463 243453 243318 243600 244889 247154 249712 251683
61455B51683O98p39j525j168k16K70J07K02J054J911J993J723J865K118J675Q65
$$ 251683 252381 251642 250117 248949 248733 249003 249110 249312 250366 252277 254270 255993 257858 259976 261651 262516
61439B62516R27K149L415L914M105M579M961M731M320M468M980M982M212L265
$$ 262516 263443 265592 269007 272921 277026 281605 286566 291297 295617 300085 305065 310047 314259 317524
61425C17524K661K323K043J848J803J844J954K169K342K214J775J314J028Q03
$$ 317524 320185 322508 324551 326399 328202 330046 332000 334169 336511 338725 340500 341814 342842 343645
61411C43645M71J1n18j123j744k216k470k684l104l700m132m089l609l021k606
$$ 343645 344116 344127 343609 342486 340742 338526 336056 333372 330268 326568 322436 318347 314738 311717 309111
61396C09111k388k251k112j901j527j039o63n21m46k98k53m64o07k56L68O15M03
$$ 309111 306723 304472 302360 300459 298932 297893 297230 296709 296263 295965 295712 295248 294641 294385 294753 295368 295771
61379B95771M47J243K385L137L245K866K173J462J225J617K121K194J942J766
$$ 295771 296218 297461 299846 302983 306228 309094 311267 312729 313954 315571 317692 319886 321828 323594
61365C23594J713J692J980K843L831M170L805L425L483L787M138M728N674O681
$$ 323594 325307 326999 328979 331822 335653 339823 343628 347053 350536 354323 358461 363189 368863 375544
61351C75544P417P849Q101Q270Q482Q729Q658P953O961O460O622O808O495N930
$$ 375544 382961 390810 398911 407181 415663 424392 433050 441003 447964 454424 461046 467854 474349 480279
61337D80279N550N312M953M508M079L445K324Q35p05k158l395m072m042l836m169
$$ 480279 485829 491141 496094 500602 504681 508126 510450 511285 510580 508422 505027 500955 496913 493077 488908
61322D88908n022n665n556m891m191l753l507l091k086n16Q56J188O39L64J181
$$ 488908 483886 478221 472665 467774 463583 459830 456323 453232 451146 450630 451486 452674 453313 453677 454858
61307D54858K583L449L402L009K781K528J834O77o61j999l174l815l630k945k508
$$ 454858 457441 460890 464292 467301 470082 472610 474444 475121 474460 472461 469287 465472 461842 458897 456389
61292D56389k646k894k696k121j642j418j197q07m07k00j98k27J4R07K533M299
$$ 456389 453743 450849 448153 446032 444390 442972 441775 440968 440561 440361 440163 439936 439950 440857 443390 447689
61276D47689N312N323M973M906M997M805M525M860N930O849O707N761N194N774
$$ 447689 453001 458324 463297 468203 473200 478005 482530 487390 493320 500169 506876 512637 517831 523605
61262E23605P100Q291R058R766J0570J1057J0769R776Q549P500O854O695O737
$$ 523605 530705 538996 548054 557820 568390 579447 590216 599992 608541 616041 622895 629590 636327
61249F36327O339N053L137J201n35k279m021n382o208o902p920r100r791r632
$$ 636327 642666 647719 650856 652057 651522 649243 645222 639840 633632 626730 618810 609710 599919 590287
61235E90287r013q688q880q939q172o893o114o039n585m042k495k568m019m849
$$ 590287 581274 572586 563706 554767 546595 539702 533588 527549 521964 517922 515427 512859 508840 503991
61221E03991l948k468k078k816l448l179k159p31Q57K130K534K011J031J04m51
$$ 503991 500043 497575 495497 492681 489233 486054 483895 483164 484021 486151 488685 490696 491727 491831 491380
61206D91380m03K82J353K526L669M645N311N997P443R751J1870J2708J2441J2098
$$ 491380 490977 491259 492612 495138 498807 503452 508763 514760 522203 531954 543824 556532 568973 581071
61192E81071J2120J2066J1560J0695R548Q004O279M984M455M490M727M884M643
$$ 581071 593191 605257 616817 627512 637060 645064 651343 656327 660782 665272 669999 674883 679526
61179F79526L859K891K178J503K91j333k498k757k606k647k930l393m279n660
$$ 679526 683385 686276 688454 689957 690248 688915 686417 683660 681054 678407 675477 672084 667805 662145
61165F62145p125q324r340j0158j0417j0107r902j0210j0397r686q336p222o520
$$ 662145 655020 646696 637356 627198 616781 606674 596772 586562 576165 566479 558143 550921 544401
61152E44401n706m614l671l067k585k396l219n217p392q582q744q777r247r718
$$ 544401 538695 534081 530410 527343 524758 522362 519143 513926 506534 497952 489208 480431 471184 461466
61138D61466r361p940o022m418l524l170k894k253j001O86K145K771K786L140
$$ 461466 452105 444165 438143 433725 430201 427031 424137 421884 420883 421569 423714 426485 429271 432411
61124D32411M424O187P622Q680R911J1503J3042J4228J5236J6249J7087J7574
$$ 432411 436835 443022 450644 459324 469235 480738 493780 508008 523244 539493 556580 574154
61112E74154J7809J7914J7834J7542J7116J6363J4890J2866J1194J0422R711P671
$$ 574154 591963 609877 627711 645253 662369 678732 693622 706488 717682 728104 737815 745486
61100G45486M134M39k202l926n539p281q840j0250j1971j4061j5840j6583j6194
$$ 745486 749620 750059 747857 743931 738392 731111 722271 712021 700050 685989 670149 653566 637372
61087F37372j5088j3784j2868j2917j3988j5298j5860j5394j4377j3261j2034
$$ 637372 622284 608500 595632 582715 568727 553429 537569 522175 507798 494537 482503
61076D82503j0665r474q851q747q694q230p275o145n287m844m463l702k632j785
$$ 482503 471838 462364 453513 444766 436072 427842 420567 414422 409135 404291 399828 396126 393494 391709
61062C91709j437j249p43J28J113K057K918L590M096M759N853P138Q062Q420Q561
$$ 391709 390272 389023 388280 388408 389521 391578 394496 398086 402182 406941 412794 419932 427994 436414 444975
61047D44975Q945R737J0828J1921J2710J3172J3668J4496J5409J5994J6406J7239
$$ 444975 453920 463657 474485 486406 499116 512288 525956 540452 555861 571855 588261 605500
61035F05500J8480J9242J8927J8259J8555K0109K1938K3210K4414K6716L0545
$$ 605500 623980 643222 662149 680408 698963 719072 741010 764220 788634 815350 845895
61024H45895L5330M0654M7065N5444O5927P8090R2145J09182J29998J54318J81470
$$ 845895 881225 921879 968944 1024388 1090315 1168405 1260550 1369732 1499730 1654048 1835518
61013A835518K10365K37055K52852K47891K18929J73306J23861Q0238M6139K3457
$$ 1835518 2045883 2282938 2535790 2783681 3002610 3175916 3299777 3380015 3426154 3449611
61003C449611J4862J9599K8437K6753M639l6255q5875j34154j75641k07897k28634
$$ 3449611 3464473 3484072 3512509 3539262 3543901 3507646 3421771 3287617 3111976 2904079 2675445
60992B675445k35963k30531k15938j96748j76330j56312j37266j19437j03102
$$ 2675445 2439482 2208951 1993013 1796265 1619935 1463623 1326357 1206920 1103818
60983A103818q8606p6199o5774n6897m9207m2681l7446l3406l0209k7475k4919
$$ 1103818 1015212 939013 873239 816342 767135 724454 687008 653602 623393 595918 570999
60972E70999k2332j9687j7260j5409j4109j2938j1635j0422r560q745p433n668
$$ 570999 548667 528980 511720 496311 482202 469264 457629 447207 437647 428902 421469 415801
60960D15801m268l938m461m981m909m351l692l082k325j149M31J997K955L065
$$ 415801 411533 407595 403134 398153 393244 388893 385201 382119 379794 378645 379076 381073 384028 387093
60946C87093K726K668L273M198M658M128K839J593R66P07J02j024k022k338k337
$$ 387093 389819 392487 395760 399958 404616 408744 411583 413176 414142 414849 414951 413927 411905 409567 407230
60931D07230k801l832m752n025m731m118l237k291j760j828j990j693j039m51
$$ 407230 404429 400597 395845 390820 386089 381971 378734 376443 374683 372855 370865 369172 368133 367682
60917C67682O2P57J411J386O10j05m2N10P22L86J00L14O55M80j44n05k62O0j41
$$ 367682 367744 368501 369912 371298 371908 371803 371761 372271 372993 373379 373479 373793 374448 374928 374784 374279 374017 374077 373936
60898C73936o10n94M8O60P54N98N86O01L60o4n30j256k305k971k480j215m77q21
$$ 373936 373326 372732 372780 373440 374194 374792 375378 375979 376339 376275 375745 374489 372184 369213 366733 365518 365041 364220
60880C64220j320q24O37K082K780K772K503K412K735L357L897M197M513N063N615
$$ 364220 362900 362076 362713 364795 367575 370347 372850 375262 377997 381354 385251 389448 393961 399024 404639
60865D04639N815N723N679N782N913O014N995N531M547L757M099N480O696O828
$$ 404639 410454 416177 421856 427638 433551 439565 445560 451091 455638 459395 463494 468974 475670 482498
60851D82498O205N680N563N670O020O742P516P736P275O608O140N890N892O360
$$ 482498 488703 494383 499946 505616 511636 518378 525894 533630 540905 547513 553653 559543 565435 571795
60837E71795P205P856P978Q014Q678J0131J1955J3787J5553J7192J8533J9457
$$ 571795 579000 586856 594834 602848 611526 621657 633612 647399 662952 680144 698677 718134
60825G18134J9873J9530J8196J6101J3882J1963J0155P968N156J902j388m415
$$ 718134 738007 757537 775733 791834 805716 817679 827834 835802 840958 842860 841472 837057
60813H37057p262j0222j3257j5760j7203j7851j8386j8908j8917j8381j8056j8359
$$ 837057 829795 819573 806316 790556 773353 755502 737116 718208 699291 680910 662854 644495
60801F44495j8572j7847j6455j5304j4473j3126j0928q752p637p581p674p153
$$ 644495 625923 608076 591621 576317 561844 548718 537790 529038 521401 513820 506146 498993
60789D98993o019m936m639n275o125o282n676n088m979m811l891k557j908k401
$$ 498993 492974 488038 483399 478124 471999 465717 460041 454953 449974 445163 441272 438715 436807 434406
60775D34406l264l489l032k677k896l234k985k266k003k827m171m918m771m604
$$ 434406 431142 427653 424621 421944 419048 415814 412829 410563 408560 405733 401562 396644 391873 387269
60761C87269n235o303o753o235n408m842m239l178k115j907k464k683j965j070
$$ 387269 382034 375731 368978 362743 357335 352493 348254 345076 342961 341054 338590 335907 333942 332872
60747C32872r36j243j018k39J03l76q69p50n51r93j755k039j797j593j496j021
$$ 332872 331936 330693 329675 329436 329539 329163 328294 327544 326993 326000 324245 322206 320409 318816 317320 316299
60731C16299mJ159K117K760K855K242J362R07Q84O55K5m63m10j36j23m92j233
$$ 316299 316295 317454 319571 322331 325186 327428 328790 329697 330581 331236 331261 330798 330388 330252 330129 329637 328404
60714C28404k314l415m073m377m801n211m811l411j988j503j841k408l019l599
$$ 328404 326090 322675 318602 314225 309424 304213 299402 295991 294003 292500 290659 288251 285232 281633
60700B81633l672k970k044j556j382j128j008j374j767j441n53L2L8NK84O40R19
$$ 281633 277961 274991 272947 271391 270009 268881 267873 266499 264732 263291 262738 262770 262808 262813 263097 263737 264656
60683B64656J237J505J439J177J166J374J293Q33N15O24Q50R78J270J821K221
$$ 264656 265893 267398 268837 270014 271180 272554 273847 274680 275195 275819 276669 277647 278917 280738 282959
60668B82959K133J748J333Q86N27P03J608K753L450L440K943K417K421L219M272
$$ 282959 285092 286840 288173 289059 289586 290289 291897 294650 298100 301540 304483 306900 309321 312540 316812
60653C16812M718M469M376M944N555N357M410L419K683J946J048J26p12j537k433
$$ 316812 321530 325999 330375 335319 340874 346231 350641 354060 356743 358689 359737 359863 359151 357614 355181
60638C55181l381m281m900n021m749m414m153l890l770m087m569m413l360k222
$$ 355181 351800 347519 342619 337598 332849 328435 324282 320392 316622 312535 307966 303553 300193 297971
60624B97971j799j832j596j052p20p42p67o04l64r6J66J98L5K35J106J903J683
$$ 297971 296172 294340 292744 291692 290972 290230 289463 288859 288495 288399 288565 288763 288798 289033 290139 292042 293725
60607B93725P62L25O56Q23L00k33j23K28K52K41O27R13L83n10n57L63R15N8j589
$$ 293725 294487 294812 295468 296291 296591 296358 296235 296463 296715 296956 297583 298496 298879 298369 297812 298175 299090 299148 297559
60588B97559k578k296j303l73K22N57P05Q06J136J831K626L083L072K892K925
$$ 297559 294981 292685 291382 291009 291231 291788 292493 293299 294435 296266 298892 301975 305047 307939 310864
60573C10864L336M097N112O115O685O617O158N667N074L992K337N90o70j329j708
$$ 310864 314200 318297 323409 329524 336209 342826 348984 354651 359725 363717 366054 366644 365974 364645 362937
60558C62937k186k838l338l143k062o16N01J387K941N554Q233R540R278Q615Q503
$$ 362937 360751 357913 354575 351432 349370 348754 349255 350642 353583 359137 367370 376910 386188 394803 403306
60543D03306Q598Q003O593N031L735K436P89j036k546l431l700l554l294l157
$$ 403306 411904 419907 426500 431531 435266 437702 438491 437455 434909 431478 427778 424224 420930 417773
60529D17773l045k596j768j130j232j831k086j563o93p0K81P79J613K550L282
$$ 417773 414728 412132 410364 409234 408002 406171 404085 402522 401829 401759 402040 402819 404432 406982 410264
60514D10264L734M042M401N018N997P281Q695J0118J1604J3345J5479J7952K0514
$$ 410264 413998 418040 422441 427459 433456 440737 449432 459550 471154 484499 499978 517930 538444
60501E38444K2901K4926K6406K7106K6842K5509K2900J8691J2847N896j432q691
$$ 538444 561345 586271 612677 639783 666625 692134 715034 733725 746572 752468 751036 742345
60489G42345j5545k1348k5401k7685k8757k8939k8137k6574k4987k3730k2307
$$ 742345 726800 705452 680051 652366 623609 594670 566533 539959 514972 491242 468935
60478D68935k0236j7880j5855j4078j2099j0121q884q587q516p874o550m964l602
$$ 468935 448699 430819 414964 400886 388787 378666 369782 361195 352679 344805 338255 333291 329689
60465C29689k729k251j816j281j023j395k074k364k134j921k061k239k025j444
$$ 329689 326960 324709 322893 321612 320589 319194 317120 314756 312622 310701 308640 306401 304376 302932
60451C02932q56n49n91p54o15n2L53j87j600k898l218k610j725j082q44q73q28
$$ 302932 302076 301527 300936 300182 299567 299515 299868 299681 298081 295183 291965 289355 287630 286548 285704 284831 284003
60434B84003n13j71j68l27j44L12L89r4m37j30L54M00L27Q33J712J962J142n1
$$ 284003 283490 283319 283151 282824 282680 282992 283381 283287 282850 282720 283074 283474 283801 284634 286346 288308 289450 289399
60416B89399o78m93J30P57J138J267J353J611J932J995J713J370J224J163Q97
$$ 289399 288721 288228 288358 289115 290253 291520 292873 294484 296416 298411 300124 301494 302718 303881 304778
60401C04778L47k36n64n71l82m5N35J312J881J846J333R30R93J319J552J654J734
$$ 304778 305125 304889 304325 303754 303372 303327 303862 305174 307055 308901 310234 311164 312157 313476 315028 316682 318416
60384C18416J713J413Q95N01N59J082J636J629R62L97P54J777K339J949J412J596
$$ 318416 320129 321542 322437 322938 323497 324579 326215 327844 328806 329203 329957 331734 334073 336022 337434 339030
60368C39030K210K365J908J386J031O30K52K47N27N96M38O46J433K209K473K555
$$ 339030 341240 343605 345513 346899 347930 348560 348812 349059 349586 350182 350620 351266 352699 354908 357381 359936
60352C59936K973L549L648L006J933Q96K54J07Q7m64j676k693k615j713j225j784
$$ 359936 362909 366458 370106 373112 375045 375941 376195 376302 376389 375925 374249 371556 368941 367228 366003 364219
60336C64219k632k648j805j146j382k000j958j001KJ20o12j362j558j360j096
$$ 364219 361587 358939 357134 355988 354606 352606 350648 349647 349649 349769 349157 347795 346237 344877 343781
60321C43781o75J60J262K147K602K842L060L219L417M044N221O388O907P030P680
$$ 343781 343106 343266 344528 346675 349277 352119 355179 358398 361815 365859 371080 377468 384375 391405 399085
60306C99085R247J1003J1909J1605J0327Q289N547K287j154m448p168q781r176
$$ 399085 408332 419335 431244 442849 453176 461465 467012 469299 468145 463697 456529 447748 438572
60293D38572r026r120r421r235q250o800n219l581k174j505j629k036k401k848
$$ 438572 429546 420426 411005 401770 393520 386720 381501 377920 375746 374241 372612 370576 368175 365327
60279C65327l272l179k552k139k337k441j760q04o23j294j925j873j252m51J13
$$ 365327 362055 358876 356324 354185 351848 349407 347647 346843 346220 344926 343001 341128 339876 339425 339538
60264C39538mp85j492j553j447j877k351j688Q9J553J722J108N49L3p40j389j228
$$ 339538 339534 338749 337257 335704 334257 332380 330029 328341 328430 329983 331705 332813 333362 333395 332655 331266 330038
60247C30038j96J066J837J746R74K82L97J088J368P54r5l55oN16J053J659K203
$$ 330038 329842 330908 332745 334491 335465 335747 336144 337232 338600 339354 339259 338904 338898 339414 340467 342126 344329
60230C44329K483K510K301J800J208R79J242J610J868K247K780L020K754K378
$$ 344329 346812 349322 351623 353423 354631 355610 356852 358462 360330 362577 365357 368377 371131 373509
60216C73509K101J564P79O31J618K852L244L099L411M113M287L818L533L695L634
$$ 373509 375610 377174 377953 378584 380202 383054 386298 389397 392808 396921 401208 405026 408559 412254 415888
60201D15888L069K594K523K357J864J691K263K940K914K288J642J059L91r2o3
$$ 415888 418957 421551 424074 426431 428295 429986 432249 435189 438103 440391 442033 443092 443483 443391 443328
60186D43328R2l49j410k403k849k873k688k283j722j351j419j755j938j743j276
$$ 443328 443420 443071 441661 439258 436409 433536 430848 428565 426843 425492 424073 422318 420380 418637 417361
60171D17361p75l64j7K05J14k47m14lN57L71p37j779j735o81N17J297J643J547
$$ 417361 416586 416222 416205 416410 416524 416277 415863 415860 416417 416788 416051 414272 412537 411856 412373 413670 415313 416860
60153D16860R09M5l58oO48J041J147J304J648K064K488L019L706M433M999N207
$$ 416860 417769 417814 417456 417450 418098 419139 420286 421590 423238 425302 427790 430809 434515 438948 443947 449154
60137D49154M975M472M068L975L967L649K985K318J813J195K68n69p20k80n8n68
$$ 449154 454129 458601 462669 466644 470611 474260 477245 479563 481376 482571 482839 482270 481550 481270 481212 480644
60121D80644j333j537j066n80o27j062j438j542j479j424j504j733j920j786j334
$$ 480644 479311 477774 476708 476128 475501 474439 473001 471459 469980 468556 467052 465319 463399 461613 460279
60106D60279r89j123j614j999k053j942j831j619j147n32m9K12M47Q44J332J668
$$ 460279 459290 458167 456553 454554 452501 450559 448728 447109 445962 445430 445381 445593 446040 446884 448216 449884
60090D49884J705J535J389J479J857K389K858L090L030K691K159J591J102O71
$$ 449884 451589 453124 454513 455992 457849 460238 463096 466186 469216 471907 474066 475657 476759 477430
60076D77430K55m1j17j92o62j519k289k756l337m336n231n325m851m664m956n083
$$ 477430 477685 477644 477527 477335 476673 475154 472865 470109 466772 462436 457205 451880 447029 442365 437409 432326
60060D32326m691m161l729l133k480k517l332l718k742j231o28r03p64K33J135
$$ 432326 427635 423474 419745 416612 414132 411615 408283 404565 401823 400592 399964 399061 398297 398530 399665
60045C99665J177P86P32J247K222L436M280M092L118K368K202J842P54m05q49
$$ 399665 400842 401628 402360 403607 405829 409265 413545 417637 420755 423123 425325 427167 427921 427516 426667
60030D26667q80j277k052k715l309m259n437o168o168n810n458n146m862m622
$$ 426667 425787 424510 422458 419743 416434 412175 406738 400570 394402 388592 383134 377988 373126 368504
60016C68504m224l437k462j859j871k181k290j972j387r42r11j054q66l35l0j46
$$ 368504 364280 360843 358381 356522 354651 352470 350180 348208 346821 345879 344968 343914 343048 342713 342683 342537
60000C42537j06M84J007P67J99K21P26Q15M04M20J220J922J752J116P54O96O51
$$ 342537 342431 342915 343922 344689 344888 345109 345835 346650 347054 347474 348694 350616 352368 353484 354238 354934 355585
59983C55585P47J200J741K010K114K200J981J249M46P8p7m25o41j52O77Q38J70
$$ 355585 356332 357532 359273 361283 363397 365597 367578 368827 369273 369351 369274 368849 368208 368056 368733 369571 369741
59966C69741l50m7O21R33Q83Q22P78O70P35J108J355J002L08l6J36M07N82R37
$$ 369741 369391 369344 369965 370898 371781 372603 373381 374051 374786 375894 377249 378251 378559 378523 378659 379066 379648 380585
59948C80585J501J704J052j82j253j702j565j106o40m89p96j362j863k122k090
$$ 380585 382086 383790 384842 384660 383407 381705 380140 379034 378394 377905 377109 375747 373884 371762 369672
59933C69672j723j152q06j000j464j671j566j479j345o18Q17K169K669K522K446
$$ 369672 367949 366797 365991 364991 363527 361856 360290 358811 357466 356848 357665 359834 362503 365025 367471
59918C67471K584K508K145J941K161K572L005L667M651N557N896N612M976M313
$$ 367471 370055 372563 374708 376649 378810 381382 384387 388054 392705 398262 404158 409770 414746 419059
59904D19059L849L532K850J349m85j418r18Q9L49k56r15j134j062q11k75L75P43
$$ 419059 422908 426440 429290 430639 430154 428736 427818 427907 428256 428000 427085 425951 424889 424078 423803 424178 424921
59887D24921Q35J087J637K125K378K658L021K984K278J411J048J159J238J076
$$ 424921 425756 426843 428480 430605 432983 435641 438662 441646 443924 445335 446383 447542 448780 449856
59873D49856Q38N41m6r68j911k507k626k359j982j839k068k435k542k172j382
$$ 449856 450694 451235 451189 450221 448310 445803 443177 440818 438836 436997 434929 432494 429952 427780 426398
59858D26398n36k59j036k472l278k461n30R29Q52l22j320j346o73k16n86j512
$$ 426398 425862 425603 424567 422095 418817 416356 415826 416755 417607 417285 415965 414619 413946 413730 413144 411632
59842D11632k168k096j651j390j403j508j745k113k025q31J099K449K437J687
$$ 411632 409464 407368 405717 404327 402924 401416 399671 397558 395533 394702 395801 398250 400687 402374
59828D02374J295J477J585J093J24r07j716k168k176j753j137p32q35j280j565
$$ 402374 403669 405146 406731 407824 407948 407041 405325 403157 400981 399228 398091 397359 396524 395244 393679
59813C93679j427j153j093j094q45n41n71o50m0J202J968J492L25m86p14q08j033
$$ 393679 392252 391099 390006 388912 388067 387526 386955 386305 386265 387467 389435 390927 391252 390766 390052 389244 388211
59796C88211j286j498j539j097k03L86l5j115j893k000j819j592j171o43m04m67
$$ 388211 386925 385427 383888 382791 382588 382974 382939 381824 379931 377931 376112 374520 373349 372706 372302 371835
59780C71835l33J81N75L92j37m56k88K72J003J663K106K422K653K486J629N08
$$ 371835 371502 371683 372258 372650 372513 372057 371769 372041 373044 374707 376813 379235 381888 384374 386003 386511
59764C86511J7M32J095J372J406J617J909J830J274O67N34J050J945K733L166
$$ 386511 386528 386960 388055 389427 390833 392450 394359 396189 397463 398130 398664 399714 401659 404392 407558
59749D07558L397L574L487K999K573K777L371L558L232L072L277L068J998Q51
$$ 407558 410955 414529 418016 421015 423588 426365 429736 433294 436526 439598 442875 445943 447941 448792
59735D48792O29J135J404J106P71P97R24O96Pq07j188q01o1R6p19j869k463k262
$$ 448792 449421 450556 451960 453066 453837 454634 455558 456254 456261 455454 454266 453465 453404 453500 452781 450912 448449 446187
59717D46187j496m02N54O21k55q77j42J376K118J716J355J896K693K705J948J233
$$ 446187 444691 444289 444843 445464 445209 444332 444190 445566 447684 449400 450755 452651 455344 458049 459997 461230
59701D61230R88R50P84N22M76Q93J576J872J248qj024j332j245j211j195r41n22
$$ 461230 462218 463168 463952 464474 464950 465843 467419 469291 470539 470531 469507 468175 466930 465719 464524 463583 463061
59684D63061k31j80k59m31q49j619k501k972k682j950j546j904k660l207l404
$$ 463061 462830 462650 462391 461960 461111 459492 456991 454019 451337 449387 447841 445937 443277 440070 436666
59669D36666l420l140k310j166l80l16o67r46r27n98l4N81J138J761K448K742
$$ 436666 433246 430106 427796 426630 426250 425934 425267 424321 423394 422796 422762 423343 424481 426242 428690 431432
59653D31432K234J334R03J089J173P18J62k1j01n89j444k244k770l015k872k349
$$ 431432 433666 435000 435903 436992 438165 438883 439045 439024 438923 438334 436890 434646 431876 428861 425989 423640
59637D23640j848j809k205k622k700k263j300k04K82k68j455k504l071l308l343
$$ 423640 421792 419983 417778 415156 412456 410193 408893 408689 408971 408703 407248 404744 401673 398365 395022
59622C95022l106k597j970j371r15q03j119j592j804j662j446j406j476j409r97
$$ 395022 391916 389319 387349 385978 385063 384260 383141 381549 379745 378083 376637 375231 373755 372346 371349
59607C71349k31O31J170J207J050J140J454J484R03O5l21j4N49Q35Q26Q28Q53
$$ 371349 371118 371749 372919 374126 375176 376316 377770 379254 380157 380222 379901 379887 380436 381271 382097 382925 383778
59590C83778N51j57q03r57p58n95n34m88o55j249j960k224k045j954k125k112
$$ 383778 384329 384172 383369 382412 381654 381059 380525 380037 379382 378133 376173 373949 371904 369950 367825 365713
59574C65713j638j075r14j187j628j948j731o22R99J971J483M3j036r49j1Q32
$$ 365713 364075 363000 362086 360899 359271 357323 355592 354970 355969 357940 359423 359466 358430 357481 357470 358302
59558C58302Q96L54J19Q83K296L393L794L917M013L789L288L278M218N518O479
$$ 358302 359198 359552 359671 360554 362850 366243 370037 373954 377967 381756 385044 388322 392540 398058 404537
59543D04537P333Q617J0135J1467J2998J5198J7080J6615J3063P991L550M58j884
$$ 404537 411870 420487 430622 442089 455087 470285 487365 503980 517043 525034 528584 529042 527158
59530E27158l954n474n951n289l826k096o16K40L51j06p16j117j365j834k697
$$ 527158 523204 517730 511779 506490 502664 500568 499952 500192 500543 500437 499721 498604 497239 495405 492708
59515D92708l708m607n428o201o684o759o768p048p319p022o118n163m630m538
$$ 492708 489000 484393 478965 472764 466080 459321 452553 445505 438186 431164 425046 419883 415253 410715
59501D10715m630m577m068l063j920j019m70l28p10j308j277k33R33J048K44k52
$$ 410715 406085 401508 397440 394377 392457 391438 390968 390640 389930 388622 387345 387112 388045 389093 389337 389085
59485C89085J93R90J434J591J822K146K482K876L271L447L514L832M285M182L256
$$ 389085 389278 390268 391702 393293 395115 397261 399743 402619 405890 409337 412851 416683 420968 425150 428406
59470D28406K197J735J665J294N18p9J4P90J913K990L754M267M851N627O224O275
$$ 428406 430603 432338 434003 435297 435815 435736 435750 436540 438453 441443 445197 449464 454315 459942 466166 472441
59454D72441O006O071O673P175O740N391M168L922M158L494J461q85k461l584
$$ 472441 478447 484518 491191 498366 505106 510497 514665 518587 522745 526239 527700 526815 524354 520770
59440E20770n069o539o814n803m745m404m232l705l301l460l539k713j212J54
$$ 520770 515701 509162 502348 496545 491800 487396 483164 479459 476158 472698 469159 466446 465234 465388
59426D65388J174K136L064L954N250P216R170J0273J0838J1905J3771J5850J7841
$$ 465388 466562 468698 471762 475716 480966 488182 497352 507625 518463 530368 544139 559989 577830
59413E77830J9753K0708J9056J4316Q092K411k153o077r335j1176j1082r185n846
$$ 577830 597583 618291 637347 651663 659755 662166 660013 653936 644601 633425 622343 613158 607312
59400F07312j771J564K435L42l484p401j0854j4147j7122j8793j8535j7020j5505
$$ 607312 605541 607105 609540 609882 606398 598997 588143 573996 556874 538081 519546 502526 487021
59387D87021j4401j3074j1014q670o812n499m138k498j126o64r58j183p13K71
$$ 487021 472620 459546 448532 439862 433050 427551 423413 420915 419789 419125 418167 416984 416271 416542
59373D16542J080J293J110R96J171J550K053K695L380L827L893L808L981M579
$$ 416542 417622 418915 420025 421021 422192 423742 425795 428490 431870 435697 439590 443398 447379 451958
59359D51958N302N672N548N394N851O947P991Q441Q580Q975R574R973J0343J1286
$$ 451958 457260 462932 468480 473874 479725 486672 494663 503104 511684 520659 530233 540206 550549 561835
59345E61835J2616J3163J2240J0591R341Q596P721O496N163L628J538r24l047
$$ 561835 574451 587614 599854 610445 619786 628382 636103 642599 647762 651390 652928 652004 648957
59332F48957m573n943p431q622r083q991q790q567q125p435o668n988n539n447
$$ 648957 644384 638441 631010 622388 613305 604314 595524 586957 578832 571397 564729 558741 553202 547755
59318E47755n608n581n009m102l536l866n062o498p324p036n913m835m482m629
$$ 547755 542147 536566 531557 527455 523919 520053 514991 508493 501169 494133 488220 483385 478903 474274
59304D74274m393l239j623m98k89n53o81n69l79M3R95K155K623J984R71O19J100
$$ 474274 469881 466642 465019 464521 464232 463679 462998 462429 462050 462093 463088 465243 467866 469850 470821 471440 472540
59287D72540J723J926J774J599J610J912K492L069L309L338L727M834O310P406
$$ 472540 474263 476189 477963 479562 481172 483084 485576 488645 491954 495292 499019 503853 510163 517569
59273E17569P652P145O435O145O537P241P457O593M721K522Q07j8k98q74k266
$$ 517569 525221 532366 538801 544946 551483 558724 566181 572774 577495 580017 580824 580806 580508 579634 577368
59258E77368m017n112n083m540m444n113o009o371n893m853l841l292l218l286
$$ 577368 573351 568239 563156 558616 554172 549059 543050 536679 530786 525933 522092 518800 515582 512296
59244E12296l131k589j705o89J84P45J105J518J993K198J856J177O75N44L72l78
$$ 512296 509165 506576 504871 504182 504366 505111 506216 507734 509727 511925 513781 514958 515633 516177 516549 516171
59228E16171j731l191m321n123n760o184o279o184o143o049n544m634l851l631
$$ 516171 514440 511249 506928 501805 496045 489861 483582 477398 471255 465206 459662 455028 451177 447546
59214D47546l790l814l428k656j683q60n90q02p66J52J653K797L087K883K735
$$ 447546 443756 439942 436514 433858 432175 431315 430725 429923 429157 429309 430962 433759 436846 439729 442464
59199D42464K711K522K051J520J227J202J166Q77N60P35J518K370K773K915L300
$$ 442464 445175 447697 449748 451268 452495 453697 454863 455740 456300 457035 458553 460923 463696 466611 469911
59184D69911L924M342M404M409M514M496M240L985L923L977M102M443M957N269
$$ 469911 473835 478177 482581 486990 491504 496000 500240 504225 508148 512125 516227 520670 525627 530896
59170E30896N115M700M335M040L718L476L472L564L368K677J641O29j10p36j735
$$ 530896 536011 540711 545046 549086 552804 556280 559752 563316 566684 569361 571002 571631 571521 570785 569050
59155E69050l299m799n243m417l235k781l285m161m777m849m369l517k606j947
$$ 569050 565751 560952 555709 551292 548057 545276 541991 537830 533053 528204 523835 520318 517712 515765
59141E15765j723k029k709l183k793j618n67l89q82j317j278p65J75J347K264
$$ 515765 514042 512013 509304 506121 503328 501710 501143 500754 499872 498555 497277 496512 496687 498034 500298
59126E00298K645K842L310L877M186M567N606O916P376O818O505P414Q886R697
$$ 500298 502943 505785 509095 512972 517158 521725 527331 534247 541623 548441 554946 562360 571246 580943
59112E80943R749R831J0246J0650J0971J1478J1955J1795J1024J0357J0020R360
$$ 580943 590692 600523 610769 621419 632390 643868 655823 667618 678642 688999 699019 708379
59100G08379P995O506N492M646L445K131J228N60l94j459j950j767j512j570j816
$$ 708379 716374 722880 728372 733018 736463 738594 739822 740382 739988 738529 736579 734812 733300 731730 729914
59085G29914k290l336m889o356p418q307r104r468r363r328r694j0130j0350j0535
$$ 729914 727624 724288 719399 713043 705625 697318 688214 678746 669383 660055 650361 640231 629881 619346
59071F19346j0704j0328r238q115p481o891n946n385o046p243p451o387n190m576
$$ 619346 608642 598314 589076 580961 573480 566589 560643 555258 549212 541969 534518 528131 522941 518365
59057E18365m074l307k712k532k194j376p79j109j949k372k118j538p94R1P90
$$ 518365 514291 510984 508272 505740 503546 502170 501391 500282 498333 495961 493843 492305 491511 491602 492392
59042D92392R31O95N97Q15J208J745K419K906K854K446K250K504K968L441M117
$$ 492392 493323 494018 494615 495430 496638 498383 500802 503708 506562 509008 511258 513762 516730 520171 524288
59027E24288N297P019Q885J0265J0817J0979J1585J2804J3825J3940J3414J2808
$$ 524288 529585 536604 545489 555754 566571 577550 589135 601939 615764 629704 643118 655926
59015F55926J1855R896P165M823L580K985K260J179j22j535k749l156k484j286
$$ 655926 667781 677677 684842 689665 693245 696230 698490 699669 699547 698012 695263 692107 689623 688337
59001F88337l53J37N65J173J817K241K231J555J97j402k638l413m227n496p017
$$ 688337 687984 688121 688686 689859 691676 693917 696148 697703 697900 696498 693860 690447 686220 680724 673707
58986F73707q201q735q791q744q756q699q364p726o961o142n109l753k389j490
$$ 673707 665506 656771 647980 639236 630480 621781 613417 605691 598730 592588 587479 583726 581337 579847
58972E79847r78j33J511L385M434M357L877L747L953M100M159M421M916N355N481
$$ 579847 578869 578736 580247 583632 588066 592423 596300 600047 604000 608100 612259 616680 621596 626951 632432
58957F32432N142M115K348M04q87j352j757k888m672o390p441p628o951n639m322
$$ 632432 637574 641689 644037 644441 643554 642202 640445 637557 632885 626495 619054 611426 604475 598836 594514
58942E94514l716l928m275l993l118k459k706l717m757n319n492n537n452n096
$$ 594514 590798 586870 582595 578602 575484 573025 570319 566602 561845 556526 551034 545497 540045 534949
58928E34949m500l809l097k535k527l254m156m325l475k197j221p74o68n79j34
$$ 534949 530449 526640 523543 521008 518481 515227 511071 506746 503271 501074 499853 499079 498411 497832 497698
58913D97698Q22J863K290J985J635J886K741L951N518P263Q435Q381P458O712
$$ 497698 498520 500383 502673 504658 506293 508179 510920 514871 520389 527652 536087 544468 551926 558638
58899E58638O679O937O889O497O200O345O862P327P424P414P977R368J0917J1694
$$ 558638 565317 572254 579143 585640 591840 598185 605047 612374 619798 627212 635189 644557 655474 667168
58885F67168J1585J1275J1204J0974R948Q129O174M644L337J513j167m051o084
$$ 667168 678753 690028 701232 712206 722154 730283 736457 741101 744438 745951 744784 740733 734649
58872G34649p056p841r181j0578j0876r758q108o935o392o018n511m961m522m162
$$ 734649 727593 719752 710571 699993 689117 679359 671251 664316 657924 651906 646395 641434 636912 632750
58858F32750l833l722m168n115n829n588m687m269m897n784n897n332m951m981
$$ 632750 628917 625195 621027 615912 610083 604495 599808 595539 590642 584858 578961 573629 568678 563697
58844E63697m827m186l540l355l496l724m098m595m799m468l963l764l835l831
$$ 563697 558870 554684 551144 547789 544293 540569 536471 531876 527077 522609 518646 514882 511047 507216
58830E07216l614l226k643j966j601j836k351k482j984j225o49l51j82j5J49K46
$$ 507216 503602 500376 497733 495767 494166 492330 489979 487497 485513 484288 483639 483288 483106 483091 483240 483486
58814D83486K83M54R91J824K515K723K571K393K200J687P72j12l92O0P81J139
$$ 483486 483769 484223 485214 487038 489553 492276 494847 497240 499440 501127 501899 501787 501395 501455 502236 503375
58798E03375R25M90K82L13K45o3l42l12n5J69K70L10K89K67N81J620L281M827
$$ 503375 504300 504790 505072 505385 505630 505567 505225 504913 504858 505027 505297 505607 505896 506163 506744 508364 511645 516472
58780E16472N490N179M511M088L893L422K445J378Q02P16N27k43j497k791l780
$$ 516472 521962 527141 531652 535740 539633 543055 545500 546878 547680 548396 548923 548680 547183 544392 540612
58765E40612m339m448m151l545k766j986j423j137r06n59k96m14o69m43M19J361
$$ 540612 536273 531825 527674 524129 521363 519377 517954 516817 515911 515352 515056 514642 513973 513530 513949 515310
58749E15310J916K252K614K783K602K530L075L905M193L729L057K663K663L147
$$ 515310 517226 519478 522092 524875 527477 530007 533082 536987 541180 544909 547966 550629 553292 556439
58735E56439M194N416O198O511O859P277P191O461N813N713N542M522K900J498
$$ 556439 560633 566049 572247 578758 585617 592894 600085 606546 612359 618072 623614 628136 631036 632534
58721F32534N90n5k94K79J481K604L405M258N245N773N390M449L579K944K288
$$ 632534 633124 633069 632775 633054 634535 637139 640544 644802 650047 655820 661210 665659 669238 672182 674470
58706F74470J441N02l85j251k394m177o535q810j0362j1253j1906j2295j2058
$$ 674470 675911 676413 676028 674777 672383 668206 661671 652861 642499 631246 619340 607045 594987
58693E94987j1335j0778j0555j0112r154q214p766p393o444n008l764l076k786
$$ 594987 583652 572874 562319 552207 543053 534839 527073 519680 513236 508228 504464 501388 498602
58680D98602k641k460k056j375o01J01P23J132J127J001J545L018M610N485N823
$$ 498602 495961 493501 491445 490070 489469 489570 490293 491425 492552 493553 495098 498116 502726 508211 514034
58665E14034O281O907P294P411P396O875N368L237J395J25r83k034k665k840k990
$$ 514034 520315 527222 534516 541927 549323 556198 561566 564803 566198 566323 565340 563306 560641 557801 554811
58650E54811l224l159k708k249j928j499j024r42j239j340j011o47m52j08M57
$$ 554811 551587 548428 545720 543471 541543 540044 539020 538078 536839 535499 534488 533841 533389 533281 533738
58635E33738P51N26K26K88O05R58J279J274N83l69m99N14J701K154K095K169K497
$$ 533738 534489 535015 535241 535529 536134 537092 538371 539645 540228 539859 539360 539874 541575 543729 545824 547993 550490
58618E50490K996L786M654M921M506M305M791N090M370L244K769K723K070O78
$$ 550490 553486 557272 561926 566847 571353 575658 580449 585539 589909 593153 595922 598645 600715 601393
58604F01393o27j365j655j486p82n9nn16j026j462j946j910p42R36J838J888K210
$$ 601393 600766 599401 597746 596260 595478 595419 595414 594898 593872 592410 590464 588554 587812 588748 590586 592474 594684
58587E94684L232M117M367M694N664O681P012O944P125P411P196O473N868N805
$$ 594684 597916 602033 606400 611094 616758 623439 630451 637395 644520 651931 659127 665600 671468 677273
58573F77273O165O622O968P235P684Q509R487J0174J0556J1106J2141J3473J4819
$$ 677273 683438 690060 697028 704263 711947 720456 729943 740117 750673 761779 773920 787393 802212
58560H02212J6109J7291J8098J8285J7837J6819J5265J3229J0775P993N246L182
$$ 802212 818321 835612 853710 871995 889832 906651 921916 935145 945920 953913 959159 962341
58548I62341K121J520M80j308l504n750p881r665j0932j1900j2856j3645j3963
$$ 962341 964462 965982 966462 965154 961650 955900 948019 938354 927422 915522 902666 889021 875058
58535H75058j4007j4178j4321j3940j3081j2217j1330r928p982o058m451k956
$$ 875058 861051 846873 832552 818612 805531 793314 781984 772056 764074 758016 753565 750609
58523G50609j626q73o82m78O0P57J531K408K910K439J547J620K955M156M028K998
$$ 750609 748983 748110 747428 746950 747010 747767 749298 751706 754616 757055 758602 760222 763177 767333 771361 774359
58507G74359K002R85m82j928k498k289k132k322k440k279k094k003j856j705j747
$$ 774359 776361 777346 776864 774936 772438 770149 768017 765695 763255 760976 758882 756879 755023 753318 751571
58492G51571j805j351k32J055J950K394K802L583M808O186P420Q473R406J0096
$$ 751571 749766 748415 748183 749238 751188 753582 756384 759967 764775 770961 778381 786854 796260 806356
58478H06356J0386J0423J0443J0273R513Q252P035O036M810L079J222k89j435
$$ 806356 816742 827165 837608 847881 857394 865646 872681 878717 883527 886606 887828 887539 886104
58465H86104k356l001l372l684l926l611k339l49J749L493M693N351N676N893
$$ 886104 883748 880747 877375 873691 869765 866154 863815 863466 865215 868708 873401 878752 884428 890321
58451H90321N885N358M345L237K190J009l79j723k741l209k879j898j098j135
$$ 890321 896206 901564 905909 909146 911336 912345 911966 910243 907502 904293 901414 899516 898418 897283
58437H97283j422q05P56K173K985L886N282O479O963P346Q277R322R799R950J0429
$$ 897283 895861 895056 895812 897985 900970 904856 910138 916617 923580 930926 939203 948525 958324 968274 978703
58422I78703J1199J1735J1804J1321R966P734N408L819K919K075R36m79j945k894
$$ 978703 989902 1001637 1013441 1024762 1034728 1042462 1047870 1051689 1054608 1056683 1057619 1057140 1055195 1052301
58408A052301k746j917j727k664l502k947j411j74N32J418K629L606M320N398
$$ 1052301 1049555 1047638 1045911 1043247 1039745 1036798 1035387 1035213 1035745 1037163 1039792 1043398 1047718 1053116
58394A053116O942Q141Q357P846P177O526N728M658L346K088J392J556K353L313
$$ 1053116 1060058 1068199 1076556 1084402 1091579 1098105 1103833 1108491 1111837 1113925 1115317 1116873 1119226 1122539
58380A122539M133M630M582M055L631L904M834N853O502O789P060P658Q549R300
$$ 1122539 1126672 1131302 1135884 1139939 1143570 1147474 1152308 1158161 1164663 1171452 1178512 1186170 1194719 1204019
58366A204019R703J0141J0948J1647J1604J1257J1706J3033J4054J4017J3451
$$ 1204019 1213722 1223863 1234811 1246458 1258062 1269319 1281025 1294058 1308112 1322129 1335580
58355A335580J3011J2533J1742J0927J0361R915R685J0084J0865J1170J0986J1372
$$ 1335580 1348591 1361124 1372866 1383793 1394154 1404069 1413754 1423838 1434703 1445873 1456859 1468231
58343A468231J2632J3595J3539J3484J4484J5889J6599J6968J8021J9555K0482
$$ 1468231 1480863 1494458 1507997 1521481 1535965 1551854 1568453 1585421 1603442 1622997 1643479
58332A643479K0495K0128J9622J8923J8350J8110J7561J6016J3933J2395J1787
$$ 1643479 1663974 1684102 1703724 1722647 1740997 1759107 1776668 1792684 1806617 1819012 1830799
58321A830799J1780J2139J2631J2783J2598J2955J4428J6301J7602J8433J9395
$$ 1830799 1842579 1854718 1867349 1880132 1892730 1905685 1920113 1936414 1954016 1972449 1991844
58310A991844K0463K1357K2278K3366K4111K4255K4478K5314K6327K7146K8258
$$ 1991844 2012307 2033664 2055942 2079308 2103419 2127674 2152152 2177466 2203793 2230939 2259197
58299B259197K9762L0558L0055K9426K9826L0528L0368K9858L0201L1253L2190
$$ 2259197 2288959 2319517 2349572 2378998 2408824 2439352 2469720 2499578 2529779 2561032 2593222
58288B593222L3298L5230L7383L8795L9924M1735M3820M5253M6514M8619N1039
$$ 2593222 2626520 2661750 2699133 2737928 2777852 2819587 2863407 2908660 2955174 3003793 3054832
58277C054832N2511N3353N4877N7011N8490N9023N9441O0020O0593O1813O4455
$$ 3054832 3107343 3160696 3215573 3272584 3331074 3390097 3449538 3509558 3570151 3631964 3696419
58266C696419O7753P0225P1842P3700P6081P8571Q1485Q5320Q9218R1865R3445
$$ 3696419 3764172 3834397 3906239 3979939 4056020 4134591 4216076 4301396 4390614 4482479 4575924
58255D575924R5163R7462J00223J03834J08380J12754J16308J20230J25578J31466
$$ 4575924 4671087 4768549 4868772 4972606 5080986 5193740 5310048 5430278 5555856 5687322
58245E687322J37055J43550J51949J60677J68183J75926J85863J96867K06984
$$ 5687322 5824377 5967927 6119876 6280553 6448736 6624662 6810525 7007392 7214376
58236G214376K17403K30534K45753K60864K76237K93563L12097L30273L49592
$$ 7214376 7431779 7662313 7908066 8168930 8445167 8738730 9050827 9381100 9730692
58227I730692L72478L97820M23216M50175M82120N18607N56903N98052O45859
$$ 9730692 10103170 10500990 10924206 11374381 11856501 12375108 12932011 13530063 14175922
58218A4175922P00870P61150Q28108R05624R94387J093196J204948J334968J484935
$$ 14175922 14876792 15637942 16466050 17371674 18366061 19459257 20664205 21999173 23484108
58209B3484108J655433J853074K087483K363153K683144L058160L499747M004484
$$ 23484108 25139541 26992615 29080098 31443251 34126395 37184555 40684302 44688786
58201D4688786M558998N166654N861766O695338P714034Q951470J0427965J2156494
$$ 44688786 49247784 54414438 60276204 66971542 74685576 83637046 94065011 106221505
58193A06221505J4155499J6448236J9030215K1828753K4676519K7255651K8991556
$$ 106221505 120377004 136825240 155855455 177684208 202360727 229616378 258607934
58186B58607934K9043067K6590277K1338124J3812441N132670l535407j1349969
$$ 258607934 287651001 314241278 335579402 349391843 354524513 350989106 339639137
58179C39639137j7784368k2489183k5298903k6329079k5954637k4642531k2795146
$$ 339639137 321854769 299365586 274066683 247737604 221782967 197140436 174345290
58172A74345290k0701900j8554813j6467877j4499544j2682546j1038900r575317
$$ 174345290 153643390 135088577 118620700 104121156 91438610 80399710 70824393
58165G0824393q283340p151649o171256n328770m605446l985779l459460l014120
$$ 70824393 62541053 55389404 49218148 43889378 39283932 35298153 31838693 28824573
58157B8824573k634200k308275k030474j794003j590028j413315j262319j133003
$$ 28824573 26190373 23882098 21851624 20057621 18467593 17054278 15791959 14658956
58149A4658956j018787r16873q28463p52272o83860o21701n67889n21979m79949
$$ 14658956 13640169 12723296 11894833 11142561 10458701 9837000 9269111 8747132 8267183
58140H267183m40213m05154l75534l48504l22464k98990k78615k59245k40179
$$ 8267183 7826970 7421816 7046282 6697778 6375314 6076324 5797709 5538464 5298285
58131E298285k23429k09680j96903j84180j73096j64068j55085j45382j36754
$$ 5298285 5074856 4865176 4668273 4484093 4310997 4146929 3991844 3846462 3709708
58122C709708j29960j23279j15806j08952j03373r7759r1869q7457q4834q1718
$$ 3709708 3579748 3456469 3340663 3231711 3128338 3030579 2938710 2851253 2766419 2684701
58112B684701p7070p2903p0690o8825o5620o2123o0000n8812n7356n5770n4551
$$ 2684701 2607631 2534728 2464038 2395213 2329593 2267470 2207470 2148658 2091302 2035532 1980981
58101A980981n3120n0958m8732m6953m4939m2234l9568l7456l5216l2416k9772
$$ 1980981 1927861 1876903 1828171 1781218 1736279 1694045 1654477 1617021 1581805 1549389 1519617
58090A519617k7755k5759k3471k1576k0300j8868j7211j6576j7417j8230j7676
$$ 1519617 1491862 1466103 1442632 1421056 1400756 1381888 1364677 1348101 1330684 1312454 1294778
58079A294778j6475j6093j6702j7551j8254j8712j8625j8051j7621j7568j7297
$$ 1294778 1278303 1262210 1245508 1227957 1209703 1190991 1172366 1154315 1136694 1119126 1101829
58068A101829j6486j5625j5003j4146j2828j1614j0874j0169r169q281p912p897
$$ 1101829 1085343 1069718 1054715 1040569 1027741 1016127 1005253 995084 985915 977634 969722 961825
58056I61825q057q424q692q367p705p527p908q060p708p421p424p304p104p466
$$ 961825 953768 945344 936652 928285 920580 913053 905145 897085 889377 881956 874532 867228 860124 852658
58042H52658q268q411p471o450o325o850p270p286o890o128n423n339n735n970
$$ 852658 844390 835979 828508 822058 815733 808883 801613 794327 787437 781309 775886 770547 764812 758842
58028G58842n981o344p140p819q120q086p305n438l424k731l334l848l758l848
$$ 758842 752861 746517 739377 731558 723438 715352 708047 702609 699185 696454 693120 689272 685514 681666
58014F81666m264m039k976k280k532k659j813p38m37p10r57j183j320p36O32J738
$$ 681666 677402 673363 670387 668107 665575 662916 661103 660365 659928 659218 658261 657078 655758 655022 655654 657392
57998F57392J817J339R13L24n20r29n79k53n31p22p1R80J646J936K052J601M43
$$ 657392 659209 660548 661461 661785 661265 660336 659757 659504 658973 658251 658180 659160 660806 662742 664794 666395 666838
57981F66838n59o83n02q75j537j698j436j406j669j724j385q15j16M97O09J99
$$ 666838 666279 665596 665094 664219 662682 660984 659548 658142 656473 654749 653364 652549 652433 652930 653539 653738
57965F53738j29J6L74Q14J674K787L191K492J636J468J512J105P63J300K300K710
$$ 653738 653609 653625 653999 654813 656487 659274 662465 664957 666593 668061 669573 670678 671441 672741 675041 677751
57949F77751K425K137K078K053K345L401M827N738O014O334P035P759Q267Q770
$$ 677751 680176 682313 684391 686444 688789 692190 697017 702755 708769 715103 722138 729897 738164 746934
57935G46934R406R986J0291J0185R485Q071O076L711J094j465l416m538n242o015
$$ 746934 756340 766326 776617 786802 796287 804358 810434 814145 815239 813774 810358 805820 800578 794563
57921G94563o892p665q221q422q168p728p460p066n900m191l017k716k399j479
$$ 794563 787671 780006 771785 763363 755195 747467 740007 732941 727041 722850 719833 717117 714718 713239
57907G13239o22l67n2J002K104K252J727J491J582J390R95J007J359J514J605
$$ 713239 712617 712250 712198 713200 715304 717556 719283 720774 722356 723746 724741 725748 727107 728621 730226
57892G30226K213L184L776L934M277M854N002M572M205M158L805K663J076m14
$$ 730226 732439 735623 739399 743333 747610 752464 757466 762038 766243 770401 774206 776869 777945 777531
57878G77531j664k536k649k089j737k256l042k842j457j82k91j396j903j059J06
$$ 777531 775867 773331 770682 768593 766856 764600 761558 758716 757259 757077 756786 755390 753487 752428 752534
57863G52534L25r6J92J530K881L555M143N274O472O919O605O019N334M581M062
$$ 752534 752859 752763 752955 754485 757366 760921 765064 770338 776810 783729 790334 796353 801687 806268 810330
57848H10330L864L506K707J983J815J800J400Q94P72O95P0p24p53O8R46J463J891
$$ 810330 814194 817700 820407 822390 824205 826005 827405 828299 829071 829766 829836 829112 828359 828427 829373 830836 832727
57831H32727K417K898L436M279N109N277M809M504M808N254N200M612L938L590
$$ 832727 835144 838042 841478 845757 850866 856143 860952 865456 870264 875518 880718 885330 889268 892858
57817H92858L633L662L063J741M45j00j64n02j127j278o63J02M02L95N26P75P84
$$ 892858 896491 900153 903216 904957 905402 905302 905138 904636 903509 902231 901568 901670 902072 902467 902993 903768 904552
57800I04552N15L31M92P64P45N27P37J721K841L111K468J860K086L037M266N501
$$ 904552 905067 905398 905890 906654 907399 907926 908663 910384 913225 916336 918804 920664 922750 925787 930053 935554
57784I35554O425O670O470O649P501Q335Q564Q530Q714Q869Q633Q318Q314Q267
$$ 935554 941979 948649 955119 961768 969269 977604 986168 994698 1003412 1012281 1020914 1029232 1037546 1045813
57770A045813P665O700N749M626L148J882J344R82Pj221j698j328q70o32l23J4
$$ 1045813 1053478 1060178 1065927 1070553 1073701 1075583 1076927 1077909 1077916 1076695 1074997 1073669 1072799 1072167 1071844 1071858
57754A071858M0j0M24J177J556J487J458J446J000L06J33O17J216J836K865L975
$$ 1071858 1071898 1071888 1072312 1073489 1075045 1076532 1077990 1079436 1080436 1080742 1080875 1081492 1082708 1084544 1087409 1091384
57738A091384M172L373K759L146M052M757N253N631N540M916M373M269M129L569
$$ 1091384 1095556 1098929 1101688 1104834 1108886 1113643 1118896 1124527 1130067 1134983 1139356 1143625 1147754 1151323
57724A151323L102L306L876M210M406M938N731O257O275N918N245M342L675L782
$$ 1151323 1154425 1157731 1161607 1165817 1170223 1175161 1180892 1187149 1193424 1199342 1204587 1208929 1212604 1216386
57710A216386M509N008M616L666L225M044N709O957O930N960M999M597M731N250
$$ 1216386 1220895 1225903 1230519 1234185 1237410 1241454 1247163 1254120 1261050 1267010 1272009 1276606 1281337 1286587
57696A286587N913O260O039N701N891O559P143P471P795Q075P971P627P632Q173
$$ 1286587 1292500 1298760 1304799 1310500 1316391 1322950 1330093 1337564 1345359 1353434 1361405 1369032 1376664 1384837
57682A384837Q831R354R954J0752J1652J2855J4780J7305J9852K2372K5462K9317
$$ 1384837 1393668 1403022 1412976 1423728 1435380 1448235 1463015 1480320 1500172 1522544 1548006 1577323
57670A577323L3400L7411M1656M5852M8371M7310M1961L2850K1049Q007m397j4536
$$ 1577323 1610723 1648134 1689790 1735642 1784013 1831323 1873284 1906134 1927183 1935190 1930793 1916257
57658A916257k1709k5995k7680k7200k5252k2559j9543j6349j3001r488o049l363
$$ 1916257 1894548 1868553 1840873 1813673 1788421 1765862 1746319 1729970 1716969 1707481 1701432 1698069
57646A698069j940j284k98J338K786L380L619M418N856P171P775P812P828Q187
$$ 1698069 1696129 1694845 1694547 1695885 1698671 1702051 1705670 1710088 1715944 1723115 1730890 1738702 1746530 1754717
57632A754717Q690Q811Q429Q187Q688R510R624Q795P820P371P335P469P902Q652
$$ 1754717 1763407 1772218 1780647 1788834 1797522 1807032 1816656 1825451 1833271 1840642 1847977 1855446 1863348 1872000
57618A872000R360R830J0237J0478J0066R048Q295Q392Q855Q985Q893R131R817
$$ 1872000 1881360 1891190 1901427 1911905 1921971 1931019 1939314 1947706 1956561 1965546 1974439 1983570 1993387
57605A993387J0660J1419J1854J1703J1172J0929J1205J1370J0986J0559J0648
$$ 1993387 2004047 2015466 2027320 2039023 2050195 2061124 2072329 2083699 2094685 2105244 2115892
57594B115892J0842J0525J0136J0628J1874J2604J2088J1040J0620J1157J2106
$$ 2115892 2126734 2137259 2147395 2158023 2169897 2182501 2194589 2205629 2216249 2227406 2239512
57583B239512J2856J3224J3357J3416J3379J3123J2674J2210J1803J1464J1384
$$ 2239512 2252368 2265592 2278949 2292365 2305744 2318867 2331541 2343751 2355554 2367018 2378402
57572B378402J1830J2649J3298J3536J3642J3824J3835J3512J3203J3222J3345
$$ 2378402 2390232 2402881 2416179 2429715 2443357 2457181 2471016 2484528 2497731 2510953 2524298
57561B524298J3274J3216J3540J4090J4391J4349J4330J4635J5242J5975J6572
$$ 2524298 2537572 2550788 2564328 2578418 2592809 2607158 2621488 2636123 2651365 2667340 2683912
57550B683912J6750J6445J5975J5748J5885J6221J6500J6530J6345J6299J6667
$$ 2683912 2700662 2717107 2733082 2748830 2764715 2780936 2797436 2813966 2830311 2846610 2863277
57539B863277J7169J7254J6868J6519J6508J6614J6633J6655J6674J6544J6465
$$ 2863277 2880446 2897700 2914568 2931087 2947595 2964209 2980842 2997497 3014171 3030715 3047180
57528C047180J6865J7524J7582J6807J6126J6415J7359J8031J8071J7765J7499
$$ 3047180 3064045 3081569 3099151 3115958 3132084 3148499 3165858 3183889 3201960 3219725 3237224
57517C237224J7582J8150J8843J9108J9092J9504K0326K0640K0255K0250K1093
$$ 3237224 3254806 3272956 3291799 3310907 3329999 3349503 3369829 3390469 3410724 3430974 3452067
57506C452067K1439K0124J8357J8278J9900K1217K1092K0426K0344K0767K1121
$$ 3452067 3473506 3493630 3511987 3530265 3550165 3571382 3592474 3612900 3633244 3654011 3675132
57495C675132K1192K0835J9915J8950J8904J9896K0988K1530K1857K2242K2192
$$ 3675132 3696324 3717159 3737074 3756024 3774928 3794824 3815812 3837342 3859199 3881441 3903633
57484C903633K1380K0485K0341K0813K1226K1500K2085K3028K3748K3778K3334
$$ 3903633 3925013 3945498 3965839 3986652 4007878 4029378 4051463 4074491 4098239 4122017 4145351
57473D145351K3043K3338K4093K4729K4740K4166K3513K3228K3413K3965K4750
$$ 4145351 4168394 4191732 4215825 4240554 4265294 4289460 4312973 4336201 4359614 4383579 4408329
57462D408329K5574K6238K6637K6744K6559K6211K5999K6098K6399K6765K7207
$$ 4408329 4433903 4460141 4486778 4513522 4540081 4566292 4592291 4618389 4644788 4671553 4698760
57451D698760K7623K7718K7473K7338K7546K7687K7498K7546K8319K9080K8700
$$ 4698760 4726383 4754101 4781574 4808912 4836458 4864145 4891643 4919189 4947508 4976588 5005288
57440E005288K7521K7233K8574L0224L0459K9217K7901K7642K8328K9077K9236
$$ 5005288 5032809 5060042 5088616 5118840 5149299 5178516 5206417 5234059 5262387 5291464 5320700
57429E320700K8944K8910K9528L0324L0590L0410L0412L0659L0514K9799K9272
$$ 5320700 5349644 5378554 5408082 5438406 5468996 5499406 5529818 5560477 5590991 5620790 5650062
57418E650062K9565L0297L0749L0820L0836L0892L0932L1168L1768L2367L2462
$$ 5650062 5679627 5709924 5740673 5771493 5802329 5833221 5864153 5895321 5927089 5959456 5991918
57407E991918L2116L1853L1918L2140L2383L2731L3210L3681L4105L4542L4933
$$ 5991918 6024034 6055887 6087805 6119945 6152328 6185059 6218269 6251950 6286055 6320597 6355530
57396F355530L5107L5065L5017L5073L5096L4903L4486L3986L3559L3353L3450
$$ 6355530 6390637 6425702 6460719 6495792 6530888 6565791 6600277 6634263 6667822 6701175 6734625
57385F734625L3777L4114L4216L4001L3610L3329L3427L3961L4667L5055L4683
$$ 6734625 6768402 6802516 6836732 6870733 6904343 6937672 6971099 7005060 7039727 7074782 7109465
57374G109465L3544L2226L1533L1835L2717L3351L3206L2442L1717L1613L2115
$$ 7109465 7143009 7175235 7206768 7238603 7271320 7304671 7337877 7370319 7402036 7433649 7465764
57363G465764L2586L2424L1792L1510L2100L3158L3811L3676L3192L3094L3668
$$ 7465764 7498350 7530774 7562566 7594076 7626176 7659334 7693145 7726821 7760013 7793107 7826775
57352G826775L4411L4429L3390L2111L1797L2648L3630L3857L3631L3663L3809
$$ 7826775 7861186 7895615 7929005 7961116 7992913 8025561 8059191 8093048 8126679 8160342 8194151
57341H194151L3340L2219L1334L1389L2094L2701L2825L2581L2219L1914L1714
$$ 8194151 8227491 8259710 8291044 8322433 8354527 8387228 8420053 8452634 8484853 8516767 8548481
57330H548481L1593L1495L1339L1019L0583L0376L0642L0922L0396K9040K7885
$$ 8548481 8580074 8611569 8642908 8673927 8704510 8734886 8765528 8796450 8826846 8855886 8883771
57319H883771K7724K8128K8291K8207K8224K8019K7084K5905K5506K5829K5741
$$ 8883771 8911495 8939623 8967914 8996121 9024345 9052364 9079448 9105353 9130859 9156688 9182429
57308I182429K4788K3829K3600K3706K3551K3341K3507K3867K3979K3817K3493
$$ 9182429 9207217 9231046 9254646 9278352 9301903 9325244 9348751 9372618 9396597 9420414 9443907
57297I443907K2850K1946K1397K1585K1932K1653K0878K0310K0025J9450J8417
$$ 9443907 9466757 9488703 9510100 9531685 9553617 9575270 9596148 9616458 9636483 9655933 9674350
57286I674350J7452J6859J6291J5495J4914J5074J5669J5715J4550J2425J0178
$$ 9674350 9691802 9708661 9724952 9740447 9755361 9770435 9786104 9801819 9816369 9828794 9838972
57275I838972Q561P865P845P856P243N824M086K698J942J655J622J654J356K90
$$ 9838972 9847533 9855398 9863243 9871099 9878342 9884166 9888252 9890950 9892892 9894547 9896169 9897823 9899179 9899469
57261I899469j360k764l335l359l386l401l116k746k837l403l830l719l325l046
$$ 9899469 9898109 9895345 9892010 9888651 9885265 9881864 9878748 9876002 9873165 9869762 9865932 9862213 9858888 9855842
57247I855842k898k682k341k112k456l749n773p695q971j0077j1882j4491j7256
$$ 9855842 9852944 9850262 9847921 9845809 9843353 9839604 9833831 9826136 9817165 9807088 9795206 9780715 9763459
57234I763459j9771k2186k4581k6762k8771l0870l2883l4268l5123l6353l8455
$$ 9763459 9743688 9721502 9696921 9670159 9641388 9610518 9577635 9543367 9508244 9471891 9433436
57223I433436m0679m1966m2241m2301m2695m3229m3384m2895m1959m1071m0626
$$ 9433436 9392757 9350791 9308550 9266249 9223554 9180325 9136941 9094046 9052087 9011016 8970390
57212H970390m0582m0678m0805m0986m1028m0647l9832l8760l7439l5932l4754
$$ 8970390 8929808 8889130 8848325 8807339 8766311 8725664 8685832 8647072 8609633 8573701 8538947
57201H538947l4348l4283l3720l2791l2600l3642l5105l6107l6861l8004l9458
$$ 8538947 8504599 8470316 8436596 8403805 8371205 8337563 8302458 8266351 8229490 8191486 8152028
57190H152028m0622m1274m1670m2003m2178m1961m1118l9773l8614l8212l8100
$$ 8152028 8111406 8070132 8028462 7986459 7944281 7902320 7861202 7821429 7782815 7744603 7706503
57179G706503l7253l5669l4535l4401l4247l3031l1275l0152k9779k9398k8708
$$ 7706503 7669250 7633581 7599046 7564645 7530398 7497367 7466092 7435940 7406161 7376763 7348055
57168G348055k7949k7064k5877k4874k4723k5188k5502k5705k6500k7810k8652
$$ 7348055 7320106 7293042 7267165 7242291 7217568 7192380 7166878 7141173 7114673 7086863 7058211
57157G058211k8770k9343l1478l4773l8050m0851m3589m6550m9561n2501n5591
$$ 7058211 7029441 7000098 6968620 6933847 6895797 6854946 6811357 6764807 6715246 6662745 6607154
57146F607154n8963o2313o5180o7381o9020p0125p0508p0035o8706o6346o2540
$$ 6607154 6548191 6485878 6420698 6353317 6284297 6214172 6143664 6073629 6004923 5938577 5876037
57135E876037n7276n1505m6427m2308l8551l5065l2737l2259l3144l4481l6112
$$ 5876037 5818761 5767256 5720829 5678521 5639970 5604905 5572168 5539909 5506765 5472284 5436172
57124E436172l8417m1298m3980m5638m5776m4216m1165l7027l1768k4838j6146
$$ 5436172 5397755 5356457 5312477 5266839 5221063 5176847 5135682 5098655 5066887 5042049 5025903
57113E025903o731K150J0279J8269K6550L5364M5577N8655P5788R7559J24362
$$ 5025903 5019172 5021322 5031601 5049870 5076420 5111784 5157361 5216016 5291804 5389363 5513725
57102E513725J56576J94403K38168K88710L46839M12512M85171N64707O51312
$$ 5513725 5670301 5864704 6102872 6391582 6738421 7150933 7636104 8200811 8852123
57093H852123P44380Q42324R43356J045288J144224J234382J309798J365212J394784
$$ 8852123 9596503 10438827 11382183 12427471 13571695 14806077 16115875 17481087 18875871
57084A8875871J391347J349263J268689J155529J015503Q47788O45446M03274
$$ 18875871 20267218 21616481 22885170 24040699 25056202 25903990 26549436 26952710
57076B6952710J26306j68350m57129p17836r34873j101199j218187j293456j336747
$$ 26952710 27079016 26910666 26453537 25735701 24800828 23699629 22481442 21187986 19851239
57067A9851239j355970j355715j337995j303368j252005j185129j106207j020351
$$ 19851239 18495269 17139554 15801559 14498191 13246186 12061057 10954850 9934499
57059I934499r32467q46109p63672o86777o16166n51833m93525m41043l93998
$$ 9934499 9002032 8155923 7392251 6705474 6089308 5537475 5043950 4602907 4208909
57050D208909l51777l13782k79495k48478k20673j96491j76183j59233j44824
$$ 4208909 3857132 3543350 3263855 3015377 2794704 2598213 2422030 2262797 2117973
57041B117973j32595j22377j13454j04875r6430q8600q1553p4979o8821o3367
$$ 2117973 1985378 1863001 1749547 1644672 1548242 1459642 1378089 1303110 1234289 1170922
57031A170922n8558n4006m9804m6413m3584m0364l6535l3162l1184l0179k9075
$$ 1170922 1112364 1058358 1008554 962141 918557 878193 841658 808496 777312 747133 718058
57020G18058k7388k5244k2831k0428j8480j7065j5713j4187j2979j2490j2288
$$ 718058 690670 665426 642595 622167 603687 586622 570909 556722 543743 531253 518965
57009E18965j1759j1000j0413r886r144q544q638r159r204q492p687p449p761
$$ 518965 507206 496206 485793 475907 466763 458219 449581 440422 431218 422726 415039 407590 399829
56996C99829q264q692q832q526p904p267o685n926m866l618k249p29P52J766K030
$$ 399829 391565 382873 374041 365515 357611 350344 343659 337733 332867 329249 327000 326271 327023 328789 330819
56981C30819J651Q80k23j783l877o245q187q913q252o943n955n590n404m900l952
$$ 330819 332470 333350 333127 331344 327467 321222 313035 304122 295870 288927 282972 277382 271978 267078 263126
56966B63126k633j024P43K496M240O130Q153R965J1139J1501J1165J0310Q865
$$ 263126 260493 259469 260212 262708 266948 273078 281231 291196 302335 313836 325001 335311 344176
56953C44176O457K822j621n797q778j0415j1055j0873r880q382o859n357l519
$$ 344176 350633 353455 351834 346037 337259 326844 315789 304916 295036 286654 279795 274438 270919
56940B70919j368M80J689K903N018Q021J1024J3336J5000J6136J6313J4875J1692
$$ 270919 269551 270031 271720 274623 279641 287662 298686 312022 327022 343158 359471 374346 386038
56927C86038P321K504k247o675j0617j3864j6147j7274j7348j6696j5540j3916
$$ 386038 393359 395863 393616 386941 376324 362460 346313 329039 311691 294995 279455 265539
56915B65539j2066j0588r919r768r456q656p511o120m478k911k051j985j940j086
$$ 265539 253473 242885 232966 223198 213742 205086 197575 191455 186977 184066 182015 180030 178090 177004
56901A77004N02J982K598K284J673J729L035N122O814P509P848Q841J0651J2631
$$ 177004 177506 179488 182086 184370 186043 187772 190807 195929 202743 210252 218100 226941 237592 250223
56887B50223J4163J4932J4656J3216J0966Q370N386J783j966m736n915n995n814
$$ 250223 264386 279318 293974 307190 318156 326526 331912 333695 331729 326993 321078 315083 309269
56874C09269n621n121m094k602p32J565M337P427J0511J3442J6526K0107K3842
$$ 309269 303648 298527 294433 291831 291099 292664 297001 304428 314939 328381 344907 365014 388856
56861C88856K6763K8292K8724K8213K5865K0635J2958M686k619q620j3452j6884
$$ 388856 415619 443911 472635 500848 526713 547348 560306 564992 562373 553753 540301 523417
56849E23417j8560j8489j6914j4099j0413o272j838K894P714J2442J7587K3986
$$ 523417 504857 486368 469454 455355 444942 438670 436832 439726 447440 459882 477469 501455
56837E01455L1576L9100M5272M9586N1601N0204M4282L3897K0331N267r649k2875
$$ 501455 533031 572131 617403 666989 718590 768794 813076 846973 867304 872571 862922 840047
56825H40047l3221m0130m3475m3430m0737l6684l2288k7581k2085j5827r482l615
$$ 840047 806826 766696 723221 679791 639054 602370 570082 542501 520416 504589 495107 491492
56813D91492J894P612J3926K0598K6771L1461L4066L4218L1268K4478J4047J645
$$ 491492 493386 500998 514924 535522 562293 593754 627820 662038 693306 717784 731831 733476
56801G33476j0443k0603k8336l3773l7076l8194l7063l4132l0490k7014k3472
$$ 733476 723033 702430 674094 640321 603245 565051 527988 493856 463366 436352 412880
56790D12880j9112j4117r669o281l025J011N359R125J2440J5767J8141J7549J3304
$$ 412880 393768 379651 369982 363701 360676 361687 367046 376171 388611 404378 422519 440068 453372
56777D53372O990O20n237j1025j6659k1284k4152k5149k4491k2597k0273j8472
$$ 453372 460362 460982 455745 444720 428061 406777 382625 357476 332985 310388 290115 271643
56765B71643j7494j6643j5033j2711j0622r453q901q261p357o467n617m536l338
$$ 271643 254149 237506 222473 209762 199140 189687 180786 172525 165168 158701 153084 148548 145210
56752A45210k591k515k627k460k157k054k051j863j575j502j619j561j173o68
$$ 145210 142619 140104 137477 135017 132860 130806 128755 126892 125317 123815 122196 120635 119462 118794
56738A18794l01j13o1j45l95q11j289j566j389q39l09r9j23q2J85N85Q88R62R63
$$ 118794 118493 118380 118319 118174 117779 116968 115679 114113 112724 111885 111576 111477 111354 111272 111457 112042 112930 113892 114855
56719A14855J177J513J460Q55L19M53Q38O08j32l80K03P45N34Pj12J38L23M70
$$ 114855 116032 117545 119005 119860 120179 120632 121470 122078 121946 121566 121769 122514 123048 123055 122943 123081 123404 123874
56701A23874Q18J244J487J536J356P34j42n77l85l55j009j568j086l7L15j78l91
$$ 123874 124692 125936 127423 128959 130315 131049 130907 130330 129945 129590 128581 127013 125927 125890 126205 126027 125636
56684A25636L22J271J444O68m66j211j097l23K93J55l42m05j7J43j35k77J40P74
$$ 125636 125958 127229 128673 129341 128875 127664 126567 126244 126537 126692 126350 125945 125928 126071 125936 125659 125799 126573
56666A26573J089J003P68N72M49L05Pl77n35l45j18l7K53J035J813J907J486J326
$$ 126573 127662 128665 129433 130005 130454 130759 130766 130389 129854 129509 129391 129354 129607 130642 132455 134362 135848 137174
56648A37174J608J795J642J544J725J878J809J786J950J937J420O23pk55j05L95
$$ 137174 138782 140577 142219 143763 145488 147366 149175 150961 152911 154848 156268 156891 156884 156629 156524 156919
56632A56919J011J342J192Q02N87P79J236J415P57o32j855k176j895j836k179
$$ 156919 157930 159272 160464 161266 161853 162632 163868 165283 166040 165408 163553 161377 159482 157646 155467
56617A55467k349k012j501j260j330j512j576j335p91k12K70Q16J353J231J02
$$ 155467 153118 151106 149605 148345 147015 145503 143927 142592 141801 141589 141859 142675 144028 145259 145361
56602A45361j186j409n21L54M47O3j55O1O73J430J803J465Q29M98L57k3k84L05
$$ 145361 144175 142766 142245 142599 143046 143109 142954 143015 143688 145118 146921 148386 149215 149713 150070 150047 149763 150068
56584A50068J401J732R20L3o9K35M23P66J424J644Q88j7J26J114J656J240P60
$$ 150068 151469 153201 154121 154154 154085 154320 154743 155509 156933 158577 159465 159448 159574 160688 162344 163584 164344
56567A64344J193K318L030K616J552J065J827L241M219M486M533M531M044L026
$$ 164344 165537 167855 170885 173501 175053 176118 177945 181186 185405 189891 194424 198955 202999 206025
56553B06025K216K147K406K324J864J374R14L47l03r63j658k235k287j696q35
$$ 206025 208241 210388 212794 215118 216982 218356 219270 219617 219314 218351 216693 214458 212171 210475 209640
56538B09640p2N17P54L27n71j165j072q06r73j462j821j907j752j341q97q80j213
$$ 209640 209568 210085 210839 211166 210595 209430 208358 207552 206579 205117 203296 201389 199637 198296 197399 196519 195306
56521A95306j134k67O59P58J54l56l86j64mj63q27j761k287k038j416r26n27k7
$$ 195306 194172 193905 194564 195322 195476 195120 194734 194570 194566 194403 193576 191815 189528 187490 186074 185148 184621 184594
56503A84594L56L83K67K54J72j23k96j39o3m23p95o26j80j08m27o00m07n8L13
$$ 184594 184950 185333 185600 185854 186026 185903 185607 185468 185405 184982 184187 183561 183381 183273 182846 182246 181839 181781 182094
56484A82094O43O81L47P3K72O69P58N67M24L22J49J54N41R15Q55P13J049J554
$$ 182094 182737 183418 183765 183838 184110 184779 185537 186104 186528 186850 186999 187153 187694 188609 189464 190177 191226 192780
56466A92780J435O84R3N7J81J37J12K53L10J36N4M51J328K226K455J530k36j774
$$ 192780 194215 194899 194992 195049 195230 195367 195479 195732 196042 196178 196232 196683 198011 200237 202692 204222 203986 202212
56448B02212k188j515l50P96J510J402O46J62N19J091R85L62M1J88L27L62N94
$$ 202212 200024 198509 198159 198955 200465 201867 202513 202675 203194 204285 205270 205632 205673 205861 206188 206550 207144
56431B07144Q99Q20M31K48L34L89N35J108J701J504O41J57M67Q58P53N20O08P90
$$ 207144 208043 208863 209294 209542 209876 210265 210800 211908 213609 215113 215754 215911 216378 217236 217989 218509 219117 219907
56413B19907P62P04P80P03L07oJ24M39M99L11J68K34N00Q77J079Q71N21N87J070
$$ 219907 220669 221373 222153 222856 223163 223157 223281 223720 224219 224530 224698 224932 225432 226309 227388 228259 228780 229367 230437
56394B30437J292Q33M1n33p61p10l54K11O46Q33J097J672K255K379K028J618J591
$$ 230437 231729 232562 232603 232070 231309 230599 230245 230456 231102 231935 233032 234704 236959 239338 241366 242984 244575
56377B44575K091K782K936J995K65j202j549q17J91O96O12N72J128J813J539J90
$$ 244575 246666 249448 252384 254379 254644 253442 251893 251076 251267 251963 252575 253147 254275 256088 257627 257817
56361B57817q67m72P47J375J281J489K205K397J524M72K62P82J316J546J500J168
$$ 257817 256950 256478 257225 258600 259881 261370 263575 265972 267496 267968 268230 269012 270328 271874 273374 274542
56345B74542O65L16J98Q5N6O06J760K705K677J794P91L14O43J546K248K135J593
$$ 274542 275207 275523 275721 275806 275862 276468 278228 280933 283610 285404 286195 286509 287152 288698 290946 293081 294674
56328B94674J522K038K388K312K389K755K594J535N60O43J298J416R38P21J065
$$ 294674 296196 298234 300622 302934 305323 308078 310672 312207 312767 313410 314708 316124 317062 317783 318848
56313C18848J334R92K56k55m7R72K362L345L493L039K410J796J383J509K172K776
$$ 318848 320182 321174 321430 321175 321128 322100 324462 327807 331300 334339 336749 338545 339928 341437 343609 346385
56297C46385K811K389J834J190N66L94Q42J371J511J656K486L850M895N088M614
$$ 346385 349196 351585 353419 354609 355175 355569 356411 357782 359293 360949 363435 367285 372180 377268 381882
56282C81882L855L084K558K444K641K949L366L948M567N044N406N706N800N562
$$ 381882 385737 388821 391379 393823 396464 399413 402779 406727 411294 416338 421744 427450 433250 438812
56268D38812N181N009N314O194P489Q666R203R218R361R953J0755J1689J3116
$$ 438812 443993 449002 454316 460510 467999 476665 485868 495086 504447 514400 525155 536844 549960
56255E49960J5099J7082J8699K0303K2202K4050K5609K7426K9999L2695L4433
$$ 549960 565059 582141 600840 621143 643345 667395 693004 720430 750429 783124 817557
56244H17557L5182L5983L7484L9121L9701L8423L5403L1646K8335K5683K2617
$$ 817557 852739 888722 926206 965327 1005028 1043451 1078854 1110500 1138835 1164518 1187135
56233A187135J7968J1784N116j143o658j1290j5042j8268k1301k3916k5683k6726
$$ 1187135 1205103 1216887 1222003 1220860 1214202 1202912 1187870 1169602 1148301 1124385 1098702 1071976
56221A071976k7663k8701k9380k9237k8356k7138k5873k4612k3206k1474j9454
$$ 1071976 1044313 1015612 986232 956995 928639 901501 875628 851016 827810 806336 786882
56210G86882j7468j5810j4519j3511j2699j1815j0460q681p135o342n978n344
$$ 786882 769414 753604 739085 725574 712875 701060 690600 681919 674784 668442 662464 657120
56198F57120m309l348k767k331j739j085o52m87k24N00J527K243K311K179K458
$$ 657120 652811 649463 646696 644365 642626 641541 640889 640402 640178 640678 642205 644448 646759 648938 651396
56183F51396L070L487L690M168M872M995M085K848K444L369N163O784P204O289
$$ 651396 654466 657953 661643 665811 670683 675678 679763 682611 685055 688424 693587 700371 707575 713864
56169G13864N248N517P031Q341Q616Q544Q951R595R981J0362J1133J2037J2780
$$ 713864 719112 724629 731660 740001 748617 757161 766112 775707 785688 796050 807183 819220 832000
56156H32000J3786J5475J7380J8888K0258K2145K4588K7348L0684L5035M0311
$$ 832000 845786 861261 878641 897529 917787 939932 964520 991868 1022552 1057587 1097898
56145A097898M6364N3578O2087P0845P8418Q4370Q8988R1965R2333Q9560Q3946
$$ 1097898 1144262 1197840 1259927 1330772 1409190 1493560 1582548 1674513 1766846 1856406 1940352
56134A940352P6242O7604N9639N3475M8834M4597L9935L4337K7197J8517R649
$$ 1940352 2016594 2084198 2143837 2197312 2246146 2290743 2330678 2365015 2392212 2410729 2420378
56123B420378K247l456q454j3379j8256k3617l0589l9527m9470n9111o7576p4088
$$ 2420378 2422625 2419169 2410715 2397336 2379080 2355463 2324874 2285347 2235877 2176766 2109190 2035102
56111B035102p7815p8417p6317p2099o6073n8584n0362m2358l5332k9470k4283
$$ 2035102 1957287 1878870 1802553 1730454 1664381 1605797 1555435 1513077 1477745 1448275 1423992
56100A423992j9140j4063r605n959k779m0J797K833L963N475O472O466O551P879
$$ 1423992 1404852 1390789 1381184 1375225 1372446 1372406 1374203 1377036 1380999 1386474 1392946 1399412 1405963 1413842
56086A413842R856J1098J1452J1799J2339J2520J2319J2333J2770J3357J4107
$$ 1413842 1423698 1434796 1446248 1458047 1470386 1482906 1495225 1507558 1520328 1533685 1547792
56075A547792J5178J6248J6921J7475J8362J9416K0362K1483K2865K3711K3466
$$ 1547792 1562970 1579218 1596139 1613614 1631976 1651392 1671754 1693237 1716102 1739813 1763279
56064A763279K2991K3372K4305K4923K5444K6574K7931K8667K9075K9952L0955
$$ 1763279 1786270 1809642 1833947 1858870 1884314 1910888 1938819 1967486 1996561 2026513 2057468
56053B057468L1212L1100L1605L2397L2340L1669L1741L2815L3972L5090L6974
$$ 2057468 2088680 2119780 2151385 2183782 2216122 2247791 2279532 2312347 2346319 2381409 2418383
56042B418383L9504M1566M2998M4741M6885M8321M8628M8652M8965M9256M9475
$$ 2418383 2457887 2499453 2542451 2587192 2634077 2682398 2731026 2779678 2828643 2877899 2927374
56031B927374N0107N1097N1886N2593N3783N5210N6236N7284N9342O2317O5436
$$ 2927374 2977481 3028578 3080464 3133057 3186840 3242050 3298286 3355570 3414912 3477229 3542665
56020C542665O8825P2927P6913P9717Q2228Q6215R1453R6224J00331J05041J10273
$$ 3542665 3611490 3684417 3761330 3841047 3923275 4009490 4100943 4197167 4297498 4402539 4512812
56009D512812J14622J18203J22756J28645J34457J39848J46067J53290J60157
$$ 4512812 4627434 4745637 4868393 4997038 5131495 5271343 5417410 5570700 5730857
56000E730857J66546J74101J83446J93401K03476K14569K26763K38973K51306
$$ 5730857 5897403 6071504 6254950 6448351 6651827 6866396 7093159 7332132 7583438
55991G583438K65211K80909K97304L14602L34289L56382L79603M04290M32178
$$ 7583438 7848649 8129558 8426862 8741464 9075753 9432135 9811738 10216028 10648206
55982A0648206M63369M96826N33607N75972O23614O74733P30587P94627Q67502
$$ 10648206 11111575 11608401 12142008 12717980 13341594 14016327 14746914 15541541 16409043
55973A6409043R47707J036958J139794J258117J391948J545531J726620J939811
$$ 16409043 17356750 18393708 19533502 20791619 22183567 23729098 25455718 27395529
55965B7395529K187629K478490K826617L244324L742870M341233N064787N934315
$$ 27395529 29583158 32061648 34888265 38132589 41875459 46216692 51281479 57215794
55957E7215794O965249Q176483R588068J1211683J3057863J5149209J7501647
$$ 57215794 64181043 72357526 81945594 93157277 106215140 121364349 138865996
55950A38865996K0079728K2765118K5317815K7279897K7909341K6359980K2140651
$$ 138865996 158945724 181710842 207028657 234308554 262217895 288577875 310718526
55943C10718526J5511785P424005r61308q719854j5261395k0209111k3357966
$$ 310718526 326230311 333654316 332693008 323973154 308711759 288502648 265144682
55936B65144682k4753475k4706079k3656922k2013686k0078521j8054690j6067021
$$ 265144682 240391207 215685128 192028206 170014520 149935999 131881309 115814288
55929A15814288j4181537j2432742j0842873r421122q161461p053079o088525
$$ 115814288 101632751 89200009 78357136 68936014 60774553 53721474 47632949
55922D7632949n258156m545282l933031l410232k966527k588080k262853j984821
$$ 47632949 42374793 37829511 33896480 30486248 27519721 24931641 22668788 20683967
55914B0683967j748985j547035j371624j220236j091097r79277q80169p93074
$$ 20683967 18934982 17387947 16016323 14796087 13704990 12725713 11845544 11052470
55906A1052470p18068o52539n93732n41683m96814m57250m20969l88169l59400
$$ 11052470 10334402 9681863 9088131 8546448 8049634 7592384 7171415 6783246 6423846
55897F423846l33577l09657k88071k68838k50556k32710k16760k03526j91657
$$ 6423846 6090269 5780612 5492541 5223703 4973147 4740437 4523677 4320151 4128494
55888D128494j79872j68597j58272j48303j38787j30956j24742j18205j10461
$$ 4128494 3948622 3780025 3621753 3473450 3334663 3203707 3078965 2960760 2850299
55879B850299j03023r7117r1979q6956q2968q0583p8680p6336p4043p2022o9344
$$ 2850299 2747276 2650159 2558180 2471224 2388256 2307673 2228993 2152657 2078614 2006592 1937248
55868A937248o5845o2900o1042n8862n5434n1905m9411m7294m4704m2223m0546
$$ 1937248 1871403 1808503 1747461 1688599 1633165 1581260 1531849 1484555 1439851 1397628 1357082
55857A357082l9180l7584l6087l4636l2346k9233k6700k5324k4004k2296k1541
$$ 1357082 1317902 1280318 1244231 1209595 1177249 1148016 1121316 1095992 1071988 1049692 1028151
55846A028151k2385k3230k2610k1348k0756k0415j9427j8309j7910j7738j6985
$$ 1028151 1005766 982536 959926 938578 917822 897407 877980 859671 841761 824023 807038
55835H07038j6032j5463j4768j3521j2623j2863j3282j2560j0981r698q983q674
$$ 807038 791006 775543 760775 747254 734631 721768 708486 695926 684945 675247 666264 657590
55823F57590r230j0760j1986j1794j1034j1209j2032j1986j0720r439r026r182
$$ 657590 648360 637600 625614 613820 602786 591577 579545 567559 556839 547400 538374 529192
55811E29192r206q619p254n580m536m396m342l776l202l009k452r13P72J509J620
$$ 529192 519986 511367 504113 498533 493997 489601 485259 481483 478281 475272 472820 471907 472679 474188 475808
55796D75808K012K458K118J197O78P67R04R50J070P69o86k989n104o704q302j0078
$$ 475808 477820 480278 482396 483593 484271 485038 485942 486892 487962 488731 488045 485056 479952 473248 464946 454868
55780D54868j1567j2415j2505j1516r209o134l238j009L85N07q95l079m901o126
$$ 454868 443301 430886 418381 406865 397656 391522 388284 387275 387660 388167 387272 384193 379292 373166
55766C73166p345q708r564r341q213o802n643m824l964k863k272l296n627p304
$$ 373166 365821 357113 347549 338208 329995 323193 317550 312726 308762 305899 303627 300331 294704 287400
55752B87400o979n587m886n211n674n877o055n944m978l480k458k219k249k387
$$ 287400 280421 274834 269948 264737 259063 253186 247131 241187 236209 232729 230271 228052 225803 223416
55738B23416l011l946m287l638k686k236k291k373k143j560q34l95n32j040j530
$$ 223416 220405 216459 212172 208534 205848 203612 201321 198948 196805 195245 194411 194016 193484 192444 190914
55723A90914j976k524k996l029k639k150j684j122m42K67R58J471J489J035O03
$$ 190914 188938 186414 183418 180389 177750 175600 173916 172794 172352 172619 173577 175048 176537 177572 178175
55708A78175N03M09O7j50J08M35L10n4k31n02j398k647l500l870m239m663m752
$$ 178175 178678 179087 179154 179004 179112 179547 179857 179803 179572 179070 177672 175025 171525 167655 163416 158753 154001
55691A54001m539m427m315l645k394j154j88P51J536J516N92k95k05P01J478J441
$$ 154001 149462 145035 140720 137075 134681 133527 133339 134090 135626 137142 137734 137439 137234 137935 139413 140854
55675A40854O73k19o39m84j87j50k97m08n61r08j173r99o35p02j231j519j066
$$ 140854 141527 141308 140669 140185 139998 139848 139551 139143 138582 137674 136501 135502 134867 134165 132934 131415 130349
55658A30349k41K29J13j68o9N20J235J692J890K014K000J686J338J429J755J449
$$ 130349 130108 130337 130450 130282 130213 130733 131968 133660 135550 137564 139564 141250 142588 144017 145772 147221
55642A47221J72j366k412l075l742m267m426m519m818m837m007k724j952j999
$$ 147221 147393 146027 143615 140540 136798 132531 128105 123586 118768 113931 109924 107200 105248 103249
55628A03249k376k586k455j953j330j153j582j916j506o98k13k3L36P29O16J4
$$ 103249 100873 98287 95832 93879 92549 91396 89814 87898 86392 85694 85481 85458 85794 86523 87139 87153
55612H7153o12j181j866k366k185j483p91j62M97N96m91k109k824k322j647j431
$$ 87153 86541 85360 83494 81128 78943 77460 76669 76507 77004 77600 77109 75000 72176 69854 68207 66776
55596F6776j107j84P36Q41J20q86j760k210j997j281o29l99m73o42p85p00l13
$$ 66776 65669 65485 66221 67062 67182 66296 64536 62326 60329 59048 58419 58020 57547 56905 56120 55420 55107
55579E5107Nj02k37L13J439K289K476K404K339K047J505J066P36P1q95j441j208
$$ 55107 55112 55010 54773 55086 56525 58814 61290 63694 66033 68080 69585 70651 71387 71458 70563 69122 67914
55562F7914p21n68o55p32q64j074j044o07r7J12Mk54m58k92K88O35O8r80j324
$$ 67914 67193 66625 65970 65238 64374 63300 62256 61649 61552 61664 61668 61414 60956 60664 60952 61587 61655 60675 59351
55543E9351o40K09O40J050J701J970J403O04K92K31r2m17k56P9l8l77j81M73O35
$$ 59351 58711 58920 59560 60610 62311 64281 65684 66288 66580 66811 66719 66302 66046 66125 66087 65710 65529 66002 66637
55524F6637j04j013j293j135j237j731k105j988j567j139o88j74N9l91j317k044
$$ 66637 66533 65520 64227 63092 61855 60124 58019 56031 54464 53325 52637 52463 52522 52131 50814 48770
55508D8770k261k183j854j034l9K40l17n53L03J291J074Kn08j66O9j79k59R1K78
$$ 48770 46509 44326 42472 41438 41399 41639 41322 40769 41072 42363 43437 43439 42931 42765 42834 42655 42396 42487 42765
55489D2765Q3m4j11p00j519j310J72J467J407O47L24L63J14k80l20j84k71k76
$$ 42765 42848 42804 42693 41993 40474 39164 39336 40803 42210 42857 43181 43544 43658 43378 43058 42874 42603 42327
55471D2327K88J053J249Q94O16O06M98J24k95n59n28p9N77P78J97o31r81q74q26
$$ 42327 42615 43668 44917 45811 46427 47033 47531 47655 47360 46801 46273 46194 46771 47549 47746 47115 46134 45260 44434
55452D4434r83j052q57n10j79QJ7M9L25O45N89K55J68L52K56j88k84K17N48Q2
$$ 44434 43451 42399 41542 41032 40853 40861 40878 40927 41252 41897 42486 42741 42909 43261 43517 43329 43045 43262 43810 43892
55432D3892o82r44p22m56j43M15R95J317J484J579J257L39p01j344j585j488q97
$$ 43892 43210 42266 41544 41088 40945 41360 42355 43672 45156 46735 47992 48331 47630 46286 44701 43213 42316
55415D2316r0J53l06n66j27K67m9m41j57K69j6o00m66K83P38O73N00J72n33j029
$$ 42316 42226 42379 42073 41507 41380 41647 41598 41157 41000 41269 41253 40653 40187 40470 41208 41881 42381 42553 42020 40991
55395D0991n65L02K76p42j547j403p12L9Q01J311J099M35J61M27N01K4m43l25
$$ 40991 40426 40728 41004 40262 38715 37312 36600 36639 37440 38751 39850 40285 40446 40873 41374 41398 40955 40630
55377D0630K49P95Q83K46q16j294n68N91R80O42N70R46J025N97K57R2m91j438
$$ 40630 40879 41674 42557 42803 41987 40693 40125 40716 41696 42338 42908 43854 44879 45476 45733 45825 45334 43896
55359D3896j838j411r56r57r70p51p81j077q27J82R34P55L38M37O12K83rM37J096
$$ 43896 42058 40647 39691 38734 37764 37013 36232 35155 34328 34510 35444 36199 36537 36974 37586 37869 37860 38297 39393
55340C9393J023M36K95P07R07O84O16R33J052M75m99j228j374j010m63j50k71
$$ 39393 40416 40852 41147 41854 42761 43445 44061 44994 46046 46521 46022 44794 43420 42410 41947 41797 41526
55323D1526o22q70q78p10m43j62J06N03J114J569J352O33K67O15R87O81K2j69
$$ 41526 40904 40034 39156 38446 38003 37841 37947 38450 39564 41133 42485 43118 43385 44000 44987 45668 45690 45521
55305D5521J92M51K09k99p33r75r51n44J18O31O73K63k97o26m51K13J036J588
$$ 45521 45713 46164 46373 46074 45341 44366 43415 42871 42989 43620 44293 44556 44259 43633 43182 43395 44431 46019
55287D6019J562R15n1p63q12l77J7J72L18N48N63J09o09j201j470j357q21J0P99
$$ 46019 47581 48496 48445 47682 46870 46493 46510 46682 47000 47548 48111 48220 47611 46410 44940 43583 42762 42772 43571
55268D3571J305J576J677J512J051O01N31P62P32p6j493k594k488j281lN90P88
$$ 43571 44876 46452 48129 49641 50692 51293 51824 52586 53318 53242 51749 49155 46667 45386 45383 45973 46761
55251D6761J171J562J378P06K66L27M14J70j59l13m19n74o02m57l81m16k81M4
$$ 46761 47932 49494 50872 51578 51844 52171 52585 52755 52596 52283 51864 51290 50688 50231 49850 49434 49153 49197
55233D9197J40k24o98q63p06l44K44R51J411J433J235J014P12L40J60L08O13Q48
$$ 49197 49337 49113 48415 47552 46846 46502 46746 47697 49108 50541 51776 52790 53502 53842 54002 54310 54923 55771
55215E5771Q36L09q18j989k404j991j376q87k97L08L49k49p13n85m02o81r60n67
$$ 55771 56607 56916 56098 54109 51705 49714 48338 47451 47154 47462 47811 47562 46849 46264 45862 45181 44221 43654
55197D3654K82Q95J110J192J165R24O95O91O33J68m65q02q88j044j180r23k55
$$ 43654 43936 44831 45941 47133 48298 49222 49917 50608 51241 51409 50944 50142 49254 48210 47030 46107 45852
55180D5852M64R80J258J259J044Q74Q92Q92P33O61Q86J198J291J183R31M16k25
$$ 45852 46316 47296 48554 49813 50857 51731 52623 53515 54248 54909 55795 56993 58284 59467 60398 60814 60589
55163F0589m42m7L58K02k46m61m89o20o54k75K09L09J79K57L48o6p82j005n71
$$ 60589 60147 60100 60458 60660 60414 59953 59464 58844 58190 57915 58124 58433 58612 58869 59217 59151 58369 57364 56793
55144E6793k24n31j163j383q96l1O26P86P78J103J565J374M20k49J31P74M33p48
$$ 56793 56569 56038 54875 53492 52596 52565 53191 53977 54755 55858 57423 58797 59217 58968 59099 59873 60306 59558
55126E9558j460j141n09l38o08r71j118o21P15K198K709K021R54J47m71r07p01
$$ 59558 58098 56957 56448 56110 55502 54531 53413 52792 53507 55705 58414 60435 61389 61536 61065 60158 59457
55109E9457J86R14O92k44j017j059m00N34J138J046N56K75L43L61K00K07M54M19
$$ 59457 59643 60557 61249 61005 59988 58929 58529 59063 60201 61247 61803 62078 62421 62782 62982 63189 63643 64062
55091F4062k49j126j545j339q17l75l45p66j095o48M00R49L11q49j330q28l5L72
$$ 64062 63813 62687 61142 59803 58986 58611 58266 57500 56405 55757 56157 57106 57417 56568 55238 54410 54375 54747
55073E4747L50K29K81N22O82M21j66m32J71J330K073J808Q92J10k67n79j073j419
$$ 54747 55097 55326 55607 56129 56811 57232 57066 56634 56805 58135 60208 62016 62908 63018 62751 62172 61099 59680
55055E9680j198n40J06O93J438K024J718O17j31J20M22l02j417j322J46J374J177
$$ 59680 58482 57942 58048 58741 60179 62203 63921 64538 64407 64527 64949 64647 63230 61908 62054 63428 64605
55038F4605J67n01o91r04j150j003m57J2J09ok8J86N39P01M10j74n36l76R8M43
$$ 64605 64772 64271 63580 62676 61526 60523 60066 60078 60187 60181 60153 60339 60878 61579 61989 61815 61279 60903 61001 61444
55018F1444M01K9l70m02K1N28P32O64M89J20m08n66l6N32K99l40k10P96J420Q75
$$ 61444 61845 61874 61504 61102 61123 61651 62383 63047 63536 63656 63248 62682 62646 63178 63477 63137 62927 63723 65143 66018
54998F6018r2m69l22k02j44J3J03J62P48J889K401J318m70j188n05K51J87r7K21
$$ 66018 65926 65457 65135 64933 64789 64802 64905 65067 65815 67704 70105 71423 70953 69765 69260 69511 69698 69601 69822
54979F9822R23J295J240J177J191R25K24m89o77k63K92M82J82l85r53j265j058
$$ 69822 70745 72040 73280 74457 75648 76573 76797 76308 75631 75368 75660 76142 76324 75939 74986 73721 72663
54962G2663l02N47R10P56N31M38K02l21q42j115j145q01J62J375J896J431Q32
$$ 72663 72361 72908 73818 74574 75105 75543 75745 75424 74582 73467 72322 71521 71683 73058 74954 76385 77217
54945G7217P95Q19K17n16m53J33J01p02j206q34k93l07o25p66q31r47o09N56J968
$$ 77217 78012 78831 79048 78532 78079 78212 78313 77611 76405 75571 75278 74971 74346 73580 72749 71802 71193 71749 73717
54926G3717K687K602K312K153K026K037K498L246L625L398L150L512M319M837
$$ 73717 76404 79006 81318 83471 85497 87534 90032 93278 96903 100301 103451 106963 111282 116119
54912A16119M608L697K369Q68n52j715k738l846m892n298m691l482k562k414k692
$$ 116119 120727 124424 126793 127661 127109 125394 122656 118810 113918 108620 103929 100447 97885 95471 92779
54897I2779k700k172j471j025q01m59kQ7m39j016q51L3Q57J164J301J531J466
$$ 92779 90079 87907 86436 85411 84610 84151 84149 84236 83797 82781 81930 81963 82820 83984 85285 86816 88282
54880H8282Q31K74O30J768K807L337L654L979M213M432M791M875L928J936j94
$$ 88282 89113 89387 90017 91785 94592 97929 101583 105562 109775 114207 118998 123873 127801 129737 129543
54865A29543j726k648l099l058k904l332m295m844m464l777l373k803j618m84
$$ 129543 127817 125169 122070 119012 116108 112776 108481 103637 99173 95396 92023 89220 87602 87118
54851H7118l25q94j252j260j549k174k428j964j226o87m09l91o54q86o90j50L25
$$ 87118 86793 85899 84647 83387 81838 79664 77236 75272 74046 73359 72950 72559 71905 71019 70329 70179 70504
54834G0504O76J069J253Q89L72M11P61L98q06j589r95L12J056R69O61M17on93
$$ 70504 71180 72249 73502 74391 74763 75174 75935 76333 75527 73938 72943 73255 74311 75280 75941 76358 76352 75759
54816G5759q59m89K62R16J191J071O85K33j33l93o07q38j076j156q00O5J051J575
$$ 75759 74900 74411 74673 75589 76780 77851 78536 78769 78636 78243 77636 76798 75722 74566 73766 73831 74882 76457
54798G6457J401P56L4m53m75n3M10M76J72q8n0K55P69J341J532R76M2m42k07J80
$$ 76457 77858 78614 78648 78195 77720 77667 78077 78553 78725 78637 78587 78842 79611 80952 82484 83460 83502 83060 82853 83033
54778H3033K63K95P00J396K023K396K455K098J482J111J296J716J903J929K268
$$ 83033 83296 83591 84291 85687 87710 90106 92561 94659 96141 97252 98548 100264 102167 104096 106364
54763A06364L093M003M442M260L856L721L672K813P22j606k682k434k302l199
$$ 106364 109457 113460 117902 122162 126018 129739 133411 136224 136946 135340 132658 130224 127922 124723
54749A24723m291m392l669l135l006k652j827r54k93L03P21N08l67j323j902k095
$$ 124723 120432 116040 112371 109236 106230 103578 101751 100797 100504 100807 101528 102036 101669 100346 98444 96349
54733I6349j882j051K64J404J851J665J173O63N28J090J991K370J998J711K226
$$ 96349 94467 93416 93680 95084 96935 98600 99773 100436 100964 102054 104045 106415 108413 110124 112350
54718A12350L034L177K741K736L427L728K556K83j763k890l568m425n254n329
$$ 112350 115384 118561 121302 124038 127465 131193 133749 134032 132269 129379 125811 121386 116132 110803
54704A10803m391l002j941j559j672j851j715j209p07o61r84j062n90q1j67o20
$$ 110803 106412 103410 101469 99910 98238 96387 94672 93463 92756 92095 91111 90049 89459 89378 89211 88591
54688H8591o70j88Q4k99p44n08J41K44m92j264j188l02O39J047R48O34K21l61
$$ 88591 87921 87733 87817 87518 86774 86266 86407 86651 86159 84895 83707 83405 84044 85091 86039 86673 86894 86533
54670H6533j020j349r92j11O93J014R79Q38N21q0n69l65L68O25k77j727k429j844
$$ 86533 85513 84164 83172 83061 83754 84768 85747 86585 87106 87026 86457 86092 86460 87085 86808 85081 82652 80808
54652H0808o43K27N32O46Q52J016Q83M88J95L41Q36J138Q57K66L0L15N33J85l70
$$ 80808 80165 80392 80924 81570 82422 83438 84321 84809 85004 85345 86181 87319 88176 88442 88472 88787 89320 89505 89135
54633H9135l99J23M46J13l88l63Q3K17l17j063j326r23k03M53R69J432J747J576
$$ 89135 88736 88859 89305 89418 89030 88667 88750 88967 88650 87587 86261 85338 85135 85588 86557 87989 89736 91312
54615I1312Q00r6l57J65P28N32l50j151j329r57l71J45L14N6j78K46J238J876
$$ 91312 92112 92016 91659 91824 92552 93084 92734 91583 90254 89297 88926 89071 89385 89441 89263 89509 90747 92623
54597I2623J515N88r2l97p25j090j037m57J69M62N40N66L89p5n47o87m64N0Q39
$$ 92623 94138 94726 94634 94237 93512 92422 91385 90928 91097 91559 92099 92665 93054 92979 92432 91745 91281 91331 92170
54578I2170J662J916J251J19o14n58j8N21Q05Q04O81P26J067J379J199N12k06
$$ 92170 93832 95748 96999 97118 96504 95946 95928 96449 97254 98058 98739 99465 100532 101911 103110 103622 103416
54561A03416n76o46o03m42r1K67K64k24q43r86m09M60R30P84M28K94L99O40J124
$$ 103416 102840 102194 101591 101149 101058 101325 101589 101365 100522 99536 99127 99587 100517 101301 101729 102023 102422 103062 104186
54542A04186J852K380K337K017J957J972J302j82j541j782r27K29J031J306J154
$$ 104186 106038 108418 110755 112772 114729 116701 118003 117821 116280 114498 113571 113800 114831 116137 117291
54527A17291P48L05Mj10n9M5p0n92j272j623j525j357j362j259p15J14P80J031
$$ 117291 118039 118344 118348 118238 118179 118224 118154 117562 116290 114667 113142 111785 110423 109164 108449 108563 109343 110374
54509A10374Q52L21l32p42p59n68l31N2O30J181J522J703J655J098J47m63k69
$$ 110374 111226 111547 111215 110473 109714 109146 108815 108867 109497 110678 112200 113903 115558 116656 116803 116340 116071
54492A16071K19K79R5L49R41J028M01l8M65J436J805J227L42r5J6K03M2l49m44
$$ 116071 116290 116569 116664 117013 117954 118982 119383 119345 119810 121246 123051 124278 124620 124525 124541 124744 124786 124437 123993
54473A23993O7Q83J446J554J402J183R65Q23P74O00J37l33l56P2N50Q89J270J658
$$ 123993 124060 124943 126389 127943 129345 130528 131493 132316 133090 133690 133827 133494 133138 133210 133760 134649 135919 137577
54455A37577J594P99l31j096j167p80n07q10j592k131j793q35j57k24n93o51l40
$$ 137577 139171 139970 139639 138543 137376 136596 136089 135279 133687 131556 129763 128928 128771 128547 127954 127303 126963
54438A26963j2O6j73o23r22o68M6O52P80O13L79n5p38j288j312r38n24j64J52
$$ 126963 126951 127017 126844 126221 125299 124631 124677 125329 126109 126722 127101 127046 126308 125020 123708 122770 122246 122082 122234
54419A22234K71J46Q5K72L49J6k79R7R14J333J077O48L35j34p80j027n74P7M67
$$ 122234 122505 122651 122736 123008 123357 123373 123094 123191 124105 125438 126515 127163 127498 127364 126584 125557 124983 125060 125527
54400A25527R43J853K540K027N27o44p42l54k94n37o28n37m58k27L52Q52O32j65
$$ 125527 126470 128323 130863 132890 133417 132773 132031 131677 131383 130846 130218 129681 129223 128996 129348 130200 130832 130667
54382A30667o85n48k65l33m71j43O16J310J570J385R61O77Q19J091Q56J19k19
$$ 130667 129982 129434 129169 128836 128365 128222 128838 130148 131718 133103 134064 134741 135560 136651 137507 137626 137407
54365A37407L28Q80L03j097j910j485n41P6K90K95O4k39j92J41J17m32q06n32
$$ 137407 137735 138615 138918 137821 135911 134426 133885 133961 134251 134546 134610 134371 134179 134320 134437 134005 133199 132667
54347A32667j77l44n75j26P25J043O83L67L89K41l82r65r15l68P3L8l71p32n94
$$ 132667 132490 132146 131571 131445 132170 133213 133896 134263 134652 134893 134511 133546 132631 132263 132336 132374 132003 131271 130677
54328A30677P1O23L36o93j541j518q71l06j82l64n63n94n22o75j266j941k031
$$ 130677 130748 131371 131707 131014 129473 127955 127084 126778 126596 126232 125669 125075 124553 123878 122612 120671 118640
54311A18640j386o00j78J16O81J216J013Pj027j399j154o81k01J17o0p73j367
$$ 118640 117254 116654 116476 116592 117273 118489 119502 119509 118482 117083 115929 115248 115047 115164 115104 114331 112964
54294A12964j105j92L07k03j007r58J41J427K038J851J136J57p47j076o18J50
$$ 112964 111859 111667 111974 111771 110764 109806 109947 111374 113412 115263 116399 116556 115809 114733 114115 114265
54278A14265N14K81o9l4L72P24P05L87N1j45k57k96j61J51L73K66k3j04K03Q01
$$ 114265 114779 115060 114991 114957 115329 116053 116758 117145 117196 117051 116794 116498 116337 116488 116861 117127 117104 117000 117203 118004
54258A18004J573K310K537J840N10o20j085j144j101q34l15m5m40j146j480j259
$$ 118004 119577 121887 124424 126264 126774 126154 125069 123925 122824 121990 121675 121630 121190 120044 118564 117305
54242A17305p87k27M07Q84R10N99K59j18p03j237j292j020j013j301j258n97J18
$$ 117305 116518 116291 116698 117582 118492 119091 119350 119232 118529 117292 116000 114980 113967 112666 111408 110811 110929
54225A10929L70L70M68M17j96j084j483j049j20Q34J544J858J751J452J193Q73
$$ 110929 111299 111669 112137 112554 112358 111274 109791 108742 108622 109456 111000 112858 114609 116061 117254 118127
54209A18127L25j69r0M78P63L02l73n00k22m08j325k141j978j106n99r44j435
$$ 118127 118452 118283 118193 118671 119434 119736 119363 118863 118641 118233 116908 114767 112789 111683 111084 110140 108705
54192A08705j097J21J271J404M66p69j446j313p15o1N67J184J520J183K63n94
$$ 108705 107608 107729 109000 110404 110870 110101 108655 107342 106627 106566 107133 108317 109837 111020 111283 110689
54176A10689p94l97Q8K17j70r45j592j424l13Q39R08j05r41n65N59J054L19p73
$$ 110689 109895 109498 109586 109803 109633 108688 107096 105672 105359 106198 107106 107001 106060 105495 106054 107108 107427 106654
54158A06654r97k48M35K24n49r44o06K8N09R00J372J742J743J465J209J080R76
$$ 106654 105657 105409 105844 106068 105519 104575 103969 103997 104506 105406 106778 108520 110263 111728 112937 114017 114993
54141A14993Q52P37N89L61J79K42O37J274J887K020J350J75p55j101j267j581
$$ 114993 115845 116582 117171 117532 117711 117953 118590 119864 121751 123771 125121 125296 124541 123440 122173 120592
54125A20592j635j022k48j24m87m10K93P30L37k28j04N21P70L42j95k67N3K62
$$ 120592 118957 117935 117687 117563 117076 116666 116959 117689 118026 117798 117694 118215 118985 119327 119132 118865 118918 119180
54107A19180j1o45j116j010n15k16m04p70q62n33J01P86J061N30n84j473j599
$$ 119180 119169 118524 117408 116398 115883 115667 115263 114493 113631 113098 113199 113985 115046 115576 114992 113519 111920
54090A11920j166o09J3P08J126R84N80M06M03K15m2J24O93J039Q31M97N07O53
$$ 111920 110754 110145 110158 110866 111992 112976 113556 113962 114365 114580 114538 114662 115355 116394 117225 117722 118229 118882
54072A18882M41j25n61n08j0P34J552K167K172J403K37o71j005r96r65q34l49
$$ 118882 119323 119198 118637 118129 118119 118853 120405 122572 124744 126147 126384 125713 124708 123712 122747 121913 121564
54055A21564L64Q68J022J139J392J500J302J238J781K677L248L286L162L156L233
$$ 121564 121928 122796 123818 124957 126349 127849 129151 130389 132170 134847 138095 141381 144543 147699 150932
54040A50932L427L833M192M079L685L814M765N800O071N637N080M593L921K947
$$ 150932 154359 158192 162384 166463 170148 173962 178727 184527 190598 196235 201315 205908 209829 212776
54026B12776J705R6j853l631m666n095n507o004o126n768n524n785o096n729m553
$$ 212776 214481 214577 212724 209093 204427 199332 193825 187821 181695 175927 170403 164618 158522 152793 148240
54011A48240l036j690q75q06j330j849j816j286p32m58l29l1N85J279J502Q80
$$ 148240 145204 143514 142639 141833 140503 138654 136838 135552 134820 134362 134033 134002 134587 135866 137368 138248
53995A38248k68j168j409j290j193j106r26p54n68j03N35O83J16l24J79J059J092
$$ 138248 137980 136812 135403 134113 132920 131814 130888 130134 129566 129463 129998 130681 130797 130473 130652 131711 132803
53978A32803J50p02q29o36m75j03M23L82m87j304j204m78P4K93M68N67M36L58
$$ 132803 132953 132251 131422 130786 130311 130208 130631 131013 130526 129222 128018 127540 127614 127907 128375 128942 129378 129736
53960A29736O06Q15N26J16L39J118J616J459J124J053J108J070J027J016Q74O68
$$ 129736 130342 131157 131683 131799 132138 133256 134872 136331 137455 138508 139616 140686 141713 142729 143603 144271
53944A44271Q18J460K055J982J370J003J457K502L399L683L596L670M023M295
$$ 144271 145089 146549 148604 150586 151956 152959 154416 156918 160317 164000 167596 171266 175289 179584
53930A79584M238L915L350K443J488J191J732K281K012J132M08O7r7j0M93R31
$$ 179584 183822 187737 191087 193530 195018 196209 197941 200222 202234 203366 203774 203841 203744 203734 204227 205158
53914B05158O15k22n91j32M60N25J89j52l26j94L67J019J130O80L84O96J277J698
$$ 205158 205773 205551 204960 204828 205288 205813 206002 205850 205524 205330 205697 206716 207846 208526 208910 209606 210883 212581
53896B12581J942J951J402L96l10l00o4r7k7O43J462J572J031Q24J574K874L904
$$ 212581 214523 216474 217876 218272 217962 217662 217598 217501 217474 218117 219579 221151 222182 223006 224580 227454 231358
53879B31358M155L507K066J23k020m216o386q206r166q926p636n958m727m340
$$ 231358 235513 239020 241086 241209 239189 234973 228587 220381 211215 202289 194653 188695 183968 179628
53865A79628m362m010l122k353k312k803l151l005k494j868j227n87l6J81j83
$$ 179628 175266 171256 168134 165781 163469 160666 157515 154510 152016 150148 148921 148334 148298 148479 148296
53850A48296r98j645j560q78j90J75K39J7l85m99p2K61k58j124j065k6N81M5n90
$$ 148296 147298 145653 144093 143215 143025 143200 143439 143456 143071 142572 142500 142761 142503 141379 140314 140288 140869 140914 140324
53831A40324l27K23J29j41L41J174J269P57P08J232J373R19P68J288J604J072
$$ 140324 139997 140220 140349 140208 140549 141723 142992 143749 144457 145689 147062 147981 148749 150037 151641 152713
53815A52713K81L8K78N75R65J609K205K373K229K105K009J768J387R70N80L73
$$ 152713 152994 153032 153310 153885 154850 156459 158664 161037 163266 165371 167380 169148 170535 171505 172085 172458
53799A72458N52R33R81M83j40m62n72o77n87lQ50J268P16o77k151k778k194j009
$$ 172458 173010 173943 174924 175407 175267 174805 174233 173556 172969 172966 173816 175084 175800 175123 172972 170194 168000 166991
53781A66991l02n59j309j779j642j081m67j42k14m03l62k16m21r82j285r12k65
$$ 166991 166689 166130 164821 163042 161400 160319 159852 159710 159496 159093 158731 158515 158094 157112 155827 154915 154650
53764A54650J8j05j72QJ57K9k73n11n81n13l37n2L23P42J119J349J351J087O29
$$ 154650 154668 154563 154391 154399 154556 154585 154312 153801 153220 152707 152370 152318 152641 153383 154502 155851 157202 158289 158918
53745A58918J81n2j17k67n80p64n07J19Q40J511J996J947J173J49l12Q0R00J645
$$ 158918 159099 159047 158930 158663 158083 157319 156812 156931 157771 159282 161278 163225 164398 164547 164235 164315 165215 166860
53727A66860K129K213J779J110Q50J274J927K255K239K100J820J359J091J482
$$ 166860 168989 171202 172981 174091 174941 176215 178142 180397 182636 184736 186556 187915 189006 190488
53713A90488K372L045L064K700K462K481K522K439K374K515K810L018L008K881
$$ 190488 192860 195905 198969 201669 204131 206612 209134 211573 213947 216462 219272 222290 225298 228179
53699B28179K794K766K734K678K623K614K779L234L820M095L782L071K272J407
$$ 228179 230973 233739 236473 239151 241774 244388 247167 250401 254221 258316 262098 265169 267441 268848
53685B68848M42l16n26m11n11q42q88n03k60n64r62p82k05l7o13j348j544j158
$$ 268848 269290 268974 268448 268037 267526 266684 265796 265293 265033 264469 263507 262725 262520 262483 261870 260522 258978 257820
53667B57820n85l7M86P32K13j088k348k645j960j098o21l40LJ16l17q87q36r4
$$ 257820 257235 257198 257684 258416 258629 257541 255193 252548 250588 249490 248869 248529 248532 248648 248331 247444 246608 246514
53649B46514O13P05L85K36N59J223J807J801R94j80q51m90N83J557J905J768J691
$$ 246514 247127 247832 248217 248453 249012 250235 252042 253843 254837 254657 253806 253316 253899 255456 257361 259129 260820
53632B60820J978K396K548K454K457K583K393J707J006Q06J003J206J414J849
$$ 260820 262798 265194 267742 270196 272653 275236 277629 279336 280342 281148 282151 283357 284771 286620
53618B86620K460L065L690M225M184L451K907L466M642N048M301L455L408L874
$$ 286620 289080 292145 295835 300060 304244 307695 310602 314068 318710 323758 328059 331514 334922 338796
53604C38796M251M533M806M640L690K474J868K094K620K839K507J729Q30J10l93
$$ 338796 343047 347580 352386 357026 360716 363190 365058 367152 369772 372611 375118 376847 377677 377787 377394
53589C77394o95n03M61J793K644K794K796K854K344Q73q98k067k594k952l198
$$ 377394 376699 376196 376657 378450 381094 383888 386684 389538 391882 392755 391857 389790 387196 384244 381046
53574C81046l117k886k914l182l405l620l975m051l213j723p42r15j515j424n67
$$ 381046 377929 375043 372129 368947 365542 361922 357947 353896 350683 348960 348218 347303 345788 344364 343797
53559C43797J53K34J78N60J069J057P35R81J913K538K279J945K432L178L006K056
$$ 343797 343950 344184 344362 344922 345991 347048 347783 348764 350677 353215 355494 357439 359871 363049 366055 368111
53543C68111J617K169K912L306L773M527M996M982N279O430P813Q702R321J0141
$$ 368111 369728 371897 374809 378115 381888 386415 391411 396393 401672 408102 415915 424617 433938 444079
53529D44079J0949J1470J2123J3231J4192J4374J4299J4903J6107J7099J7626
$$ 444079 455028 466498 478621 491852 506044 520418 534717 549620 565727 582826 600452
53518F00452J8040J8447J8849J9746K1514K3404K4270K4206K4384K5289K6209
$$ 600452 618492 636939 655788 675534 697048 720452 744722 768928 793312 818601 844810
53507H44810K6554K6674K7034K7456K7576K7404K7107K6738K6416K6316K6351
$$ 844810 871364 898038 925072 952528 980104 1007508 1034615 1061353 1087769 1114085 1140436
53496A140436K6210K5825K5389K4916K4213K3258K2193K1058J9954J9275J9249
$$ 1140436 1166646 1192471 1217860 1242776 1266989 1290247 1312440 1333498 1353452 1372727 1391976
53485A391976J9450J9355J9206J9575K0199K0038J8615J6557J4756J3502J2593
$$ 1391976 1411426 1430781 1449987 1469562 1489761 1509799 1528414 1544971 1559727 1573229 1585822
53474A585822J1583R894P232M069J167j334l854o443q684j0518j2385j4331j5759
$$ 1585822 1597405 1607299 1614531 1618600 1619767 1618433 1614579 1608136 1599452 1588934 1576549 1562218 1546459
53461A546459j6363j6703j7493j8813k0293k1553k2293k2363k2066k2019k2521
$$ 1546459 1530096 1513393 1495900 1477087 1456794 1435241 1412948 1390585 1368519 1346500 1323979
53450A323979k3353k4162k4676k4564k3674k2442k1527k0929k0036j8507j6523
$$ 1323979 1300626 1276464 1251788 1227224 1203550 1181108 1159581 1138652 1118616 1100109 1083586
53439A083586j4218j1661r426q229p756o727m575k215o46M06J808L615N171O280
$$ 1083586 1069368 1057707 1048281 1040052 1032296 1025569 1020994 1018779 1018133 1018539 1020347 1023962 1029133 1035413
53425A035413P519R466J2092J4866J7116J8472J9174J9880K1023K2480K3872K4952
$$ 1035413 1042932 1052398 1064490 1079356 1096472 1114944 1134118 1153998 1175021 1197501 1221373 1246325
53413A246325K5722K6553K8105L0672L3629L6053L7887L9802M2025M4041M5614
$$ 1246325 1272047 1298600 1326705 1357377 1391006 1427059 1464946 1504748 1546773 1590814 1636428
53402A636428M7239M9312N1613N3900N6188N8152N9176N9456O0145O1775O3381
$$ 1636428 1683667 1732979 1784592 1838492 1894680 1952832 2012008 2071464 2131609 2193384 2256765
53391B256765O3873O3467O2908O2128O0617N8569N6595N4612N2080M9068M6181
$$ 2256765 2320638 2384105 2447013 2509141 2569758 2628327 2684922 2739534 2791614 2840682 2886863
53380B886863M3610M1021L8250L5334L2020K8096K3974K0072J5737R804K243n692
$$ 2886863 2930473 2971494 3009744 3045078 3077098 3105194 3129168 3149240 3164977 3174781 3177024 3171332
53368C171332j3200k0843k9264l7799m4988n0116n3620n6291n8539o0443o2007
$$ 3171332 3158132 3137289 3108025 3070226 3025238 2975122 2921502 2865211 2806672 2746229 2684222
53357B684222o3208o3907o3920o3258o2176o0864n9266n7476n6166n6011n6633
$$ 2684222 2621014 2557107 2493187 2429929 2367753 2306889 2247623 2190147 2133981 2077970 2021337
53346B021337n6813n5984n4813n3879n2556m9997m6618m3574m1106l8458l5374
$$ 2021337 1964524 1908540 1853727 1799848 1747292 1697295 1650677 1607103 1565997 1527539 1492165
53335A492165l2565l0480k8567k6167k3429k0898j8778j7106j6145j6024j6204
$$ 1492165 1459600 1429120 1400553 1374386 1350957 1330059 1311281 1294175 1278030 1262006 1245802
53324A245802j5894j4965j3991j3333j2588j1228r462q054p236o276m517k473
$$ 1245802 1229908 1214943 1200952 1187619 1175031 1163803 1154341 1146287 1139051 1132775 1128258 1125785
53312A125785j270j032n68J114L570N639O858P732Q930J0766J3099J5358J6907
$$ 1125785 1124515 1123483 1122915 1124029 1127599 1133238 1140096 1147828 1156758 1167524 1180623 1195981 1212888
53299A212888J7857J9124K1271K3730K5653K7033K8235K8935K8598K7688K7388
$$ 1212888 1230745 1249869 1271140 1294870 1320523 1347556 1375791 1404726 1433324 1461012 1488400
53288A488400K7992K8560K8277K7234K5752K3832K1631J9685J8135J6365J3801
$$ 1488400 1516392 1544952 1573229 1600463 1626215 1650047 1671678 1691363 1709498 1725863 1739664
53277A739664J0640P430M478J873l80k643n578r409j3599j7552k1124k4262k6700
$$ 1739664 1750304 1757734 1762212 1764085 1763705 1761062 1755484 1746075 1732476 1714924 1693800 1669538 1642838
53264A642838k8435k9996l1791l3547l4822l5619l6062l5885l4832l3312l2099
$$ 1642838 1614403 1584407 1552616 1519069 1484247 1448628 1412566 1376681 1341849 1308537 1276438
53253A276438l1485l1217l1056l0973l0889l0723l0627l0818l1170l1347l1234
$$ 1276438 1244953 1213736 1182680 1151707 1120818 1090095 1059468 1028650 997480 966133 934899
53242I34899l0871l0087k8691k7012k5717k4912k3868k1955j9534j7478j6023
$$ 934899 904028 873941 845250 818238 792521 767609 743741 721786 702252 684774 668751
53231F68751j4553j2637j0776r842r914j0167r950r563r766j0736j1836j2345
$$ 668751 654198 641561 630785 620943 611029 600862 590912 581349 571583 560847 549011 536666
53219E36666j2139j1644j1321j1245j1118j0735j0340j0369j0755j0874j0341
$$ 536666 524527 512883 501562 490317 479199 468464 458124 447755 437000 426126 415785
53208D15785r520q906q391p597o665o108o099o437p076q040q895q993q309p471
$$ 415785 406265 397359 388968 381371 374706 368598 362499 356062 348986 340946 332051 323058 314749 307278
53194C07278o848o270n653n224m937m389l539k877k579k205j576j179j290j401
$$ 307278 300430 294160 288507 283283 278346 273957 270418 267541 264962 262757 261181 260002 258712 257311
53180B57311j119r97j758l092l950l734k680j431o92q84j577j707r49l44q16j683
$$ 257311 256192 255195 253437 250345 246395 242661 239981 238550 237858 236974 235397 233690 232741 232397 231581 229898
53164B29898j601n87R2j69p34j107j583k253k466j914j305j294j440r85p5M95
$$ 229898 228297 227710 227802 227633 226899 225792 224209 221956 219490 217576 216271 214977 213537 212552 212477 212972
53148B12972L69k32j055j798j869r78J38L91j55k18R16K250K214N87j303k141
$$ 212972 213341 213109 212054 210256 208387 207409 207547 207938 207783 207565 208481 210731 212945 213532 212229 210088
53132B10088j787r27r9N52R39R95Q92R42J157J186P79J27m12p07q38r12r95j106
$$ 210088 208301 207374 207275 207827 208766 209761 210653 211595 212752 213938 214717 214844 214432 213725 212887 211975 210980 209874
53114B09874j110q17l60j81n05r90j143r24p13q43j321j838j942j455q28o86q61
$$ 209874 208764 207947 207587 207406 206901 205911 204768 203844 203131 202288 200967 199129 197187 195732 194904 194218 193357
53097A93357m72O97J598J322M88K50N34L64k70l22M69R89N19j69j19M44Q02R48
$$ 193357 192885 193582 195180 196502 196990 197240 197774 198138 197868 197546 198015 199004 199523 199354 199235 199679 200481 201429
53079B01429J183J253Q58M51M88M28l96j412j490q02o21j255j521o55M84P36K20
$$ 201429 202612 203865 204723 205174 205662 206090 205694 204282 202792 201990 201369 200114 198593 197938 198422 199158 199378
53062A99378j86j86j15j32j21j26k22j90J18L26L5m39m66j12j33q69j702j899
$$ 199378 199192 199006 198891 198759 198638 198512 198290 198100 198218 198544 198579 198140 197674 197562 197429 196560 194858 192959
53044A92959j507j166j277j620j693j279o68l39l79l47J29P21P57J60l89m09l16
$$ 192959 191452 190286 189009 187389 185696 184417 183749 183410 183031 182684 182813 183534 184291 184451 184062 183653 183337
53027A83337p39j438j480n23O22R95O23K88M14O98P87P44O48K93l56q03n73K9
$$ 183337 182598 181160 179680 179157 179779 180774 181397 181685 182099 182797 183584 184328 184976 185269 184913 184110 183537 183566
53009A83566K76K1j48J53O00P35O01M71K86j52o50p21k27M28P90Q21P70P65O76
$$ 183566 183842 183863 183715 183868 184468 185203 185804 186275 186561 186409 185759 185038 184811 185239 186029 186850 187620 188385 189061
52990A89061L74K7k4K51M16J35k34j6P54J180O34l45o91r9P70J222J240J211J306
$$ 189061 189435 189462 189438 189689 190105 190240 190006 189990 190744 191924 192558 192213 191522 191423 192193 193415 194655 195866 197172
52971A97172J308R59L71J5K12O54P41M20K57N14P06M39J81N07R90O47o22j861
$$ 197172 198480 199439 199810 199825 200037 200691 201432 201852 202109 202623 203329 203768 203949 204456 205446 206093 205471 203610
52953B03610k401k446k238j522l51M12Q0p71j002m08J56N4m04o25n63n23n54l98
$$ 203610 201209 198763 196525 195003 194652 195064 195144 194373 193371 192963 193119 193173 192769 192144 191581 191058 190504 190106
52935A90106k0K32R0k33l17j13M3l5k03m10q49j453j678j279q23q77j016m35O73
$$ 190106 190086 190318 190408 190175 189858 189745 189788 189753 189550 189140 188291 186838 185160 183881 183058 182181 181165 180730 181403
52916A81403J258R41M28K69J78q2j27K32M33J17k10j23j06n84q67j14J111J458
$$ 181403 182661 183602 184030 184299 184477 184395 184268 184500 184933 185050 184840 184717 184611 184027 183160 183046 184157 185615
52898A85615O50l42q28r38p20J01J125J241R7j174j284k32J017J733J789J295
$$ 185615 186265 185923 185095 184157 183437 183538 184663 185904 186001 184827 183543 183311 184328 186061 187850 189145
52882A89145M33m73j085j214q56k79K0j71l43J30R85J320Q89M14M44P17R15J169
$$ 189145 189578 189105 188020 186806 185950 185671 185691 185520 185177 185307 186292 187612 188501 188915 189359 190076 190991 192160
52864A92160J346P74n75j420o93P80J167Mj415j958j914k089k539k772k556k044
$$ 192160 193506 194280 193705 192285 191592 192372 193539 193543 192128 190170 188256 186167 183628 180856 178300 176256
52848A76256j413q38n50n74n98m70n96j413k511k774j667K5J056J080Q04Q09Q41
$$ 176256 174843 174005 173455 172881 172283 171813 171217 169804 167293 164519 162852 162877 163933 165013 165817 166626 167467
52831A67467M43j73m28k64j52l07m24k92j17n3J04N08R41J107J002P68N20M32
$$ 167467 167910 167737 167309 167045 166893 166586 166162 165870 165753 165700 165804 166312 167253 168360 169362 170130 170650 171082
52813A71082O78J106J380J593K158K904K897J669O0q34j038j332j929k372k522
$$ 171082 171760 172866 174246 175839 177997 180901 183798 185467 185527 184693 183655 182323 180394 178022 175500
52798A75500k668k712k133j024k83m16q33p68l05m2j05j00J89N31O51N67M98N85
$$ 175500 172832 170120 167987 166963 166680 166264 165431 164663 164358 164316 164211 164111 164300 164831 165482 166049 166547 167132
52780A67132O91N50J56k3M30J227J590J163L22m87j174j619j441o02J75J32o37
$$ 167132 167823 168373 168529 168506 168936 170163 171753 172916 173238 172751 171577 169958 168517 167915 168090 168222 167585
52763A67585j423j791j690j040J49J281J522Q17k0l51l20k05K00J060J904K089
$$ 167585 166162 164371 162681 161641 161790 163071 164593 165410 165390 165039 164719 164514 164714 165774 167678 169767
52747A69767J636J056N64K3m27l62K41Q76J256J659K254K604K258J478Q95P45
$$ 169767 171403 172459 173023 173046 172619 172257 172498 173374 174630 176289 178543 181147 183405 184883 185778 186523
52731A86523Q46J043J150P21m43j630j775q21J29J88l43o86o59n49m86m32m95
$$ 186523 187369 188412 189562 190283 189840 188210 186435 185614 185743 185931 185588 184902 184243 183694 183208 182776 182281
52714A82281o94o63j79K82Q1n80r10o98n37p47q06k57M48N85K63K68R24J655J779
$$ 182281 181587 180924 180745 181027 181108 180528 179618 178920 178383 177636 176830 176573 177021 177606 177869 178137 179061 180716 182495
52695A82495J221L80m07r25r67m64K73P41P26M31J26j19k82k34N6K72Q4l60n04
$$ 182495 183716 184096 183689 182764 181797 181333 181606 182347 183073 183504 183630 183511 183229 182995 183051 183323 183407 183047 182543
52676A82543q8M84O07J59m07o19m13j02M6R7K90O06P19N06L94Q09J497J806J665
$$ 182543 182455 182939 183546 183705 183298 182679 182266 182164 182210 182307 182597 183203 183922 184428 184822 185631 187128 188934 190599
52657A90599J620J833J636N10j016j896j753j092n59m08n22n87l93j91m52j026
$$ 190599 192219 194052 195688 196198 195182 193286 191533 190441 189882 189474 188952 188365 187972 187781 187329 186303
52641A86303j017m3R32P93o9k45O05J267Q13r7k98K09M81Q8l52k7J148K401K729
$$ 186303 185286 185243 186175 186968 186899 186654 187259 188526 189339 189242 188944 189153 189634 189722 189370 189343 190491 192892 195621
52622A95621J744J19r55r45m18k11m51o66n29j81Q3J05j00l89n49l92J07P98J391
$$ 195621 197365 197484 196529 195584 195166 194955 194504 193838 193309 193128 193211 193316 193216 192827 192278 191886 191993 192791 194182
52603A94182J584J342J020R16Q36M45k2Q2Q99J788K158J995J444M66o41j062m15
$$ 194182 195766 197108 198128 199044 199880 200325 200303 200385 201284 203072 205230 207225 208669 209135 208494 207432 207017
52586B07017M55M37m00r80p21j04K63M17N71N29J8p04j025o79k5L89L63J11r4
$$ 207017 207472 207909 207509 206529 205808 205704 205967 206384 206955 207484 207502 206798 205773 205094 205069 205458 205821 205932 205838
52567B05838k57n84j102j502j460r75k69M88J184J602J502Q75J6o39p62l63R3
$$ 205838 205581 204997 203895 202393 200933 199958 199689 200177 201361 202963 204465 205340 205356 204717 203955 203592 203685
52550B03685Q4l61o23k83L03M69Q3m59q29r45o91pP44J003P56O05R13J278J114
$$ 203685 203769 203408 202785 202502 202805 203274 203357 202898 202069 201124 200433 200426 201170 202173 202929 203534 204447 205725 206839
52531B06839M45k65p61j170j541j632j239n20J13L08Kn55q82n91K57J137J562
$$ 206839 207284 207019 206258 205088 203547 201915 200676 200156 200269 200577 200579 200024 199142 198551 198808 199945 201507
52514B01507J560J542J703J804J620J271R86P80O69Q91J493J937J680R85N28K18
$$ 201507 203067 204609 206312 208116 209736 211007 211993 212773 213442 214333 215826 217763 219443 220428 220956 221174
52498B21174o40j937k428j407P8M69l91j385j697j449j019o51n89q16p31J34J200
$$ 221174 220534 218597 216169 214762 214840 215309 214918 213533 211836 210387 209368 208717 208128 207312 206581 206715 207915
52481B07915J451R39P45J347K014K076J807J622J272N08j59j08M01O13L21n3k00
$$ 207915 209366 210305 211050 212397 214411 216487 218294 219916 221188 221696 221537 221429 221830 222443 222764 222711 222511
52464B22511j78l2L33R24J570K019K029J588J070Q80Q41L75n51j259j361j306
$$ 222511 222333 222301 222634 223558 225128 227147 229176 230764 231834 232714 233555 233930 233379 232120 230759 229453
52448B29453j552j889k046k323k867l028k224j006k94k1M99J136J096M22J03N05
$$ 229453 227901 226012 223966 221643 218776 215748 213524 212518 212224 212203 212702 213838 214934 215356 215459 215964
52432B15964Q30N44K20M67Q43O89L30O44J751K843L169K678J855J400J840L041
$$ 215964 216794 217338 217558 218025 218868 219557 219887 220531 222282 225125 228294 230972 232827 234227 236067 239108
52416B39108M226M801N016N496O344P100P405P201O401M845K656K53k044m160
$$ 239108 243334 248135 253151 258647 264991 272091 279496 286697 293098 297943 300599 300852 298808 294648
52402B94648n921o864o623n422m010l108k857k848k617k101j533j007l83L99J110
$$ 294648 288727 281863 275240 269818 265808 262700 259843 256995 254378 252277 250744 249737 249354 249753 250863
52387B50863J488J514J444J552J928K358K457K135J828K004K512K794K752K872
$$ 250863 252351 253865 255309 256861 258789 261147 263604 265739 267567 269571 272083 274877 277629 280501
52373B80501L366L795L786L658L875M351M705M896N058N015M513L728L031K445
$$ 280501 283867 287662 291448 295106 298981 303332 308037 312933 317991 323006 327519 331247 334278 336723
52359C36723J845J520J863K555K809K508K504L531N289O893P773P967P888Q085
$$ 336723 338568 340088 341951 344506 347315 349823 352327 355858 361147 368040 375813 383780 391668 399753
52345C99753Q872R966J0782J1276J2026J3277J4420J4876J5074J5912J7512J9093
$$ 399753 408625 418591 429373 440649 452675 465952 480372 495248 510322 526234 543746 562839
52333E62839K0055K0581K1051K1374K1208K0531J9747J9263J9174J9246J9073
$$ 562839 582894 603475 624526 645900 667108 687639 707386 726649 745823 765069 784142
52322G84142J8305J6841J4949J3131J1790J0812R604P688N304L176J608J88j418
$$ 784142 802447 819288 834237 847368 859158 869970 879574 887262 892566 895742 897350 897538 896120
52309H96120k823l543l932m778n979o418n472m023l423l879m481m552m187l511
$$ 896120 893297 889754 885822 881044 875065 868647 863175 859152 855729 851850 847369 842817 838630 835119
52295H35119k250m10J271K111K476L326M974O730P876Q503R236J0458J2013J3463
$$ 835119 832869 832459 833730 835841 838317 841643 846617 853347 861223 869726 878962 889420 901433 914896
52281I14896J4468J4986J5191J5139J4563J3219J1434R984R271Q844P933O284
$$ 914896 929364 944350 959541 974680 989243 1002462 1013896 1023880 1033151 1041995 1049928 1056212
52269A056212M261K317O72o57j776k925m313n832p083p720p827p944q625r777
$$ 1056212 1060473 1062790 1063462 1062805 1061029 1058104 1053791 1047959 1040876 1033156 1025329 1017385 1008760 998983
52255I98983j0552j0184q956p947p743p882p786p576p511p180o111m771m024l737
$$ 998983 988431 978247 969291 961344 953601 945719 937933 930357 922846 915666 909555 904784 900760 897023
52241H97023k959j569o95j035j709j441j92J194K321L365M232M563M558M865N492
$$ 897023 894064 892495 891800 890765 889056 887615 887423 888617 890938 894303 898535 903098 907656 912521 918013
52226I18013N622M860M011M103N044N828N834N479N501O057O701P054P195P412
$$ 918013 923635 928495 932506 936609 941653 947481 953315 958794 964295 970352 977053 984107 991302 998714
52212I98714P716P777P258O112M617L290K686K972L634L818L193K236J569J314
$$ 998714 1006430 1014207 1021465 1027577 1032194 1035484 1038170 1041142 1044776 1048594 1051787 1054023 1055592 1056906
52198A056906J272J421J821K206K156J625R80M93J26k37p07j510k697l789m103
$$ 1056906 1058178 1059599 1061420 1063626 1065782 1067407 1068387 1068880 1069006 1068769 1068062 1066552 1063855 1060066 1055963
52183A055963l653l208l312l703l994m328m875n104m304k713j416j080j305j432
$$ 1055963 1052310 1049102 1045790 1042087 1038093 1033765 1028890 1023786 1019482 1016769 1015353 1014273 1012968 1011536
52169A011536j383j380j296p91O9Q32J240J475J852K437L083L633M002M218M359
$$ 1011536 1010153 1008773 1007477 1006686 1006755 1007587 1008827 1010302 1012154 1014591 1017674 1021307 1025309 1029527 1033886
52154A033886M375M122L682L532M123N340O647P687Q461R009R359R746J0412J1095
$$ 1033886 1038261 1042383 1046065 1049597 1053720 1059060 1065707 1073394 1081855 1090864 1100223 1109969 1120381 1131476
52140A131476J1266J1053J1289J2299J3287J3474J3336J3858J4968J5590J5240
$$ 1131476 1142742 1153795 1165084 1177383 1190670 1204144 1217480 1231338 1246306 1261896 1277136
52129A277136J4659J4664J5135J5450J5315J4830J4207J3678J3324J2791J1596
$$ 1277136 1291795 1306459 1321594 1337044 1352359 1367189 1381396 1395074 1408398 1421189 1432785
52118A432785R822Q058O472M631K447O14m56j454l184n286o703p203p628q617
$$ 1432785 1442607 1450665 1457137 1461768 1464215 1464829 1464373 1462919 1459735 1454449 1447746 1440543 1432915 1424298
52104A424298r812j0426j0115r082p683o152m535k810j087M08J619K678L548M005
$$ 1424298 1414486 1404060 1393945 1384863 1377180 1371028 1366493 1363683 1362596 1363004 1364623 1367301 1370849 1374854
52090A374854M156M559N494O562P386Q289R752J1581J3270J4762J6132J6863J6372
$$ 1374854 1379010 1383569 1389063 1395625 1403011 1411300 1421052 1432633 1445903 1460665 1476797 1493660 1510032
$$ [...]
##END NTUPLES=NMR SPECTRUM
##END=
