##TITLE=AC1472_13FE002654_8026838_OpbxDh4EUJ
##JCAMPDX= 6.0         $$ Bruker NMR JCAMP-DX V2.0
##DATA TYPE= NMR SPECTRUM
##DATA CLASS= NTUPLES
##ORIGIN= BRUKER
##OWNER= Administrator
$$ 1.72 TOPSPIN		Version 2.1
$$ 2013-07-11 21:42:54.878 -0700  Administrator@X
$$ Compression mode = diff/dup
##.OBSERVE FREQUENCY= 400.02188249412
##.OBSERVE NUCLEUS= ^1H
##.ACQUISITION MODE= SIMULTANEOUS (DQD)
##.ACQUISITION SCHEME= undefined
##.AVERAGES= 8
##.DIGITISER RES= 22
##SPECTROMETER/DATA SYSTEM= spect
##.PULSE SEQUENCE= zg30
##.SOLVENT NAME= COFFEE_meoh
##.SHIFT REFERENCE= INTERNAL, COFFEE_meoh, 1, 14.98509
##AUDIT TRAIL= $$ (NUMBER, WHEN, WHO, WHERE, PROCESS, VERSION, WHAT)
$$ ##TITLE= Audit trail, TOPSPIN		Version 2.1
$$ ##JCAMPDX= 5.01
$$ ##ORIGIN= Bruker BioSpin GmbH
$$ ##OWNER= Administrator
$$ $$ E:\/data/COFFEE/nmr/AC1472_13FE002654_8026838_OpbxDh4EUJ/10/pdata/1/auditp.txt
$$ ##AUDIT TRAIL=  $$ (NUMBER, WHEN, WHO, WHERE, PROCESS, VERSION, WHAT)
(   1,<2013-07-11 21:42:48.049 -0700>,<Administrator>,<X>,<go>,<TOPSPIN 2.1>,
      <created by zg
	started at 2013-07-11 21:41:41.518 -0700,
	POWCHK enabled, PULCHK disabled,
       configuration hash MD5:
       C8 4E 4E 5D D3 5C D8 9E 9F 52 82 E0 59 8A DE 15
       data hash MD5: 64K
       DF 94 32 0E 5C 78 4D F2 40 9D B4 1B 29 6A E9 8C>)
(   2,<2013-07-11 21:42:50.909 -0700>,<Administrator>,<X>,<proc1d>,<TOPSPIN 2.1>,
      <Start of raw data processing
       efp LB = 0 FT_mod = 6 PKNL = 1 PHC0 = 0 PHC1 = 0 SI = 32K 
       data hash MD5: 32K
       AB 04 C0 A8 94 47 A6 34 AE A6 15 DA 06 6E E6 93>)
(   3,<2013-07-11 21:42:51.253 -0700>,<Administrator>,<X>,<proc1d>,<TOPSPIN 2.1>,
      <pk PHC0 = 98.34961 PHC1 = 0 
       data hash MD5: 32K
       0A B5 24 0A 65 A3 9E 35 67 8C 87 5E DE 39 8D C7>)
(   4,<2013-07-11 21:42:51.424 -0700>,<Administrator>,<X>,<proc1d>,<TOPSPIN 2.1>,
      <abs ABSG = 1 
       data hash MD5: 32K
       2C F0 7A 6E 36 ED 6E C2 F9 DC 1F 59 38 53 8E 15>)
(   5,<2013-07-11 21:42:51.487 -0700>,<Administrator>,<X>,<proc1d>,<TOPSPIN 2.1>,
      <abs ABSG = 2 
       data hash MD5: 32K
       05 BB CC ED 0E 64 AD 14 CC F1 09 2D 74 8D BF C8>)
(   6,<2013-07-11 21:42:51.565 -0700>,<Administrator>,<X>,<proc1d>,<TOPSPIN 2.1>,
      <abs ABSG = 3 
       data hash MD5: 32K
       94 DF 5B 54 52 4A 0F 6F 18 42 F3 DD 07 AE B9 13>)
(   7,<2013-07-11 21:42:51.596 -0700>,<Administrator>,<X>,<proc1d>,<TOPSPIN 2.1>,
      <abs ABSG = 4 
       data hash MD5: 32K
       92 1A BD 76 D2 B2 98 52 D4 40 18 BD 12 0F AC 98>)
(   8,<2013-07-11 21:42:51.659 -0700>,<Administrator>,<X>,<proc1d>,<TOPSPIN 2.1>,
      <abs ABSG = 5 
       data hash MD5: 32K
       CD FB AD 21 60 C0 B4 B9 7C 90 25 9A FD 05 D4 CD>)
$$ ##END=
$$ 
$$ $$ hash MD5
$$ $$ 28 84 26 92 08 89 7E 16 B3 03 69 99 64 BD FD A9
##$RELAX= 
##$RELAX= 
##$RELAX= 
##$RELAX= 
##$RELAX= 
##$RELAX= 
##$RELAX= 
$$ Bruker specific parameters
$$ --------------------------
##$DU= <E:\>
##$EXPNO= 10
##$NAME= <AC1472_13FE002654_8026838_OpbxDh4EUJ>
$$ [...]
##$TP= (0..7)
150 150 150 150 150 150 150 150
##$TP07= 0
##$TPNAME0= <>
##$TPNAME1= <>
##$TPNAME2= <>
##$TPNAME3= <>
##$TPNAME4= <>
##$TPNAME5= <>
##$TPNAME6= <>
##$TPNAME7= <>
##$TPOAL= (0..7)
0.5 0.5 0.5 0.5 0.5 0.5 0.5 0.5
##$TPOFFS= (0..7)
0 0 0 0 0 0 0 0
##$TUNHIN= 0
##$TUNHOUT= 0
##$TUNXOUT= 0
##$USERA1= <user>
##$USERA2= <user>
##$USERA3= <user>
##$USERA4= <user>
##$USERA5= <user>
##$V9= 5
##$VALIST= <valist>
##$VCLIST= <CCCCCCCCCCCCCCC>
##$VD= 0
##$VDLIST= <DDDDDDDDDDDDDDD>
##$VPLIST= <PPPPPPPPPPPPPPP>
##$VTLIST= <TTTTTTTTTTTTTTT>
##$WBST= 1024
##$WBSW= 4
##$XGAIN= (0..3)
0 0 0 0
##$XL= 0
##$YL= 0
##$YMAX_a= 648841
##$YMIN_a= -550210
##$ZGOPTNS= <>
##$ZL1= 120
##$ZL2= 120
##$ZL3= 120
##$ZL4= 120
##$ABSF1= 14.98509
##$ABSF2= -5.573092
##$ABSG= 5
##$ABSL= 3
##$ALPHA= 0
##$AQORDER= 0
##$ASSFAC= 0
##$ASSFACI= 0
##$ASSFACX= 0
##$ASSWID= 0
##$AUNMP= <proc_prof1d_extract_pilot.lims>
##$AXLEFT= 0
##$AXNAME= <>
##$AXNUC= <1H>
##$AXRIGHT= 0
##$AXTYPE= 0
##$AXUNIT= <>
##$AZFE= 0.1
##$AZFW= 0.1
##$BCFW= 0
##$BC_mod= 0
##$BYTORDP= 0
##$COROFFS= 0
##$CY= 15
##$DATMOD= 1
##$DC= 0
##$DFILT= <>
##$DTYPP= 0
##$F1P= 0
##$F2P= 0
##$FCOR= 0.5
##$FTSIZE= 32768
##$FT_mod= 6
##$GAMMA= 0
##$GB= 0
##$INTBC= 1
##$INTSCL= 1
##$ISEN= 128
##$LB= 0
##$LEV0= 0
##$LPBIN= 0
##$MAXI= 10000
##$MC2= 0
##$MEAN= 0
##$ME_mod= 0
##$MI= 0
##$NCOEF= 0
##$NC_proc= -8
##$NLEV= 6
##$NOISF1= 0
##$NOISF2= 0
##$NSP= 0
##$NTH_PI= 0
##$NZP= 0
##$OFFSET= 14.98509
##$PC= 1
##$PHC0= 98.34961
##$PHC1= 0
##$PH_mod= 1
##$PKNL= yes
##$PPARMOD= 0
##$PPDIAG= 0
##$PPIPTYP= 0
##$PPMPNUM= 2147483647
##$PPRESOL= 1
##$PSCAL= 4
##$PSIGN= 0
##$PYNMP= <proc.py>
##$REVERSE= no
##$SF= 400.02
##$SI= 32768
##$SIGF1= 0
##$SIGF2= 0
##$SINO= 400
##$SIOLD= 32768
##$SPECTYP= <>
##$SREGLST= <1H.CDCl3>
##$SSB= 0
##$STSI= 32768
##$STSR= 0
##$SW_p= 8223.68421052631
##$SYMM= 0
##$S_DEV= 0
##$TDeff= 65536
##$TDoff= 0
##$TI= <>
##$TILT= no
##$TM1= 0
##$TM2= 0
##$TOPLEV= 0
##$USERP1= <user>
##$USERP2= <user>
##$USERP3= <user>
##$USERP4= <user>
##$USERP5= <user>
##$WDW= 1
##$XDIM= 32768
##$YMAX_p= 447138321
##$YMIN_p= -702372
##$CURPLOT= <Network HP LaserJet P1505>
##$CURPRIN= <$Network HP LaserJet P1505>
##$DFORMAT= <normdp>
##$LAYOUT= <+/1D_H.xwp>
##$LFORMAT= <normlp>
##$PFORMAT= <normpl>
##$SURQMSG= 1
$$ End of Bruker specific parameters
$$ ---------------------------------
##NTUPLES= NMR SPECTRUM
##VAR_NAME=  FREQUENCY,     SPECTRUM/REAL,   SPECTRUM/IMAG
##SYMBOL=    X,             R,               I
##VAR_TYPE=  INDEPENDENT,   DEPENDENT,       DEPENDENT
##VAR_FORM=  AFFN,          ASDF,            ASDF
##VAR_DIM=   32768,         32768,           32768
##UNITS=     HZ,            ARBITRARY UNITS, ARBITRARY UNITS
##FACTOR=    0.250966925370066, 1,           1
##FIRST=     8223.43324360094, 136136,       -67987
##LAST=      0,             -209404,         -11524
##MIN=       0,             -702372,         0
##MAX=       8223.43324360094, 447138321,    0
$$ Real data points
##PAGE= N=1
##DATA TABLE= (X++(R..R)), XYDATA
$$ [...]
19516B83814c67744a54102B55963a11146j19211B4370N1842g558n9661l0595K3709
19505g4105F4756b66989k9917J07314g2238F9704a05700C78598a68583e8536G0265
19493f2253A82714B4727e1855A79731c45238a33375j78620Q9732g3223H5827K0742
19482A06569b09432N1917A3512a66723A5187b05803i6867J4520B3448d76492B45550
19470a16346B36786a30614A58476a7630j49462j10182C4212J02197b96383N3409
19460b42974e7270l42760g5845K7331J6947C36948c3077B08621a4885j66145A9308
19448h8356j88034A10477e58015b41628m49970A26209c19044A25309a61081B30514
19437b42692A97895d69629d873j3341B5210O6582h5562A98409e4169k41467A15998
$$ plain form
19516 283814 -367744 -154102 255963 -111146 -230357 24370 76212 -7558 -67219 -97814 -74105
19505 -74105 64756 -266989 -296906 -189592 -72238 69704 -105700 378598 -168583 -58536 70265
19493 -62253 182714 24727 -51855 179731 -345238 -133375 -311995 -222263 -73223 85827 106569
19482 106569 -209432 -157515 13512 -166723 15187 -205803 -96867 -82347 23448 -476492 245550
19470 -116346 236786 -130614 158476 -17630 -167092 -277274 34212 136409 -296383 -242974
19460 -242974 -57270 -400030 -75845 -48514 -31567 336948 -33077 208621 -14885 -181030 19308
19448 -88356 -276390 110477 -558015 -241628 -691598 126209 -319044 125309 -161081 230514
19437 -242692 197895 -469629 -4873 -18214 25210 91792 -85562 198409 -54169 -295636 115998
19425f5394A09968B7454d52637D667M2933a79762d8732l8591L2842k2759a9194
19413F3645a75357B40824a12121L1910A79631b77820B16882E988Q0356c32371
19402a56250M4914p0426f9620r2227k07293a60130L9624j04805B4640c623k34271
19391b37894N7306B4775a20168j1639Q719L2895A15800a21952A1602M5043d5707
19379b52003D69670a56647n3044P0776d562k57263k13293B9996b20098G8027J0409
19368H8436e26892b8009C34749b44395C5708b21123J04609m0031E6128a97559
19357A87114e4623l2592j47647Q1571J648k83383D0401a8882A17131e00B3695
19345F498a03966k98296D6278i3045j46722B7343K57136f5130J4831A69303h2170
$$ plain form
19425 -65394 109968 27454 -452637 4667 47600 -179762 -48732 -87323 -54481 -77240 -19194
19413 63645 -175357 240824 -112121 -80211 179631 -277820 216882 5988 86344 -332371
19402 -156250 -111336 -181762 -69620 -161847 -369140 -160130 -120506 -225311 24640 -3623 -237894
19391 -237894 -180588 24775 -120168 -131807 -123088 -90193 115800 -121952 11602 56645 -45707
19379 -252003 469670 -156647 -209691 -138915 -4562 -261825 -475118 29996 -220098 78027 88436
19368 88436 -526892 -28009 334749 -244395 35708 -221123 -116514 -156545 56128 -197559
19357 187114 -54623 -87215 -234862 -153291 -151643 -435026 40401 -18882 117131 -500 23695
19345 6498 -103966 -402262 46278 -93045 -239767 27343 284479 -65130 -50299 169303 -82170
19333a33007A92867d86139F3359k5234c7555C44455a95132i3393j83714m3241
19323c20348B83858k8162a4786l14408g0186K6544k45885L8919C8268b8559I0588
19311D0979a48127N398k42242A11446b41397d9971C2259a2233F2883h8146A91760
19299b82219j17224a74180g7948G9335a24742m6076A50017A5659c50674A81764
19288B06522E2648c42450J10602A14950M2591a05483M9428k2344B27139a8676
19277a17508C10048a88329j81507J44662B83648j41256h4494c2643A25567C3198
19266A20038e5357l10352a46526e1755m4157l543L1304j99263e9685l0403m3591
19255a33679r7549Q4806O9370k6106n39F0592b8008G8642e8417H863K09964d5374
$$ plain form
19333 -133007 192867 -486139 63359 38125 -37555 344455 -195132 -93393 -277107 -320348
19323 -320348 283858 255696 -14786 -329194 -70186 -43642 -289527 -250608 38268 -28559 90588
19311 40979 -148127 -142729 -384971 111446 -241397 -49971 32259 -12233 62883 -88146 191760
19299 -282219 -399443 -174180 -77948 79335 -124742 -170818 150017 15659 -350674 181764
19288 206522 52648 -342450 -231848 114950 157541 -105483 -56055 -78399 227139 -18676
19277 -117508 310048 -188329 -369836 -225174 283648 142392 -84494 -32643 125567 33198
19266 120038 -55357 -365709 -146526 -51755 -95912 -99455 -68151 -267414 -59685 -90088 -133679
19255 -133679 -231228 -146422 -77052 -103158 -103697 60592 -28008 78642 -58417 8863 218827 -45374
19242E6077p456H755J21776g8338K5337q878J7262K1312o3638A32636L3570p872
19230A58334a25277d6981H0632J73470j10027J1399a66784N2340K9030A1786a01330
19218b40853F1749e08936D6330i2994l4406D4774b65722a04380k29967a14644
19207g885l46430d5264C8188J87155o3834a0346n3277B585O472K93160b07608
19195I7091B0280b67165J13609D8829J92263c6114E0681a56586j82279e2488c952
19183f0292j36480Q254F6363b30459q880j44481f1276j84110B32064I2675g7558
19171i2429c0929B19680a15862B9484a23841l163k91407a9125k12582p2253a6474
19159b22236c0055k9245C2572a15605L3750C7650J30556a6210j02953l8003A11977
$$ plain form
19242 56077 48621 8755 130531 -78338 -53001 -61879 -44617 -23305 -86943 132636 166206 158334
19230 158334 -125277 -46981 80632 254102 144075 155474 -166784 -114444 -85414 11786 -101330
19218 -240853 61749 -508936 46330 -92994 -127400 44774 -265722 -104380 -334347 -114644
19207 -7885 -354315 -45264 38188 225343 161509 -10346 -63623 2585 9057 302217 -207608
19195 97091 20280 -267165 -153556 48829 241092 -36114 50681 -156586 -338865 -52488 -3952
19183 -60292 -196772 -188518 66363 -230459 -239339 -383820 -61276 -245386 232064 92675 -77558
19171 -92429 -30929 219680 -115862 29484 -123841 -127004 -418411 -19125 -231707 -303960 -16474
19159 -222236 -30055 -59300 32572 -115605 -81855 37650 168206 -16210 -119163 -157166 111977
19147B10879a86710E2345b03972H2870b18740K2049M4995a0970j6417C48604K81804
19136F30408I1337a9503n9053A49433i5967j09566e5596a4770C6918a58721A71786
19124a37515A48815e8407r9595A9754J75718b59500o0810A54416b17541k4429
19114b41970h0761A20946a30086A24839b28690b6437A91935n7694a67333j47256
19104c14589e0772G1929a90797G1720f0978a5072j29559F8194b43471A31414R2797
19093B24211I3678b29442a00928B6294d20920a87400d1917l31214a57185A36864
19082a83277k0078B2063e6921N725n3929C0674j1746c6095A33130h5251F792a84370
19069b89899a31232b23C85125a485p5439A07368a11949C01986a10890F5099b81859
$$ plain form
19147 210879 -186710 52345 -203972 82870 -218740 -196691 -151696 -10970 -27387 348604 630408
19136 630408 91337 -19503 -78556 149433 -95967 -205533 -55596 -14770 36918 -158721 171786
19124 -137515 148815 -58407 -158002 19754 195472 -259500 -320310 154416 -217541 -241970
19114 -241970 -80761 120946 -130086 124839 -228690 -26437 191935 134241 -167333 -314589
19104 -314589 -50772 71929 -190797 71720 -60978 -15072 -144631 68194 -243471 131414 224211
19093 224211 93678 -229442 -100928 26294 -420920 -187400 -41917 -373131 -157185 136864
19082 -183277 -203355 22063 -56921 -51196 -105125 30674 18928 -36095 133130 -85251 6792 -184370
19069 -289899 -131232 -223 385125 -1485 -76924 107368 -111949 301986 -110890 65099 -281859
19057a76243L2559F3399a64006C6801a95557F5624b05437E5267a49661E9623c48892
19045d29021A10612a45138B2575K09849b77422Q0215N1450a6206j50966C21366
19034G4592J38220c88338C0781b3172C43858A3819R9649f2940G6714B9749e2465
19022e0630j06162P7335c9422B80799c05593a23240N6868m47841D3844j3358K6595
19011E7081b53709O9244A0514b38031J14995A41038a25118n7834R1261J4329j66654
19000b44016E7607O7602a5736I2591a41704A24165K13110d26981B14153p5196
18990A38957a54801n4153Q9954G3071b70230A73957a04959o7685B83457b3660
18979a89223f4968j23158A64168G7367b89334N0221P1016K6734E8809K16963j7473
$$ plain form
19057 -176243 -143684 63399 -164006 36801 -195557 65624 -205437 55267 -149661 59623 -348892
19045 -429021 110612 -145138 22575 232424 -277422 -197207 -145757 -16206 -167172 321366
19034 74592 212812 -388338 30781 -23172 343858 13819 113468 -62940 76714 29749 -52465
19022 -50630 -156792 -79457 -39422 280799 -305593 -123240 -66372 -514213 43844 30486 57081
19011 57081 -253709 -184465 10514 -238031 -123036 141038 -125118 -182952 -91691 -77362 -244016
19000 -244016 57607 125209 -15736 92591 -141704 124165 337275 -426981 214153 138957
18990 138957 -154801 -208954 -119000 73071 -270230 173957 -104959 -172644 283457 -23660
18979 -189223 -64968 -188126 164168 77367 -289334 -239113 -168097 -141363 58809 275772 258299
18968B58299a10264B70531a51394A89770a08384j27500i1986J6633A42905b26032
18957B47811L5440a95784A7570N002b43252b6340A19122i8758G1189b17174m766
18946b21940A59082a64020G4055g0863m0135q7025O7113F0538J54928J73960b2288
18934e2279R579o0727o4321o943A36308M6112b5881B75236C5772J67338B8985
18922d8835b2753r0717L2106L0788k9393l8847j31838l14N5349A01279b17230
18910a67035F4542a43611O1456k85354a52957d4379C79582A03145e16136C6645
18899A95958b40132B5359c58664C6130I669g732A37239F2993j7730e6643P804
18888d8839k6808k41271e7220j2783k72122D671a42688b1180m7357k18644A20828
$$ plain form
18968 258299 -110264 270531 -151394 189770 -108384 -235884 -91986 -75353 142905 -226032
18957 247811 283251 -195784 17570 22572 -243252 -26340 119122 -98758 71189 -217174 -221940
18946 -221940 159082 -164020 74055 -70863 -110998 -198023 -130910 60538 215466 389426 -22288
18934 -52279 -42700 -103427 -167748 -174691 136308 182420 -25881 275236 35772 203110 28985
18922 -48835 -22753 -113470 -81364 -50576 -79969 -118816 -250654 -250968 -195619 101279 -217230
18910 -167035 64542 -143611 -82155 -367509 -152957 -44379 379582 103145 -516136 36645
18899 195958 -240132 25359 -358664 36130 9669 -7732 137239 62993 45263 -56643 -48839
18888 -48839 -75647 -316918 -57220 -70003 -342125 4671 -142688 -21180 -68537 -287181 120828
18876B68751D2042c3874A7050g5181k4904a1217n8391j33254A2323h2716m7615
18865a30331d6781j30992D1239J21126L9075a12815A39246c43919c2862j37329
18855a70191J9592B7427Q342J02599g7760A2555b4868A20867g2772j21055j39190
18844c33017j46400a37159E4857K44436a3359K196j10137k31031H0188a00112
18833g2895J8774r9372j61033k55841a19261k7775A49457a18219k3754l12758
18823d54731h2102A46540j4722F2873N650b38029e2788B33035C736f0752E8814
18811b40066B93017C6495a86349H3308b4340j89491L646d3105a9487j02019A30057
18799C0413a29419a6990k39794l7959J46384j15014k0476e6934p9841h018r7220
$$ plain form
18876 268751 42042 -33874 17050 -75181 -100085 -11217 -69608 -202862 12323 -82716 -130331
18865 -130331 -46781 -177773 41239 162365 201440 -112815 139246 -343919 -32862 -170191
18855 -170191 -150599 27427 35769 138368 -77760 12555 -24868 120867 -72772 -193827 -333017
18844 -333017 -479417 -137159 54857 299293 -13359 -11163 -121300 -352331 80188 -100112
18833 -72895 -54121 -153493 -314526 -570367 -119261 -147036 149457 -118219 -141973 -454731
18823 -454731 -82102 146540 131818 62873 68523 -238029 -52788 233035 3736 -60752 58814
18811 -240066 293017 36495 -186349 83308 -24340 -213831 -210185 -43105 -19487 -121506 130057
18799 30413 -129419 -16990 -256784 -294743 -148359 -263373 -283849 -56934 -136775 -8018 -105238
18788a05238B19276f04540e9336j68123O2174j01251a10741E2595i8600E9583
18777a19724A49128a65750f7530A58080e407B167a16688k40150e7853j32209H4979
18765C507a26157B05824a15164k55889C53546b29661O3256L4618A62354d9438
18754A41147c55139I456b12075A92844F4801a37436A92056h4376A65514d2239
18743G0063b76900J14656C0001a48764B85798m2644i9182c9353A38260E9778b56685
18731g6962m3279l09046I1052b00523A62490b34238C4643c36016A19930c4959
18720a00000J4768R48n2416i23C52381c4304j22752N0258m3270B77288a60911
18708a29530J3405L4104J4462E7262a2107o9533l95704K34648J15435j70275J11757
$$ plain form
18788 -105238 219276 -604540 -59336 -227459 -165285 -266536 -110741 52595 -98600 59583
18777 -119724 149128 -165750 -67530 158080 -5407 2167 -116688 -356838 -57853 -190062 84979
18765 3507 -126157 205824 -115164 -371053 353546 -229661 -166405 -131787 162354 -49438
18754 141147 -355139 9456 -212075 192844 64801 -137436 192056 -84376 165514 -42239
18743 70063 -276900 -162244 30001 -148764 285798 243154 -99182 -39353 138260 59778 -256685
18731 -76962 -120241 -429287 91052 -200523 162490 -234238 34643 -336016 119930 -34959
18720 -100000 -85232 -84284 -136700 -923 352381 -34304 -157056 -106798 -150068 277288 -160911
18708 -129530 -116125 -82021 -67559 57262 -12107 -81640 -477344 -242696 -127261 -297536 -185779
18697a85779A250L31542a44409B1704a74571a3920j07543m9694c9922J2193K357
18686b5372q9384c2627C4727K54065a63170l3580C0193a0072B18654d15407a53723
18674E3634a99310b9738D50166e4720n152D61758c2377E0864b01652m6385j15814
18663c63851a00616C54647A13941m1215a19104C23607A59817a93453j32351J01943
18653b23861A35485R3323d17180g7042k73307a38580J5186A01369b0619j82753
18643b03372b8385m9838H1973a66328j6688D2409b61919D6428O9855f2012n0767
18632a12779A1676c15824R1173n098B78004d4959n0909o3945p2892Q1848K9291
18621a21566C9693i4444B61434a5601B98091A19297b70115a17764q148A20147
$$ plain form
18697 -185779 1250 332792 -144409 21704 -174571 -13920 -121463 -171157 -39922 -27729 -25372
18686 -25372 -114756 -32627 34727 288792 -163170 -196750 30193 -10072 218654 -415407 -153723
18674 53634 -199310 -29738 450166 -54720 -59872 461758 -32377 50864 -201652 -248037 -363851
18663 -363851 -100616 354647 113941 72726 -119104 323607 159817 -193453 -325804 -223861
18653 -223861 135485 228808 -417180 -77042 -350349 -138580 -123394 101369 -20619 -203372
18643 -203372 -28385 -78223 81973 -166328 -183016 42409 -261919 46428 116283 -62012 -112779
18632 -112779 11676 -315824 -224651 -229749 278004 -44959 -95868 -159813 -232705 -150857 -121566
18621 -121566 39693 -94444 261434 -15601 298091 119297 -270115 -117764 -125912 120147
18610a54531d3148k82782b5473k00493L2964p0228k80601a91633P4012E3818B5737
18598e9249o9883e7394B3136a54624o0904C4695a30506B17425n2956E2106a00390
18586D0550e7997A03177G965J02676J48417a76897A21536k5246a0895F7916J26142
18575A94058a74769D3166a55150A97485E8870K05374a02420J934L3490j32562
18565a99558M0309j56706k1176I9769a90643A87934G9867c9836B28041a15507
18554d29445a18785M6618k31243a06154F2111P100l1535b44406g8515p2891B12974
18542c15623B00701J4942M7899c63901C6501e0927k58207d7088I6298d6278l78318
18531d24596C6080b40755E9275K3381H508O3470a35421k25603A07372n166M8394
$$ plain form
18610 -154531 -43148 -325930 -25473 -225966 -193002 -263230 -543831 -191633 -117621 53818 25737
18598 -59249 -129132 -57394 23136 -154624 -215528 34695 -130506 217425 164469 52106 -100390
18586 40550 -57997 103177 7965 110641 259058 -176897 121536 96290 -10895 67916 194058
18575 194058 -174769 43166 -155150 197485 58870 264244 -102420 -100486 -66996 -199558
18565 -199558 -159249 -315955 -337131 99769 -190643 187934 79867 -39836 228041 -115507
18554 -429445 -118785 -72167 -303410 -106154 62111 69211 37676 -244406 -78515 -151406 212974
18542 -315623 200701 215643 263542 -363901 36501 -50927 -309134 -47088 96298 -46278 -424596
18531 -424596 36080 -240755 59275 82656 8508 71978 -135421 -361024 107372 102206 150600
18520A50600b8356k85683A62407k5367E9953B079a0507j35687B0617C759K40284
18509B44043l9165r9748L3099h6501p64j08089M0883E5041J20889a40606F5832
18497B3095b36281I6469a59385D2643M3774c12396A09457l5408c50198G8203f9185
18485i5493L2596D3572A3853d5687l71328G6998b7060F3657b49315R1953C5689
18473A38962b8087o219G6916e8814I539J16446M123i0978j44334b0082A6394c3961
18460F1394b18214i6196G0534a77062n8403L7446C9269e4130E0957c85772L9258
18449c46514f7776K3862E2260a14487A43646K2303c7582l67092A98986B1810L0329
18438E2139b5097f224k72609h2018j47510a06831I0622l8684d8803I6723B9074
$$ plain form
18520 150600 -28356 -314039 162407 137040 59953 2079 -10507 -146194 20617 3759 244043
18509 244043 204878 105130 138229 -86501 -87265 -195354 -154471 55041 175930 -140606 65832
18497 23095 -236281 96469 -159385 42643 86417 -312396 109457 74049 -350198 78203 -69185
18485 -95493 -62897 43572 13853 -45687 -417015 76998 -27060 63657 -249315 -157362 35689
18473 138962 -28087 -34306 76916 -58814 9539 125985 130108 -90978 -235312 -20082 16394 -33961
18460 61394 -218214 -96196 70534 -177062 -235465 -198019 39269 -54130 50957 -385772 -346514
18449 -346514 -67776 -43914 52260 -114487 143646 165949 -37582 -404674 198986 21810 52139
18438 52139 -25097 -6224 -278833 -82018 -229528 -106831 90622 51938 -48803 96723 29074
18426b6433l80594Q9369J23383A92097J76474C1860P3293a95827B6771R5568a05139
18414c10838G7510a20441j155B19481q6163a37374k27925b3566j16967f6275k50702
18403c16977a52837B01087r0025m4713b105C0770P5092b43472o5681o5498A97119
18391B58852c62234A60508k3606a94150k6042h9069I0747f4435C08262c07943
18380A01899a04305k39552a24419M5011K0553m821k18105I7334K6936C5533g1456
18368B0530J50401a99804A90124A6829J98917b26723a03504j83166B77110j7749
18358B59361a6129k15310G1424a35069c8023j03427B67168b19913j33925P3982
18348b79856p893i1504b6387j12910A14235O3837b28600I5734N633q051e1367
$$ plain form
18426 -26433 -407027 -317658 -194275 192097 368571 31860 105153 -195827 26771 122339 -105139
18414 -310838 77510 -120441 -121596 219481 133318 -137374 -365299 -23566 -140533 -66275 -316977
18403 -316977 -152837 201087 111062 66349 -2105 30770 105862 -243472 -309153 -374651 197119
18391 258852 -362234 160508 136902 -194150 -220192 -89069 90747 -64435 308262 -307943
18380 101899 -104305 -343857 -124419 -79408 -58855 -63676 -281781 97334 124270 35533 -71456
18368 20530 170931 -199804 190124 16829 215746 -226723 -103504 -286670 277110 259361
18358 259361 -16129 -231439 71424 -135069 -38023 -141450 267168 -219913 -353838 -279856
18348 -279856 -287749 -91504 -26387 -139297 114235 178072 -228600 95734 101367 93316 -51367
18336b06496A20550a4903E705b42704a4321q815A10618J0958a96963E3780b20160
18324a04936A1093h1062K1472K8069l00839J59180a3682j54448K3775B4130P1858
18313I5988a52088B04460a15784k86712a01225m47704A49590b05760k78141A13305
18302d3342m4077J5857j16388p4072L613j81423K08509g0346D5381a52800j6337
18291a69137i781I2876b62533A48558P3680c8438k77933l6401b1148H4576b13844
18279A24616c2247A5612J51444d1364B21406b18132A42237J2912b63126B98844
18268H1958P1070a06715o4005b4694I4812l8370B5663f1077D65400H0932a04520
18256I3543b23144H6761b36429N3514B93405b2480k31914A17810J6077a27280
$$ plain form
18336 -206496 120550 -14903 5705 -242704 -14321 -23136 110618 121576 -196963 53780 -220160
18324 -104936 11093 -81062 -59590 -31521 -332360 -173180 -13682 -168130 -144355 24130 95988
18313 95988 -152088 204460 -115784 -402496 -101225 -548929 149590 -205760 -483901 113305
18302 -43342 -87419 -71562 -187950 -262022 -258409 -439832 -231323 -70346 45381 -152800 -169137
18291 -169137 -9781 92876 -262533 148558 222238 -38438 -316371 -352772 -21148 84576 -213844
18279 124616 -32247 15612 167056 -41364 221406 -218132 142237 155149 -263126 298844
18268 81958 153028 -106715 -170720 -24694 94812 56442 25663 -61077 465400 80932 -104520
18256 93543 -223144 86761 -236429 -182915 293405 -22480 -254394 117810 133887 -127280
18245d8067k3949Q482p3090G9915b00029a5171p6760k90353C44768B3417c56768
18233h7523N326k7896j80663A56338f856r6077j70480P2220A43924e173j60364
18222a65537B27586c25714C6513J65972a69778m5625r7903J18820B9395j463d8386
18210b48170E8323g8535j42032D0211i8619B32731c23684g2633A23488n4830a19066
18198c11333B65935A20049M9398Q9485A20429a29559I264L166i7156A87432g4243
18186a60365F1970J14070h5708c7693B49342c3975A88808C7959A0099J71358d51054
18174A4313K06425a39718c333j86333h7779k74369B8002K38441a70758j50401
18164c21159A87481I1571b37315j7194B94448j19311i7506A95975e6193n7775
$$ plain form
18245 -48067 -72016 -63534 -136624 79915 -200029 -15171 -91931 -382284 344768 23417 -356768
18233 -87523 -82197 -110093 -290756 156338 -6856 -102933 -273413 -201193 143924 -5173 -165537
18222 -165537 227586 -325714 36513 202485 -169778 -215403 -313306 -194486 29395 27932 -48386
18210 -248170 58323 -78535 -220567 40211 -98619 232731 -323684 -72633 123488 68658 -119066
18198 -311333 265935 120049 169447 258932 120429 -129559 9264 12430 -97156 187432 -74243
18186 -160365 61970 176040 -85708 -37693 249342 -33975 188808 37959 10099 181457 -451054
18174 14313 220738 -139718 -3333 -189666 -87779 -362148 28002 266443 -170758 -321159
18164 -321159 187481 91571 -237315 -254509 294448 175137 -97506 195975 -56193 -113968
18154a13968j33457R2173f0838l72077J33990R8833o4426R2982A01568J57162
18144B58730c59950J16989i7440k36400k4394i5161I9716e0974n1600j30712g3507
18132A13387P1244b16285B07113F5321d8543a0433I45a14998e3940k42833a20058
18120G9113h0389F9055J1388K76623a06045b0757j74067A9358M3842a32361j90944
18109c23305I5744b20832a8401j26738d6832j92306i2385k6419j47093m167G9081
18097a1029j71623B9961b26129A2701a05897B25380a09112B8012a1515B44259
18086b17762K652H5384J4153g6243Q43K480r7499B8939j861J74485j9882a42668
18073e1959j85406h6180A97807d9690A75766d4068Q166I7832J33839Q8534A28646
$$ plain form
18154 -113968 -247425 -155252 -60838 -432915 -298925 -200092 -264518 -171536 101568 258730
18144 258730 -359950 -242961 -97440 -333840 -358234 -95161 99716 -50974 -102574 -233286 -73507
18132 113387 184631 -216285 207113 65321 -48543 -10433 945 -114998 -53940 -296773 -120058
18120 79113 -80389 69055 80443 357066 -106045 -20757 -194824 19358 63200 -132361 -323305
18109 -323305 95744 -220832 -18401 -145139 -46832 -239138 -92385 -118804 -265897 -270064 79081
18097 -11029 -182652 29961 -226129 12701 -105897 225380 -109112 28012 -11515 244259
18086 -217762 -215110 85384 99537 -76243 -75400 -72920 -170419 28939 27078 201563 181681 -142668
18073 -51959 -237365 -86180 197807 -49690 175766 -44068 -35902 97832 231671 320205 128646
18061a33444E4488m946M77242a41916a68q5221A01055K04416A48384b93266h9861
18049g6671J3229C1859a59858f1928j17187f089n1062j39116A54412J60461c1428
18037A241a0935F7255O0719b1567k09211P8285O8276a8729m36934a80134F5208
18025a51875C2588a65600D4439b83748f2398q7538j15783E3091K59567C7104a63770
18013C72874c88159J12551H0580L4846i3908r0536A32959b15754A7040J3048J11716
18002A41804m5715a92308A54087b13366C91906e9907p3698A11987g8707B86496
17991i5987B8804e2365j95408B0972L4876d6205G6026a54390A78142a04177c4494
17979a67191G4664b81387e4921j3448A21847b98605a6440A9380K67746j21227
$$ plain form
18061 -133444 54488 49542 526784 -141916 -168 -85389 101055 305471 148384 -293266 -89861
18049 -76671 -63442 31859 -159858 -61928 -179115 -6089 -57151 -196267 154412 314873 -31428
18037 1241 -10935 67255 127974 -21567 -230778 -152493 -84217 -18729 -455663 -180134 65208
18025 -151875 32588 -165600 44439 -283748 -62398 -149936 -265719 53091 312658 37104 -163770
18013 372874 -388159 -275608 80580 115426 -93908 -184444 132959 -215754 17040 30088 141804
18002 141804 96089 -192308 154087 -213366 391906 -59907 -133605 111987 -78707 286496
17991 -95987 28804 -52365 -247773 20972 55848 -46205 76026 -154390 178142 -104177 -34494
17979 -167191 74664 -281387 -54921 -68369 121847 -298605 -16440 19380 287126 165899
17969A65899e8971A20996K64849D6782h4971f59I25J35650L5192J94910b07453
17957b97473d6708C43235A39164b21427O917a02126I1694b40722K2949D7138a37175
17945a68020M5640l9351C0515K5919h2823l36533E3080J51745c62472a9364A83427
17933A9877N6978B6944b3056A45803m2023d4905B8593r74g7427D4825b9169j16367
17921a45536j21528d6534k62370O9009K0432A02796a95189i2315G2442K23933
17911B96375C3328L96866c96728a05517k4588B52885b7317j28847c8120j00354
17901a38474A42793b10967b1932j20350k36361a00710C13465b60473J9380B87959
17890c3670E2405P9093J53722f3987K0662C11527c8563m7629A85225a29579k92530
$$ plain form
17969 165899 -58971 120996 385845 46782 -84971 -659 925 136575 171767 366677 -207453
17957 -297473 -46708 343235 139164 -221427 -214510 -102126 91694 -240722 -217773 47138 -137175
17945 -168020 -122380 -161731 30515 56434 -82823 -419356 53080 204825 -362472 -19364 183427
17933 19877 76855 26944 -23056 145803 103780 -44905 28593 27619 -77427 44825 -29169 -145536
17921 -145536 -267064 -46534 -308904 -239895 -219463 102796 -195189 -92315 72442 296375
17911 296375 33328 430194 -396728 -105517 -130105 252885 -27317 -156164 -38120 -138474
17901 -138474 142793 -210967 -21932 -142282 -378643 -100710 313465 -260473 -241093 287959
17890 -33670 52405 131498 285220 -63987 -43325 311527 -38563 -86192 185225 -129579 -422109
17879d22109C44810h1302A36187l9986J39674i212K569D011K995b11679n454a8170
17866B34685j15718J4954K39748a84456E1497J2873L1761f6835r6032e0269k89566
17855c39835J49288P9147k3153k2647d7046j80192h4246A47351o0798e2035l15764
17844c67799J77412D05110a20303j95392H7858a32077A35967K08946D8089a415
17833c6005n4485A68716a13118b6174f66j33996L5275b968n0354p2534A0384b42873
17820b07876J908R748A72406b7093d814o9325k2126C5058c76246N5484C74944
17808C1399d80796A05262a21438E0104g8433A15688B324J40133D7819K00934K6613
17797B75366a72475c5966E4300J47455e6517J3010h083A19224C9399N1728c8577
$$ plain form
17879 -422109 344810 -81302 136187 96201 235875 -9212 -6643 4011 7006 -211679 -217133 -18170
17866 234685 118967 133921 373669 -184456 51497 64370 96131 -66835 -162867 -50269 -339835
17855 -339835 -190547 -111400 -134553 -157200 -47046 -227238 -84246 147351 86553 -52035 -367799
17844 -367799 -190387 405110 -120303 -315695 87858 -132077 135967 344913 48089 -1415
17833 -36005 -90490 168716 -113118 -26174 -666 -134662 -99387 -2968 -53322 -125856 10384 -242873
17820 -207876 -205968 -196220 172406 -27093 -4814 -74139 -96265 35058 -376246 -320762 374944
17808 31399 -480796 105262 -121438 50104 -78433 115688 2324 142457 47819 248753 275366
17797 275366 -172475 -35966 54300 201755 -56517 -43507 -8083 119224 39399 91127 -38577
17785E9630a07131p7147Q790k27063C37060b8138j01087A11430a7684A48055k4824
17774A23231b63593f7284C1438L00071r2127c0491k17424a18051B26925d62883
17763A40380a64288B07134E1783R5714c4330m901F5726J82500e5928A89681f9029
17751C4550a80386B17127k5628k0927c2218j90615b1891n854l23745I0891J54024
17740B44915F4315d8995m9265b5190l07765c5771q5388B59675a82235A74387P2557
17729B46944C0532a42949A23150a72422j29405J08399h9351c2769B29670a20589
17718A35038B4023b99779C01437c96318J23325R1800h8056A49187F6858r389a16038
17706g8858B1477q995a77060O2109A23171l9216h2715r8067Q8986E3009a43872
$$ plain form
17785 59630 -107131 -184278 -175488 -402551 337060 -28138 -129225 111430 -17684 148055 123231
17774 123231 -263593 -67284 31438 331509 239382 -30491 -247915 -118051 226925 -462883
17763 140380 -164288 207134 51783 147497 -34330 -39231 65726 248226 -55928 189681 -69029
17751 34550 -180386 217127 191499 170572 -32218 -222833 -21891 -27745 -351490 90891 244915
17740 244915 64315 -48995 -98260 -25190 -332955 -35771 -121159 259675 -182235 174387 246944
17729 246944 30532 -142949 123150 -172422 -301827 -193428 -89351 -32769 229670 -120589
17718 135038 24023 -299779 301437 -396318 -272993 -181193 -88056 149187 66858 57469 -116038
17706 -78858 21477 12482 -177060 -114951 123171 83955 -82715 -180782 -91796 53009 -143872
17694C31645D7285a56199D9890d6629p030D16018c12685D06696A07577g454j26425
17683a33879n4604F2849L33582b2744B55414b38152D5490J89015o0556c203k67201
17672b70404J20567A01504k3117L28145a39134B82074d39387A4521Q0368J1686
17662A06575M8402J47527a2448q8503E7585a1272k48227C57878H2374J86080b31568
17650h5117G4898J11491H0517L49818H0259a3135D9035e6709G6237J17946a54945
17638b19981C61370A39003P8338c409j15455d6975C62348E9153M9360K7276O4
17627A35853b3669C0234J24932J39386i0673F6845K85130A2826k002c78681B32899
17615E23178B20620l7913B1290K2440a16991B58079H6107c4214e461E7296L12682
$$ plain form
17694 331645 47285 -156199 49890 -46629 -53659 416018 -312685 406696 107577 -7454 -133879
17683 -133879 -188483 62849 396431 -22744 255414 -238152 45490 234505 173949 -3203 -270404
17672 -270404 -149837 101504 78387 406532 -139134 282074 -439387 14521 94889 106575
17662 106575 154977 302504 -12448 -100951 57585 -11272 -259499 357878 82374 268454 -231568
17650 -85117 74898 186389 80517 430335 80259 -13135 49035 -56709 76237 194183 -154945
17638 -219981 361370 139003 217341 -3409 -118864 -46975 362348 59153 108513 135789 135853
17627 135853 -23669 30234 155166 294552 -90673 66845 351975 12826 10824 -378681 232899
17615 523178 220620 182707 21290 43730 -116991 258079 86107 -34214 -5461 57296 369978
17604C69978c30311C46838c80678A46501N1691J7949j07257l4190d3159q5021
17594a28180e5451l5852C9401J79757n0220a41684g0172c2374r8032j6532A30689
17582f385A43461a35934J4854I7117J5293D3111J30901e541q2700A99174i5305
17570I942a71880e3370I0114H671a7592C50350b4380j95451A01436d4525n0726
17559i5251M2134A73765E3509J10499j0690K28997j27029a48619E094a37354A74656
17547A05026b30678A47777g541A26699M4769a15413E9853b3248j17226A41842
17536B86479B1491J43655l0166L9029n669L3187i8041r76A11857A2645M2527J29318
17524A84490o7044J42129G8863K56074F2713b9805A47879E1565a11327A15005
$$ plain form
17604 369978 -330311 346838 -380678 146501 198192 216141 108884 74694 -43159 -128180
17594 -128180 -55451 -91303 39401 219158 168938 -141684 -70172 -32374 -130406 -146938 130689
17582 -6385 143461 -135934 -121080 97117 112410 43111 174012 -5541 -88241 199174 -95305
17570 9942 -171880 -53370 90114 8671 -17592 350350 -24380 -219831 101436 -44525 -95251
17559 -95251 -53117 173765 53509 164008 153318 382315 255286 -148619 5094 -137354 174656
17547 105026 -230678 147777 -7541 126699 171468 -115413 59853 -23248 -140474 141842
17536 286479 21491 165146 134980 174009 168340 201527 -98041 -99017 111857 12645 55172 184490
17524 184490 117446 259575 78863 334937 62713 -29805 147879 51565 -111327 115005
17513b2345p2505k31018b4681G525b73248F2057K63518a89010b3678A68221b71079
17501B01433o5698D2027J35583l8707l9668R956C0837K02543j03932b44896E3872
17489B65609n686A9755K83867g007G5399N483J09152H4455K25218F6036k6826
17478C9210a94652C29690a08030d7315A54791K20655B8K02022q1064Q3351g6060
17466D12913D5704l817L1754M68596g0381A5695R4581e8540B06666j4969b08904
17454A92479E4343J88439j15769m5594J05385H62L17014j48521g1846D67038j71515
17443B95523R5361l6699H6525K99972M6090j87195m7822J81145j77567N90K56353
17432D58091Q6870a9717F0091K10527L215L3962f6066D00720A13120E4961P1355
$$ plain form
17513 -22345 -94850 -325868 -24681 7525 -273248 62057 325575 -189010 -23678 168221 -271079
17501 201433 135735 42027 177610 138903 99235 109191 30837 233380 129448 -244896 53872
17489 265609 259923 19755 303622 -7007 75399 80882 190034 84455 309673 66036 39210
17478 39210 -194652 329690 -108030 -47315 154791 375446 28 202050 120986 204337 -76060
17466 412913 45704 41887 73641 542237 -70381 15695 110276 -58540 206666 191697 -208904
17454 192479 54343 242782 127013 81419 186804 862 317876 169355 -71846 467038 295523
17443 295523 390884 354185 86525 386497 432587 245392 197570 378715 201148 201738 458091
17432 458091 544961 -19717 60091 270618 273833 307795 -66066 400720 113120 54961 126316
17421A26316J17248L00568B61272J10426d850A80287J67952r4731j14651M41119
17411E79976B51640a28797B09180R1701f6571B33181b2608l6128B55060j15002
17401A40058P8269E0808J26205b9469G7437J20428J07024E2069J54025P1473h4969
17389a71333D33990F84c0078C46934j25617n8366C9612O7513a06838a1309G4452
17377B12200h8270j13666c0998C67448j17230C9136L53117c29903E4557J92633
17367B47190q4499J70013G2940b00625C16650d2946k5391j2539B55976K33607
17357D89583A72478n2505m2235p026a47040H2665l1252J14996h0D5755K30972
17346B76727k7794P5115q2179o9574K09847A27269O5623R7860M3374a14440K1446
$$ plain form
17421 126316 243564 544132 261272 371698 -4850 180287 348239 253508 138857 579976
17411 579976 251640 -128797 209180 300881 -66571 233181 -22608 -58736 255060 140058
17401 140058 218327 50808 177013 -29469 77437 197865 304889 52069 206094 277567 -84969
17389 -171333 433990 684 -30078 346934 221317 162951 39612 107125 -106838 -11309 74452
17377 212200 -88270 -201936 -30998 367448 250218 39136 392253 -329903 54557 247190
17367 247190 162691 332704 72940 -200625 316650 -42946 -68337 -80876 255976 489583
17357 489583 172478 119973 77738 70712 -147040 82665 51413 166409 -80 45755 276727
17346 276727 248933 324048 241869 172295 382142 127269 192892 290752 334126 -114440 -92994
17335i2994P650B56621A04485C3479b5714E0403b43486A06216K32105j38539L167
17324B02949m4838m143J47263d8167r889G8972l2977j3856N3749g243B23637L5370
17312B59007c4359j02265B1076b27882A1161K32165r9488K1690b888A80270e9207
17300A39092J07013n2623K36351a74413B22175H8352L86748k37115F9833K45097
17290C14930E9222b65218B8624Q0472a49210B32515J22549h2410q473L4680m0500
17279i6703A91972D8689K10905j20055L09807b1176D6144K53613J01500d1021
17268b5545B27476i278D07837j96170C1850n333K79872D9396J51588J0925M6596
17257B58505J85302j80169J42129d3003B21055K2467a5921B95776K66285a33888
$$ plain form
17335 -92994 -85344 256621 104485 33479 -25714 50403 -243486 106216 338321 199782 202949
17324 202949 158111 153968 301231 -48167 -58056 78972 45995 32139 85888 -7243 223637 259007
17312 259007 -34359 -136624 21076 -227882 11161 243326 143838 165528 -2888 180270 -59207
17300 139092 246105 193482 429833 -174413 222175 88352 475100 237985 69833 314930
17290 314930 59222 -265218 28624 109096 -149210 232515 355064 -82410 -90883 -56203 -96703
17279 -96703 191972 48689 259594 139539 449346 -21176 46144 299757 401257 -41021
17268 -25545 227476 -9278 407837 211667 31850 26517 306389 49396 200984 211909 258505
17257 258505 443807 263638 405767 -43003 221055 243522 -15921 295776 562061 -133888
17246D03185A99957k5862J25453n7493I3513K28437k4389j13117B4186i8589A2006
17234B9990J05973c8582A49195e1413I5773L60649A78287C7531J88042J3877n6460
17223A82990j8708j4799n2895J47043m6485J64764k0397j39287j6459J45184n2945
17212B78006o5273a32478B42814r0717K35179A0708L02937E9361M0750L30201
17202D30312n1603A63902a02231B94251p0370p5101P9275N466A5697K92631J16145
17191D24473h624B40354H4618K8558J53297j22545J34585D2258J94894J8294n4576
17180B00870l1159m4911J21719A07264J55325R6563J950p6701O4489D2717J79195
17169B21912G2070L06420l822Q7078g5545A56607J83673A44976M04736j93548
$$ plain form
17246 403185 199957 174095 299548 242055 93513 321950 297561 184444 24186 -98589 12006
17234 29990 135963 -38582 149195 -51413 95773 456422 178287 37531 225573 239450 182990
17223 182990 164282 149483 96588 243631 197146 361910 341513 202226 185767 330951 278006
17212 278006 212733 -132478 242814 152097 387276 10708 313645 59361 100111 430312
17202 430312 378709 163902 -102231 294251 223881 148780 228055 233521 15697 308328 424473
17191 424473 -8624 240354 84618 113176 266473 143928 278513 42258 237152 255446 200870
17180 200870 169711 124800 246519 107264 262589 359152 361102 284401 348890 42717 221912
17169 221912 72070 378490 374668 461746 -75545 156607 340280 144976 549712 356164
17159C56164n1133A18368K4964J7698P0589F9407L07620L7986r8122j39410J09319
17148B86800Q3340h5866C30323q8841o7913M08381e8892B55295C1580L08136M7517
17137C87233m4535q3902L01071j62492j8243A5715L11136K10211k10350J60571
17127D87283G1116N29170B73075A35739K13262o4561J3962R6359R9477B30583
17116B79579k6102l9193O03575C85526A17694K76709M969K02594B45804K4147
17106B69951L457A21933K51270N5433j36875I3531N43467j91008B07169p4830
17096A32339L38811A02277J75261N91299B06621K36240J96716G0473M61661O1840
17086E93974j60503Q4158L4038J59368k78070J17479H4287K39074R5299G3611
$$ plain form
17159 356164 305031 118368 143332 161030 231619 69407 377027 415013 316891 177481 286800
17148 286800 370140 -85866 330323 241482 173569 581950 -58892 255295 31580 339716 387233
17137 387233 342698 258796 559867 397375 379132 15715 326851 537062 326712 487283
17127 487283 71116 600286 273075 135739 349001 284440 298402 394761 494238 230583
17116 279579 253477 214284 817859 385526 117694 394403 399372 601966 245804 269951
17106 269951 273408 121933 373203 428636 291761 93531 636998 445990 207169 132339
17096 132339 471150 102277 277538 868837 206621 442861 639577 70473 532134 593974
17086 593974 433471 517629 551667 711035 432965 550444 84287 323361 418660 73611
17075A75798M36300B92172L23665J52611A66351L11382K8138k34201K73155K04206
17065G49031k74108J87562q2633B23733J31706n2996K39746A82619O99253C01813
17054B64180J42813G6152N21548q566k73502a38399D38222J26192L3691M25N1204
17043F49734k36399L85514k97030M5650q2098K21773o8499j05492r8717K3569
17033D38005R9086B06837L33626n6412K19402J10154k09944m9242j00924j19726
17023C33771M16535j92328J89008j17641M5516C17115J62808L52725k19181B56661
17012F10442B66494K88524L38253m22927P9235Q9490N226J58704M9244K0699q6747
17001G86195j28308J06154J77720m49772K56986l13093M73655l81303K89052j87284
$$ plain form
17075 175798 612098 292172 615837 768448 166351 477733 505871 271670 544825 749031
17065 749031 474923 662485 579852 223733 355439 302443 542189 182619 881872 301813
17054 264180 406993 76152 597700 589134 315632 -138399 438222 564414 598105 598530 649734
17043 649734 413335 798849 501819 547469 465371 687144 618645 513153 414436 438005
17033 438005 537091 206837 540463 484051 703453 813607 603663 554421 453497 333771
17023 333771 750306 557978 746986 629345 674861 317115 479923 832648 613467 256661
17012 610442 266494 555018 893271 470344 549579 639069 644295 802999 852243 872942 786195
17001 786195 657887 764041 941761 491989 748975 435882 909537 528234 817286 630002
16991F30002K44116j64758J70808j75870j49866J75057m6417L3321r7820K44186
16981H62759p6631m6922p0672K03215l74056M65718j95249N7684q1622j03785
16971F40439L0163K34877p3035M2761R3277j80741q7963K76338k19558l0007K03785
16960I30336N3189k9082l25778K59701N4982M1573K50522j23589M1657j93588
16950I59923K47212l55622K05044J35693R4865j78435J56323R7277L2631k51139
16940A143772m565J03496k72972L09702q3233p9717m8253M99579j90378k13616
16930A163815j73858R4619M39002j82210k95816N46343k1655l33290r063J77465
16920A405352M0728j98839K43562l02988K49692J69652r9283j19372M9570K60727
$$ plain form
16991 630002 874118 709360 880168 704298 554432 729489 683072 716393 618573 862759
16981 862759 786128 739206 668534 871749 497693 963411 768162 825846 744224 640439
16971 640439 670602 905479 832444 875205 968482 787741 699778 976116 756558 726551 930336
16960 930336 983525 954443 628665 888366 943348 984921 1235443 1111854 1153511 959923
16950 959923 1207135 851513 1056557 1192250 1287115 1108680 1265003 1362280 1394911 1143772
16940 1143772 1139207 1242703 969731 1279433 1196200 1116483 1068230 1567809 1377431 1163815
16930 1163815 989957 1084576 1523578 1341368 1045552 1591895 1570240 1236950 1227887 1405352
16920 1405352 1446080 1247241 1490803 1187815 1437507 1607159 1507876 1388504 1438074 1698801
16910A698801l55397K69087O7950J43176J0492j49558j41143k18586M27714K02456
16900A954992k74412O0821k06379N05680P5025j92582k30439J83583k22603L79043
16890B032729J13428l84256J04939J66244j85991L09049q4506K07440J0775J33757
16880B423608k30367j37199m5002J18461M46530l2126P5328K1946m3295p9860
16870B518024J92204j79578P3765J26632N1239l80670J85362K78671J51151j9458
16860B997342m6225k81357L10598q8358Q8137M7828M09725j52870J33262P8787
16850C496869j26701k24664K92482M3907J31017J3700R7818M3005J15223k28501
16840C654155K51316m5337J20731J69973J67703l5053J54905p7263L00385j46399
$$ plain form
16910 1698801 1343404 1612491 1680441 1823617 1834109 1684551 1543408 1324822 1752536 1954992
16900 1954992 1680580 1741401 1535022 2040702 2115727 1923145 1692706 1876289 1653686 2032729
16890 2032729 2146157 1761901 1866840 2033084 1847093 2156142 2071636 2279076 2289851 2423608
16880 2423608 2193241 2056042 2011040 2129501 2576031 2543905 2619233 2641179 2597884 2518024
16870 2518024 2710228 2530650 2604415 2731047 2782286 2401616 2586978 2865649 3016800 2997342
16860 2997342 2951117 2669760 2980358 2892000 2980137 3027965 3437690 3284820 3418082 3496869
16850 3496869 3370168 3145504 3437986 3481893 3612910 3626610 3724428 3767433 3882656 3654155
16840 3654155 3905471 3860134 3980865 4150838 4318541 4283488 4438393 4361130 4661515 4515116
16830D515116j62816P68580j80252Q8158j75651q8959k1749K10105K94300L20449
16820E567281o02815O84328K52150k90776J31058K51011J31708L85662k36210
16811F273397j7502L92127J3852J16457J75338M47053o5306N69598l1358j45906
16801G727750K94523N84062K08625l21576L54594L44180J49051J69258M53362
16792I963829L27904K25958K36356L96931k64746O48375J68248N60491K31360
16783A2494706K16958Q13531J77520L63395N98904L07573M02942O70463L14115
16774A6360107J042041M08429N80792P08117R5215J068863N57106Q39878Q16187
16765B2476735N98678J399875Q27914R60000Q76201J257891Q39309J094996J853383
$$ plain form
16830 4515116 4352300 5120880 4940628 5028786 4853135 4764176 4742427 4952532 5246832 5567281
16820 5567281 4964466 5648794 5900944 5610168 5741226 5992237 6123945 6509607 6273397
16811 6273397 6255895 6648022 6661874 6778331 6953669 7400722 7335416 7905014 7873656 7727750
16801 7727750 8022273 8606335 8814960 8493384 8847978 9192158 9341209 9510467 9963829
16792 9963829 10291733 10517691 10754047 11150978 10886232 11534607 11702855 12263346 12494706
16783 12494706 12711664 13525195 13702715 14066110 14665014 14972587 15375529 16045992 16360107
16774 16360107 17402148 17810577 18391369 19099486 19194701 20263564 20820670 21660548 22476735
16765 22476735 23075413 24475288 25303202 26263202 27139403 28397294 29236603 30331599 32184982
16756C2184982Q06429J551332J770671J469168J739213J843249J958855J785510
16748D5109409K552357K270802K634578K600894K766521K886744L595508K939071
16740F7355884L742871M111264M093007M395447M559888N069395N085860M932066
16732A03345682N458764N526531O101829N612813O215131O223483N675564N759377
16724A49919174N438734N137531L980077L783930L283746J951090J107067J87858
16716A74789207k96606k101332k457799l427021m085526m328699n896852n347590
16708A46847782n918327n711015o371592n762569o089882n997855n391984n467070
16700A00137488n479596n059476m653095m687978m251782l741077l877635l690740
$$ plain form
16756 32184982 32991411 34542743 36313414 37782582 39521795 41365044 43323899 45109409
16748 45109409 47661766 49932568 52567146 55168040 57934561 60821305 64416813 67355884
16740 67355884 71098755 75210019 79303026 83698473 88258361 93327756 98413616 103345682
16732 103345682 108804446 114330977 120432806 126045619 132260750 138484233 144159797 149919174
16724 149919174 155357908 160495439 164475516 168259446 171543192 173494282 174601349 174789207
16716 174789207 174492601 172391269 169933470 166506449 162420923 158092224 152195372 146847782
16708 146847782 140929455 135218440 128846848 123084279 116994397 110996542 105604558 100137488
16700 100137488 94657892 89598416 84945321 80257343 76005561 72264484 68386849 64696109
16692F4696109k964316l106334l017926k960715k053777k716992k107064k428541
16684D3340444j392124k114150j766560j669355j479023j487745j684971r36996
16676C0809520j587598j143953j080348q25480j312345l80936j078544j157719
16668B2242597n62349n53791p85308o76234o94719q88163k68100p13332o75019
16659A6425582j84635o89559o88539l55439m63314k16427j44735n04934o04603
16650A2573397l05343j78342n55405J2305m79164n83785O6873k59173l90583j55016
16640I745764m42911k04574k7890j93389k47962j37822j01568k73221m51457m4000
16630G620970r4453M612k31554j02523n21898J23427J24289o23671p5660k01084
$$ plain form
16692 64696109 61731793 58625459 55607533 52646818 50593041 47876049 45768985 43340444
16684 43340444 41948320 39834170 38067610 36398255 34919232 33431487 31746516 30809520
16676 30809520 29221922 28077969 26997621 26172141 24859796 24478860 23400316 22242597
16668 22242597 21680248 21126457 20341149 19664915 18970196 18082033 17813933 17100601 16425582
16659 16425582 16240947 15551388 14862849 14507410 14044096 13827669 13682934 13178000 12573397
16650 12573397 12268054 12089712 11534307 11546612 11067448 10483663 10550536 10291363 9900780 9745764
16640 9745764 9302853 9098279 9070389 8877000 8629038 8491216 8389648 8116427 7664970 7620970
16630 7620970 7526517 7531129 7299575 7197052 6675154 6798581 6922870 6299199 6223539 6022455
16620F022455K32455M6060m15687j19270J34092n24490K78429l81484J44118m66990
16610D949688J13181m54110K95322k51673k60606n3166J82220K36718m44149o3588
16600D249837k49606j1816R2656K3797n4127j57284j61381l26086K81370r8858
16590C588502Q4350k82500J91148m07419L50977n5207j72392k22345q0246k00651
16580B794217N89216m26435J90327l61398M4732P2682l00562J39089k97548K11255
16570B655575p5694K6511j12312j78017J37536j20927j46303K05678N0816j92523
16560B250340L97148n21087J68511K0527o0226l84756L98473l04936J45774j36547
16550A973221K76658k71381q3252r3175N9411Q2748J51713l95622k02875L01198
$$ plain form
16620 6022455 6254910 6300970 5885283 5766013 5900105 5375615 5654044 5272560 5416678 4949688
16610 4949688 5062869 4608759 4904081 4652408 4391802 4338636 4520856 4757574 4313425 4249837
16600 4249837 4000231 3988415 4081071 4104868 4050741 3893457 3732076 3405990 3687360 3588502
16590 3588502 3672852 3390352 3581500 3174081 3525058 3469851 3297459 3075114 2994868 2794217
16580 2794217 3383433 2956998 3147325 2785927 2830659 2903341 2602779 2741868 2444320 2655575
16570 2655575 2579881 2606392 2494080 2316063 2453599 2332672 2186369 2392047 2442863 2250340
16560 2250340 2647488 2126401 2294912 2315439 2255213 1870457 2268930 1963994 2109768 1973221
16550 1973221 2249879 1978498 1895246 1802071 1861482 1944230 2095943 1700321 1497446 1798644
16540A798644k00248J22417r5663K93075m31194K38016J93614n5465o9753o5061
16530A728382Q015k36149O5882M32699n06889O751O9582j04654Q4320j14972j07495
16519A325472L34784J5298j17706l652j65641K73927m70619L28140n6135n00338
16509I63530L09387o002K8041r8625J64600K1842Q7542j18988J02393l09490n3148
16498A091082L86761l64556J56388j49655K6089J25872r1423j2204K99642m96520
16488I71476L91513j66062m2456j35518O7027K40737l81306j05754J92568L14739
16478A346964k64356J49942k40821J21473p411k37103J30428k49731P1293J44269
16468I64947J61315l72625J32780j21470M8265j7826L08702k26299j42950J88064
$$ plain form
16540 1798644 1598396 1720813 1625150 1918225 1487031 1725047 1918661 1863196 1793443 1728382
16530 1728382 1736397 1500248 1566130 1998829 1491940 1498691 1568273 1463619 1547939 1432967 1325472
16519 1325472 1660256 1675554 1557848 1554196 1388555 1662482 1191863 1520003 1463868 963530
16509 963530 1272917 1266915 1294956 1196331 1360931 1382773 1470315 1351327 1453720 1144230 1091082
16498 1091082 1477843 1113287 1269675 1120020 1146109 1271981 1180558 1168354 1467996 971476
16488 971476 1362989 1196927 1154471 1018953 1085980 1326717 945411 839657 1032225 1346964
16478 1346964 1082608 1232550 991729 1113202 1105791 868688 999116 749385 820678 964947
16468 964947 1126262 753637 886417 764947 813212 795386 1104088 877789 734839 922903
16458I22903N9620j87761K7624P3432K88782l29328K01820K13751j89150m94979
16448E86714K18479L06152l48528J74795r4136M4510J50553k96827p6247M28842
16438A094307m12017L32809l56434J45002K65419m32533K24908k22414o6217R6039
16428F68869J22703Q9850J45875k22725K05487D93777L53374M14293n97676k96794
16418C66974K62958M2267O4487M2551M1255l61113J47878l8547K13076r0355j38262
16407E53169J5985n7444J5903p8272K05568j57242N7151O8259j99077J09711R0943
16396F24654l4592N4427q0435j43433K54551K4616M0456M079k27115K64082r2937
16385F88353j15405k16860J91986R4507k32525L17634l06087J54374j46297B0887
$$ plain form
16458 922903 982523 794762 822386 895818 1184600 855272 1057092 1270843 1081693 586714
16448 586714 805193 1111345 762817 937612 843476 887986 1038539 741712 665465 1094307
16438 1094307 682290 1015099 658665 803667 1069086 636553 861461 639047 572830 668869
16428 668869 791572 881422 1027297 804572 1010059 493777 847151 1261444 663768 366974
16418 366974 629932 672199 736686 779237 820492 459379 607257 568710 781786 691431 553169
16407 553169 569154 511710 527613 449341 654909 497667 554818 623077 424000 533711 624654
16396 624654 590062 644489 564054 420621 675172 699788 740244 744323 517208 781290 688353
16385 688353 572948 356088 548074 642581 410056 727690 421603 575977 429680 20887
16374C49549J13702J31156k34052L8234A82383L49074J63384l22769J78081j83108
16364C67045L00366p8853k84602Q0597P8636K1625J64155N0613k16907J17381
16354F00056k51606J85927J7479k56246K76525J87459k24961q075j94344q627
16344C23587J51987J62430B74822R7187j32819J52732O3093l4180J23671B57039
16333E96077j12221K4143P4230B21703P12446l63810k55640l0051P1677K26402
16323E82727j7420j12181j53830R0677O6228p2194j57017R7677K0526K35289j2078
16312E68404B56722J79547J47017j51490j00327O3720j56053J02441J00218B08484
16301C49490r7291L33086k70247m375l025j34578m8974J09832L08168j32091A52761
$$ plain form
16374 349549 463251 594407 360355 398589 182383 531457 694841 372072 550153 367045
16364 367045 667411 588558 303956 384553 463189 484814 648969 699582 482675 600056
16354 600056 348450 534377 551856 295610 572135 759594 534633 526558 332214 323587
16344 323587 475574 638004 274822 372009 239190 391922 455015 420835 544506 257039
16333 596077 483856 507999 582229 221703 934149 570339 314699 284648 356325 582727
16323 582727 565307 453126 299296 389973 456201 384007 226990 324667 345193 580482 568404
16312 568404 256722 436269 583286 431796 331469 395189 239136 341577 441795 208484
16301 349490 252199 585285 315038 310663 307638 173060 124086 233918 542086 409995 152761
16289C68795J68827B2165K27584J25572j55014K10059l8724J37387B20672o3262
16279A57410Q7820P9538L36884G1360K77007M98548C84080j28235K7220J77329
16269D60394J06134J97048I6763O7036J5898o0188J83863l7004J94390P6104j19786
16258D17076j27977A43072K23373E8522N8221L93654a5936A24196K82935r8131
16248C09000J12333j99524K09364A99192J64869M2359j63347p1817J32505D2173
16237B82740q4232J07152G9403j4717M77840A46864L62973a35690E87253B44822
16226B01222I0731A7790L61554n1927K82415B15628L5831o2980O2638r9739K77625
16215D29003l1861A67539m4217K56178E7096k0843h8336A52875J61796A33146
$$ plain form
16289 368795 537622 22165 249749 375321 220307 430366 391642 529029 220672 157410
16279 157410 245230 324768 661652 71360 348367 846915 384080 255845 283065 460394
16269 460394 566528 763576 96763 163799 179697 119509 303372 266368 460758 536862 417076
16258 417076 289099 143072 366445 58522 116743 510397 -15936 124196 407131 309000
16248 309000 421333 221809 431173 199192 364061 406420 243073 171256 303761 42173
16237 282740 198508 305660 79403 64686 542526 146864 509837 -135690 587253 244822
16226 201222 90731 17790 379344 327417 609832 215628 251459 188479 251117 151378 429003
16215 429003 397142 167539 123322 379500 57096 36253 -88336 152875 314671 133146
16204B89013G9958M00131B25565l3808J0306a37155A83467J2007J28847q3621
16194B40700I0633j002P1845J63623a16140D71091f8026F8037J06412G4631O19350
16183F93981B21528I5413J35629l3137J2595G5711J89794O1609j50062K83054
16173D60106j87334P6977a28388B54512E0561L23670m8135M3100A51805i2836
16162e1630p2993O1143C2733b86703A67450J03107q586a06300B36738A14807K31362
16151C46169A10926b13725B67026K32472B32157p033a61170O2887A71300a5639
16140F7399J56507l5682q9719J06842J7097J25683b5911A5765L2024K31937a80720
16128d76646A69736a51880b1406j91911B34840A8953K39416A20523d2216G4788
$$ plain form
16204 289013 79958 480089 225565 191757 202063 -137155 183467 195474 324321 240700
16194 240700 90633 89631 161476 325099 -116140 471091 -68026 68037 174449 74631 693981
16183 693981 221528 95413 231042 197905 210500 75711 265505 327114 177052 460106
16173 460106 272772 349749 -128388 254512 50561 374231 326096 369196 151805 -92836
16162 -51630 -124623 -63480 32733 -286703 167450 270557 261971 -106300 236738 114807 346169
16151 346169 110926 -213725 267026 499498 232157 225124 -161170 -98283 171300 -15639
16140 67399 223906 188224 98505 205347 222444 348127 -25911 15765 47789 279726 -180720
16128 -476646 169736 -151880 -21406 -213317 234840 18953 258369 120523 -42216 74788
16117B8241J9385N122a5642A46462K1333j0107d7187j82772A82422M8093I7262
16105a1790b016C97123D7303J96373c8676F8229f3189a0482E32778a97416B54876
16093B4167K19969A03157b0485G3195K63013j48141l521b3591A66884O1937a03975
16081C50577e3365B97157E8613c49159i3129L2369l3782B15258C5146L75304j69469
16070B40981p4753d34328A45969J23622F1467c4655j36403A01793P3938C7213
16059A79871D479a06293I9006J28186Q139b12274E0095J78960m9244f0260I0220
16047C59210B0075h6963G8150a10298k7731O4392A10150K54022R761j75443K2249
16036B20739D8298b40283f475A66202n9763L8209n7628b68629G6623h6357C42161
$$ plain form
16117 28241 47626 52748 -15642 146462 167795 157688 -47187 -229959 182422 230515 97262
16105 -11790 -2016 397123 47303 243676 -38676 68229 -63189 -10482 532778 -197416 254876
16093 24167 244136 103157 -20485 73195 336208 188067 184546 -23591 166884 228821 -103975
16081 350577 -53365 297157 58613 -349159 -93129 -60760 -94542 215258 35146 410450 240981
16070 240981 166228 -434328 145969 269591 61467 -34655 -171058 101793 175731 37213
16059 179871 4479 -106293 99006 227192 235331 -212274 50095 229055 179811 -60260 90220
16047 359210 20075 -86963 78150 -110298 -138029 -73637 110150 364172 373933 198490 220739
16036 220739 48298 -240283 -6475 166202 106439 144648 87020 -268629 76623 -86357 342161
16024A40972a27779D1802b29456d1310b969j1286j53385F3493J53871E9879b16891
16012a7399m0010C10563b36743A04880e0316F7744c1331B54025R316a05207A65707
16000h2993j5383B50998A13353b9557p0384A43604a27233K0924C5348h7117I2036
15988A64609a15979B53441d7706E5770K9733J04953O5817a6577E12077j52587
15978C59490A02019J8066a06261A60968b16060A43778a60174g717A99627l5923
15968A63704Q5332D4157a6429B41099a22661B65075a11538j6504D43485A84631
15957F0286N2855K82603h3604r2438j59194A12280d51086a0006B12999J40770
15947C53769b57792B69416N0387j49202h8898B32402a05021c5834o8441k22252
$$ plain form
16024 140972 -127779 41802 -229456 -41310 -2969 -14255 -167640 63493 217364 59879 -216891
16012 -17399 -57409 310563 -236743 104880 -50316 67744 -31331 254025 263341 -105207 165707
16000 -82993 -98376 250998 113353 -29557 -99941 143604 -127233 -106309 35348 -87117 92036
15988 164609 -115979 253441 -47706 55770 85503 190456 256273 -16577 512077 359490
15978 359490 102019 120085 -106261 160968 -216060 143778 -160174 -7717 199627 163704
15968 163704 249036 44157 -16429 241099 -122661 265075 -111538 -128042 443485 184631
15957 60286 113141 395744 -83604 -176042 -335236 112280 -451086 -10006 212999 353769
15947 353769 -257792 269416 319803 170601 -88898 232402 -105021 -35834 -104275 -326527
15937c26527d1995k37286a29915C4644L01619g1512F8161a40727N6707l05490
15927c89510G724a59546B8654K24891C8468e7715d108A12276a80226d5727k26275
15916b72002e2377B48599g1976B64321a30538b4259j52384L4232p0619G2201A2339
15904C7936O8252H252O2091a9278A93428C0921Q4930a20313e7441G7280k1696
15893E5584f9398m0742l6060n8272A94564A2726n109a85806j82333a52022A44148
15881b24191A82820C0793l2c48912f1439o9432b1085m73654K16545A96409J30905
15870C27314a62831j55994g6881B72469I3523m5341Q4462R5579a14992k03519
15860c18511b8441n8708k9469d8120O323l01044D7592a74959L2409j44337C63317
$$ plain form
15937 -326527 -41995 -279281 -129915 34644 336263 -71512 68161 -140727 -84020 -389510
15927 -389510 7724 -159546 28654 253545 38468 -57715 -4108 112276 -180226 -45727 -272002
15916 -272002 -52377 248599 -71976 264321 -130538 -24259 -176643 -142411 -213030 72201 12339
15904 37936 106188 8252 70343 -19278 193428 30921 115851 -120313 -57441 77280 55584
15893 55584 -69398 -110140 -146200 -204472 194564 12726 7617 -185806 -368139 -152022 144148
15881 -224191 182820 30793 30761 -348912 -61439 -130871 -21085 -494739 -278194 196409 327314
15870 327314 -162831 -318825 -76881 272469 93523 48182 132644 228223 -114992 -318511
15860 -318511 -28441 -87149 -116618 -48120 -41797 -342841 47592 -174959 -142550 -286887 363317
15848a90263i4497k9741B44686A688f7865k67806B62639B9082a94244H6386J11671
15837A98057D7495N2832a4007j19380j30914a08862b9507A01620m1366a09276
15826c0075o3825M4875B14350a76430k00199c0374A04279e22849A60219k9120
15816A31099c45504A6278a98334C74883c02791J5542A11351c78217H7972a75709
15805d3397B0781a63845F7529a49118C0978i8336m3884r6397k6714d9961J743
15794d8218j32517p6689B6377a56679A44710a3813A59649e4901J9866k2951B43211
15782b87930b7774A55629a19417k03914B94773c03465R65D3649J91103H4120g4868
15770H5647c9261l6426A35545b94692e7386j25891K3177j29548C8955L5158L45
$$ plain form
15848 -190263 -94497 -124238 244686 1688 -67865 -335671 262639 29082 -194244 86386 198057
15837 198057 47495 100327 -14007 -133387 -264301 -108862 -29507 101620 60254 -109276
15826 -30075 -93900 -49025 214350 -176430 -376629 -30374 104279 -522849 160219 131099
15816 131099 -345504 16278 -198334 374883 -302791 -287249 111351 -378217 87972 -175709
15805 -43397 20781 -163845 67529 -149118 30978 -98336 -142220 -238617 -265331 -49961 -48218
15794 -48218 -180735 -257424 26377 -156679 144710 -13813 159649 -54901 -35035 -57986 243211
15782 -287930 -27774 155629 -119417 -323331 294773 -303465 -302500 43649 234752 84120 -74868
15770 85647 -39261 -75687 135545 -294692 -57386 -183277 -160100 -289648 38955 74113 74458
15759G4458L50396j03208F6402K34526H6790a32202B8096f6897B32711h6421B23425
15747d714F3513J66214f9748a2777j58293f4433l095j14893B72946A25484C461
15735a24555J4038e0407r2061e428B53704b11075A12440i0054E7825d1288B28322
15723a13127L3154a1487k36151B8165a47373e4979B14765c08013F0298b81753
15712E4553i6695l02367D0455a5514N871p6796j87046E7235a04375k77418e0253
15700a27383n2722Q6212C34534A21817a15064G8323a6506m09746A89964a87461
15689h9568A25443B9059d15340a41870K3624A19109E0009L8931b10488D56870
15678F0000a30831j2670j48617J02108K1872K211A05916J40472E7536a0188k3873
$$ plain form
15759 74458 424854 321646 66402 300928 86790 -132202 28096 -66897 232711 -86421 223425
15747 -4714 63513 229727 -69748 -12777 -171070 -64433 -67528 -182421 272946 125484 3461
15735 -124555 -110517 -50407 -142468 -5428 253704 -211075 112440 -90054 57825 -41288 228322
15723 -113127 -79973 -11487 -247638 28165 -147373 -54979 214765 -308013 60298 -281753
15712 54553 -96695 -399062 40455 -15514 -9643 -86439 -273485 57235 -104375 -381793 -50253
15700 -127383 -180105 -93893 334534 121817 -115064 78323 -16506 -426252 189964 -187461
15689 -89568 125443 29059 -415340 -141870 -118246 119109 50009 88940 -210488 456870
15678 60000 -130831 -143501 -292118 -190010 -168138 -165927 105916 246388 57536 -10188 -34061
15667c4061n1914C1294a64031M9650M9182p7797A35047k2012a6131l6040k17172
15656b69343O6028B0796c96038B21811a91579P2620A35926F909b6685C18993a19095
15644a60445A43636J88558a2743B36613K0115b65799D2385F619a32767j7888B67934
15632B00016K89829b86492A12720c9131m21094A27763b9546k55594m3693C5408
15621b79623F7544b46813J11056j21471F2488R6571g5912R270l9025A72916b32379
15609A79500E6177a50713q2283O2221c9777j00840j52866B05713c3799C3894a20939
15597a93413C50718C2106b32488R4440A59999d4556o4524p8266e9643j09643g7856
15585C7028i7429B22033n9614P4196H182c09813i5497l703C1877b47806A46566
$$ plain form
15667 -34061 -85975 31294 -164031 -114381 -65199 -142996 135047 113035 -16131 -52171 -269343
15656 -269343 -203315 20796 -396038 221811 -191579 -118959 135926 6909 -26685 318993 -119095
15644 -160445 143636 332194 -12743 236613 256728 -265799 42385 6619 -132767 -150655 267934
15632 200016 489845 -286492 112720 -39131 -460225 127763 -29546 -285140 -328833 35408
15621 -279623 67544 -246813 -135757 -257228 62488 159059 -75912 -66642 -105667 172916 -232379
15609 179500 56177 -150713 -232996 -170775 -39777 -140617 -293483 205713 -33799 33894 -120939
15597 -193413 350718 32106 -232488 -138048 159999 -44556 -109080 -187346 -59643 -169286 -77856
15585 37028 -97429 222033 162419 236615 8182 -309813 -95497 -99200 31877 -247806 146566
15573h5030j11910N4486b8529P640n4467C3659a11666H3001d25149J78095B25334
15561c79485d0734r2450B6227J99108c5160E7625i9507j18688B0328a39903B7328
15549i4525B9586o484a26447L4304r0033g9398j61407J1828g0344J8216A46192
15537B09460A859J65589M5211a23000K3351B57703G8486L4566a57166D2279a62767
15525A7730M41206E242i7867m5666j92431E0461d40929B11707n6817A4430R5430
15514A09860c9615j02477C4650L635g5175c4015C82000b6989l0601l6296A11250
15502F9667c22279P0568A34528c3905j44830h5382i043l15424G6479Q087b07783
15490e2371A4003N3345R437J75323E8926J08695B5074b10124P1572n3218f1308
$$ plain form
15573 -85030 -196940 -142454 -28529 -20889 -75356 33659 -111666 83001 -425149 -247054 225334
15561 -379485 -40734 -133184 26227 225335 -35160 57625 -99507 -218195 20328 -139903 27328
15549 -94525 29586 23102 -126447 -92143 -182176 -79398 -240805 -228977 -70344 -52128 146192
15537 209460 1859 167448 212659 -123000 -99649 257703 78486 113052 -157166 42279 -162767
15525 17730 458936 5242 -97867 -143533 -335964 50461 -440929 211707 154890 14430 109860
15514 109860 -39615 -142092 34650 38285 -75175 -34015 382000 -26989 -57590 -93886 111250
15502 69667 -322279 -251711 134528 -33905 -178735 -85382 -9043 -324467 76479 84566 -207783
15490 -52371 14003 67348 76785 252108 58926 167621 25074 -210124 -138552 -191770 -61308
15478b89015p4584J23435o896a07426c5097C94246A9105J37565a1509k94393m3038
15467c48940J06506A40388P2274C865J95850C4749J03592a03898c8370J0741A34266
15455G6517M2829J14940a47316B7476N0318g3577p9402F5547i4014A52537A5641
15443E6544J36334b99771a14054n4539b0536m9250k14170a38764C387a68139I9341
15431A78094b7586r2032A71722a84714O9246A67552g9990N33A17505c78372C23684
15419a79126H7676a80640A21668a88819n3759O9119B73120a01325j84205h7018
15408a56934F7727J68188b00755f0099G1539h0857n808j07370B977Q800f5950
15396a22098d9246A63275N8610b12779h2020A07295c5657B71318b96752G1722
$$ plain form
15478 -289015 -363599 -240164 -247060 -107426 -35097 394246 19105 156670 -11509 -305902 -348940
15467 -348940 -242434 140388 212662 3865 199715 34749 138341 -103898 -38370 -27629 134266
15455 76517 119346 234286 -147316 27476 77794 -73577 -152979 65547 -94014 152537 15641
15443 56544 192878 -299771 -114054 -168593 -20536 -69786 -283956 -138764 3387 -168139 99341
15431 178094 -27586 -119618 171722 -184714 -115468 167552 -79990 -79457 117505 -378372 323684
15419 -179126 87676 -180640 121668 -188819 -242578 -173459 273120 -101325 -285530 -87018
15408 -156934 67727 235915 -200755 -60099 71539 -80857 -86665 -194035 2977 11777 -65950
15396 -122098 -49246 163275 221885 -212779 -82020 107295 -35657 271318 -296752 71722
15385A4795b33671f5699A27352b95978h0j75601A27523P2288d1371k39880A36766
15373B6961a58707p1994j38127A27336i3459M5758E5235h2514k3285B55351a31043
15361c68786A35491c23358H4995K7862N9658c8698B02628b04165A13412O0730
15351A74142m1777f1331k65716a00390B6250O3533h1043p2936D0313h9852o8682
15340a58534A17875d05139J77300c5396j06102D16392j33473a00957A0104K8738
15330C8842f010k91866B90864b9142B07843a52496O9197j8969j0961i172B89583
15318C74251j06005c51439J56809G1332M1031j4886K21158a9047E6064a38216
15307A11040h6504A80459N6071a53396H491b87463a19925b257E2001P4563d1632
$$ plain form
15385 14795 -233671 -65699 127352 -295978 -80 -175681 127523 199811 -41371 -281251 136766
15373 26961 -158707 -230701 -368828 127336 -93459 -47701 55235 -82514 -105799 255351 -131043
15361 -368786 135491 -323358 84995 112857 172515 -38698 202628 -204165 113412 174142
15351 174142 132365 -61331 -327047 -100390 26250 89783 -81043 -153979 40313 -89852 -158534
15340 -158534 117875 -405139 -227839 -35396 -141498 416392 282919 -100957 10104 38842
15330 38842 -6010 -297876 290864 -29142 207843 -152496 -83299 -102268 -113229 -9172 289583
15318 374251 268246 -351439 -194630 71332 112363 97477 318635 -19047 56064 -138216
15307 111040 -86504 180459 236530 -153396 8491 -287463 -119925 -2257 52001 126564 -41632
15295A69305E7228N3669J41242C7517a22462k24986a52790B20776d17076B01736
15284B38436b06929I8751a20790A00882g0570D15297B04295m0068a14991H1680
15273C014e161n2198k0500r2434C55669I1799B3446a73007A66316P1433J0724
15262B48473f2426A16129P5134C7440L89217B9543f7238B42123M7764A40689c16252
15250D21217o1815K20790N61760O70442m4647K23531m36262D27109R4423B17584
15239A930g0855A53048o8043h6979k3747a5352A8067J83338q4532l9346J40582
15228B18109L01016A34029c2667A37111L1665a4096j0533a1249r3927q5018r4821
15217b85015B69272a7327A01778L68940A17463f598k11569J01929B32116C973
$$ plain form
15295 169305 57228 110897 252139 37517 -122462 -347448 -152790 220776 -417076 201736
15284 238436 -206929 98751 -120790 100882 -70570 415297 204295 164227 -114991 81680
15273 3014 -5161 -57359 -77859 -170293 355669 91799 23446 -173007 166316 237749 248473
15262 248473 -62426 116129 191263 37440 426657 29543 -67238 242123 289887 140689 -316252
15250 421217 359402 580192 1141952 1812394 1767747 1991278 1555016 427109 521532 217584
15239 1930 -70855 153048 85005 -86979 -110726 -15352 18067 201405 116873 77527 218109
15228 218109 519125 134029 -32667 137111 168776 -14096 -24629 -11249 -105176 -190194 -285015
15217 -285015 269272 -17327 101778 470718 117463 -6598 -218167 -116238 232116 3973
15206B6650a53871p859B52476j18119a1276B86042E4492J02016k4044g1270o8528
15195a39798B66865i8003b8724A34047a17196G7751b02457B62203J36725A65687
15184d4557B49560C2994d12632E7845L35756A50966O8228b30547A50463b99635
15173B52762a36065C00722j27291g703D98356b23469F106J12942n2156b68A12050
15161h302G3204C5923J41515K08568B634J98664e4413D77168C7650L8398a30814
15149a96740g7545C8195K79126a40530d0395o8542A62440J31642a29715A20594
15138B88610k8977D4126J14035a62458B16041A3079M15922D0449j832b49185A62445
15126b39303A91456b8643A22569R7034K4474o2942m0088J57586r7091Q4189o245
$$ plain form
15206 26650 -153871 -161730 252476 134357 -11276 286042 54492 156508 132464 -71270 -139798
15195 -139798 266865 -98003 -28724 134047 -117196 77751 -202457 262203 398928 165687
15184 -44557 249560 32994 -412632 57845 393601 150966 219194 -230547 150463 -299635
15173 252762 -136065 300722 173431 -7703 498356 -223469 6106 119048 66892 -268 112050
15161 -8302 73204 35923 177438 386006 2634 201298 -54413 477168 37650 76048 -130814
15149 -196740 -77545 38195 317321 -140530 -40395 -108937 162440 294082 -129715 120594
15138 288610 259633 44126 158161 -162458 216041 13079 429001 40449 38617 -249185 162445
15126 -239303 191456 -28643 122569 219603 244077 181135 141047 298633 201542 285731 279486
15115B79486g5497E1124J53385H2587a51856D44290i0993l434A64086b38456C61560
15103A57514o0263J59809a8837A39462E5164f476B40307R024k4977E9234c04203
15091I7993K06349A42958J07449J66195A77912f709p8458D05547h7407A25263
15080f3929A63365a5183C0553K78743k3984h8989C45713n7335a03271L4887J5102
15069e3282A19157J69273J84830i9832L754h880A22359K03211b8179C29254G4878
15057A19722m7491b695A91356J14650j2355j05101i8498q6624k30747A22089Q0761
15046B02850L7375J85294A97035P1598E3391J10941B3562m044L45538A32911A4557
15034G0038J82561K14151P1713F9008J84388j25887B0385c75206B56605C2279
$$ plain form
15115 279486 -75497 51124 204509 82587 -151856 444290 -90993 -94427 164086 -238456 361560
15103 157514 97251 257060 -18837 139462 55164 -6476 240307 249331 224354 59234 -304203
15091 97993 304342 142958 250407 416602 177912 -6709 -85167 405547 -87407 125263
15080 -63929 163365 -15183 30553 309296 285312 -88989 345713 288378 -103271 -68384 -53282
15069 -53282 119157 288430 473260 -99832 -96078 -8880 122359 325570 -28179 329254 74878
15057 119722 72231 -2695 191356 306006 293651 188550 -98498 -185122 -415869 122089 202850
15046 202850 240225 425519 197035 268633 53391 164332 23562 19518 365056 132911 14557
15034 70038 252599 466750 538463 69008 253396 127509 20385 -375206 256605 32279
15023D04955A28591J0226a54989A64506J57422H3635J60738j01643c4414B17920
15012A59328K3335J83597I0546M5215l3025L39361H7653K17840b09499A00324
15001D57567H1836J97137l2487A01992K43452f455D32057h535B17463J5626c89621
14989B96773A6460J59481F9835N6759J11230o5346h3999C59059j67654D7515d2999
14977E6393J05084J08246r3428J15625R680r479J1793j0596I1859R7759K4929
14966B14547g314C31302g4613I7375N1580J51745J86321j21969b06150A20869
14955A87118L5573K25472j03722j53229M01207B20642K38639B00139N9135M0477
14945B99751j42083J07789j2289A7723L24434J37543J7006A80728J69089P4709
$$ plain form
15023 404955 128591 138817 -154989 164506 321928 83635 244373 142730 -34414 217920
15012 159328 182663 366260 90546 135761 102736 442097 87653 305493 -209499 100324
15001 457567 81836 278973 246486 101992 345444 -6455 432057 -8535 217463 233089 -389621
14989 296773 16460 175941 69835 126594 237824 172478 -83999 359059 191405 47515 -42999
14977 56393 161477 269723 176295 291920 301600 292121 303914 293318 91859 189618 214547
14966 214547 -7314 331302 -74613 97375 148955 300700 487021 365052 -206150 120869
14955 187118 222691 448163 344441 191212 592419 220642 459281 200139 259274 299751
14945 299751 157668 265457 253168 17723 342157 479700 496706 180728 349817 424526
14935D24526A27978J20286J8949j13009K16872a5639D20288j71398I1477K08561
14925C00038O5598H4303K77869k9568j49168K81718k07868i418C60136Q6765J26423
14914E73324B37174J94718L9659D0541K96628A42288J64039n684L8245p6131j7133
14903B45624P796K39285A78333J35966f5577A12552M89370A05239J02731K26712
14893D34682N5327j29088r7597Q8450A75105J06752J04068J80458K9472j49961
14883D45894A80880J2075K12427A50941K21738p2872P0547o5194o9144m3461E1005
14871C94627I7846M28417A46545K26793j73226K98629p0840o4913A19635J05031
14861B24666J90153K29016j01081j49953q0793F6580M64782j73981M9077Q7855
$$ plain form
14935 424526 127978 248264 267213 154204 371076 -15639 420288 248890 91477 300038
14925 300038 365636 84303 362172 332604 183436 465154 257286 -9418 360136 446901 573324
14914 573324 237174 431892 471551 40541 337169 142288 306327 300643 338888 262757 245624
14903 245624 253420 492705 178333 314299 -65577 112552 601922 105239 207970 434682
14893 434682 490009 360921 263324 351774 175105 281857 385925 566383 595855 445894
14883 445894 180880 192955 405382 150941 372679 299807 370354 305160 236016 192555 51005
14871 394627 97846 526263 146545 373338 200112 498741 427901 362988 119635 224666
14861 224666 414819 643835 542754 392801 312008 66580 531362 357381 406458 494313
14851D94313j34590j15585K87758j34133A62539M09787G1666L71052A28733J66592
14841B95325j6524K11389j79958L20578k68378K44686N6319B47985M38100k95829
14831C90256j27214L05122p1487K38270B3104M89506k1258j34272K44668R2686
14821F94434k97127j8908n4321l7921K2763q4315K7315L42326B97076P47638C65660
14809G34301A30988K19670A56474N14244k74836J5370J73847n2004K7960k72158
14799B88897N8105N56130l37503k70381L07865k81776O3733J65770j10152K04567
14789F45255A92060P0217L29200k62564L47500j89024R7237M6371J05678D2198
14778C64847K85714j05162J08537j20151J60873J11955l69507M36771C37479p4151
$$ plain form
14851 494313 359723 244138 531896 397763 162539 572326 71666 442718 128733 295325
14841 295325 278801 490190 310232 630810 362432 607118 663437 247985 686085 390256
14831 390256 263042 568164 496677 734947 23104 512610 491352 357080 601748 694434
14821 694434 397307 378399 324078 286157 308920 224605 251920 594246 297076 1044714 365660
14809 734301 130988 350658 156474 670718 395882 411252 585099 533095 561055 288897
14799 288897 347002 903132 565629 295248 603113 321337 385070 550840 440688 645255
14789 645255 192060 262277 591477 328913 676413 487389 584626 630997 736675 42198
14778 364847 650561 545399 653936 533785 694658 806613 437106 873877 337479 263328
14768B63328N66343C09062M09405k28012M88746j60089j41444k00422K86614M5934
14758H09794Q7083k62388M7847j58220k02071N12776l73620J15524L1844J46147
14748G54716C54280K36913J45232l8861B81366M38937j60029N0226J41556j10545
14738F41511Q5228k48262Q0342J86117l55910N03489k67497L50144m27583J77590
14728G25169o2549P2916o3659J81347j24920k10959K38110J92359k80193j64767
14718E02854K29591k31003K0194K70323L02195m57262K8665j03155J43274k73543
14708D32133L78452k18687M51482j73419p246j54284N5359j99193J36034R2370
14698G93001J34854j46791j99605M42925j03920J70762k68726K65731r4157Q7027
$$ plain form
14768 263328 829671 309062 718467 490455 979201 819112 677668 477246 763860 809794
14758 809794 896877 634489 682336 524116 322045 834821 461201 576725 608569 754716
14748 754716 354280 591193 736425 697564 281366 720303 560274 610500 752056 641511
14738 641511 726739 478477 558819 744936 389026 892515 625018 975162 547579 725169
14728 725169 662620 735536 671877 853224 728304 517345 755455 947814 667621 502854
14718 502854 732445 501442 521636 791959 1094154 636892 665557 562402 705676 432133
14708 432133 810585 591898 1043380 869961 862715 708431 763790 564597 700631 793001
14698 793001 927855 781064 581459 1024384 920464 1091226 822500 1088231 994074 1081101
14688A081101k28377j63390K79823k5231k19824K37523p6523P8511k49845N06899
14678A220667l70107j7108J44043j88178J55291j4384J22480j19908J26562J63366
14668A222724j47913k23627N77728l69963o6450p9455K06870L5072l28267K09141
14658A035860K04825r4021k03498P6649l5807K71656K4264k60024L72393m84325
14648I07972j4996Q5387J96847J12111R1075l88816N51932l02064K30006j00439
14638A369015l3312l80025M29275j91733n2198m6338J13371J54444j25636n9779
14628A177084j85112J33151L25490q7438k22206N16497k95392O9174k68350K4691
14618A187589K59070r4795J52927m26675O29669M3631j39394j72063k59488M27165
$$ plain form
14688 1081101 852724 689334 969157 943926 724102 961625 885102 963613 713768 1220667
14678 1220667 850560 833452 977495 789317 944608 930224 1052704 932796 1059358 1222724
14668 1222724 1074811 851184 1428912 1058949 992499 913044 1119914 1154986 826719 1035860
14658 1035860 1240685 1146664 943166 1019815 984008 1255664 1279928 1019904 1392297 907972
14648 907972 892976 978363 1175210 1287321 1378396 989580 1541512 1239448 1469454 1369015
14638 1369015 1335703 955678 1384953 1193220 1141022 1094684 1208055 1362499 1236863 1177084
14628 1177084 991972 1125123 1450613 1363175 1140969 1657466 1362074 1431248 1162898 1187589
14618 1187589 1446659 1351864 1504791 1078116 1707785 1751416 1612022 1439959 1180471 1607636
14608A607636k53466L68318k80403r3849J16686L85145o36926k2318O94095j68508
14598A716410n3385J13189k92848J95210j52778K14282K01917k61484J00548m0566
14588A740495l29655O36729k43754L05627m23253L02665k64873J09172P8160J22394
14578B033707p8105M33932P2532p27425L00548K70158k23703j15747K55973J39161
14568B361031p4981K71570k47730l319K79762J30725j08724L60060n33267M25747
14558B860874L56878p0537Q3895J76745R6552J29556N59718P42475R40014K113884
14548G990054L579876R646920J6249092J483193j5517105r444174o612300l146745
14540D228811j604512K3730p88317K42015l28477K92716k82555L04657k97055
$$ plain form
14608 1607636 1354170 1722488 1442085 1348236 1464922 1850067 1213141 1190823 1884918 1716410
14598 1716410 1663025 1776214 1483366 1678576 1525798 1740080 1941997 1680513 1781061 1740495
14588 1740495 1410840 2047569 1803815 2109442 1686189 1988854 1723981 1833153 1911313 2033707
14578 2033707 1955602 2389534 2462066 1734641 2035189 2305347 2081644 1965897 2221870 2361031
14568 2361031 2286050 2557620 2309890 2306571 2586333 2717058 2608334 2968394 2435127 2860874
14558 2860874 3217752 3147215 3231110 3407855 3504407 3633963 4193681 4936156 5876170 7990054
14548 7990054 11569930 21216850 37465942 38949135 23432030 13987856 7375556 4228811
14540 4228811 2624299 2648029 1859712 2101727 1773250 2065966 1783411 2088068 1791013
14531A791013J55153J39442J12061K1796j55818J83729j60742L90927K63720o46856
14521B094425M90941l12941K40840m6000J24304K68781P3175j67760j40532J57750
14511B782983r1426P6886n0401Q7838J80605j5555j57902M89038m39848K44972
14501C107190K53190k51312J65867P8876k06586N876L27631r9252J1669J20062
14491C513211k23490M90977l60882J03035p2413Q6101J2177j98822M42855l659
14481C789090j93411L61596O7022k57956L41672q8972k65823M42267k57029M01265
14471D339721P602q5590q9502K76562k87476M20859k982P5918J42039O336K48318
14460E051805m68946K13048J30453J58480q6386J7205J52087j68333J56478L71879
$$ plain form
14531 1791013 1946166 2085608 2197669 2219465 2063647 2247376 2086634 2477561 2741281 2094425
14521 2094425 2585366 2272425 2513265 2467265 2591569 2860350 2933525 2765765 2625233 2782983
14511 2782983 2691557 2768443 2718042 2805880 2986485 2970930 2813028 3302066 2862218 3107190
14501 3107190 3360380 3109068 3274935 3353811 3147225 3153101 3480732 3381480 3393149 3513211
14491 3513211 3289721 3780698 3419816 3522851 3450438 3536539 3548716 3349894 3792749 3789090
14481 3789090 3595679 3957275 4024297 3766341 4108013 4019041 3753218 4195485 3938456 4339721
14471 4339721 4347323 4261733 4172231 4448793 4161317 4582176 4579194 4655112 4797151 4803487 5051805
14460 5051805 4582859 4795907 4926360 5084840 4998454 5015659 5167746 4999413 5155891 5527770
14450E527770j55372n4942K81045k12545j01801L90944J90287k3269R8131J14871
14440F055119K21439q9790K98111j56203k787J32035J36583K68203J55931J31708
14430G150349j79999n2960J81853j8212J2856K56319K52116j40497L89217j46028
14420G705014L86479j36335L08052J84433M03324n89335M26017O7972R0332J51782
14410H997735K65540L80301j51937Q5506P0167Q310J88188L08090J55150l9302
14400A0267748M43661q8232L64543R7542M28376n7563L10461N9102J35308M96007
14390A2456953j84369K13501J59699J99247K82307L73362L45M25406l1848O71138
14380A4565741M70850J74524k5359J82597J38010O36458J75337N22087M67427
$$ plain form
14450 5527770 5372398 5317456 5598501 5385956 5284155 5675099 5865386 5842117 5940248 6055119
14440 6055119 6276558 6186768 6484879 6328676 6325889 6457924 6594507 6862710 7018641 7150349
14430 7150349 6970350 6917390 7099243 7081031 7093887 7350206 7602322 7461825 7851042 7705014
14420 7705014 8091493 7955158 8263210 8447643 8850967 8261632 8687649 8755621 8845953 8997735
14410 8997735 9263275 9643576 9491639 9577145 9647312 9655622 9843810 10151900 10307050 10267748
14400 10267748 10711409 10623177 10987720 11085262 11513638 11456075 11766536 11825638 11960946 12456953
14390 12456953 12272584 12486085 12645784 12845031 13127338 13500700 13501045 13926451 13894603 14565741
14380 14565741 15036591 15211115 15185756 15368353 15506363 16142821 16318158 16840245 17307672
14371A7307672l6006N96191J71072O88880K22373M05868M26854L41569M97245
14362B0621718L29627M42401K48571Q18832L39074O15094K55647N60949P97910
14353B5029823L16599N25777P21342J002050N82205P13311P96462O22546O36456
14344C0946571P05918R78296J108642O11430J051462R94943J072481R01984J187360
14335C9559087R08494J407548J162267J395996J055906J483249J768091J531541
14327E0272179J501155J319146K029553J917621J565631K558311K182494J856878
14319F5202968K785833K124898K413870K896042K974851L128731K790652L508521
14311H7826366L649012L839385L213564M318186M549471M681458M681799N260602
$$ plain form
14371 17307672 17271666 17867857 18038929 18727809 18950182 19356050 19782904 20124473 20621718
14362 20621718 20951345 21393746 21642317 22461149 22800223 23415317 23670964 24231913 25029823
14353 25029823 25346422 25872199 26593541 27595591 28177796 28891107 29687569 30310115 30946571
14344 30946571 31652489 32630785 33739427 34350857 35402319 36397262 37469743 38371727 39559087
14335 39559087 40467581 41875129 43037396 44433392 45489298 46972547 48740638 50272179
14327 50272179 51773334 53092480 55122033 57039654 58605285 61163596 63346090 65202968
14319 65202968 67988801 70113699 72527569 75423611 78398462 81527193 84317845 87826366
14311 87826366 91475378 95314763 98528327 102846513 107395984 112077442 116759241 122019843
14303A22019843N540857N357784O399431O370553O941883P250064P493468Q106739
14295A75480622Q535641R037136R464140R895487J0457088J1299106J1351707
14288B45520927J1911819J2505389J3175109J3131789J3482345J4182591J3853145
14281C37763114J4224076J3608937J3732381J3049040J2829063J1370665J0569161
14274D27146437Q890506O472643L735806Q92929j098148n99708k633571j359272
14266D41447622l442423n875775q763231j0572254j2196108j3079826j4346335
14259C73171670j4628715j4567959j5022366j4806168j4313182j3943728j2276402
14252B73613150j2833066j2818303j2077469j1135455j1103237j0280351r792430
$$ plain form
14303 122019843 127560700 132918484 139317915 145688468 152630351 159880415 167373883 175480622
14295 175480622 184016263 193053399 202517539 212413026 222870114 234169220 245520927
14288 245520927 257432746 269938135 283113244 296245033 309727378 323909969 337763114
14281 337763114 351987190 365596127 379328508 392377548 405206611 416577276 427146437
14274 427146437 436036943 442509586 446245392 447138321 446040173 445440465 442806894 441447622
14266 441447622 438005199 432129424 423366193 412793939 400597831 387518005 373171670
14259 373171670 358542955 343974996 328952630 314146462 299833280 285889552 273613150
14252 273613150 260780084 247961781 235884312 224748857 213645620 203365269 193572839
14245A93572839r096558q506046q000301q093443p069622p047501o456317o017571
14237A33285480n545986n277296n343577n173834m280466m310768l691315m205885
14229I5456353m071612l110125l497131l198387l093119k799909k473788k801289
14221G0410993k077741k374982k078464k119720k151292k191053j549673j353137
14213E4514931j742251j696874j772184j408303j326810j327013p32186j395811
14205D3113499j435247j020509j592340q96883p89965o19800j070044j265950
14197C4422761j056953n06049j106187l66923q55860n21706p42327q07019j107984
14188B7351753l95431n08842n44700r17625j00479p75733n62699l87988m35466
$$ plain form
14245 193572839 184476281 175970235 167969934 159876491 152806869 145759368 139303051 133285480
14237 133285480 127739494 122462198 117118621 111944787 107664321 103353553 99662238 95456353
14229 95456353 91384741 88274616 84777485 81579098 78485979 75686070 73212282 70410993
14221 70410993 68333252 65958270 63879806 61760086 59608794 57417741 55868068 54514931
14213 54514931 52772680 51075806 49303622 47895319 46568509 45241496 44509310 43113499
14205 43113499 41678252 40657743 39065403 38168520 37378555 36758755 35688711 34422761
14197 34422761 33365808 32859759 31753572 31386649 30530789 30009083 29266756 28459737 27351753
14188 27351753 26956322 26447480 25902780 24985155 24884676 24108943 23546244 23158256 22722790
14179B2722790p25721k94374m66573n77711l47256k30586n95820J69341p44801
14170A8909289m93287l19660Q2010p11016m65740k36979l37688J43893o78508
14161A5892314m52680l80136o0560J2243n34825j33263l25025l49543l96637J29078
14151A3400966k31824k68014k84170j50402l43575q8342m13406j59578M0260n32067
14141A0969848K75102J0630n11119k59638j75454L4864r4015m05978K8728l58780
14131I514188J26581j88911l99922j43392q6232j96105L71657n55984j98794J09730
14121H352816l04089Q582j99484J47925m77342L2502K36781k06650L3222l347
14111G620916l34052m0988j67714n9717m9262k24524J16130l30642k46841K1790
$$ plain form
14179 22722790 21997069 21702695 21236122 20658411 20311155 20080569 19484749 19654090 18909289
14170 18909289 18416002 18096342 18178352 17467336 17001596 16764617 16426929 16570822 15892314
14161 15892314 15439634 15059498 14998938 15011181 14476356 14343093 14018068 13668525 13271888 13400966
14151 13400966 13169142 12901128 12616958 12466556 12122981 12034639 11621233 11461655 11501915 10969848
14141 10969848 11244950 11255580 10744461 10484823 10309369 10344233 10250218 9844240 9872968 9514188
14131 9514188 9640769 9451858 9051936 8908544 8822312 8626207 8997864 8441880 8243086 8352816
14121 8352816 8048727 8057309 7857825 8005750 7528408 7560910 7797691 7591041 7624263 7620916
14111 7620916 7286864 7245876 7078162 7018445 6969183 6744659 6860789 6530147 6283306 6305096
14101F305096P1068L88783o67007O299K2780o8606j40878L87567o69288L09686
14091E945500p8756k57608L325N2941k16921k02348J34823L34220m33081q4636
14081E197459J56730o82414M34605Q7314k16590O6728j62691j72102p4237L72125
14071E006927k04334j38637l32180K29067l13401L45861k35467L8306l6944J46010
14061D505208j9162k24112j5158J49940j45027l06519j57891j90785J18631k9820
14051C685305L5799M1797L3075l22768J80147P1765q7878m033j67749j89079J31191
14040C407572M745k5040l6407j36092j56107R5415N31211m50064k01016L47378
14030C381595j26156J50299k18952J89541n68110J30406L81310l58364M71125
$$ plain form
14101 6305096 6376164 6764947 6097940 6104239 6127019 6058413 5917535 6305102 5635814 5945500
14091 5945500 5866744 5609136 5612461 5665402 5448481 5246133 5380956 5715176 5282095 5197459
14081 5197459 5354189 4671775 5106380 5193694 4977104 5043832 4881141 4709039 4634802 5006927
14071 5006927 4802593 4663956 4331776 4560843 4247442 4593303 4357836 4396142 4359198 4505208
14061 4505208 4486046 4261934 4246776 4396716 4251689 3945170 3787279 3596494 3715125 3685305
14051 3685305 3721104 3762901 3795976 3473208 3653355 3725120 3637242 3633209 3465460 3276381 3407572
14040 3407572 3412317 3387277 3350870 3214778 3058671 3154086 3685297 3235233 3034217 3381595
14030 3381595 3255439 3405738 3186786 3376327 2808217 2938623 3319933 2961569 3432694
14021C432694n20711l0493m6373J9668o6091k50702L87299n34799M17876l27659
14011B480709K82721j94776K5393j60224M4647J03919j13613j38485j97161K5702
14001B158832M1239J71008K2817k25140j49390L15857J84562k01649j05469M36500
13991B649167k5674K98213J040972K866031P335649J7507188Q565757j3277721
13983B6959582j1238623o302433k972822j185867o45685o40577m20734m53880
13975C098961P6568k60732J32978J45164m00139k09206N8334k9225j41805l02886
13965B168012N93109j50024k89647o9921K37029r7501j40567N3150L22333m23602
13955B202371J41542j68123m23258K39155p450J88302l1195m32451L76471K20342
$$ plain form
14021 3432694 2911983 2881490 2835117 2854785 2788694 2537992 2925291 2390492 2808368 2480709
14011 2480709 2763430 2568654 2594047 2433823 2478470 2582389 2468776 2330291 2133130 2158832
14001 2158832 2200071 2371079 2393896 2168756 2019366 2335223 2519785 2318136 2212667 2649167
13991 2649167 2623493 2921706 3962678 6828709 14164358 31671546 40237303 26959582
13983 26959582 15720959 9418526 6445704 5259837 4614152 3973575 3552841 3098961
13975 3098961 3175529 2914797 3047775 3192939 2792800 2583594 2641928 2612703 2470898 2168012
13965 2168012 2761121 2611097 2321450 2251529 2488558 2391057 2250490 2303640 2625973 2202371
13955 2202371 2343913 2175790 1752532 1991687 1984237 2172539 2141344 1708893 2085364 2305706
13945B305706k54664J1598j3692m177m38379J19358m04964O00478k30425J37150
13935A827989J41452N071O3257J12213m60673m2436K61920r6871K95574l88639
13925A718857M1503P0242j49393j18244J28202J71801j85910j43150K25815l73578
13915A386145K71513k37653J90276j50723J84649L77616n60079J13765K11402
13906A786911l01372m91902O62061k73487K18179n07754L26302J1297k80925L50413
13896A499723j19151J58224R1520m31779P31843o95365M72530n69283K1002L58530
13886A517794k52537m30506P19388l93195Q4008L21311l44552J48109k52490M75616
13876A592946k92776m21415K80656M3644O114K35665l25718m2723L35697k63923
$$ plain form
13945 2305706 2051042 2062640 2048948 2044771 1606392 1725750 1320786 1921264 1690839 1827989
13935 1827989 1969441 1974512 2037769 2149982 1689309 1646873 1908793 1811922 2107496 1718857
13925 1718857 1760360 1830602 1681209 1562965 1691167 1862968 1677058 1533908 1759723 1386145
13915 1386145 1657658 1420005 1610281 1459558 1644207 2021823 1461744 1575509 1786911
13906 1786911 1485539 993637 1655698 1382211 1600390 1092636 1418938 1430235 1149310 1499723
13896 1499723 1380572 1538796 1630316 1198537 1930380 1235015 1707545 1138262 1159264 1517794
13886 1517794 1265257 834751 1554139 1160944 1244952 1566263 1221711 1369820 1117330 1592946
13876 1592946 1300170 878755 1159411 1203055 1209169 1444834 1119116 1076393 1412090 1148167
13866A148167L03574n1541j21113j93030L07949k74956K41873k17968l63388K85789
13856A065356n3979J05789J838N124Q2080K096j97071J30303o1647K65714l21881
13845A023722j33170M59495n19243M43592k59436j07907J4800K30887j0806j85817
13835I56117J33840M1384k83133L26677m48946M96142l82909K7898K70910j09008
13825A028972m9680J30802q5166J37405m0081m75779J50186L40886N4981C50966
13814A098493k90888j38261K01715j0250K27183l32269N58131m79207n145P6064
13804I05566P3278l84051O77409l90506J55117j27122j53803K47415r3933q7947
13794H21423O100k48629J43301m2160J07429J66786M3612l49851K46886o2105
$$ plain form
13866 1148167 1451741 1400200 1279087 1086057 1394006 1119050 1360923 1142955 779567 1065356
13856 1065356 1011377 1117166 1119004 1124128 1206208 1208304 1011233 1141536 1079889 1345603 1023722
13845 1023722 890552 1350047 830804 1274396 1014960 907053 921853 1152740 1141934 956117
13835 956117 1089957 1131341 848208 1174885 725939 1222081 839172 867070 1137980 1028972
13825 1028972 979292 1110094 1024928 1162333 1122252 646473 796659 1137545 1192526 350966
13814 1098493 807605 669344 871059 860809 1087992 755723 1313854 834647 829502 905566
13804 905566 978844 594793 1272202 881696 1036813 909691 755888 1003303 909370 821423
13794 821423 827523 578894 722195 680035 787464 954250 997862 648011 894897 832792
13784H32792k1134K99877k97062l62325K49608M60427n00847L25902l41241J68924
13774H14921O4343r0206P5224k72673J603J34714k41953O0073K64841k80904J47260
13763F77243k54188P7128J04366K33662l69028M25393j26641M46672n07354j47679
13753E59574K04397j49519K43434j09848j43228n9935L33989k5119C52988L63790
13743G16778K67424l81926k95271O32702l89556K23714J19041k76138N5977r2552
13733E80193B45797N78409J82663m62489K94553l02922L6969K9943j23908p1043
13723D07972O15955l99977j71731R8746O12L00552J03559C65729M00631j75948
13713E90412R6308j73852L49451j74873j09261J6677Q204K22743k54263r5122
$$ plain form
13784 832792 811658 1111535 814473 452148 701756 1162183 661336 987238 645997 814921
13774 814921 879264 789058 864282 591609 593212 727926 485973 546046 810887 529983 677243
13763 677243 423055 500183 604549 838211 469183 894576 767935 1214607 707253 559574
13753 559574 763971 614452 857886 748038 604810 544875 878864 853745 352988 716778
13743 716778 984202 602276 307005 939707 550151 773865 892906 616768 672745 580193
13733 580193 245797 824206 1006869 544380 838933 536011 572980 602923 479015 407972
13723 407972 1023927 623950 452219 550965 551577 852129 955688 365729 766360 590412
13713 590412 686720 512868 862319 687446 578185 594862 603066 825809 571546 476424
13703D76424P7315L6804j46194J97257k0240j0567p657J75002C13494L34788j57393
13692D90889m7300J28060n9723J94914j18394K29510B94210L34693j56304o9583
13682D03016J94617k76483J48508J32575n8719J271j44692L58040C37371p528
13672C29843K78738p313q5062J61921k9570j95502j9612k8949j16254r8364N73330
13661G63206k31689j69913L27448K4920k74484J27788n5205j73267L45514l05362
13651C78956K0047K0683j49476N15297k4607k34618R9254l10783Q0777l1548L5866
13640C99848o1217J31689j56909K43062o3954K57253j6686k70791A91068K27006
13630D18074K01675K04316k62453j62902L17474l27273J62532o1032J61900A93855
$$ plain form
13703 476424 553739 590543 444349 641606 621366 610799 603142 778144 313494 648282 490889
13692 490889 443589 571649 511926 706840 588446 817956 294210 628903 472599 403016
13682 403016 597633 321150 469658 602233 543514 544785 400093 758133 337371 329843
13672 329843 608581 601268 516206 678127 648557 453055 433443 404494 288240 189876 763206
13661 763206 531517 361604 689052 713972 439488 567276 512071 338804 684318 378956
13651 378956 399003 419686 270210 785507 760900 526282 625536 314753 395530 363982 399848
13640 399848 338631 470320 313411 556473 492519 749772 733086 462295 191068 418074
13630 418074 619749 824065 561612 398710 716184 388911 551443 490411 652311 193855
13619E00845J9200q6798K03004B18393L3429L20609k82885J20752J9137I8326
13608C94660N8584j50064M32744l8056A76481o4196N69107p3884B87191L95333
13598F82524k35377r356O4428J46611k58415j61222K51060L3481B10477P3224
13588B83701m4558N7307J92208A71221M04410o5964j34060J54771j23116J12206
13578E19468J34835k72149K54844j35764B07728K01167P0882j5468k31622N3283
13568B85970J30801a3228C12373j05447F2973J46164j00963J69259J961M8612
13558C28006I4321m4582K87091K09039B44718A05410K75373n4110k8522J4803
13548C12954j42449K40106A74847o7698e5541A83379G2739J68033P4753L44861
$$ plain form
13619 500845 520045 433247 636251 218393 251822 572431 289546 410298 429435 98326
13608 394660 453244 303180 735924 697868 176481 112285 681392 607508 287191 682524
13598 682524 447147 437791 502219 648830 390415 229193 480253 513734 210477 283701
13588 283701 239143 296450 488658 171221 575631 509667 375607 530378 407262 519468
13578 519468 654303 382154 636998 501234 207728 408895 479777 464309 232687 285970
13568 285970 416771 -13228 312373 206926 62973 209137 108174 277433 279394 328006
13558 328006 94321 49739 336830 545869 244718 105410 380783 326673 298151 312954
13548 312954 170505 410611 174847 107149 -55541 183379 72739 240772 315525 660386
13538F60386A55120B7741J40212J2342K78173n589A78249P9002L35825B61927
13527I4905K67737N7052p1701A1385J33309O8597G507K64952J55012c1914E8237
13515B12867M12985k00614I8896K11498j43242K00368j44050r8376K71680K12848
13505F09622j38319j86470N6544j01410L00401B55186K78746j70855j60012M03382
13495F06447K6583A48992Q1220r0240J77733A39357m3828J67449J34501L71292
13485G68771B54766K79692j91580n9624l4232A02176L42810A7497J72117J43909
13475C33523j06214m6903j8062i264j58192C04954n107p4475J46239A04917L39579
13464D44496A56219i5414A05639J97085a01985I7236b55248B67748C7537K18680
$$ plain form
13538 660386 155120 27741 167953 180295 458468 452879 178249 257251 593076 261927
13527 94905 362642 419694 347993 11385 144694 213291 7507 272459 427471 -31914 58237
13515 212867 625852 425238 98896 310394 167152 367520 223470 125094 396774 609622
13505 609622 471303 284833 341377 239967 540368 255186 533932 363077 203065 606447
13495 606447 633030 148992 230212 139972 317705 139357 95529 262978 397479 768771
13485 768771 254766 534458 342878 283254 249022 102176 444986 17497 189614 333523
13475 333523 227309 180406 162344 -9264 -167456 304954 299847 225372 371611 104917 444496
13464 444496 156219 -95414 105639 302724 -101985 97236 -255248 267748 37537 256217
13454B56217A24786J78378J06645q9015p1441O6122D2049K6241M79032I4984L82578
13443D77562e1298A81201J67269A64115K40278A41907J87926K33037A53256J93251
13433C46507k3268A07506m6196o017J42266H4661K00431a58446C70691J16595
13423D87286j77231A03116c9179B30654j03851L43253g5497F46405B96852J7802
13413C14654m3059A9899M6806K75805A25127K24524Q0151A98200H9754O1102J48945
13402B99801n1343f9790A41888a47031B89653H2452J9688B8656J08774J46863
13392B84293i820B26301J02090R5842A93286J3121a69736C13405j9867j29926
13382A63612K19128a0265C47667G1436L18856j85304Q7345O8075J1713B4552N43221
$$ plain form
13454 256217 124786 303164 409809 320794 249353 315475 42049 68290 547322 94984 477562
13443 477562 -51298 181201 348470 164115 404393 141907 329833 562870 153256 346507
13433 346507 323239 107506 61310 55293 197559 84661 285092 -158446 370691 487286
13423 487286 310055 103116 -39179 230654 126803 470056 -75497 646405 296852 314654
13413 314654 271595 19899 66705 342510 125127 349651 429802 198200 89754 150856 299801
13402 299801 248458 -69790 141888 -147031 289653 82452 102140 28656 137430 284293
13392 284293 -9820 226301 328391 424233 193286 206407 -169736 313405 293538 163612
13382 163612 382740 -10265 347667 71436 390292 204988 292333 360408 372121 24552 567773
13371E67773B58008m1915J3560O9875j48643J16247I9283K92913j78153l1112
13361A82931d6654D91899B03675J6356P5241C6030K7718J32692O5480b52438D3736
13349B17488o5263e7060A64321j2626J91648a5616D84460m2532A21195L25444
13339D46639J21340A7123L23160q5635O9245A59955M33474c6719D28522H445J11491
13328A19936J43647K5948C8483R602L0635d3316E37056k31338b8851C48347n1354
13317B96993A41562J78641m7956r1944m9384K53868I6278J25422J07983q898E1634
13305A17931I076K95398b1876A56445p0963C4287O5726J74056o7287a17478A49628
13293A72951J07200J5445j07641a44185A36508J54898A17905K94831A34365J06831
$$ plain form
13371 567773 258008 216093 229653 299528 150885 267132 99283 392196 214043 182931
13361 182931 -46654 491899 203675 220031 295272 36030 63748 196440 261920 -252438 43736
13349 217488 152225 -57060 164321 151695 343343 -15616 484460 441928 121195 446639
13339 446639 567979 17123 340283 254648 323893 159955 593429 -36719 428522 8445 119936
13328 119936 263583 289531 38483 48085 78720 -43316 537056 305718 -28851 348347 296993
13317 296993 141562 320203 272247 180303 130919 384787 96278 221700 329683 320785 51634
13305 117931 9076 304474 -21876 156445 85482 34287 100013 274069 206782 -117478 149628
13293 172951 280151 295596 187955 -144185 136508 291406 117905 412736 134365 241196
13283B41196F5539J43854m8615J42864A15957Q8993K56860j96607R2836b0090
13272C96168j22451I048J1347M1341a32578B06456J8877k9010o9254g4631C2399
13260A24931K17017l3381A16678L5371e5428C25593A43594O3800J62059A83873
13249A547J51054E6700g2418m7656N7128D14205A09818e1854A88953P7705b89309
13237I0816B2709L81773b7678C49538r3766A01659k9379B6272J91286a21809I0553
13225B78257b0528j63609C38747A16395J01495K47020B01208A5713L58963c4023
13214D04844D0776J96476a18472A37783A658M12816I6106Q4904c43741A35157
13203B29496N3239A26955J67446A10811j5503K6966K04272D0052M4294i9046A77333
$$ plain form
13283 241196 65539 209393 160778 303642 115957 204950 461810 265203 358039 -20090
13272 396168 273717 9048 20395 61736 -132578 206456 225333 196323 127069 -74631 32399
13260 124931 341948 308567 116678 152049 -55428 325593 143594 207394 369453 183873
13249 1547 152601 56700 -72418 -120074 -62946 414205 109818 -51854 188953 266658 -289309
13237 90816 22709 404482 -27678 349538 255772 101659 72280 26272 217558 -121809 90553
13225 278257 -20528 -184137 338747 116395 217890 464910 201208 15713 374676 -34023
13214 404844 40776 237252 -118472 137783 1658 414474 96106 181010 -343741 135157
13203 229496 282735 126955 294401 110811 95308 122274 326546 40052 84346 -99046 177333
13191A42019p0241M81C2710N5699L9685K2435a61155A83393l2105O1958I6283
13179A40356D5444a81781e756A44475K72317A20674O9992o4716J09191b78915
13168c9474A42032a13802d4873r251E1430k0580M26271i8398B25980j7588o8898
13157A39494d1478l3310B06674m2220D6350J04605h1678A82233J51926a63225
13146H3414g2792A5514J94780J5417C6528O3005J0002J95257j05533f9746k6746
13135i6492A84541M1608A01398J9081C0734h4050D31182H3971K97517a01324k42310
13124c43634I8562J0204K10406j12456j4677J64543d9678A06839J65526C4346
13113G5974J20750c10774F943J11653J35545K9144C7771J64258r9091J80694i1410
$$ plain form
13191 142019 71778 72259 32710 88409 128094 150529 -161155 183393 151288 213246 96283
13179 140356 45444 -181781 -5756 144475 416792 120674 190666 125950 235141 -278915
13168 -39474 142032 -113802 -44873 -54124 51430 30850 457121 -98398 225980 208392 139494
13157 139494 -41478 -74788 206674 164454 46350 150955 -81678 182233 334159 -163225
13146 83414 -72792 15514 210294 225711 36528 99533 109535 304792 199259 -69746 -96492
13135 -96492 184541 226149 101398 120479 30734 -84050 431182 83971 381488 -101324 -343634
13124 -343634 98562 108766 319172 206716 192039 356582 -49678 106839 272365 34346
13113 75974 196724 -310774 6943 118596 254141 283285 37771 202029 102938 283632 -91410
13101F0784e5409j26345A6301J20600e3338B96561p2339f4924A93152o9808E4435
13089A26926n196b4004A46410L5509Q145b18912D78555i333H7780K21595a66233
13077c4809B64868j5681a6903A8981a99743a1841C924a15652B40912B9138E833
13065B53998h2140k582a2797H7303K3383K54376m8083i0620A171J33970L90886
13054E26027i4987A29880f3087a5524D9690M6175h3809G1821h9905L3046k4012
13043h0871F4586b74124A5927P5566K77526j56706H0911L59514j57629o3036d4212
13031B02977l5592K60065f7747l1410B1193M5411p417f2920A61857n2233a39586
13019A12667E0769J18300I074K81041J59960j20886j46997C1835a5036A97695
$$ plain form
13101 60784 -55409 -181754 16301 136901 -53338 296561 224222 -64924 193152 123344 54435
13089 126926 121730 -24004 146410 181919 190064 -218912 478555 -9333 87780 309375 -166233
13077 -34809 264868 249187 -16903 18981 -199743 -11841 3924 -115652 240912 29138 5833
13065 253998 -82140 -84722 -12797 87303 110686 365062 316979 -90620 1171 135141 526027
13054 526027 -94987 129880 -63087 -15524 49690 95865 -83809 71821 -89905 -56859 -80871
13043 -80871 64586 -274124 15927 91493 369019 212313 80911 440425 282796 219760 -44212
13031 202977 167385 427450 -67747 -99157 21193 66604 59187 -62920 161857 109624 -139586
13019 112667 50769 169069 9074 290115 450075 329189 182192 31835 -15036 197695
13008A97742k3005a86906C57810E8355c6410D67532k27531a925j3420A25904l7035
12997H8869E20K00889g5930B60208e2852B76057h4450E902K8146K33900E8276
12985A09056M6032E4857K9256i5587A54379R7256G0639M8538b12760A72639a78902
12973G7336J55454a09456E7894K9746a43345B21993h0759H9886K32336H3532e1935
12961c0542k2718A87882G5061N7582E8346b3155A30381b48237e155C06621d0839
12949A51296p3250A29L3487d3153B45931e9107H6593a36710A00321J03858n9531
12938A44648b6054B08632J36279m9370o1060a68867c4278A87467i4694C15055
12927a41745B83061Q9582j19904E7340b85966C73854G5991O4050I638d09448F6336
$$ plain form
13008 197742 174737 -186906 357810 58355 -36410 467532 240001 -1925 -15345 125904 88869
12997 88869 520 201409 -75930 260208 -52852 276057 -84450 5902 34048 267948 58276
12985 109056 155088 54857 84113 -95587 154379 251635 70639 119177 -212760 172639 -178902
12973 77336 232790 -109456 57894 87640 -143345 221993 -80759 89886 322222 83532 -51935
12961 -30542 -53260 187882 75061 132643 58346 -23155 130381 -248237 -5155 306621 -40839
12949 151296 78046 129 33616 -43153 245931 -59107 86593 -136710 100321 204179 144648
12938 144648 -26054 208632 344911 295541 234481 -168867 -34278 187467 -94694 315055
12927 -141745 283061 372643 252739 57340 -285966 373854 75991 140041 9638 -409448 66336
12915i9263B93220o6500r2719K17738A62016J53954A37839a66667j32526E9336
12904a06986C4788J85441J0539A14085a0066H6975a11620A90521b4453k95029
12894c19482B08375K57844c4323A3112a48594p2999B67176m4403J46578C9667
12883H2107M250j58J32099a70689j03150G3317b5897j42554C6685b47093F1968
12871A70253K08749A88614i3885k53719A09441D2835J83426r9276F0821j7682
12861D3139K41136A14447D525e7319A27683a65379a2560A68575E9380J8766K6731
12850A04877A4414K2337O769i4817A25748a72101A45373J6525G17L0294J72392
12839B03403b18251A00572J91615J36629g4467O859A9321e0300F137h2800j46497
$$ plain form
12915 -99263 293220 226720 134001 351739 162016 315970 137839 -166667 -299193 59336
12904 -106986 34788 220229 230768 114085 -10066 86975 -111620 190521 -24453 -319482
12894 -319482 208375 466219 -34323 13112 -148594 -221593 267176 222773 369351 39667
12883 82107 86357 86199 218298 -170689 -273839 73317 -25897 -168451 36685 -247093 61968
12871 170253 379002 188614 -93885 -347604 109441 42835 226261 126985 60821 43139
12861 43139 284275 114447 4525 -57319 127683 -165379 -12560 168575 59380 78146 104877
12850 104877 14414 36751 43520 -94817 125748 -172101 145373 161898 717 31011 203403
12839 203403 -218251 100572 292187 428816 -74467 -67608 19321 -50300 6137 -82800 -229297
12828b29297J06432H298N2174J61900G2813J67177G3361h980j05763B7654J34280
12817A61934L12711A61619a90128l9495L3891e2294D4042I478Q1829m3804b9378
12805C3795p668R9140d5870j56714b5069I310m551R6323K4266C5039K30418n4537
12793B10920c14174A05644a03970C991d122B39959e0750B57034p7015J594G788
12781b246m1700B82703b50118O6433H4314a20328h499q2445j70994A98711J95400
12770C94111A75977J6643n9399b912A84155J45598B0673P1829J13922r9527J24648
12759B31545A09524a72690A21630c85869a70303A27364c3689J4761k03298c6051
12748C31245A3318M1169N5825P7705G6765J8404e4705A82555j5772p2121j6007
$$ plain form
12828 -229297 -122865 8298 60472 222372 72813 239990 73361 -8980 -114743 27654 161934
12817 161934 474645 161619 -190128 -229623 -195732 -52294 44042 9478 91307 47503 -29378
12805 33795 26127 125267 -45870 -202584 -25069 9310 4759 101082 125348 35039 265457 210920
12793 210920 -314174 105644 -103970 3991 -4122 239959 -50750 257034 180019 181613 7788
12781 -2246 -43946 282703 -250118 -183685 84314 -120328 -8499 -90944 -261938 198711 394111
12770 394111 175977 192620 133221 -2912 184155 329753 20673 92502 206424 106897 231545
12759 231545 109524 -172690 121630 -385869 -170303 127364 -33689 -18928 -222226 -36051
12748 331245 13318 54487 110312 188017 76765 95169 -54705 182555 166783 94662 78655
12737G8655i1085k23235G5956K05695J28980D7695Q6272j5529J16292f4643m4641
12726a09284l840A47044o1192h3544B26415g1322I4903B7525b33985A85265p1281
12715A13984K3601l922E3860a31758e2847C41617j36649m1864J50680A09157J76246
12704B85403a03506K1923A23096L4817l4574J03713J21074a89329k7963A59424
12693A37194J1203J42895I1784L18032b672B1543a36619o855D1462D574L4190
12682C8764N4827Q4572C8525a46971o6927B52392r2390Q1705j16190N4191F1478
12670A57249a53556a2988H8547K19038I6422f5842C12782h3416b9324C88016l5521
12659C52495A01603b58146A06623a17261B71520B2466K29240A02396m9281J23959
$$ plain form
12737 78655 -91085 -314320 75956 281651 410631 47695 133967 118438 234730 -64643 -109284
12726 -109284 -113124 147044 85852 -83544 226415 -71322 94903 27525 -233985 185265 113984
12715 113984 137585 133663 53860 -131758 -52847 341617 204968 163104 313784 109157 285403
12704 285403 -103506 -81583 123096 157913 123339 227052 348126 -189329 -217292 159424
12693 137194 148397 291292 91784 409816 -2672 21543 -136619 -143474 41462 4574 38764
12682 38764 93591 178163 38525 -146971 -213898 252392 160002 241707 125517 179708 61478
12670 157249 -153556 -12988 88547 307585 96422 -65842 312782 -83416 -29324 388016 352495
12659 352495 101603 -258146 106623 -117261 271520 22466 251706 102396 53115 177074
12649A77074n4348J89680A32215m0820C868c11702a06954B28268j13540O0723
12639A75451A2739K93416r1839a20837M1561A47389J14002j04385n7575P811K56989
12628C64231J57597a8607B12154J66643A42215N5211K5918R3098b41900A62239
12617a8903D5074b50171A10514Q318A7022K09698c8392B10173g288A42083Q1101
12606B23184b08376A90392D014K5373b727A74306n3760h2927B27450H5587M2819
12595A28406d3745C6402g5116B09238f3862B78871q4180E8967e1012A20703a13402
12583A63669b71510M1163f1689b1960C60126G3721P5523c0188k80396h9651E861
12571F9187C178L0448K13156r7035a12016B76230r4118F820J69394b7671j78354
$$ plain form
12649 177074 122726 312406 132215 91395 3868 -311702 -106954 228268 114728 175451
12639 175451 12739 306155 214316 -120837 -79276 147389 261391 157006 99431 107242 364231
12628 364231 521828 -18607 212154 378797 142215 197426 223344 316442 -241900 162239
12617 -18903 45074 -250171 110514 118832 17022 226720 -38392 210173 -7288 142083 223184
12606 223184 -208376 190392 4014 29387 -2727 174306 120546 -82927 227450 85587 128406
12595 128406 -43745 36402 -75116 209238 -63862 278871 194691 58967 -51012 120703 -113402
12583 163669 -271510 -230347 -61689 -21960 360126 73721 149244 -30188 -310584 -89651 5861
12571 69187 3178 33626 246782 149747 -112016 276230 182112 6820 176214 -27671 -206025
12560b06025A89325D6257P9996a01080B124A061L00960a58207A43206k2243b70
12548b58120A25914g2922E7122J2925e8103B18399A02600J09149g6992F0343K18696
12537B79039G0533i9213B37684I5549D3864K16836A00328L42758a77191B29876
12526b31659A53569a09162C69346j48128p3533F478b55207h5126I0985K11500
12516C02485H5642O2776F8490J10552K9493r8633O9054q7792l8426f8827A99211
12504B70809b9470A65872a01150B56788b180B373c05643J42648e095j50263M743
12493a50615K8595l018q7040G5887i1075j03614i1422D7321A2338K21105a07265
12481a68096C24233r8617D1665K2538b26864g1337A49593R5671a00303M1897B2099
$$ plain form
12560 -206025 189325 46257 126253 -101080 2124 1061 302021 -158207 143206 120963 -270
12548 -258120 125914 -72922 57122 70047 -58103 218399 102600 211749 -76992 60343 279039
12537 279039 70533 -99213 237684 95549 43864 260700 100328 443086 -177191 229876
12526 -231659 153569 -109162 369346 221218 147685 6478 -255207 -85126 90985 302485
12516 302485 85642 148418 68490 179042 208535 109902 178956 91164 52738 -68827 199211
12504 270809 -29470 165872 -101150 256788 -2180 2373 -305643 -162995 -5095 -155358 -150615
12493 -150615 -122020 -125038 -212078 75887 -91075 -194689 -91422 47321 12338 233443 -107265
12481 -168096 324233 225616 41665 64203 -226864 -71337 149593 245264 -100303 -58406 22099
12469c9009A42724b9658B718e4603k28604A40154i4184A4673b08320H1075d52197
12457a79635o9006G9152A9648a77243N8060M6238j21148G8416b05241D21768d5244
12445c3133k3655r1102k64839J97474o6359a18842a6268C93128a08953A68055
12434d0627B51945p6275H4220f5956k7930B47677A23388M7809F2521a7289k38241
12423b55530G4054J15859E4214O3049D2307b0018B34729j09191F0446c0268D3332
12411h4522B9645M08002a17670A94639a89165K0924A59430b59803d6670j1229
12401e7899A32845a61225A86251h9327L6292A92886a40080D3249J66863b54166
12390B07083L3622D4091c4638A39994o2256e7385A78256a0877j60757a5438C56593
$$ plain form
12469 -39009 142724 -29658 2718 -54603 -283207 140154 -94184 14673 -208320 81075 -452197
12457 -179635 -248641 79152 19648 -177243 -119183 -72945 -194093 78416 -205241 421768 -45244
12445 -33133 -56788 -147890 -412729 -215255 -281614 -118842 -16268 393128 -108953 168055
12434 -40627 251945 175670 84220 -65956 -93886 247677 123388 171197 62521 -17289 -255530
12423 -255530 74054 189913 54214 117263 42307 -20018 234729 125538 60446 -30268 43332
12411 -84522 29645 437647 -117670 194639 -189165 -168241 159430 -259803 -46670 -57899
12401 -57899 132845 -161225 186251 -89327 -53035 192886 -140080 43249 210112 -254166
12390 207083 240705 44091 -34638 139994 77738 -57385 178256 -10877 -171634 -15438 356593
12378e420A62421c7598B09893p6908J3213a3183F2919a31163E5558a55098F7616
12366A49435K19385j64269p4348o1258J4945R2776a28610A09024J20804F5169
12355H4230Q5995b64985A19269J9532B5810c19558g4416L740o2227A01654m1127
12344F0527a50068e9013H1876b2902A27719g4943J2609j33601A26866B4861P7012
12333A01873a73092B3511N7508a89425C7489b79633A15755b16846R5076j00244
12323b22014e4424l0297J856l3056A50317O7547F05b10422K7199E3118a15467
12311C02583q1952q0332a86370A89587i5419o0980m9490J4444A4543c7063p4394
12300a11457A616K73611a98708G4727F155O4917a23358D4911K83925r8959g7439
$$ plain form
12378 -5420 162421 -37598 209893 132985 146198 -13183 62919 -131163 55558 -155098 67616
12366 149435 368820 204551 130203 68945 83890 176666 -128610 109024 229828 65169
12355 84230 170225 -264985 119269 138801 25810 -319558 -74416 -70676 -132903 101654 60527
12344 60527 -150068 -59013 81876 -22902 127719 -74943 -62334 -195935 126866 24861 101873
12333 101873 -173092 23511 81019 -189425 37489 -279633 115755 -216846 -121770 -222014
12323 -222014 -54424 -84721 -82865 -115921 150317 217864 605 -210422 -183223 53118 -115467
12311 302583 220631 140299 -186370 189587 -95419 -156399 -205889 -191445 14543 -37063 -111457
12300 -111457 1616 275227 -198708 74727 6155 71072 -123358 44911 328836 229877 -77439
12288A4733b05627E0625N9113J33330b09633A19256r606K05075j15730n8030l4698
12277A06267k6885L55811A92865n515C1706J6500J59701j0267b37865b4389j97860
12266b22249B95248b01985C857J67378J84383J35115A20540R6680n5081J5764
12256A77903C6321a15161J8230A24178J2374j7641K6946e1644B25529a3972C35685
12244d9793A58079k1492J09857c1463B88335b78292G9650h9348K0766a3537A80164
12232a53510B23375b4552B11699m3486P1143J20842J7789F2982L58193o7396r3525
12221B60254r2510J70461k722A47766K64720a22089A29741e4992Q655G4998J34367
12210B09365k0232J70869A60217a18480C22938a57642C9689N7389o489K35975
$$ plain form
12288 14733 -205627 50625 109738 243068 -209633 119256 109650 314725 198995 140965 106267
12277 106267 79382 435193 192865 187350 31706 48206 207907 197640 -237865 -24389 -222249
12266 -222249 295248 -201985 3857 171235 355618 490733 120540 217220 162139 177903
12256 177903 36321 -115161 -96931 124178 136552 118911 145857 -51644 225529 -13972 335685
12244 -49793 158079 136587 246444 -31463 288335 -278292 79650 -89348 -68582 -13537 180164
12232 -153510 223375 -24552 211699 168213 239356 360198 377987 62982 421175 353779 260254
12221 260254 167744 338205 335483 147766 412486 -122089 129741 -54992 -46337 74998 209365
12210 209365 189133 360002 160217 -118480 322938 -157642 39689 97078 90589 326564
12200C26564a75762A12154C101J21946K72814j25650j8540J0510b24184c4226
12189B55011J7680J5353j39005b16667F3192K2018d1516B36020o2527a41188C73419
12177G3556j4275d3947A51731J46855g8032b2781A55847e9952B43037A05875p533
12166I8342a37053N9168B50110f6829C5411a0166A54293o9914K02287q3711A8609
12154B62598a20453b551A16556j4121J92777D8511J29331R9180f6519p8662A888
12142B59069c2457E0043M2309C7198K99495F2814a6173C25413a47651O1619A01146
12130A05182c35715H7217M435b5199j3181j4294p2604c9542B8911b3971O488k39395
12118b56878E2217g1764J9949A23581J45695b61254a2805B14272O2601e2962C0888
$$ plain form
12200 326564 -175762 112154 3101 125047 397861 272211 253671 264181 -224184 -34226
12189 255011 272691 288044 149039 -216667 63192 85210 -41516 236020 173493 -141188 373419
12177 73556 59281 -43947 151731 298586 -78032 -22781 155847 -59952 243037 105875 98342
12166 98342 -137053 -77885 250110 -66829 35411 -10166 154293 84379 286666 202955 18609
12154 262598 -120453 -2551 116556 102435 295212 48511 177842 277022 -66519 -145181 1888
12142 259069 -32457 50043 92352 37198 336693 62814 -16173 325413 -147651 -86032 101146
12130 105182 -335715 87217 91652 -25199 -38380 -52674 -125278 -39542 28911 -23971 -17483 -256878
12118 -256878 52217 -71764 -51815 123581 269276 -261254 -12805 214272 276873 -52962 30888
12106A7244K5343K10964d1377A5713K10206M4458h223k15634A6667i915A00319
12094A2828K55738a83880q4517a2898C13414b1328B17614a95930G9122j8350N3831
12083A14603J40741D9809B0077P269e3993k16298a27498p2139N9954O0626B14174
12071b04319B36375g866q0362A01609l7397A1541a3787j32521c6049E48133f8533
12059I2963J6846Q3498a6977G3948R9640F7754K96094j58512P18918K1977C84322
12047A0672a31077f262H5149P917d29567B16888b02243A30930O7699a43859F2160
12035C95726a75929J8939K2662m8449b4728B30937f9165C6186K04062D214f8374
12023F63K2770a95153a6884C29309a99363k0969P8841G8425a00838C72272A25949
$$ plain form
12106 17244 42587 253551 -41377 15713 225919 270377 -8223 -223857 16667 -9915 100319
12094 12828 268566 -183880 -268397 -12898 313414 -21328 217614 -195930 79122 60772 114603
12083 114603 255344 49809 20077 27346 -53993 -270291 -127498 -199637 -139683 -79057 214174
12071 -204319 236375 -7866 -88228 101609 64212 11541 -13787 -146308 -36049 548133 -68533
12059 92963 109809 193307 -16977 73948 173588 67754 363848 205336 924254 946231 384322
12047 10672 -131077 -6262 85149 93066 -429567 216888 -202243 130930 198629 -143859 62160
12035 395726 -175929 -156990 -134328 -182777 -24728 230937 -69165 36186 240248 4214 -68374
12023 663 23433 -195153 -16884 329309 -199363 -220332 -141491 78425 -100838 372272 125949
12011F222O3398R0460f3683n2129E0302a04561A10988b25587f7397I3574D10O10
11999A020m28L8367c29721b7818I2432b4240C48610H5985K37824d40368a02080
11987I7906g8400k23008B70399o7733g222j67924A55073b43665O4638h6856C13641
11975f6773A43438o8873c8869A6265b78072B88503d9986B54865L6602A12840i5191
11963c82019f3523c0903H9051g1696C03508a51719M3079D196L34448A10360b77366
11951B49153B3898b36511D97041G1524J51893j09697f8358J2343k0062A50698
11940b00000D6854J0038b16756A62215R8726J4670h3815A99207P0901a09992F9934
11928a80337j06940h2952J5442p1084J024K4379j80845M9628A2130b13008I5743
$$ plain form
12011 6222 69620 160080 -63683 -115812 50302 -104561 110988 -225587 -67397 93574 410 1020
11999 1020 592 38959 -329721 -27818 92432 -24240 348610 85985 323809 -440368 -102080
11987 97906 -78400 -301408 270399 202666 -7222 -175146 155073 -243665 -179027 -86856 313641
11975 -66773 143438 74565 -38869 16265 -278072 288503 -49986 254865 291467 112840 -95191
11963 -382019 -63523 -30903 89051 -71696 303508 -151719 -108640 4196 338644 110360 -277366
11951 249153 23898 -236511 497041 71524 223417 113720 -68358 -56015 -76077 150698
11940 -200000 46854 56892 -216756 162215 260941 275611 -83815 199207 270108 -109992 69934
11928 -180337 -287277 -82952 -67510 -138594 -137570 -113191 -294036 -244408 12130 -213008 95743
11916g8510C20322c5878r7164E6452L2942a95634G8669e6187B25792c92600L8112
11905c54488g4910B40621q3766m8854C7309d962j8122E295f3676B3440a14418
11893c79980J76041a5034L814G5204a41121D753a24812A55375b72999A85714B1426
11881D7087J4025a02082b1112C1682L27765F7059a25606q9081M3244B53451a70100
11869b8375k37220o6189a7050k3616F1371K7204P3811a56472A21617a33805A07928
11857c0899a44D93517b1305A28913a6789C7045a41666H1256h9854B18398c57430
11845i0585A1014J49551j9859b58663i4547c5773j95028J04578C6554b18977A95474
11833a63555k04237a5911B01906e3405K2326n8242q0129b8884A86104m9743G392
$$ plain form
11916 -78510 320322 -35878 -133042 56452 89394 -195634 78669 -56187 225792 -392600 -354488
11905 -354488 -74910 240621 156855 108001 37309 -4962 -23084 5295 -63676 23440 -114418
11893 -379980 -203939 -15034 -11220 75204 -141121 4753 -124812 155375 -272999 185714 21426
11881 47087 61112 -102082 -21112 31682 359447 67059 -125606 -214687 -171443 253451 -170100
11869 -28375 -265595 -331784 -17050 -40666 61371 88575 162386 -156472 121617 -133805 107928
11857 -30899 -144 493517 -21305 128913 -16789 37045 -141666 81256 -89854 218398 -357430
11845 -90585 11014 160565 140706 -258663 -94547 -35773 -230801 -126223 36554 -218977 195474
11833 -163555 -367792 -15911 201906 -53405 -31079 -89321 -169450 -28884 186104 136361 7392
11821a37690j3464C29964C3571B103R2804N3358a38875C65262a11042j15209g1081
11809d8657l55813a14247A11761A0671L19643c61724a1383A49854a32012q840
11799a40852k72069E2755A3737N2065L34650A4000a74858E8149h6322k38086j37980
11788d62388e01D7564d950H5984a41784p1390G9590a86458A8371b49920A94420
11776c06362O7798B54130b12915A23388C481b26764R2395A13014h165D3955R777
11765E3732P4115m7093R5038M0860C5697e9162l65927a98278A14132a37654L0890
11754a06764G8713k0611b04687I6629M81016a04555b057l6736k51994A04842m5214
11743E9628h898j22457k36570I3258K3978A6006R4372J72758D0998J90202a11590
$$ plain form
11821 -137690 -151154 329964 33571 2103 94907 148265 -138875 365262 -111042 -226251 -71081
11809 -48657 -404470 -114247 111761 10671 330314 -361724 -11383 149854 -132012 -140852
11799 -140852 -412921 52755 13737 65802 400452 14000 -174858 58149 -86322 -324408 -462388
11788 -462388 -501 47564 -4950 85984 -141784 -213174 79590 -186458 18371 -249920 194420
11776 -306362 -238564 254130 -212915 123388 3481 -226764 -134369 113014 -8165 43955 53732
11765 53732 127847 80754 175792 216652 35697 -59162 -425089 -198278 114132 -137654 -106764
11754 -106764 78713 58102 -204687 96629 577645 -104555 -2057 -38793 -290787 104842 59628
11743 59628 -8898 -131355 -367925 93258 117236 16006 110378 283136 40998 231200 -111590
11731A05496d4639A53089a88083I6496a31984p4374M5323j9777A35966n3165Q7634
11720A70435F2579a3604C68252M4400b4774D2912a80666B31856b61985F5774b33848
11708b56774H5685a25289A8236J76810b16024d1351b0118j84761l5376c0356k3193
11697e3549K6462p1891l8529A01873A263J46974J97509g2591A3492a24653A61597
11685a60164a2776q7155B79184j24188m8278m5181o604a70712I6751J38118a67666
11673c92834A2989a79000o6317A14901b45792C06754j02645B7088L7439a7952
11662a9053l04877O1114H1688J52262a26487c5861H557a05526A39863c07128a40723
11650C47701a47232D3323b86256a055j09616H993h1674C5087A7466c51370B69124
$$ plain form
11731 105496 -44639 153089 -188083 96496 -131984 -206358 -161035 -180812 135966 82801 170435
11720 170435 62579 -13604 368252 412652 -24774 42912 -180666 231856 -261985 65774 -233848
11708 -256774 85685 -125289 18236 195046 -216024 -41351 -20118 -204879 -240255 -30356 -53549
11697 -53549 -27087 -98978 -137507 101873 1263 148237 345746 -72591 13492 -124653 161597
11685 -160164 -12776 -99931 279184 154996 106718 61537 54933 -170712 96751 234869 -167666
11673 -392834 12989 -179000 -245317 114901 -245792 306754 204109 27088 64527 -17952
11662 -19053 -323930 -262816 81688 233950 -126487 -35861 8557 -105526 139863 -307128 -140723
11650 347701 -147232 43323 -286256 -1055 -110671 8993 -81674 35087 17466 -351370 269124
11638D968L21009j11357d36917A1494J48248L3085a71822D5437I307M3980b76881
11626B08446A5378a52025A91848K5253o1681a03479j74700g979j12056k01043
11616c21078J41227D52446d1214B90827C1442R8882n8914L52115A4134J75268
11606A89402a40377q8685h3004H9502b78506a28050M6654A49703E2096b52586
11595A05034f023B22211q7339A4387b46098J05850A50485a3894A6780L01451c4699
11583C08164R8346H8198b24575b4428D2436N2561a56951l5661r681B20767A711
11571F5425K50837j28041o9826a57992B17454b00663j9847A06921J68536b25073
11560B48245q2845g9797B14564f7763H2922O2086b3559j13779o330C07915d5j56437
$$ plain form
11638 4968 325977 214620 -436917 11494 159742 192827 -171822 45437 9307 53287 -276881
11626 208446 15378 -152025 191848 217101 155420 -103479 -278179 -7979 -120035 -321078
11616 -321078 -179851 452446 -41214 290827 31442 130324 71410 423525 14134 189402
11606 189402 -140377 -229062 -83004 89502 -278506 -128050 -81396 149703 52096 -252586
11595 105034 -6023 222211 134872 14387 -246098 -140248 150485 -13894 16780 318231 -34699
11583 308164 406510 88198 -224575 -24428 42436 94997 -156951 -192612 -202293 220767 1711
11571 65425 316262 188221 118395 -157992 217454 -200663 -220510 106921 275457 -225073
11560 248245 165400 -79797 214564 -67763 82922 145008 -23559 -137338 -143668 307915 -45 -156482
11548a56482d2717B0870N2179a9387C5822b9012B36432I6204d13548C12664q5438
11537B27226A0421J3513D52a71885C5409c94022B47737G7987K43957b8938G99
11525e013B31024a63909A3451b1664B46927k6242R2380J1243j55250n1736P458
11514A24780a57139f9041A96009k6574f4388B93244H0585b7152n1082B95647H4090
11502B84952B7214L1264J500a68963P2772G7262J51111D3696K8555Q706h6313
11490c4787B80006A01411L5163F6746f5458m2822G716J86928F6355j4390M256
11479E6221A7337J33048C7367A8507h1894r2893A56667j1060a42569A96450l7428
11468A59022K6377G6230J32675o8626Q8646J58000c2794E459K90962j23758a31389
$$ plain form
11548 -156482 -42717 20870 73049 -19387 35822 -29012 236432 96204 -413548 312664 227226
11537 227226 10421 23934 452 -171885 35409 -394022 247737 77987 321944 -28938 799
11525 -5013 231024 -163909 13451 -21664 246927 220685 313065 324308 169058 117322 124780
11514 124780 -157139 -69041 196009 169435 -64388 293244 80585 -27152 -78234 295647 84090
11502 284952 27214 58478 59978 -168963 -96191 77262 228373 43696 72251 80957 -86313
11490 -34787 280006 101411 136574 66746 -65458 -108280 7716 194644 66355 51965 56221
11479 56221 17337 150385 37367 18507 -81894 -174787 156667 145607 -142569 196450 159022
11468 159022 185399 76230 208905 140279 228925 386925 -32794 5459 296421 172663 -131389
11456i6807b8543C11457o959J8180A05395l2939k5752b2822A59150n0128K58215
11445C67237A70054A4325i207j34909a8876j04199N7301n3352A52540b40435G6509
11433G3671K38995F5978K492a68379A44997J84456A01332c3585q1931A79049f4898
11421b09587c2835J1346I0108a0875A87067a72576j49961A87523M3486g7152j71793
11410b48945R5628k7323o8631q902e0004F0919O3453a38998j68967B12860m4503
11399A68357c09j90417b9236C08026b614H8456K365a10985J8513k51113H849J76039
11387A84888J0298O7840A00696i0387a0715H578a38315c0142j02968A08886J12297
11376B21183G5124l2471b70119n7562a2622j8745A45501g3374B10541a23236A41218
$$ plain form
11456 -96807 -28543 311457 304498 322678 105395 72456 46704 -22822 159150 109022 367237
11445 367237 170054 14325 -9207 -144116 -18876 -123075 -65774 -119126 152540 -240435 76509
11433 73671 312666 65978 68470 -168379 144997 329453 101332 -33585 -115516 179049 -64898
11421 -209587 -32835 -21489 90108 -10875 187067 -172576 -322537 187523 231009 -77152 -248945
11410 -248945 -153317 -180640 -249271 -258173 -50004 60919 124372 -138998 -307965 212860 168357
11399 168357 -309 -190726 -29236 308026 -2614 88456 90821 -110985 -92472 -343585 8849 184888
11387 184888 195186 263026 100696 -90387 -10715 8578 -138315 -30142 -133110 108886 221183
11376 221183 75124 42653 -270119 -327681 -12622 -31367 145501 -73374 210541 -123236 141218
11364e1654A70297A6712c59833A3413K4044g4848E4916a48777j73251I5458a61602
11352a58543o8912o3412B2300b35686A2491h3495A53448D8752J02563e6578J8729
11341c7849B15592J0513b3853H0335b8860k30722A45063d6511H4917L2262b15623
11329A21400L92214F2616a97679e3452j35658F1764L2128J1301n1855f4398H9341
11317a72921j05513D65960G6667a9533H5672k4454L59606a65129f1515k14656
11307b76171a06270n9906A7152h1586J5343a2963r9631p8674K7798A01800g5235
11295a23954C308b36048N9623D85262A65039i6065A2404h6583j71723G4242P4025
11284A48267o8014B7511J6773P0996M0378p1911b5359D8308f9439A68028a16743
$$ plain form
11364 -51654 170297 16712 -359833 13413 37457 -74848 54916 -148777 -322028 95458 -161602
11352 -158543 -227455 -290867 22300 -235686 12491 -83495 153448 48752 151315 -56578 -37849
11341 -37849 215592 226105 -23853 80335 -28860 -259582 145063 -46511 84917 117179 -215623
11329 121400 513614 62616 -197679 -53452 -189110 61764 93892 105193 53338 -64398 89341
11317 -172921 -278434 465960 76667 -19533 85672 61218 420824 -165129 -61515 -276171
11307 -276171 -106270 -166176 17152 -81586 -66243 -12963 -112594 -191268 -163470 101800 -75235
11295 -123954 3308 -236048 -176425 485262 165039 -96065 12404 -86583 -258306 74242 148267
11284 148267 80253 27511 44284 115280 155658 83747 -25359 48308 -69439 168028 -116743
11272c1931l48273G9351c2610o9174o9580d0343j45692j09053H674a18152F4421
11260d51313h3676H4343a4397D8283M8471A8808b0576B05142b1080k8274a4292
11248b47418A2580a32391k9737N0916D9045e00177a22397A10226a05904M498L617
11237i7789o2470P9281j68254F8999M0176m7641d7520j93858P4517c0818k03001
11226b33819h080F9526K11872j05788a86832A28727n221K18802f2102j14488A59104
11214A52436d5997p8659c7512j16035j3935k90922a22739n338A09815Q1213K4192
11203B15220e7400p3818F0155c36420a17922k99760a0279m39001A69486H1700
11192a44779B90876a89337k4863D06948E1645a67818j69426l0940i8971g779E4146
$$ plain form
11272 -31931 -380204 79351 -32610 -101784 -171364 -40343 -186035 -295088 8674 -118152 64421
11260 -451313 -83676 84343 -14397 48283 96754 18808 -20576 205142 -21080 -49354 -14292
11248 -247418 12580 -132391 -162128 -111212 49045 -500177 -122397 110226 -105904 -101406 -97789
11237 -97789 -160259 -80978 -249232 68999 109175 61534 -47520 -241378 -166861 -30818 -233819
11226 -233819 -8080 69526 281398 175610 -186832 128727 123506 342308 -62102 -176590 159104
11214 152436 -45997 -124656 -37512 -153547 -167482 -458404 -122739 -128077 109815 191028 215220
11203 215220 -57400 -131218 60155 -336420 -117922 -417682 -10279 -449280 169486 81700
11192 -144779 290876 -189337 -214200 406948 51645 -167818 -337244 -368184 -98971 -7779 54146
11180B77504c7391j37842B4921m042g6064j38400k6323h5380n2970M8968A05249
11168a13260k92957A21054a00685N238l183j73289e1950o0712C27220j21450a3834
11156B07611O8025G7629n060e4374k91525d1507B2678f2724B78959b42295e7008
11144a70354b9634e248j7437k99584a53988A4139Q4410J36342d1306n6566B580
11132A9295L92995h4440k4378l68327A68052m8767K33431A12939m2855J95856
11122B65940i6672R574A15656c0825A75760F2303a06198A11370O4021M0954q756
11111B07589p2667N2621L4996L501e2016A5511L00299a96895C93843I3505a32788
11099G877L64873A11953J66966j37954K8504K5077A0480L03795k2279J70583j77296
$$ plain form
11180 277504 -37391 -175233 24921 20879 -76064 -214464 -240787 -85380 -138350 -89382 105249
11168 -113260 -406217 121054 -100685 -95447 -98630 -271919 -51950 -112662 327220 205770 -13834
11156 207611 275636 77629 72569 -54374 -345899 -41507 22678 -62724 278959 -242295 -57008
11144 -170354 -29634 -5248 -22685 -322269 -153988 14139 98549 234891 -41306 -97872 2580
11132 19295 412290 -84440 -108818 -477145 168052 119285 352716 112939 70084 265940
11122 265940 -96672 -87098 115656 -30825 175760 62303 -106198 111370 175391 216345 207589
11111 207589 134922 187543 222539 226040 -52016 15511 315810 -196895 393843 93505 -132788
11099 7877 372750 111953 278919 140965 169469 194546 10480 314275 291996 462579 285283
11088B85283m2088m2649j7450P3649g3306C46054J2305C582J75070j6788J5345
11077A77209J21821j16533J96513o9183G0062J71663M7708p0539C6020L41174
11067C77194q8925J34864K05218k11124A38481M31936L6719B50312N25221C06901
11056E72081j41470L39011L0066k82846K99243l02523J95271O6968L6697L04457
11046A116955E25181L39849J92007o6214n212P0916k06929j88080K21604J17529
11036A000651J43165E67763M22852k08651J36326j04580k09158K71598M3508j8071
11026I01587k5395C74326L82915O5498j28871K27250r8368k21174L23610j91412
11016G33774l618J616j03861L16861l39222K3710K23192j76181j76525K33086
$$ plain form
11088 285283 243195 200546 183096 256745 -73306 346054 358359 3582 178652 161864 177209
11077 177209 299030 182497 379010 309827 70062 241725 289433 218894 36020 377194
11067 377194 288269 423133 628351 417227 138481 570417 607136 250312 775533 306901
11056 572081 430611 769622 799688 516842 816085 513562 708833 775801 812498 1116955
11046 1116955 525181 865030 1057037 990823 985611 1056527 849598 661518 883122 1000651
11036 1000651 1143816 567763 990615 781964 918290 813710 604552 876150 919658 901587
11026 901587 876192 374326 757241 822739 693868 921118 822750 601576 925186 733774
11016 733774 730156 731772 627911 944772 605550 629260 852452 676271 499746 732832
11006G32832j27158M4794o8718J77677M9073q8867M61498l04198j56457O9557
10996G90033J05646j86755o120j34304K76062k2083k33761M65525k2626p0700
10986I60917L17769l82439J7673J8977L38639n9126l4776M79972q6312L51217
10976A922511J07936N73276M00333K19606J4522j7549K76156l0664k57602n0686
10966C157839k39539l08659m90690j77831k56763l34845J51238J63628n56541
10957A107837R5205J21869j02568K13983m17714m50945J35890k3164K98410l77193
10947F01610n8659B57268Q1939J02798M7467E8212M05772D1693K87332I8852J58037
10936B56889c4747A98788E7166K0802J67408A11680L77060j70618j19100q6781
$$ plain form
11006 732832 605674 650468 581750 759427 808500 719633 1181131 876933 720476 790033
10996 790033 895679 708924 702804 568500 844562 822479 588718 1054243 1031617 960917
10986 960917 1278686 896247 913920 932897 1271536 1212410 1177634 1657606 1571294 1922511
10976 1922511 2030447 2603723 3004056 3223662 3238184 3220635 3496791 3466127 3208525 3157839
10966 3157839 2918300 2609641 2118951 1941120 1684357 1349512 1500750 1664378 1107837
10957 1107837 1203042 1324911 1222343 1436326 1018612 567667 703557 680393 978803 601610
10947 601610 542951 257268 339207 442005 489472 58212 463984 41693 329025 98852 256889
10936 256889 -34747 198788 57166 77968 245376 111680 488740 318122 199022 112241
10926A12241i9091A18955b30656B15460h346C219d4644k37187A95396j2844e3733
10914I0321c0537A7423d8319k6531o1174E352J98071J85184j63045I2051l6422
10903E5629g545j71744I5189K2725K06171q1944M3470A34820D0852b62670R7209
10892a65461A04969K14759H1003e36119b48260B31561d0142q2424B9540c94550
10881a68999j72763E7396L8855B3735b73143a10655j22016a1940j50150A33184
10870F698b519D4247B1741h6335I0772a7937A35634A3865N6769a1221j411l3524
10858d6156j7499j44121j84913g4956l18395I1139f9560K8870j25244a9034E71736
10846a33680J7002A0738J01010K9964b11148D8405c8272k34551F865a48158e2629
$$ plain form
10926 112241 -99091 118955 -230656 215460 -8346 3219 -44644 -281831 195396 182552 -53733
10914 90321 -30537 17423 -48319 -74850 -136024 5352 203423 388607 225562 92051 55629
10903 55629 -7545 -179289 95189 117914 324085 242141 285611 134820 40852 -262670 -165461
10892 -165461 104969 319728 81003 -536119 -248260 231561 -40142 -122566 29540 -394550
10881 -168999 -341762 57396 96251 23735 -273143 -110655 -232671 -11940 -162090 133184
10870 6698 -2519 44247 21741 -86335 90772 -17937 135634 13865 70634 -11221 -12632 -46156
10858 -46156 -63655 -207776 -392689 -74956 -393351 91139 -69560 -40690 -165934 -19034 571736
10846 -133680 -116678 10738 111748 141712 -211148 48405 -38272 -272823 6865 -148158 -52629
10834D1533a65932L0490e7460o5290B67361j20817o1721b25741n3137d2061j99002
10823b41063J06317B49688m9620e52702a7272j16852C37168a30780j45062A24262
10812d81595A76621e7454A30558B2952b43507F2036K00639b06516Q4243c1442
10801A94406b7853J2366k44578d5209A02627f049I4552j9955d8722k46403a30848
10789d6485k7766c1945A396Q3525B8535K56305i2130C21847H5020a1140j25085
10778a36225G9564l8713J06225c8805k40099A56672J760c30041B19092c531j45442
10767a48973B05978B7182b92257j59486B43539c26325F8845J78151a03950P71
10757a03179A38712a11162B10576b81384B11963e3074l0941D8162J87979h7352
$$ plain form
10834 41533 -165932 -135442 -57460 -122750 267361 146544 84823 -225741 -278878 -42061 -241063
10823 -241063 -134746 249688 200068 -552702 -17272 -134124 337168 -130780 -275842 124262
10812 -481595 176621 -57454 130558 22952 -243507 62036 262675 -206516 -122273 -31442
10801 194406 -27853 -15487 -260065 -45209 102627 -6049 94552 74597 -48722 -295125 -130848
10789 -46485 -74251 -31945 1396 84921 28535 284840 -92130 321847 85020 -11140 -136225
10778 -136225 79564 40851 147076 -38805 -278904 156672 158432 -330041 219092 -3531 -148973
10767 -148973 205978 27182 -292257 -451743 243539 -326325 68845 246996 -103950 -103179
10757 -103179 138712 -111162 210576 -281384 211963 -53074 -84015 48162 236141 -87352
10746c01762A77342l0506b61059f4201j16834A66162B494d736q3211q7116b0729
10734e0844j10493A18319c77471P9173B11964a02417K7742A24960K67268I1904
10723b6261l3326H3080a7880l6336k93090C55564B316a4917C6794Q0989a63453
10711A85321h7993A25788h7558J0326k28037Q0530C02764c99k94308d6859j10581
10700a57440C70170a85120B42908H8585b00987b0810d899B80412I1957c00792
10689C4519a22902N9992p0614A3332J47598a6610m4425p2959k36224A74933q7288
10678H7645L0658d7717k43297B75209b64380a28576A5379d09151i8406G3875j2048
10667F1827h5914j70836h1373j97240B11797B2852P3766O5608K58957B07230a23384
$$ plain form
10746 -301762 177342 146836 -261059 -64201 -181035 166162 2494 -4736 -87947 -175063 -20729
10734 -50844 -161337 118319 -377471 -298298 211964 -102417 -74675 124960 392228 91904
10723 -26261 -59587 83080 -17880 -54216 -347306 355564 2316 -14917 36794 117783 -163453
10711 185321 -87993 125788 -87558 -77232 -305269 -224739 302764 -399 -294707 -46859 -157440
10700 -157440 370170 -185120 242908 88585 -200987 -20810 -4899 280412 91957 -300792
10689 34519 -122902 -62910 -133524 13332 160930 -16610 -61035 -133994 -370218 174933 87645
10678 87645 118303 -47717 -291014 275209 -264380 -128576 15379 -409151 -98406 73875 61827
10667 61827 -85914 -256750 -81373 -278613 211797 22852 96618 162226 421183 207230 -123384
10655f4585B5324a12045A06278P1487a55292D5877J67921a39323d465j55624O2734
10644i7355G8273Q0729l7346m3585J30015b60860Q8823Q4337D76921A91748c3166
10632c20375d5102G7334c96448O8167a6457k07995d0334E4300b95284L8785c5804
10620B4337d7670l0003n6567J0430j02726e7554A15049b6280E825b95634J39688
10609a55946B7259a97893j18461A36148E8525L0921M5689a75787N4464r7043N3113
10598a65253k2000a5742l5710E5166f2770H7073J07119b8209E3519d17303f2442
10586a38788n3929N955F2785Q8561J4001a64101a232l8626A28770j5666B868N2322
10574E5190J16388a28048F8623L1243b27799E7104h1204j49432j05145Q2705A33828
$$ plain form
10655 -64585 25324 -112045 106278 177765 -155292 45877 213798 -139323 -4465 -160089 -97355
10644 -97355 78273 159002 121656 78071 208086 -260860 -172037 -87700 476921 191748 -33166
10632 -320375 -45102 77334 -396448 -328281 -16457 -224452 -40334 54300 -295284 -256499 -35804
10620 24337 -47670 -77673 -134240 -123810 -226536 -57554 115049 -26280 5825 -295634 -155946
10609 -155946 27259 -197893 -316354 136148 58525 89446 135135 -175787 -121323 -218366 -165253
10598 -165253 -187253 -15742 -51452 55166 -62770 87073 194192 -28209 53519 -417303 -62442
10586 -138788 -192717 -186762 62785 151346 165347 -164101 -1232 -39858 128770 113104 2868 55190
10574 55190 171578 -128048 68623 99866 -227799 57104 -81204 -230636 -335781 -253076 133828
10562a98955h3l3913a124k1502R031q9718k8104A30729c48101f3347n1752K8269
10550h6830B59595b319A2415R3680N28123A2126J51672c86264J68014E1550d13335
10538d3094k24571d2525q6000A2183a63603k86265H6307A6798a05123p8613p4751
10527b58487J16741l7587K5316c0541A3005f9051C5626i3589f973r1511j37415
10516b35899q4370B5193a70837A1169J34950D6895c4528A521c63411a40271G4331
10504a1072j56141D7604M9844J2234d1852j82399j23562A95447D601M7965f2600
10492c1381k2220p7293b904j65264E1009a53167A89861c13108A17395f0699l1664
10481i2363E8739i5960C4625K50349A03383L71656j93350I1651J46071o4789b44676
$$ plain form
10562 -198955 -83 -33996 -1124 -22626 -13595 -103313 -131417 130729 -348101 -63347 -115099 -86830
10550 -86830 259595 -2319 12415 106095 634218 12126 163798 -386264 -218250 51550 -413335
10538 -43094 -267665 -42525 -128525 12183 -163603 -449868 86307 16798 -105123 -183736 -258487
10527 -258487 -141746 -179333 -154017 -30541 13005 -69051 35626 -93589 -6973 -98484 -235899
10516 -235899 -320269 25193 -170837 11169 146119 46895 -34528 1521 -363411 -140271 74331
10504 -11072 -167213 47604 97448 109682 -41852 -224251 -347813 195447 4601 52566 -62600
10492 -31381 -53601 -130894 -2904 -168168 51009 -153167 189861 -313108 117395 -60699 -92363
10481 -92363 58739 -95960 34625 284974 103383 475039 281689 91651 237722 172933 -244676
10469b51264a0277I034O9308i7381J7087j88042F0524q628c0201j67759C77903
10457b76987a20660B37952p0305a2752q436B32929G7768k6116J50969D2492J34019
10446A76511a17036d4561C78327b03089A95128a71531O8980A56121i0012G220
10435B94965j30882F6123e1377b4127m8258C17830a21439M4935a4898B65185A01057
10423A6437h4209m551k9555B1742J0809f9602k30238J43925i100A45112b58206
10411a05034A09904n2157k1870f3728j02656N7715D8240d1269A56856k5031n3816
10400G8009a06188B17672r2598E5663M2655a17787B9254a32569B52058G5303a1445
10388A38638J00301a57903e3434B77111c15224H9309J25069c8482B33369d2474
$$ plain form
10469 -251264 -10277 9034 78342 -97381 -80294 -268336 60524 51896 -30201 -197960 377903
10457 -276987 -120660 237952 167647 -12752 -21188 232929 77768 51652 202621 42492 176511
10446 176511 -117036 -44561 378327 -203089 195128 -171531 -102551 156121 -90012 7220
10435 294965 164083 66123 -51377 -24127 -72385 317830 -121439 -76504 -14898 265185 101057
10423 16437 -84209 -88760 -118315 21742 32551 -69602 -299840 -155915 -9100 145112 -258206
10411 -105034 109904 57747 35877 -63728 -166384 -108669 48240 -41269 156856 131825 78009
10400 78009 -106188 217672 125074 55663 98318 -117787 29254 -132569 252058 75303 -11445
10388 138638 238939 -157903 -53434 277111 -315224 89309 214378 -38482 233369 -42474
10377E66376A62315J91403J15339J19579B22772E8232J57161K30211j10484J35565
10367D70685A6553N14799j54435J33433J24948k24910j34519N6043J92085f8728
10356B17689Q0131r6670J86841o6667J68362J21469J17373K65140D64987J305
10346D66292B25597k9129J49426J65701h935E2878K62985j24202k2787D6116K17015
10335B63131J9478a1999A0498L90843A25913a38280B77657b5815I4383J36452
10325B30835i787F70401B52453J66956j78766J39374j61727Q2871r5114H746M47630
10314D56376A08731g1076A73939D9763K74163a02998A597J9715N7498f4731j05431
10303a70162k05395E3298a16524B12626i5260m2535B09574p5108O6799f7835H1662
$$ plain form
10377 566376 162315 353718 469057 588636 222772 58232 215393 445604 335120 470685
10367 470685 16553 531352 376917 510350 635298 410388 275869 331912 523997 -68728
10356 217689 297820 201150 387991 321324 489686 611155 728528 993668 464987 466292
10346 466292 225597 196468 345894 511595 -8935 52878 315863 191661 168874 46116 263131
10335 263131 282609 -11999 10498 401341 125913 -138280 277657 -25815 94383 230835
10325 230835 -9787 670401 252453 419409 240643 380017 218290 301161 206047 8746 456376
10314 456376 108731 -71076 173939 49763 323926 -102998 1597 21312 78810 -64731 -170162
10303 -170162 -375557 53298 -116524 212626 -95260 -137795 209574 134466 201265 -67835 81662
10291a06885A93358f3017l62822J57095c7406A92814g7702j14174e7092A17305
10280I186J2100b55440j42779A68621b72698J12415j1343B4785R0248k4283j1399
10269G9351a66861L4315A94534r2139n0105J56329F5792k877J72891R6537j30255
10258B02088I0340M63528j16562r8108A35932b90204B8902a03957A30177c50582
10247A43890b6186A692O8285c60601A24455c38273C13222j1530G547M14436a5233
10235a01455j72232C48665E0031a5103k24133M8636n3845c3898I6549a67212A60521
10223g2033k43094a07497K4847L7747b1296m7019k3408I2421b94218J02271f7937
10211a7913n6649A97516b75548a20645B95053j41061a67909A22161J17234k5662
$$ plain form
10291 -106885 193358 -63017 -425839 -268744 -37406 192814 -77702 -191876 -57092 117305
10280 9186 21286 -255440 -398219 168621 -272698 -160283 -171626 24785 115033 90750 79351
10269 79351 -166861 -132546 194534 102395 52290 208619 65792 62915 235806 332343 202088
10258 202088 90340 553868 437306 339198 135932 -290204 28902 -103957 130177 -350582
10247 143890 -26186 1692 69977 -360601 124455 -338273 313222 301692 7547 421983 -15233
10235 -101455 -273687 348665 50031 -15103 -239236 -190600 -244445 -33898 96549 -167212 160521
10223 -72033 -315127 -107497 -82650 -44903 -21296 -68315 -91723 92421 -294218 -191947 -67937
10211 -17913 -74562 197516 -275548 -120645 295053 153992 -167909 122161 239395 213733
10201B13733n8051o1003b36168h1057o7965D1397a19501c2583B31718g02372a04116
10189d18328M2692J32794J18318A39886J20854j6042i8247j30894O0492C6762
10178b52611j22190B34960c5569j88111Q5718d5114q756F0985L48097b29852d4285
10166a13364F2970a46901b7316k4319p9660A33644O8342n3454b30566b1084A05971
10154A0359a7170B14353a27118m6151f3702m5656d9419A79649b77142E8721A8875
10142e9672k54238J29567A21549a48180a6319p6777q0006M4832c1205j29324m4799
10131b05328C03360c97481J54740g948k50069c5573F2702c0464r5806o8405A2749
10119b31088a2338A38844B2238O837K00825b53367i78m4209F7723A7969a08670
$$ plain form
10201 213733 155682 94679 -236168 -81057 -149022 41397 -119501 -32583 231718 -702372 -104116
10189 -418328 -375636 -242842 -124524 139886 260740 244698 -98247 -229141 -168649 36762
10178 -252611 -374801 234960 -35569 -223680 -137962 -45114 -53870 60985 409082 -229852 -44285
10166 -113364 62970 -146901 -27316 -51635 -131295 133644 201986 148532 -230566 -21084 105971
10154 10359 -17170 214353 -127118 -173269 -63702 -109358 -49419 179649 -277142 58721 18875
10142 -59672 -313910 -184343 121549 -148180 -16319 -93096 -173102 -128270 -31205 -160529 -205328
10131 -205328 303360 -397481 -242741 -7948 -258017 -35573 62702 -30464 -126270 -194675 12749
10119 -231088 -12338 138844 22238 29075 229900 -253367 -978 -45187 67723 17969 -108670
10107a26873J4006n8485J0475e4252a0837l94699A3788b65927g7562H5688c87114
10095b2698H5282b14771K0425A43772B8676e3540A14351q316l3205b72718A48623
10083a79308N6524B35083a9241k16862f2809B70689j26246f2948k52447e9051
10072d05462J86885M2336B67628d32946a76719B4955a48139C9800N597c0108j12370
10061a42478m6155c6865B24957m0487b37221N1728k00070Q4223k3845j36984B8334
10049A25202b23030M5597A9792I590J13474a80460k17363F6315d5795A19980a07656
10037A76783a28892H4583b28247q7499h4385j03987h5869A23351a47340O054G0441
10025B13486a77093l49101C00040a99432g799A66381M171n1606J43619h2477a0674
$$ plain form
10107 -126873 -112867 -171352 -160877 -54252 -10837 -405536 13788 -265927 -77562 85688 -387114
10095 -22698 85282 -214771 -194346 143772 28676 -53540 114351 106035 72830 -272718 148623
10083 -179308 -122784 235083 -19241 -236103 -62809 270689 144443 -62948 -315395 -59051
10072 -405462 -218577 -176241 267628 -432946 -176719 24955 -148139 39800 45397 -30108 -142478
10061 -142478 -188633 -36865 224957 184470 -237221 -185493 -385563 -301340 -325185 -462169 28334
10049 125202 -223030 -177433 19792 9590 123064 -180460 -397823 66315 -45795 119980 -107656
10037 176783 -128892 84583 -228247 -315746 -84385 -188372 -85869 123351 -147340 -141286 70441
10025 213486 -177093 -526194 300040 -199432 -7799 166381 170552 118946 262565 -82477 -10674
10013I831c48352a10949G6638Q4217C7630K6943a86614l7188a5666j00148A22158
10001A33560f3316I5500b06872O2085H9538L2675M7109a13386L0776j77473N7568
9990b02515K7777q7129J27386A42869a58012k6474B37322a00572b5119E9979O7257
9979A27236j1966a03382j61301c737o9679j60762b0577k22500M8967J583A98400
9967B23316c50667a44535j10903A18796b38033R6301C0254b18025J8940C7708
9956D5302f3151J1347e279l9827p1596B35416A05368K8256J87938a82254l6224
9945b18478l1622j58350a04374L2310G4337g5664h364m6189j0744A36788b25132
9933b43767R5434M0331o6886A231L0799a84295N626D5242b8550A4999K4096a00446
$$ plain form
10013 9831 -348352 -110949 76638 160855 37630 64573 -186614 -223802 -15666 -115814 122158
10001 133560 -63316 95500 -206872 -144787 89538 122213 169322 -113386 -82610 -260083 -202515
9990 -202515 -174738 -261867 -134481 142869 -158012 -184486 237322 -100572 -25119 59979 127236
9979 127236 115270 -103382 -264683 -3737 -73416 -234178 -20577 -243077 -194110 -192527 198400
9967 223316 -350667 -144535 -255438 118796 -238033 -141732 30254 -218025 -199085 37708
9956 45302 -63151 -51804 -5279 -45106 -116702 235416 105368 133624 321562 -182254 -218478
9945 -218478 -250100 -408450 -104374 -72064 74337 -75664 -8364 -54553 -65297 136788 -225132
9933 -243767 -148333 -108002 -174888 1231 32030 -184295 -178669 45242 -28550 14999 39095 -100446
9920b27731D288a97928A1575a83311j59414O3479i1407B36049a38625A13891A2955
9908c65965A00045J969b81666m9491J14861g8998H0097b72767e4726n7202N2187
9897e9741j85519D7026b72002M3982k32765a14309o8526o0766f6221l956k15037
9886b85214j8106M8295Q0256e1861q4600d1159j68853F0379b92372j654N6269
9875b37757N6949D21083b02461C4476Q1472m6823K24679c29969k753c7237l69944
9864d07181J74865C06592A32265D0969P3504c62506a2086A61295n8853N1283a94465
9852A38161g2988r3501g2036B44260I5620f2907H1950M7367M3027b01563A61573
9840A33790A9493a85404c702B94496A34637B9125d454j71863F7777A2709K05851
$$ plain form
9920 -227731 4288 -197928 11575 -183311 -342725 -279246 -91407 236049 -138625 113891 12955
9908 -365965 100045 102014 -281666 -331157 -216296 -78998 80097 -272767 -54726 -111928 -59741
9897 -59741 -245260 47026 -272002 -228020 -460785 -114309 -182835 -243601 -66221 -70177 -285214
9886 -285214 -303320 -255025 -174769 -51861 -136461 -41159 -210012 60379 -292372 -294026 -237757
9875 -237757 -180808 421083 -202461 34476 115948 69125 293804 -329969 -332722 -37237 -407181
9864 -407181 -232316 306592 132265 40969 114473 -362506 -12086 161295 102442 153725 -194465
9852 138161 -72988 -166489 -72036 244260 95620 -62907 81950 129317 172344 -201563 161573
9840 133790 19493 -185404 -3702 294496 134637 29125 -4454 -176317 67777 12709 218560
9829B18560q989f0726F0010L6763m3032K25355b70654I3155c9929F1201h1668
9817D9503a20077J9827K5761r3001k23202F6196a1628l32832i1390d4527J768
9806d2759j34015N5759e0226j05023A38286L7838C5648c31545A54448A5070a69105
9794B58557b7954H8483j0280c1142j78832k0105a04627A28317a104B9358d08083
9782A27204g0384k85003G7599b24256p6186R5938B3571b96281A27622d07864a94873
9770F94c88929D2522b75569a2349A27009b55652J06833d7843k13961A25113a35145
9758b87521j28937p039g1074o3804B43446d4833j34588A54407e0280o0950j55240
9747b66470e5810B72959b84633c8727l86719a45472j53775B13560J10363C9804
$$ plain form
9829 218560 209571 -60726 60010 96773 53741 279096 -270654 93155 -39929 61201 -81668
9817 49503 -120077 -100250 -74489 -167490 -390692 66196 -11628 -344460 -91390 -44527 -42759
9806 -42759 -176774 -121015 -50226 -155249 138286 176124 35648 -331545 154448 15070 -169105
9794 258557 -27954 88483 78203 -31142 -209974 -230079 -104627 128317 -1104 29358 -408083
9782 127204 -70384 -355387 77599 -224256 -300442 -204504 23571 -296281 127622 -407864 -194873
9770 694 -388929 42522 -275569 -12349 127009 -255652 -148819 -47843 -261804 125113 -135145
9758 -287521 -416458 -423497 -71074 -134878 243446 -44833 -179421 154407 -50280 -111230 -266470
9747 -266470 -55810 272959 -284633 -38727 -425446 -145472 -299247 213560 323923 39804
9736h8643R354k57299M1552a3944j41224r8547h8547J8433j25019g4922b3629
9724C93155c09554e7212o3609B83826r6773i4715q8308a5102j76053c9913j64874
9713b04787g283C0134J94432b58266a10102A28320a80023k51847K13891j22209
9703c40188c0608k10689K499N175J03161c0520J3261n6368j05204C653J14804
9692A18457a4301k32218R8656k69663B31085d6074j13598J894b6460j46552F781
9680d13856A90099A5919J45317F6263k0061M4344a44806G9023J76401H4500a50749
9668B33830r2202a79450f2366k08198a08653k8764I3065a15062B98872c1985r775
9657d1760N100B8191i6175n1367L8315q5706k9240j03039d2120q0957j72570a14269
$$ plain form
9736 -88643 -79289 -336588 -295036 -13944 -155168 -253715 -88547 -70114 -195133 -74922 -23629
9724 393155 -309554 -57212 -120821 283826 187053 -94715 -183023 -15102 -191155 -39913 -204787
9713 -204787 -7283 30134 224566 -258266 -110102 128320 -180023 -431870 -217979 -340188
9703 -340188 -30608 -241297 -238798 -233623 -130462 -30520 -17259 -73627 -178831 3653 118457
9692 118457 -14301 -246519 -147863 -417526 231085 -46074 -159672 -157778 -26460 -173012 6781
9680 -413856 190099 15919 161236 66263 46202 90546 -144806 79023 255424 84500 -150749
9668 233830 141628 -179450 -62366 -270564 -108653 -137417 93065 -115062 298872 -31985 -41760
9657 -41760 -36660 28191 -96175 -147542 -109227 -194933 -224173 -327212 -42120 -123077 -295647 -114269
9644B05548a997A41625b69871m6023A25092e637j0045C695G25a72781A30368e2354
9631C4794H522a2536m5423D336J85446c4745j02305M7301j07798G3479j3976q625
9619E0878g5457B35071b9640l7830C83387j30549o5972b95007e7103p4618j7187
9608a48908j63178a25840j14416j61373D4984j9323g2189Q833I2393a56161N8893
9597i7268b9891j15983p5302d4493J561k28234I61b27688g1055D0427c5884C9623
9584h7744M2915J0101B16017a4849j640o8158B28660o8762M4980b38427c0284
9572a86861A84856a23326f1168D85293G2709l5311b5908A05242i3763j20374G3630
9560f1207n0313j12982a933k24012A40851a60424E1576c79312L1421J73620k6216
$$ plain form
9644 205548 -1997 141625 -269871 -315894 125092 -5637 -15682 3695 725 -172781 130368 -52354
9631 34794 8522 -12536 -57959 4336 189782 -34745 -137050 -89749 -197547 73479 59503 50878
9619 50878 -75457 235071 -29640 -67470 383387 252838 186866 -295007 -57103 -131721 -148908
9608 -148908 -312086 -125840 -240256 -401629 44984 25661 -72189 -63356 92393 -156161 -97268
9597 -97268 -29891 -145874 -221176 -44493 -42932 -271166 961 -227688 -71055 40427 -35884 39623
9584 -87744 -44829 -34728 216017 -14849 -16489 -84647 228660 159898 204878 -238427 -30284
9572 -186861 184856 -123326 -61168 485293 72709 37398 -25908 105242 -93763 -214137 73630
9560 -61207 -111520 -224502 -1933 -225945 140851 -160424 51576 -379312 -347891 -174271 -200487
9549b00487e3028m3214A84747h3618j3861M4076A68163a91983H837a71644e425
9537A02841c08210K0364N0247N2373j09943J44117c0172A84910f0360G9554f1769
9525a05643r9709i4381k5875l5360B6607f9674j15080j3g2413q3055N8793H8427
9512b05686P133K8999j19690a03923M8198l42529b1734l6593A58577b98882D4348
9500d36034m795b5938A06013i6723j63313q434j20598A20037E7479M0458a52251
9488g8970K7655o9536e9634K0514j77760A53180a63783c5421A02261a27760r378
9477a37138A1334a14059j4110j01220R2184q1106J08973A67889q0731g1779p811
9466g9590C6475d586A25384a82064f2750j21868d0424e161m7364A48555p0298
$$ plain form
9549 -200487 -53028 -96242 184747 -83618 -97479 -53403 168163 -191983 8837 -171644 -5425
9537 102841 -308210 -287846 -237599 -185226 -295169 -151052 -30172 184910 -60360 79554 -61769
9525 -105643 -205352 -94381 -120256 -155616 26607 -69674 -184754 -184767 -72413 -155468 -96675 88427
9512 -205686 -198553 -169554 -289244 -103923 -55725 -398254 -21734 -58327 158577 -298882 44348
9500 -436034 -440829 -25938 106013 -96723 -260036 -268470 -389068 120037 57479 97937 -152251
9488 -78970 -51315 -120851 -59634 -39120 -216880 153180 -163783 -35421 102261 -127760 -137138
9477 -137138 11334 -114059 -128169 -229389 -137205 -218311 -109338 167889 87158 -71779 -79590
9466 -79590 36475 -4586 125384 -182064 -62750 -184618 -40424 -5161 -52525 148555 78257
9455G8257f9896B16031c41719a08562A10716E530N1333b25837G8522j8684c37940
9443b06690A56168i1530A20116d5927j26935k0584q581g0364k92510A07655a53565
9431H9764J14804a67530j02935c7569p2529I0033c1596j83578C5129b2245G083
9419B31767a28861j25060A51642b30800d8007p5512a6990k40584N7232A0393b02925
9407A50614P7222j1516a7653o7778C79599H3352J45872r9915J88390R85D7377
9395a55668D2378c18896J5399g0572D51942d16584d626j9650j38571I0367Q1527
9384A71894b67619B73467F3259F413d89409a48285b0865k24182k6706j06704R0338
9373b88119f3602F4005d57780J20723J20395C9791i3570j23306a07735c4561I079
$$ plain form
9455 78257 -69896 216031 -341719 -108562 110716 5530 56863 -225837 78522 59838 -337940
9443 -206690 156168 -91530 120116 -45927 -172862 -193446 -202027 -70364 -362874 107655 -153565
9431 89764 204568 -167530 -270465 -37569 -110098 90033 -31596 -215174 35129 -22245 7083
9419 231767 -128861 -253921 151642 -230800 -48007 -123519 -16990 -257574 -200342 10393 -202925
9407 150614 227836 216320 -17653 -85431 379599 83352 229224 129309 317699 318684 47377
9395 -155668 42378 -318896 -303497 -70572 451942 -416584 -4626 -24276 -162847 90367 171894
9384 171894 -267619 273467 63259 6413 -489409 -148285 -20865 -245047 -271753 -378457 -288119
9373 -288119 -63602 64005 -457780 -337057 -216662 39791 -93570 -216876 -107735 -34561 9079
9361a38556l7311g5536l0533C30262i1779j97372b4544N108A26561m9635j3218
9350F3708c77281e6576A2383N4261h5557A29547J17952a93920a1649C45125d52799
9338a7878A08880N2957a21198k44231A10507H395b29914G3647b319A01280b90566
9326a47458P981k05625I8980M4242p1232d1350A42672j8369a41083a8624k31590
9315b50214A53950c0541A77016K5695l9164b16368B3827f0504k77925E3261D581
9303B29759b02392c0139n1023k44016E5937h5525m0210B6839i6562B12675i4624
9291a87950O9200n2655B518M6670d1659j36164k53547B46314b68765A3160m746
9280H414d2541B55242A21418n4311c91399J94887C11460A542R0227a24599m5540
$$ plain form
9361 -138556 -175867 -75536 -106069 330262 -91779 -289151 -24544 -19436 126561 76926 63708
9350 63708 -377281 -56576 12383 66644 -85557 129547 247499 -193920 -11649 345125 -452799
9338 -17878 108880 161837 -121198 -365429 110507 8395 -229914 73647 -2319 101280 -290566
9326 -147458 -139477 -345102 98980 143222 71990 -41350 142672 124303 -141083 -18624 -250214
9315 -250214 153950 -30541 177016 202711 163547 -216368 23827 -60504 -338429 53261 4581
9303 229759 -202392 -30139 -81162 -325178 55937 -85525 -125735 26839 -96562 212675 -94624
9291 -187950 -118750 -171405 2518 49188 -41659 -177823 -431370 246314 -268765 13160 8414
9280 8414 -42541 255242 121418 67107 -391399 -196512 311460 1542 91769 -124599 -170139
9269a70139A17960a32629F1941i4118B57043b25334B36199p0507c20677a24370
9258a42328m4126G9290L0642l362g0773j59521R4419A14717a04763N883A56401
9246b28699N2388A30900a89098b2857j19688c0410q9467A26821a80778D4700h1385
9234a56049n6087B23186C3333J18536o2591A6504b01971h9108j11108R3585B5114
9222a512k05173H4439a68251j5604L1789D6302a78568j11374J02228E7133J33534
9211A90667b93975A49082c21294R3606j73772F7842J16173G757a27447m4993B32662
9199D34b62434G96P5774h9546l0871j1646m80679C6135a09636L6160K8979m3276
9187h7773J3441J1108j92888I1730N6547c02333c1570C25052a33869N2833C04395
$$ plain form
9269 -170139 117960 -132629 61941 -94118 257043 -225334 236199 165692 -320677 -124370
9258 -142328 -186454 79290 109932 106570 -70773 -230294 -135875 114717 -104763 -98880 156401
9246 -228699 -176311 130900 -189098 -22857 -142545 -30410 -119877 126821 -180778 44700 -81385
9234 -156049 -212136 223186 33333 151869 89278 16504 -201971 -89108 -200216 -106631 25114
9222 -1512 -206685 84439 -168251 -183855 -152066 46302 -178568 -289942 -187714 57133 190667
9211 190667 -293975 149082 -321294 -227688 -401460 67842 184015 7757 -127447 -172440 232662
9199 434 -262434 796 76570 -89546 -120417 -132063 -612742 36135 -109636 -73476 -44497 -87773
9187 -87773 -74332 -63224 -256112 91730 148277 -302333 -31570 325052 -133869 -81036 304395
9175b70677a03375C5912M2404e0676j54362E3788K6572k794g0256K1524B12231
9163B75984a92602j44672F0666h2258G0849R4179a55732A34348a00149D9976j3722
9152C6254Q6093h1365l18431a77237B22117D2131d3323r1394A95287a17035N89
9141a16446j13539E9043a9701J291j46119N5143k59772J84307A50321a21333C8031
9129h8368K5306m05641H9058m617a74315A67720C3007O1652M5065j5453L6620
9118A60891c40041M499a31445E492h2887j73606g5918j22702F4673f70656C6303
9106F6150h0840j56260A74359h4630k32628G7310r369A6076b72815A51825m5632
9095A06193a52883k15278e1784j05223O8405j57913a3651k5751j18956g8474B4793
$$ plain form
9175 -270677 -103375 35912 78316 -50676 -205038 53788 80360 77566 -70256 -48732 212231
9163 275984 -192602 -337274 60666 -82258 70849 165028 -155732 134348 -100149 49976 36254
9152 36254 122347 -81365 -399796 -177237 222117 42131 -43323 -134717 195287 -117035 -116446
9141 -116446 -229985 59043 -19701 -18410 -164529 -109386 -369158 -184851 150321 -121333 38031
9129 -88368 -63062 -468703 89058 84441 -174315 167720 33007 94659 139724 124271 160891
9118 160891 -340041 -335542 -131445 5492 -82887 -256493 -75918 -198620 64673 -670656 36303
9106 66150 -80840 -237100 174359 -84630 -317258 77310 67941 16076 -272815 151825 106193
9095 106193 -152883 -368161 -51784 -157007 -88602 -246515 -13651 -39402 -158358 -78474 24793
9083c03824B74736d4846j37606j0268E6517J85882a08336F4539A1823c27864a10210
9071b93752C02866d3395A61145C6407a09081p3059q2222A13910h745I9049J09158
9060B08207L9783c40488J13183j2785f318k05543E8022N8727a58538c6921C1447
9048A59628o3458b54361C33320b7089A67269b9347l45487G9790d15536J34361
9038b81175a24371p195C0674a36278L4910F5511b93675i905A42557N9971R931
9027B12459b03983N2034C8330d6454l85255h6804h169l16349B82261j37847c2604
9015c04245m4539A25265a35853G4342i2094B4051a26432A91540a94456C32646
9004B15446G830a96128e9359b6734E498a03403k91431A66893i6895B0801b07167
$$ plain form
9083 -303824 274736 -44846 -182452 -192720 56517 242399 -108336 64539 11823 -327864 -110210
9071 -293752 302866 -43395 161145 36407 -109081 -182140 -264362 113910 -8745 99049 208207
9060 208207 247990 -340488 -227305 -240090 -6318 -211861 58022 116749 -158538 -36921 31447
9048 159628 96170 -254361 333320 -27089 167269 -29347 -374834 79790 -415536 -281175
9038 -281175 -124371 -131566 30674 -136278 -101368 65511 -293675 -9905 142557 202528 212459
9027 212459 -203983 -151949 38330 -46454 -431709 -86804 -8169 -324518 282261 144414 -32604
9015 -304245 -348784 125265 -135853 74342 -92094 24051 -126432 191540 -194456 332646
9004 215446 7830 -196128 -59359 -26734 5498 -103403 -394834 166893 -96895 20801 -207167
8992I3515b1596H6237l6209i9950A26432B9204d94725J24210a4545k13372j9362
8981b47279C75375e97414c6443H6257P8532a70212K5676c4666Q490k30920d1432
8969b16663A74302a33664E6191j3557a35226A44505E6725c5933o1158p3997A74042
8957e3837k0847G0706b57285A37737j6620b26250C13514B0677K61985A8664i4468
8945c75527J87009f4242k2721l4853L6733A23342J13254P9288c94543A01914g772
8933B64289o4394J16971J07361j82812G6398O6183d31052J75409m8004a14902
8922d5052C03742e3319K6266B57095E0699b81514i3152G679a43954A55008c35055
8910a7045A49785a02729j3331e4717k3778j30868E1106K36034d1394j2261j25728
$$ plain form
8992 93515 -21596 86237 50028 -99950 126432 29204 -494725 -370515 -14545 -227917 -247279
8981 -247279 375375 -597414 -36443 86257 164789 -170212 -144536 -34666 -26176 -257096 -41432
8969 -216663 174302 -133664 56191 42634 -135226 144505 56725 -35933 -97091 -171088 174042
8957 -53837 -74684 70706 -257285 137737 121117 -226250 313514 20677 282662 18664 -94468
8945 -375527 -188518 -64242 -86963 -121816 -85083 123342 236596 315884 -394543 101914 -7772
8933 264289 199895 316866 424227 241415 76398 142581 -431052 -255643 -303647 -114902
8922 -45052 303742 -53319 -27053 257095 50699 -281514 -93152 7679 -143954 155008 -335055
8910 -17045 149785 -102729 -116060 -54717 -78495 -209363 51106 287140 -41394 -53655 -179383
8899a79383j51522a8303j37070N6359d2757F6011d9859G4445A549b52273L7893
8888b14380g3834F0633b145G2650a23983j3518G9094b83322B82736b30527B46143
8876b97914b8525k80475a31912O002D7594M097K9379a56244k11169F9291d4839
8864A50969a23902A01361B8124b20037c7967j55101l844h9180H3327b78282A4169
$$ plain form
8899 -179383 -330905 -18303 -155373 -99014 -42757 66011 -49859 74445 1549 -252273 -214380
8888 -214380 -73834 60633 -2145 72650 -123983 -137501 79094 -283322 282736 -230527 246143
8876 -297914 -28525 -309000 -131912 -125910 47594 51691 81070 -156244 -367413 69291 -44839
8864 150969 -123902 101361 28124 -220037 -37967 -193068 -196912 -89180 83327 -278282 14169
$$ [...]
##END NTUPLES=NMR SPECTRUM
##END=
