##TITLE=AC1472_13FE002654_8026838_OpbxDh4EUJ
##JCAMPDX= 6.0         $$ Bruker NMR JCAMP-DX V2.0
##DATA TYPE= NMR SPECTRUM
##DATA CLASS= NTUPLES
##ORIGIN= BRUKER
##OWNER= Administrator
$$ 1.72 TOPSPIN		Version 2.1
$$ 2013-07-18 17:53:09.831 -0700  Administrator@X
$$ Compression mode = diff/dup
##.OBSERVE FREQUENCY= 400.02188249412
##.OBSERVE NUCLEUS= ^1H
##.ACQUISITION MODE= SIMULTANEOUS (DQD)
##.ACQUISITION SCHEME= undefined
##.AVERAGES= 8
##.DIGITISER RES= 22
##SPECTROMETER/DATA SYSTEM= spect
##.PULSE SEQUENCE= zg30
##.SOLVENT NAME= COFFEE_meoh
##.SHIFT REFERENCE= INTERNAL, COFFEE_meoh, 1, 14.98509
##AUDIT TRAIL= $$ (NUMBER, WHEN, WHO, WHERE, PROCESS, VERSION, WHAT)
$$ ##TITLE= Audit trail, TOPSPIN		Version 2.1
$$ ##JCAMPDX= 5.01
$$ ##ORIGIN= Bruker BioSpin GmbH
$$ ##OWNER= Administrator
$$ $$ E:\/data/COFFEE/nmr/AC1472_13FE002654_8026838_OpbxDh4EUJ/20/pdata/1/auditp.txt
$$ ##AUDIT TRAIL=  $$ (NUMBER, WHEN, WHO, WHERE, PROCESS, VERSION, WHAT)
(   1,<2013-07-18 17:53:03.346 -0700>,<Administrator>,<X>,<go>,<TOPSPIN 2.1>,
      <created by zg
	started at 2013-07-18 17:51:57.627 -0700,
	POWCHK enabled, PULCHK disabled,
       configuration hash MD5:
       C8 4E 4E 5D D3 5C D8 9E 9F 52 82 E0 59 8A DE 15
       data hash MD5: 64K
       AF 68 34 D0 3B D9 C3 3B AC 24 CB 05 BC 3E C5 60>)
(   2,<2013-07-18 17:53:06.206 -0700>,<Administrator>,<X>,<proc1d>,<TOPSPIN 2.1>,
      <Start of raw data processing
       efp LB = 0 FT_mod = 6 PKNL = 1 PHC0 = 0 PHC1 = 0 SI = 32K 
       data hash MD5: 32K
       43 3E 7F AE 19 FE F3 DC CC B5 11 63 7D AD 58 76>)
(   3,<2013-07-18 17:53:06.487 -0700>,<Administrator>,<X>,<proc1d>,<TOPSPIN 2.1>,
      <pk PHC0 = 99.3988 PHC1 = 0 
       data hash MD5: 32K
       E8 BA 58 6A 21 61 FF 5F 7F A7 85 C8 CA 73 1D 89>)
(   4,<2013-07-18 17:53:06.565 -0700>,<Administrator>,<X>,<proc1d>,<TOPSPIN 2.1>,
      <abs ABSG = 1 
       data hash MD5: 32K
       0F 34 17 41 89 C7 15 BE 2F 9D F0 CD 48 66 E7 FB>)
(   5,<2013-07-18 17:53:06.643 -0700>,<Administrator>,<X>,<proc1d>,<TOPSPIN 2.1>,
      <abs ABSG = 2 
       data hash MD5: 32K
       13 3D 99 A5 87 D3 FD EA FA 1D B2 62 8C A2 9D 7D>)
(   6,<2013-07-18 17:53:06.737 -0700>,<Administrator>,<X>,<proc1d>,<TOPSPIN 2.1>,
      <abs ABSG = 3 
       data hash MD5: 32K
       1C 6B 7F 4E D7 33 6B CA 57 8A EF 64 E7 6B 12 0B>)
(   7,<2013-07-18 17:53:06.815 -0700>,<Administrator>,<X>,<proc1d>,<TOPSPIN 2.1>,
      <abs ABSG = 4 
       data hash MD5: 32K
       C0 2F 9D D9 EC D5 AD F0 FD A3 5D 0A 15 41 5D A1>)
(   8,<2013-07-18 17:53:06.877 -0700>,<Administrator>,<X>,<proc1d>,<TOPSPIN 2.1>,
      <abs ABSG = 5 
       data hash MD5: 32K
       7E C2 57 E1 FC 4E 06 86 83 2F 00 DD 77 BE 78 BB>)
$$ ##END=
$$ 
$$ $$ hash MD5
$$ $$ 45 ED 6F 82 DD 06 D4 42 CC 5A 58 65 DD 32 33 63
##$RELAX= 
##$RELAX= 
##$RELAX= 
##$RELAX= 
##$RELAX= 
##$RELAX= 
##$RELAX= 
$$ Bruker specific parameters
$$ --------------------------
##$DU= <E:\>
##$EXPNO= 20
##$NAME= <AC1472_13FE002654_8026838_OpbxDh4EUJ>
$$ [...]
##$TP= (0..7)
150 150 150 150 150 150 150 150
##$TP07= 0
##$TPNAME0= <>
##$TPNAME1= <>
##$TPNAME2= <>
##$TPNAME3= <>
##$TPNAME4= <>
##$TPNAME5= <>
##$TPNAME6= <>
##$TPNAME7= <>
##$TPOAL= (0..7)
0.5 0.5 0.5 0.5 0.5 0.5 0.5 0.5
##$TPOFFS= (0..7)
0 0 0 0 0 0 0 0
##$TUNHIN= 0
##$TUNHOUT= 0
##$TUNXOUT= 0
##$USERA1= <user>
##$USERA2= <user>
##$USERA3= <user>
##$USERA4= <user>
##$USERA5= <user>
##$V9= 5
##$VALIST= <valist>
##$VCLIST= <CCCCCCCCCCCCCCC>
##$VD= 0
##$VDLIST= <DDDDDDDDDDDDDDD>
##$VPLIST= <PPPPPPPPPPPPPPP>
##$VTLIST= <TTTTTTTTTTTTTTT>
##$WBST= 1024
##$WBSW= 4
##$XGAIN= (0..3)
0 0 0 0
##$XL= 0
##$YL= 0
##$YMAX_a= 598087
##$YMIN_a= -509627
##$ZGOPTNS= <>
##$ZL1= 120
##$ZL2= 120
##$ZL3= 120
##$ZL4= 120
##$ABSF1= 14.98509
##$ABSF2= -5.573092
##$ABSG= 5
##$ABSL= 3
##$ALPHA= 0
##$AQORDER= 0
##$ASSFAC= 0
##$ASSFACI= 0
##$ASSFACX= 0
##$ASSWID= 0
##$AUNMP= <proc_prof1d_extract_pilot.lims>
##$AXLEFT= 0
##$AXNAME= <>
##$AXNUC= <1H>
##$AXRIGHT= 0
##$AXTYPE= 0
##$AXUNIT= <>
##$AZFE= 0.1
##$AZFW= 0.1
##$BCFW= 0
##$BC_mod= 0
##$BYTORDP= 0
##$COROFFS= 0
##$CY= 15
##$DATMOD= 1
##$DC= 0
##$DFILT= <>
##$DTYPP= 0
##$F1P= 0
##$F2P= 0
##$FCOR= 0.5
##$FTSIZE= 32768
##$FT_mod= 6
##$GAMMA= 0
##$GB= 0
##$INTBC= 1
##$INTSCL= 1
##$ISEN= 128
##$LB= 0
##$LEV0= 0
##$LPBIN= 0
##$MAXI= 10000
##$MC2= 0
##$MEAN= 0
##$ME_mod= 0
##$MI= 0
##$NCOEF= 0
##$NC_proc= -8
##$NLEV= 6
##$NOISF1= 0
##$NOISF2= 0
##$NSP= 0
##$NTH_PI= 0
##$NZP= 0
##$OFFSET= 14.98509
##$PC= 1
##$PHC0= 99.3988
##$PHC1= 0
##$PH_mod= 1
##$PKNL= yes
##$PPARMOD= 0
##$PPDIAG= 0
##$PPIPTYP= 0
##$PPMPNUM= 2147483647
##$PPRESOL= 1
##$PSCAL= 4
##$PSIGN= 0
##$PYNMP= <proc.py>
##$REVERSE= no
##$SF= 400.02
##$SI= 32768
##$SIGF1= 0
##$SIGF2= 0
##$SINO= 400
##$SIOLD= 32768
##$SPECTYP= <>
##$SREGLST= <1H.CDCl3>
##$SSB= 0
##$STSI= 32768
##$STSR= 0
##$SW_p= 8223.68421052631
##$SYMM= 0
##$S_DEV= 0
##$TDeff= 65536
##$TDoff= 0
##$TI= <>
##$TILT= no
##$TM1= 0
##$TM2= 0
##$TOPLEV= 0
##$USERP1= <user>
##$USERP2= <user>
##$USERP3= <user>
##$USERP4= <user>
##$USERP5= <user>
##$WDW= 1
##$XDIM= 32768
##$YMAX_p= 433356258
##$YMIN_p= -690741
##$CURPLOT= <Network HP LaserJet P1505>
##$CURPRIN= <$Network HP LaserJet P1505>
##$DFORMAT= <normdp>
##$LAYOUT= <+/1D_H.xwp>
##$LFORMAT= <normlp>
##$PFORMAT= <normpl>
##$SURQMSG= 1
$$ End of Bruker specific parameters
$$ ---------------------------------
##NTUPLES= NMR SPECTRUM
##VAR_NAME=  FREQUENCY,     SPECTRUM/REAL,   SPECTRUM/IMAG
##SYMBOL=    X,             R,               I
##VAR_TYPE=  INDEPENDENT,   DEPENDENT,       DEPENDENT
##VAR_FORM=  AFFN,          ASDF,            ASDF
##VAR_DIM=   32768,         32768,           32768
##UNITS=     HZ,            ARBITRARY UNITS, ARBITRARY UNITS
##FACTOR=    0.250966925370066, 1,           1
##FIRST=     8223.43324360094, -21720,       -26820
##LAST=      0,             -63400,          -76452
##MIN=       0,             -690741,         0
##MAX=       8223.43324360094, 433356258,    0
$$ Real data points
##PAGE= N=1
##DATA TABLE= (X++(R..R)), XYDATA
$$ [...]
23854 366720 -54596 -94360 -166234 -97469 -226199 -55579 -179520 103351 -77547 -103096 78035
23842 22229 -273909 373856 -117203 225311 -127702 88402 -393946 -150176 -108728 192779
23831 29323 207024 -79608 -86283 270982 -33222 141096 -78875 61654 34040 -375578 -495921
23820 -495921 -390970 -24231 118349 -99655 199262 31439 -138088 3853 -191378 -60193 -124753
23809 -124753 -124654 71829 -118360 91538 -118249 345761 -51507 -290254 -87389 19946 -9744
23797 77064 80353 235422 175504 -67276 -86483 113049 -25627 115483 192700 -107901 128416
23785 697 -327151 -155959 129641 31122 170795 -35844 -144591 26254 268505 62879 -125750
23773 41948 10873 -50373 -67796 -49608 -184077 17913 200026 -119638 158843 97793 76375
23762 76375 15003 -156966 -124589 70821 -59178 -161920 -158583 -93834 -11470 241081 58083
23750 98221 75330 -79319 -23023 -344368 70487 -12163 -88662 97017 -37329 -233539 -210604
23739 -210604 -89230 -72075 1206 -314994 143210 240935 285817 160651 131905 47071 259819
23728 259819 80477 -40817 54829 66154 -179067 187310 282285 64182 -20118 -70199 76621
23716 -114417 2606 -281635 114755 135795 -264710 205214 -102462 232770 26160 65412
23706 65412 -99879 -135819 -272186 140320 -53859 -38343 64315 -206600 72699 -126040 106796
23694 -182252 -243 -260032 218645 18057 125373 -2835 -42719 -234881 -6814 239116 -309125
23682 358761 -131225 -86126 -247169 -387198 -72324 -118712 -207278 54485 -121798 63087 4638
23670 298050 -18091 348003 -64531 162971 72763 127750 41092 237388 -394841 -147122
23659 81171 218734 129605 -1424 -29836 458447 -78477 98053 -291286 -281741 -99348 -46128
23647 -179961 -132265 -172410 232423 208848 263637 79937 7956 1370 25916 -443955 -148113
23635 30600 -99096 180148 105200 -61755 -211080 64610 -485984 57272 35691 143286 -161249
23623 261915 -188686 -149690 83881 76656 -198142 -307274 -82587 -24535 -162652 -128754 -199500
23612 -199500 16390 139606 44790 145827 -80647 -210552 -159078 -261320 70017 -158640
23601 99445 224281 144147 188336 -127761 -59645 10484 131907 -157622 -105395 -96230 -135576
23590 -135576 -202507 -208885 89224 -14532 -13239 -157168 -91235 -367696 131964 -211943 -241488
23579 -241488 13621 -3337 -27052 -92067 -26166 206562 42656 -52304 146128 -354892 29605
23567 -223849 228713 -171831 104608 -281533 72301 163897 357617 -15739 -272314 -148795
23557 -148795 183491 -106275 17516 178800 20945 -117431 -83193 -152584 218515 14155
23546 131762 92637 34780 35279 -66522 129585 84009 -150282 -93130 -55306 -93320 334380
23534 30251 -133316 -168572 -30354 55211 -231898 130538 -8404 287749 -66115 -16902 151258
23522 -277612 -89778 181447 -145742 -55526 110673 -358153 3404 262062 68692 -110529
23511 -63678 -301407 133427 10500 -84509 90446 -112924 30833 -117906 -216571 -33876 -261024
23500 -261024 -269494 19933 29742 19417 -51447 -44558 -152573 65335 195842 -7133 -222791 21092
23487 182042 -105590 167440 84971 -252437 -97210 50068 -117392 -379098 -183173 42973
23476 -256986 -319502 -91443 71517 39027 1541 -12423 91740 15560 31902 -295654 176077
23464 67918 131602 1060 -110313 -194389 77640 -113031 -198824 182110 -212179 -18247 -44692
23453 -44692 136787 108757 64621 -195123 -54403 -37618 -21753 -169368 211088 -205170 -102239
23441 37960 99707 -180498 96006 216017 102305 -208826 -35754 67088 -34003 -71501 -354488
23430 -354488 -108745 124719 177223 68930 61458 68261 -179631 -234860 -33515 -163436 91329
23418 -166335 -413884 -191050 14027 -239173 160377 78828 38831 -76120 -327733 -67670
23407 29967 -94639 230156 -264173 60582 278228 -1799 -28161 32097 326245 -69410 -30463
23395 239163 126946 -114976 -159701 -4682 128316 -122574 112423 -56300 -143571 192366
23384 35375 -20979 293821 60960 -370795 -19103 63301 -193005 -127854 -114931 -119178 -30860
23372 -89272 -147460 347675 230357 -282818 -34406 86143 -228079 33876 -115398 6901 213382
23361 213382 34290 160370 352625 144270 -127838 -226398 -245377 -11583 -180294 223750
23350 -58103 -182561 -80267 -67936 -63695 -113499 -75881 13563 -147395 98357 174378 -68678
23338 -245564 -73820 -239770 -110846 -15488 -236283 -131643 297961 216656 -396231 14669
23327 -597 16873 -96498 256173 139123 -56003 214359 -17165 -123539 -154374 277747 61905
23315 -181021 166533 -205925 -28502 168085 -64223 -120303 28383 -78512 -30118 154781 -37465
23303 20916 253963 -30 88813 84382 -110462 109812 206786 -17638 16644 -70078 13677 66636
23291 66636 -146947 -197413 -25186 28636 -7758 -62186 -220403 -40812 59835 87954 -360495
23279 -44311 -204204 -259841 -346849 -281915 53678 -203686 181749 67800 45986 73283 216140
23268 216140 -192080 172880 408833 46931 -6115 -24002 -53210 33675 -145129 293421 -223666
23256 -53199 -23402 262274 -129174 252985 -284050 35494 -149425 -78607 325216 194454
23246 194454 99103 221116 15315 -126226 -196092 -184280 89771 -120661 42171 57284 -27965
23234 -126703 -366149 -198328 188105 -35268 68924 296561 -37968 -254913 -417392 163548
23223 55392 12327 -182947 381853 -249636 11260 -38426 -105825 -14384 -147782 -201249 160942
23211 -229682 -208868 -66267 73017 274879 -48490 -66726 -20783 -224701 -188379 75765 -66676
23199 265679 199456 161829 106530 -27317 -51552 43603 -175554 -69239 52879 -86094 36973
23187 37523 23018 81944 -170983 -88842 -69451 -115619 -1247 -67423 -233797 30195 48058
23176 48058 149411 -135239 -114940 -169838 -124481 127928 -249534 -106483 -21791 244 89599
23165 89599 -75183 61916 115039 14488 324091 -96931 -193805 108278 360844 -273348 172053
23153 -61496 7965 -47422 -422728 82982 62173 94988 -210434 -75216 -147926 35408 62630
23142 62630 266367 56679 190787 25166 -121057 -124895 120849 -66240 347847 182558 -86937
23130 -104224 441553 -157834 24654 68980 134012 -195432 34068 -84683 -124179 -32345 -70845
23119 -70845 -41371 -362869 16252 10829 -56442 -273395 72922 235796 -121263 32239 -330673
23107 203660 10181 95287 280057 172497 -126145 -18578 76566 11512 -10720 124698 64451
23096 64451 -293089 417791 96350 33180 218740 252629 47925 -139849 127271 -75178 73977
23084 -7079 -79596 356194 -80707 291985 -36483 -163574 14700 -513319 126549 282908 946
23072 -386771 23475 169273 -23653 -22215 -33045 -45609 29833 -503272 -49282 -115351 222574
23060 31697 -159042 -140140 51736 63717 -349885 -78965 79886 -102766 -42482 -241257 -226474
23049 -226474 -132940 58596 -39988 198842 -7432 -32025 -137680 73351 -88947 -91322 122061
23037 -112774 169947 -235790 -93191 212936 104314 -8304 129979 117370 157308 -68005 -89367
23026 -89367 192452 -210823 207203 121579 56687 266997 36840 -327460 -66450 -106733 128030
23014 146600 -179954 -187391 305534 -61535 -34946 141841 -4423 148574 -26223 25148 164711
23003 164711 -662497 -19404 260677 -69203 -204735 -21896 248740 -91577 -490 -207017 -369729
22992 -369729 113899 106166 -270480 47505 -234087 214951 25028 54446 -193738 -116368 14575
22980 54105 19785 102175 -100852 239936 -217558 -251799 -118312 60714 -156857 235963
22969 9182 -39612 -60529 280325 -93872 306493 219596 141580 -170656 72047 -292689 362887
22957 -22659 -264548 -214886 -329004 54523 245283 143751 61444 -29585 50691 151485 234520
22946 234520 189711 -204261 -210927 -75751 -91963 -182754 193420 -151799 -284854 -108524 185117
22934 -61137 -199925 -176880 -442655 -40781 -89390 135732 253364 -53709 111422 -20999 117229
22922 -280169 -159408 -39870 109416 -159396 -277407 -160344 -117345 -37190 -149665 -158034
22912 -158034 -317319 -139183 280918 -38697 179567 -1245 -46744 -169729 -117153 186674
22901 -149463 -118648 36821 -11195 126454 209958 -251757 -101370 -185250 248248 82494 -92508
22889 -64826 -42510 33373 -126707 -42946 445601 -199075 49513 132383 -171258 -166289 -9310
22877 -333469 -40728 -213348 -128524 -278543 81481 163871 -166684 -253653 -203964 -62714 -128456
22866 -128456 6319 -71260 -133455 197282 222800 -43126 151587 152794 194136 -25290 -189546
22855 -189546 -119465 -377440 61096 149779 -65547 -300885 71100 -435194 -293097 1164 -71976
22843 28220 -77783 185504 -37087 13203 162970 -277405 127861 -18913 -74877 283612 -262515
22831 -265138 -286293 61444 -83935 110467 -97568 -162802 -167350 40283 -259441 -121793 42849
22819 26504 -21734 146427 -280343 -109264 -420056 61914 -84397 -261521 -195470 -21003 46152
22807 -158119 -6460 -190419 14209 -126926 -269102 49721 20222 95533 -45542 80971 47322
22796 47322 221605 115763 -269492 240456 265405 -406552 -46699 -243481 -98116 -343658
22786 -343658 -132153 25810 -76822 -218039 139878 -48789 -166765 141857 268600 -22511
22775 -97226 -57536 -73599 -5013 -252148 -242692 -71947 -37611 -74904 -130786 310994 241876 -314323
22762 2828 -126015 237064 61759 42035 -8261 -380 34160 75617 -152255 -210882 -244803 97561
22749 29404 138392 96071 3684 105115 -40464 -338 20901 -132121 -200937 272187 -113659
22737 -38438 276649 -81069 68858 -306336 -163254 -203975 -128173 14655 21720 -18577 2264
22725 -255643 110166 178790 65581 142897 1973 -276955 -126859 -129319 -55106 -36805 -194531
22714 -194531 10330 -222030 -234947 -23891 8298 74695 -65302 229377 -107424 -145957 165264
22702 113205 -134919 60696 -151490 -73964 237181 173855 82630 -245018 -34223 78555 -96404
22690 159800 -81563 -47555 -242840 -127374 -69577 38050 -88501 -158611 -78213 39518 110755
22679 110755 274781 -52404 -76208 -134471 -181198 101994 -39003 72915 -105498 42141 9151
22667 159626 -421587 26117 70229 -117752 -257382 -47400 67622 271781 360193 -18227 -181155
22656 -181155 95338 53666 -123946 -24431 149771 -106558 35716 -159812 -116109 120825
22645 97873 -59069 -52383 -99792 91261 -233441 198169 30927 -112557 -6969 -383625 -34157
22633 272045 -312029 -167556 34661 -109296 54667 79661 -56769 1708 -87731 337364 133921
22621 -57688 -167240 16824 -111847 50362 4303 -184461 62098 -82667 247689 -275529 90940
22609 7846 16198 -84306 99445 255834 -157682 -376325 179863 415877 -309587 -246901 -35491
22597 47995 -9979 -170708 -294283 223209 60993 111839 58933 79740 412399 -254723 461443
22585 4771 38787 -112239 112575 173443 -100730 197782 -102199 -84264 25926 -34025 114332
22573 54158 -141053 522294 -54060 220067 127693 -33616 6699 -118195 -160254 204669 7591
22561 -300227 -35449 104335 -54283 -43056 -196627 -14132 38129 57843 97241 -143732 -248446
22550 -248446 252783 -355128 -452851 -264549 -126873 -111686 -28607 -201006 -118555 -96311
22540 -96311 12148 124306 -213760 -149349 251652 -83857 82241 -168372 -81237 -325269 -142881
22528 43170 -107640 -63113 99686 101371 5805 -18317 168516 -139641 -385470 -189780 40533
22516 -43696 -129275 41218 -243946 4193 110301 14504 84317 -76392 -11490 -317545 -63024
22504 -149902 10349 -74365 96965 24813 98141 -124113 90363 -296406 -16223 -182762 -49363
22492 74563 -22915 -93073 164323 -298047 36064 -53809 -93239 -402276 -115373 -119725 -186811
22481 -186811 -202153 108441 299373 286241 -284753 -376474 -85934 -89631 -348698 -26164 -164993
22470 -164993 -47354 74743 -168772 -280484 -264123 9241 -511755 -7846 -35573 112097 -9890
22458 -62541 -153368 199619 -199708 -302128 196301 8050 -367024 -64781 36811 66448 73001
22447 73001 -5098 -35113 -14725 -96309 -95229 -41829 242684 398035 178540 -91354 -4939 -144295
22435 -144295 -21775 -208952 -153228 250722 -209643 -19721 -29904 -77892 -66049 239657 -41532
22423 135252 -207696 -93654 -168466 150174 34934 299588 -207000 9738 -30689 8851 -28282
22411 -190566 193250 -180032 -81064 -17332 181206 109420 -198411 19186 8180 34054 -14762
22399 51934 119526 -1285 207378 50064 39652 -63245 -336508 197797 -36792 -87980 -66962
22388 -66962 -139176 153624 -212365 40236 31206 -167160 -31661 45190 169850 9215 59741
22377 59741 -85290 199554 -203080 -72694 -58400 72291 -124750 -220854 -232968 -6397 -109372
22366 -109372 249081 99590 -106677 -86716 -57107 44132 -104553 65961 6431 -198322 -19220
22354 98445 20571 -135280 374957 113991 -85759 -177651 -15742 -36354 116893 -238855 11913
22342 154961 -16318 142550 112264 33712 9538 -130559 6528 -195536 13974 158181 -198986
22330 -209809 294903 22070 55872 59471 47663 -299157 7850 -90242 215314 -337538 -74483
22318 -59218 113820 -316032 162956 40427 108746 18689 166470 17181 393907 -21638 -67300
22307 -67300 11420 -239813 82560 -186239 74289 163656 660 19952 -66340 -166264 -200111 -103614
22295 -103614 115418 58574 36674 10014 -66929 -101195 28976 10677 50974 7797 206224
22284 206224 -69709 -81013 54672 -430398 -174983 -143047 80535 -19489 6509 -199858 -68967
22272 -32939 -291638 -36095 -22665 60368 -26690 229091 -82277 30408 -36721 47718 103321
22261 103321 -112304 -87077 -126268 388857 -102311 104358 -72518 117477 -243002 -15597
22250 89934 -137344 244177 -228167 -29197 -110315 270025 -140160 -188097 -268658 -9985 -304205
22239 -304205 -37419 185861 -31638 -319523 46577 -69370 -51123 303023 -76764 97967 31137
22227 132022 -58129 -6970 84635 -187873 -74977 -8957 -140726 -97663 -373595 -25109 -234784
22216 -234784 158455 243543 36015 -181962 29767 -111373 -33028 105201 -198010 24015
22205 89173 107634 -89146 -29848 -90177 -314445 272649 -2240 -374036 113095 -215855 -227430
22194 -227430 -114952 92080 -32050 -73015 248179 89847 -7049 -190042 43885 256984 -294939
22182 -48449 17694 -15361 -334056 239129 115900 -235933 -141430 137528 -47922 23963 203585
22171 203585 -725 28461 91973 -128756 -204788 -3481 3622 -82025 104493 -79815 171560 139606
22159 139606 -127755 -129952 337054 -143244 -13084 -19717 -15401 -119646 -155719 21674 -4967
22147 -33260 -93427 -247479 99877 -39825 54814 97920 175653 85560 -373723 -271372 -143074
22136 -143074 -67774 74452 -191868 -168512 -77611 131604 -64737 311557 26855 -157269 -151890
22125 -151890 152867 -50534 -54947 6236 69581 -357563 -142558 168582 50524 144752 -405342
22113 -108237 84731 -4018 -123946 10794 18093 -165993 -122599 -242147 178415 -293555 -217416
22102 -217416 121172 191170 143289 179451 -64353 159907 -57026 -27664 -195037 -71569 -6920
22090 -61440 84185 92481 32107 98261 -56568 119928 -61175 119103 -64476 -78275 210537
22078 -59618 41663 -9107 294180 -199851 99731 -207301 -332606 -33837 -1759 98068 -157622
22066 -102544 -56113 -181499 13014 -214861 -50092 74715 -110714 160707 91397 -58277 -138589
22055 -138589 -138711 254276 -68345 78406 52158 -17430 156672 167560 -249553 174039 81033
22043 229837 -131490 -559415 -100633 194921 -118762 -100947 -79258 -62830 -22573 -242362
22033 -242362 -208909 -193817 -69526 -49689 -139853 -438541 -133560 88497 -351928 24593 110426
22022 110426 -139684 89433 -137064 -42305 -208131 110419 363654 20927 -187810 -89260
22011 39503 -351597 42785 -157716 -199880 -88151 149716 -344576 140291 -311953 -54662
22000 -31616 -96567 -170912 -207385 -93362 -86285 -113366 -44699 59836 197637 124703 -82976 -69799
21988 -69799 37798 276311 -51154 143150 21153 -135124 75235 67610 -384885 71374 111271
21977 111271 -19929 217509 -11923 -125049 -117651 -135609 -283073 -156660 -145696 -18206 226604
21965 85562 163253 -319741 111784 -9911 202427 -3247 147570 110543 176089 -164059 -192054
21954 -192054 -46892 243724 125064 -218397 330007 57508 159070 -191804 -97384 -218614
21944 -218614 211317 -119911 303620 71739 -8181 23002 142284 -4344 -67639 308166 -29715
21932 227245 102791 -184527 -211212 -42034 185926 -2844 367194 -32187 147532 -118540
21921 82045 136085 68026 56300 -77001 399 4291 -111044 -87271 -189343 -205641 212648 -24677
21908 -7494 -36943 -237369 -180723 -158896 -222656 -68976 -66105 -2682 -41428 -174973 168379 -183674
21895 156482 -238916 1409 -336123 65724 128259 -200331 -298051 -222715 -7419 -200934 104020
21883 186491 -152651 -233199 -112694 -45445 -97496 -462540 -98437 -42287 -53322 -93669 -66085
21872 -66085 -135666 260822 141608 -73695 -80129 -13040 -18634 65962 109102 166167 -122236
21860 110033 210931 -92094 -148006 -78180 244319 -145870 -315313 -282349 -82817 -3008 -118866
21849 -118866 -134738 -167198 397810 -294280 170250 142595 40160 183680 46524 35623 79823
21838 79823 77453 37771 54790 59720 -133706 -4145 -4911 1149 -62433 8559 164895 -146986
21825 78620 56719 112266 -304999 -98258 -27446 -151236 -202550 -3136 -137544 64716 -189154
21813 201658 -191979 42872 49614 287664 -103062 -36633 239215 324694 -301036 -132833
21802 141155 142724 180776 92762 -85113 -103001 -34659 -75931 36676 95377 176830 -38817 -21022
21790 -21022 -146759 -223848 175759 68275 17879 56229 73546 254597 33410 295258 -141537
21778 -216978 -266032 212709 358532 -96358 -384942 -153072 -21196 -162111 -5924 -255780
21768 -255780 220865 -286444 190081 213847 -264349 117215 -58448 275762 101199 214620
21758 214620 -62370 -86724 -139978 -283329 -44785 87189 388472 -494523 -85458 -44602 -341841
21747 -341841 -162753 -250379 166590 -250201 -41221 -422137 31406 -139363 77855 69097 -109203
21735 -118740 -87267 -176251 -56001 -273470 4869 -38629 38818 -169405 -150256 16431 41159
21724 41159 -455767 103106 21301 -144477 13622 84789 -4104 76140 -46809 -42558 -394058
21713 -394058 -260212 245405 91652 84266 -193011 -480585 -212183 -106126 -62229 128613
21702 153627 -54797 -215179 -82291 -152095 182169 -374054 -98961 17684 -81566 2778 82820
21691 82820 36067 -56023 172344 -219324 441922 -236814 169064 -245336 -29192 -329371
21681 -329371 -171379 -154154 -25192 -124677 -451643 -212798 11130 -135790 19071 142658
21671 142658 92007 -155281 -8404 -104480 -185174 79639 93234 -90140 -382134 -97387 -5162
21659 -108058 -89276 -160852 63925 -88834 -226639 -31088 56213 166473 -14303 389629 -172212
21647 16615 -37023 130508 -167291 -9612 157504 -114073 59286 -72707 56409 -80441 67307
21635 -68236 22127 -81892 -120706 -232648 56368 222073 188681 50806 74906 -13626 -7698
21624 -7698 46696 -113176 -142036 -354366 -207634 75339 -197948 -42829 31105 51303 -180848
21612 -202358 196377 -90601 -306003 55451 42713 -62503 177267 58311 206664 -217401
21601 -242632 -258878 -211360 -31512 -181553 71164 -41427 91776 58176 151333 30220 -374957
21589 -491812 59616 -41798 -289414 185635 -17312 -226298 31387 26178 -116905 75135 129133
21578 129133 -127435 -207618 -175735 79111 -59392 -119344 -14864 -197315 -430737 -62842 -152842
21567 -152842 366651 -13790 18103 132118 -350487 -131270 449879 -277650 57953 208427
21557 208427 -166300 -136173 -342559 25373 -15450 65326 6317 207802 146596 -162215 65929
21545 -57036 138199 42966 -210084 -16387 129723 -211247 -67248 106999 219597 24072
21534 -155992 -280381 -176394 32077 -278027 -93417 140519 40313 -379693 -115643 248450
21523 116774 -33259 84840 -27521 -3902 131410 239360 116702 -17452 -115965 79051 -67431
21511 -2463 -99957 -193422 313695 -95263 -60980 -377498 -443250 -225931 -58054 -36378 77197
21499 137001 -48496 113320 172561 118985 -73171 -202876 200008 -274349 -188962 -109960 -268736
21488 -268736 78899 -292145 97331 194570 -22476 -381979 -17516 -131168 -258582 183577
21477 57948 30546 33820 -130615 -358079 -38493 44801 -81521 -56671 136724 81282 309038
21466 309038 105868 -40025 -60699 -219973 1605 -55108 89508 153012 -86649 -72224 -14996
21454 197250 -60596 -244957 232819 114352 157858 -102072 -67236 59625 155950 -321883
21443 -171317 -172643 48810 -124223 -73243 337537 199708 466860 248621 441119 86212
21432 309865 283701 -4053 -43568 -78250 189012 67125 155155 -26403 -114593 -350278 -172619
21420 -198180 -141379 77461 283629 150979 85188 446900 67395 -155985 -16392 41172 -92671
21408 -586330 -3577 -127166 -10125 -329565 -272049 19896 111514 -295614 -92572 235920 -185020
21396 -30404 -382837 -31263 54435 -186111 -40953 -232591 -273305 -257276 151433 -183990 -38895
21384 -194159 151236 67221 -78011 227663 6260 159713 -96297 21523 -183443 105012 33523
21372 -26496 203455 -119225 166345 200637 -108817 -31244 -56583 -237491 199633 152123
21362 152123 -61047 -108461 98411 222286 12773 -140065 355076 -20079 -113140 -116199 265214
21350 -296068 -7632 -115099 253578 43292 114045 -246976 110853 -63674 179119 -264018
21339 -298787 -85644 -272802 65780 38218 984 -7882 -171950 -237907 191526 81961 -176153
21327 -67326 237137 -149558 -191545 230447 -221479 109859 -35165 -132035 216830 735 -302732
21315 60926 -275756 -115006 24217 -72657 153591 37276 -119477 -58018 -126591 -33456 -291451
21304 -291451 -199081 -6372 -92924 34682 -215362 -289627 -211163 -198802 517873 -538525 -330464
21293 -330464 116349 -96528 -65766 -73728 -212856 -114340 -152374 196733 -429437 -132867 -13036
21281 248413 185086 -189659 -28877 -67491 -380191 -37880 -206544 366177 -201193 69649
21270 -65880 -236526 -94231 1737 -4461 -181582 -248459 127559 248562 -73694 -243422 23883
21258 -44340 243750 -159042 -372089 46710 63559 -316497 -139193 -26796 199291 80082
21247 -72647 -245991 -151617 31012 -209903 170349 8129 301100 104696 -297378 90624 63234
21236 63234 10672 -13156 -18569 -87526 -166522 93297 -144931 2331 -106863 109189 -275268
21224 -75650 -66754 -77326 -240771 -110198 -231518 -97270 109197 362745 -19996 -14190 -221385
21213 -221385 -33951 -165230 146690 -56749 65732 -156939 203550 -26081 -271726 -60748
21202 -28147 205189 170014 -372364 119654 -43493 39047 74812 176389 314016 -226181
21191 -203718 -165309 126506 43973 49764 5355 -183454 74859 -58551 45785 -149946 -50888
21179 26018 43255 -107142 -401563 140141 -91638 -27028 -175945 107330 16420 -243117
21168 -178967 106587 -131947 -102825 5663 -77920 -310956 896 -258708 -266132 -42637 -49617 -16241
21155 -225351 26913 153819 -155297 6972 65680 100627 142752 -28222 -17571 -214784 -115122
21144 -115122 96264 -126362 288951 68758 389172 41338 -27267 -137945 108728 -295417
21133 -1771 -80952 -264283 -302275 -452535 171763 -142281 -133832 -143467 -156471 28120 -44130
21121 -24337 106915 -64591 -22261 -6556 49938 65330 43358 -179166 -292805 12034 264307
21110 264307 102234 -11315 209980 -42188 66553 -116388 -56204 149772 -8151 159738 -217851
21098 -61972 -95107 49031 20726 -230459 -38786 -296888 -165040 27964 -174265 -124769 -160411
21087 -160411 -402480 85941 -10424 -120881 -126889 -62341 -93625 127906 17645 137458 104030
21076 104030 167967 -163448 13442 -197859 -3216 -156353 92324 -11950 31478 226341 -44527
21064 -123277 234952 137176 -114360 -130319 -34941 -183560 -98432 -147065 -261099 136399
21053 -240504 -89417 13152 106782 16846 -387765 -142022 -178314 5768 -85385 193212 39331
21041 -154101 167107 -440805 -297204 -280977 -58795 62027 105861 -197598 74855 185444
21031 185444 278339 41996 -15345 -188015 193550 -80116 134650 -58729 -57773 -8498 -521404
21020 -521404 -322020 -91226 -157102 319254 275361 -34916 -320298 -172092 -59055 197775
21009 -150828 -11478 133572 -222506 -87652 -182998 -98537 -232381 -182810 -109011 -117441 -70750
20998 -70750 247861 -253937 -100292 207489 -58607 -213686 -60089 -20153 19514 70888 -81843
20986 -196412 102954 120616 -41897 -56705 34129 167735 113440 56904 149682 -251754 267428
20974 33973 -4530 79697 -49299 12880 -4757 -248087 -184522 147566 -268226 -54475 -11410
20962 -133072 -202253 166521 -120211 -203922 -100270 -327513 256571 -409855 97277 227239
20952 227239 -110492 -143324 -348798 -168944 -250225 -306350 -172663 -32690 -171436 103093
20941 36936 203240 -43018 183933 -86293 55891 -174180 166757 -280472 -11429 216344
20930 270796 -130154 -222274 -271693 -196490 -23889 121850 -19607 -170957 -151068 -238164 -31270
20918 108599 67900 112026 -3151 -257763 -139777 211598 -72323 -79575 -250179 -57278 157784
20906 -207075 45797 80293 -186727 -202165 -60321 -188729 90835 -126644 56453 -262249 182668
20894 10156 127572 -91315 96945 48353 56286 -127958 -251901 242967 -209203 -78401 -22860
20882 -69007 -146016 298694 -119743 76538 114522 50338 164740 -46542 39531 161589 -87967
20870 65792 42806 -334228 34264 67973 168843 -255024 -184096 99 -350719 298918 346478
20859 346478 -61232 11607 70500 -320118 -203526 -168631 5816 -219728 19177 293847 52527
20847 77006 -24520 222834 -145957 -91305 -46623 -93970 -241590 105325 -75821 217137 -314234
20835 -65775 62832 -232566 115859 -187086 157809 58513 -41252 -321018 205797 -65300
20824 123392 7697 -74820 -113228 28908 196822 -237563 157704 -401647 -72344 -149609 -267198
20813 -267198 18420 268844 -153150 -18978 63198 -468 -98276 -7049 -174555 -109277 -196282
20802 -196282 -218073 -129218 -143159 -1983 -20480 -51470 -75270 -20027 -152338 -358319 -56995
20790 107781 -203161 -20847 57491 -108092 -156582 -272331 -5507 -141190 176062 -26490 -21818
20779 -21818 6058 -67541 105152 61818 9493 -139700 -74845 -238919 48990 -132192 96971
20767 -209843 -395329 82701 -196846 -67726 -63697 45380 -15335 -4132 48105 -257679 -1260
20755 -30440 -152806 80853 9967 -367115 -9021 -127899 -329467 38318 -187780 -137124 336536
20743 34124 55471 37370 -117286 -151033 -60682 -150531 -14768 -195901 -79484 116498 94483
20732 94483 -212297 -238443 129824 298791 60423 -33004 71744 177910 -153573 -255545
20722 -255545 -121995 -226251 -331768 80081 -47923 -60403 -162891 84716 74774 -379850 -221755
20711 -221755 130107 13469 -96245 -262521 86574 219450 -54501 -60149 -202113 241504 -54082
20699 22532 -297785 320497 55653 -164526 -198686 -220650 -40338 33297 14189 -52450 -163760
20688 -163760 181154 -101616 386915 -88962 -128197 -347315 28279 -202409 174464 -43630
20677 110981 -318114 137694 126855 70955 31753 37528 143135 106534 36225 -88477 63044
20665 -49084 -65779 101556 -579231 -44659 192900 250320 -92117 54742 2417 -207670 82095
20653 -394383 -256547 -207617 -383249 -219886 1121 -192145 67014 -94395 11796 -42879 -64649
20642 -64649 -597990 -62853 294279 60890 -24642 -99258 -115553 -135148 -106055 -33946 -364796
20631 -364796 -246475 58020 -9274 -169203 336368 -132344 12979 19846 -254463 -80927 -156684
20620 -156684 -29758 -236157 -74888 262905 -306147 -290027 1962 -167844 -10055 -12381 151882
20608 7246 -76416 -73267 146859 49501 -133855 57193 -59899 -298816 -218274 -69329 -228035
20597 -228035 25449 -101904 109852 63294 -205882 -167866 -255597 -1629 98191 102787 19271
20585 -91499 -31680 88789 6546 -200020 227610 -97921 81437 -46896 28585 59641 436982
20574 436982 -109030 -92641 -407576 -46392 105580 -210716 -145125 -109381 160452 -214941
20563 -89627 61362 -236171 -40514 158973 -205683 -144856 263142 -190395 453086 -176369
20552 -89262 -61532 -394210 -52305 257190 144689 -470275 -218831 -81895 -63493 206396
20541 37004 -98218 355326 16180 -21642 -83394 114918 -165906 168111 103286 76007 86778
20530 86778 168684 301991 -475074 117938 -295298 49214 93011 217971 -231198 198205
20519 -119403 -36100 75957 -213851 112355 20014 -116794 -86948 78101 47831 51446 -151696
20507 -39345 328887 15711 256930 -127128 197839 149508 106606 -273898 184187 -285184
20496 -313904 61181 228936 74768 -255016 119500 -156326 -165478 72566 85318 100776 124994
20485 124994 9065 -244322 -379678 -158146 210238 71685 -203519 -250639 127232 21454
20474 235731 -164852 184217 -52143 501566 -12833 -77638 162159 -50010 -347519 -214691
20464 -214691 -186681 -13773 135837 -263798 59382 193841 -20656 -245633 -62761 127864
20453 89433 -258263 20648 226591 207154 -34331 38239 191326 -111228 -56681 -70707 -216876
20442 -216876 -41964 -61604 -194992 -102620 244164 204676 -59896 -303752 -117206 -364877
20432 -364877 -19776 -103779 -257863 172802 -34457 181283 91377 -65213 274087 -162732
20421 -217077 -159369 -78760 -19525 123617 -157523 -97056 -75458 285774 -178840 156028
20410 -160744 57854 107566 -23870 -88169 -40204 -329097 -40274 -19736 270052 -321242 76298
20398 -148608 164027 -29040 -23476 -40259 -75602 118963 -258514 -137238 156887 -84410 -240487
20387 -240487 88232 15364 -242321 -297212 -14921 103766 -102731 64270 62357 -40828 -58413
20376 -58413 -183822 -343135 -149946 -244574 -213311 -441766 -48813 -157733 -307277 -146059
20365 -269214 19068 -201244 -158112 -281698 323217 75330 -183772 49013 156468 -161910
20354 -131294 293657 -19662 26209 71644 214661 -137973 163758 17850 -197230 -178620
20344 -178620 356831 45666 229234 -476968 141658 -192951 110123 -130805 146919 71712
20333 238878 -36551 -119932 -241511 30509 -124209 -334947 -315288 -177347 214166 28113
20322 122611 -413180 275868 231825 -102219 -278633 -108523 22964 -257449 -212320 27895
20311 -164629 109784 -59403 278981 749 -113892 -39842 -3222 55974 -179508 263954 -12303
20299 -22052 361752 33040 128353 -356741 88815 -50530 16825 -109385 -218071 110485 4110
20287 -41710 239773 131318 -140773 -80192 -118845 -194501 95467 -63556 218936 -227148 -337970
20276 -337970 51474 65512 12429 -99084 -219316 83825 -122737 100849 -350081 288223
20265 345560 55546 103688 89216 -109301 67719 69440 -70742 -34464 220311 -158301 -85486
20254 -85486 -45711 216016 -100124 135696 -52600 -251282 -19822 -112914 -59864 8738 -207717
20242 150464 -14331 179084 -262667 138965 -107588 -223814 291943 48663 -223968 34303
20231 -258583 105262 -235615 -84221 -262478 -122325 -12981 42821 -207425 -128106 -234928
20221 -234928 78125 -220215 69392 139361 -43686 -125857 -279967 -68298 -159284 -84471 -189465
20210 -189465 -187757 104177 -192290 21758 -110141 -219747 195586 446270 391604 137457
20199 287859 -14771 -126595 -166773 192168 99480 -12036 163166 24495 -167341 -362420
20189 -362420 -240773 66382 99064 -123624 -34481 -18662 -231258 -211908 -210480 -151922 233347
20177 34373 -214763 113444 156450 -162100 -472751 19326 160397 -201101 42193 -202600
20166 -249255 -20179 -120801 35565 -74810 116913 172107 145142 264519 -30781 -121745 20099
20154 -270591 -151602 117132 128757 213984 -118594 60161 -433193 -101706 157405 3699
20143 -256095 -80973 -78610 66923 163784 -214777 -218976 -180260 67208 113358 36437 -100777
20131 -84113 23853 -118500 -252779 -230672 -12985 86450 -98270 3236 -259803 51314 61356
20120 61356 -132699 -199132 -148609 -156149 212255 -255785 -586149 -79995 79989 -436059 -77798
20108 214031 -56075 -75013 199466 26228 351505 37186 86625 -419084 -182004 -177437 -119805
20097 -119805 -56168 278520 198854 -290161 -110778 259219 -38003 -60669 -55383 71659 -14292
20085 -81092 -116257 32881 59089 -223615 -16669 -64688 -113355 175761 -88833 226851 -113688
20073 -51805 -266193 -54891 -221004 -120982 69535 13368 -136833 -111866 -187357 104694 -32592
20061 -206564 -437528 50559 -197579 -228782 2489 -357658 -16287 -21645 251182 -245309 -260714
20050 -260714 -279175 -83854 50248 300558 -52718 -392960 -179457 -141088 113830 -35408 -214426
20039 -214426 245803 -330624 40065 94380 -85011 -290537 -56159 171579 56493 317540
20029 317540 88245 1768 164865 127224 -493724 -30369 8096 19452 56972 222272 -199063
20017 -365675 153769 -160188 73742 -35868 412103 114308 160367 -107262 -156953 -55760
20006 -64014 -191600 -185050 -103138 -376412 -345570 -37527 -460261 -40241 151651 -103911 113199
19994 -112143 -390466 -85883 74508 94670 -304156 -5167 260814 -15626 -274436 7223 22102
19983 22102 -1656 4831 150358 -326926 248461 -151555 -30113 368506 -252709 -235549 -134426
19972 -134426 51178 451209 -325967 -259558 58694 -121568 81553 9302 -116871 -130661 -62315
19960 109101 426512 -256198 50351 -144239 42131 -179703 45644 116694 -248359 73714
19949 -112455 22633 94052 129312 -71737 -10957 -94325 59866 -320064 116211 68217 -238709
19937 73205 -138932 -164550 28203 -246151 97073 147928 -94199 -145879 -283295 -320279 -115618
19925 70781 -225506 -335076 -142476 -207784 -120836 -121852 -214492 -141573 -44158 -3320 116667
19913 -279269 107090 19141 141303 -6386 -198202 112209 22722 59639 -102667 220149
19902 89677 -198261 -130966 -191595 165915 -220139 -324801 45545 -113505 -169449 -114749 -151732
19891 -151732 113395 234972 -85624 -84369 28087 -44394 -162102 -309311 -40030 357689 -202826
19879 62613 45369 -51952 -196963 -135943 -167645 73037 112882 6885 -311937 -368780 -130052
19867 -171793 -258723 -19764 -60359 -82766 242173 -5999 -161586 -218549 -122762 196 45160 -160359
19854 283124 -158325 -226924 -221483 52287 59469 -97620 -251004 -59821 83043 43264 -40735
19842 -21347 -182035 -264543 198478 49542 23364 -71613 159389 -232434 48211 -24137 222252
19830 -91465 -15074 -51749 117070 54337 98543 -50221 -422727 3344 -23764 -45765 185631
19818 -150690 -272822 -27450 -324570 94559 -32292 212170 -136189 94513 -198558 116615
19807 38427 49268 -119822 27922 -141697 2608 -83786 -165169 -261752 541118 95998 -289754
19795 -127382 151117 -389576 -160257 -256959 -402872 230565 16023 54748 49278 262514
19785 262514 -206807 -62814 -253697 -217833 -109134 154573 329368 175897 -224514 -16394
19774 30697 391983 -280302 16530 -2927 -370737 -331947 -225135 -307289 -107866 -273540 -48968
19762 58171 -8273 -308179 35407 -50091 73910 34142 367330 127941 54672 -207388 31343
19750 -270568 -90759 186620 -110626 -201697 -8998 -439184 -180721 -244605 -200345 -394364 -15021
19738 -383318 -58955 101227 261634 -15137 274986 -118939 146602 -96665 -208162 42495
19727 -153764 -327324 45288 17077 -185653 123033 98724 -22218 -160875 -94028 125649
19716 -6218 -4585 -26518 -31327 10341 197715 37194 22155 -170192 106231 128021 50992 3884
19703 126266 -179629 57343 119627 318391 -251084 -64448 90696 -180273 116150 -268558
19692 95497 -52767 -79019 -101926 155970 241433 180264 143767 153774 73646 -458595 -100075
19680 -180048 183568 64469 213275 -213424 -261178 35249 -533731 116937 85430 -186064
19669 -246710 -167368 -46256 -237814 -124303 41843 -36517 -25782 12308 3174 -365800 172585
19657 -41718 132678 -214990 -73972 -250612 -81220 87891 73203 27099 -13103 -299014 1858
19645 -185974 127776 -234088 -187132 148456 -451298 -127637 62879 -97291 -90478 207588
19634 -82180 -311753 1240 59564 258 -375302 -294249 103077 -124571 -54802 -123349 -47030
19622 -52797 37659 -73799 -241851 -251171 169997 165970 -47012 193011 -87634 -175429 2442 -46256
19609 65 -137012 196538 -162228 177873 -180257 -352974 -174848 -120389 56745 231237 -140033
19597 221980 8850 -90960 -112688 -225283 13348 -109732 174963 -188947 -325826 283546
19586 -124053 -165526 -231354 -148906 4564 139800 186713 121430 -77210 -335034 170337 32090
19574 -108591 104578 -375809 -154853 58866 86592 -80332 -90016 -161809 50761 165213 36452
19562 -56165 125228 -128558 40878 102838 73582 49528 89873 -4787 -50064 -332213 125737
19550 31558 -74584 58031 35392 202917 -154171 -105204 -57089 -92228 -250116 114698 -233316
19538 49640 -69513 19386 308576 -252056 -195649 66443 138650 276462 -29538 -246355 84235
19526 194163 -35082 191493 -178381 -228775 -215601 -142496 -209257 83659 174587 8546 188370
19515 188370 129223 -113766 -90800 -23990 46982 171848 45752 14490 -293342 74421 88451
19504 88451 -261607 -174718 32993 200080 -190799 -439840 -214706 154196 -73313 -150323
19494 -150323 81682 138834 44959 -100332 37081 -221359 510498 165593 -91434 83088 -64663
19482 -19310 -163663 27588 -179158 16911 -151134 -249974 -186170 -327024 -380645 166717 108326
19471 108326 -198816 11838 -25313 -36665 -231447 -363391 210058 -67558 -27625 -79063 96978
19459 -437451 -11641 264732 -10366 -20820 -81188 -102347 -506844 -228163 -58089 -87906 2418
19447 -197716 -149826 -225223 160566 -82817 -28393 -641144 -72861 37773 37002 287666 62195
19435 -168278 -132389 -30485 -95547 -37572 -168510 -166036 2624 69067 94742 -228782 -49334
19423 -17310 -51489 130585 38902 -84099 -19196 -336896 90239 113910 -89363 -236373 87984
19411 -160966 45832 14035 -51723 52964 215384 -51771 35015 -120230 -101692 206987 -104145
19399 -221940 -130863 -96850 167179 43714 21608 -61049 194016 10603 -225113 -12915 -80390
19388 -80390 233742 26235 -136377 205795 452966 151611 -361377 15884 42400 139396
19378 139396 327326 -201114 112575 -40035 -269881 -11322 -36765 34205 209604 -203339
19367 -117267 36922 94680 -99898 -168892 -23814 211675 -231119 -160716 58664 112596 -213072
19355 117640 -120611 -54646 173654 -356842 -181690 -86468 157363 103681 65218 -64738
19344 -128872 -105920 -211749 -26149 -109132 151134 302736 -248432 16492 -53586 -302228
19334 -302228 -62562 -82857 -160635 -122505 -157780 32952 -173468 342358 -89180 241892 -74005
19322 245795 69548 67964 -121131 -54491 -99865 236450 89222 -218710 49350 -61595 8022
19310 -221318 -169767 -53143 -270920 -210095 58075 40932 -455563 -12067 -29144 376760 -247829
19298 -197936 -183390 -78304 126957 -39859 -170276 37081 -108554 15973 -196003 248813
19287 21722 -20555 -154162 63742 -80538 -540591 208323 97917 -109373 -190882 -28511 11416
19275 -122165 85727 92422 116110 143618 -7531 -29661 -408254 -144310 -238321 -29872 -181771
19264 -181771 -139967 -195352 -83694 -30482 -39562 -91456 -211072 -295558 -126549 -305029 -153559
19253 -153559 55829 153592 -49286 109650 121342 152973 177129 -211601 -289408 -257841 46566
19241 177089 392068 165848 -126797 75137 -53370 -38178 104222 -288844 -137685 138849
19230 -84464 -84864 30358 120246 49177 -228015 -279374 -187810 -3376 237031 -25142 -202376 58903
19217 -188482 -102859 -162005 151321 -169341 -83235 -158651 -212919 107335 -2204 -193730 98273
19205 -415995 289054 -137916 -275177 -66632 -264302 77115 -190667 -100664 73482 -225155
19194 -204698 58105 238600 59408 -170554 -151311 -101695 -21195 -202340 -34296 -90022 195865
19182 71169 -177435 188880 -90874 -137257 -272527 165142 -247020 -70672 -164084 -58051 162710
19170 -31914 165173 -100951 1670 -84297 -67576 -551865 143444 56904 91743 -172256 -224257
19159 -224257 -79686 -48824 126765 -27285 -188203 -145153 -88326 14082 -224847 57604 103067
19148 103067 133032 96826 72443 -68964 94710 16832 -148411 79516 -265439 170791 47270
19136 -28101 -22235 11317 -191939 89601 107335 -14249 -155036 330998 224679 101956 5061
19124 324922 -3176 157805 -81384 144871 140361 -19809 -20667 24782 -225091 -81765 -204786
19113 -204786 319969 -84905 -176222 -107287 185376 -299384 -120350 -37072 -110097 -234000
19103 -234000 192685 -310719 -165209 -10089 -73191 -84388 41069 366443 -370223 -333897
19093 -333897 -67306 29345 -321283 98804 -76202 96626 -247731 -31673 -158525 -55645 -180295
19082 -180295 -13461 -3053 88655 121087 -310366 -94995 77674 -188790 -135287 -297505 -159184
19071 -159184 -185368 157895 -95151 15531 90145 9633 65552 -188076 -76719 -159029 19067
19059 -250143 88044 -224442 -223957 93933 -7669 303038 120451 -175857 -136639 -174170 8814
19047 206282 148874 119757 -107302 -265596 87669 94786 -82870 125656 10163 -67587 -237131
19036 -237131 -247908 80490 -209264 -142419 -216592 154151 -49072 -350 -36104 -120130 156446
19024 108407 84920 -278622 285520 38 138681 243474 164168 -268244 -270118 -150563 -68075
19012 224103 -391552 101080 -161070 -23181 -65655 72864 -18232 435174 179531 -438728
19001 -415340 -177700 81642 115918 94750 -49590 -314082 -105165 -28711 -140492 -44501 -139471
18990 -139471 -144016 48780 -160641 82766 170106 -96633 356138 7496 -115255 -27786 -181342
18979 -181342 -30141 94464 52652 18336 208969 -204509 166813 -154815 -150262 -325926 61038
18967 138193 -308704 -64670 72514 -83614 27914 -39805 -415877 39463 158522 -344489 29327
18955 -362781 -191375 87036 -220005 129649 -235579 -114408 137616 -272345 205610 -73878
18944 -129186 125984 -39329 -297379 -34654 -46423 122550 -2937 -305821 -178843 -73231 -73640
18933 -73640 209898 30388 18788 95751 -38714 -112910 17662 -178111 -27468 13481 -20542
18921 -71348 -56041 205090 -9977 263268 -214122 -275038 -140680 -28012 194059 -115043 -28718
18909 5937 -312667 113090 120516 -75355 102196 -46201 -301546 -142885 -95249 -60465 -27347
18897 -116929 160051 35543 -222842 -112632 195941 -70204 -66307 133120 -23087 -19086 -210420
18886 -210420 -238735 302588 127194 -124923 37611 41619 1186 -40319 -206557 -112934 -246017
18875 -246017 -65561 35164 -10266 14182 -186847 145346 -16411 -136052 -173464 -102811 134278
18863 98886 6649 -189962 -198127 269604 -61147 123881 -152755 196054 -41204 -272429 -279784
18852 -279784 67114 28137 112285 67561 166437 -6212 -114868 -425611 -92604 -305880 201841
18840 109949 -304082 -108133 31709 -316106 -201338 -41460 59388 -151375 -243928 94531
18829 -459167 -225693 -211187 107686 -2951 5993 -61706 181368 -87487 -9593 81400 129814
18818 129814 113032 53631 20781 282538 305915 -200300 -16347 286600 73679 21924 148413
18807 148413 47459 98295 -32577 46946 5196 29984 -142195 -53521 -80472 181864 -256391
18795 -46125 -20403 204150 -244645 18301 -76201 260898 -139207 -260465 81432 60857 -31888
18783 16507 66853 -282048 293653 -187165 -189402 -394451 -144615 -264767 43838 138796 112674
18772 112674 -101891 -74145 -404685 -230807 237069 -170652 -225250 252227 -374334 -116721
18761 -117917 146540 226548 102236 205146 -285293 226271 -26596 -380904 33227 -31963
18750 -85842 -369689 -109275 -58620 -135081 47704 -183241 -58352 -16926 46044 -58585 -72034
18739 -72034 62769 2546 -186769 3279 -180392 -125692 -79969 -44411 -119244 -138725 -96292 -2905
18726 -117689 -48667 -112264 -198043 -235970 -189071 159295 -152971 11623 220529 -131922 1088
18714 43452 384073 204022 -118671 -66666 -188182 52456 155448 -184502 86294 -312097
18703 -121509 192324 110004 270411 7649 96997 -66237 -95325 104742 24941 -90931 -14667
18691 -217259 255227 -168611 -225460 134431 -172432 -73208 16010 13747 -170465 -296938
18681 -296938 52437 -187474 -106947 -45693 -8072 -157166 53459 48756 -94477 62616 -22594
18669 -291579 206722 -23375 -79512 -202401 -144563 87397 -107491 -82558 -3416 149316 -226190
18657 3427 -174568 -183297 -24498 173517 256447 169619 109201 -204377 -91365 -136692 118800
18645 7431 -264398 227734 45135 -166956 10491 9054 59305 313 -234119 -140459 16141 -186504
18632 -8398 -125274 -105450 2470 -64528 5420 52492 322104 28330 15601 206715 -135936
18620 240025 -327551 140558 -57134 -168742 343563 -162628 -423935 -39286 -63422 -74830
18610 -74830 -94805 -156536 -29983 -199440 238447 39716 -196954 86219 -33902 -24678 29106
18598 50498 -40045 -158364 -378871 9451 14310 27347 -17336 -250195 -34638 152825 77275
18587 77275 -245545 -263112 -70287 -315342 254504 131550 -170045 -89491 87319 130335 102701
18576 102701 -200880 -416618 -124951 -108996 81312 75068 -87120 194817 150201 -415926 243881
18564 285666 91596 -399281 -295947 -416751 444801 301911 -213299 -236155 36228 115022
18554 115022 209337 29345 3479 186594 79266 -8535 130098 203505 97038 -126222 -369854
18543 -369854 -89985 -39241 -156568 -287139 -52118 186059 -61785 -120455 310771 -8162 -162251
18532 -162251 4209 -198563 199159 71964 -252580 90256 -366565 134055 46983 93126 -64861
18520 -18609 139033 -52327 -381963 -337452 -161114 179409 89135 -143416 186494 140276
18510 140276 -1930 38391 -79580 -80230 -205599 -66168 -357303 136199 100867 277434 -320456
18498 -308362 44615 -87913 8967 -364265 -218551 183922 -21699 -193081 63887 -162700 1466
18486 -293851 86007 71687 -34271 -109276 -158228 -50540 -224563 -52146 -288804 196718 -249044
18474 -105667 -65969 49489 -50534 32220 972 -343016 -272128 -175740 -76358 243052 -44651
18462 -48277 -28420 -284688 -185618 197842 79137 -35485 -132323 178694 186689 164526 128893
18451 128893 -207837 -170877 141223 -100692 -18670 119192 -95011 -690741 -93217 -138121
18441 -138121 -252816 -104015 -49871 -384406 -30772 37669 109545 -47787 -187282 -275055 51456
18429 8424 -21244 -167092 -69055 135612 -193059 -185766 -30165 164984 -8748 -103675 -301749
18418 -301749 33476 305075 41612 68773 -428345 -147051 -389455 20802 -180182 -95989
18408 -95989 88876 43028 -112282 136764 -378944 -155038 41352 216510 167376 -155014
18397 -122194 19515 -195751 204018 77636 -467957 -219883 105622 -63331 -287196 -123658
18386 -97664 -39108 -234012 272864 -84291 -88015 -46883 153802 104474 -42616 -54060 -94869
18375 -94869 -160890 38614 -68497 -14434 -38918 72214 38014 -15741 -138253 23136 -150638
18363 211769 -55422 -194045 -81689 -626 -31571 61142 2267 105642 -149873 170224 -180781
18351 -6298 65966 -44125 336081 -106749 -34763 3589 24497 146667 -279443 -115539 -32286
18339 -75213 30820 93257 -279683 -134880 32100 52155 -33038 -8602 -41050 -178094 -175668
18328 -175668 243617 -84397 -53608 -108964 119867 86608 -71003 64889 -60558 -12129 205075
18316 -8184 -29398 -110355 8450 -330701 -256395 83346 111080 15760 62122 -182076 57234 -348133
18303 198866 -277393 112034 -29019 -163488 -186597 -496025 -369235 -149220 56282 -253907
18292 -28162 -45713 119048 212824 -95586 48273 -109376 -55100 -144751 -93529 -157460 17311
18280 -224065 -100466 132764 163151 -192160 83278 -48337 54758 -449289 -209660 123769
18269 210763 -109948 -56243 255738 -49527 41929 75531 -109569 -194591 59045 -10988 -149673
18258 -149673 -264699 232978 -185854 130874 -95279 -55445 -156770 180749 -477890 -85622
18247 -102922 -159188 69878 20669 -324851 148427 -228567 242995 170819 -41064 25740 -9716
18235 22289 -310183 -99799 -326170 -265196 -155681 -234343 -197789 291946 -179180 217146
18224 336889 -50682 -11579 -128003 164357 193212 -113893 -25742 225866 252476 -232108
18213 145459 -329119 53144 14073 142762 -470637 132368 -91298 -87636 -261692 75878 -85201
18201 -63333 -198437 -340906 -312937 73037 239262 -159975 240461 39501 -16470 -195827
18191 -195827 177074 -139618 -132179 157645 147109 340748 -368598 -72272 -167133 -187448 251797
18179 -30072 18229 -199010 49533 -192713 -22784 -462787 -224210 -27381 139267 29617 -99780
18167 -197527 59843 -16332 38612 -31760 -86201 312252 -268611 132527 -11940 98948 -283104
18155 198387 140102 23255 -149733 -119996 -52388 -80412 -31557 301130 -169913 -22961 -222146
18144 -222146 142867 -90827 -145808 24888 -87637 98466 -77156 24372 -81251 -114942 -139837
18133 -139837 45589 65607 -140806 -180628 82508 9149 -52769 345340 104754 24787 65106
18122 65106 -307751 56968 185510 -87537 128321 -177754 -1141 120402 -15873 -121021 4813
18110 20069 296973 197834 35239 41717 -186742 -174871 -131310 -390805 65630 -187265 257521
18098 79296 -111150 -276083 -125698 61717 50712 71172 -12222 -49675 103576 6543 -1846
18086 -131761 115980 126556 137317 -14505 -91745 34818 17159 -9844 -223168 84856 -83225
18074 21054 -253862 -102025 112226 -84274 72140 -67358 -143076 -21301 13232 -65069 -110082
18063 -110082 81446 5113 -52188 111180 190045 -16706 -180965 103136 70935 118490 228500
18052 228500 -55222 -150993 -136574 1453 -119001 -46707 -280779 -56518 46309 152106 157134
18041 157134 214880 8844 43896 194903 -135996 253331 -263253 176156 114740 134994 -82249
18029 39056 -14684 -195028 -60992 139066 99863 -13098 -23509 -22249 -15737 29592 -4308 -7716
18017 -7716 174920 -97280 426645 -95356 63261 -406292 186910 195330 -26390 -290429 -91758
18005 143935 -40223 -282082 -36175 -151005 -24896 15722 -271591 -297924 7322 -143484 -155530
17994 -155530 -105313 -55384 -139033 -23764 251793 61047 -141402 166 -174608 -157006 -203900
17983 -203900 -278199 -95179 350764 219862 -48431 32002 -231990 102033 -168544 -38824
17972 94992 -51335 17862 147466 74550 -90893 -68643 -51795 -142618 -3015 191977 -116923
17960 -140091 88456 192247 240570 -197858 148965 337540 44891 -169874 -18388 -32339
17950 -32339 85768 111948 -31461 288930 -82102 124740 117724 -251638 -86620 -127659 -131539
17939 -131539 -223490 362179 -121606 -144248 -84993 -40478 -547769 -90130 -201336 -234872 -94425
17927 123225 -243129 -266701 179130 134430 176855 -91204 290928 -379999 141028 -4903 89118
17915 -38967 93796 240768 -119237 -221185 -48244 105011 -46225 153728 209140 -183834
17904 388915 113666 72820 347181 21083 -233783 -62768 238076 -86309 84515 47790 177342
17893 177342 71806 -80877 22766 -36031 300990 -14073 -134678 96961 42968 141158 7344
17881 -65786 13858 -155710 67216 -181661 92965 171633 -23140 86464 20106 -2449 175951
17869 25749 -64000 52489 -262196 -106392 -182192 281825 -10095 -194866 102336 -108403
17858 -160585 -214171 -76466 -73282 -76804 28026 174856 296433 65058 235736 -175417 -323467
17847 -323467 72718 -171465 -57388 -19840 39588 134641 -184224 -159606 -267934 -67858 10438
17835 25233 82677 -77862 261852 180135 11573 -138095 128645 969 -232596 59807 -87085
17823 -182489 1726 -146788 355012 423255 72535 -312386 -133361 39049 -315528 -127750
17812 -280475 -30391 -94665 11140 304472 -223746 -90451 -54108 323074 -45839 -18298 73729
17800 -151763 -188819 -67662 98065 -143984 -127838 -271390 -79038 -148534 151603 3675 -84073
17788 58553 171107 12281 -194941 -18722 417747 -103147 -246126 -213633 -110341 168066
17777 -12220 -60208 -232443 23683 -18745 -199984 74823 34638 -261024 293545 60155 -485629
17765 -58948 122919 -174204 -31598 25031 13191 -191609 -250996 -102649 26497 39112 -38708
17753 -155674 168645 381963 -109282 -150478 -73797 103029 -384591 -104253 38580 169181
17743 169181 119092 -403652 304823 28020 -528945 509186 145610 -248250 113776 -45843
17732 181315 -184270 362610 -26732 202941 -178276 83172 16818 -174288 328164 112357
17721 65853 106100 62054 -15868 55543 279752 317 368411 99976 -12919 106858 -235086
17709 155426 252490 -177817 -141000 -125829 -122563 -44082 -10439 -239033 -65294 119300 -104570
17697 53272 240312 -46777 -327661 203124 128500 -34162 10682 -71997 8391 154005 88565
17686 88565 -162198 -58324 48308 -77532 -103666 -249805 228025 -283139 -26914 -128697 -162804
17675 -162804 286925 40328 -101000 306419 -123714 169541 28545 1250 21340 -129752
17664 468224 62050 347630 4173 298127 69987 30446 65477 50668 -180163 -137151 -239515
17653 -239515 151264 -131813 222337 -29144 30390 80464 -50277 168336 140128 105293 -19488
17641 -39339 118417 -26378 277607 236205 -286586 -136635 -103132 -254306 10751 5814 60414
17630 60414 -210275 96476 -377886 213575 141433 171999 36680 311475 132283 -229309
17619 1656 -5242 16785 -87164 -4955 -114883 -29130 -79704 71455 37730 63734 115975 251435
17607 251435 228037 -196132 143741 261959 -105713 -81529 106633 91120 -85290 -212908
17597 -212908 106967 65996 169193 -26216 83323 145506 109849 42707 128840 -254796 -106238
17585 42426 -102277 -143196 -45472 -40079 -31427 227231 300652 187207 -98269 464537 -311436
17573 -130434 -14015 134187 195273 -161149 123749 -76210 36420 -5807 15849 55326 -186459
17561 -153248 99332 -32611 -229383 131843 310403 -25361 13720 112380 213146 116988 209422
17550 209422 -156600 301257 -113467 -154101 116489 -122489 -154414 -52489 -31698 81554
17539 112806 129115 -219203 -31975 -175529 109487 196719 -22956 -168102 -63100 -165218
17529 -165218 -112252 -86157 99977 90833 34438 -159846 -5760 34676 163583 53442 306189
17518 306189 903 -13411 -211505 56104 -1866 127449 60301 86879 25439 -114927 201104
17506 -5260 235672 -129397 132215 301520 20664 48966 129642 73494 -352151 -240994 -72510
17494 26390 136802 118109 -3313 -59892 114720 -87135 192734 232843 -182673 142543 -1476
17482 77922 -57369 303544 243131 230067 -102758 -70853 212953 -212457 220573 168917 86774
17471 86774 31550 74905 602486 268529 131233 -159847 32273 166912 158722 248630 416632
17460 416632 -282789 -109543 -34392 28587 -131402 193823 -96290 -116518 249094 28902
17449 300349 373342 186216 198082 204487 195930 411273 105032 -92791 120545 406149 438461
17438 438461 207239 204043 299382 137917 -36789 366850 47593 363654 113725 277350
17428 277350 40054 241633 -31938 523064 -148985 19281 331785 376294 -26123 131525
17417 351699 196682 223775 584175 278302 242268 343803 496857 23517 279169 370153
17407 370153 -73045 150218 72217 9130 148747 -265184 -82482 209787 275969 263091 538061
17396 538061 159428 155012 424155 182071 85795 404811 108337 307571 207173 157158
17386 157158 174446 28086 20223 96554 176860 81451 201332 123288 210925 -31856 -7331 -146343
17374 -146343 308640 -33881 77914 120416 -216154 239437 55038 -264884 -26134 476384
17363 336985 149306 52975 272745 111187 32873 -175 28010 134363 582112 -59953 -31321
17352 -31321 215484 -41644 156016 137304 60836 312573 160865 1618 25663 222884 -115437
17340 249090 76659 8270 444663 332547 178401 54212 47086 47438 134607 73458 26865 -81484
17327 241893 -73764 -16510 -134270 113064 272435 -357981 -77258 -71710 -74302 43755 228944
17316 228944 263545 206850 170862 121741 348530 354049 263197 113792 74420 279143 297246
17305 297246 98320 98390 276216 -46151 292580 48718 -36672 32557 174152 -92982 70798
17293 276173 104993 110480 405407 38033 416219 -223477 185809 221360 327582 -142564
17282 62443 168361 157050 215340 200529 305888 182022 -135537 527547 296096 394319
17272 394319 166253 199389 416460 290029 32583 91866 -107460 105631 134849 241627
17262 241627 31026 131107 94992 227174 -118197 220717 120628 255341 211948 136361
17252 136361 64826 -127493 -210399 125591 112284 47562 187641 269881 300471 6402 451719
17241 451719 149762 423915 126296 308656 213605 41940 181958 58744 -233828 37867
17230 -84963 313747 111327 127168 102815 -376169 277402 -123964 -178977 97943 156277 231406
17219 231406 157801 -345412 37467 165907 531879 -172522 108814 216268 188160 332812
17209 332812 289125 235681 76840 45059 245373 36550 249362 138477 551388 361496
17199 361496 133014 -60024 165590 122387 84211 -55107 326633 153737 277544 151039
17189 151039 424191 -24362 237862 44454 359831 108716 49920 -44500 105799 204133
17179 204133 -173590 340711 532433 350156 356701 521421 118419 274002 89968 67963
17169 67963 -131361 128189 106346 334367 439552 435316 31794 233144 50266 215781 161799
17158 161799 523873 178249 203854 185059 413952 64200 442248 89581 354519 405881
17148 405881 322762 154675 450395 270534 189456 286721 211086 305448 216542 200884 179038
17137 179038 231144 333986 251143 288498 245019 265551 442293 563880 100953 101340 56546
17126 56546 174590 157972 436381 292832 32111 475837 248973 151381 286221 414599
17116 414599 226543 350377 126578 49331 210303 116251 376999 256854 85801 386813
17106 386813 372698 101993 442212 344467 337224 425770 342125 425921 626186 639945 380420
17095 380420 1608 205675 477089 644716 179582 324796 288458 309129 350677 493902
17085 493902 268869 323967 571871 -150393 608202 355429 271771 204097 -60047 203351
17074 451581 785876 530683 285804 -4212 719682 559970 380783 219423 362120 503090
17064 503090 232606 -2122 320459 580932 526644 559796 495073 590717 492688 533105 443101
17053 443101 236081 438397 108450 329581 711432 413337 608599 -47810 423694 322192
17043 322192 516800 616126 454344 438260 579293 398873 716545 352610 307647 590416
17033 590416 294743 377342 613453 445886 434930 560312 537822 514784 507290 341061 864632
17022 864632 442126 409968 774523 770494 412729 579511 535029 438980 694968 599317 439232
17011 439232 666507 609674 743648 510482 615052 680917 930802 511611 693930 452891
17001 452891 565534 640095 757835 867042 367130 412129 551071 467151 466540 731003 463041
16990 463041 570935 717375 877646 806123 591761 1219498 588702 532204 865690 787042
16980 787042 999490 286965 824629 953066 778575 1016400 740050 480567 772254 941911
16970 941911 918563 756982 964437 769476 824928 928315 692224 1172576 747095 1030741
16960 1030741 937725 791834 1073721 662791 1077597 780160 720672 962100 890850 622421
16950 622421 743475 1140898 873227 859552 1082675 785553 844135 861768 860285 1041883
16940 1041883 1034298 966404 1267858 933066 1287834 1246097 1157934 951598 932329 911165 960700
16929 960700 1039991 1194729 1392751 993456 1051715 952324 1527294 1050469 1188373 1555553
16919 1555553 1485259 1169476 1342637 1412123 1388129 856609 1263977 1347510 1344883 1256188 1646476
16908 1646476 1305494 1283705 1433121 1463772 1289050 1507138 1272954 1441889 1312619 1314917
16898 1314917 1441300 1470635 1445816 1311048 1485093 1448751 1556071 1459270 1677279 1893510
16888 1893510 1958450 1821050 1773042 1745815 1906464 1741956 1677329 1973006 2070398 2048762
16878 2048762 1884082 1854984 1871971 1904506 1927795 1886197 1648560 2321486 1971952 2433203
16868 2433203 2482359 2372263 2383153 2405457 2274789 2223078 2531525 2596019 2441830 2722416
16858 2722416 2373632 2611724 2227256 2745785 2879722 2776061 2884753 3017305 2709415
16849 2709415 3139138 2732483 3075417 2831454 3024990 3119436 2882900 3267079 3271985 3460800
16839 3460800 3405926 3759432 3060052 3615194 4015593 3661418 4049926 3834358 4031407 3834350
16829 3834350 3944492 4064919 4375640 4152417 4232219 4185005 4255486 4362203 4540268 4692233
16819 4692233 4526112 4877074 4919061 5247935 5730304 5193768 5695610 5790413 5489648 5697709
16809 5697709 6379864 6157207 6252651 6376138 6438198 6617113 6424017 6928249 7294089 7263053
16799 7263053 7195456 7607893 7839634 7732791 8169785 8266452 8988541 8744640 8965064 9490275
16789 9490275 9447814 9796041 9968901 10404335 10312874 10958249 11106022 11741741 11462988 12397796
16779 12397796 12643918 12805384 13194335 13331301 14208339 14613054 15300592 15743001 15643213
16770 15643213 16515645 16994729 18066656 18178696 19185306 19606418 20413462 21515764 21964269
16761 21964269 23154147 23941367 25057951 25820282 27046848 28102286 29590426 30779829
16753 30779829 32168883 33458332 35244804 36920719 38572378 40262852 42653849 44402461
16745 44402461 46895230 49783051 52042210 55073266 57611446 61273167 64690017 68363687
16737 68363687 72380162 76596403 80953095 85729512 90969275 96169823 101906377 107541606
16729 107541606 113781340 119919377 126111333 132434294 138301098 144380984 150085515 155450691
16721 155450691 159772449 163790637 166554442 168793188 169937765 169853625 169515632 167354022
16713 167354022 164642390 161246977 156777237 151450160 146391090 140453277 134490370 127902383
16705 127902383 121834480 115789310 109445262 103432077 97632079 92072991 87142790 82424085
16697 82424085 77627746 73236929 69153036 65410719 61845225 58546212 55629405 52688399
16689 52688399 49671182 47157537 44589637 42597256 40383507 38455609 36933109 34915470
16681 34915470 33310163 31872279 30592578 29285778 27963745 26684448 25663979 24727982
16673 24727982 23628528 22551470 21853338 21021858 20247795 19346904 18557268 18021717 17358341
16664 17358341 16926548 16308345 15946647 15369724 14837396 14108710 13707608 13436758 12991677
16655 12991677 12272204 12090235 11797237 11414458 11268808 10593781 10440595 10660123 10072038
16646 10072038 9624460 9109778 8865069 8767054 8644013 8580742 8078837 8155326 7917767 7367065
16636 7367065 7134906 7378715 7091167 6704783 6739971 6716184 6309999 6266275 6080924 6112370
16626 6112370 5943227 5767547 5655227 5671019 5666887 5099927 4917006 4798317 5027613 4709412
16616 4709412 4618701 4921366 4634812 4502641 4335626 4415778 4251126 4318846 4048706 4102989
16606 4102989 3916809 3710771 3688981 3890127 3865806 3310885 3874047 3560079 3424680 3458789
16596 3458789 3114450 3308027 3552060 3236059 3341262 3185479 3114195 2824511 2832976 2954052
16586 2954052 2631307 2655273 2870555 2880705 2730517 2403730 2695617 2334014 2374096 2556460
16576 2556460 2428802 2661755 2529901 2741492 2251216 2154652 2310104 2068445 2432644 2406916
16566 2406916 1680911 2102142 1960497 2171002 2005440 1946794 1893401 1794961 1881686 2170684
16556 2170684 1764197 2095695 1928556 1810435 1961447 1882941 1886692 1904826 1796360 1684459
16546 1684459 1556004 1652593 1875206 1476074 1440166 1423769 1458371 1751295 1562803 1364443
16536 1364443 1296132 1862850 1621354 1521892 1497405 1431017 1494635 1641162 1617092 1519754 1066341
16525 1066341 1553170 1536342 1406563 1259407 1291052 1574138 1581540 1473293 1491519 883438
16515 883438 992618 1267299 1089750 1006041 1257435 1170082 1218908 1084590 1054259 1316420
16505 1316420 1152997 984443 838352 1184103 1108094 812979 1297251 1423695 820756 1110161
16495 1110161 1120932 1131803 784986 1095769 1033864 1140924 802533 1190838 842886 884084
16485 884084 819970 1550029 727882 647137 816531 954966 543406 816134 719366 619137
16475 619137 636232 746186 649746 658730 784718 912251 896350 679296 684092 615186 761455
16464 761455 671128 840373 1083750 613128 668462 700939 922661 760113 473059 646396
16454 646396 471982 767402 1206502 918085 1044831 546797 680203 1098494 724076 687889
16444 687889 760867 566629 613023 500198 968953 357153 797550 538554 620975 441543
16434 441543 497185 713559 481573 596332 793362 716501 593621 593378 576809 880681 562640
16423 562640 428803 322428 616744 776825 588936 340817 555743 432109 570712 677612
16413 677612 765035 427116 449908 743108 507892 536461 427841 691436 201252 505600
16403 505600 660447 692280 626913 628627 286076 396232 612836 197098 473190 493623
16393 493623 581144 338608 523411 429583 711285 441490 345794 427960 636665 367907
16383 367907 182255 445002 645653 438791 249396 472094 312230 569738 309401 291973
16373 291973 271632 361306 412412 339676 211693 362361 446440 346560 328363 309210 531164
16362 531164 542427 291003 403490 749258 619097 476302 324080 687574 279459 347496
16352 347496 220356 516534 285067 219028 359505 592498 464532 100142 234781 -27472
16341 414675 284763 239514 190528 469730 492127 368658 444423 316177 312746 264458 527377
16330 527377 420660 355912 376730 473057 646416 183233 124437 589022 458729 606049
16320 606049 380605 348819 357488 497601 -12535 308794 252598 107648 290115 515201
16310 515201 98692 238614 72248 198849 354721 117453 269177 15604 225661 215040
16300 215040 311480 66379 384907 90777 299656 161270 366681 138872 298089 51600
16289 436011 98546 299855 351571 331839 549338 309751 429269 -38290 37327 131883 381474
16278 381474 178338 -2194 -59329 300869 129186 -42193 90322 79747 90774 306642 301540
16267 301540 535562 322039 254695 178034 73697 191925 542891 385055 140782 274662
16257 274662 -182442 525424 638483 241410 127824 278092 232578 240951 403385 444460
16247 444460 385567 282825 286743 536064 22120 9063 312101 -5961 -86108 139256 49533
16235 359832 -42739 272102 65046 386383 260929 200599 22752 261101 161152 -85095 330318
16223 8976 123985 317083 319233 188459 26056 167364 303212 192338 462551 352452
16213 352452 212386 -19510 460087 -59608 220209 262306 236086 236797 -198957 -150842 359752
16201 42517 231972 -5905 -85105 185412 -68420 256303 390266 55746 -145718 162570 56201
16189 268348 371028 -129475 51770 313811 166466 218032 339293 72078 127838 201456
16179 201456 -181701 297798 205126 125544 49592 195863 -89217 -40334 -206279 114129
16168 44443 1614 -73561 -156508 168256 211527 440683 223416 54438 52095 -268970 -155181
16157 -155181 268409 288538 -50661 539809 166530 325641 -2686 -84878 -49685 -56649 156218
16145 340802 189142 -199869 -73619 -65643 367885 288285 92457 -149457 18218 -184656 205773
16133 293879 548594 184890 127129 -63126 -214578 397717 144001 -81371 169089 61755
16122 355263 281069 -8899 131548 -218118 169091 192661 -342485 -255571 126013 292676
16112 292676 127840 -133338 158065 169199 140508 -121817 167142 468223 -124420 437088
16101 35387 52294 61039 30042 141671 207159 376860 -103173 178053 -78459 19422 -105916
16089 -64498 42091 296432 -184510 -116743 -152932 231639 -70148 -241572 43185 68430 16960
16077 -96308 104096 101497 149452 -5748 94692 -35034 196574 248162 193399 337312 652 -1852
16064 70047 -149974 -16940 178167 238079 146698 48659 105007 101544 -23500 362206 -186549
16052 -58616 103755 -26033 -6578 24392 -55468 -37026 63460 -313097 307079 77634 -177805
16040 296571 317086 25378 99323 24851 64638 43879 23072 -5947 80531 262999 191906
16029 191906 307291 -329525 -286420 -176716 147792 15638 97316 -202914 22273 -244409
16018 230982 30572 -18392 -165030 98540 -180261 -12109 103858 255366 -339850 -27322
16007 -27097 72602 -131824 145290 -102203 226081 -16388 -232157 3740 -110013 28041 -250726
15995 165159 -150030 254304 -22843 166784 -220075 165127 -22206 -41234 -162636 251512
15984 -147383 135010 197721 -142151 -1406 498903 399364 33521 157026 93289 -101245 112210
15972 99808 -116434 -59669 88929 -306446 -167613 19453 91979 274710 54136 278468 217555
15961 217555 10394 506832 -46924 -110801 -100222 -54165 175596 -84974 -134717 -47177 82058
15949 -290494 -64311 52963 -286072 -205222 -45945 163640 29888 -431897 143095 11707 -46710
15937 -69914 25154 -109498 -322522 234704 30750 -349 -7501 157897 147718 -84365 -91183 -115279
15925 -115279 226462 -224366 -255126 -224997 123596 220201 -157369 134261 -55984 -158434
15915 -158434 -202877 35851 -114675 -216023 287590 -239425 -84373 -246709 186542 87651
15904 -2064 313578 4663 45004 27253 -359243 -12705 94051 109510 -40706 -18286 -25002 -69286
15892 -69286 142790 -89571 280474 31333 -57481 -93790 15658 -237618 241437 68400 -257366
15880 -317166 -151259 244809 -88170 -160870 -135208 -74718 -261265 -22290 -289488 -277740 -381148
15869 -381148 3853 166807 -203555 45282 -125009 -358765 336647 -32372 174997 -205321
15858 -131241 -14605 -310399 135338 389334 -28940 129597 -229198 -111864 -66542 229155
15847 -196188 -301665 -123161 31292 312329 39944 -231354 -235435 -266308 254428 -165614
15836 -72552 366801 31055 -73412 -18501 -76625 407214 -315466 230219 -15368 118009 -4548
15824 -13896 -174690 282200 -165502 -156078 -95292 313762 -132459 -114840 -141786 -253722 157093
15812 -26846 -82068 -13629 89447 -68769 5768 -58905 26537 40287 49411 -246016 35084 -93354
15799 320041 131291 3102 105938 -276 -127793 66064 67383 402080 2687 171155 -88985
15787 283599 -199935 -55401 -330897 -72915 -302370 57682 136711 98499 781 -113277 -22447
15775 33415 182849 8374 68759 -74723 -262893 81851 -50139 111054 -68866 -216009 -17974
15763 -17033 -109346 116205 -181398 -97625 -136989 -93127 62692 153737 631 -157474 -186777
15752 -186777 -99801 -343482 -153568 591117 326148 -46809 25949 -78130 -351612 30956
15741 -37465 -32450 -157153 -7811 -81892 -100927 -74546 -66230 -192253 -24851 -55526 -371299 -136842
15728 -164895 -339869 25015 -348224 -184672 -170054 20028 -315530 135482 -244348 -130149
15718 -130149 -330121 235269 9454 127039 127582 72277 -42531 21348 -86832 -239851 196218
15706 -180901 -151757 -148445 -102647 -63060 157812 45419 -110129 96263 -270904 183429 -165464
15694 142522 -144905 -31208 99738 -119444 127888 -74165 -180479 147093 -18330 826 102144
15683 102144 10205 328179 11435 107048 -94553 -23128 -39198 292988 -210415 5290 -299914
15671 -91908 -123060 -244760 -77972 303601 66214 134645 -195649 272171 -245105 -231515 159787
15659 92320 77496 -111242 169388 -100148 -179618 9797 -370183 -379994 -231816 -201400 298227
15647 -85060 -240793 -237711 131496 204141 -14724 -246363 -130669 291490 -188207 -150868 -247132
15636 -247132 132493 3191 11764 -62586 50829 252655 10839 -4381 231651 5929 202968
15625 202968 201566 -277868 -127749 74572 423382 -83540 68076 -51743 -257209 -117468 -218430
15614 -218430 -35823 -144713 -248192 -140258 171822 -165010 -23828 -24766 -84463 -93854 -186704
15603 -186704 205567 -122837 -366659 -39030 196476 228718 62733 202549 -14945 -135540
15593 -135540 229072 -92136 240458 -336337 -296547 -66374 175863 -310800 96562 -119142
15582 -60703 -17243 -141800 115055 -2220 -95886 27028 153338 -103582 166843 -44121 -358242
15571 -358242 -284078 -221245 -181868 -149046 67003 -143391 29818 -39270 -498 8379 254991 -75643
15558 -156882 7169 -342240 130348 154732 -94656 14359 -13377 -9568 -65959 -86657 165094
15546 184364 15422 105025 -394330 -194022 405790 -16876 -173767 -476764 -30437 210385
15535 90243 57416 -69779 -70387 291817 -198030 -7531 -98129 196723 -42750 -160635 -293305
15524 -293305 -156492 -291808 47278 -163324 -13355 -49560 115819 -13871 227688 298029
15514 298029 -49942 -73919 -56041 78886 -112686 158661 218851 1067 -86745 39283 -233232
15502 -48367 -74920 -103996 -100696 -151070 86006 -193760 309143 77671 -52650 23569 -23443
15490 -134434 -70204 246857 33185 -267792 100512 -108244 -152480 -169355 254815 -152673
15479 -100482 -127217 -208649 298872 91676 -70444 -63555 -43660 5607 10831 145970 38435 -15556
15466 -417464 -39929 -6453 -195025 170195 19334 -242395 88178 58720 -92973 -185483 -129745
15455 -129745 -170150 69147 -182051 -109955 -177248 -219192 -87074 36037 -68981 37135 -158123
15443 90157 -322238 78752 15770 219465 -13275 -100830 -42406 -7002 265593 104972 -13129
15431 76638 216639 -119042 -145568 179394 86622 -273400 116747 9420 257430 -46736 -86391
15420 -86391 -218267 10138 -65471 81228 167082 -98505 122731 186729 329285 -101049 20130
15408 -44469 -232185 263684 31169 548948 -23000 -91397 -340188 -78692 -97912 -99149 -111415
15397 -111415 73605 -5634 -284282 -27023 -258776 234144 -110600 30998 -208387 118123
15386 -79891 234163 180522 186589 -134758 -23351 -333298 -222647 33678 146474 152609 152083
15375 152083 72983 -183828 -65840 -13892 72800 -318848 -12674 -261364 111423 151229 223889
15364 223889 -87073 146192 32796 -167314 310355 156116 -10667 -79916 -417596 357253
15353 341537 49819 -213333 19642 -36737 -61189 120098 -193654 13736 11608 -379978 -172256
15341 112461 38947 199793 -146565 -132231 -105427 -77642 102105 262102 87517 55837 -11296
15329 -130313 -66083 -53591 120005 -147275 154659 131654 -242029 79935 127808 -14378 113079
15317 -27554 -16128 179261 -100745 97227 -63775 -255901 150442 524419 119533 163255
15307 163255 -36746 101666 97470 -59078 -166258 115051 349224 -99567 180675 -321 -170137
15296 -170137 90943 -140630 239780 75295 163863 231407 204334 -118321 194818 78463 -56252
15284 -197653 -2414 -82284 -317407 289298 -169826 -106810 15023 -139689 16258 171112 36747
15272 87816 -38565 356520 94641 252626 -207571 38358 25471 87386 -65411 218650 19928
15260 -290758 -48513 125239 386684 -60595 -329783 98070 -18129 119767 164899 334248
15250 334248 -102559 318295 764563 1148281 1893787 1468050 1427146 1017539 233700 161046
15240 161046 -213693 245136 335355 -6577 90667 -129948 72399 1285 1575 261682 1027 -136339
15227 248504 -183853 257911 196539 227586 237622 -119895 -102779 -46056 -139615 -298269 25426
15215 -156229 177196 253583 -31037 97259 37364 -11923 12825 148120 201 -65416 107341
15203 -85553 -386106 120836 -77721 -44113 241596 250048 -120045 -129387 -193893 -18125 27271
15191 -61901 -29646 258971 104157 110349 223207 46042 102610 42410 -119614 85499 -24184
15179 254835 -150491 283386 -7917 -324324 43024 -138435 -7505 -207445 376882 422429 -8017
15167 -111054 42425 -73753 47535 -29785 56683 -137552 261530 341981 259580 -339357 -309592
15156 -309592 376547 125617 34967 163677 283342 33529 68622 82566 -139698 195425
15145 88472 361323 -98403 242212 349616 130861 214196 -55301 -48103 258813 99911 33073
15133 87659 268811 30406 -167327 253537 199140 -83795 67017 276137 21822 82992 263348
15122 263348 -149055 390289 443766 225059 9917 -152475 188402 -98686 -83137 17050 -46810
15110 -85310 275647 5035 118741 -45422 -134224 71024 -170417 28966 184011 58225 -295664
15098 -170975 42856 47157 26610 -156660 202989 188584 -47557 120692 97137 14984 91820
15087 91820 295867 195511 277241 -357025 241481 51335 -150052 172476 138581 56975
15076 579 200210 100261 367975 304922 130244 111245 -23993 -166904 220909 232387 -145845
15064 368168 97205 161990 26875 199462 -213262 359817 -182529 -113431 297359 233015
15054 233015 -934 -16275 38695 70672 71188 118350 -461 310511 -124718 250894 146739 224053
15042 224053 32192 294446 402953 82668 -129875 20256 354043 355847 -130574 12996 108019
15031 108019 103687 -94824 112012 173572 59011 91125 -119245 198547 480597 432769 284161
15020 284161 577777 288307 344608 192096 473744 81871 123229 252993 135275 -85224
15009 177928 192607 233671 51224 133279 413678 157762 76198 95780 558177 -51116 232999
14997 -287612 97723 372548 492618 218589 192880 206448 216991 -12906 137524 152911 -11315
14985 31112 -298954 87857 -43947 299122 -170401 260924 327831 47448 170141 -10724 232323
14973 131009 -132666 -85133 330830 77008 367722 205215 198927 -86527 488942 335219
14963 335219 148604 6851 28809 46747 474922 412210 502727 183585 297113 213322 404207
14952 404207 95471 169740 66338 168366 356315 183101 81413 186995 410553 384411
14942 384411 466725 272665 121543 163667 53659 264396 240099 275727 195971 159164 333461
14931 333461 222147 -31071 113348 276907 142553 115648 435 222468 429882 304113
14921 304113 292482 527488 153370 54430 495063 287036 478769 460151 316724 557227
14911 557227 248616 513751 378443 116915 218338 467479 239575 145925 394188 245535
14901 245535 177323 685888 653022 392757 432496 532089 65611 372410 75448 224926 643637
14890 643637 419749 244065 441016 286012 278237 496137 326597 442738 520260 123900
14879 334894 39113 372806 144813 -62042 -51395 315604 170869 82308 734990 141512
14868 338600 231090 99718 120505 26593 121138 583179 10893 213853 408674 78285 315057
14857 315057 183210 361406 288317 435666 170848 233605 504688 146716 397482 222956
14847 222956 455362 317107 635976 358450 106742 354679 406746 -216709 254594 468869
14837 468869 103976 456428 549622 93063 708628 209364 386549 445690 496060 511343
14827 511343 292676 328902 366481 67159 411487 471171 234157 602088 -1375 545681 262705
14815 777437 335803 439136 281765 145819 355949 256855 182571 351703 646032 303282
14804 332748 397501 294437 552970 258059 453003 472031 337296 413988 705850 254293
14793 476959 568231 589025 485538 470789 578910 331692 619719 622030 243325 646195
14783 646195 315901 411083 780776 503816 319828 444140 502302 698707 184953 578931
14773 578931 472869 625787 659609 599429 549724 142059 147080 609233 523529 700204 698596
14762 698596 604658 588877 394828 664613 577422 480955 356349 448684 789045 479215
14752 479215 565661 327057 345893 455979 710254 584310 680074 520329 561074 511185
14742 511185 661714 260939 710078 727319 731969 760841 827958 654807 642596 465785 317137
14731 317137 871189 446355 749018 698043 788964 532450 576458 509033 665736 650592
14721 650592 657150 620314 980015 743111 919817 714007 627175 742926 491919 672989
14711 672989 782560 525782 701776 546864 1129331 1046348 629459 554540 558302 742644
14701 742644 717289 687791 966056 712826 884805 517423 449121 656077 1151707 948631
14691 948631 929857 766267 565252 703646 682562 847055 931687 624432 999913 956418
14681 956418 504470 602231 824786 773620 1210395 940676 729846 948261 894230 931370
14671 931370 999405 508760 819044 892914 989571 1102062 1027011 695174 810665 951405
14661 951405 944997 975140 1117976 981042 723267 1177415 898202 852744 1320079 597397
14650 1156158 594465 1013508 903591 985614 954994 976194 1117251 755282 887441 897934
14640 897934 1142074 1245835 1173770 1433204 1342176 1417286 1035054 1178821 1238071 1203119
14630 1203119 1035300 1268133 1169803 1105978 1117697 1027478 1502214 1381354 1452062 1043976
14620 1043976 1209210 1427181 1200544 1190844 1218462 1301693 1140824 1207841 1255661 1131578
14610 1131578 1252485 1228357 1200917 1384011 1291794 1375892 1456109 1398801 1631684 1132034
14600 1132034 1511119 1558118 1259123 1146024 1183874 1580131 1291555 1596144 1774587 1642197
14590 1642197 1507450 1585373 1620188 1592535 1438714 1831689 1570530 1646302 1295629 1512903
14580 1512903 1367766 1784391 1823766 1643439 1561272 1967464 2107313 1768433 2038258 2086880
14570 2086880 2211920 2184785 1822692 1929759 1854413 2017003 1801410 2086997 2316776 2221189
14560 2221189 2238435 2228544 2584335 2325206 2418671 2617730 3039058 3550873 3935756 3918221
14550 3918221 5273969 7477445 12215732 20702837 26819973 28560586 26397238 15471319
14542 15471319 8933976 4859998 2981238 2333529 1849518 1922280 1796217 1684544 1879869
14533 1879869 1712950 1992029 2118459 1934524 1752092 1990585 2080175 1966348 2005416 2153106
14523 2153106 2208312 2223330 1897046 2207406 2252786 1891498 2248972 2476212 2494899 2194657
14513 2194657 2282519 2443570 2371297 2489573 2246656 2200668 2104533 2435768 2626950 2569190
14503 2569190 2766909 2765936 2487100 2720607 2989635 2702462 2685377 2752673 2870442 2499208
14493 2499208 2873668 2946412 2857951 2658871 2923196 2997512 2948469 3378531 3266031 3079645
14483 3079645 3416489 3332553 3383428 3542390 3277982 3211943 3527679 3180736 3267896 3386957
14473 3386957 3700391 3513629 3633201 3854173 3727892 3948308 3732058 3636844 4007676 3984711
14463 3984711 3968829 4055033 3987013 4243037 4155204 4233828 4048383 4140553 4643104 4535901
14453 4535901 4216237 4427877 4377328 5045987 4777393 4847514 4533277 4731951 4602886 4791228
14443 4791228 4990751 5081352 5088153 4954884 5051214 5247974 5673925 5151105 5787312 5890152
14433 5890152 5784917 5892149 5897197 5826632 6017825 6203392 6112081 6251824 6340925 6252598
14423 6252598 6568926 6695588 6571926 6939797 6631125 6926996 7048997 7260810 7312825 7516950
14413 7516950 7263099 7291127 7745821 7794950 7998010 7886438 8084257 7965231 8507419 8406794
14403 8406794 8694309 8803788 9374708 9032909 9535389 9389393 9479988 9556767 9736524 10038068
14393 10038068 10105429 10179538 10459939 10872207 10822969 10888136 11355146 11714888 11610476 12102204
14383 12102204 12028556 12397829 12313341 12721787 12840771 13418966 13818757 13953679 13851796 14044199
14373 14044199 14332317 14885581 15277341 15350903 15903231 16447174 16624201 16456435 17246784
14364 17246784 17643480 17833488 18074147 18495044 18827073 19400518 20044289 20160282 20772481
14355 20772481 21116170 21246558 22085875 22712881 23259951 23672515 24427427 24996325 26025074
14346 26025074 26134453 26898806 28040087 28315226 28891471 29767571 30584130 31644715 32214952
14337 32214952 33052735 33918567 35121812 36066256 37141364 37876288 39615087 40412562 41817613
14328 41817613 43381882 44723247 45882232 47412312 48992998 50479999 52534893 54069082
14320 54069082 55599719 58199693 60206186 62432245 64811187 67062395 69893893 72535748
14312 72535748 75572339 78407694 81752949 85493366 88837973 92496804 96752056 100876364
14304 100876364 105270884 110318027 115573938 121008423 126858130 133355296 139722072 146814893
14296 146814893 154289471 162205562 170946724 179869954 189500104 199821915 210554450 222149619
14288 222149619 233971990 246423330 259718625 273518647 287981651 302475255 317640989
14281 317640989 332991103 348290694 363487199 378220509 392236050 405730771 417964830
14274 417964830 427985149 432977385 432955762 430755799 426779049 427752401 433237515 433356258
14266 433356258 431348508 426764553 418272634 407488132 395438365 381826135 366820287
14259 366820287 351415462 335970672 319908879 304113380 288986098 274791843 260867988
14252 260867988 248298112 235217472 223046902 211637295 200253691 190171831 180340198
14245 180340198 171575634 162961773 155112895 147516155 140211762 133755108 127186786 121582842
14237 121582842 116159600 110951452 105834451 101098097 96848431 92651142 88854658 85641893
14229 85641893 82220496 78691922 75349870 72420166 69649658 67068002 64469029 61987208
14221 61987208 59823200 57947093 56045650 54197505 52099418 50533584 48758795 47096597
14213 47096597 45936586 44539842 43197612 41637916 40562969 39174562 38329226 37494145
14205 37494145 36402477 35054591 33765184 33104257 32340002 31503560 30621880 29928154 28943261
14196 28943261 28397696 27394815 26947533 26175632 25669323 25036619 24246717 23393548 22874270
14187 22874270 22499543 21925974 21656741 21083049 20416991 20054905 19471812 19232606 18837189
14178 18837189 18102732 17964939 17482428 17173100 16665799 16498654 16148255 15872121 15493213
14169 15493213 15211700 15029341 14918089 14380179 14512384 13948408 13806267 13295382 13020523
14160 13020523 12886504 12723254 12516837 12574686 12256115 12118448 11672228 11279729 11369402 11092499
14150 11092499 10968423 11005165 10479604 10377154 10013949 10157189 10052726 9877252 9587623
14141 9587623 9537730 9506396 9279369 9116646 8858072 9024547 8484817 8615683 8430594 8228680
14131 8228680 7976023 7690170 8008175 8042575 7990861 7677074 7657921 7367055 7568148 7184672
14121 7184672 7403130 7157779 6952511 6920717 6730810 6747633 6411429 6099660 6784704 6349420
14111 6349420 6553381 6543260 6462254 6297526 6292617 6307159 5817811 6089430 5627287 5780354
14101 5780354 5668514 5676823 5098587 5190313 5078279 5321782 5023700 5057228 5000483 5144514
14091 5144514 5239826 4657544 4835336 4907748 4626223 4774809 4467446 4928453 4627649 4477771
14081 4477771 4362540 3936003 4215482 4328601 4144875 4205017 4267135 4316675 3732402 3867884
14071 3867884 4010388 3971683 3840664 3720918 4038085 3743555 3728771 3544970 3716685 3883338
14061 3883338 3363894 3392041 3493925 3341103 3391997 3685384 3577403 3080911 3169351 3361639
14051 3361639 3193480 3122137 3480733 3034323 3022632 3005529 2943302 3043261 2940348 2880137
14041 2880137 2959290 3069375 3015763 2722281 2760874 3050356 3000594 3068594 2869027 2561700
14031 2561700 2911846 3075277 2783693 2762399 2701805 2652435 2669619 2574864 2474567 2539803
14021 2539803 2257856 2535601 2439289 1858129 2428556 2497394 2084241 2088172 2254097 2000055
14011 2000055 1921358 2397743 2656339 1918591 1974101 2083224 2334010 1991676 1922686 1854177
14001 1854177 2144124 1890693 1837805 1750718 1981486 1704052 1767686 1896339 2258209 2179259
13991 2179259 2149705 2914162 3997924 8330915 15936650 24108392 26802730 27608090 17562849
13982 17562849 10619538 6788357 5152863 4144842 3555810 3237657 2967698 2765178 2884432
13973 2884432 2480919 2404965 2556926 2360485 2343514 2394107 2070309 2378059 2005050 2059972
13963 2059972 2043550 1888161 2324147 1989301 2061603 1924265 1821020 1827803 1523907 1833454
13953 1833454 1577381 1584118 1694990 1796807 1774664 1350133 1639473 1678862 1658427 1490136
13943 1490136 1447886 1743643 1652437 1287519 1700887 1429403 1750276 1742696 1658275 1501548
13933 1501548 1545281 1176660 1403849 1525566 1556994 1381262 1293834 1235140 1208435 1129939
13923 1129939 1581915 1268834 1432367 1379266 1272153 1315109 1483802 1332324 1433181 1333097
13913 1333097 1402136 1417391 1162175 1142112 1548448 1438233 1046889 1207792 980863 1569405
13903 1569405 1140172 1391835 925176 1200918 1162564 1060974 939459 1321838 1194618 1240360
13893 1240360 1153039 1381665 1026033 1381928 1084488 1179494 1018609 1144524 1248475 955022
13883 955022 1360126 1075484 981507 1290770 892800 1348357 1079410 1043960 759263 1016737
13873 1016737 799937 1235074 1030910 1056329 1104191 893984 722463 699480 882820 922864
13863 922864 1539285 1130404 1029867 1137103 912973 736384 703689 1192952 787361 1097835
13853 1097835 1011585 1084099 1170781 1204280 973513 761100 1187395 1206983 1195752 985514
13843 985514 894497 1006605 1242962 716926 591702 702531 615274 849988 946773 639117
13833 639117 943844 859544 680761 804594 993273 834464 833230 914137 1017915 842404
13823 842404 885496 1019813 581788 1010582 826130 746509 825421 714435 724777 745057
13813 745057 708518 785030 847543 794392 1103887 868181 852251 539915 998566 411429
13802 610771 917867 569916 888729 527320 627860 823615 663520 492674 720672 830290
13792 830290 593484 512772 1110585 592342 401434 578443 595990 723226 591440 670944
13782 670944 604954 415667 702443 851621 635595 197391 473572 698568 635959 582340
13772 582340 888203 832487 497578 473162 552068 709050 683920 705161 456154 797077
13762 797077 334797 770579 435089 777543 441196 540359 642095 599224 664494 296000
13751 428235 736240 131259 689446 751069 535863 629625 726838 376297 483534 349360
13741 349360 588339 435258 717155 755168 755111 488984 623162 835328 770634 615967 471336
13730 471336 261827 817232 697568 266294 597025 494644 270824 539985 566329 74707
13719 586591 352257 377936 385417 773705 466184 801648 510305 552242 367400 576657
13709 576657 544135 665245 144086 492307 833664 700368 272706 822088 303093 785400
13699 785400 717837 716334 607944 618060 487935 363607 578121 223929 474978 650334
13689 650334 718634 335888 591370 303231 630343 643593 536004 655192 636216 601357
13679 601357 336225 337738 241798 532282 653440 334378 232079 553946 637580 500636
13669 500636 523223 686566 266005 406819 781545 397442 289997 203118 172504 288336
13659 288336 777257 379277 405337 184934 422907 492462 313874 348215 35409 188427
13649 188427 137018 738628 274403 623126 373200 317662 192851 182357 378434 305687
13639 305687 387346 233527 268598 114845 562190 196533 161574 562074 363265 743712
13629 743712 561963 405553 379105 373772 389116 397549 393728 494304 398664 736526 300245
13617 219324 404393 172310 298655 318044 349950 381370 479958 338011 339287 375868 137326
13605 347590 270871 524914 253007 644034 69147 -39697 175007 525099 284890 595134
13595 595134 390340 51076 109406 250978 -606 301464 84055 533550 217078 426932 546689
13584 546689 449140 483206 259617 221245 80660 401504 233048 319613 552237 355232
13574 355232 430862 712999 60496 -2587 375649 162326 150856 183741 317894 350041 508384
13563 508384 152994 471970 214328 305974 56346 181727 528185 283792 398377 130855
13552 394160 219045 200571 240461 309346 386221 79189 457915 149118 370588 188555
13542 188555 193530 100321 336840 355127 259218 159332 573464 460433 223179 449525 105806
13530 396783 66864 441539 303304 265336 232520 648097 -114158 187328 111704 341894
13520 341894 -22931 279926 426635 283703 532994 224035 478143 -106303 578074 405662
13510 405662 171138 296062 260450 2616 362270 263397 428066 271333 301835 275063 274192
13499 274192 156051 312489 390083 79807 126798 64157 325599 141054 190355 320154
13489 320154 297130 186509 -239786 272700 337328 219068 418100 91110 201640 203056
13479 203056 -48368 241370 -40571 266215 -28155 224306 307335 -75971 254573 215543 364770
13468 364770 245403 254265 8979 -55874 99200 127169 361139 332507 229222 207350 149239
13457 149239 280857 221145 291361 357261 311712 468103 404867 132278 332688 84786 315258
13446 315258 56083 436918 101854 32155 230526 5372 248726 435573 218512 291166
13436 291166 319159 63377 436505 64141 65585 277513 268145 361317 43016 348685 59421
13424 228212 148997 240718 121019 339331 100604 328649 118572 14337 140840 256164
13414 256164 242376 -13 327216 -115681 131333 136024 259307 61509 260459 320389 -24738
13402 444647 261327 380958 328264 -36019 263034 -39401 126284 -70350 -15252 312510
13391 -169806 -7866 108666 218799 262726 -136217 645662 28765 142886 447273 -24134
13380 49741 247322 182381 268780 71058 -107989 351470 82629 -46573 111547 22598 366644
13369 366644 292209 508713 118322 301207 156348 224242 520146 246604 77284 334923
13359 334923 357071 300098 292531 190041 39083 -61750 462294 -23449 115378 381412 51042
13347 141117 653150 124570 257059 526409 441068 211986 548148 27928 221214 346909
13337 346909 131886 443972 84467 161816 10023 -19147 146444 215860 269660 12414 311252
13326 311252 47447 366704 121844 239820 129062 408364 -96958 403420 140819 376734
13316 376734 154924 386239 278875 216897 253322 309675 68716 85205 218100 -273796
13305 1888 215509 205188 370895 139882 235916 433193 92786 181041 -128618 9383 -70290
13293 102829 294196 419327 304071 387487 27609 22758 176554 -251935 177186 -31492
13282 344152 -137966 168770 -79991 78462 221611 97440 123977 39026 55997 190046 196548
13271 196548 159896 112954 95093 70852 119491 -17925 110966 -284811 60421 107286 155776
13260 155776 268778 16256 183134 275255 143285 -162377 -107743 137534 304563 127287
13249 -44836 261538 -45593 237685 101859 55641 167378 47406 67072 224864 110322
13238 302636 66259 423078 93096 -33049 369205 88739 395938 73267 -294317 134011
13227 229654 -12250 -52080 146706 380255 120025 46499 -199768 163754 267128 129579
13216 104337 -111018 250324 -12046 178949 50307 -69521 52313 196186 68467 137094 145263
13205 145263 137707 -74227 106085 -49186 -73993 386532 438463 -11413 -13162 296567 -134621
13193 320063 82455 -162649 22541 143719 47309 -28125 306918 -96650 92477 -92973 402316
13181 33414 -184704 -10877 221488 -427543 -245081 167242 329147 159507 332596 239800
13171 239800 145134 -172543 400731 27120 506591 115600 8976 25592 309777 476146
13161 476146 114563 -112078 354268 -15401 -81073 227195 -98162 -167191 412382 68679
13150 18463 327708 -194923 95618 -121122 66911 -49466 52511 131169 41548 42286 -87750
13138 372249 139878 -99815 -164495 52993 170973 67966 364529 -5069 364299 -168694 -15023
13126 -206609 179074 40449 -50921 59553 -16874 -146423 8149 -161360 65196 -76728 -192527
13115 -192527 -143843 227666 32251 -98442 238935 171732 -173189 315839 13544 -25324 -295414
13104 -295414 425822 -221097 -477019 241082 261541 242915 351545 -172356 80600 16123
13093 85414 244882 72107 61980 69378 103992 86669 164339 -96416 -145011 -124658 87877 259231
13081 259231 82535 56565 -138276 48458 -21029 -57946 358057 -92887 153998 97753 168478
13070 168478 12668 -53074 202339 111935 137876 396115 -27130 -321145 230801 401540
13060 401540 77817 151 173706 167048 169999 -161523 501840 56950 146166 164122 113395 20327
13047 40304 -347826 3936 103795 29311 -163924 68778 -36631 102281 336362 167659 116268
13036 116268 -48199 -218511 -49179 342570 52582 35730 -74508 138953 168374 389639 122463
13024 -250580 -32616 86540 -9817 -146024 -27881 -27661 -46453 100544 -189358 137359 -59949
13012 -176014 304004 157349 464875 -156653 -6960 -281213 -107763 133611 141837 87 -10916
13000 19660 272028 -40750 269278 56844 203540 107716 -118373 85191 -240679 337140
12989 99369 -208115 -15693 88713 201897 -43439 -322933 -124452 52878 130998 -101009 265828
12977 72843 207127 93802 171876 -155617 147262 87809 -390082 -171003 211349 -5968 152382
12965 358545 194926 238643 93803 44715 328212 148711 -62371 -110926 175348 403023
12955 403023 -80671 -4891 -14536 85862 120976 -132770 95866 166030 -8935 -109894 547307
12943 -81546 207275 -194324 175072 -149320 196952 -4056 16310 -104482 -146737 38276 -129363
12931 -55606 -150485 1908 37340 3453 45298 68395 -136425 -209600 237463 191627 217337 91312
12918 123228 -39540 293554 -332419 303856 -113606 80385 -61527 73416 156699 100096 -74336
12906 -192702 151345 -80575 78160 -72416 -167674 100465 128687 245640 190509 -25072 47012
12894 -66366 276219 -86204 -35489 -168472 182714 69511 270075 103871 75533 158925 22304
12882 56594 162879 206896 -47184 152148 -95835 338188 176134 2173 -114863 323011 -207412
12870 -3196 168511 173288 -58319 -137747 39550 55028 147674 86669 -69904 54329 175794 -48885
12857 100903 -305243 137916 95249 -115102 -294914 -140994 -130825 223177 320211 173077
12847 173077 148653 246492 115354 -169774 53891 346156 277812 -71964 -186214 -373881
12837 -373881 580 -153738 -71907 58346 145146 -66719 -194317 -86814 275738 179118 9254
12825 21802 -71729 171119 -93049 -315199 -236555 89339 -183027 79197 -108036 129961 259996
12814 259996 -44830 -93955 -7237 12288 102821 376993 52431 69484 8249 -126804 78506
12802 126404 -62016 -247531 -33690 97715 50642 -346176 -255268 119511 -169716 61009 -108253
12790 308334 29513 20888 -251158 401330 76603 104623 44021 210562 393850 202392 -61383
12778 239913 -159064 -392151 -421932 139500 -49417 103592 -8401 103589 -2951 -38748 160407
12766 155645 213182 -72148 27341 -153429 15158 -197064 -66399 45321 33903 5826 -48574
12754 -145608 234383 -117138 329836 -149397 -35606 30902 -241882 -137420 -210753 -223189
12744 -223189 -91370 -113517 -5793 53178 163534 413890 60404 117754 233106 -64368 465675
12732 180219 -370 -146739 19446 204303 -77938 -42874 -123331 -87112 258434 285430 154189
12721 154189 154289 -172724 70139 -349548 -67066 108088 251756 53582 43632 32478 198971
12710 198971 217416 104324 38260 83193 66219 246826 -133392 69461 -31130 -159971 167902
12698 -77875 240094 -215556 309557 -67117 392689 -2140 69435 220798 110341 98672 106074
12687 106074 106851 199750 2395 142696 298226 -58265 228231 -39693 110727 -103545 -40537
12675 225343 137333 24937 365368 -178636 -182546 323444 -20841 -319522 -241652 203786 245144
12664 245144 -122237 82543 -39422 41004 -105223 -144102 -47043 215346 177657 3937 4846
12653 4846 165426 23123 -60072 241978 243491 -2725 -15205 224225 -251166 178591 283942
12642 283942 -120220 32417 67472 -172330 -297657 175224 77037 -142774 167961 -234982
12631 277489 212730 335012 336020 475201 191765 -205084 19301 -34561 258189 149218
12621 149218 129300 270383 71295 133346 19574 288877 142163 237388 -88121 172253 55590
12609 4875 -296257 192012 169082 156943 374204 340062 325501 83507 155017 -107708 -75553
12598 -75553 -1603 -6337 49788 -60476 -39820 36434 143922 121619 111909 -55020 -23202 191306
12585 -42497 -354466 114380 66185 22172 -88071 319835 326084 -145307 208603 -61859 34461
12573 170574 59825 11648 -137227 236167 -142376 145836 144713 -206985 -330271 214838
12562 77397 -76425 -134581 -119632 -56187 -67299 -116392 -68073 89755 -192272 -5468 72614 -77623
12549 -241211 -123732 -78663 114082 -134430 -32969 109899 120011 431606 150553 230391
12539 230391 -121526 91595 48649 -119564 -262810 -283832 -118314 -164742 274949 145353
12529 145353 229142 18846 -217103 127155 -232349 21184 144185 206029 11021 -219861
12518 -110752 43725 185858 32445 490383 114429 28189 -38058 284363 44458 81627 345637
12507 345637 309185 -195850 -122055 153316 49101 -5396 97076 344223 -85806 -77724 -76609
12496 -76609 141007 95430 263992 -54444 191168 -79147 -320810 -35114 105379 -149964
12485 -51244 37777 239317 128592 86384 -23122 80311 32898 212185 271286 23870 -165646
12473 213720 205130 -153893 -46107 -68844 -69340 110343 154795 108357 -289257 235592 90346
12461 -29757 -331553 178890 44640 146969 -220096 -3239 177099 -107353 93379 311786
12451 311786 126882 205884 89752 -90768 17138 -151756 -108938 -28606 151951 145911 -252253
12439 -32442 127573 61013 74699 -37050 29868 -48946 270121 260808 -25299 194152 -51811
12427 156659 -27178 220524 -33874 -6684 316844 -198112 -56534 -167831 75547 -164247 112698
12415 202344 -172937 -153022 -148394 44677 -55359 -89636 -42387 -44438 150569 -37883 -6752 -297697
12403 -297697 -170999 265313 -185707 -228441 295605 119105 246019 -48919 -47209 -112457
12393 -112457 175346 -207596 338918 149845 72639 -175682 -65424 -108638 -173987 137681
12382 -126293 6357 257706 102080 -6168 13853 -147362 -80433 -264322 -390542 126965 -242163
12370 118022 173384 134651 175197 -78054 77907 -54555 45306 -20715 -33202 -377297 -280667
12359 -280667 -18236 249128 55718 -146644 -72671 -92872 -813 103012 -300382 -36026 -185940
12348 -185940 -196280 204036 21787 263283 -143752 293841 -36447 123431 -205935 -285325
12338 -285325 -106501 -216727 -114588 161524 40899 -405603 -315416 -6524 4145 -82876 -114724
12327 -114724 -269019 42025 381408 -108300 18918 173784 95265 -166309 -8758 191387
12316 -144157 159757 138558 -101275 74470 -3529 -248378 46544 53921 158003 -142173 -105528
12305 -105528 -103749 76507 288334 251058 143228 148383 301313 57787 -272393 231995 -95431
12293 -119574 -73864 111771 336110 -109536 -95730 66080 213152 -102255 196731 -324774
12282 128156 126788 -287216 -271887 -254080 -225160 1503 -125614 -12655 150318 144143 208245
12271 208245 81629 -54498 -23887 63387 34666 178359 46460 -183111 45882 317616 48960
12259 330448 -121487 -184265 206699 619989 146745 95796 89176 -188908 -211018 -139276 491730
12247 -285545 -29092 485414 341991 70700 104592 -163720 -101723 31668 109807 -148421 -32478
12235 -148993 -162267 145844 35017 -38333 233678 295326 167384 229578 -45837 -88439 150344
12223 342133 322490 443116 311735 65147 -32907 473860 49260 229778 11171 144150
12213 144150 -91585 -33398 -40607 -110690 305683 548927 -204267 308774 283529 305457 -20930
12201 -45847 56573 98676 32403 59124 194107 270512 293180 -45909 292742 219980 151143
12190 151143 -68441 330790 -18879 251219 262904 -187976 -159181 -105190 187618 135620 -36712
12178 -159879 -19096 123571 -49158 123451 20616 -54892 355283 421082 -107424 64277 -72365
12166 207504 -222253 403252 137769 111858 -14105 191781 146788 -68537 157429 37293
12155 70913 149622 187994 -156946 64742 -55997 97304 97826 129990 57212 19855 -106894 289305
12142 51036 175117 58745 105155 -52057 516073 246975 -217350 -154356 -137123 2954 -90148
12130 21246 2775 129833 238971 233921 -37020 -116746 -64276 -214542 51772 -4027 173800
12118 -96032 -114532 37528 118510 182331 -18471 -138458 -37260 -805 154758 134098 233628 -112556
12105 10881 198490 -77265 -25587 -5200 -88378 -77024 66733 190695 25394 96757 -134359
12093 405845 204116 70485 187447 -5219 143432 10578 -63520 -14350 10257 68376 400230
12082 400230 129578 109919 -84951 154173 239762 -281499 118696 -142701 -64024 -107373
12072 -107373 -18930 2279 237441 -217773 -61605 93781 12325 -121150 30379 -146941 75049
12060 -213418 -192668 214715 3706 -104940 129434 453228 -17880 150642 358722 626187
12050 626187 587357 666430 266898 -194382 30816 118192 173469 127492 -242089 -83905 -252092
12039 -252092 8566 -145918 302546 -249922 65074 -31403 305675 213710 -149348 93112 -186723
12027 -131129 -113868 -71033 43355 65522 97451 63253 -25234 234115 -159786 -198731 119572
12015 -197393 -148880 111766 137377 21942 153263 40661 354066 -203213 -202702 11520 121587
12004 121587 -43660 156434 -233518 -36517 42168 -30252 -60043 -415502 -44742 57895 -137407
11992 392774 -47571 174483 -192633 20844 60496 -227830 292166 -72485 -290437 -95262
11981 -113843 -32900 -182546 42344 -115872 -296337 104491 -328481 -73404 79412 4763 116252
11970 116252 -227283 -44277 -93135 31544 -298139 24734 -446317 -52777 -104958 146856 -363171
11958 -60683 -24053 -125993 292621 -103288 -167630 -216938 -151595 125997 294182 -90292 -148418
11947 -148418 647093 14788 -138182 219554 92899 -240296 253384 -27767 -108600 14532
11936 -127042 177800 120260 107731 -103931 -335328 -89301 246154 -531362 -64809 -196639
11926 -196639 160357 -185119 3121 121311 -397276 -57111 -12033 76324 -114685 22074 -167221
11914 -393073 84223 -192355 -332996 133938 201638 44110 158069 236136 -115555 381936
11903 66605 -198902 -164901 14314 -250164 31093 -167524 222101 -327431 125673 -60057
11892 92796 17790 -29287 -159918 -229976 -7449 -57710 63283 27763 35037 13758 146741 -197268
11879 395783 -23922 136170 81727 210307 23088 -156589 21953 -259980 -31112 269626
11868 369479 14243 157675 230030 -55420 277840 -51341 -51315 19568 -44192 2128 34561 88557
11856 88557 181680 -37411 62289 -230032 -1499 1096 184666 224998 68012 -85816 38459 156388
11844 156388 57139 -76815 132871 -39335 -121308 -210901 -4019 -154213 -195274 72187 -212870
11832 271363 -44698 -158072 -353462 -63161 -123374 -315891 -41580 198313 56291 240145
11822 240145 -411810 -117688 -250198 -128993 147199 -97172 53643 -150482 178857 -352916
11811 -71292 190156 58086 -224153 -145977 -131883 111059 101653 -134055 -35990 112429 32957
11799 -160686 25797 -17192 -247239 -24307 79004 99569 27601 -29068 -19582 74205 581370
11788 581370 -184775 -364503 75196 -275235 -274827 -286324 -33700 -248885 -86269 1156 -51768
11776 158595 -74064 108238 77702 -162998 58921 -79358 -1990 -49697 39504 138580 177144
11765 177144 128408 264881 -358326 -7644 -128553 18866 -93333 -152049 179883 73316 91866
11754 91866 -114389 -248732 30638 -226638 273873 -45692 -51903 -8187 -128683 -247432 96123
11742 -201756 -165791 -143463 -120751 149326 150012 -176256 41706 291579 -122682 -166784 182637
11730 33699 121867 -184420 2069 -105270 -33488 251908 -277489 -301009 94818 -73438 184604
11718 131137 200837 -132475 86803 241448 128783 71635 9128 95453 284797 43257 -126922
11706 181019 -93560 18558 -95130 204898 11098 343349 101230 -24027 216564 129637 184474
11695 184474 -131456 -123942 -233338 25866 98920 102506 324309 -154589 -175087 125819 317048
11684 317048 -64144 255896 -323026 12068 54501 144715 66083 -26838 27939 166292 209839
11673 209839 129117 -169181 90742 -357309 -113798 87617 -357755 149732 58209 72323
11663 72323 -270611 216504 -367766 -478634 -308415 163835 -419464 105149 -155275 31453
11652 -60614 -28427 7752 85273 -141660 -344157 156108 -22977 70874 323462 -23579 -93323
11641 -93323 185164 -65622 -105974 -151391 69793 -93954 -135852 290808 320317 -51870 194739
11629 -271966 -2710 131603 -238519 -30041 -12604 189973 89529 -209867 -215876 -122167 52088
11617 30443 -92360 170893 -50264 118473 69412 -186236 279063 155962 -67933 332147
11606 -109843 148594 -392196 151970 -88031 -211201 139719 -107748 262145 51746 -156655
11595 -146707 84368 -122864 42199 -377103 79267 -92729 225994 -102167 -156673 33478 94958
11584 94958 120745 -88673 -111547 -154810 55488 36280 -33673 266573 64496 157210 379845
11573 379845 188128 113624 -159262 -172013 -19595 126486 65382 -155765 19034 -294176
11562 99834 21776 229751 -347451 164080 -94119 181236 275983 -30575 208672 145382 -109719
11550 -173656 -202104 18244 -32865 90859 -81913 238935 54062 -55071 123789 41160 101108
11539 101108 -241046 330493 -169147 -16419 -20381 -67045 -28624 -2226 -7661 128584 39607
11527 195603 166615 64028 -63936 40620 -237751 158416 -21272 271531 471844 -374588
11516 167697 -81830 -161955 -78077 353878 -38881 -129283 293029 -274886 53493 72355 176687
11505 176687 38983 428654 37983 -244096 15237 254674 -30655 45146 472291 40133 129681
11494 129681 307774 21422 47158 420093 323406 257356 -162032 342919 -99912 184635
11483 381107 55931 -79138 345790 -240444 -281606 -235872 309920 -176316 -26607 242506
11472 54994 -1240 153900 338401 -89871 157398 -5324 96812 450528 119149 356739 166204
11460 83675 232157 62377 356130 134600 34700 191221 174577 118798 219967 293033 246215
11449 246215 27417 83160 244054 253019 200046 151979 -148915 172348 37893 -230848 194605
11437 306802 15426 -232640 68799 -35834 248607 346170 216497 -35240 -232329 112696
11426 99099 201497 -169710 -212644 -2933 179000 -51570 -73164 49061 203007 -1772 58947
11414 -123679 -173870 -340827 -80991 48188 -57701 45333 -453951 259770 -142818 25330 -170308
11402 -15976 -129902 207363 -275215 2287 -65777 -129192 -309611 191584 460314 145878
11391 -47832 241869 263305 -221012 182522 114063 -144952 4898 -54414 308643 -164266 -4431
11379 40822 -110843 359268 47547 100921 71161 -228740 170677 99924 -268701 -93428 140539
11367 -139599 -116235 29854 120301 -65275 -322326 181786 -18582 -96372 194182 -284239 -253804
11356 -253804 59166 410917 247420 -303070 -287183 2272 -95034 51789 64767 -357755 157510
11344 25495 -262387 -281804 254453 156448 -2249 257278 -48005 227180 125167 -92206 189985
11332 -204796 -35631 -103733 68880 -89483 142383 -275662 -76488 -4799 -136666 -498123 -355212
11321 -355212 68413 -18631 136771 -109410 41680 232149 101576 137810 -311306 -562245
11311 -562245 -57774 -328137 -404810 -61798 447111 85196 -275820 69983 -142377 -199095 107340
11299 145807 153433 15083 157296 -248107 188561 -307520 150951 -94684 -184916 27550 -70491
11287 -279904 126296 -138330 65858 3640 -268113 11463 -236240 -204992 -385856 240897
11276 -17296 -15845 -238794 -287483 215555 -58274 23088 159776 143792 23345 -13545 -166412
11265 -166412 -257526 -126959 -12711 -134791 -80195 -38526 131426 -108708 -537191 123486
11254 -332661 -40437 98012 106844 -122182 -244890 32919 43127 109991 112107 217370 -56690
11242 -408263 -153951 6032 233398 -97065 40438 -182638 43196 -84668 -59335 -22635 30155
11230 -115888 92326 -208295 -454589 -281349 52187 177951 211186 125098 -108323 304571
11219 179985 47081 242475 -196274 -60279 -166080 100486 219862 46898 -230598 62394
11208 -7224 -130253 184771 44758 -19313 -283687 -128905 333804 70252 -350578 -82274 5220
11196 131058 -194254 16286 122838 91715 -270909 111866 83525 -254267 202780 -41310
11185 -215598 168426 -96846 -20994 5766 -155158 202981 -195575 -379103 -33186 -173535
11175 -173535 -373087 -45381 -366250 262156 -191047 -253592 70657 -113117 -112168 -195534 -40317
11163 111150 407717 -279904 5270 -298253 -27637 43739 -70231 118206 -252554 -14184 81049
11151 -214552 52191 131020 -80593 -33685 -129915 -295005 -24780 207984 344259 -102103 40243
11139 -50592 -87623 144240 -175200 -238737 -164726 -37526 26827 -99277 143798 241632 -62875
11127 103028 251567 -45268 201680 -176550 113249 -178809 226533 43931 201021 194155
11117 194155 158346 -37454 -271403 290041 78374 227387 40647 27343 123046 177604 176826
11106 176826 10707 287469 100058 253759 346364 49028 139672 110726 259079 342260 55218
11094 -33288 56116 279649 -263303 142238 495750 -41761 231401 67319 153220 -80751 310665
11082 121387 7748 249972 141314 286654 478362 253340 227708 18409 277833 265487
11072 265487 310534 221367 399040 62256 261908 173744 269013 626051 841002 313335
11061 611868 660729 237738 422259 666393 491634 459960 577276 673750 400820 560567
11051 560567 380442 776683 350428 896592 1015177 657036 443623 661534 725434 409159
11041 409159 741742 662048 691975 727259 610996 844095 666517 526409 820820 860643
11031 860643 710791 913986 709537 865304 727918 1147469 558863 926578 743539 801691
11021 801691 587599 590009 404361 240858 479739 760595 675552 901716 760475 723240
11011 723240 683799 720898 482422 773036 844280 534498 624443 798552 753948 633823
11001 633823 894809 624312 862809 801410 765957 826902 764165 662306 634021 552708 520120
10990 520120 643284 612837 785776 642569 830904 1037266 1117819 1038250 1016517 1240997
10980 1240997 1378554 1322871 1577414 1613040 1807576 2163387 2407798 2444992 2724302 2799461
10970 2799461 2960153 3044667 3094069 2698319 2549385 2183208 1634643 1702654 1347536 1321196
10960 1321196 1610740 1432878 1172749 1661290 1307936 1333242 1109275 613916 764568 728373
10950 728373 682265 679128 273558 609679 275647 116859 523742 105981 190581 -13111
10939 125089 122453 84208 194393 -28400 320156 27063 194196 35932 269496 -131422 -49460
10927 -49013 -17050 168529 70050 179632 -113877 -7551 93767 -142625 174677 135038 25413
10915 -115745 227206 20261 -323133 -78803 -7837 -33096 -43635 174748 -302665 39609 -91486
10903 -157034 -16917 73237 221434 216557 7308 -43258 -45959 42203 34420 -63749 -269121 -239745
10891 -239745 361225 462460 42484 -79523 61828 -161178 -311325 -39408 43677 263099
10881 263099 224137 -79965 -155624 -134057 42024 -185519 -11338 -65121 -78551 -247340 -224390
10870 -224390 129028 170168 -96560 -237275 -43638 -144821 38979 11777 124554 65818 -84175
10858 125217 -243057 9161 -27607 -157860 -53042 155220 87670 -126765 -84481 52669 -67389
10846 -325049 -40023 -5226 1767 73666 -318000 177732 -59261 -70870 -153996 7963 -93988 -280060
10834 -280060 -62154 70373 -84316 -184741 231733 130920 292644 -23337 56101 -231823
10823 -341234 118199 -289368 -77238 150391 199718 -149648 -55653 42795 64527 181762
10813 181762 -168188 -286509 -336963 7817 -82989 28571 -291780 -70569 -113299 -131794 -204550
10802 -204550 245326 -48234 150439 -121382 177486 213984 -153249 -445677 -285467 -207432
10792 -207432 48299 165403 -7248 37152 -47197 -308785 -383730 -355147 79284 -179044 -235066
10781 -235066 33644 -14754 28707 -201892 349113 -20605 -90530 127887 -79376 103757 -11219
10769 273650 75561 235352 -309409 -81808 -106995 -258066 7619 14711 95048 334941 24286
10757 -171877 -133743 -124969 -446601 -94586 -41720 -160287 -14955 88407 -295252 113163 -161999
10745 -203002 -271902 165321 -38203 -146353 -32641 -134820 -170931 215455 -104645 89497
10734 -41278 52023 -123329 -73031 439108 -165828 221023 -4797 151792 -58608 -282010 -223614
10723 -223614 -27349 -62341 82440 -141218 134388 61032 -106708 -177856 44060 -39839 406359
10711 34053 -42648 -8500 142298 -161964 55754 198066 124622 -83740 -59728 -195782 -111662
10700 -111662 184588 -74114 52260 169943 -113669 91777 -26337 94209 -149301 -114942 -62438
10689 -62438 -42739 82097 250126 -130452 -11236 148176 -252726 246351 -228962 -157726
10679 -157726 -130255 -38626 16114 -185112 -94408 26965 -145802 1370 -32348 146674 -47598
10667 15759 85479 -62931 83839 -93658 -6230 -393565 39469 -18734 184367 189224 203435 46670
10654 47539 131743 32335 -169124 -216476 -271663 -234785 21731 111756 -211953 940 -114503
10642 -299045 -236198 -251057 262848 -92057 -74872 36949 -59048 -300663 -237243 71954 251724
10631 251724 166853 32775 -54356 -9890 111650 -32625 220772 -245328 132085 98436 -56671
10619 -121945 -320846 -134510 153188 -221656 31374 154286 -786 49086 140980 -140935 -193866
10608 -193866 -76449 152895 -260822 -86992 -37118 -126660 -27067 332796 -63340 -303575 -31994
10596 137408 91911 57772 -148370 90320 197908 -116385 224730 172954 141868 -232299
10585 -68068 108618 16083 -82300 -143854 439467 -220172 -260426 -210763 181817 189157 -187802
10573 142250 -112357 -212860 -213280 -174196 -178264 -190601 -283554 118127 -187786 -213092 26523
10561 47658 -182092 -435105 34485 -42485 -131544 -288315 -60083 -184637 211661 -23578 -45790
10550 -45790 -62471 21078 133284 -271800 -80675 39359 -139326 86076 49693 -18079 191510
10538 141657 -151111 -151591 -96189 -153912 -475219 -168957 -114465 -304449 220402 -116929 -202619
10527 -202619 279476 -101498 358172 -164645 -52445 1267 77528 -60556 144703 12419 -220841
10515 -188738 -94605 -1028 226740 -70279 76224 109433 41759 -97520 -151189 -60735 -81681
10504 -81681 -151347 111761 -88227 205254 -38919 7880 -197065 -22670 1400 -96838 92330
10492 226384 396149 -291709 -160866 125970 -94317 11570 -35289 6260 -38550 264607 35855
10480 34539 208105 459514 152976 -14929 63559 75948 143854 -231373 -75762 47011 -152558
10468 61067 162986 -85240 272629 -86058 -87198 -222054 -124268 136216 -164075 -94474 10071
10456 110475 136135 -126381 -358607 -75111 -36668 -112074 -128271 66892 -44704 4530 -278278
10444 -242989 -51262 -81324 123542 -204026 121275 -119172 41340 -179445 83638 126321
10434 126321 -169495 -217029 -82841 -104341 -47674 133986 28102 50292 63331 -45333 -458037
10423 -458037 203159 218590 210140 -206638 -140978 -16180 -164716 -388907 -16705 59594 -24652
10411 -58796 -21900 40321 -327413 133723 89968 -222271 62417 36618 42470 56167 48962
10400 48962 25006 -30004 -115855 51869 71275 437639 101285 44848 249904 97131 306602
10389 306602 478979 180085 128150 51808 176657 -73678 306412 -277422 301976 -4800
10378 85229 205822 76249 360948 318982 -26570 119582 397880 454919 550099 364973 226378
10367 226378 317131 525037 209522 396927 402440 558385 262512 340989 150576 60958
10356 276472 69702 229836 402001 369252 281118 524485 350838 532509 213055 496052
10346 496052 407487 253314 250043 341780 41673 144751 -67748 137121 178957 227020 -25379
10334 137784 -17557 173059 75860 -7270 110066 255366 62930 194418 -142374 36271 161302
10323 161302 248639 159561 229738 643333 86408 126204 86034 -166037 294657 -119554 -258271
10312 -258271 -320292 -150152 -130249 296491 -165442 -108859 -134316 -256361 40966 -74078 61911
10300 233565 -27938 28233 -177428 -193037 -69450 -37434 67305 24521 200926 94367 182708
10289 182708 214554 106652 36773 -25595 -204735 -58156 -162710 -33505 8330 282689 -177794
10277 -298341 -71330 -36231 -256585 -143582 -90543 425640 35113 144408 -134003 48124
10266 -489878 -119347 -143720 11155 212417 -138955 166722 159497 -220211 20644 299274
10256 299274 139750 249283 218167 -34497 -68077 207194 -9384 21851 -192128 137527 14058
10244 38241 -256869 -32914 61164 113134 110100 32510 44062 -88074 -274584 -153349 36614
10232 -144614 137218 -13850 11284 -75419 280447 58807 290417 -322158 122589 658 -224857
10220 -214112 -243518 -226494 -418715 95787 -424873 -193893 -164599 111692 209005 128431 -17529
10208 -231038 10013 -120776 -11107 10921 216018 -257732 -336275 177866 -279376 30406
10197 93997 -53950 247557 99814 -30890 -84812 -901 -133163 178609 51544 -19324 178670
10185 133692 14725 17222 -147256 -191418 20762 -108415 309647 -141212 -25205 57300 -90437
10173 -71763 -65950 46951 -91909 -228905 -134865 -91790 261205 -296892 -109311 -18882 174249
10161 49320 -294969 -92184 -92143 63701 -62224 430548 -228787 -83517 48683 -228084 -310481
10150 -310481 -98278 -82092 78044 -55162 133713 64898 10775 7222 -44860 90697 26731
10138 277127 -212241 -38060 -180454 218709 -225838 -335168 -145003 -213356 39461 -253840
10127 -232008 156849 -96293 169657 -11591 52662 -149372 -5259 124155 101287 -120302 -26363
10115 96782 -48905 -81647 -270976 168530 62791 -173972 -61125 -22262 -179025 -25500 111509
10103 22950 40911 -106200 82369 -26894 -30518 -81281 -289544 -235351 6281 -169828 -140985
10092 -140985 295018 191585 97875 -57163 -26262 -94688 -144682 39421 215604 -179387 -106694
10081 -106694 -146333 -70283 -357888 -288043 -462212 354292 99503 -240416 207907 1159 32291
10070 32291 -180577 -347694 -77465 -129192 -80738 -85737 207159 43935 211713 -175762 -72978
10058 -58804 -321258 -321836 77567 348399 77003 -144558 -204723 279365 2633 147476 81101
10047 81101 -259804 -2139 31298 -555528 -68853 207966 -258928 -67791 177802 101166 -13903
10035 -366672 -26669 -112286 -51025 -154755 160698 -47718 -141948 45206 -288281 203972 141775
10024 141775 -56034 232374 -12748 93926 275680 44996 -306692 -57333 -18561 -253793 -43499
10012 -299139 -130999 169714 -123349 -211036 -224461 -18679 -313582 -146219 -121527 -196261
10002 -196261 -75810 -143511 -212299 24563 -11638 51766 -222292 -33439 -69651 -54872 -192479
9991 -192479 -174522 35802 -125500 -82771 170331 -17834 -351149 -272489 56945 -460239 -102608
9979 -72001 -42098 81940 -162535 202876 115218 317128 -70946 188469 -6981 91309 -240321
9967 176860 -213676 130419 -43632 -169967 276441 32476 59843 -443027 -131221 -187642
9957 -187642 61944 -3237 39758 98439 91167 443407 145012 77615 21207 -43294 74922 165478
9945 165478 -352491 -190766 -52978 -17562 135251 -19660 -98226 -288999 -15241 -176581 414008
9933 -242913 -58939 -197705 256830 709 -118448 -127499 -390357 -156210 46999 11864 -149701
9921 -231458 137013 176184 -64755 99648 -173815 -64147 182597 83969 -461835 305970 -167110
9909 110303 73173 82389 -174318 254064 -153419 229474 -117559 67251 -276775 -189603 -151744
9898 -151744 55430 390395 276006 -223841 -383594 -284462 -96808 204313 -195519 -73967
9887 19437 29726 -73684 -234895 -275603 -77919 -3798 -283414 75611 -84790 -408106 192326
9875 -91409 -132117 69628 42495 -258572 -92717 39275 -57669 -36077 -63396 292972 -276221
9863 286599 -52447 -269800 -243587 -104714 189885 -295749 -51260 -42642 -191279 30966 15216
9851 -91572 -255048 -277800 49152 150040 11385 -22740 -40488 -120730 -75017 -112866 125227
9839 8670 6450 -281874 -191273 146129 20534 -112036 -30451 -355086 -36481 -101615 131934
9827 169136 -59601 -174664 -262156 -46013 264630 -52033 -335921 -126294 256213 -92294 -87056
9816 -87056 101329 -74317 -13607 30204 -341637 -194001 -17532 75381 22553 194105 -190531
9804 56792 -260340 -187928 -302072 -262481 -467899 -246746 -125389 -196575 -175561 -77651 -69456
9793 -69456 117725 -382465 99777 -36456 -295157 -59589 -13940 -99755 -9454 181868 -61401
9781 -44327 80849 99922 428367 -114402 -52010 164796 -113846 46252 85833 -120874 -138687
9770 -138687 -240456 -10719 90811 -78630 -55165 -152046 81310 -140096 -383111 -279636 276686
9758 120991 34260 61832 -67563 -130651 20043 90546 -224477 -48767 133278 215023 -193855
9746 57618 -166781 -66512 -58505 -125520 -305442 -433617 93253 -59956 -200314 -266637 -244679
9735 -244679 -285917 -2010 22919 -324654 -120849 -42709 156200 -46812 -102996 194411 -420579
9723 135855 -252613 -71037 7084 -152340 -265938 -203459 73504 260492 156815 23512 -77723
9711 -338273 248310 68197 -190211 -139443 75345 -115141 64470 -9405 4799 32567 -5579 -102011
9699 -102011 21003 -150506 -211777 -168711 64135 -158068 -70025 149167 -269928 59475 85317
9688 85317 -289579 131463 -293407 -204001 152643 -36615 198758 60950 44007 154769 -311254
9676 -216497 216856 8369 -134197 -68544 141638 231746 -251246 -137024 -32425 8041 52585
9665 52585 -77819 -215326 -57910 -392705 -200174 -40713 -133727 -267968 -93710 205450 -122423
9653 -24543 -198555 180338 113191 336217 -124991 -277654 114018 -106654 -48173 -242895
9643 -242895 114920 -102379 1002 114239 74363 -101440 -118645 -2440 25045 35331 -272365
9631 53875 -45066 -274957 -181117 -253081 19746 -254924 -226395 190352 199352 34272 -73708
9619 -200312 -352339 -105731 -22611 54221 -298557 -161141 -220702 69497 -26236 -194444 70433
9607 6677 -197234 105323 268337 44296 -25985 130617 -211818 5595 -163767 140815 238997
9596 238997 -65623 20082 -129917 129629 -144478 199728 -264160 92144 35962 -355816
9585 -119627 -129037 -118747 -115069 -214106 -345492 179432 59571 -45203 280412 -62743 -34216
9574 -34216 -371956 166883 95095 -321655 -53991 162166 -197246 39991 68971 31452 -158849
9562 -174002 106008 94198 -126262 300159 127398 4090 -26870 -92161 -117536 90674 -366617
9550 -96781 104093 67106 -634439 -165799 24695 168293 35600 -199458 -76155 54310 36072
9539 36072 203727 -199869 -114519 -66228 94264 80637 -30388 152370 -58962 515817 65045
9527 188605 -20871 -283065 -48835 24335 -331222 -248055 -18287 -267200 -1230 91796 185257
9516 185257 -226452 110378 -302081 67059 -80486 -112651 -183858 -345359 -244769 274192
9505 -141738 25956 -101595 -29330 -176736 -31151 -53140 -280044 -182839 -135160 -238025 126322
9493 -57938 -258550 -37336 -111675 -135084 8150 -165592 149017 258288 -192307 60219 -69352
9481 84986 -318033 -161890 3970 -348990 -489389 156640 54755 -285983 -76019 -175551 162832
9469 23909 -25320 -26323 -216044 -22626 -235940 71908 -119417 -240078 184690 104965 212712
9458 212712 -3865 71200 43429 81480 137155 -80393 -79558 90455 -122548 -36512 -179925 38017
9445 -31500 -99222 -238455 -273732 -168530 -376663 -4811 -330009 39516 160775 -36668 -81676
9434 -81676 255167 -157309 -317122 171826 -153913 61730 -59637 -152540 -325632 149083
9423 28437 287696 106169 -59156 -133704 44872 -109411 84747 -87180 12604 93548 132716
9412 132716 -220044 -107349 -438947 -495484 -62750 -73818 78021 204595 -382802 26504 -323847
9400 -144706 -17406 10629 -44436 -96393 -518757 -181434 -229365 -183215 186624 8181 -64676
9388 -274331 -8524 -87460 -162549 -31958 -101281 -144183 -163560 -253790 34395 -122155 -186848 -232363
9376 -232363 -228650 -142773 -13237 178596 9752 33261 -407842 56220 -252890 -212966 84441
9364 84373 -9646 -11616 -26520 192045 -30225 10334 -67745 252564 -125487 -254951 98145
9352 -432936 -68800 -100556 197293 59466 156349 133451 -51364 -250835 -21056 -53695 -243786
9341 -243786 -18854 21932 -211073 -234785 -310278 -348854 18705 2681 -268132 23097 -203553
9329 305681 8640 -86464 -350260 -58991 -26778 -34236 -92847 -59453 -80442 -166251 -45406 -148613
9317 -148613 -78203 -337255 -79019 -18249 -80570 32192 -154121 88591 -238247 228908 256828
9306 256828 172638 28922 -20388 -47152 -16212 -259249 9769 -3039 58247 -115433 -209693 -159617
9294 -159617 -97784 114215 156112 -176439 -322582 -162606 -314177 51616 -246092 -183067
9284 -183067 -59472 285758 160893 -48227 -115388 215180 -231341 230698 -279998 -6960 267727
9272 -198194 -80299 -197428 -221803 110567 96068 28253 -169878 -87466 -116623 -70406 -186608
9261 -186608 -73242 34958 -68582 76832 86747 -397279 84090 -11547 167701 -163669 -79352
9249 -236165 -250623 -76190 -133578 -98891 -20668 -9351 -213338 -109781 -122765 -84356 -60932
9238 -60932 219246 -92276 154342 -221803 4587 -55927 -62497 208210 125896 171714 -222585
9226 58226 -92904 200337 -75777 -67411 13783 -262879 -240061 -400696 -43255 -53104 -158829
9215 -158829 -23412 67973 -24270 -156924 -71877 -301417 -81103 326965 -82035 -44759 -74150
9204 -74150 -222674 -96642 -116272 -166813 -68210 -91457 137914 -235343 -81656 12449 -171345
9192 18824 -2957 9516 148030 -91232 -17709 155976 -435856 67686 4484 -253553 -212305 -101498
9179 -278646 -95048 22035 216461 -199313 -123441 167586 20799 -35642 -92346 -241362 27880
9167 -218786 -35669 -141054 80379 124605 192338 -123722 155327 -312251 -67409 155506 419773
9156 419773 186845 -10297 23997 -9535 95325 20913 -170068 -301585 -198987 58838 112869
9145 112869 132132 -126425 38931 127295 -121784 70188 -99787 -44106 191484 97507 -206378
9133 35265 -145904 -7160 207129 -412808 -155685 203847 -201095 71760 -128504 397927
9122 111935 -105021 -221037 -236805 71970 194319 5141 -367042 -9322 -215945 -203837 150393
9110 -277682 -147840 100173 -239365 189354 -176788 -239916 139099 160295 -5841 -32126 -396714
9099 -396714 -100372 -45309 -246063 -62836 -103217 -20233 -12557 -110499 -338444 -160092 -53981
9087 -23537 -347746 -174506 -183460 -79903 16156 -126641 -210171 -216874 153148 -286026 94524
9075 -95734 -43719 -143129 -87714 -560029 -143196 -129852 89393 -22058 -165829 -65068 -47669
9064 -47669 -599926 113147 -101452 -93567 -286628 -28550 46199 31653 34910 200626 242975
9053 242975 35840 -176786 -9036 141681 -250014 -142709 104122 -98875 -317204 -50715 193723
9041 -217513 422461 -197778 102290 -181370 -123277 288570 -184882 -128858 -288989 -305734
9031 -305734 -22770 -189039 -136217 42160 -145324 -144706 -317218 139287 -186325 -202416 -79069
9019 -62505 -398374 363920 376744 -196506 -200087 242054 -41310 200453 -192278 40596 -327950
9007 64120 -264116 -365135 250075 -221170 -167938 -225904 -254030 -208084 -217717 -102295 43705
8995 -41011 -61132 -29815 64663 -34152 -41841 -245732 345294 68242 89784 -286535 62449
8983 181724 143132 -96261 -201744 250927 -35561 -238515 -176556 -451262 148972 68720 38641
8972 38641 67938 314312 36487 -294375 -194090 -49010 -37594 -254627 -90440 -151339 -270400
8961 -270400 229931 26176 -56383 -100785 95514 -122397 113044 -128096 125156 -94878 285492
8949 168181 -203260 -249765 -257266 49814 -132575 -48178 -103263 -277164 306265 33608 151027
8938 151027 364933 89062 31150 244721 278537 214410 -62595 90724 -32099 -179182 -89838
8927 -89838 387949 328428 870231 3008663 8172713 11784760 12522761 10375569 3549806
8917 1455684 489681 631266 495592 261846 95527 180955 428501 157559 212968 126736
8907 126736 70362 121635 209982 -119310 25812 -103874 -131846 41737 -181886 -85551 -19638
8895 21019 150540 -239557 85912 77619 22061 -124401 -113206 52512 43845 163759 -36835
8883 255954 159902 -38370 265738 -117919 -288093 -500613 147598 -203239 9282 -169841
8872 -213876 286798 -62215 -86612 -25239 -7913 127936 -230885 -135212 17789 92564 -26996
8860 181736 179350 -92046 -188198 -204600 -64989 -56421 -253612 17316 -176449 41578 206425
8849 206425 70813 -300397 -126710 19132 -229490 26156 -252408 -167015 114532 112207 68028
8838 68028 13114 -184703 -204272 8468 17141 -13113 -145822 -99575 -206219 170620 117278
8827 117278 -259132 -173304 -33906 244222 -124235 15296 -99270 43457 197001 19583 7356
8815 31256 -485558 101357 -99471 -153143 194788 16439 -115143 -110367 -136517 193544 -44014
8803 38031 142851 -73448 -153570 -163565 -329665 220766 -61346 -95500 35383 -274308 11725
8791 178298 -28388 -14088 -237743 -7086 -198199 240986 -18923 -209751 53852 -232621 -64759
8779 -172137 52119 -161469 179134 -77269 31966 2595 -58381 -116381 -235162 -2684 3327 -11233
8766 85175 266982 139822 -224570 17454 -137595 107833 -70225 135357 -129643 -207090
8756 -207090 29337 125456 291231 202879 -282651 272323 234356 128959 203369 -110388 -199686
8745 -199686 16079 20053 6558 -149725 102572 -25434 -189549 -24345 -324852 -100362 -293345
8734 -293345 -198423 -188061 -104024 -9459 -93806 4709 48033 62809 -279283 -38965 44445 -237996
8721 -212532 -252091 175913 -236008 -231435 -112422 -63942 266496 88023 32763 -55721 -23833
8709 -188915 70993 -193211 35884 17777 62704 -238189 -212813 169570 116424 -37001 -72933
8698 -72933 189690 -103502 64251 -51270 -192470 -219549 -137323 30217 -147251 -178512 -1673
8686 227568 43367 -19033 -164717 44296 136979 -297108 -63941 -68204 5953 119661 -17505
8674 242322 -186741 -54425 -96116 -259576 -95141 -263554 287966 73876 -281796 -363183 73200
8662 108413 -6707 77458 -67602 14316 -235180 -190390 -118456 19353 24677 149429 -160718
8650 -23606 -217287 -292322 -154591 -153918 32715 162549 135663 -155130 16533 -399413 51290
8638 -132066 149333 -292703 -189537 -105661 -25829 153216 -161536 -158527 -15067 29927 -474315
8626 175112 2084 107625 -287091 70916 181223 -136925 17309 -283528 47185 -60605 -74408
8615 -74408 -102270 -36725 -32297 -56483 39104 -42852 321265 349642 381620 -285985 153840
8603 -98497 229366 -468200 75695 -150070 148112 -310111 -42591 -70784 -81879 -287968 -119310
8591 -56194 -342645 -279787 -258643 -109713 -238563 122273 30349 38230 154858 -217851 242137
8579 12717 -114098 216972 -33999 -180979 5217 248333 -245244 -89312 -31074 110371 167836
8568 167836 -380250 -26801 111396 -124540 -326483 274106 -133539 -88077 171536 158592
8558 158592 -194267 153505 -114271 -251949 117839 -412764 -148635 38707 175114 -67452
8547 -270011 6309 -90277 -2239 -231544 -296339 19051 -140721 -16318 2781 -312637 -127230
8535 -310927 -106932 57814 -176259 -199114 111695 -36501 -37296 213307 34548 161449 -49970
8523 -132569 -142706 6360 -62447 -176330 -174124 -225521 291120 173133 9517 -178753 -54848
8511 -65753 -126209 219321 79535 -69664 -8000 -199703 -74889 -104941 -251370 184971 -28617
8499 43951 5286 -65574 -148605 -18594 26128 -427807 67339 162620 361540 -12446 -321650
8488 -321650 172865 266528 115694 -560645 107403 -236520 -81222 86220 84044 153685 -388697
8476 105416 149732 -22202 65550 63533 163549 -469067 205229 2206 126882 103809 -24326
8464 105368 -184136 41726 144179 379324 232671 -183070 -3045 251927 -158735 184309
8453 -414638 -202248 -253407 315166 4325 172111 -61643 -240291 -53785 -130191 16138 102087
8442 102087 -224485 249813 45056 -85642 -132291 88250 -260603 -20528 -134147 391035 -283617
8430 125480 -63247 -218914 -64069 97006 75096 -6085 -97655 324674 78830 -62317 236725
8418 93697 156186 337643 41073 -204040 -39373 53981 -85030 136585 -78365 -232659 -175833
8407 -175833 62553 -12072 335613 -259677 -196599 84879 86759 -40594 -280102 119579 -39421
8395 378006 64795 -164575 -18006 -137003 184714 -154022 -122005 146243 -45108 -63808 -189136
8384 -189136 55762 102453 -82896 -229724 -113908 61516 156779 74495 -26478 79250 204109
8373 204109 -20970 -263459 31990 -166062 17771 -2433 253808 -55902 34960 -118028 123470
8361 -162559 -517308 -110817 -26006 -132188 141787 28972 -10121 -20300 163255 -180322
8350 -25207 186827 67995 -165644 -176332 -105910 192299 -59817 -54684 -29171 90217 -78042
8338 68914 141697 -20530 107773 -290870 103101 339041 224365 -100706 165945 -177164
8327 22061 13706 -280351 -103547 -138795 -161779 52561 33763 -370220 196334 50717 -166705
8315 159406 -237230 -82994 -82862 -153454 -179968 110401 163317 -395400 -227753 -218743 -422812
8304 -422812 -218110 -273268 -129511 19609 1078 -173597 -366392 250504 -174583 1195 -183881
8292 -53468 -38266 -50728 -96848 283170 102275 -387638 -76671 81054 -474723 -43532 -6339
8280 -310946 52202 -108871 -106904 -69507 293003 10256 -252996 20306 17069 -8573 -345799
8269 -345799 -100840 111342 -291429 1155 -114012 -53520 -27941 -7463 -196682 105336 -182773
8257 49029 109709 -312594 52329 -74821 119965 -319231 98261 89741 -41614 363781 20401
8245 -271234 -150123 -42838 78521 -350989 -338608 -9256 -148547 98858 -286509 -95207 -66243
8234 -66243 -218710 -212695 50053 35285 -73011 142548 141404 7931 -202990 -144884 -56382 297391
8221 -28884 -52981 101014 -206586 -106263 -246045 -138319 4289 -335762 -77248 73439 -42054
8209 34701 88197 -180573 -27536 89480 -96571 31935 -377645 62913 -194357 47924 -273666
8197 -289010 -313977 -301354 -3106 -51894 -199057 -95027 -114997 -141863 -36010 -57576 -113499 434616
8184 24611 -207456 -150531 88560 182045 -92971 -234338 -9915 -156606 -30438 49715 162496
8173 162496 236839 -23005 -81781 -90936 -424096 -347336 -185295 6631 -50751 99920 6506 -328759
8160 -161375 -287274 -212731 -117130 53161 -494989 257425 -17178 332258 169754 -108074
8149 50415 -176047 -96019 133980 -23890 137176 -298025 16864 -42027 220272 216780 -7945
8137 -378753 -272872 -338665 -228350 -259138 -157097 -132886 -414661 -88199 331261 -79303 414992
8125 154539 24781 -319093 214998 15577 99088 -305101 284456 -22294 -106596 -283104 -171526
8114 -171526 -138540 2078 70261 -442092 -118254 -148602 254196 46102 -62173 -149158 -8240
8102 -173127 233049 -217597 -8410 -25283 262392 -9925 -312368 149876 -183479 223250 -65506
8090 25004 32746 -239500 -34807 106649 198991 -253371 -141482 38495 -133692 -106929 -14005
8078 96352 -114701 -59827 -112994 251718 -206601 21040 -447527 57322 -182434 -21543 -4696
8066 -183608 446296 119226 26438 -130104 -108774 73967 272447 -93241 -135051 200039 -102769
8054 65471 -130764 -145835 -118299 -119659 -336321 -121319 -279535 18131 53887 -98174 -204142
8043 -204142 54451 -159277 401788 -22771 24447 -142687 28836 42922 -245131 -308404 -108248
8031 169705 -180609 -11648 -345181 -87131 -369344 -133986 -44980 -212548 -207494 35139 238271
8020 238271 68471 263196 72310 92501 -165787 64124 -188964 -6591 -260412 178575 -88807
8008 34610 144264 107066 23102 -141031 -499737 -151404 44042 -183626 27249 113831 -7606
7996 -150353 -166866 68481 72072 31610 -586379 172428 124830 5754 -79979 -203579 -80890
7984 -19666 44768 253959 -251926 -117962 -125746 -304869 -123619 114417 309478 82128 -91060
7972 -118607 -22939 175910 -177932 -124250 80445 -159389 280997 -176032 -427929 449960
7961 -69026 98358 117633 -158240 -29143 -5880 38785 -178106 -197843 181166 -55770 107537
7949 160253 -167992 133059 -108103 88752 -39493 -148227 59831 -4779 79529 -127962 -9207
7937 -54702 -152304 49992 258041 -206711 -40286 -458543 -441383 215982 -221132 -197431 -269172
7926 -269172 264903 28171 81785 21783 -124947 133478 -24522 -23902 -245734 -111569 -151816
7915 -151816 -227329 -41892 -166661 -12696 -80622 104179 -254865 -71632 -154996 -46535 155830
7903 111077 -102048 -196874 -62352 -55279 121695 -9814 -112003 6756 34337 -42944 -303431
7892 -303431 -196484 -125221 8178 -270819 -287921 -21190 -33737 -165543 313940 -63510 26499
7880 -130501 -135422 -61995 49082 -118066 -138685 15885 106046 -488823 77507 -281692 -58562
7868 -74897 -141759 68312 -349284 -237421 66595 -55051 159347 -68898 -32368 -84420 25266
7856 -50573 -141591 -36753 -128775 349262 -138948 39293 214963 -36582 56032 -183315 47831
7844 62241 98441 -64904 -128737 41565 -57591 149830 -123920 -96495 -74775 -56361 104198
7832 -135720 41593 45496 -61056 220220 126373 -188727 -220592 106031 18231 101642 -37493
7820 -100082 116158 -19094 27946 -183281 13933 119563 -66108 149253 205846 -462214 152494
7808 -259847 -402977 39603 -80727 -13912 3210 -198529 116504 14768 -149375 32355 -240106
7796 -30801 -211666 -23361 -264691 -48691 -162689 348297 103889 93474 99289 -161121 -17800
7784 63041 178795 -83653 -35629 -199850 -14738 -72849 33219 14193 -43132 -266574 15706
7772 291065 -105356 -76266 33590 238336 -19106 36021 -110572 405778 -107418 -541948
7762 -541948 122140 41930 -130410 56133 -44287 51674 22826 -273148 -68477 142195 -25494
7750 -29807 279072 -85108 46708 173111 78062 264100 -207053 -206632 108462 92929 260084
7739 260084 247211 -28855 10983 -9219 -18734 -210963 122693 11271 70028 56705 -79164 65371
7726 -119239 -162879 -49088 1472 -335345 -199291 48895 -115298 -40907 -108942 29775 -6324
7714 41302 -146730 84698 240144 -82250 -192001 37255 -26339 -18484 -20096 189392 -194982
7702 -119756 221714 -250528 57303 90802 -150645 -155617 -178719 44857 22190 -25379 51481
7690 -150508 -225867 105129 -53455 133208 115942 -284591 -173094 574789 28182 -279587
7679 -44325 -50790 105560 -86605 81999 -194783 95740 161842 57957 -116366 140088 -81676
7667 125117 104595 253287 -375384 -18756 -406892 170466 -82888 441649 -25864 -97780 -52991
7656 -52991 7991 32291 133050 49107 -176366 -290847 -63166 109270 -225062 -245435 -124301
7645 -124301 51394 -14301 117355 187233 -125061 184623 7076 -144496 -150249 -244064 219736
7633 -192337 123958 179534 21758 108223 196559 -358455 76682 27338 -224579 -77107 -143994
7622 -143994 -112114 -24580 46529 14458 39998 -303150 -20533 245969 149546 -347081 86981
7610 216198 -272843 -95070 234 -281655 -31384 -103991 -137815 150792 -40257 -109142 158527
7598 -175225 143390 -238837 64181 -407738 -113960 -88079 -8393 -371993 -55469 -52658 162681
7586 166570 -74013 -121339 -318705 108652 165311 92630 215813 -39710 52900 -139799 5080
7574 154792 -142164 -151949 -485767 37498 -233007 -126624 324769 101349 145163 -87440 -19920
7562 -126151 -138891 85922 -60563 118850 341433 39700 82112 2469 150685 -181084 -104948
7551 -104948 38907 -73653 -44112 -173641 -21129 -12383 77950 44535 79702 10684 140690
7540 140690 85799 284124 52437 -103871 -209814 -222625 161683 205431 -92953 -116366 141364
7528 -237203 -17045 53766 245840 251354 68734 132899 -6317 76064 -66554 -70393 287985 56067
7515 100804 -196139 -45059 -72980 398417 39114 51660 -168160 139971 343582 -78575 136430
7503 -450326 53207 114821 -438955 1588 104089 -211308 -206484 303985 -28113 -12799 61405
7491 -62435 -230048 39865 -151564 -194349 -187277 181422 163844 72520 -44490 -105747 399 -64060
7478 -243272 -308158 215212 110104 -338975 3440 -99931 74149 -218135 -134573 -92901 -79801
7467 -79801 158238 -105990 132920 14591 -123754 -2808 -73251 -199618 67231 6388 -341643
7455 -179309 -151966 -70372 140076 -171683 -29922 17148 -27399 139725 254541 81706 8822
7443 168916 166358 32896 212983 103692 -103377 129837 -124452 -225989 249665 181456
7433 181456 122702 -15643 50502 54600 90383 102863 -141828 104930 -23424 -158078 -390421
7422 -390421 109989 21001 -116938 -131298 145472 28125 -137284 -195222 -79759 -196601 -59511
7410 -188112 -245112 113242 -262073 -343760 36744 28893 -148592 19376 -72925 -234674 39275
7398 -184803 -49506 -362422 -89205 -63016 89190 132631 -376308 -25805 -100004 87182 37351
7386 -214314 -145868 -29397 -86694 113991 32787 2394 32172 -39658 460964 141563 136519
7375 136519 -160422 354463 -14141 83428 -80156 38653 54515 -84943 76215 -232912 -21167
7363 179864 -454890 -142072 -29466 76760 -362823 -251935 -12317 -38574 -305555 30759 -136767
7351 -24700 -322241 -97738 80444 67982 -80508 5006 -152841 -81038 -23188 11329 -111321
7339 311866 -201666 199127 170334 33744 48516 -79181 -138831 24396 171717 -27911 118964
7327 23840 -255896 76017 35039 231040 29436 -60037 -2142 -269415 -12498 -46865 -277315
7316 -277315 144063 -170200 179670 -99438 -11659 62555 -259843 -37944 245356 -353367
7305 -54096 -32561 -193620 67218 -130409 -158905 -99769 -170769 145435 -329594 161806 50758
7293 51423 17903 187170 107005 90955 -14375 -213198 -78995 207964 -109658 -360640 -38405
7281 -57708 -118607 -110585 13516 -35507 80936 -308052 -153484 46442 182387 -168574 -156592
7270 -156592 -146559 -293508 -133152 76879 -291325 -39086 -67775 -167568 -72884 -215808 96000
7258 -118985 -112432 -167030 -146322 -253553 -257095 -223080 -26202 170464 -274189 -82768 -98024
7247 -98024 39268 172801 68035 51337 -194579 35072 261438 -76100 -77445 -320515 122624
7235 -189643 11396 -117374 -84065 52939 80573 -285810 26071 -184206 -317019 -135030 -493242
7224 -493242 169974 71339 -84334 5697 281764 -196588 183067 -67523 44222 -147530 98197
7212 170726 179255 81042 129714 240120 233471 171231 -68592 96716 -138389 -135035 -38486 368719
7199 -282568 118671 -348465 229653 851 -69305 -82333 -26912 158140 -136384 -81470 -124860
7188 -124860 -213197 -115778 96320 55672 269441 -254438 157175 -103259 -35019 246726 174646
7177 174646 120637 223003 89754 -198433 -209366 -136612 49756 57670 148804 -161904 -62724
7165 -7467 163037 -231664 5434 -140559 -33802 16026 -19244 -137584 -131866 -108198 -101594 92899
7152 -79346 33133 109918 -423937 -230388 -86852 245848 152763 -13887 10196 126047 -245183
7140 -74350 -73397 13493 -258712 74264 134294 -210395 -48352 -332064 151934 91129 210672
7129 210672 -209376 341198 115576 -6643 259213 -200837 -68409 200421 -188388 -383671
7119 -383671 24105 -9049 243202 62903 137752 93023 99839 34284 62585 -264737 192814
7107 139167 105726 404107 -90414 -226624 -20799 -95003 181963 143205 -381989 -91746 -340862
7096 -340862 -369873 135806 -140192 261288 74993 -252218 -50148 -8440 -98151 24006 -144806
7084 -112071 42361 -478993 167342 168456 -62132 -151937 -336991 145446 -268725 -65103 201666
7072 -37181 -8042 149757 189243 148003 -124927 56717 37317 -201544 -241273 14351 -286048
7060 -71201 -62814 -227850 256999 -121086 119136 324042 95158 -117754 110898 110194 245054
7049 245054 246287 -466113 -67940 -444743 -53535 90745 -95790 81766 -113614 28911 -117555
7037 -11179 -167816 148495 -226938 31138 -98523 -49745 54326 60816 -15163 -231715 25933
7025 -272488 -9871 51373 -158972 -59954 -79753 -33466 -124311 101104 -6221 -60266 -149301 -253566
7013 -253566 63683 304470 145893 -30508 -28536 -191826 -166470 92315 376443 -60070 -194375
7002 -194375 178029 -158810 -33849 -38175 20535 -195276 -370757 -15754 -191084 -27303 -74861
6991 -74861 -116866 32893 -27362 26758 60700 -219774 -52314 120008 -13522 68956 -49146
6979 -155617 130160 141493 -223204 275416 199418 -244983 54885 -100253 357036 -61895
6968 52280 19082 -70148 163472 -50244 214596 -20358 -143278 -16849 -196085 -179089 95816
6956 -153471 -11828 71678 -51628 -184683 15281 1126 268497 -148000 -47314 -87957 208525
6944 -101599 -45762 -56985 71010 164436 278854 -198519 -252464 -174876 -241510 213378 -154772
6932 -92429 5871 69859 236061 -215893 15748 -20856 -46727 -285585 2667 -7979 -65827 1579
6919 -228859 -97561 -76113 47661 -115928 257515 157734 9192 -219252 45626 -159190 -101303
6908 -101303 -54645 223893 -82927 140871 67732 -155772 158758 -166558 -170899 -49397 -50873
6897 -50873 27034 -337580 131855 191684 -264285 248249 45723 -67315 -173744 215477 -6446
6885 -2582 -131624 168737 -63860 69563 -177576 -227582 -346391 -325440 -82781 37945 27579
6874 27579 -98056 214516 -90803 181189 -228371 -99383 -90820 13649 295560 83926 265019
6863 265019 -2194 4891 -118477 118980 -232921 84559 40093 -37993 145487 7242 60923
6852 60923 -12883 113349 -384272 17947 -6087 88585 -245085 9813 -11831 12352 4918 -92200
6839 160087 -302120 -24437 -70171 153718 -106000 -67088 62577 142209 -122846 -57190 -234110
6828 -234110 35506 -252188 135969 -196120 194700 4202 212707 222675 174979 -209845 -172205
6817 -172205 -196968 41819 55162 -241093 144440 -243827 66105 -284775 184030 -12733 -83457
6806 -83457 14515 18253 7023 -398765 -113113 26916 9333 220446 -542556 89060 -192733
6794 -77617 -62214 85163 199900 -17100 -391089 -11184 -30224 -103228 -109761 27991 35546 -104556
6781 -28954 -145532 202699 27267 -117391 34151 253549 -163978 171859 -176703 -16868
6770 511569 -34054 291670 -89039 -123569 -47059 -9378 266001 179605 259579 -152729 -53540
6758 -95022 359073 153023 -165458 -268654 123241 -153753 -413631 -209582 139142 -276
6747 -135178 30798 -145345 -180483 152148 10031 268482 -125165 171833 153535 -121948
6736 44865 -235312 322738 60396 -39870 -11621 -404889 -304991 27144 -99263 -220362 19397
6724 -34033 29020 49248 -249187 -79135 -81563 -67954 274903 408222 60834 -6265 44707 -246854
6711 -33635 120641 128552 -16656 -45649 -161623 -87087 -161041 225602 -256225 210276 -333901
6699 -104017 276807 73891 -57206 22733 -18919 90722 120047 -115716 -21681 -231804 -200819
6688 -200819 6413 62775 285588 267484 184470 -445076 -350194 -35828 40269 -202261 348368
6676 -24334 66139 -445078 -6448 -92124 68364 -225848 -68601 85682 -94688 9920 191147 -238961
6663 -196736 -20927 -23643 -70185 87622 -94494 -215830 -27463 6598 -40954 -12860 -270010 7203
6650 -32673 147412 -177792 -82256 -272103 399196 -118469 -12108 -202673 -105832 -66994 228397
6638 -447322 -31050 -78709 156692 71456 -136999 306334 22236 -145585 -11785 271667 -25745
6626 -138214 -72220 172637 9306 359444 57773 242890 -131681 -292738 -145939 -203319 5232
6614 353590 29509 -252961 -63909 338883 -110877 31052 -21570 157213 25734 15843 202237
6603 202237 6497 -319352 -102691 -247749 128913 149376 -88371 -4540 -118413 243491 118180
6591 64115 -146154 147880 -90271 -229590 209375 82402 64736 35735 360782 21122 59182
6580 59182 192149 -214115 46309 -245317 200163 -31472 141983 -94078 167676 -63046 60000
6568 -207700 -156828 -10415 158707 13521 139994 109121 76959 -263977 47811 -151200 1528
6556 13625 142398 344725 -140274 -110222 64554 19153 -262262 244240 272856 -91904 50379
6544 4279 -92740 -156145 114420 -42798 86160 -265943 136181 103471 -226875 50986 81701
6533 81701 -153846 85830 10043 -94752 -66284 107538 122898 -218104 -174818 -17297 -22062
6522 -22062 -26842 -66920 183837 -3297 32553 111174 -104920 94590 145225 218061 92501 -13195
6509 95502 85017 79928 -53685 -117265 118402 73639 -206434 -167377 -319494 -315186 29473 -221134
6496 -303035 270452 32660 102330 -11557 -126472 49319 -48146 -49867 -218772 78178 -142631
6484 -46447 -11724 -164523 -376087 79892 -52375 -464537 1086 -136426 129744 1456 -397543
6472 32314 121365 -362934 -85868 78863 50477 -5488 67804 42915 -142424 79068 -293388
6460 -38212 32879 -328189 18297 -193757 -24343 -51941 332024 -80140 77551 -23985 54673
6448 68824 -49360 -144901 83859 178633 32872 42061 178411 -27854 -2250 -89889 -109081 286595
6435 11761 -16814 5311 -190102 -220748 -95496 183300 -15955 -45304 -40040 146843 -375430
6423 -177438 182999 304378 41388 -23550 136928 48708 -79768 -154761 94477 -126929 -129608
6412 -129608 173295 157412 -31876 -266090 306011 68298 178731 300732 259810 119440
6401 3705 -151020 -146490 101528 -56696 80661 47222 187370 -122859 88425 -24537 36349
6389 -80627 168131 110393 130182 -581638 -91674 -8504 -78316 235531 129398 -351048 235655
6377 -195612 -88448 -57121 -24444 88399 13246 -61122 -171368 -317806 51111 -484500 -225081
6365 25315 6155 -109464 33985 -113480 -114754 -45926 -43696 -27692 45479 59510 33146 -260129
6352 62061 -238994 -103813 -298476 -23154 -369277 147643 213465 98459 53846 -48927 -118313
6341 -118313 130735 125470 9978 154767 116540 -291419 -145319 94184 147351 -138032 -123075
6330 -123075 -205336 -368551 234933 251537 -79243 624626 -43844 -21117 -12352 -196607 -493478
6319 -493478 -259137 197716 49880 -233963 179802 -109537 238292 189621 -131989 105960
6308 113501 437041 -21885 -319604 235389 -347907 154406 -139484 -118453 97763 14909
6297 -110694 -134966 -122421 156871 -166111 -380658 33952 -49843 101477 158342 -58256 -175492
6286 -175492 -86852 -75217 33942 -53908 176396 160579 -48808 70415 -92290 -186511 97439
6274 76775 310029 235230 -14629 -44757 -58153 -5925 -79867 -221962 -181048 -47395 306793
6262 59165 123523 -71500 285241 125466 -34431 63554 -30727 98429 205191 54179 -188237
6250 238366 -113763 -22799 -5210 -1501 -122635 -79982 -40495 -22209 135590 238962 -26377
6238 -190244 -45239 -376945 240023 -22820 -264850 90978 174279 21445 -28471 -96231 -106658
6227 -106658 -324460 58673 -23293 -123357 -183296 -352683 -166986 -23017 -109586 -20987 72467
6215 85306 334979 231710 25019 47595 141375 -357833 -92220 -157999 204110 35456 -147868
6203 151593 307642 -101778 -26571 -118317 -92830 -380700 -21125 -58107 -13887 71744 -142620
6191 -223465 25008 -248750 -72237 102350 -230997 113143 -58507 -38780 114749 -114121
6180 -32146 -78802 -122387 365551 -59699 91929 31916 -62592 -60276 -275283 317472 -694 113717
6167 164642 -87813 -388694 -40351 -419290 -106607 -87483 -28278 -125446 -189797 15238 -108820
6155 -129183 55992 -129741 31479 -212295 54773 -101349 -102379 -100073 254133 -117383 -162294
6144 -162294 -172963 134679 -202278 415811 17243 244066 117310 -196075 -151700 269446
6133 109267 96332 379934 -230226 -154872 -125095 257772 155210 -5242 -80914 -82943 -125319
6122 -125319 264679 -96106 15303 -208142 10955 -225864 -251533 116985 -48439 -132411 161278
6110 150730 81276 174358 -238735 -74628 -46276 -122206 190576 310043 21581 28008 203419
6099 203419 56501 -61756 35859 -324293 194882 183352 -5506 -109627 122816 -220916 232717
6087 82611 -459126 -333711 137716 -274395 -325000 351917 -71175 198742 -158164 55233
6076 137549 -216727 -159595 130627 97081 -193386 500 88392 294450 120132 235572 119210
6065 119210 167765 262650 -216612 -311403 393472 -22422 90754 -51521 -8657 39570 -210899
6053 25722 -13029 -173621 -174486 109279 135 -386689 -273337 -92052 -138230 -7743 240098 210133
6041 210133 64901 83728 -110420 22632 670 -257306 79174 201659 144476 -129361 -225266
6030 -225266 -80797 -49879 172575 101869 -45963 148343 4916 -79855 455106 229171 -130601
6018 142076 32156 -77380 187188 -217953 -86119 -368338 52623 -53062 70853 -174838 410113
6006 -81136 251181 48047 -42217 144786 298087 -247869 -114106 8375 28605 187044 317583
5995 317583 159950 106695 -92773 125347 -165585 81627 417490 -163084 106197 335936
5985 335936 -22151 -258575 32788 -165390 297655 -306386 105245 -52058 152482 -213847
5974 322841 27216 20464 128860 -77604 -102348 -137506 152743 211769 -251433 -112326 -121294
5963 -121294 163366 -212408 -230697 140399 76258 -112465 -133899 -56010 -103092 245878 -22855
5951 112745 -156381 -130923 219936 -288585 55855 -18481 -61990 -191237 -117973 220709 13216
5939 94118 -180730 -36388 312156 107940 -255695 -176789 -129377 -51452 -195057 -106462 -162891
5928 -162891 3097 -129754 -284527 -31713 -43185 180734 -15198 -342226 225905 -136552 72902
5916 73749 21400 -364293 -30171 58239 -75685 -110983 -159429 -23967 80676 176024 -2694 -177640
5904 -177640 170338 96152 -98337 -1282 -5565 166775 71641 136444 186272 -115014 207589
5892 136398 -169238 209642 -84496 -151223 68543 10810 -91439 542695 -122924 -318105 -60425
5880 -176201 -221928 73494 -134846 -220700 -113409 170962 -25168 -283504 228539 -39458 -117729
5869 -117729 -456436 257510 -109906 11835 -156643 150743 307158 -9033 6291 -112153 80813
5857 -30691 -162361 207388 -109736 -106179 -48720 -70269 42859 52456 -183305 150903 -361804
5845 -199300 -53475 -241335 111351 -326140 -221200 -19332 -50059 -32270 265691 63858 213985
5834 213985 9687 -366213 178874 32867 220263 173422 286816 -273628 -225579 34263 -93550
5822 195387 77287 -59166 -204217 125230 -188172 -173006 15252 178718 -243854 94609 206434
5811 206434 -5806 -99665 -8360 -91637 320304 -104920 72830 -52568 -42510 88266 -92901 -51467
5799 -51467 270351 -58993 -48093 -199461 161328 -81864 -93605 -116719 61869 60788 -69038
5787 -256092 -24590 -184919 -132563 -31038 43604 97174 -292849 -99201 -90505 -79935 101734
5775 -31186 55136 -99528 -224328 -207703 226632 -155353 -191883 -161117 223020 -50090 -6726
5763 253906 10549 206504 -78549 140758 -125154 186893 -138177 26553 -188134 -87181
5752 172167 40582 -120562 59512 -62547 6089 124221 58233 -393166 174918 47189 -75780
5740 -125220 -140131 -27579 -42588 118234 -233336 130150 -15440 -82742 19397 -160368 172407
5728 25751 58965 3465 -245510 -196267 -97233 91396 220121 -57234 -44377 -278648 -124915
5716 -88273 90807 223594 -157671 -272447 48088 64082 -431098 -129718 -280519 146465
5705 -200669 -144681 124809 -239214 -213590 -117669 15749 -23469 -320111 16713 -125869 289514
5693 291600 57413 174219 212299 -249995 -234816 -70939 145315 120157 170096 62491 110866
5682 110866 -30631 -274759 95057 -77653 -152285 -49 270338 -201805 -175128 -49956 -237374
5671 -237374 68265 -252937 -173333 225870 159987 124382 -230592 -168371 343467 -233165 155224
5659 -36194 229413 149178 -145011 11219 77350 -113572 116541 -10264 174602 104928 -285772
5647 -153767 -378892 -74629 175805 235322 237797 59709 -113350 5877 144850 269345 123575
5635 -64243 -156348 -143546 55041 -118255 -95191 14173 43344 -218987 22524 340260 161900
5623 246775 -133732 -66781 -47411 -303072 -241233 -32565 -64944 8641 -185683 -391956 -181880
5611 25661 -158761 -100411 66215 -4645 24444 -156638 53416 -186683 -152807 -126120 -142672
5600 -142672 -157148 -258722 6707 151019 -93432 -94817 92323 63552 -299124 246051 -225975
5588 -116931 -138206 136332 -52254 -522899 71554 360717 -81257 -158865 -84474 -141222 162723
5576 -2343 414778 -108424 213071 -258149 -205435 -203300 -29335 350769 5052 110612 -18848
5564 18618 10722 64689 -70467 177983 -87212 285785 -246775 22026 -113782 -78562 -1361
5552 46770 -61986 148596 -354496 387638 279922 105837 109488 -149136 -143329 -141021 164894
5540 -3160 -152164 -19341 -20896 32292 -9869 -50418 -60791 -37294 91795 28439 -52469 182387
5527 -323426 80865 78876 -98443 -17467 200200 -213213 -152252 -104732 -117731 -39301 195189
5515 165547 232055 -89982 264538 79834 -235313 28801 -191925 277150 -146691 132331
5504 -19169 -300792 -121845 261333 163436 201808 -256631 -115589 334730 -177859 -42635
5493 -380855 18213 353597 -49142 -189077 259903 -15911 -50045 293313 -59487 -140275 296350
5481 -223818 -44768 94773 146122 -104714 175682 -65965 -24769 -180930 58957 49681 127525
5470 127525 -52966 -63042 175342 -26024 -55425 220918 283034 -176332 188031 58730 228757
5459 228757 171986 -244447 192387 55527 -345510 202405 -26949 125813 48054 -145277
5448 -277245 1233 -68592 -179946 137346 38734 -19945 172610 89074 -148235 -114091 85212
5436 -49436 83183 236046 -54867 55101 -11122 -153549 -178813 -92748 160758 216708 -45401
5424 86775 141187 245736 -43001 -19038 192956 179620 -7855 230903 101589 17792 220416
5413 220416 809 -95217 183993 115439 188473 12620 -46207 128651 29494 303519 -92225
5401 74203 -209881 384528 -90717 176233 -292733 -52456 -224070 74164 -19677 405510 3876
5389 109491 186603 -131012 -97951 -111341 -26864 -79921 79868 -107807 -47326 -132921 29239
5377 -71407 -209004 -361249 48158 48379 -180882 25820 202972 1248 37061 -72105 -237791
5366 -237791 51088 64512 -398733 80496 -209908 -77610 -55665 -46461 40854 4482 105214
5355 105214 -354213 118082 -119840 -166848 173512 110267 241329 -123430 -199253 -128976
5345 -128976 106883 -138338 -257001 54743 -242704 -30179 108405 -49614 109426 38891
5334 -88503 133192 122593 -24799 -196980 228827 67415 -24146 137862 -36433 165133 266687
5323 266687 -349508 -43744 249417 119134 -27596 -261211 -126911 -177933 17049 236883
5313 236883 67240 271046 123327 141858 -28070 -56801 -194645 142224 -322189 6376 -363180
5301 33841 37225 101015 -39482 -179380 -128993 190851 -363981 -69823 28647 -50795 -81447
5290 -81447 -49304 -85971 58946 -85905 -66471 -174887 212944 97901 89746 -145256 191939
5278 166901 176005 -23774 27074 -41821 -128548 42681 99950 -40727 10966 -29380 -131083 -969
5265 -306915 502 211918 103002 52298 260441 85304 -26794 200780 45655 -83672 229265
5253 45090 -235247 8486 85682 24168 -91393 208111 108722 265484 14762 49416 132052
5242 132052 -206460 185988 -162125 -236270 -3430 11766 138243 70358 -86494 122563 429668
5231 429668 -71286 74504 314837 -184911 -216390 -48280 -36260 -261696 349935 36881 -200599
5219 312060 69292 11618 281448 -247221 93553 -139938 218062 41374 -150654 -33054 73918
5207 -167401 22996 -268074 45752 71463 14163 26994 -225699 -33900 92677 262343 94839
5195 58865 -73536 -531220 60187 -110613 -173748 -222023 100096 -108820 -192033 1376 106817
5184 106817 176004 -269634 -227703 26132 73564 167093 21979 -12564 234860 81909 176963
5173 176963 293407 214202 -171573 104954 102803 -120079 84436 -134026 -87606 -34648 -37291
5162 -37291 22633 132331 -453374 9552 -263250 302420 153115 164132 -14901 43708 -21002
5150 -147598 121829 39852 118802 45132 46295 -22345 -60229 112048 -65684 294622 237160
5139 237160 152611 295810 134062 -64885 -63132 -29692 12174 8032 309584 4496 293594
5128 293594 42303 -306402 -292320 -111263 -25710 -226605 -65494 -354616 268186 12149 96562
5117 96562 48668 -54828 97445 -225021 267067 -13336 -190280 -166023 122580 -351480 312549
5105 -14203 -414981 99547 -65745 -210105 -14342 67015 -247610 298903 -48191 -30900 140575
5093 -66692 -30283 -25969 119214 77570 -122627 -88850 -91660 55246 -133058 36324 -197270
5081 -216969 157786 113493 115495 44019 184241 220300 -99119 -97982 135545 -65324 -66659 274243
5068 -77208 -115315 184959 60087 54132 8104 -1603 -48607 276651 202161 -36657 -199148 18498
5055 184124 41004 -52017 81612 -31367 -33929 -9873 -111511 -123221 8149 -75440 74446 132663
5043 132663 66570 -181168 -48137 -98506 256445 54321 48769 -10134 -205604 -209566 107849
5031 109384 127045 -118980 121531 -109876 12384 -196401 -146293 252681 -463797 -26593
5020 76210 46488 -60646 247126 -236 -22744 -59827 -169383 -240573 -36428 -63033 -193618 266243
5007 -63590 -186574 26861 176291 -55279 -19816 27670 -101638 167503 -155903 227621 -423
4995 150508 -79074 120264 -142963 -78680 205495 142223 -199861 68847 166108 -6534 -116113
4984 -116113 -139990 82464 -155394 -53619 -111333 26956 -256961 -92152 -264552 -7412 76430
4972 152789 50828 -67144 -18573 -17083 121343 120853 93830 93961 206413 -266774 -35778 -127080
4960 -127080 -430581 -159116 -520283 -63069 70702 -44769 -465899 -193332 -201691 140805 252966
4949 252966 -171919 -77018 -24338 117052 57093 74205 102133 -155342 106079 -129765 62410
4937 -316103 -290679 -344583 -108934 -41994 -81587 321341 -27033 103149 -83179 41358 -22360
4925 -16456 -129054 -5587 55058 359430 183075 -355950 -149195 -55501 -112547 353880 -101688
4913 30020 166714 -39476 325142 35103 69858 253046 115540 35789 -40916 145112 125549
4902 125549 -15060 58908 5920 -209180 -153704 129833 -4924 -106601 -323699 -208217 98098
4890 -216355 -73296 24700 -99046 108949 225042 237379 -62535 -323340 90938 226975 111129
4878 -20306 -22816 14499 238638 108763 -10691 -85899 17663 15936 173329 2638 -59455 147197
4865 -134197 249136 70406 126275 -15607 96195 -97008 41793 50285 332780 149205 46221
4853 77502 -104470 -18425 -213394 16086 292596 -373433 23941 -119626 -76145 94412 86096
4842 86096 74497 99618 29302 154586 141726 988 241302 226851 147338 -131849 6841 438319
4830 438319 54217 -172212 -12234 71560 -244125 288291 140811 310585 -150814 71767
4819 4311 69966 113240 -84829 94633 50462 106787 -274931 -384173 95493 30413 -188942
4807 140221 -94109 108184 298300 -157458 192218 134218 36519 142162 -130917 -40732
4796 -49072 41379 -15934 91894 471424 443027 -22503 152318 14655 25511 -16680 148389
4784 -226610 -40441 -16279 -31321 144153 3379 131727 -126470 -91094 116337 144363 53799
4772 -177437 118501 178962 239490 82637 -24816 142526 125241 250024 20440 -60033 -102996
4761 -102996 -141931 193327 -12480 38510 -216364 -297382 38548 16233 -201200 -34868 29917
4749 175555 127445 24026 -80959 -98690 142677 43852 -367006 -114039 383447 -239089 -82877
4737 95549 -16033 75726 -126677 112850 142833 257711 256596 94597 -191431 246040 246470
4726 246470 -445794 17452 51339 -191773 1007 -54972 58413 -194995 485761 -78351 -277972
4715 -277972 156166 -97658 297181 117025 16568 243864 63915 395335 -167236 -161618 -12108
4703 -134136 44572 46524 -238692 -186688 264218 -120864 208505 -14985 106930 324826 168610
4692 168610 67924 -84855 -5380 -38891 36178 157406 -265823 -148673 61199 164907 162722
4681 162722 -405477 -102693 -66335 299025 435424 68992 -81708 -185428 209938 225272
4671 225272 -259061 -240649 -8134 282130 -25079 -114615 33390 -204495 109545 87913 -174992
4659 -70832 246724 89710 -65659 38277 38125 10651 -230406 -51532 168093 -219629 273535
4647 -160613 -159217 106390 69765 107248 144786 184175 -85583 11054 -104509 106427 -175690
4635 -220301 180111 -66284 -144586 -360093 102946 106094 399646 137466 -379098 -7835 354694
4623 37658 6175 73950 105867 45530 -5050 285353 212781 -134907 149840 136109 206662 1105
4610 184579 -197298 -24647 71813 -77511 -55103 103101 -510727 -393861 144615 74040 -117411
4598 64882 -133999 99958 -169900 -106853 -238311 218735 -124567 307774 -52190 -88995 -68443
4587 -68443 78516 4263 -47055 -136165 -120102 -141855 -126593 -112263 120640 112139 59944 -43235
4574 265870 28244 -4147 -98665 -134630 -235235 -52469 148141 -17474 460794 -218665 59010
4562 -118116 -125947 -171950 136411 132559 -321679 -40678 81347 -4092 79240 -48473 72004 175699
4550 175699 138447 218575 -181308 56166 -202587 -66755 116313 9645 117193 -52533 -180676
4539 -180676 117793 312907 333902 19194 104718 -59269 82788 -72988 229335 -166391 -145342
4528 -145342 -161846 -16289 177818 290328 -510861 108398 80156 142925 11615 -78970 -160434
4517 -160434 -42907 -123561 -226315 -208267 -166592 94058 -39515 191038 124502 135732 167939
4506 167939 138928 -287256 204441 -3599 108287 182998 94388 -359409 -77267 -318427 -20795
4494 -210934 -369383 23104 -73685 -207647 -179974 107993 54882 56092 -21974 112517 -210889
4482 452181 -41500 -255946 -286419 257080 226443 -154573 242367 -88805 -21667 253388 275343
4471 275343 -233178 -214725 235146 25141 79396 234362 178422 248856 260567 -101939 95905
4459 430770 151970 31917 23025 100884 -5314 -29828 4354 75166 75487 140853 385161 98890
$$ [...]
##END NTUPLES=NMR SPECTRUM
##END=
