##TITLE=AC1472_13FE002654_8026838_OpbxDh4EUJ
##JCAMPDX= 6.0         $$ Bruker NMR JCAMP-DX V2.0
##DATA TYPE= NMR SPECTRUM
##DATA CLASS= NTUPLES
##ORIGIN= BRUKER
##OWNER= Administrator
$$ 1.72 TOPSPIN		Version 2.1
$$ 2013-07-18 18:06:08.376 -0700  Administrator@X
$$ Compression mode = diff/dup
##.OBSERVE FREQUENCY= 400.02188249412
##.OBSERVE NUCLEUS= ^1H
##.ACQUISITION MODE= SIMULTANEOUS (DQD)
##.ACQUISITION SCHEME= undefined
##.AVERAGES= 64
##.DIGITISER RES= 22
##SPECTROMETER/DATA SYSTEM= spect
##.PULSE SEQUENCE= noesygpps1d.comp
##.SOLVENT NAME= COFFEE_meoh
##.SHIFT REFERENCE= INTERNAL, COFFEE_meoh, 1, 14.96112
##AUDIT TRAIL= $$ (NUMBER, WHEN, WHO, WHERE, PROCESS, VERSION, WHAT)
$$ ##TITLE= Audit trail, TOPSPIN		Version 2.1
$$ ##JCAMPDX= 5.01
$$ ##ORIGIN= Bruker BioSpin GmbH
$$ ##OWNER= Administrator
$$ $$ E:\/data/COFFEE/nmr/AC1472_13FE002654_8026838_OpbxDh4EUJ/22/pdata/1/auditp.txt
$$ ##AUDIT TRAIL=  $$ (NUMBER, WHEN, WHO, WHERE, PROCESS, VERSION, WHAT)
(   1,<2013-07-18 18:06:03.549 -0700>,<Administrator>,<X>,<go>,<TOPSPIN 2.1>,
      <created by zg
	started at 2013-07-18 17:54:33.940 -0700,
	POWCHK enabled, PULCHK disabled,
       configuration hash MD5:
       C8 4E 4E 5D D3 5C D8 9E 9F 52 82 E0 59 8A DE 15
       data hash MD5: 64K
       4D 88 3C FC 34 6C DF 0C ED 59 49 DD C4 B2 81 80>)
(   2,<2013-07-18 18:06:06.377 -0700>,<Administrator>,<X>,<proc1d>,<TOPSPIN 2.1>,
      <Start of raw data processing
       efp LB = 0.3 FT_mod = 6 PKNL = 1 PHC0 = 0 PHC1 = 0 SI = 128K 
       data hash MD5: 128K
       5C CE 0D EA 3A B2 17 1C 95 F1 A8 65 7E D1 89 B1>)
(   3,<2013-07-18 18:06:07.284 -0700>,<Administrator>,<X>,<proc1d>,<TOPSPIN 2.1>,
      <pk PHC0 = -78.44788 PHC1 = 0 
       data hash MD5: 128K
       AE E3 87 D6 AB 64 32 FD 52 5E 4A 9D 48 39 DC A8>)
(   4,<2013-07-18 18:06:07.774 -0700>,<Administrator>,<X>,<proc1d>,<TOPSPIN 2.1>,
      <abs ABSG = 1 
       data hash MD5: 128K
       64 5A 19 99 06 B4 93 44 27 86 12 B3 E5 A8 23 9C>)
(   5,<2013-07-18 18:06:07.895 -0700>,<Administrator>,<X>,<proc1d>,<TOPSPIN 2.1>,
      <abs ABSG = 2 
       data hash MD5: 128K
       4B 9B FE 03 F2 BB 83 9D 5C A2 F0 93 B3 08 41 38>)
(   6,<2013-07-18 18:06:07.981 -0700>,<Administrator>,<X>,<proc1d>,<TOPSPIN 2.1>,
      <abs ABSG = 3 
       data hash MD5: 128K
       C7 9B AF 4A 7F 57 F5 40 B3 46 F4 3E 89 3A 4A AB>)
(   7,<2013-07-18 18:06:08.049 -0700>,<Administrator>,<X>,<proc1d>,<TOPSPIN 2.1>,
      <abs ABSG = 4 
       data hash MD5: 128K
       09 D9 76 FA 5A 85 78 78 06 87 D6 60 E6 9B 3F FF>)
(   8,<2013-07-18 18:06:08.135 -0700>,<Administrator>,<X>,<proc1d>,<TOPSPIN 2.1>,
      <abs ABSG = 5 
       data hash MD5: 128K
       EF 42 74 EC AC C5 5D 0F E4 BC 92 8F 69 03 96 11>)
$$ ##END=
$$ 
$$ $$ hash MD5
$$ $$ 98 F5 8F 2B 4D A5 0B 7A A6 A7 5C 9D A3 4A 81 80
##$RELAX= 
##$RELAX= 
##$RELAX= 
##$RELAX= 
##$RELAX= 
##$RELAX= 
##$RELAX= 
##$RELAX= 
$$ Bruker specific parameters
$$ --------------------------
##$DU= <E:\>
##$EXPNO= 22
$$ [...]
##$TP07= 0
##$TPNAME0= <>
##$TPNAME1= <>
##$TPNAME2= <>
##$TPNAME3= <>
##$TPNAME4= <>
##$TPNAME5= <>
##$TPNAME6= <>
##$TPNAME7= <>
##$TPOAL= (0..7)
0.5 0.5 0.5 0.5 0.5 0.5 0.5 0.5
##$TPOFFS= (0..7)
0 0 0 0 0 0 0 0
##$TUNHIN= 0
##$TUNHOUT= 0
##$TUNXOUT= 0
##$USERA1= <user>
##$USERA2= <user>
##$USERA3= <user>
##$USERA4= <user>
##$USERA5= <user>
##$V9= 5
##$VALIST= <valist>
##$VCLIST= <CCCCCCCCCCCCCCC>
##$VD= 0
##$VDLIST= <DDDDDDDDDDDDDDD>
##$VPLIST= <PPPPPPPPPPPPPPP>
##$VTLIST= <TTTTTTTTTTTTTTT>
##$WBST= 1024
##$WBSW= 4
##$XGAIN= (0..3)
0 0 0 0
##$XL= 0
##$YL= 0
##$YMAX_a= 6799871
##$YMIN_a= -11587211
##$ZGOPTNS= <>
##$ZL1= 120
##$ZL2= 120
##$ZL3= 120
##$ZL4= 120
##$ABSF1= 14.96112
##$ABSF2= -5.597062
##$ABSG= 5
##$ABSL= 3
##$ALPHA= 0
##$AQORDER= 0
##$ASSFAC= 0
##$ASSFACI= 0
##$ASSFACX= 0
##$ASSWID= 0
##$AUNMP= <proc_prof1d_extract.lims>
##$AXLEFT= 0
##$AXNAME= <>
##$AXNUC= <1H>
##$AXRIGHT= 0
##$AXTYPE= 0
##$AXUNIT= <>
##$AZFE= 0.1
##$AZFW= 0.1
##$BCFW= 0
##$BC_mod= 0
##$BYTORDP= 0
##$COROFFS= 0
##$CY= 15
##$DATMOD= 1
##$DC= 0
##$DFILT= <>
##$DTYPP= 0
##$F1P= 0
##$F2P= 0
##$FCOR= 0.5
##$FTSIZE= 131072
##$FT_mod= 6
##$GAMMA= 0
##$GB= 0
##$INTBC= 1
##$INTSCL= 1
##$ISEN= 128
##$LB= 0.3
##$LEV0= 0
##$LPBIN= 0
##$MAXI= 10000
##$MC2= 0
##$MEAN= 0
##$ME_mod= 0
##$MI= 0
##$NCOEF= 0
##$NC_proc= -2
##$NLEV= 6
##$NOISF1= 0
##$NOISF2= 0
##$NSP= 0
##$NTH_PI= 0
##$NZP= 0
##$OFFSET= 14.96112
##$PC= 1
##$PHC0= -78.44788
##$PHC1= 0
##$PH_mod= 1
##$PKNL= yes
##$PPARMOD= 0
##$PPDIAG= 0
##$PPIPTYP= 0
##$PPMPNUM= 2147483647
##$PPRESOL= 1
##$PSCAL= 4
##$PSIGN= 0
##$PYNMP= <proc.py>
##$REVERSE= no
##$SF= 400.020009589678
##$SI= 131072
##$SIGF1= 0
##$SIGF2= 0
##$SINO= 400
##$SIOLD= 131072
##$SPECTYP= <>
##$SREGLST= <1H.CDCl3>
##$SSB= 0
##$STSI= 131072
##$STSR= 0
##$SW_p= 8223.68421052631
##$SYMM= 0
##$S_DEV= 0
##$TDeff= 65536
##$TDoff= 0
##$TI= <>
##$TILT= no
##$TM1= 0
##$TM2= 0
##$TOPLEV= 0
##$USERP1= <user>
##$USERP2= <user>
##$USERP3= <user>
##$USERP4= <user>
##$USERP5= <user>
##$WDW= 1
##$XDIM= 131072
##$YMAX_p= 307766192
##$YMIN_p= -20526197
##$CURPLOT= <Network HP LaserJet P1505>
##$CURPRIN= <$Network HP LaserJet P1505>
##$DFORMAT= <normdp>
##$LAYOUT= <+/1D_H.xwp>
##$LFORMAT= <normlp>
##$PFORMAT= <normpl>
##$SURQMSG= 1
$$ End of Bruker specific parameters
$$ ---------------------------------
##NTUPLES= NMR SPECTRUM
##VAR_NAME=  FREQUENCY,     SPECTRUM/REAL,   SPECTRUM/IMAG
##SYMBOL=    X,             R,               I
##VAR_TYPE=  INDEPENDENT,   DEPENDENT,       DEPENDENT
##VAR_FORM=  AFFN,          ASDF,            ASDF
##VAR_DIM=   131072,        131072,          131072
##UNITS=     HZ,            ARBITRARY UNITS, ARBITRARY UNITS
##FACTOR=    0.0627417313425164, 1,          1
##FIRST=     8223.62146879497, -1021,        -63919
##LAST=      0,             2092,            -64355
##MIN=       0,             -20526197,       0
##MAX=       8223.62146879497, 307766192,    0
$$ Real data points
##PAGE= N=1
##DATA TABLE= (X++(R..R)), XYDATA
$$ [...]
63910A965196j45087j38777j31466j23314j14246j04671r5252q6040p6568o6963
63900H82812n8340n1510m5812l9861l3376k7528k3383k0662j8324j5883j3627
63889E34506j1760j0024q196o560n519m983m357l134j360N22K144L509M812O127
63875D95727P355Q484R754J1479J3775J6526J9469K2188K4222K5489K6619K8506
63863G09593L1362L4428L6815L8462M0056M2029M3962M5033M4868M3710M1875
63852A152193L9327L5987L2188K8464K4790K0492J5132R209L569j734p409j3716
63840A338492j9878k4989k9065l2797l6497l9778m2164m3629m4459m4911m5088
63829I35237m4931m4270m2995m1234l9288l7398l5629l3828l1663k8913k5853
$$ plain form
63910 1965196 1820109 1681332 1549866 1426552 1312306 1207635 1112383 1026343 949775 882812
63900 882812 824472 772962 727150 687289 653913 626385 603002 582340 564016 548133 534506
63889 534506 522746 512722 504526 497966 492447 487464 483107 479973 478613 479135 481279 484788 489600 495727
63875 495727 503082 511566 521320 532799 546574 563100 582569 604757 628979 654468 681087 709593
63863 709593 740955 775383 812198 850660 890716 932745 976707 1021740 1066608 1110318 1152193
63852 1152193 1191520 1227507 1259695 1288159 1312949 1333441 1348573 1357782 1361351 1359617 1352208 1338492
63840 1338492 1318614 1293625 1264560 1231763 1195266 1155488 1113324 1069695 1025236 980325 935237
63829 935237 890306 846036 803041 761807 722519 685121 649492 615664 584001 555088 529235
63818E29235k3157k1218j9788j8411j6932j5333j3480j1466r898r177q733p618
63806C54024n850m382l713l302k680k291k697l520l955l960m228n073n995o391
63792B95987o216n843n611n633n734n521m767l774l111k948k863k471j928j659
63778B37908j731j846j814j761j762j612j160o77n43o26m60n4k3o52j381j590
63762B20216j476j486j361n88M02N42k86r59p53k92l28n05j28N48P60N35M91O48
63744B15980M15k37n40l6Q97J857K942M141M820M481L554K935K886K877K462J943
63728B51377J996K880M081M799M730M318M195M446M706M785M899N141N081M199
63714C11633K619J182N72M84j02j641l268l677k773j886k194l365m195m119l557
$$ plain form
63818 529235 506078 484860 465072 446661 429729 414396 400916 389450 379552 370375 361642 354024
63806 354024 348174 343792 340079 336777 334097 331806 329109 325589 321634 317674 313446 308373 302378 295987
63792 295987 289771 283928 278317 272684 266950 261429 256662 252888 249777 246829 243966 241495 239567 237908
63778 237908 236177 234331 232517 230756 228994 227382 226222 225545 225002 224376 223916 223862 223839 223187 221806 220216
63762 220216 218740 217254 215893 215305 215707 216249 215963 215004 214251 213959 213631 213126 212998 213546 214306 214841 215332 215980
63744 215980 216395 216158 215618 215582 216479 218336 221278 225419 230239 234720 238274 241209 244095 246972 249434 251377
63728 251377 253373 256253 260334 265133 269863 274181 278376 282822 287528 292313 297212 302353 307434 311633
63714 311633 314252 315434 316006 316490 316388 314747 311479 307802 305029 303143 300949 297584 293389 289270 285713
63699B85713k993k418j689q55kQ08J340J363J101J169J806K561K843K530J880
63684B95157J166N74K63K69M55O88R57J297J711K196K722L187L542L878M224M327
63668C26613L953L287K771K523K263J846J496J442J500J167pk025m231n652n917
63653C31029n671n719n956n720m933m176l658l002k199j863k073j862n69R49J393
63638B85970Q85Q08J872L268L916L795L597L607L495L103K887L414M620N888O769
63623C37894P410Q152R023R866J0734J1748J2686J3263J3782J4975J7059J9372
63611D85964K1186K2388K3175K3578K3681K3785K3952K3667K2442K0465J8224
63600G32507J5770J2768R131N170J289k142m737o329p161p593p831q161r077j0741
$$ plain form
63699 285713 282720 280302 278613 277758 277756 278564 279904 281267 282368 283537 285343 287904 290747 293277 295157
63684 295157 296323 296897 297160 297429 297884 298572 299529 300826 302537 304733 307455 310642 314184 318062 322286 326613
63668 326613 330566 333853 336624 339147 341410 343256 344752 346194 347694 348861 348854 346829 342598 336946 331029
63653 331029 325358 319639 313683 307963 303030 298854 295196 292194 289995 288132 286059 284197 283628 284577 285970
63638 285970 286855 287663 289535 292803 296719 300514 304111 307718 311213 314316 317203 320617 325237 331125 337894
63623 337894 345304 353456 362479 372345 383079 394827 407513 420776 434558 449533 466592 485964
63611 485964 507150 529538 552713 576291 599972 623757 647709 671376 693818 714283 732507
63600 732507 748277 761045 770176 775346 776635 774493 769756 763427 756266 748673 740842 732681 723604 712863
63586G12863j2625j4145j5327j6363j6869j6369j5252j4410j3937j3055j1420
63575E53091r648q245o797m787k568r42m3P00J762L133M571N782O429O395O098
63560E54931O199O968Q101R185J0081J0881J1720J2797J4339J6486J9128K2002
63548G02818K4819K7301K9174L0205L0297K9532K8073K5955K2979J8813J3338
63537I83304O927M47n141r235j1721j2744j2567j1669j0759j0410j0707j1471
63525H84254j2685j4406j6374j8140j9693k1410k3288k4626k4862k4256k3437
63514F61077k2599k1619k0550j9443j7986j5922j3691j2024j0953r898q685p774
63502D79933p294o687n608m524l931l528k786j902j579j992k542k633k205j578
$$ plain form
63586 712863 700238 686093 670766 654403 637534 621165 605913 591503 577566 564511 553091
63575 553091 543443 535198 528401 523614 521046 520104 520061 520761 522523 525656 530227 536009 542438 548833 554931
63560 554931 561130 568098 576199 585384 595465 606346 618066 630863 645202 661688 680816 702818
63548 702818 727637 754938 784112 814317 844614 874146 902219 928174 951153 969966 983304
63537 983304 990231 990678 985537 976302 964581 951837 939270 927601 916842 906432 895725 884254
63525 884254 871569 857163 840789 822649 802956 781546 758258 733632 708770 684514 661077
63514 661077 638478 616859 596309 576866 558880 542958 529267 517243 506290 496392 487707 479933
63502 479933 472639 465952 460344 455820 451889 448361 445575 443673 442094 440102 437560 434927 432722 431144
63488D31144j127j116j438j552j029j48M33N88R20J897L272M523N414N834N466
63473D53081M241K842K113J972J476J99j204k094k923m520o618p970p957p270
63459D25368o801o511n850m729l543k521j663j069q44o96j59Q89K262L874N628
63444D03635P067P779Q111Q878J0253J1749J3323J5686J9027K2265K4296K5356
63432E77425K6330K7167K6974K5508K3445K1057J7679J3026Q149M489K488J786
63420G75523K325M350P545J0949J3890J6403J8645K0403K1331K1227J9853J7021
63408I49465J3107R031N398J956j683n219p988r873j1369j2841j4216j5380j6439
63395H83949j7577j8960k0723k2707k4302k4980k4884k4414k3369k1214j8258
$$ plain form
63488 431144 430017 428901 427463 425911 424882 424734 425167 425755 426675 428572 431844 436367 441781 447615 453081
63473 453081 457322 460164 462277 464249 465725 465924 464720 462626 459703 455183 448565 440595 432638 425368
63459 425368 418567 412056 406206 401477 397934 395413 393750 392681 391837 391141 390982 391871 394133 398007 403635
63444 403635 410702 418481 426592 435470 445723 457472 470795 486481 505508 527773 552069 577425
63432 577425 603755 630922 657896 683404 706849 727906 745585 758611 766760 771249 773737 775523
63420 775523 777848 782198 789743 800692 814582 830985 849630 870033 891364 912591 932444 949465
63408 949465 962572 971603 977001 978957 977274 972055 964067 954194 942825 929984 915768 900388 883949
63395 883949 866372 847412 826689 803982 779680 754700 729816 705402 682033 660819 642561
63384F42561j5720j4286j3270j1681r603p868o767n788m397k525l41J910L836
63371E56061N174O198P483R207J0949J2246J3117J3970J5168J6720J8315J9714
63359G04322K1049K2605K4248K5493K6185K6685K7107K6916K5657K3646K1266
63348I75179J8102J3579Q198L238p32m141p177r229r954j0155j0920j2473j4296
63335I39219j6045j7716j9250k0469k1376k2067k2417k2174k1327k0127j8718
63324G17533j6953j4670j2039r514p486n932m517l092k051k035l380n935r257
63311F20672j2780j5837j7856j8618j8207j6867j5074j3467j2326j1279r897q446
63299D50018p524p113o623n828n140m788m468m023l849m202m658m637m135l533
$$ plain form
63384 642561 626841 612555 599285 587604 578001 570133 563366 557578 553181 550656 550315 552225 556061
63371 556061 561235 567433 574916 584123 595072 607318 620435 634405 649573 666293 684608 704322
63359 704322 725371 747976 772224 797717 823902 850587 877694 904610 930267 953913 975179
63348 975179 993281 1006860 1015058 1018296 1017564 1013423 1006246 997017 987063 976908 965988 953515 939219
63335 939219 923174 905458 886208 865739 844363 822296 799879 777705 756378 736251 717533
63324 717533 700580 685910 673871 664357 656871 650939 646422 643330 641279 639244 635864 629929 620672
63311 620672 607892 592055 574199 555581 537374 520507 505433 491966 479640 468361 458464 450018
63299 450018 442494 435381 428758 422930 417790 413002 408534 404511 400662 396460 391802 387165 383030 379497
63285C79497l048k683k381j940j177m08l15r42j405j076n66r01k047l051l341
63270C54216l199k981k635k082j507j097q93j000j544k329k869k882k457j722
63256C25019p16L56J113J395J416J453J575J708J764J661J448J400J746K346K883
63241C46567L333L851M284M287L989M027M697N548O117O636P532Q531Q925Q558
63227D26882Q053P958Q208Q517Q821R067R011Q646Q544R185J0144J0443R749Q689
63213E51917P896P300O527N453M046K190J22j448k208k878m284o148p590q562
63199E52333r728j0983j1235j0016q334p315o797n941m546k997j449J63J628K762
63185D77545L920N583P543R168J0277J1143J1813J2091J2120J2290J2579J2633
$$ plain form
63285 379497 376449 373766 371385 369445 368268 367860 367545 366603 365198 364122 363556 362655 360608 357557 354216
63270 354216 351017 348036 345401 343319 341812 340715 339822 338822 337278 334949 332080 329198 326741 325019
63256 325019 324303 324659 325772 327167 328583 330036 331611 333319 335083 336744 338192 339592 341338 343684 346567
63241 346567 349900 353751 358035 362322 366311 370338 375035 380583 386700 393336 400868 409399 418324 426882
63227 426882 434935 442893 451101 459618 468439 477506 486517 495163 503707 512892 523036 533479 543228 551917
63213 551917 559813 567113 573640 579093 583139 585329 585451 584003 581795 578917 574633 568485 560895 552333
63199 552333 542605 531622 520387 510371 502037 494722 487925 481984 477438 474441 472992 473155 474783 477545
63185 477545 481465 487048 494591 503759 514036 525179 536992 549083 561203 573493 586072 598705
63173E98705J2481J2592J3094J3516J3418J2783J1733J0317Q654O842M711K121
63161G20967n67k890n109p862j1007j3564j5113j6373j7998j9536k0148j9803
63149E70997j9148j8516j7722j6574j5093j3429j1879j0748r845q523o653n102
63137D17765m684m968m843l949k864j982j128k96O7j14j85L80J232J687J689J795
63121C99602K423L488M528M925M303L039K173K408L333L994M022L834L778L725
63107D49575L506L327L484L928M320M338L877L222K974L528M434M710L997L036
63093E02256K734L097L479L526L332K866J926O64l41p44p11n27l39m02j038k081
63077E17697k779k690k307k401l000l437l265k651j961j340p11M9J050K243L363
$$ plain form
63173 598705 611186 623778 636872 650388 663806 676589 688322 698639 707293 714135 718846 720967
63161 720967 720400 717510 712401 704539 693532 679968 664855 648482 630484 610948 590800 570997
63149 570997 551849 533333 515611 499037 483944 470515 458636 447888 438043 429520 422867 417765
63137 417765 413081 408113 403270 399321 396457 394475 393347 393051 393118 393004 392819 393199 394431 396118 397807 399602
63121 399602 402025 405513 410041 414966 419269 422308 424481 426889 430222 434216 438238 442072 445850 449575
63107 449575 453081 456408 459892 463820 468140 472478 476355 479577 482551 486079 490513 495223 499220 502256
63093 502256 504990 508087 511566 515092 518424 521290 523216 523880 523539 522795 522084 521557 521218 520816 519778 517697
63077 517697 514918 512228 509921 507520 504520 501083 497818 495167 493206 491866 491155 491204 492254 494497 497860
63062D97860M169M741N385O269P371Q693J0286J1970J3268J3830J3892J4206J5416
63049F27356J7485J9706K1401K2516K3471K4507K5437K5952K5909K5288K4238
63038H83266K3284K3044K3572K4203K4287K3761K2859K1652K0206J8724J7134
63027A125992J4816J1233O668J919k543o766j0859j4845j8775k2524k5587k7497
63015A031232k8344k8477k7922k6538k4565k2351j9762j6467j2847r777p374m681
63003H02127q84L647P817J0907J2941J4438J5999J7856J9639K0840K1510K2090
62991I68927K2556K2391K1521K0653K0325K0172J9511J8189J6452J4362J1802
62980A176861Q757N179Q66m150r330j4120j8454k2489k6133k9201l1778l3971
$$ plain form
63062 497860 502029 506770 512155 518424 525795 534488 544774 556744 570012 583842 597734 611940 627356
63049 627356 644841 664547 685948 708464 731935 756442 781879 807831 833740 859028 883266
63038 883266 906550 929594 953166 977369 1001656 1025417 1048276 1069928 1090134 1108858 1125992
63027 1125992 1140808 1152041 1158709 1160628 1158085 1151319 1140460 1125615 1106840 1084316 1058729 1031232
63015 1031232 1002888 974411 946489 919951 895386 873035 853273 836806 823959 814182 806808 802127
63003 802127 801243 804890 812707 823614 836555 850993 866992 884848 904487 925327 946837 968927
62991 968927 991483 1013874 1035395 1056048 1076373 1096545 1116056 1134245 1150697 1165059 1176861
62980 1176861 1185618 1190797 1191663 1187513 1178183 1164063 1145609 1123120 1096987 1067786 1036008 1002037
62968A002037l5487l5880l5173l3860l2379l0863k9287k7579k5585k3220k0676
62957F72048j8388j6772j6054j6069j6208j5779j4655j3354j2376j1736j1268
62946E09389j0996j0932j0832j0432r750q895p903o914o158n594m936m275m131
62933D07641m595m998m871m645m741m661l832k797k513k695k124n95O49P13J90
62918C66126L7J98O5m13q52j183j596j969j990j695j349r63l96J53K94J10J79
62901C54756Q34J767K524L089L691M255M409M044L663L868M628N237N133M480
62887D06378L824L301K611J658Q73O47P43N13l80j614k589l043l237l543l894
62872D02248l820l191k659k968l919m435l855k755k213k534l075l224l094l149
$$ plain form
62968 1002037 966550 930670 895497 861637 829258 798395 769108 741529 715944 692724 672048
62957 672048 653660 636888 620834 604765 588557 572778 558123 544769 532393 520657 509389
62946 509389 498393 487461 476629 466197 456447 447552 439649 432735 426577 420983 416047 411772 407641
62933 407641 403046 398048 393177 388532 383791 379130 375298 372501 369988 367293 365169 364574 365223 365936 366126
62918 366126 366163 366361 366426 366013 365161 363978 362382 360413 358423 356728 355379 354416 354020 354173 354467 354577 354756
62901 354756 355590 357357 359881 362970 366661 370916 375325 379369 383032 386900 391528 396765 401898 406378
62887 406378 410202 413503 416114 417772 418645 419292 420035 420548 420168 418554 415965 412922 409685 406142 402248
62872 402248 398428 395237 392578 389610 385691 381256 377401 374646 372433 369899 366824 363600 360506 357357
62858C57357l400l325k578j506q24p99j046j110r84q65p13l97r0j50n54q84q53
62841C37279n85k65O5K74P7n14r64o76L96J705K536K393J374K32k05O7K78N4K6
62822C43547Q50K016K340J512M79J76M97P56P02O86J092J837K461K584K367K395
62806C66297K941L449L202K395K037K646L643M253M461M625M682M440M235M594
62792D17900N335N828O099O861Q315R739J0679J1752J3689J6112J7997J9065K0004
62779E69375K1549K3921K7019L0382L3065L4280L4335L4320L4665L4658L3595
62768I11164L1656K9279K6300K2335J7562J2372O682K65o392j2367j7444k2208
62756I99204k6833l0535l2580l3317l3731l4257l4497l3920l2455l0450k8389
$$ plain form
62858 357357 353957 350632 348054 346548 345724 344925 343879 342769 341785 340920 340207 339810 339720 339570 339016 338132 337279
62841 337279 336694 336429 336494 336768 336845 336331 335367 334691 335087 336792 339328 341721 343095 343327 343122 343189 343467 343521 343547
62822 343547 344397 346413 348753 350265 350744 350920 351417 352173 352875 353561 354653 356490 358951 361535 363902 366297
62806 366297 369238 372687 375889 378284 380321 382967 386610 390863 395324 399949 404631 409071 413306 417900
62792 417900 423235 429063 435162 442023 450338 460077 470756 482508 496197 512309 530306 549371 569375
62779 569375 590924 614845 641864 672246 705311 739591 773926 808246 842911 877569 911164
62768 911164 942820 972099 998399 1020734 1038296 1050668 1057350 1057615 1051223 1038856 1021412 999204
62756 999204 972371 941836 909256 875939 842208 807951 773454 739534 707079 676629 648240
62745F48240k6596k5024k3292k1136j8805j6808j5368j4237j3071j1764j0370
62734D51769q920p431o067n148m885n070n069m290k744j120j39J50L48R42J736
62719D04062K133J969J830K450L851N308O191O674P478R016J0945J2575J3533
62706D88015J4046J4648J5762J7457J9569K1950K4555K7275K9858L2151L4317
62695G39603L6564L8681M0076M0431M0099L9733L9588L9282L8073L5298L0723
62684A158151K4731J8111J1470M834k119r504j6992k3997k9942l4506l7807m0274
62672A022156m2153m3246m3286m2480m1314l9885l7806l4916l1692k8824k6546
62661F10008k4583k2551k0227j7668j5245j3402j2200j1260j0302r464q852q128
$$ plain form
62745 648240 621644 596620 573328 552192 533387 516579 501211 486974 473903 462139 451769
62734 451769 442849 435418 429351 424203 419318 414248 409179 404889 402145 401025 400886 401036 401384 402326 404062
62719 404062 406195 408164 409994 412444 416295 421603 427794 434468 441946 450962 461907 474482 488015
62706 488015 502061 516709 532471 549928 569497 591447 616002 643277 673135 705286 739603
62695 739603 776167 814848 854924 895355 935454 975187 1014775 1054057 1092130 1127428 1158151
62684 1158151 1182882 1200993 1212463 1217297 1215178 1205674 1188682 1164685 1134743 1100237 1062430 1022156
62672 1022156 980003 936757 893471 850991 809677 769792 731986 697070 665378 636554 610008
62661 610008 585425 562874 542647 524979 509734 496332 484132 472872 462570 453106 444254 436126
62649D36126o987n819n357n679o037n747m829l726k796k271k253k454k213j170
62635C78788K26J092R70J72o06r39r90j266j944k488k233j347p48r69j532j686
62619C64500j377j075j006r55o79j05P04J496J853J580R75M74K61L92R79J883
62603C69900K635L127L955N527P141P759P528P708R103J1263J3300J4728J5433
62590D79107J5526J5515J5947J6636J6769J5952J4563J2885J0691P985N416L412
62578F30404J442j254m654q197j1515j4417j6501j7417j7331j6713j5840j4913
62566D93094j4241j3915j3568j2851j1876j0776r358p642o329o048o411o416n560
62553C68103m073k377j000n76j151j715j329n40o87j901k790k330j039P7P50J150
$$ plain form
62649 436126 429139 423320 417963 412284 406247 400500 395671 391945 389149 386878 384625 382171 379958 378788
62635 378788 379014 380106 381076 381248 380642 379703 378713 377447 375503 373015 370782 369435 368687 367718 366186 364500
62619 364500 363123 362048 361042 360087 359408 359303 360007 361503 363356 364936 365911 366385 366646 367038 368017 369900
62603 369900 372535 375662 379617 385144 392285 400044 407572 415280 424383 435646 448946 463674 479107
62590 479107 494633 510148 526095 542731 559500 575452 590015 602900 613591 621576 626992 630404
62578 630404 631846 630592 625938 617741 606226 591809 575308 557891 540560 523847 508007 493094
62566 493094 478853 464938 451370 438519 426643 415867 406509 398867 392538 386490 380079 373663 368103
62553 368103 364030 361653 360653 360077 358926 357211 355882 355342 354655 352754 349964 347634 346595 346672 347422 348572
62537C48572J128N47j29k93P6O31J347K355L309L578L134K784L296M600O027P159
62521C88121Q185R438J0831J1969J2744J3549J4756J6246J7690J9076K0591K2135
62509E65331K3325K4054K4549K4873K4641K3443K1342J8787J6158J3431J0267
62498G90201O455K334j375m288o695q918j0690j1607j1914j2193j2326j1528r485
62485F97971o937m769l019j083J384M039O144P099O887O130N504N025M127K408
62471G30910j4k873n979q975j1415j3349j5423j8011k0535k2027k2223k1778k1503
62458E46805k1570k1394k0233j7979j5416j3486j2333j1340j0001q453p034n837
62446C81729m806l921l081k193j443j113r86n01K74M68m33j679k142j657r62o13
$$ plain form
62537 348572 349700 350247 350118 349825 349901 350532 351879 354234 357543 361121 364255 367039 370335 374935 380962 388121
62521 388121 396306 405744 416575 428544 441288 454837 469593 485839 503529 522605 543196 565331
62509 565331 588656 612710 637259 662132 686773 710216 731558 750345 766503 779934 790201
62498 790201 796656 798990 797615 793327 786632 777714 767024 755417 743503 731310 718984 707456 697971
62485 697971 691034 686265 683246 682163 683547 687586 693730 700829 707716 713846 719350 724375 728502 730910
62471 730910 730896 728023 722044 713069 701654 688305 672882 654871 634336 612309 590086 568308 546805
62458 546805 525235 503841 483608 465629 450213 436727 424394 413054 403053 394600 387566 381729
62446 381729 376923 373002 369921 367728 366285 365172 364186 363685 363959 364427 363994 362315 360173 358516 357554 356941
62430C56941n60o64r59j371j682j825j858j641j049l85j81m65o92n50m33q05j434
62413C40387j639j131l39J23P0k93o84q98p78l43K2j35o57o25O55K663M033M020
62395C44451L236K795L084L641L952M015M153M486M743M592M149M060M839O218
62381D02414P380P866P969Q152Q478Q775R090R677J0600J1537J2048J2013J1887
62368E27886J2399J3846J5809J7771J9757K2005K4244K5969K7443K9636L2965
62357G69730L6681L9849M2374M4610M6518M7693M7895M7022M4879M1437L7060
62346A245748L2013K6011J8766J0797L093l828j0112j5873k0920k5223k9055l2488
62334A198929l5135l6628l7143l7155l6788l5728l3819l1580k9887k9066k8558
$$ plain form
62430 356941 356381 355717 354758 353387 351705 349880 348022 346381 345332 344947 344766 344301 343609 343059 342626 341821 340387
62413 340387 338748 337617 337278 337401 337471 337178 336494 335596 334818 334475 334497 334362 333705 333080 333735 336398 340431 344451
62395 344451 347687 350482 353566 357207 361159 365174 369327 373813 378556 383148 387297 391357 396196 402414
62381 402414 409794 417660 425629 433781 442259 451034 460124 469801 480401 491938 503986 515999 527886
62368 527886 540285 554131 569940 587711 607468 629473 653717 679686 707129 736765 769730
62357 769730 806411 846260 888634 933244 979762 1027455 1075350 1122372 1167251 1208688 1245748
62346 1245748 1277761 1303772 1322538 1333335 1336428 1332600 1322488 1306615 1285695 1260472 1231417 1198929
62334 1198929 1163794 1127166 1090023 1052868 1016080 980352 946533 914953 885066 856000 827442
62323H27442k7672k6401k5124k3821k2203k0561j9672j9608j9382j8191j6447
62312E88360j5050j4186j3402j2466j1504j0528r396q150o910n674m582m034m055
62299D68423l890k871j443o54q04j223j260p99J12J416K708L402L432L292L360
62284D73201L547L747L986M098L756L070K650K858L381L742L903M121M522N024
62270E25606N555O158P047Q547J0758J3329J5806J8172K0734K3470K5977K8182
62258G09341L0758L4491L9333M4215M7781M9404M9593M9330M8917M7584M4440
62247A195187L9473L3415K6808J9674J1874L424n463j4195k1864k7884l2569l6650
62235A191230m0336m3266m5215m6295m6480m5539m3568m1099l8551l5912l3061
$$ plain form
62323 827442 799770 773369 748245 724424 702221 681660 661988 642380 622998 604807 588360
62312 588360 573310 559124 545722 533256 521752 511224 501828 493678 486768 481094 476512 472478 468423
62299 468423 464533 461662 460219 459565 458761 457538 456278 455479 455591 457007 459715 463117 466549 469841 473201
62284 473201 476748 480495 484481 488579 492335 495405 498055 500913 504294 508036 511939 516060 520582 525606
62270 525606 531161 537319 544366 552913 563671 577000 592806 610978 631712 655182 681159 709341
62258 709341 740099 774590 813923 858138 905919 955323 1004916 1054246 1103163 1150747 1195187
62247 1195187 1234660 1268075 1294883 1314557 1326431 1329855 1324392 1310197 1288333 1260449 1227880 1191230
62235 1191230 1150894 1107628 1062413 1016118 969638 924099 880531 839432 800881 764969 731908
62224G31908l0045k6967k3992k1457j9614j8243j6859j5244j3504j1743j0113
62213E24127q975q447p947o843n510m968n398n777n138l606j903n01M40R12J169
62198D61635J624K371L193M079N233O529P569Q326R081R668R679R529J0282J1900
62184E60698J2832J2111J0877J0770J1540J1528J0098Q334P380P221P311P431
62172F78131P599P856Q510J0107J2769J5954J9086K2100K5133K8085L0703L2803
62160H98836L4085L4051L2437K9644K6373K2867J8714J3497P425J170m786j0404
62148A103909j5678k0321k4057k7060k9736l2116l3727l4138l3422l1943k9971
62137G91740k7601k4971k2286j9656j7016j4280j1670r679q514p560n837l144
$$ plain form
62224 731908 701863 674896 650904 629447 609833 591590 574731 559487 545983 534240 524127
62213 524127 515152 506705 498758 491915 486405 481437 476039 470262 465124 461518 459615 459114 459554 460466 461635
62198 461635 463259 465630 468823 472902 478135 484664 492233 500559 509640 519308 528987 538516 548798 560698
62184 560698 573530 585641 596518 607288 618828 630356 640454 648788 656168 663389 670700 678131
62172 678131 685730 693586 702096 712203 724972 740926 760012 782112 807245 835330 866033 898836
62160 898836 932921 966972 999409 1029053 1055426 1078293 1097007 1110504 1117929 1119099 1114313 1103909
62148 1103909 1088231 1067910 1043853 1016793 987057 954941 921214 887076 853654 821711 791740
62137 791740 764139 739168 716882 697226 680210 665930 654260 644581 636067 628507 622670 619526
62125F19526l45J701L077M309N517O618P971J0014J2461J4606J6253J7624J8567
62112G37899J8687J8204J7648J6729J4635J1600R046P765O994N858M641L958L591
62099H77255K969K096J141j39j803l112l453l330l501l683l052j649k62Q75K207
62084H62559L823N263O446P883R811J1874J3780J5630J7510J9289K0891K2248
62072A017007K3029K3051K2849K3206K4083K4708K4717K4449K4047K3132K1695
62061A275973K0465J9884J9278J7634J4804J1454Q073M616R42k861o642j0319
62049A373301j3750j6779j9463k2147k5074k7974l0264l1744l2919l4338l5764
62038A083085l6408l5944l4827l3560l2172l0685k9432k8422k6917k4313k1178
$$ plain form
62125 619526 619181 620882 623959 628268 633785 640403 648374 658388 670849 685455 701708 719332 737899
62112 737899 756586 774790 792438 809167 823802 835402 844448 852213 859207 865065 869706 873664 877255
62099 877255 880224 882320 883461 883322 881519 878407 874954 871624 868123 864440 861388 859739 859477 860352 862559
62084 862559 866382 871645 878091 885974 895785 907659 921439 937069 954579 973868 994759 1017007
62072 1017007 1040036 1063087 1085936 1109142 1133225 1157933 1182650 1207099 1231146 1254278 1275973
62061 1275973 1296438 1316322 1335600 1353234 1368038 1379492 1387565 1392181 1393123 1390262 1383620 1373301
62049 1373301 1359551 1342772 1323309 1301162 1276088 1248114 1217850 1186106 1153187 1118849 1083085
62038 1083085 1046677 1010733 975906 942346 910174 879489 850057 821635 794718 770405 749227
62027G49227j8711j7256j6000j4179j2009j0324r623r673r809r545r057q907r278
62014E94856r614r252q101o569n137m204l923l837l123j594K0J169K270L798N261
61999E52020N960O202O724P278O885N406L721K301O93j389l495n259o851q268
61985E71928r027r024q973r454j0170j0535j0464j0180r684q905p988p139o447
61972D53938n979n711n294m444l529l162l080k295o06Q86J214P29L79M63P46J154
61956D25409J719K263K800L791N353O679O996O777P228Q787J0850J2847J4839
61943E16338J6992J9174K1263K3364K5465K7280K8614K9712L0978L2441L3530
61932H05151L3484L2093L0082K8494K7551K6357K3952K0383J6473J2746R070N259
$$ plain form
62027 749227 730516 713260 697260 683081 671072 660748 651125 641452 631643 622098 613041 604134 594856
62014 594856 585242 575990 567889 561320 556183 551979 548056 544219 541096 539502 539522 540691 542961 546759 552020
61999 552020 557980 564182 570906 578184 585069 590475 594196 596497 597190 595801 592306 587047 580196 571928
61985 571928 562901 553877 544904 535450 525280 514745 504281 494101 484417 475512 467524 460385 453938
61972 453938 447959 442248 436954 432510 428981 425819 422739 420444 419838 420724 421938 422667 423046 423509 424255 425409
61956 425409 427128 429391 432191 435982 441335 448014 455010 461787 469015 477802 488652 501499 516338
61943 516338 533330 552504 573767 597131 622596 649876 678490 708202 739180 771621 805151
61932 805151 838635 870728 900810 929304 956855 983212 1007164 1027547 1044020 1056766 1065836 1071095
61920A071095J602j460l899o047p968r091q724o917m499k104N55M062Q222J2102
61906A046929J5055J7179J8718J9531J9295J7787J4937J0996O707K700j342o337
61894A182155j2353j8178k2624k5717k8170l0199l1406l1478l0593k9336k8366
61883H93735k7908k7406k6121k4208k2567k1491k0233j8296j6336j5116j4353
61872F59700j3319j2046j0988r983q433o320m160k186l09J408L010N192Q571J2551
61858F22688J5800J7925J9863K2565K6107L0224L4684L8919M2192M4591M7139
61847I62697N0359N3363N4856N4481N2662M9608M5246L9778L3669K7053J9778
61836A443550J2023M516j991p143j0891j3299j4458j4359j2753r407m594Q00N816
$$ plain form
61920 1071095 1072697 1071237 1067338 1061291 1053323 1044232 1035508 1028591 1024092 1021988 1022543 1026605 1034827 1046929
61906 1046929 1061984 1079163 1097881 1117412 1136707 1154494 1169431 1180427 1187134 1189834 1188492 1182155
61894 1182155 1169802 1151624 1129000 1103283 1075113 1044914 1013508 982030 951437 922101 893735
61883 893735 865827 838421 812300 788092 765525 744034 723801 705505 689169 674053 659700
61872 659700 646381 634335 623347 613364 604931 598611 594451 592265 591956 593364 596374 601566 610137 622688
61858 622688 638488 656413 676276 698841 724948 755172 789856 828775 870967 915558 962697
61847 962697 1013056 1066419 1121275 1175756 1228418 1278026 1323272 1363050 1396719 1423772 1443550
61836 1443550 1455573 1460089 1458098 1450955 1440064 1426765 1412307 1397948 1385195 1375788 1371194 1371994 1377810
61823A377810J0005J3390J5949J7253J6652J3732Q618J994n202j2283j9131k5966
61811A412821l2763l9094m4549m8978n2111n3418n2852n1330m9787m7932m4768
61800H95239m0350l6067l2937l0511k7904k5082k2476k0031j7492j5126j3363
61789F13900j2004j0605r353q729q496p844o548n174m125l215k347j899k153k804
61775E28604l285l214k540j563q51p23q47p21l57m4K54O61P38k7j136j452q02
61758E12695k27l23k96P11K207L027K879K383J954J428P28J36j23j31k3R9L3m41
61740E26716j261k018k301k009j408r56r41j166j081l36Q74J994K526K318J760
61725E22711J642K428L590M047L459K697K747L540M227M314M058L805L447K664
$$ plain form
61823 1377810 1387815 1401205 1417154 1434407 1451059 1464791 1473409 1475403 1470201 1457918 1438787 1412821
61811 1412821 1380058 1340964 1296415 1247437 1195326 1141908 1089056 1037726 987939 940007 895239
61800 895239 854889 818822 785885 755374 727470 702388 679912 659881 642389 627263 613900
61789 613900 601896 591291 581938 573209 564713 556869 550321 545147 541022 537807 535460 533561 531408 528604
61775 528604 525319 522105 519565 518002 517151 516428 515581 514860 514503 514459 514713 515374 516112 516085 514949 513497 512695
61758 512695 512468 512145 511849 512560 514767 517794 520673 523056 525010 526438 527166 527302 527179 527048 527025 527124 527157 526716
61740 526716 525455 523437 521136 519127 517719 516763 515822 514656 513575 513239 514113 516107 518633 520951 522711
61725 522711 524353 526781 530371 534418 537877 540574 543321 546861 551088 555402 559460 563265 566712 569376
61711E69376J463L17k36q6K72J05r74k723m454n490n583n086m589m240l658k661
61695E31753j746j415j336q17K9M02Q6j80J63P80J179J470J834J885J273M67K46
61678E36073O10Q69O69L17R7j56o83j433k162k652k778k528k021j409q33n12o47
61661E20821j105j411j286r34o65m78l06k75l73j68P22K058L288M198M831N006
61645E33923M449L350K340J892K049K597L132L123K348J254M50j21j007k327l521
61630E53931m098m185m190m295m455m586m611m512m310l863k842j292PL02q0p0
61614E06851O46J162O37n95j673k377l116m075m987n653o140o450o419o036n583
61599D56192n264m940m332l415k522k069k172k615l139l717m391m977n115m643
$$ plain form
61711 569376 570839 571156 570920 570834 571106 571211 570237 567514 563060 557570 551987 546901 542312 538072 534414 531753
61695 531753 530007 528592 527256 526439 526468 526870 526956 526776 526939 527719 528898 530368 532202 534087 535360 535827 536073
61678 536073 536683 537552 538221 538538 538635 538479 537796 536363 534201 531549 528771 526243 524222 522813 521980 521468 520821
61661 520821 519716 518305 517019 516085 515420 514942 514636 514361 513988 513820 514542 516600 519888 524086 528917 533923
61645 533923 538372 541722 544062 545954 548003 550600 553732 556855 559203 560457 560907 560786 559779 557452 553931
61630 553931 549833 545648 541458 537163 532708 528122 523511 518999 514689 510826 507984 506692 506699 507001 506921 506851
61614 506851 507497 508659 509296 508701 507028 504651 501535 497460 492473 486820 480680 474230 467811 461775 456192
61599 456192 450928 445988 441656 438241 435719 433650 431478 428863 425724 422007 417616 412639 407524 402881
61585D02881l748k748j942j591j752k080k072j669j366j549j982k109j706j083
61571C75484p58j054j820k518k718k565k492k489k057j073k21j84p96j340j476
61556C51923j317r36l32J71J51k54m54l06l22p14q69k36O54P36j17q16m31O79
61538C47210J447J507J501J988K629K720K265J982K260K606K365J609Q94L43m86
61523C72840j777l017l569l422l059k856k856k983l088k882k152j114l66l10p82
61508C38607j313j599j601j310p27m7L48K61j37n39q70j161j196o52L03R10N98
61491C29875l06r97j143j016p79k68M03O17R6m56j78P33J226Q28K30K75Q68J237
61473C31245R46K61k89m42l31k93m81o06k40N18J015Q41L57J66L35N40P22J014
$$ plain form
61585 402881 399133 396385 394443 392852 391100 389020 386948 385279 383913 382364 380382 378273 376567 375484
61571 375484 374726 373672 371852 369334 366616 364051 361559 359070 357013 355940 355719 355535 354739 353399 351923
61556 351923 350606 349670 349338 349509 349660 349406 348952 348646 348324 347610 346741 346505 347159 347895 347778 346962 346531 347210
61538 347210 348657 350164 351665 353653 356282 359002 361267 363249 365509 368115 370480 372089 372983 373326 372840
61523 372840 371063 368046 364477 361055 357996 355140 352284 349301 346213 343331 341179 340065 339699 339389 338607
61508 338607 337294 335695 334094 332784 332057 332010 332358 332619 332482 331943 331073 329912 328716 328064 328367 329277 329875
61491 329875 329569 328572 327429 326413 325634 325366 325769 326386 326482 326026 325848 326581 327807 328635 328865 329140 330008 331245
61473 331245 332191 332452 332163 331721 331390 331097 330616 330010 329770 330288 331303 332144 332501 332667 333002 333542 334264 335278
61455C35278J190Q40J33j69K86R32J031N39j28o93j027q46K7J233K148K535K605
61438C45914K557K443K432K739L316L928M500N022N158M525L411K648K545K528
61424C93666K135J784K025K575K750K537K487K664K527J908J394J450J765J777
61410D23444J292L37j114k771l825l762l169l170m073n069n263m612l710l085
61396C81450k815k634k251j672j230j167j236r57k55M03N22O6n58q17m29L42Q34
61379C67596O54J28j41m8J38M31J110J974K334K015J685J866K179K108J957K309
61363C88295K892K863K120J557J842K621L242L695M386N317O043O319O401O669
61349D44262P194P916Q960J0484J2198J3328J3408J2889J2559J2425J1660R873
$$ plain form
61455 335278 336468 337308 337441 337272 337558 338490 339521 340060 339932 339239 338212 337366 337393 338626 340774 343309 345914
61438 345914 348471 350914 353346 356085 359401 363329 367829 372851 378009 382534 385945 388593 391138 393666
61424 393666 395801 397585 399610 402185 404935 407472 409959 412623 415150 417058 418452 419902 421667 423444
61410 423444 424736 425073 423959 421188 417363 413601 410432 407262 403189 398120 392857 388245 384535 381450
61396 381450 378635 376001 373750 372078 370848 369681 368445 367488 367233 367636 368158 368224 367666 366849 366420 366762 367596
61379 367596 368250 368378 368237 368189 368327 368758 369868 371842 374176 376191 377876 379742 381921 384029 385986 388295
61363 388295 391187 394050 396170 397727 399569 402190 405432 409127 413513 418830 424873 431192 437593 444262
61349 444262 451456 459372 468332 478816 491014 504342 517750 530639 543198 555623 567283 577156
61337E77156P824O451N670M639K956J004p64k234l351m010m396m923n639o117
61323E74266o078n775n576n485n290m946m584m282m007l613k934k016j212p81
61309E17687l99M88J850L011L522L659L938M474N045N408N370M865M140L540K964
61294E69562J965M81r81k167l433m949o091o239n757n428n259m631l508k649k434
61279E18482k236j274M03K168L618M755N589O069O331O664P131P479P558P645
61265E80382Q136Q988R685R875R833J0129J0954J2046J3181J4379J5559J6342
61253G19489J6342J5557J4288J2835J1256R380P000M252J568r37l804p433j1061
61240G88732j3234j3460j2725j2178j1974j1713j1291j0762r915q665p417o527
$$ plain form
61337 577156 584980 591431 597101 601740 604696 605700 604936 602702 599351 595341 590945 586022 580383 574266
61323 574266 568188 562413 556837 551352 546062 541116 536532 532250 528243 524630 521696 519680 518468 517687
61309 517687 517288 517776 519626 522637 526159 529818 533756 538230 543275 548683 554053 558918 563058 566598 569562
61294 569562 571527 572008 571027 568860 565427 560478 554387 548148 542391 536963 531704 527073 523565 520916 518482
61279 518482 516246 514972 515375 517543 521161 525916 531505 537574 543905 550569 557700 565179 572737 580382
61265 580382 588518 597506 607191 617066 626899 637028 647982 660028 673209 687588 703147 719489
61253 719489 735831 751388 765676 778511 789767 799147 806147 810399 811967 811030 807226 799793 788732
61240 788732 775498 762038 749313 737135 725161 713448 702157 691395 681480 672815 665398 658871
61228F58871n751m805l968l483k890j798q43q35j234o89R13K110J911J076Q34
61213F39419J264J580J393R56N70L53L70N28N48L64L46Q34J685K560L368M273
61197F60411N415O902Q795J0899J2827J4454J6055J7779J9325K0314K0653K0336
61185H34165J9267J7570J5738J4126J2596J0914R199P755O715O121N917N627M493
61172I70203K365M0j730l129m697o352p705q926j0507j2257j3481j4100j4763
61159H74961j5677j6214j5978j5462j5206j4979j4340j3439j2620j1628r912p551
61147G11955n208l276j654l30L96M44J30l65j264k636l977m725m993n336n936
61132F73225o323n926m656k865r79Q29K704M796O834Q244Q989J0036J2439J5975
$$ plain form
61228 658871 653120 648315 644347 640864 637974 636176 635333 634498 633264 632575 633488 635598 637509 638585 639419
61213 639419 640683 642263 643656 644612 645182 645535 645905 646433 646981 647345 647691 648525 650210 652770 656138 660411
61197 660411 665826 672728 681523 692422 705249 719703 735758 753537 772862 793176 813829 834165
61185 834165 853432 871002 886740 900866 913462 924376 933575 941330 948045 954166 960083 965710 970203
61172 970203 972568 972608 970878 967749 963052 956700 948995 940069 929562 917305 903824 889724 874961
61159 874961 859284 843070 827092 811630 796424 781445 767105 753666 741046 729418 719506 711955
61147 711955 706747 703471 701817 701487 701883 702327 702457 702092 700828 698192 694215 689490 684497 679161 673225
61132 673225 666902 660976 656320 653455 652476 653305 656009 660805 667639 675883 684872 694908 707347 723322
61118G23322J9213K1145K2210K3424K5020K6360K6877K6559K5742K4907K4539
61107I89318K4633K4454K3276K1283J9221J7284J5005J2299R828P974O071L215
61095A173861o24m747q691j2490j6133j9323k1826k3669k4919k5554k5610k5332
61083I64943k5024k4833k4650k4177k3194k1735k0020j8181j6222j4237j2408
61072G40262j0728r032p362o031n135m291l163k022j384j265j053j88J266K746
61058F92620L725M103M235M602N483O879Q629J0426J1860J2739J3449J4672J6590
61045H10012J8639K0212K1392K2806K4864K7376K9726L1325L2032L2276L2632
61034A103292L3247L3861L4346L4963L5937L7232L8804M0720M2811M4599M5869
$$ plain form
61118 723322 742535 763680 785890 809314 834334 860694 887571 914130 939872 964779 989318
61107 989318 1013951 1038405 1061681 1082964 1102185 1119469 1134474 1146773 1156601 1164575 1170646 1173861
61095 1173861 1173237 1168490 1159799 1147309 1131176 1111853 1090027 1066358 1041439 1015885 990275 964943
61083 964943 939919 915086 890436 866259 843065 821330 801310 783129 766907 752670 740262
61072 740262 729534 720502 713140 707109 701974 697683 694520 692498 691114 689849 688796 688608 689874 692620
61058 692620 696345 700448 704683 709285 714768 721647 730276 740702 752562 765301 778750 793422 810012
61045 810012 828651 848863 870255 893061 917925 945301 975027 1006352 1038384 1070660 1103292
61034 1103292 1136539 1170400 1204746 1239709 1275646 1312878 1351682 1392402 1435213 1479812 1525681
61023A525681M7025M8578N0602N2927N5609N8874O2902O7950P4437Q2688R2835
61012B220108J05168J20281J38807J61535J89904K25600K69416L21436L82803
61003D135058M56309N44584O48889P70749R13263J079055J267559J475123J693704
60994A2984293J903274K066274K139808K103312J974234J789941J572504J316718
60986B7850358J015739O91787L91781J50682l4988j95023l54065n19960o99956
60977B8296355r14696j184555j501082j816837k066449k199668k200966k088289
60969A4323813j899465j676054j450442j240234j051085q83499p37331o12300
60961D773403n07322m20679l50423k94321k49871k14592j86258j63075j43988
$$ plain form
61023 1525681 1572706 1621284 1671886 1724813 1780422 1839296 1902198 1970148 2044585 2127273 2220108
61012 2220108 2325276 2445557 2584364 2745899 2935803 3161403 3430819 3752255 4135058
61003 4135058 4591367 5135951 5784840 6555589 7468852 8547907 9815466 11290589 12984293
60994 12984293 14887567 16953841 19093649 21196961 23171195 24961136 26533640 27850358
60986 27850358 28866097 29557884 29949665 30100347 30065359 29870336 29516271 28996311 28296355
60977 28296355 27381659 26197104 24696022 22879185 20812736 18613068 16412102 14323813
60969 14323813 12424348 10748294 9297852 8057618 7006533 6123034 5385703 4773403
60961 4773403 4266081 3845402 3494979 3200658 2950787 2736195 2549937 2386862 2242874
60952B242874j28489j15713j04112r2631q1845p3131o6792o1797n7374n3913n1894
60941A355183n0791m9609m8126m6843m5917m4766m2857m0381l7928l5764l3758
60930H78443l1836l0078k8355k6291k3896k1831k0663j9984j8821j6827j4632
60919F25229j2952j1891j1202j0667j0017q953p599o531o026n633m791l457j908
60906E23602m12O21P60K58P6N99R78M43l96m89j09m60j723k725k714k294k266
60889E13749k499k524k375k269k060j635j320j387j579j583j626k008k458k473
60875D85953k064j721j820k425l437m477m917m474l637l079k854k583k149j676
60861D44640j096l63O0l27j067j030J36J514K217K449K837L254L044K150J290
$$ plain form
60952 2242874 2114385 1998672 1894560 1801929 1720084 1646953 1580161 1518364 1460990 1407077 1355183
60941 1355183 1304392 1254783 1206657 1159814 1113897 1069131 1026274 985893 947965 912201 878443
60930 878443 846607 816529 788174 761883 737987 716156 695493 675509 656688 639861 625229
60919 625229 612277 600386 589184 578517 568500 559547 551948 545417 539391 533758 528967 525510 523602
60906 523602 523190 523811 524571 524829 524905 525504 526482 526925 526529 526040 525931 525471 523748 521023 518309 516015 513749
60889 513749 511250 508726 506351 504082 502022 500387 499067 497680 496101 494518 492892 490884 488426 485953
60875 485953 483889 482168 480348 477923 474486 470009 465092 460618 456981 453902 451048 448465 446316 444640
60861 444640 443544 443181 443241 442914 441847 440817 440953 442467 444684 447133 449970 453224 456268 458418 459708
60846D59708J053J345J802K229K486K356J805J080M28q4l66k53J61M45L11m3l68
60829D74095p70j390j923j955j594j237q21R1J372K115J671L99q07j433j503j333
60813D64977j359j893k684l112l072l205l854m360l962l007k476k635k937l111
60799D23310l455l959m040l430k695k495k841l343l742l832l379k471j670j390
60785C80568j345r73j89N21P41N94N84J044J690J857J295N59L41O11R35J316K102
60768C92251L144L829M043M298M754M903M610M566N211N924N946N525N349N399
60754D59752N101M340L531K932K496K205J999J622J083Q94J229J260K68j032j308
60739D86372o79p17k198l986m689m456m360m761n150n226n273n474n565n300m873
$$ plain form
60846 459708 460761 462106 463908 466137 468623 470979 472784 473864 474292 474208 473842 473589 473750 474195 474506 474463 474095
60829 474095 473325 471935 470012 468057 466463 465226 464405 464496 465868 467983 469654 470053 469246 467813 466310 464977
60813 464977 463618 461725 459041 455929 452857 449652 445798 441438 437476 434469 431993 429358 426421 423310
60799 423310 419855 415896 411856 408426 405731 403236 400395 397052 393310 389478 386099 383628 381958 380568
60785 380568 379223 378250 378061 378582 379323 379917 380501 381545 383235 385092 386387 386946 387287 387898 388833 390149 392251
60768 392251 395395 399224 403267 407565 412319 417222 421832 426398 431609 437533 443479 449004 454353 459752
60754 459752 464853 469193 472724 475656 478152 480357 482356 483978 485061 485955 487184 488444 488712 487680 486372
60739 486372 485693 484976 482778 478792 474103 469647 465287 460526 455376 450150 444877 439403 433838 428538 423665
60724D23665m559m258l625k700k084k291l002l307k793j990j530j290p77j0N79
60709C90028R66J547K358K909K939K775K741K704K440K092J995K305K973L818
60695D24590M594N128N427N447M955L967L132L105L666L986L725L187K494J452
60681D78855L72N7O13J108R19O68J226K429L445L939M144M200M088M036M314M821
60665E19234N336N954O745P368P556P672Q132Q583Q424P916Q014R029J0238J0927
60651F31128J1118J1090J0798J0152R359Q648P886O752N153L363J756N04o34k087
60637G14986l926n621o630o995p117p119o825o293n915n953o315o757p022o857
60623F25641o262n633n302n048m461l693l279l342l497l591l888m377m530m092
$$ plain form
60724 423665 419106 414848 411223 408523 406439 404148 401146 397839 395046 393056 391526 390236 389459 389449 390028
60709 390028 390994 392541 394899 397808 400747 403522 406263 408967 411407 413499 415494 417799 420772 424590
60695 424590 429184 434312 439739 445186 450141 454108 457240 460345 464011 467997 471722 474909 477403 478855
60681 478855 479227 479284 479897 481005 481924 482592 483818 486247 489692 493631 497775 501975 506063 510099 514413 519234
60665 519234 524570 530524 537269 544637 552193 559865 567997 576580 585004 592920 600934 609963 620201 631128
60651 631128 642246 653336 664134 674286 683645 692293 700179 706931 712084 715447 717203 717707 717073 714986
60637 714986 711060 705439 698809 691814 684697 677578 670753 664460 658545 652592 646277 639520 632498 625641
60623 625641 619379 613746 608444 603396 598935 595242 591963 588621 585124 581533 577645 573268 568738 564646
60609E64646l615l793m599n392n677n456n025m682m629m941n630o601p434p490
60595D89682o587n448m942m983m730l873l051k829k910k703k038j029K33J337
60581D46129J545O83l56o24k80r6j47K54J417K853M054N002N771O266O700P763
60565D86934R827J2279J4038J4677J4692J4708J4715J4175J2649J0202P216M073
60553F30185J068j483l341m522n197n418n125m422l546k407n51K212N335Q085
60539F10873J0327J2467J4686J6680J8077J8671J8244J6626J4115J1456R014O343
60527G77579K883j062m442o579p727q424q683q172o996n786n002m419l594k502
60513G07074j532r07m44J90J189K580M223N829P145Q179R144J0347J2234J5409
$$ plain form
60609 564646 561031 557238 552639 547247 541570 536114 531089 526407 521778 516837 511207 504606 497172 489682
60595 489682 483095 477647 472705 467722 462992 459119 456068 453239 450329 447626 445588 444559 444792 446129
60581 446129 447674 448357 448001 447377 447097 447001 446854 447108 448525 451378 455432 460434 466205 472471 479171 486934
60565 486934 496761 509040 523078 537755 552447 567155 581870 596045 608694 618896 626112 630185
60553 630185 631253 629770 626429 621907 616710 611292 606167 601745 598199 595792 595241 597453 602788 610873
60539 610873 621200 633667 648353 665033 683110 701781 720025 736651 750766 762222 771236 777579
60527 777579 780462 779400 774958 768379 760652 752228 743545 735373 728377 722591 717589 713170 709576 707074
60513 707074 705542 704635 704191 704381 705570 708150 712373 718202 725347 733526 742670 753017 765251 780660
60499G80660K0075K5477L0444L4687L9159M4747N0951N6309N9932O2019O2824
60488A267284O1793N8153N2046M4434L5745K5201J1970l239j8379l1943m3955
60477A459110n4754o3647o9477p2132p2448p0812o6953o1300n5403n0394m5916
60466G75874m1178l6313l1906k7871k3788j9986j7201j5373j3698j1891j0465
60455E26204r651q942q011p228o887o586n852m931m400m349m390m227l789l056
60441D43905k144j460j369j681j788j356p37n45r14j298j101m34l2k94p85r58
60425D27009r86j392k022k164j654j249j630k544l231l190k293o58J156K293K397
60410D09842J996J750J673J492J328J461J670J516J036O22L03j70n99m60J70N41
$$ plain form
60499 780660 800735 826212 856656 891343 930502 975249 1026200 1082509 1142441 1204460 1267284
60488 1267284 1329077 1387230 1439276 1483710 1519455 1544656 1556626 1553387 1535008 1503065 1459110
60477 1459110 1404356 1340709 1271232 1199100 1126652 1055840 988887 927587 872184 821790 775874
60466 775874 734696 698383 666477 638606 614818 594832 577631 562258 548560 536669 526204
60455 526204 516553 507611 499600 492372 485485 478899 473047 468116 463716 459367 454977 450750 446961 443905
60441 443905 441761 440301 438932 437251 435463 434107 433370 432825 431911 430613 429512 429078 429046 428752 427967 427009
60425 427009 426023 424631 422609 420445 418791 417542 415912 413368 410137 406947 404654 403996 405152 407445 409842
60410 409842 411838 413588 415261 416753 418081 419542 421212 422728 423764 424386 424689 424519 423920 423460 423630 424171
60394D24171K92m8M4K66J30j04K72J341K375K742K464J930J414J032Q52Q55R05
60377D40933Q71P23N12L74N22J048J669J900J546R49O03O43P93P52M68Q7k17k59
60359D53917J14Q61J621J893J444N71j16k36O8K84O3l78l76N45K052L188L318
60342D68833K887K910L686M357L995K836K000K108K645K783K304J451L29j106
60328E02018k551l411l464l111k900k954l025k851k288j311p1J071J790K063K171
60313D81176K450L135M306N831P399Q763J0009J1444J3184J5007J6732J8555K0801
60300F18792K3288K5245K5966K5365K3696K0908J6618J0771L999k794r034j4523
60288G68297j9093k2452k4319k4604k3490k1435j8916j6145j3176j0371q382p486
$$ plain form
60394 424171 424463 424415 424459 424725 424855 424751 425023 426364 428739 431481 433945 435875 437289 438321 439173 440028 440933
60377 440933 441804 442527 443039 443413 443935 444983 446652 448552 450098 451047 451650 452293 453086 453838 454306 454393 454176 453917
60359 453917 454031 454892 456513 458406 459850 460421 460305 460069 460137 460421 460484 460106 459730 460275 462327 465515 468833
60342 468833 471720 474630 478316 482673 486668 489504 491504 493612 496257 499040 501344 502795 503124 502018
60328 502018 499467 496056 492592 489481 486581 483627 480602 477751 475463 474152 474081 475152 476942 479005 481176
60313 481176 483626 486761 491067 496898 504297 513060 523069 534513 547697 562704 579436 597991 618792
60300 618792 642080 667325 693291 718656 742352 763260 779878 790649 794648 791854 782820 768297
60288 768297 749204 726752 702433 677829 654339 632904 613988 597843 584667 574296 565914 558428
60276E58428p205o923o604o482o359n762m823m284m517n021n098m616l904l210
60262D83620k657k377k378k423k263j929j625j465j420j351j054m26L17P32N76
60247D63877l3q40j573j905j626r02q1P23J476J825J403N55O4Q5M3j71J82J397
60229D64499K555K792K663L310M639N367M790L564K758K703K978L010K609K137
60215E10374K114K451K438J767J089J050J322J291J212J721K592K988K755K445
60201E37609K220J829J586K156L139L210K004P64N44Q27O09j20p83j302j896k340
60185E50056k313k032j878j754j459j243j330j339q33j34J54K5j89n62j206j507
60169E32456p87M20P84J4n92J56J844L062L046K233J567J544J891J925J319N76
$$ plain form
60276 558428 551223 544300 537696 531214 524855 519093 514270 509986 505469 500448 495350 490734 486830 483620
60262 483620 480963 478586 476208 473785 471522 469593 467968 466503 465083 463732 462678 462252 462569 463301 463877
60247 463877 463844 463004 461431 459526 457900 456998 456917 457640 459116 460941 462344 462899 462963 463048 463091 462920 463102 464499
60229 464499 467054 469846 472509 475819 480458 485825 490615 494179 496937 499640 502618 505628 508237 510374
60215 510374 512488 514939 517377 519144 520233 521283 522605 523896 525108 526829 529421 532409 535164 537609
60201 537609 539829 541658 543244 545400 548539 551749 553753 554517 555061 555888 556497 556377 555594 554292 552396 550056
60185 550056 547743 545711 543833 542079 540620 539377 538047 536708 535875 535741 535895 535920 535731 535169 533963 532456
60169 532456 531669 532089 532873 532887 532295 532451 534295 537357 540403 542636 544203 545747 547638 549563 550882 551458
60153E51458M87J181J934J989J312M83J22M85J394K355K917L062L180L650M456
60138E80465N264N737N875O002O442P107P542P380O639N463L891K050L21j026
60124F49152k240l746n419o530o507n575m489l772l292k579j483m39l4l18p20
60109F02009o85k38J20m1o41j157j120o46l34m69o22l03K05K05l75q98r23n80
60091E93507NR33J985K609K762L089L914M730N118N403N844N932N228M238L595
60076F48892K843J113j372l418m371m599m597m527m687n517o839p767p665o729
60062E90760n604m845m804n468o232o297n402l906k324j206j127k116l172l126
60048E35131k023r85o94p68p41p38q98q70l80K91Q46J495K469L347L397K407Q97
$$ plain form
60153 551458 551945 553126 555060 557049 558361 558844 558966 559451 560845 563200 566117 569179 572359 576009 580465
60138 580465 585729 591466 597341 603343 609785 616892 624434 631814 638453 643916 647807 649857 650178 649152
60124 649152 646912 643166 637747 631217 624710 619135 614646 610874 607582 605003 603520 603081 603047 602729 602009
60109 602009 601324 601086 601206 601165 600524 599367 598247 597601 597267 596798 596176 595873 596078 596283 595908 595010 594087 593507
60091 593507 593512 594445 596430 599039 601801 604890 608804 613534 618652 624055 629899 635831 641059 645297 648892
60076 648892 651735 652848 651476 648058 643687 639088 634491 629964 625277 619760 612921 605154 597489 590760
60062 590760 585156 580311 575507 570039 563807 557510 552108 548202 545878 544672 543545 541429 538257 535131
60048 535131 533108 532123 531429 530661 529920 529182 528284 527414 527034 527325 528171 529666 532135 535482 538879 541286 542183
60031E42183m26j201j529j709j865j901j879k135k752l264l345l441m109n004
60017E07623n337n138n138n436n308m493l699l463l395k955k283j757j414j181
60003D56626j111j002m86K05L02k64n64p5M68L61J55P00J674K161K212K674L656
59986D67692M251L878L003K440K517L014L425L221K352J454J116J092O97j31p59
59971D99262p79m63k69l33n74q50r05n45R4O04O43J36o61j176q74J25J117J608
59953D96160J742J633R42l93j585j891j661j753k184k276j876j572j683j906k054
59938D79643k358k834l039k696k031j386r65r90j481j781j069N12J839K156J854
59923D65374J656J712J783J762J614J275J010J366K389L285L273K522J825J666
$$ plain form
60031 542183 541757 540556 539027 537318 535453 533552 531673 529538 526786 523522 520177 516736 512627 507623
60017 507623 502286 497148 492010 486574 481266 476773 473074 469611 466216 463261 460978 459221 457807 456626
60003 456626 455515 454513 454027 454232 454534 454270 453706 453631 454099 454460 454615 455315 456989 459150 461362 464036 467692
59986 467692 471943 475821 478824 481264 483781 486795 490220 493441 495793 497247 498363 499455 500152 500021 499262
59971 499262 498483 498020 497751 497418 496844 495994 495089 494544 494638 495242 495885 496021 495360 494184 493310 493435 494552 496160
59953 496160 497902 499535 500477 500084 498499 496608 494947 493194 491010 488734 486858 485286 483603 481697 479643
59938 479643 477285 474451 471412 468716 466685 465299 464334 463344 461863 460082 459013 459525 461364 463520 465374
59923 465374 467030 468742 470525 472287 473901 475176 476186 477552 479941 483226 486499 489021 490846 492512
59909D92512J944K346K638K692K539K237J695Q48L8k21M8L17L93O14J014J084
59893E12738P36P89J734K739K768K227K426L575M509M543M451N152O261O727O306
59878E67681N696N405N225M777M090L437K948K470J740O71m30j088j277j629k697
59863E97019m112m927m772m169l630l008k148j624k143l350l970l213j525J46
59849E54574J308K033K669L702N409P298Q396Q399Q050P974P765O813N464M493
59835F34347L807K704J211J24l55r69k126l282m051m960o511q202r298r944j0684
59820E81811j1316j1114j0055q962q400q078p467o492n470m755m531m613m414
59807D86144l473k102j195j260j892k283k057j534j266j408j559j314r38j098
$$ plain form
59909 492512 494456 496802 499440 502132 504671 506908 508603 509451 509489 509268 509316 509633 510026 510640 511654 512738
59893 512738 513474 514263 515997 518736 521504 523731 526157 529732 534241 538784 543235 548387 554648 561375 567681
59878 567681 573377 578782 584007 588784 592874 596311 599259 601729 603469 604140 603710 602622 601345 599716 597019
59863 597019 592907 587980 583208 579039 575409 572401 570253 568629 566486 563136 559166 555953 554428 554574
59849 554574 555882 557915 560584 564286 569695 576993 585389 593788 601838 609812 617577 624390 629854 634347
59835 634347 638154 640858 642069 642193 641838 640869 638743 635461 631410 626450 619939 611737 602439 592495 581811
59820 581811 570495 559381 549326 540364 531964 523886 516419 509927 504457 499702 495171 490558 486144
59807 486144 482671 480569 479374 478114 476222 473939 471882 470348 469082 467674 466115 464801 463863 462765
59793D62765j784k092j476p67j137k355k937k122p42P1K41K95L09M9k74k24M6
59776D47866o5o25r15m10N15J121J216J212J436J723J696J284P76M43K78J66K19
59759D57936O51J392K082K529K885L168K972K044R50O88J602K972L792L692L085
59744D92440K688K944L642M032L570K558J769J410R47P2o38m84L41R75R55N79
59728E17800K60M0k13m47n02l02N8K62j30j230k476l010k520j470n36LK35L74
59710E06196O38J168J858K437K783L004L176L273L365L579L767L557K912K368
59696E44081K429K924L205K848J993J072M22L5l61r03j299j233r99j299k186k733
59680E47996k170r34j46k86q46j189j222j283j674k363k935k924k410k073k384
$$ plain form
59793 462765 460981 458889 457413 456646 455509 453154 450217 448095 447353 447424 447665 447960 448269 448318 448044 447820 447866
59776 447866 447801 447176 446261 445851 446366 447487 448703 449915 451351 453074 454770 456054 456830 457273 457551 457717 457936
59759 457936 458587 459979 462061 464590 467475 470643 473615 475659 476609 477297 478899 481871 485663 489355 492440
59744 492440 495128 498072 501714 505746 509316 511874 513643 515053 516000 516072 515434 514950 515291 516266 517221 517800
59728 517800 518060 518100 517887 517440 516938 516636 516694 516956 516826 515596 513120 510110 507590 506120 505584 505587 505822 506196
59710 506196 506834 508002 509860 512297 515080 518084 521260 524533 527898 531477 535244 538801 541713 544081
59696 544081 546510 549434 552639 555487 557480 558552 558974 559009 558648 557745 556446 555213 554214 552915 550729 547996
59680 547996 545826 544892 544746 544460 543614 542425 541203 539920 538246 535883 532948 530024 527614 525541 523157
59665E23157l003l270l019k544k023j497j119r15m72M71J338J335O79M34J056
59650E10608J839J988J502P75K8n56p66q05j192j915k301k094j970k509l308l649
59634D95675l495l077k211q57J97K02k57k4P52P36n26j783j879j247r01p62r0
59617D80453R40J139n5j704k451j969j004l61k56m87p52p01m1J058J795J383P
59600D76994j202j305n01K91N55M66K59j58q04j264j061k14P94J450J513J082
59584D76895N15J86J14n4o05j402k147k748l209l374l124k722k561k581k344j772
59568D49067j388j552j892j757j123n77n22p57q15m08M10J275J634J204M30J43
59552D43372O39J356J652J611J828K623L745M731N319N532N608N811O248O960
$$ plain form
59665 523157 520154 516884 513865 511321 509298 507801 506682 505767 505295 505766 507104 508439 509118 509552 510608
59650 510608 512447 514435 515937 516712 516740 516184 515418 514613 513421 511506 509205 507111 505141 502632 499324 495675
59634 495675 492180 489103 486892 486035 486232 486434 486177 486153 486905 487641 487115 485332 483453 482206 481305 480543 480453
59617 480453 481393 482532 482477 480773 478322 476353 475349 474988 474732 474245 473493 472792 472751 473809 475604 476987 476994
59600 476994 475792 474487 473986 474277 474832 475298 475557 475399 474595 473331 472270 472056 472850 474300 475813 476895
59584 476895 477410 477596 477710 477656 477051 475649 473502 470754 467545 464171 461047 458325 455764 453183 450839 449067
59568 449067 447679 446127 444235 442478 441355 440778 440256 439499 438684 438276 438686 439961 441595 442799 443229 443372
59552 443372 444011 445367 447019 448630 450458 453081 456826 461557 466876 472408 478016 483827 490075 497035
59538D97035Q167J0051J2144J3423J3405J2759J2321J1841J0380P809N038K807
59526F17180J128J38M99K301M226M779M034L413L742M374M279L348K121P75j005
59511F55332l240n341o812p901r149j0487j1249j1158j0723j0390r801q527p041
59498E43513o251o147n836m976m303m358m562m158l335k666k017q93L85R00N32
59483D95828K94J054K508L746M257M171L928L963M441N046N274N071M893M982
59469E49456M957M304L064J738P38K62M74J448K864M057M593M726N152O315Q018
59454F02166R760J1256J2483J3424J4049J4575J5270J5831J5383J3445J0609P829
59442G56080N298K435j096m907q413j1309j3480j4819j5341j5175j4441j3387
$$ plain form
59538 497035 505202 515253 527397 540820 554225 566984 579305 591146 601526 609335 614373 617180
59526 617180 618308 618446 618945 621246 625472 630251 634285 637698 641440 645814 650093 653441 655562 656337 655332
59511 655332 652092 646751 639939 632038 622889 612402 601153 589995 579272 568882 559081 550554 543513
59498 543513 537262 531115 525279 520303 516000 511642 507080 502922 499587 496921 494904 494011 494396 495296 495828
59483 495828 496122 497176 499684 503430 507687 511858 515786 519749 524190 529236 534510 539581 544474 549456
59469 549456 554413 558717 561781 563519 564257 564519 564993 566441 569305 573362 577955 582681 587833 594148 602166
59454 602166 611926 623182 635665 649089 663138 677713 692983 708814 724197 737642 748251 756080
59442 756080 761378 763813 762717 757810 749397 738088 724608 709789 694448 679273 664832 651445
59430F51445j2490j2005j1351r591o698l811j922p61O67K785N192P424R431J1315
59416F29630J3060J4696J6448J8479K0468K1521K0718J7899J3887R746N840J880
59404H04272k295o348r835j2355j3295j2163r622p540p295q349r202r480j0302
59391F86191j2524j5508j7943j9232j9641j9387j8261j6139j3496j1183r666q606
59379E04605p272n409l526k234j544j092q01q09q30k34J032K132K305J812J535
59364D89670J857K359K480K117J623J555K358M029N972P430Q078Q182Q262Q824
59350E54796J0257J2556J5115J7122J8270J8899J9397J9724J9635J9061J8102
59339G42934J6857J5428J3881J2067R698O779L777J093j403m073o940r709j2158
$$ plain form
59430 651445 638955 626950 615599 606008 599310 595499 593577 592816 593483 596268 601460 608884 618315 629630
59416 629630 642690 657386 673834 692313 712781 734302 755020 772919 786806 796552 802392 804272
59404 804272 801977 795629 785794 773439 760144 747981 738359 730819 723524 715175 705973 696493 686191
59391 686191 673667 658159 640216 620984 601343 581956 563695 547556 534060 522877 513211 504605
59379 504605 497333 491924 488398 486164 484620 483528 482727 481918 481088 480854 481886 484018 486323 488135 489670
59364 489670 491527 493886 496366 498483 500106 501661 504019 508048 514020 521450 529528 537710 545972 554796
59350 554796 565053 577609 592724 609846 628116 647015 666412 686136 705771 724832 742934
59339 742934 759791 775219 789100 801167 810865 817644 821421 822514 821111 817038 810098 800389 788231
59326G88231j4106j5197j5167j4425j3851j3909j4174j3904j2768j0999r138p730
59314F32863o944o373n514m510l994m067l992l230k222j613j149o6J656L227M251
59299E98323N227O712Q550J0286J1857J3418J4790J5486J5117J3629J1265Q511
59287G33171N800L031l70m616q903j1912j2874j1945r746o906m015j549L66K022
59273F71554L819N942Q340J0796J2970J4477J5079J4835J4031J2909J1435R339
59261H05526O447L029l29l203n597p723r653j1340j2779j3957j4744j4960j4532
59248G06185j3512j2014j0303q731p458o345n287m411l742k868j389M00J726K247
59234F34498K332K475K818L359M062M496L929K170J9j555k426l161m198n589p283
$$ plain form
59326 788231 774125 758928 743761 729336 715485 701576 687402 673498 660730 649731 640593 632863
59314 632863 625919 619546 614032 609522 605528 601461 597469 594239 592017 590404 589255 589189 590845 594072 598323
59299 598323 603550 610262 618812 629098 640955 654373 669163 684649 699766 713395 724660 733171
59287 733171 738971 742002 741632 737016 728113 716201 703327 691382 681636 674730 670715 669166 669532 671554
59273 671554 675373 681315 689655 700451 713421 727898 742977 757812 771843 784752 796187 805526
59261 805526 811973 815002 814673 811470 805873 798150 788497 777157 764378 750421 735677 720717 706185
59248 706185 692673 680659 670356 661625 654167 647822 642535 638124 634382 631514 630125 630525 632251 634498
59234 634498 636830 639305 642123 645482 649544 654040 657969 660139 660158 658603 656177 653016 648818 643229 635946
59219F35946r037j0221j0306r623r060q993q998q636p968p181o291n406m772m294
59205E25160l497k302j297r09q08n43k41j66m8M60J090J413J760K740M040M620
59189E31472M183L571L441L452L149K894L253M053M713N098N400N443M868L945
59175E88935L536M127N355O584P551Q261Q682Q808Q860R113R584J0072J0432J0638
59161G00538J0566R873Q334O228M189K589J279L6j070k001l141m832o634p743
59147G18211q155q776j0036j1036j0604q843p035o195o259o557o587o204n461
59134F16463m459l239j866o54l6l4l4O05J927L597N408P160Q422R005R522J0789
59118F62576J2644J4026J4326J4079J4090J4483J4924J5230J5307J4907J3989
$$ plain form
59219 635946 626909 616688 606382 596759 587699 578706 569708 561072 553104 545923 539632 534226 529454 525160
59205 525160 521663 519361 518064 517155 516347 515804 515563 515397 515349 515809 516899 518312 520072 522812 526852 531472
59189 531472 535655 539226 542667 546119 549268 552162 555415 559468 564181 569279 574679 580122 584990 588935
59175 588935 592471 596598 601953 608537 616088 624349 633031 641839 650699 659812 669396 679468 689900 700538
59161 700538 711104 720977 729311 735539 739728 742317 743596 743632 742562 740561 737420 732588 725954 718211
59147 718211 710056 701280 691244 680208 669604 660761 653726 647531 641272 634715 628128 621924 616463
59134 616463 612004 608765 606899 606245 606209 606175 606141 606746 608673 612270 617678 624838 633260 642265 651787 662576
59118 662576 675220 689246 703572 717651 731741 746224 761148 776378 791685 806592 820581
59107H20581J3025J2432J1886J0765R192P945P283O488M930L020J555M83r48k911
59093I05726m619n470n875o459o979o785o052n742o242o857o931o805p216q261
59079H15433r416j0289j0882j1314j1729j2265j2846j3107j2832j2198j1354j0204
59067F76997q876p990p815p586o416m717l852m388n395n624m776l400k177j596
59053F02389j827k525l063l166l113l173l208k965k378j471k95Q53J470J329P20
59038E79577J61J12Q96K422L888M377L960L763M634O125P244P749Q225R066R999
59023F52198J0664J1229J2202J3753J5373J6286J6165J5340J4270J2948J1050
59012H01478Q486N558K699L77r66j304j265j466j755j576r67m20J53J379L174
$$ plain form
59107 820581 833606 846038 857924 868689 877881 885826 893109 899597 904527 907547 909102 909585 908637 905726
59093 905726 901107 895637 889762 883303 876324 869539 863487 857745 851503 844646 837715 830910 823694 815433
59079 815433 806017 795728 784846 773532 761803 749538 736692 723585 710753 698555 687201 676997
59067 676997 668121 660131 652316 644730 638314 633597 629745 625357 619962 614338 609562 606162 603985 602389
59053 602389 600562 598037 594974 591808 588695 585522 582314 579349 576971 575500 575205 576058 577528 578857 579577
59038 579577 579738 579850 580746 583168 587056 591433 595393 599156 603790 609915 617159 624908 633133 642199 652198
59023 652198 662862 674091 686293 700046 715419 731705 747870 763210 777480 790428 801478
59012 801478 809964 815522 818221 818598 817632 816328 815063 813597 811842 810266 809299 808879 809032 810411 813585
58997H13585M435M467L899L543L099J792k67k201l585m745n931o954p688q341
58983G95108r153j0130j1058j1552j1226j0143q896p908o942n631m156k848j431
58970F94034N48K806M555N680O846Q320R440R647R342R246R369R174Q425P339
58956G94771O022M246J858r67l900o610q691r821j0168j0423j1065j1703j1496
58943G22053j0253q711p577o679n438l831k430j604j277j327j754k381k972l675
58929F62144m781n990o597o539o502o744o620n750m835m636m817m629m159l915
58915E85630l628k567r05K81M98M27Q55J874L237M775O146O935P302P930Q992
58900F27782R812R948J0002J0809J2243J3381J3609J3117J2525J2473J3377J5136
$$ plain form
58997 813585 818020 822487 826386 829929 833028 834820 834553 832352 828767 824022 818091 811137 803449 795108
58983 795108 785955 775825 764767 753215 741989 731846 722950 715042 708100 702469 698313 695465 694034
58970 694034 694582 697388 701943 707623 714469 722789 732229 741876 751218 760464 769833 779007 787432 794771
58956 794771 800793 805039 806897 805930 802030 795420 786729 776908 766740 756317 745252 733549 722053
58943 722053 711800 703089 695512 688833 683395 679564 677134 675530 674253 672926 671172 668791 665819 662144
58929 662144 657363 651373 644776 638237 631735 624991 618371 612621 607786 603150 598333 593704 589545 585630
58915 585630 582002 579435 578530 578811 579309 579736 580591 582465 585702 590477 596623 603558 610860 618790 627782
58900 627782 637594 647542 657544 668353 680596 693977 707586 720703 733228 745701 759078 774214
58888G74214J7097J8609J9531K0032K0043J9323J7957J6422J5004J3366J0909
58877I62507P448L381p72m811q749j2389j5327j7318j8422j8711j8143j6979j5945
58864H25770j5518j5238j4236j2413j0712j0025j0259j0690j0903j1044j1271
58853F93461j1280j0540q999p379o596o768p019o516n472m841n124n832o130n645
58839E95320m639l670l237l503m191m816n062m873m256l234k012r99n78q33j398
58824E48019j642j194l85J09J22J09K83K18k82m71M03J821K466J864P69jl66n50
58806E51292o76j003j777k568k475j375l25k74r53j496j622j588j476j214r84
58791E31486r68q37j15J087K227L098L883M495M556M082L666L717M011M177M222
$$ plain form
58888 774214 791311 809920 829451 849483 869526 888849 906806 923228 938232 951598 962507
58877 962507 969955 973336 972564 967753 959004 946615 931288 913970 895548 876837 858694 841715 825770
58864 825770 810252 795014 780778 768365 757653 747628 737369 726679 715776 704732 693461
58853 693461 682181 671641 662642 655263 648667 641899 634880 628364 622892 618051 612927 607095 600965 595320
58839 595320 590681 587011 583774 580271 576080 571264 566202 561329 557073 553839 551827 550828 550250 549417 548019
58824 548019 546377 545183 544798 544907 545029 545138 545421 545639 545357 544886 545289 547110 549576 551440 552209 552208 551842 551292
58806 551292 550616 549613 547836 545268 542793 541418 541093 540819 539866 538370 536748 535160 533684 532470 531486
58791 531486 530518 529681 529566 530653 532880 535978 539861 544356 548912 552994 556660 560377 564388 568565 572787
58776E72787M243M043L489K941K758K508J333p52k548l048k653k512k973l359
58762E76257l184k828k782k870k597j845q67P5P81J155J487K339L741M916N200
58747E78978M864M586M547M584M852N601O598P435Q211R246J0308J0892J1013
58734F71715J0963J0570R629Q885R324J0470J0674R456Q265Q276Q646P864N917
58721G90654M052K920K087J090R4n32n67M8J067J871J971J552J130P91J30j190
58705H07168l056n053o787q258r908j2061j4203j5385j5451j5329j5823j6712
58693F69142j7342j7431j6818j5191j2756j0607r591r239q572p537o770o341n792
58680E25155n244n340n936n896m532k496q62L8M73O75Q57J430K663M252N613O516
$$ plain form
58776 572787 577030 581073 584562 587503 590261 592769 594102 593350 590802 587754 585101 582589 579616 576257
58762 576257 573073 570245 567463 564593 561996 560151 559284 559359 560140 561295 562782 565121 568862 573778 578978
58747 578978 583842 588428 592975 597559 602411 608012 614610 622045 630256 639502 649810 660702 671715
58734 671715 682678 693248 702877 711762 721086 731556 742230 751686 759951 768227 776873 784737 790654
58721 790654 794706 797626 799713 800803 800897 800365 799798 799846 800913 802784 804755 806307 807437 808228 808358 807168
58705 807168 804112 799059 792272 784014 774106 762045 747842 732457 717006 701677 685854 669142
58693 669142 651800 634369 617551 602360 589604 578997 569406 560167 551595 544058 537288 530947 525155
58680 525155 519911 514571 508635 502739 498207 495711 494849 494887 495360 496035 496892 498322 500985 505237 510850 517366
58664E17366P164P796Q390Q772Q832Q616Q174P286N563L063O31p78j184j579k704
58649E85408m155m986m936m624m623m741m415l552k632k026j628j275j195j606
58635E39014k109j963r90J86Q66R33O84M30L44L90L07r7n40n71j84L00R30K079
58617E40009L574M658N135N829P359R059R710Q957P488O210N695N954O231N427
58603F31295L304Q94p18j547k084k235j726j075j096j643j833j370p79l45K22
58588F19264J053J971L135M956P120Q555Q760Q470Q617R219R674R688R381Q860
58574G18723Q046O899N615M617M299M675N417O385P775R470J0838J1740J3184
58561H17683J6011J9280K1064K0828J9814J9001J7880J5723J2944J0407Q144N591
$$ plain form
58664 517366 524530 532326 540716 549488 558320 566936 575110 582396 587959 591022 591653 590875 589691 588112 585408
58649 585408 581253 576267 571331 566707 562084 557343 552928 549376 546744 544718 543090 541815 540620 539014
58635 539014 536905 534942 533952 534138 535004 535937 536621 537051 537395 537785 538092 537995 537455 536884 536700 537000 537930 540009
58617 540009 543583 548241 553376 559205 566564 575623 585333 594290 601778 607988 613683 619637 625868 631295
58603 631295 634599 635493 634775 633228 631144 628909 627183 626108 625012 623369 621536 620166 619387 619042 619264
58588 619264 620317 622288 625423 630379 637499 646054 654814 663284 671901 681120 690794 700482 709863 718723
58574 718723 726769 733668 739283 743900 748199 752874 758291 764676 772451 781921 792759 804499 817683
58561 817683 833694 852974 874038 894866 914680 933681 951561 967284 980228 990635 998779 1004370
58549A004370K583n30l474o145q372j0096j1554j3000j4451j5864j7225j8310
58537H87932j8816j8913j9081j9167j8325j6303j4134j2908j2440j1764j0496
58526G15585q957p292n353l357j887j173p96k32P31J959L008L326K859K289K252
58511G02962K487K304J718J486K017K899L645M236M652M550L806K931K394J890
58497G43977Q21o43j668j897j906k252k654k486j771j147r54q90n42J57J191K626
58481G29962M328N813O765P427Q240R279J0313J1048J1018R587O700L398Q97p44
58467H24031k470m730o904q371r343j0179j0519r825q399p121o176m794k451J48
58453G32897J758K043J839J973K222J825P11l23p24q88j467k351k835k606k060
$$ plain form
58549 1004370 1006953 1006423 1002949 996804 988432 978336 966782 953782 939331 923467 906242 887932
58537 887932 869116 850203 831122 811955 793630 777327 763193 750285 737845 726081 715585
58526 715585 706628 699336 693983 690626 688739 687566 686770 686538 687269 689228 692236 695562 698421 700710 702962
58511 702962 705449 707753 709471 710957 712974 715873 719518 723754 728406 732956 736762 739693 742087 743977
58497 743977 744798 744155 742487 740590 738684 736432 733778 731292 729521 728374 727420 726530 725988 726145 727336 729962
58481 729962 734290 740103 746868 754295 762535 771814 782127 793175 804193 813780 820480 823878 824775 824031
58467 824031 821561 816831 809927 801556 792213 782034 771515 761690 753291 746170 739994 735200 732749 732897
58453 732897 734655 736698 738537 740510 742732 744557 745268 744945 744221 743333 741866 739515 736680 734074 732014
58438G32014j645j282n53P77K412L632L914L554L497M274N482O565P659R111J0579
58423G89990J1361J1482J1648J2126J2433J2179J1542J0662R227P024M336J527
58411I05537j326m071o244p516q070q249q115p622o882o013m937l614k289j307
58397H29282q34p34o41j56P15J414J396P66P8m08q54j381j973k739l720m462m411
58380H11338l730l160k987k766k050q65O55K399M017N127N884O693P373P470P352
58365H42750P990R392J0334J0141R659R879J0498J0697J0447J0165R703Q690P484
58352I67829O826O690O325N351M147L272L044L606M836O166O941P055P025P485
58338A046598Q699J0349J1687J2150J2003J2065J2675J3225J2963J1900J0708
$$ plain form
58438 732014 730369 729087 728534 729311 731723 735355 739269 742823 746320 750594 756076 762641 770300 779411 789990
58423 789990 801351 812833 824481 836607 849040 861219 872761 883423 892650 899674 904010 905537
58411 905537 904211 900140 893896 886380 878310 870061 861946 854324 847442 841429 836492 832878 830589 829282
58397 829282 828448 827714 827073 826917 827632 829046 830442 831208 831286 830878 830024 828643 826670 823931 820211 815749 811338
58380 811338 807608 804448 801461 798695 796645 795780 796435 798834 802851 807978 813862 820555 827928 835398 842750
58365 842750 850740 860132 870466 880607 890266 900145 910643 921340 931787 941952 951655 960345 967829
58352 967829 974655 981345 987670 993021 997168 1000440 1003484 1007090 1011926 1018092 1025033 1032088 1039113 1046598
58338 1046598 1055297 1065646 1077333 1089483 1101486 1113551 1126226 1139451 1152414 1164314 1175022
58327A175022J0027R972J0069R573Q205O508N167M176L212K557K788L677M434
58314A255387N008O073P618Q707Q997R312J0297J1677J3205J5066J6795J7179
58302A385321J6088J5147J5593J6618J6795J6099J5334J4697J4139J4205J5181
58291A555217J6136J6109J5642J5884J6867J7898J8972K0397K1623K1894K1760
58280A758399K2504K4316K6255K7774K9089L0318L1366L2532L4242L6381L8733
58269B091909M1600M5127M8656N1727N5005N9089O3148O6002O7757O9078O9693
58258B728791O9200O8532O8732O8957O7674O5359O3971O3982O4092O3795O4268
58247C457353O6446P0076P4808Q0566Q6696R2394R8076J04766J12226J19400J26521
$$ plain form
58327 1175022 1185049 1195021 1205090 1214663 1222868 1229376 1234543 1238719 1241931 1244488 1247276 1250953 1255387
58314 1255387 1260395 1266468 1274086 1282793 1291790 1301102 1311399 1323076 1336281 1351347 1368142 1385321
58302 1385321 1401409 1416556 1432149 1448767 1465562 1481661 1496995 1511692 1525831 1540036 1555217
58291 1555217 1571353 1587462 1603104 1618988 1635855 1653753 1672725 1693122 1714745 1736639 1758399
58280 1758399 1780903 1805219 1831474 1859248 1888337 1918655 1950021 1982553 2016795 2053176 2091909
58269 2091909 2133509 2178636 2227292 2279019 2334024 2393113 2456261 2522263 2590020 2659098 2728791
58258 2728791 2797991 2866523 2935255 3004212 3071886 3137245 3201216 3265198 3329290 3393085 3457353
58247 3457353 3523799 3593875 3668683 3749249 3835945 3928339 4026415 4131181 4243407 4362807 4489328
58236D489328J34748J43853J52481J60838J70837J83177J96452K09704K23811
58227F065229K39616K56738K74910K94827L16973L41238L68115L98595M32609
58218H988850M69313N09182N54000O04764O61703P26305Q01052Q87239R85717
58209A5188125J099832J234953J395437J585663J814454K095290K441959K867315
58201B9723028L385205M008352M744465N600841O593860P747276R079180J0596747
58193H1478954J2303279J4197658J6256841J8414617K0536075K2371949K3529116
58186B09088489K3554254K2152527J9377108J5577099J1118763O162362P35590
58179C07766192m988769j0534321j5263718j8679717k0613874k1198580k0732456
$$ plain form
58236 4489328 4624076 4767929 4920410 5081248 5252085 5435262 5631714 5841418 6065229
58227 6065229 6304845 6561583 6836493 7131320 7448293 7789531 8157646 8556241 8988850
58218 8988850 9458163 9967345 10521345 11126109 11787812 12514117 13315169 14202408 15188125
58209 15188125 16287957 17522910 18918347 20504010 22318464 24413754 26855713 29723028
58201 29723028 33108233 37116585 41861050 47461891 54055751 61803027 70882207 81478954
58193 81478954 93782233 107979891 124236732 142651349 163187424 185559373 209088489
58186 209088489 232642743 254795270 274172378 289749477 300868240 307030602 307766192
58179 307766192 302777423 292243102 276979384 258299667 237685793 216487213 195754757
58172A95754757j9576529j8099349j6614894j5304015j4179036j3135177j2053787
58165H6791970j0880689r639247q397205p226551o177274n267900m491264l829748
58157C0882092l267935k794698k399342k070272j796652j568831j377726j215945
58149A4390691j079069r64162q67385p84536p12979o51194n96923n47606n02216
58140G684621m60890m22872l86601l51814l19875k91773k67118k45290k26283
58131D712105k10066j96238j84580j75095j67303j60326j53737j47512j41144
58122C176104j33784j25361j16735j08686j01454r5270r0355q6247q1960p7016
58112B159236p1705o6340o1046n6295n2693n0078m7625m5117m3141m1836m0373
$$ plain form
58172 195754757 176178228 158078879 141463985 126159970 111980934 98845757 86791970
58165 86791970 75911281 66272034 57874829 50648278 44471004 39203104 34711840 30882092
58157 30882092 27614157 24819459 22420117 20349845 18553193 16984362 15606636 14390691
58149 14390691 13311622 12347460 11480075 10695539 9982560 9331366 8734443 8186837 7684621
58140 7684621 7223731 6800859 6414258 6062444 5742569 5450796 5183678 4938388 4712105
58131 4712105 4502039 4305801 4121221 3946126 3778823 3618497 3464760 3317248 3176104
58122 3176104 3042320 2916959 2800224 2691538 2590084 2494814 2404459 2318212 2236252 2159236
58112 2159236 2087531 2021191 1960145 1903850 1851157 1801079 1753454 1708337 1665196 1623360 1582987
58101A582987l8205l5979l4497l3493l2198l0636k9492k8934k8470k7865k7418
58090A235800k7021k5785k3159k0073j8150j7842j7954j7287j6122j5588j6001
58079A020818j6620j6879j7020j7369j7754j7998j8368j8983j9332j8904j8012
58068H23579j7414j7344j7321j6775j5475j3568j1556j0115r516r387r185q730
58056F67193q105p389o886p192q505j0043j0728j0311r459q787q249p526o588
58043E57425n811n582n819n938n485m826m845n807o978p561p535p264o847o263
58029D70864n770n612n646n670n742n850n711n321n198n546n698n073m125l637
58015C96265l465k974k318k321l119l882l882l124j900m78O97J274J524J937K400
$$ plain form
58101 1582987 1544782 1508803 1474306 1440813 1408615 1377979 1348487 1319553 1291083 1263218 1235800
58090 1235800 1208779 1182994 1159835 1139762 1121612 1103770 1085816 1068529 1052407 1036819 1020818
58079 1020818 1004198 987319 970299 952930 935176 917178 898810 879827 860495 841591 823579
58068 823579 806165 788821 771500 754725 739250 725682 714126 704011 694495 685108 675923 667193
58056 667193 659088 651699 644813 637621 629116 619073 608345 598034 588575 579788 571539 564013 557425
58043 557425 551614 546032 540213 534275 528790 523964 519119 513312 506334 498773 491238 483974 477127 470864
58029 470864 465094 459482 453836 448166 442424 436574 430863 425542 420344 414798 409100 404027 399902 396265
58015 396265 392800 389826 387508 385187 382068 378186 374304 371180 369280 368802 369499 370773 372297 374234 376634
58000C76634K432K209K433L204L883M241M801N739O340O076N444N136N035M599
57986D38206L834L249L073L011K653J835O83n03j561k649l866m821n099n121n801
57971D27123p173q028p341n593m224m091m830n391m977l732k693k746l531l835
57957C58938l167k310k063k212k142j799j429r43k89J9m38j089r22J63J307J939
57941C43563K408L253M424N414N818N609N224N381O429P857Q716Q601P911P173
57927D27781O469N577M330K684P00j415l423n236o811p932q375q408q703r617
57913C87621j0746j1355j1161j0472r720q998q124p015n877m993m471m291m427
57900B85971m726m782m290l622l576m362n166n026l847k238o92O05J413J585J510
$$ plain form
58000 376634 379066 381275 383708 386912 390795 395036 399837 405576 411916 417992 423436 428572 433607 438206
57986 438206 442040 445289 448362 451373 454026 455861 456544 456041 454480 451831 447965 443144 438045 432924 427123
57971 427123 419950 411922 404581 398988 394764 390673 385843 380452 375475 371743 369050 366304 362773 358938
57957 358938 355771 353461 351398 349186 347044 345245 343816 342873 342584 342603 342165 341076 340154 340317 341624 343563
57941 343563 345971 349224 353648 359062 364880 370489 375713 381094 387523 395380 404096 412697 420608 427781
57927 427781 434250 439827 444157 446841 447541 446126 442703 437467 430656 422724 414349 405941 397238 387621
57913 387621 376875 365520 354359 343887 334167 325169 317045 310030 304153 299160 294689 290398 285971
57900 285971 281245 276463 272173 268551 264975 260613 255447 250421 246574 244336 243644 244249 245662 247247 248757
57885B48757J862K755L583L872L737L453K998K336J758J543J524J321Q43K70k75
57870B80337p88j182j376j454j526j509j260q51l82K96J354K414K729K091J283
57855B80176J326K402L724M385M143L488L113L299L715L797L399K892K566K232
57841C24657J623R28M33j84j562l553n024n165m506m188m490m649m061l011k130
57826B85118j546q80R6J088J566J369R83J158K095L199L703L475K997K709K653
57811C09783K581K132J039m41j484j550j316k147m429o959q262q152p600p479
57797B65716p810q055p728o773n622m874m732m832m732m316l614k570j299k64
57783A98495K24M43Q20J229J217Q14O23J083K051L161M130M698M703M416M351
$$ plain form
57885 248757 250619 253374 256957 260829 264566 268019 271017 273353 275111 276654 278178 279499 280342 280612 280337
57870 280337 279549 278367 276991 275537 274011 272502 271242 270391 270009 270305 271659 274073 276802 278893 280176
57855 280176 281502 283904 287628 292013 296156 299644 302757 306056 309771 313568 316967 319859 322425 324657
57841 324657 326280 327208 327641 327457 325895 322342 317318 312153 307647 303459 298969 294320 290259 287248 285118
57826 285118 283572 282692 282788 283876 285442 286811 287794 288952 291047 294246 297949 301424 304421 307130 309783
57811 309783 312364 314496 315535 315094 313610 312060 310744 308597 304168 297209 288947 280795 273195 265716
57797 265716 257906 249851 242123 235350 229728 224854 220122 215290 210558 206242 202628 200058 198759 198495
57783 198495 198719 199162 199982 201211 202428 203242 203865 204948 206999 210160 214290 218988 223691 228107 232458
57768B32458M522M275L195J771P84K31n70j892l152l720l777l974m442m623m102
57753B16984l282k925l235l685l740l426l136l076l067k734j832m82P31J097M46
57738A84638o28j331j414j232j185j308j442j518j608j726j669j100R6J501K408
57723A72482K481K015J446Q35Q5n75o82j75M09M74o1p69j182j196j132j328j718
57706A71409j873j642j422j614j939j783j079m50l77o92r43r36o72j33O01J229
57690A57684J512J499J321R79N65N12J206K481L752M727N721P226R354J1794J4249
57675B24582J6793J9841K3744K8460L3682L9297M5445N1939N7697O1038O0562
57664F63080N5727M6705L4100J8842K118j4904l1109m5140n5389o0737o1391n8688
$$ plain form
57768 232458 236980 241255 244450 246221 247005 247236 246666 244774 241622 237902 234125 230151 225709 221086 216984
57753 216984 213702 210777 207542 203857 200117 196691 193555 190479 187412 184678 182846 182364 183095 184192 184638
57738 184638 184010 182679 181265 180033 178848 177540 176098 174580 172972 171246 169577 168477 168573 170074 172482
57723 172482 174963 176978 178424 179259 179344 178769 178087 177912 178321 178795 178734 177965 176783 175587 174455 173127 171409
57706 171409 169536 167894 166472 164858 162919 161136 160057 159607 159230 158538 157595 156659 155987 155854 156455 157684
57690 157684 159196 160695 162016 162995 163560 164072 165278 167759 171511 176238 181959 189185 198539 210333 224582
57675 224582 241375 261216 284960 313420 347102 386399 431844 483783 541480 602518 663080
57664 663080 718807 765512 799612 818454 820572 805668 774559 729419 674030 613293 551902 493214
57652D93214n3971m7902m0938l3958k7949k3186j9192j5543j2351r870q033o579
57640A93742n370m328l329k366j638j260r68m80O2K03k75j130j914k214j853j125
57624A65757p09r77j483j513j096r93j578k295k454k169k031k146j967j143j41
57609A43062K09l70j291j710j319n17J38M37M21J13m61j064j386j349j135r56
57593A32822r64j282j837k283k329k074j773j431j003q13j248k095k694k758k493
57578A05745j951r75P5L79k06p70o51m27r17j818k140j701j258j278j438j393
57562H9276j268j200j032o70k61J55P03J182J111M80j3J47O16P97P19Q26J110
57545I2678J071N54R3K35Q54J345J355J068Q38Q30J010J299J524J383P40n1m25
$$ plain form
57652 493214 439243 391341 350403 316445 288496 265310 246118 230575 218224 208354 200321 193742
57640 193742 188372 184044 180715 178349 176711 175451 174483 174003 174065 174268 173993 172863 170949 168735 166882 165757
57624 165757 165048 164071 162588 161075 159979 158986 157408 155113 152659 150490 148459 146313 144346 143203 143062
57609 143062 143271 142901 141610 139900 138581 138064 138202 138639 139060 139173 138712 137648 136262 134913 133778 132822
57593 132822 131858 130576 128739 126456 124127 122053 120280 118849 117846 117033 115785 113690 110996 108238 105745
57578 105745 103794 102819 102894 103273 103067 102297 101646 101219 100302 98484 96344 94643 93385 92107 90669 89276
57562 89276 88008 86808 85776 85106 84845 85000 85703 86885 87996 88476 88463 88610 89226 90023 90742 91568 92678
57545 92678 93749 94303 94396 94631 95485 96830 98185 99253 100091 100921 101931 103230 104754 106137 106877 106826 106401
57528A06401k82j61n48j314k004k441k648k433j525k08P76J037R24Q76Q38O04
57512I7892L96O05J066J140N89J2M6M55M01l84j172j172n96l39p36j148r06k50
57494I5899K4l94j043j338j169q47o94p73r31r93r67r88j091j204j395j835k369
57477G7892k434j742q38n63j033j536j422p54j09O9j81m01j25N93J138J044N89
57460G0187L63M34L88J30R2N23R63P94%q36j106o39K52J039J409J461J424J255
57442G8133P73N4n49p94o89l31Q2K17l0k22P1M80J92q34j639j485p35k31k29l49
57422G1885j93L37J000J238N49q09j866j977j463r65o00j62J94J16l45p76r31
57405F5232q66o46l30j45l38q34j286j344q05K47J284J618J173O55O47R03Q93
$$ plain form
57528 106401 106119 105958 105410 104096 102092 99651 97003 94570 93045 92837 93613 94650 95574 96450 97288 97892
57512 97892 98288 98893 99959 101099 101688 101700 101746 102201 102602 102218 101046 99874 99278 98939 98203 97055 96149 95899
57494 95899 95923 95529 94486 93148 91979 91132 90438 89665 88734 87741 86774 85786 84695 83491 82096 80261 77892
57477 77892 75458 73716 72878 72315 71282 69746 68324 67570 67461 67530 67349 66948 66823 67416 68554 69598 70187
57460 70187 70550 70984 71372 71502 71594 72117 73080 73874 73874 73038 71932 71293 71545 72584 73993 75454 76878 78133
57442 78133 78906 78960 78411 77617 76928 76597 76679 76896 76866 76644 76715 77195 77387 76553 74914 73429 72694 72463 72234 71885
57422 71885 71692 72029 73029 74267 74816 74007 72141 70164 68701 67736 67136 66974 67168 67284 66939 66163 65232
57405 65232 64366 63720 63390 63245 62907 62073 60787 59443 58638 58885 60169 61787 62960 63615 64262 65165 66058
57388F6058O36N02M99L45Q8L2J83K71K55K67K23p2m96p80r38j067q90k05M07J29
57368F5447q31j312p40J68N16K83j24o90j474k014j730p53J59N17M66M23O79J346
57350F0336K286L029L091K510J855J551J347O22o93j872k175j768j365j148n69
57335F7037N10J201P01m74j082p69k07J33M39O46J32j187k262k071q96J50N00
57318F2501M20K44j7l04l50j6M61O52L17l74q70o60K02J118J517J296O37k12q61
57299F5701q90l36K21L16R6p1j81l59m26j27L54O13O22O79P95O25P2m19l99O0
57279F6946N14O84O26N51N10L28j74q53j274j094l96M49J079J231Q41K17n2L26
57261G0459R79J271J040O45M24L41K51K29N45J316K263K776K346J085k64q74m30
$$ plain form
57388 66058 66694 67196 67695 68040 68128 68160 68343 68614 68869 69136 69359 69287 68791 68011 67073 66006 65116 64911 65318 65447
57368 65447 64616 63304 62564 62732 63248 63531 63407 62717 61243 59229 57499 56746 56905 57422 57888 58311 58990 60336
57350 60336 62622 65651 68742 71252 73107 74658 76005 76627 75934 74062 71887 70119 68754 67606 67037
57335 67037 67547 68748 69449 68975 67893 67124 66917 67050 67489 68135 68267 67080 64818 62747 61851 62001 62501
57318 62501 62921 63165 63148 62844 62494 62478 62939 63591 63908 63534 62664 62004 62206 63324 64841 66137 66774 66562 65701
57299 65701 64811 64475 64696 65012 65108 65037 64856 64497 64071 63944 64298 64911 65533 66212 67007 67632 67704 67285 66886 66946
57279 66946 67460 68144 68770 69321 69831 70159 69985 69132 67858 66764 66368 66817 67896 69127 69968 70185 70133 70459
57261 70459 71438 72709 73749 74394 74818 75159 75410 75639 76184 77500 79763 82539 84885 85970 85706 84832 84402
57244H4402P31J880K322J902J219J056J449J667J228N86M57Q58J309J659K100
57229A04825K474K297J585J064J284J941K409K556K682K864K813K393J952J996
57215A35135K613L362L708L563L291L197L163K913K547K516L117M189N364O431
57201A85109P264P581P031N716M441M200N203O594P349P400P553Q354R457J0294
57187B83546J0890J1611J2425J2918J2983J2981J3144J3283J3176J2979J2961
57176D22897J3009J2649J1562J0065R089R517J1399J3824J5721J6775J7457J8288
57164E82252J9313K0209K0627K0356J9398J8056J6729J5571J4448J3270J2136
57153G72365J1069R834Q265O692N803N976O813P445P279O394N267M257L519L188
$$ plain form
57244 84402 85133 87013 89335 91237 92456 93512 94961 96628 97856 98442 98899 99757 101066 102725 104825
57229 104825 107299 109596 111181 112245 113529 115470 117879 120435 123117 125981 128794 131187 133139 135135
57215 135135 137748 141110 144818 148381 151672 154869 158032 160945 163492 166008 169125 173314 178678 185109
57201 185109 192373 199954 206985 212701 217142 221342 226545 233139 240488 247888 255441 263795 273252 283546
57187 283546 294436 306047 318472 331390 344373 357354 370498 383781 396957 409936 422897
57176 422897 435906 448555 460117 470182 479271 488788 500187 514011 529732 546507 563964 582252
57164 582252 601565 621774 642401 662757 682155 700211 716940 732511 746959 760229 772365
57153 772365 783434 793268 801533 808225 814028 820004 826817 834262 841541 847935 853202 857459 860978 864166
57139H64166L336L674L652L003K041J217O39J19m60j069j691k335l088m270o276
57124H62658r032j1837j4243j6822k0562k5443l0214l3781l6376l9054m2368m6066
57112E36860m9961n4558o0531o7872p6015q4809D8319e7986j18903j32250j47396
57101d56535j66261j89892k18054k50735k89381l36251l93317m62164n44005o38588
57091c945183p43109q52615r61357j064077j157188j239155j308091j358021j379310
57082a4008106j364554j311570j216416j064874q38557n35855j86265J60219M60649
57073a9905329O98646Q82316J028757J150467J250439J324185J365085J369602
57065a0835832J339335J279428J196200J096315R86709Q73757P62312O55793N56878
$$ plain form
57139 864166 867502 871176 874828 877831 879872 881089 881728 881847 881387 880318 878627 876292 873204 868934 862658
57124 862658 853626 841789 827546 810724 790162 764719 734505 700724 664348 625294 582926 536860
57112 536860 486899 432341 371810 303938 227923 143114 48319 -57986 -176889 -309139 -456535
57101 -456535 -622796 -812688 -1030742 -1281477 -1570858 -1907109 -2300426 -2762590 -3306595 -3945183
57091 -3945183 -4688292 -5540907 -6502264 -7566341 -8723529 -9962684 -11270775 -12628796 -14008106
57082 -14008106 -15372660 -16684230 -17900646 -18965520 -19804077 -20339932 -20526197 -20365978 -19905329
57073 -19905329 -19206683 -18324367 -17295610 -16145143 -14894704 -13570519 -12205434 -10835832
57065 -10835832 -9496497 -8217069 -7020869 -5924554 -4937845 -4064088 -3301776 -2645983 -2089105
57056b089105M67612L89097L21473K64133K15762J74556a17555i664G1184N7153
57046A28337L6497J9338O190l328j0290j5256j7963j8334j7243j5831j4409j2567
57034F5141j0133p448m714j675J748N008P534R634J2300J6192K1235K7118L3526
57021A75466L9352M2254L9940L2372K2420J3895Q742O055L520m84o011j2152j7887
57008C47482k2433k5209k5868k4488k1655j8342j5481j3432j1856j0266q668p378
56996A42406o357n156l681k422j654r05K79J519K229K688L688N166O135O047N452
56981A55434M975M485L682K821K210J474M6j871l455m276m609m801m730l990k297
56966A45098K22K956N074O166O617P171Q191R503J0738J1529J1482J0314Q164
$$ plain form
57056 -2089105 -1621493 -1232396 -910923 -646790 -431028 -256472 -117555 -9664 71184 128337
57046 128337 164834 184172 190362 187034 176744 161488 143525 125191 107948 92117 77708 65141
57034 65141 55008 47560 42846 41171 42919 47927 55461 65095 77395 93587 114822 141940 175466
57021 175466 214818 257072 297012 329384 351804 365699 374441 380496 384016 383532 377521 365369 347482
57008 347482 325049 299840 273972 249484 227829 209487 194006 180574 168718 158452 149784 142406
56996 142406 136049 130893 127212 124790 123136 122231 122510 124029 126258 128946 132634 137800 143935 149982 155434
56981 155434 160409 164894 168576 171397 173607 175081 175127 173256 169801 165525 160916 156115 151385 147395 145098
56966 145098 145320 148276 153350 159516 166133 173304 181495 190998 201736 213265 224747 235061 243225
56953B43225N583L132R88j154l719o640r103j0174r765q675p621o594n246l487
56939A80750j436P95K955M695O061P559R379J0927J1590J1499J1069J0171Q429
56926B74443O006L414O83k531o178r697j2642j4798j5826j5488j4228j2832j1470
56913A68856r765p742n996m800l817k912k433k417k258j513n09L15R73J527J731
56898A29240J600J782K765M148N240O008O851P825Q703R522J0470J1421J2078
56885B17653J2433J2529J2001J0427Q038N550L289J049j212l103m362n129n509
56872B63654n217l902j562J452M700P834J0814J3944J7489K1206K4442K6693K7840
56859D09387K7943K7098K5453K2948J9087J3386O196j263p831j3041j6777j8797
$$ plain form
56953 243225 248808 251940 252928 251774 248055 241415 232312 222138 212373 203698 196077 189483 184237 180750
56939 180750 179314 180109 183064 187759 193820 201379 210758 221685 233275 244774 255843 266014 274443
56926 274443 280449 283863 284546 282015 275837 266140 253498 238700 222874 207386 193158 180326 168856
56913 168856 159091 151349 145353 140553 136736 133824 131391 128974 126716 125203 124694 125009 125982 127509 129240
56898 129240 130840 132622 135387 139535 144775 150783 157634 165459 174162 183684 194154 205575 217653
56885 217653 230086 242615 254616 265043 273081 278631 281920 282969 281757 278654 274292 269163 263654
56872 263654 258437 254535 252973 254425 259125 266959 277773 291717 309206 330412 354854 381547 409387
56859 409387 437330 464428 489881 512829 531916 545302 551498 550235 542404 529363 512586 493789
56847D93789j8908j7347j4575j0831o114n03N708J2139J8404K4261K9826L5434
56835E51283M0992M5532M7751M6963M3370L7373K9069J8566O541n884j7760k8578
56823H15218l7776m4294m6999m5669m1369l5650k9499k3120j6525r935l536K821
56811D83667R425J6185K2440K7270L0005L0531K9090K5816K0536J3185M306n110
56799G07346j4349k3148l1042l6901l9552l8951l6297l2845k8828k3778j7753
56788C83902j1789o945l187L69M194P796J0551J2493J3742J3708J1655Q014M190
56775D48693P79l188q670j4905k0028k3059k4474k4958k4485k2829k0372j7903
56763B44601j5889j4243j2649j1008r596q811q542p972o358m040k214j702k195
$$ plain form
56847 493789 474881 457534 442959 432128 426014 425511 431219 443358 461762 486023 515849 551283
56835 551283 592275 637807 685558 732521 775891 813264 842333 860899 867440 861556 843796 815218
56823 815218 777442 733148 686149 640480 599111 563461 533962 510842 494317 484382 480846 483667
56811 483667 493092 509277 531717 558987 588992 619523 648613 674429 694965 708150 712456 707346
56799 707346 692997 669849 638807 601906 562354 523403 487106 454261 425433 401655 383902
56788 383902 372113 365168 361981 362350 366544 374340 384891 397384 411126 424834 436489 444503 448693
56775 448693 449472 446284 437614 422709 402681 379622 355148 330190 305705 282876 262504 244601
56763 244601 228712 214469 201820 190812 181216 172405 163863 155891 149533 145493 143279 141577 139382
56750A39382k815k987k680k218k008k150k175j559n62qj42l69l25m34r27j102
56734A16921l61N95O29j93p78o99n93q19q28k33L73L14j60l48j22J12J98M02Q96
56715A15306J477J787J589R53L09J42M52P34O52L63J07k10o53q44l89M73J055
56698A23303J006N57L2n04j012j221q79k16Q0m22j225j280k45R51J138L25m19
56681A19969m10MK53L34N03P44R13J006R54N71j4l12j80o0j69n6N49J070R34N62
56661A27165O93J197J350J085R49J010P52J28j81K08Q44J155J131J021R39R11
56645A40357R27P78L31o2N4M28L73r6k12L16Q00P00M15M55N26R7o61j146j141
56626A43239p53P0J222J991J691O63l4J9J91j35o43n60K82J178J352Q19L54N77
$$ plain form
56750 139382 136567 133580 130900 128682 126674 124524 122349 120790 120228 120220 120078 119709 119384 118950 118023 116921
56734 116921 116560 117155 117784 117591 116813 116114 115521 114702 113874 113641 114014 114328 114168 113820 113698 113810 114008 114410 115306
56715 115306 116783 118570 120159 121112 121421 121563 122015 122749 123401 123764 123871 123661 123008 122164 121775 122248 123303
56698 123303 124309 124866 124898 124394 123382 122161 121282 121066 121146 120724 119499 118219 117974 118925 120063 120388 119969
56681 119969 119559 119563 119816 120150 120653 121397 122310 123316 124270 124841 124827 124515 124335 124275 124106 124050 124599 125669 126603 127165
56661 127165 127858 129055 130405 131490 132439 133449 134201 134329 134148 134356 135200 136355 137486 138507 139446 140357
56645 140357 141284 142062 142393 142331 142385 142813 143186 143090 142878 143194 143994 144694 145109 145564 146090 146187 145526 144380 143239
56626 143239 142486 142556 143778 145769 147460 148123 148089 148108 148299 148164 147521 146961 147243 148421 149773 150592 150946 151523
56608A51523J213J410Q03q1n11k99K22O48P27M86L47P29J375J463P13q0j25K50
56590A60813J41n39r88p58l20k64n32o95n42j77K00L60J84q6N0Q20J846K425K139
56571A64077J226N04P60J982L218L511K899K248K214K737L511M387N172N549N512
56556B09507N555N994O422O154N177M241L989M287M489M167L448K690J987J111
56542B69218q3j309k063k173j970j881k048k393k833l300l663l786l659l327k869
56527B31861k456k371k743l334l802m061m260m417m291l709k802j927j390j317
56513A88981j582j751j361m41L30K69m94j120j017n52n88j388k202k001n86J114
56497A75611J922J520O18O2o5k31o12q32n58m9J46j43n84p40m44J61P87J194J353
$$ plain form
56608 151523 152736 154146 154949 154868 154357 154058 154280 154928 155655 156141 156488 157217 158592 160055 160768 160688 160563 160813
56590 160813 160954 160415 159427 158669 158349 158085 157553 156858 156316 156139 156339 156699 156883 156797 156847 157667 159513 161938 164077
56571 164077 165303 165807 166567 168549 171767 175278 178177 180425 182639 185376 188887 193274 198446 203995 209507
56556 209507 215062 221056 227478 233632 238809 243050 247039 251326 255815 259982 263430 266120 268107 269218
56542 269218 269135 267826 265763 263590 261620 259739 257691 255298 252465 249165 245502 241716 238057 234730 231861
56527 231861 229405 227034 224291 220957 217155 213094 208834 204417 200126 196417 193615 191688 190298 188981
56513 188981 187399 185648 184287 183846 184176 184445 183951 182831 181814 181262 180674 179286 177084 175083 174497 175611
56497 175611 177533 179053 179671 179733 179668 179437 178825 177993 177435 177386 177532 177389 176805 176065 175621 175782 176569 177763 179116
56478A79116J379J284R37L03m11r54j162r27k60M68P39N08L21N12O95M56J47M01
56460A83552J121J644J823K067K323J887N68o62p68O6P86P88L87J31J48J42j96
56443A95807q08j162p53K22R40R21N64M72O01M70Ll15j00M83R92J136R15N62L24
56424B01274K45J68L7j1P1J03J1M0L78Q10R95R48R03Q40N65J64QK17M24K39k62
56403B08167n59k19O17J243J079L81J1L82R77J130R16Q67J105J286J266J235J200
56386B21084R12M36L05Q55J740K357K452K156J679J209Q93P06M49N2k77l29j03
56369B36576L28R29J454J375N00n10o95O9Q62P86n5q57j094q46m13PK04l5o38
56350B37947j152j159o37J36Q26J123Q73L20J8K66Q09J250J468J429R96L40J68
$$ plain form
56478 179116 180495 181779 182716 183019 182608 181654 180492 179565 179305 179773 180512 181020 181341 181853 182548 183004 183151 183552
56460 183552 184673 186317 188140 190207 192530 194417 194985 194323 193555 193621 194407 195195 195582 195713 195861 196003 195807
56443 195807 194999 193837 193084 193306 194246 195167 195731 196203 196804 197274 197277 196962 196862 197345 198337 199473 200388 200950 201274
56424 201274 201519 201687 201724 201713 201784 201887 201898 201938 202316 203126 204121 205069 205972 206812 207377 207541 207549 207766 208190 208429 208167
56403 208167 207608 207389 208006 209249 210328 210709 210720 211102 212079 213209 214125 214992 216097 217383 218649 219884 221084
56386 221084 221996 222432 222737 223592 225332 227689 230141 232297 233976 235185 236078 236784 237233 237285 237008 236679 236576
56369 236576 236904 237833 239287 240662 241162 240652 239957 240026 240888 241674 241619 240762 239668 238822 238409 238416 238620 238585 237947
56350 237947 236795 235636 234999 235135 235961 237084 237957 238277 238295 238561 239370 240620 242088 243517 244513 244853 245021
56333B45021R54K160K824K799K713K809K627K002J568J863K517K808K527J980
56319B77172J556J511J853K065J478K24o54n05O1N4m96o98o5R47J550J393P88
56302B88234N00J070K130K661K231J510J249J289J107P92P68Q89O62J38j07J07
56286C05230L77M81O81J217J997K815L517L929L986L821L446K651J629J269K128
56271C39174L413L860L409L150L633M252M497M834N837P122P802P654P303P468
56257D13408Q282R307J0053J0543J1342J2872J4896J6883J8655K0296K1775K3103
56245E91415K4617K6399K7733K7853K7119K6607K6599K6308K5061K2901J9968
56234H72580J6258J2233Q660N503J854k599o964j0447j3419j6460j9215k1019
$$ plain form
56333 245021 245975 248135 250959 253758 256471 259280 261907 263909 265477 267340 269857 272665 275192 277172
56319 277172 278728 280239 282092 284157 285635 285859 285205 284700 284761 284815 284319 283621 283556 284503 286053 287446 288234
56302 288234 288734 289804 291934 294595 296826 298336 299585 300874 301981 302773 303541 304430 305092 305230 305123 305230
56286 305230 305607 306088 306769 307986 309983 312798 316315 320244 324230 328051 331497 334148 335777 337046 339174
56271 339174 342587 346447 349856 353006 356639 360891 365388 370222 376059 383181 390983 398637 405940 413408
56257 413408 421690 430997 441050 451593 462935 475807 490703 507586 526241 546537 568312 591415
56245 591415 616032 642431 670164 698017 725136 751743 778342 804650 829711 852612 872580
56234 872580 888838 901071 909731 915234 917088 914489 907525 897078 883659 867199 847984 826965
56222H26965k2011k2739k3097k2625k1608k0939k0899k0743j9665j7667j5413
56211E99559j3566j2411j1830j1500j1132j0494r383p859o466n743n439m776l598
56198D85362k673k518k597k168j386r13p92m02N79J757K484K391J568N74J42N15
56182D81923J228J733K022K324K573K580K450K377K246J955J853K305K933K969
56168E13471K345J901K346L509M749N659O113O051N603N271N608O698Q122R427
56154E86873J0482J1318J1865J2104J2407J3337J4965J6710J8167J9815K2465
56143G50508K6164L0222L4332L9075M5140N2488O0563O8889P7224Q5422R3331
56132A363358J00491J05834J08149J07165J03686R8380R1059Q1661P1367O1760
$$ plain form
56222 826965 804954 782215 759118 736493 714885 693946 673047 652304 632639 614972 599559
56211 599559 585993 573582 561752 550252 539120 528626 519243 511384 504918 499175 493736 488960 485362
56198 485362 482689 480171 477574 475406 474020 473107 472315 471913 472492 474249 476733 479124 480692 481266 481408 481923
56182 481923 483151 484884 486906 489230 491803 494383 496833 499210 501456 503411 505264 507569 510502 513471
56168 513471 515816 517717 520063 523572 528321 533980 540093 546144 551747 557018 562626 569324 577446 586873
56154 586873 597355 608673 620538 632642 645049 658386 673351 690061 708228 728043 750508
56143 750508 776672 806894 841226 880301 925441 977929 1038492 1107381 1184605 1270027 1363358
56132 1363358 1463849 1569683 1677832 1784997 1888683 1987063 2078122 2159783 2231150 2292910
56122B292910N3098M4329L4905K5718J7739J0500K683o079j4856k2902l0706l9065
56110B368274m7761n5938o3543p1435p9899q7845r3839r7246r7881r5340q9556
56099A487991q1586p2929o4244n5479m7023l9683l3553k7888k2280j7195j3076
56088A013055r724o879m705l289k187r35M11J543K463L449M703O073O975O804
56074A017757N836N395O452Q281R340R411R876J1707J4109J5621J5807J5449J5540
56061A160581J6396J7394J7482J6350J4943J4309J4196J3605J2439J1601J1573
56050A320869J2002J2632J3529J4370J4721J5080J6334J8129J9190J9401J9967
56039A496224K1260K2202K2320K2684K4023K5565K6707K8197L0590L3004L4671
$$ plain form
56122 2292910 2346008 2390337 2425242 2450960 2468699 2479199 2481882 2475803 2460947 2438045 2407339 2368274
56110 2368274 2320513 2264575 2201032 2129597 2049698 1961853 1868014 1770768 1672887 1577547 1487991
56099 1487991 1406405 1333476 1269232 1213753 1166730 1127047 1093494 1065606 1043326 1026131 1013055
56088 1013055 1003331 996452 991747 988458 986271 985336 985747 987290 989753 993202 997905 1003978 1010953 1017757
56074 1017757 1023593 1028988 1035440 1043721 1053061 1062472 1072348 1084055 1098164 1113785 1129592 1145041 1160581
56061 1160581 1176977 1194371 1211853 1228203 1243146 1257455 1271651 1285256 1297695 1309296 1320869
56050 1320869 1332871 1345503 1359032 1373402 1388123 1403203 1419537 1437666 1456856 1476257 1496224
56039 1496224 1517484 1539686 1562006 1584690 1608713 1634278 1660985 1689182 1719772 1752776 1787447
56028A787447L6369L9029M2104M4628M6789M9154N1292N2543N3301N4323N5482
56017B312461N6343N7197N8471N9909O1206O2679O4517O6391O8584P2207P7356
56006C017321Q2382Q6069Q9262R3239R7911J02822J08498J15333J22514J29428
55996D044779J36769J45012J53243J60903J69134J78924J89640K00832K13544
55987E592780K28119K42872K57023K72883K92810L16049L40952L68299L99681
55978H311468M34665M72568N15141N64409O19716O80189P48371Q28256R21510
55969A4096293J029153J155135J304953J483093J695959J955742K277685K675268
55961B7673281L160581L745575M438999N247090O182974P270600Q532477R977803
$$ plain form
56028 1787447 1823816 1862845 1904949 1949577 1996366 2045520 2096812 2149355 2202656 2256979 2312461
56017 2312461 2368804 2426001 2484472 2544381 2605587 2668266 2732783 2799174 2867758 2939965 3017321
56006 3017321 3099703 3185772 3275034 3368273 3466184 3569006 3677504 3792837 3915351 4044779
55996 4044779 4181548 4326560 4479803 4640706 4809840 4988764 5178404 5379236 5592780
55987 5592780 5820899 6063771 6320794 6593677 6886487 7202536 7543488 7911787 8311468
55978 8311468 8746133 9218701 9733842 10298251 10917967 11598156 12346527 13174783 14096293
55969 14096293 15125446 16280581 17585534 19068627 20764586 22720328 24998013 27673281
55961 27673281 30833862 34579437 39018436 44265526 50448500 57719100 66251577 76229380
55953G6229380J1607877J3422793J5406967J7504629J9601628K1494936K2847774
55946A98115984K3212635K2202022J9714989J5990428J1398902O183233M31025
55939B97249218n705369j1804503j7213567k1293137k3667953k4333741k3600858
55932A69630090k1935695j9787734j7483257j5214346j3083222j1144086r423219
55925F1558531p929367o660211n601932m728338m008444l416118k930565k531503
55917B3752053k199945j922619j690854j495747j328249j182840j057082r47937
55909A1926780q51745p66961o93464o29446n71970n20111m74758m35534m00469
55900F582322l68436l39487l13062k88092k64774k44134k25951k08901j92576
$$ plain form
55953 76229380 87837257 101260050 116667017 134171646 153773274 175268210 198115984
55946 198115984 221328619 243530641 263245630 279236058 290634960 296818193 297249218
55939 297249218 291543849 279739346 262525779 241232642 217564689 193230948 169630090
55932 169630090 147694395 127906661 110423404 95209058 82125836 70981750 61558531
55925 61558531 53629164 46968953 41367021 36638683 32630239 29214121 26283556 23752053
55917 23752053 21552108 19629489 17938635 16442888 15114639 13931799 12874717 11926780
55909 11926780 11075035 10308074 9614610 8985164 8413194 7893083 7418325 6982791 6582322
55900 6582322 6213886 5874399 5561337 5273245 5008471 4764337 4538386 4329485 4136909
55891D136909j77665j64251j51523j38984j26656j14401j02252r0824q0219o9203
55881B920931n6854m4248l3148k3796j5614r354o738q334j3385k1371l2181m4965
55869B610943n8227p0949q2372r1159r6144r7652r6845r4038q9034q2617p6270
55858A675636p0536o4987n9694n5334n1890m8506m4754m1011l7599l4559l2178
55847A134588l0758k9845k8603k6937k5376k4042k2587k1030j9765j8817j7895
55836H68933j7065j6636j6511j6320j5969j5499j4795j4020j3706j3784j3220
55825G01408j1546r948r716j0315j0300r585r272r651r928r812r821r969r567
55812E71978q507p461o639n621m530m131m390m204k919j089O72K475M307N422
$$ plain form
55891 4136909 3959244 3794993 3643470 3504486 3377830 3263429 3161177 3070353 2990134 2920931
55881 2920931 2864077 2819829 2786681 2762885 2747271 2737917 2731179 2722845 2709460 2688089 2655908 2610943
55869 2610943 2552716 2481767 2399395 2308236 2212092 2114440 2017595 1923557 1834523 1751906 1675636
55858 1675636 1605100 1540113 1480419 1425085 1373195 1324689 1279935 1238924 1201325 1166766 1134588
55847 1134588 1103830 1073985 1045382 1018445 993069 969027 946440 925410 905645 886828 868933
55836 868933 851868 835232 818721 802401 786432 770933 756138 742118 728412 714628 701408
55825 701408 689862 679914 670198 659883 649583 639998 630726 621075 611147 601335 591514 581545 571978
55812 571978 563471 556010 549371 543750 539220 535089 530699 526495 523576 522487 523159 525634 529941 535363
55798E35363N246M211L098K138J173K38n54j282k098l152m583o282p686q333q486
55783E09011q631q602p988p251p390q415r185q971q314p969p748o963n337l144
55769D03103q83Q75J754J892J655J073Jj328k526l747n314o834p588p782q327
55754C66024r171r138p825o458o157o339n845m836m509n285o349o824o608o027
55740B74653n306m574l955l496l132k726k146j405p82n59o63q35j133j821k691
55725B39429l024k538j834j659j994k263k217k197k572l167l303k481j037J31
55711B09274O45J099K043K963K961K189J604J468J051K8r37j361j715k413k991
55696B15908l052l190m004m776m300k746j573j637k274k494k186j801j443q65
$$ plain form
55798 535363 540609 544820 547918 550056 551229 551467 550913 549631 547533 544381 539798 533516 525830 517497 509011
55783 509011 500380 491778 483790 476539 469149 460734 451549 442578 434264 426295 418547 411584 406247 403103
55769 403103 402220 403095 404849 406741 408396 409469 409470 408142 405616 401869 396555 389721 382133 374351 366024
55754 366024 356853 347715 339890 333432 327275 320936 315091 310255 305746 300461 294112 287288 280680 274653
55740 274653 269347 264773 260818 257322 254190 251464 249318 247913 247131 246572 245909 245074 243941 242120 239429
55725 239429 236405 233867 232033 230374 228380 226117 223900 221703 219131 215964 212661 210180 209143 209274
55711 209274 209919 211018 213061 216024 218985 221174 222778 224246 225297 225325 224388 223027 221312 218899 215908
55696 215908 212856 209666 205662 200886 196586 193840 192267 190630 188356 185862 183676 181875 180432 179567
55682A79567j5Q64J564K032K231K106J756J448J333J284J093Q34P87R53Q53O8
55666A98758j174k204k589k423k051j783j753j691r92N21K024K428J699Q96Q85
55651A90551J564K403L090L331K789J634O39K22j50j085k306l163l674m348n115
55636A86382n315m756m079l869l970l995l991m184m370m056l153k141j481j154
55622A35868r91j106j675k404k618k004r50NO62Q81L49q61j858j778r76o61j278
55605A18605j997k007j571j391j514j460j063o02k47P8L73N49O83R21J114Q98
55589A11369J83o80j312j661j815j670j037r8N26M23rP2Q55J540J342M58l14o28
55571A07544p04o77m88l64o52j082q81J14J054J189P93O34R12J228J258J021N81
$$ plain form
55682 179567 179552 180416 181980 184012 186243 188349 190105 191553 192886 194170 195263 196097 196884 197837 198690 198758
55666 198758 197584 195380 192791 190368 188317 186534 184781 183090 182098 182619 184643 187071 188770 189666 190551
55651 190551 192115 194518 197608 200939 203728 205362 206001 206223 206073 204988 202682 199519 195845 191497 186382
55636 186382 181067 176311 172232 168363 164393 160398 156407 152223 147853 143797 140644 138503 137022 135868
55622 135868 134877 133771 132096 129692 127074 125070 124120 124125 124787 125668 126017 125156 123298 121520 120544 119883 118605
55605 118605 116608 114601 113030 111639 110125 108665 107602 107000 106753 106831 107204 107753 108436 109357 110471 111369
55589 111369 111552 110872 109560 107899 106084 104414 103377 103279 103805 104228 104219 104291 105146 106686 108028 108486 108172 107544
55571 107544 106840 106163 105675 105311 104659 103577 102696 102810 103864 105053 105846 106480 107392 108620 109878 110899 111480
55554A11480q9r72j906k547k471j562l25N12P60P73P51N19P1k19j25K00O17J076
55536A06543J159L58r35j492q12J67M24J60P4R9j58m10j59J98r7p77q16o2M84
55517A03948J98l87o14o29q47j207j414j474j546j635j664j568j121j49R30J270
55501I2091N94l83q12o72n36p35j065j148p81o1O51R79R14P85P75O57J75n14r54
55482H9960q26k09N14Q62N82j40q41j140r09k15O14R85M68o35j417j217k11Q97
55464H7122J569J722J548J204O82j16j095j907k195j897j207l72L11N20K20j40
55448H5969q1L42O80O93N03J93k80p81r87q04m47j04J94L23R9k56j72N30J251
55429H6865J265N72k14o28p63q48q37m78K08Q10J030J112J416J662J152n9q36
$$ plain form
55554 111480 111391 110419 108513 105966 103495 101933 101608 102120 102880 103653 104404 104923 104994 104775 104650 104850 105467 106543
55536 106543 107702 108060 107125 105633 104821 104988 105412 105572 105646 105745 105587 105177 105018 105216 105119 104342 103526 103464 103948
55517 103948 104146 103759 103145 102516 101669 100462 99048 97574 96028 94393 92729 91161 90040 89891 90821 92091
55501 92091 92685 92302 91490 90818 90282 89547 88482 87334 86553 86492 87143 88122 89036 89821 90596 91253 91428 90914 89960
55482 89960 89134 88925 89439 90301 90883 90743 89902 88762 87853 87638 88252 89237 89705 89070 87653 86436 86225 87122
55464 87122 88691 90413 91961 93165 93847 93731 92636 90729 88534 86637 85430 85058 85369 85889 86109 85969
55448 85969 85888 86230 86910 87603 88106 88299 88019 87238 86251 85447 85000 84896 85090 85413 85512 85256 85084 85614 86865
55429 86865 88130 88702 88488 87860 87097 86249 85412 84934 85142 85952 86982 88094 89510 91172 92324 92265 91429
55412I1429l42P33J065M25k91n65p49j026r10k35K46j35r82j407j109l81M61J087
55394H7314J010J31q15r56k94M33P13N89J54o57j695k468k467j517P6J542K017
55377H3110J298Q4p50r84q46m17K47P22N65O6l6L67O16L14m6J41P22J059R01N96
55357H7729N15O20O20L67P2J10N76J112J225P80P1n42q77r11p41n25l08K9M57
55338I0379O21K79k11j80M74J115J125N37j44m76l80j42k26p51j230j133p04p11
55320H8242j333j752j177J81J467K113K058J436N37j65l97l97m93n36k10K54K58
55303I0086l22r29j044o84j15N12J030J209J083J058J354J593J224K27q12j313
55287I4157j182p50l64r2K19N89P30L88j45k20L41R12Q10J92j32K72R38J031K51
$$ plain form
55412 91429 91087 91820 92885 93310 93019 92454 91705 90679 89769 89534 89780 89645 88663 87256 86147 85766 86227 87314
55394 87314 88324 88455 87640 86684 86390 86823 87536 88125 88279 87622 85927 83459 80992 79475 79551 81093 83110
55377 83110 84408 84492 83742 82758 81912 81495 81742 82464 83029 83095 83059 83426 84042 84356 84310 84451 85173 86232 87133 87729
55357 87729 88244 88864 89484 89851 89923 90033 90609 91721 92946 93726 93797 93255 92378 91467 90726 90201 89893 89922 90379
55338 90379 91000 91279 91068 90888 91362 92477 93602 94139 93995 93519 93139 92997 92771 92020 90790 89657 88953 88242
55320 88242 86909 85157 83980 84161 85628 87741 89799 91235 91772 91607 91210 90813 90320 89784 89574 89828 90086
55303 90086 89764 88835 87791 87107 86992 87504 88534 89743 90826 91884 93238 94831 96055 96282 95470 94157
55287 94157 92975 92225 91861 91769 91988 92577 93307 93695 93550 93330 93671 94583 95393 95585 95453 95725 96663 97694 97945
55268I7945q52j399r57R5R67J236J133J108J270J415J344R55K01p89j583j808
55252A00281j557j237r68n21J78P82R09N85J36j97m07o56j050j404j280n33K88
55235I3349N05K39K45P19R53N02j0J20M77K48l02j13Q63J353N68o53j116q53o43
55216I6451n92k04M33O05J38k34N1O30Q68O58K72j51n07n02k8M60M18n4m08m52
55196I7852n08p25p42k64L98O51L14k38n67n64l86j85K6K84N18N49L00n2k72l51
55176I6038m18m35k33O7M8m05p49m07M51J125J306J290J310J172Q00O56J122J808
55158A04546J976J569J222J246J139L91o83j298j166o73k54l4o6m30r53j175q88
55141A04469m82m36o57o26j40M71Q50R68Q32L17n07j098r31k00L10J09m91p89
$$ plain form
55268 97945 97093 95694 94737 94832 95799 97035 98168 99276 100546 101961 103305 104260 104461 103672 102089 100281
55252 100281 98724 97487 96519 95998 96176 96958 97867 98452 98588 98391 97984 97328 96278 94874 93594 93061 93349
55235 93349 93854 94093 94338 95057 96010 96512 96502 96622 97099 97347 97045 96932 97795 99148 99716 99063 97947 97094 96451
55216 96451 95859 95655 96088 96693 96831 96597 96648 97278 98146 98804 99076 98925 98418 97916 97888 98348 98766 98712 98304 97852
55196 97852 97344 96619 95877 95613 96011 96662 96976 96738 96171 95607 95221 95036 95062 95346 95864 96413 96713 96661 96389 96038
55176 96038 95620 95185 94952 95019 95067 94662 93913 93506 93957 95082 96388 97678 98988 100160 100960 101616 102738 104546
55158 104546 106522 108091 109313 110559 111698 112089 111406 110108 108942 108269 108015 107981 107915 107485 106532 105357 104469
55141 104469 103987 103551 102894 102268 102128 102599 103449 104417 105249 105566 105059 103961 103030 102830 103140 103249 102758 101969
55123A01969m09M25J126J145L86o45j221j089o84n37o45o18l13JJ20K25N66J059
55105A00861J423J576J632J551J117L39l07l45J39N72N21P3l84n84m93k17Q7K69
55087A07830L03K72K22J20nl6K7O4O6K20N56P03L08m46j024j148r48o06j87J84
55067A06475L58L97M61L85k33j363k280k272j345j59O16P47N47O55J405K233K089
55050A08716P00r08j544j200q26r32j062o36J63O92O81N06O50J092J335J007L24
55033A08758j45j48P3K02J99R7j74n90r25j033r31n12M15J473J708P77l09l30
55015A08605N78J217R85L67j07l95l43M24J591K047J249L2n12l59j48jL77Q47
54997A16454Q95N09J98J84J74L0L1L53P36Q63P56O23N74N95N12K5r04j747j814
$$ plain form
55123 101969 101560 101985 103111 104256 104642 103997 102776 101687 101003 100466 99821 99203 98890 98891 99011 99236 99802 100861
55105 100861 102284 103860 105492 107043 108160 108499 108192 107847 107986 108558 109079 109152 108768 108184 107691 107474 107561 107830
55087 107830 108133 108405 108627 108747 108742 108706 108733 108797 108863 109083 109639 110342 110650 110204 109180 108032 107084 106478 106291 106475
55067 106475 106833 107230 107691 108076 107843 106480 104200 101928 100583 100424 101040 101787 102334 102989 104394 106627 108716
55050 108716 109416 108508 106964 105764 104938 104006 102944 102308 102471 103163 103844 104350 105000 106092 107427 108434 108758
55033 108758 108613 108465 108538 108740 108939 109036 108862 108272 107347 106314 105383 104871 105286 106759 108467 109244 108935 108605
55015 108605 109183 110400 111385 111752 111645 111250 110907 111331 112922 114969 116218 116250 115738 115379 115231 115230 115607 116454
54997 116454 117349 117858 118056 118240 118414 118444 118475 118828 119564 120427 121183 121806 122380 122975 123487 123512 122608 120861 119047
54978A19047j079k49R8M0n2m0J45P46J822K828K981K118R40K25M3r7m17n06K0
54959A28613P81R95N54J73K62K57l77r76m59R13J622R44p5k41J29l4p74j148p67
54940A30392k67j68j83J00N31P66P43N48K02j04rN37J199J875K868M187N234N643
54922A54094N849O290O566O177N621N856O744P014N881L917K117P73m56j965l925
54907B10553o096p680p968p329o894p006o775n598m237l654l504k831j734j167
54893A38080j220q57L80J521J544Q54O40J220J733J471R12J166K596M311N235
54878A59586N434N939P183Q265Q153P054N885M886L579J931N24m65j577l089m626
54863B08662n940p255q419q603p490o038n333n249m953m257l646l262k751k010
$$ plain form
54978 119047 117968 117719 117817 117857 117805 117765 117910 118656 120478 123306 126287 128405 129345 129570 129613 129516 129099 128593 128613
54959 128613 129394 130389 130943 131116 131378 131635 131258 130282 129823 130736 132358 133302 133227 132986 133115 133081 132307 131159 130392
54940 130392 130125 129957 129774 129874 130405 131171 131914 132462 132664 132560 132551 133088 134287 136162 139030 143217 148451 154094
54922 154094 159943 166233 172799 178976 184597 190453 197197 204211 210092 214009 216126 216899 216443 214478 210553
54907 210553 204457 196777 188809 181480 174586 167580 160805 155207 150970 147316 143812 140981 139247 138080
54893 138080 136860 136003 136383 137904 139448 140302 140942 142162 143895 145366 146278 147444 150040 154351 159586
54878 159586 165020 170959 178142 186407 194560 201614 207499 212385 215964 217895 218419 217954 216377 213288 208662
54863 208662 202722 195467 187048 178445 170955 164917 159584 154335 149382 145125 141479 138217 135466 133456
54849A33456j350q96m80j31j22m32o69n93l30qL08L28k89j327j969j651o82J24
54831A23287J91m11j113j273p69j61o1l44l24K66R26J052O30L7m66p60o93k23
54813A19791L57O71P02P57J027J339J462J384J191Q16J57n37p36k13N65R41P88
54796A30462M32J7o09j321j634j368r62p47m38K66R96J199R95R66J241J381J115
54779A31991O81M24N72J248K247K880K669K169K401L479M487M857N073N724O637
54764A77539P395P977Q348P940O346M170K448J400L55j174k938m504n708o459
54750B03135o595o161n561n151m922m687m417m146l694k756j359p6M21J06l27
54735A53810j96M44J025J298J523J915K268K312K145K100K404L089M015M821N166
$$ plain form
54849 133456 132106 131210 130730 130599 130477 130045 129376 128783 128453 128445 128753 129081 128792 127465 125496 123845 123163 123287
54831 123287 123478 123067 121954 120681 119912 119751 119690 119346 119022 119288 120214 121266 121896 121933 121467 120707 120014 119791
54813 119791 120148 120819 121521 122278 123305 124644 126106 127490 128681 129497 129654 129117 128381 128168 128733 129674 130462
54796 130462 130894 130911 130302 128981 127347 125979 125017 124270 123832 124098 125094 126293 127288 128254 129495 130876 131991
54779 131991 132672 133096 133668 134916 137163 140043 142712 144881 147282 150761 155248 160105 165178 170902 177539
54764 177539 184934 192911 201259 209199 215545 219715 222163 223563 223918 222744 219806 215302 209594 203135
54750 203135 196540 190379 184818 179667 174745 170058 165641 161495 157801 155045 153686 153610 154031 154137 153810
54735 153810 153614 154058 155083 156381 157904 159819 162087 164399 166544 168644 171048 174137 178152 182973 188139
54720A88139N122N122N299N186M287K693R22n98j689k411l112m182n458o211o048
54705A87061n410m836m225l365k712k872l574l909l518k859k318j859j516j483
54691A42605j579j377r76r16j112p85K28R57O29k07n99n45o38q94q51n13l21k63
54673A32843J22Q18J187Q40R7n30p86n69O2O98R10Q10Q14Q30M25k06k65L44O35
54654A39079q5j140j433r28m09k57k07j05q5j00N9K83K73J33K47N57O19L35O1
54635A36897r3m02p97p51q4O82J072J171J090N93k60p25k59O02R17N78J88j0l38
54616A40071q93j232j015l91L07Q82J190J158R18O28J84m89r99q90m21l10o25
54599A38073o08J60J096J456J288J092R98P78L96J3k77m19k83K2R0j74k57K09
$$ plain form
54720 188139 193261 198383 203682 208868 213155 215848 216770 216172 214483 212072 208960 204778 199320 193109 187061
54705 187061 181651 176815 172590 169225 166513 163641 160067 156158 152640 149781 147463 145604 144088 142605
54691 142605 141026 139649 138673 137757 136645 135860 136088 137045 137674 137467 136868 136323 135685 134791 133940 133427 133106 132843
54673 132843 132965 133783 134970 135810 135907 135377 134591 134022 134084 134782 135692 136502 137316 138146 138571 138365 138100 138444 139079
54654 139079 138994 137854 136421 135493 135084 134827 134620 134515 134430 134330 134389 134672 134945 135078 135325 135882 136501 136836 136897
54635 136897 136804 136402 135605 134854 134770 135452 136524 137695 138785 139378 139118 138393 138134 138736 139653 140231 140419 140409 140071
54616 140071 139178 137946 136931 136540 136847 137729 138919 140077 140995 141623 141807 141318 140319 139429 139008 138698 138073
54599 138073 137465 137625 138721 140177 141465 142557 143555 144333 144729 144742 144465 144046 143763 143785 143875 143701 143444 143653
54581A43653P63Q12N69O01P03J74q37j328r15l36j59P9Q18J495J434J029J043
54564A49598J262Q87K6m09k51l84j107j398m23J069J712J293P24N74N68M04K24
54547A54369J97K53L77O44Q56P09L75M26R64J425J458J450J846K367K390J800
54531A71906J045N59M82O95Q27M64k71o24j01Q02J203R73P06O86N13j97j262k222
54513A76184k744k673k080j354r46q54o81k59K07N68Q21P62J66n71o33N9N49J89
54495A66710l68j76N21P03K14o1L30P06M19k2L64J617K721K734J660K64o10n52
54477A77174K26J147J843K449L197L872L972L398K616K000J440P62K52L10P41
54462B05399Q71L66l77p71o72l61j55j65k97k96lM07N97M97L23J17l24r13j174
$$ plain form
54581 143653 144416 145228 145797 146398 147101 147275 146438 145110 144195 143859 143700 143779 144597 146092 147526 148555 149598
54564 149598 150860 151747 151773 151364 151113 150729 149622 148224 147801 148870 150582 151875 152599 153173 153741 154145 154369
54547 154369 154566 154819 155196 155840 156696 157405 157780 158206 159170 160595 162053 163503 165349 167716 170106 171906
54531 171906 172951 173510 173992 174687 175514 175978 175707 175083 174982 175784 176987 177960 178666 179352 179865 179668 178406 176184
54513 176184 173440 170767 168687 167333 166387 165533 164852 164593 164800 165368 166189 166951 167117 166546 165913 165972 166521 166710
54495 166710 166342 166166 166687 167390 167604 167543 167873 168579 168998 168976 169340 170957 173678 176412 178072 178336 177726 177174
54477 177174 177400 178547 180390 182839 186036 189908 193880 197278 199894 201894 203334 204096 204348 204658 205399
54462 205399 206270 206636 206259 205488 204816 204455 204300 204135 203838 203542 203539 203946 204543 205040 205363 205480 205156 204243 203069
54443B03069r45p66j092j540j451r34p00j020j504j866k221k471k092q43O90J566
54427A85880J342L90m04l34M07Q28L35l94l13M39P48K55j50J44M72K4q26j104
54409A87739n99O0L53K47q6l88m37l93p14j277j193k4J311J623J011N54P66J193
54391A89746J407J491J522J283N96m53j591k287j904n36O61O75j56q45j190j519
54375A86900j459l83J051J306K16o26k26N15N61L94P94J181O30l14l51M13N70
54358A91172l55j193r03M7N38K01n26j104j174o15K08N63P8p73j198r02l25j42
54340A83597o19j287j337n68J53j83j411k314k144j432j005q05l11L36M05k72
54324A70803r19q28k34J17j54q61j622j952j317L14J985K441J489K67r8L32P66
$$ plain form
54443 203069 202124 201358 200266 198726 197275 196341 195641 194621 193117 191251 189030 186559 184467 183624 184314 185880
54427 185880 187222 187612 187208 186874 187281 188109 188444 188050 187737 188176 188924 189179 189029 189173 189645 189669 188843 187739
54409 187739 187140 187200 187553 187800 187714 187326 186889 186496 185782 184505 183312 183288 184599 186222 187233 187787 188553 189746
54391 189746 191153 192644 194166 195449 196045 195592 194001 191714 189810 189274 189935 190610 190454 189609 188419 186900
54375 186900 185441 185058 186109 187415 187631 187005 186779 187294 187855 188249 189043 190224 190854 190540 190189 190602 191172
54358 191172 190817 189624 188721 188768 189306 189507 188981 187877 186703 186088 186296 186859 186937 186164 184966 184064 183739 183597
54340 183597 182978 181691 180354 179786 179939 179756 178345 176031 173887 172455 171450 170645 170334 170670 171075 170803
54324 170803 169884 169056 168822 168939 168785 167924 166302 164350 163033 163347 165332 167773 169262 169529 169431 169763 170529
54307A70529Q93J063J456J695J350M76m42q54m83L95J048R91N47L37L45j3q55
54290A78478j517j496j088p60m38P1L71n5r09j241o70J12K58j91m60q5N13N65
54272A71458m4n81l53L98P96M21l02q74j255j496j293m30O25J121Q82L78L5j09
54254A69377j57j63k25m30o95q30p25l12L87R36N89p18j801j372K76J494J232
54237A66863R0p86j059j097j125j094r46n52K71J225J424M74p21r86m88m55j290
54220A59748j942j532o46l93p86r36n78l84p04r07l68N04Q44N45K61L18L49R0
54202A53483n2L52R56J024M59j08k50k67m89n97r8P36J020M39k85m05j01n6l54
54183A55407m76k58j34l13l71l8J71k76r41q98q3N37K74m01n79j8P15R76O10r
$$ plain form
54307 170529 171422 172485 173941 175636 176986 177462 177020 176166 175683 176078 177126 178117 178664 179001 179346 179333 178478
54290 178478 176961 175465 174377 173617 173179 173250 173621 173566 172657 171416 170746 170858 171116 170925 170465 170380 170893 171458
54272 171458 171414 170833 170480 170878 171674 172095 171793 170919 169664 168168 166875 166445 167070 168191 169073 169451 169486 169377
54254 169377 169220 169057 168832 168402 167707 166877 166152 165840 166227 167163 167752 167034 165233 163861 164137 165631 166863
54237 166863 166953 166167 165108 164011 162886 161792 160846 160294 160565 161790 163214 163688 162967 161981 161493 161038 159748
54220 159748 157806 156274 155628 155235 154449 153513 152935 152551 151847 150940 150572 151076 151920 152465 152726 153044 153393 153483
54202 153483 153431 153783 154739 155763 156222 156114 155864 155597 155108 154511 154413 155149 156169 156608 156323 155918 155817 155761 155407
54183 155407 154931 154673 154539 154226 153855 153817 153988 153712 152771 151873 151790 152327 152601 152200 151621 151603 152318 153294 153904 153895
54163A53895k94K2N46O05M5o10r00r85j161j231p89N0O55O44L12K06N12R68J188
54144A53678J011N87K27J27K72N60Q64R91P96M30K71M74Q23J058J145J028M91
54127A64833m33j214j361j031p25n50k30K10L26j00o58p57k08O75J382J498J034
54110A62691N02M28P62R15N32r2m48m42l83m90o39n59j56L49N70L25j95o47q94
54091A62129j029j057q10k35M04P05M76j24o59o75m2Q81J507J513J045M91J66
54074A64686J71M35Q02J139J315J185P00R6k26j81q1j20n1K94N09R0o85r87n52
54055A68539QJ38M7K06N62O82M44K00L68J046J927K493K477K305K741L883M804
54038A92870M577L423K408K150K343K505K656L004L444L711L815L972M201M330
$$ plain form
54163 153895 153601 153623 154169 154774 154819 154209 153309 152324 151163 149932 149143 149193 149848 150492 150804 151010 151522 152490 153678
54144 153678 154689 155276 155503 155630 155902 156462 157326 158317 159113 159543 159814 160288 161111 162169 163314 164342 164833
54127 164833 164400 163186 161825 160794 160069 159519 159289 159499 159825 159725 159067 158310 158102 158777 160159 161657 162691
54110 162691 163193 163621 164383 165298 165830 165738 165290 164848 164465 163975 163336 162777 162621 162970 163540 163865 163670 163023 162129
54091 162129 161100 160043 159233 158998 159402 160107 160583 160459 159800 159125 159083 159964 161471 162984 164029 164520 164686
54074 164686 164857 165292 166094 167233 168548 169733 170433 170529 170303 170122 170041 169921 169870 170164 170673 170763 170078 169091 168539
54055 168539 168547 168685 168732 168938 169500 170182 170626 170826 171194 172240 174167 176660 179137 181442 184183 188066 192870
54038 192870 197447 200870 203278 205428 207771 210276 212932 215936 219380 223091 226906 230878 235079 239409
54024B39409M340M330M136L329J806J61p84p37o5O62R75N69m98j619k059j790
54008B52165j544j888k546k883k755k493k338k321k560l177l917m239l869l079
53994B12556k340j928j785j625j242q57r27j376j417n94L14J11j194k310k253
53979A93133j346m54j2q7p33j756k493k386j495k68R11J674J660R74K81Rj30m40
53961A87042m63L94J765K543K220J397R26J083J635K237K594K566K359K353K661
53946B13312L009L154L215L499M160N057N888O502P123Q149R583J0931J1877J2773
53932C08232J4048J5335J5734J4948J3579J2151J0329P423L373j068m968p733
53920D01383r273r895j0038r841r046p422n309l488k437j845j034K46J575K404
$$ plain form
54024 239409 243749 248079 252215 255544 257350 257511 256727 255990 255925 256587 257562 258131 257633 256014 253955 252165
54008 252165 250621 248733 246187 243304 240549 238056 235718 233397 230837 227660 223743 219504 215635 212556
53994 212556 210216 208288 206503 204878 203636 202779 201852 200476 199059 198465 198779 198890 197696 195386 193133
53979 193133 191787 191333 191321 191234 190501 188745 186252 183866 182371 182103 183014 184688 186348 187322 187603 187612 187482 187042
53961 187042 186579 186973 188738 191281 193501 194898 195824 196907 198542 200779 203373 205939 208298 210651 213312
53946 213312 216321 219475 222690 226189 230349 235406 241294 247796 254919 263068 272651 283582 295459 308232
53932 308232 322280 337615 353349 368297 381876 394027 404356 411779 415152 414084 409116 401383
53920 401383 392110 382215 372177 362336 353290 345868 340559 337071 334634 332789 331755 332001 333576 335980
53906C35980K625K467K105J602J191J130J242R55oj224k092k543k960l609m312
53891C32551m699m587m210m104m591n286n467m983m480m427m460m040l401l221
53877B70595l606l976l894l449k908k528k680l534m541m774l973k768j808j171
53863B24985p93q57j353j787j763j508j437j456j223q14o88r46j141r03n01n09
53847B07306j054j536j224r7J075J514J161N35J08J02N61J179J281N37l74m78
53831B10596P3J22p94j689j566q45n75q14o84J75J091J362J031N29J28n8j0O3
53813B08135j20m47m53J3N29P72J062J866K951L486L034K179J895K418L059L175
53797B33554L055L488M583N480N384M425L306K466K032K077K461K604K090J368
$$ plain form
53906 335980 338605 341072 343177 344779 345970 347100 348342 349297 349291 348067 345975 343432 340472 336863 332551
53891 332551 327852 323265 319055 314951 310360 305074 299607 294624 290144 285717 281257 277217 273816 270595
53877 270595 266989 263013 259119 255670 252762 250234 247554 244020 239479 234705 230732 227964 226156 224985
53863 224985 224192 223335 221982 220195 218432 216924 215487 214031 212808 211994 211306 210360 209219 208316 207815 207306
53847 207306 206252 204716 203492 203395 204470 205984 207145 207680 207788 207890 208451 209630 210911 211448 211074 210596
53831 210596 210669 210791 209997 208308 206742 205897 205322 204508 203824 203999 205090 206452 207483 208012 208140 208082 208072 208135
53813 208135 208015 207568 207115 207128 207657 208429 209491 211357 214308 217794 220828 223007 224902 227320 230379 233554
53797 233554 236609 240097 244680 250160 255544 259969 263275 265741 267773 269850 272311 274915 277005 278373
53783B78373J177J385J116J71n34l22K10N4p90j507j812k311l418m558m743l688
53767B58803k089r08n55p34r54j023r69o79K0R61J716K238K982M125N130N486
53751B73550N582O209P328P979P414N828L852J887R0j512l158n222p604r576j0515
53736B82132j0462r739q412o581m788l586k842k007j020m08m55p72q21m93l2L05
53720B30019L84K52J73L58N62K99m44r77o67L43J352J873J981K021K167K294K224
53703B44214K005J871J788J413P41M71J133K120K360J940K074L173L989L390K066
53688B74748J542K061K584K508K186J899J442R15Q07J000O70l70j139q74j65l5
53672B89779n25r22q90o38k39M00J053J337J229R64N10l07j207j574j167k87P00
$$ plain form
53783 278373 279550 280935 282051 282222 281688 281366 281576 281630 280840 279333 277521 275210 271792 267234 262491 258803
53767 258803 256714 255806 255251 254517 253563 252540 251571 250892 250912 251873 253589 255827 258809 262934 268064 273550
53751 273550 279132 285341 292669 300648 308062 313890 317742 319629 319719 318207 315049 309827 302223 292647 282132
53736 282132 271670 261931 253519 246938 242150 238564 235722 233715 232695 232287 231832 231060 230239 229746 229714 230019
53720 230019 230403 230655 230828 231186 231748 232047 231603 230626 229959 230302 231654 233527 235508 237529 239696 241990 244214
53703 244214 246219 248090 249878 251291 252032 252503 253636 255756 258116 260056 262130 265303 269292 272682 274748
53688 274748 276290 278351 280935 283443 285629 287528 288970 289885 290692 291692 292362 291992 290853 289979 289814 289779
53672 289779 289254 288332 287442 286804 286565 286965 288018 289355 290584 291548 292058 291751 290544 288970 287803 287516 288216
53655B88216J561K021J888J434J180J276J475J741K309L032L268K634J454K23
53641C13712r18j958k672k932l012l167l225k968k654k665k762k275j088N4M38
53626B81908K03P2M38R99J255J133J027J266J688J856J712J746K308K965K935
53611C03511K161J521J761K598L167L101K719K344J952J580J581K127K790K906
53597C35819K264J212K79j29J58Q73J367J225P78O08P42O98L59J19J33K6l69o25
53579C45537m97n11j148j933k061j647j504j798j793j125m11l09o69j020j319
53564C27792j674j787j323m96K01O37R15R06M99J30L87J177J810J947J814J525
53548C34460R20K61K84J184K137K397K309K643L340L688L538L494L917M429M663
$$ plain form
53655 288216 289777 291798 293686 295120 296300 297576 299051 300792 303101 306133 309401 312035 313489 313712
53641 313712 312794 310836 308164 305232 302220 299053 295828 292860 290206 287541 284779 282504 281416 281470 281908
53626 281908 282111 282183 282621 283620 284875 286008 287035 288301 289989 291845 293557 295303 297611 300576 303511
53611 303511 305672 307193 308954 311552 314719 317820 320539 322883 324835 326415 327996 330123 332913 335819
53597 335819 338083 339295 339574 339445 339603 340476 341843 343068 343846 344454 345196 345894 346253 346372 346505 346531 346162 345537
53579 345537 345040 344529 343381 341448 339387 337740 336236 334438 332645 331520 331109 330800 330131 329111 327792
53564 327792 326118 324331 323008 322512 322713 323350 324265 325171 325670 325800 326187 327364 329174 331121 332935 334460
53548 334460 335380 335641 335925 337109 339246 341643 343952 346595 349935 353623 357161 360655 364572 369001 373664
53533C73664M869N428O174O620O643O648P098Q064R187R975J0264J0402J0847
53520D75883J1652J2591J3693J5183J6801J7776J7794J7582J8070J9257K0422
53509F56704K1185K1860K2763K3668K4154K4181K4163K4534K5224K5605K5188
53498I19229K4414K4341K5332K6494K6866K6653K6686K7052K7072K6449K5557
53487A206145K4606K3406K2008K0756J9564J7968J6158J5008J4712J4310J3133
53476A407774J1829J1280J1236J0866R988Q865P383N410L494K082L93k679o684
53463A481237r808j1153j1687j2666j4153j5584j6863j8207j9474k0295k0664
53452A310683k0962k1627k2818k4162k4794k4227k3126k2618k2758k2496k1300
$$ plain form
53533 373664 378533 383961 390135 396755 403398 410046 417144 425208 434395 444370 454634 465036 475883
53520 475883 487535 500126 513819 529002 545803 563579 581373 598955 617025 636282 656704
53509 656704 677889 699749 722512 746180 770334 794515 818678 843212 868436 894041 919229
53498 919229 943643 967984 993316 1019810 1046676 1073329 1100015 1127067 1154139 1180588 1206145
53487 1206145 1230751 1254157 1276165 1296921 1316485 1334453 1350611 1365619 1380331 1394641 1407774
53476 1407774 1419603 1430883 1442119 1452985 1462973 1471838 1479221 1484631 1488125 1490207 1490600 1487921 1481237
53463 1481237 1471429 1460276 1448589 1435923 1421770 1406186 1389323 1371116 1351642 1331347 1310683
53452 1310683 1289721 1268094 1245276 1221114 1196320 1172093 1148967 1126349 1103591 1081095 1059795
53441A059795j9899j9056j8506j7777j7229j7311j7354j6063j3094r369o039l665
53429H84433k300j592q41N17K410M447O509Q630J0610J2324J4181J6615J9183
53416I75126K0888K1412K1483K1986K3229K5110K7318K9299L0553L1224L1970
53405A259598L3190L4741L6486L8557M0959M3380M5613M7696M9612N1275N2948
53394A734055N5061N7437N9266O0093O0362O0593O0665O0292N9633N8907N7885
53383B384249N6324N4534N2861N0897M7934M4058M0117L6595L3183K9534K5862
53372B856148K2586J9735J6930J3680R633M801m53n896j1867j8784k6320l3547
53360B846646m0038m6194n2218n7362o0725o2549o4014o5792o7352o7808o6999
$$ plain form
53441 1059795 1039896 1020840 1002334 984557 967328 950017 932663 916600 903506 894137 888098 884433
53429 884433 882133 880541 879700 880217 882627 887074 893583 902213 912823 925147 939328 955943 975126
53416 975126 996014 1017426 1038909 1060895 1084124 1109234 1136552 1165851 1196404 1227628 1259598
53405 1259598 1292788 1327529 1364015 1402572 1443531 1486911 1532524 1580220 1629832 1681107 1734055
53394 1734055 1789116 1846553 1905819 1965912 2026274 2086867 2147532 2207824 2267457 2326364 2384249
53383 2384249 2440573 2495107 2547968 2598865 2646799 2690857 2730974 2767569 2800752 2830286 2856148
53372 2856148 2878734 2898469 2915399 2929079 2938712 2943513 2943060 2937164 2925297 2906513 2880193 2846646
53360 2846646 2806608 2760414 2708196 2650834 2590109 2527560 2463546 2397754 2330402 2262594 2195595
53349B195595o5463o3684o1752n9714n7936n6847n6512n6556n6482n5918n4678
53338A550053n2778n0530m8342m6294m3966m0920l7306l3802l0944k8649k6387
53327A110135k3739k0796j8097j6142j4919j3892j2589j1055r595q258o829n284
53315I48940l873k731j640l42J151K590L688M270M505M998O336Q388J0403J1893
53301I98576J3093J4430J5922J7448J9182K1276K3369K4895K5806K6523K7263
53290A227783K7857K8214K8491K8741K8744K8360K7685K6811K5709K4395K2871
53279A525661K0959J8537J6028J4133J2867J1356Q879N802L044R84q18k977n741
53266A628714q909j1968j4498j6679j9209k2420k5720k8280l0032l1550l3123
$$ plain form
53349 2195595 2130132 2066448 2004696 1944982 1887046 1830199 1773687 1717131 1660649 1604731 1550053
53338 1550053 1497275 1446745 1398403 1352109 1308143 1267223 1229917 1196115 1165171 1136522 1110135
53327 1110135 1086396 1065600 1047503 1031361 1016442 1002550 989961 978906 969311 961053 954224 948940
53315 948940 945067 942336 940696 940354 941505 944095 947783 952053 956558 961556 967892 976280 986683 998576
53301 998576 1011669 1026099 1042021 1059469 1078651 1099927 1123296 1148191 1173997 1200520 1227783
53290 1227783 1255640 1283854 1312345 1341086 1369830 1398190 1425875 1452686 1478395 1502790 1525661
53279 1525661 1546620 1565157 1581185 1595318 1608185 1619541 1628420 1634222 1637266 1638250 1637432 1634455 1628714
53266 1628714 1619805 1607837 1593339 1576660 1557451 1535031 1509311 1481031 1450999 1419449 1386326
53255A386326l4518l5529l6207l6498l6228l5573l5014l4700l4258l3444l2431
53244A001926l1320k9903k8310k7275k7242k7594k7411k6719k6293k6369k6297
53233F97193k5584k4514k3440k2075k0020j7596j5614j4430j3672j2889j2044
53222D95315j1302j0698j0214r895r709r406q787q013p476p354p440p399p134
53209C80488o785o534o412o361o342o318o114n434m257l154k911l648m537m705
53195C06976m200l728l573l268k465j578j281j738k539l203l375k908k121j716
53181B69283j995k406k262j720j490j723j847j475q87m28n5L41O61Q85J131J221
53165B57234P18k78r53p94k71l3K5L14O08M10j01k02K65P22P61N62K93j75p66
$$ plain form
53255 1386326 1351808 1316279 1280072 1243574 1207346 1171773 1136759 1102059 1067801 1034357 1001926
53244 1001926 970606 940703 912393 885118 857876 830282 802871 776152 749859 723490 697193
53233 697193 671609 647095 623655 601580 581560 563964 548350 533920 520248 507359 495315
53222 495315 484013 473315 463101 453206 443497 434091 425304 417291 409815 402461 395021 387622 380488
53209 380488 373703 367169 360757 354396 348054 341736 335622 330188 325931 322777 319866 316218 311681 306976
53195 306976 302776 299048 295475 292207 289742 288164 286883 285145 282606 279403 276028 273120 270999 269283
53181 269283 267288 264882 262620 260900 259410 257687 255840 254365 253478 253050 252995 253336 253997 254882 256013 257234
53165 257234 257952 257674 256721 255927 255656 255623 255648 255962 256570 256980 256879 256677 256942 257664 258425 258987 259280 259105 258339
53146B58339r99o32j4M51P53R44Q54M56J35J87L56K50n0j95j08M1K19M60N01k7
53126B61921j015j783j703p69M14J062P70j49r16j096j054j323j688j377k69O43
53110B51668L24j024k175k298j730j270j130r43o16o07j230k061k367j930j104
53095B31507k42N30R80Q04J16m85o08m82m36l60l8L11L12P2M4K99M00M0n91j086
53075B31087j157o63K62J090J314J093J045J256J015j42j604k307j920r89j53
53060B29227L40M33J27l50o72p64q37r92j061r02o07l22l7L43Q51J439J978K207
53042B30401J880J086K63k18m26p29j323j963k174j738r32k40J47L98N72L68l66
53025B25006j120j164m64K95O33P77J044J216Q92J95l09k85N1K44K3n22r63r21
$$ plain form
53146 258339 257340 256708 256694 257145 257898 258842 259696 260152 260287 260474 260830 261080 261030 260835 260727 260768 260987 261447 261948 261921
53126 261921 260906 259123 257420 256651 257065 258127 258897 258748 257832 256736 255682 254359 252671 251294 251025 251668
53110 251668 251992 250968 248793 246495 244765 243495 242365 241422 240806 240199 238969 236908 234541 232611 231507
53095 231507 231265 231795 232775 233579 233695 233210 232602 232120 231684 231324 231286 231597 231909 231981 232025 232324 232724 232764 232173 231087
53075 231087 229930 229267 229529 230619 231933 233026 234071 235327 236342 236200 234596 232289 230369 229380 229227
53060 229227 229567 230000 230127 229777 229105 228341 227504 226512 225451 224549 223942 223620 223583 223926 224777 226216 228194 230401
53042 230401 232281 233367 233630 233412 232986 232257 230934 228971 226797 225059 224127 223887 224034 224432 225004 225372 225006
53025 225006 223886 222722 222258 222553 223186 223963 225007 226223 227115 227310 227001 226716 226767 227011 227034 226512 225549 224628
53007B24628n25k56j93J29Q37J149L89p65r28J52J233J249N15j49o47j275j693
52990B23850j182J79J407J741J424J082Q75M95j47o44m79L71J345J811J621J058
52974B34807L84k67o20l62K97O46L86J14M41J056J231J009J062J482J584J012
52958B44262L40J66L04L17L26P06J288J440Q58j87j292k216k767k772k290j695
52942B36788j408j498j581j159l09J19o07j962k464j410J95Q94N12M3Q4K17p3
52925B26381n76p22l51K11M45K3q82j533j312m81J27K58M78J103J531J171M25
52908B26296J55M71O85L73k57q90j377j448q29J72P86P25N26O78R38R24Q47J051
52890B29826J264R50L12R2M56P23M66J61L17N29j3j373k761l443l288k489j342
$$ plain form
53007 224628 224103 223847 223654 223783 224620 225769 226158 225393 224465 224617 225850 227099 227614 227465 226818 225543 223850
52990 223850 222668 222847 224254 225995 227419 228501 229376 229871 229724 229080 228601 228972 230317 232128 233749 234807
52974 234807 235191 234924 234304 233942 234239 234885 235271 235385 235826 236882 238113 239122 240184 241666 243250 244262
52958 244262 244602 244768 245072 245389 245715 246421 247709 249149 250007 249820 248528 246312 243545 240773 238483 236788
52942 236788 235380 233882 232301 231142 230833 230952 230345 228383 225919 224509 224704 225598 226110 226153 226237 226454 226381
52925 226381 225805 225083 224732 224943 225388 225411 224529 222996 221684 221203 221330 221588 222066 223169 224700 225871 226296
52908 226296 226451 226922 227607 227980 227723 226833 225456 224008 223179 223351 224137 224862 225388 226066 227004 227928 228775 229826
52890 229826 231090 232040 232352 232444 232900 233623 234089 234250 234567 235096 235083 233710 230949 227506 224218 221729 220387
52873B20387l63j09n56r68o53L24J345J912J933J496Q08K05J7K50N81O72M08l3
52855B27656k50Q4P84J153P35Qj39L89P36K69o04j169j440j875k390k479k189
52838B19279k171k578k702k078j255q89o74L9J021J418J087P46P33N12k75j076
52822B11137j236q63m23M8O71J187J293J222J350J504J373J294J869K850L300
52807B26576K953K552K585K533J781N17q10k263l893n011m879l934l435l805m093
52792B07374l352j914q45n98p60r06j044j194j016k78O34J058Q97O98Q15R66Q16
52775B01351O12P54J042R20L66lK01P46J296J744J892J388M10k30o6L01L0p73
52757B11981j263j026m67r7L9K13O24J182J465J033M2p41q30o49q05j142j087
$$ plain form
52873 220387 220024 219915 219359 218391 217738 218062 219407 221319 223252 224748 225556 225761 225778 226028 226609 227281 227689 227656
52855 227656 227406 227490 228274 229427 230162 230170 230031 230420 231156 231425 230821 229652 228212 226337 223947 221468 219279
52838 219279 217108 214530 211828 209750 208495 207606 206932 206971 207992 209410 210497 211243 211976 212488 212213 211137
52822 211137 209901 209038 208615 208663 209334 210521 211814 213036 214386 215890 217263 218557 220426 223276 226576
52807 226576 229529 232081 234666 237199 238980 239497 238687 236424 232531 227520 222641 218707 215272 211467 207374
52792 207374 204022 202108 201263 200665 199905 198999 197955 196761 195745 195467 196101 197159 198056 198754 199569 200535 201351
52775 201351 201963 202717 203759 204679 205045 205042 205243 205989 207285 209029 210921 212309 212719 212489 212423 212724 212754 211981
52757 211981 210718 209692 209225 209128 209167 209380 210004 211186 212651 213684 213726 212985 212155 211506 210701 209559 208472
52740B08472p05n82p78o94j08M35M85L07K87L06J38j2K29Q88J713K450K816K549
52722B18196J777J032O24K90l07j015j466j636j783k072k476k874l047k779k160
52707B00304j513r16j31P64J228R93N47M39N32M64M20Q08J446J730J493J078O49
52690B10335J05l79l98j1K35J82L01Q66J403J369R71Q43J154J427J166L64n25
52673B19408r29n34M21J224J260N58k42n43l70k40m53o56l13M83J081J184J252
52656B22591J676K052J830J296J271J910K464K304J525N01n65j465j888j838j772
52641B31892j983k199k059j582r86l53K13M77M25M08O76J087J501K079K785L055
52625B35436K432J295M52K15K73K96J78k33j100k206k995l004k216j085l55n41
$$ plain form
52740 208472 207767 207185 206407 205713 205605 206040 206525 206832 207119 207425 207563 207551 207780 208668 210381 212831 215647 218196
52722 218196 219973 221005 221629 221919 221612 220597 219131 217495 215712 213640 211164 208290 205243 202464 200304
52707 200304 198791 197875 197744 198508 199736 200729 201276 201715 202247 202711 203131 203939 205385 207115 208608 209686 210335
52690 210335 210440 210061 209663 209652 209887 210069 210370 211236 212639 214008 214979 215822 216976 218403 219569 219933 219408
52673 219408 218479 217945 218366 219590 220850 221408 221166 220623 220253 220013 219560 218904 218591 219074 220155 221339 222591
52656 222591 224267 226319 228149 229445 230716 232626 235090 237394 238919 239420 238855 237390 235502 233664 231892
52641 231892 229909 227710 225651 224069 223083 222730 222943 223420 223845 224253 224929 226016 227517 229596 232381 235436
52625 235436 237868 239163 239615 239830 240103 240399 240577 240344 239244 237038 234043 231039 228823 227738 227383 226842
52609B26842j248j380m34P41R59J67p63j303j516j304m17O68R47K86k24K10J006
52592B23237J181P07K42P8J05L68R11J309J074M37N9J89N76J044J523J666J152
52575B35858L43OL15P15Q24Q31R09Q51N22J37j51m66q57j162j395j731j927j434
52557B32188l55L08q8r07j076m44L16P00O30R8p27j261j027l68K8J14K79M11j
52538B28818q02j173q76n89p20p34j94M19N30M60P89J291J367J102J045J173R78
52521B32884M98L31N62N88J98m7J95M59L88M53J106J793J659Q80M45O79Q82N84
52503B44537L06O43J241J236M17o46j497k159k613k492j630n45K8p1l86n52o54
52486B35163q35q99n04L74J334J887J823J341R18R54J437J972K180K009J672J446
$$ plain form
52609 226842 225594 224214 223780 224521 225480 225647 224884 223581 222065 220761 220344 221012 221959 222245 222021 222231 223237
52592 223237 224418 225125 225367 225445 225550 225918 226829 228138 229212 229649 229708 229897 230473 231517 233040 234706 235858
52575 235858 236201 236207 236522 237237 238061 238892 239801 240652 241174 241311 241160 240694 239837 238675 237280 235549 233622 232188
52557 232188 231833 232141 232053 231146 230070 229626 229942 230642 231272 231370 230643 229382 228355 227987 228015 228129 228408 228819 228818
52538 228818 228016 226843 225967 225378 224658 223924 223730 224149 224679 225139 225928 227219 228586 229688 230733 231906 232884
52521 232884 233382 233713 234275 234863 235061 235014 235209 235668 236056 236509 237615 239408 241067 241947 242392 243071 243953 244537
52503 244537 244843 245486 246727 247963 248380 247734 246237 244078 241465 238973 237343 236798 236826 236755 236369 235817 235163
52486 235163 234328 233429 232925 233299 234633 236520 238343 239684 240602 241556 242993 244965 247145 249154 250826 252272
52470B52272J510J809J965J547N86l64q04p59n39k52K16Q28J292J251M20j152
52454B59826k766l345k534j305r62j642k362k430k065j585q71j5K82l65j170j007
52438B35684J20J101J137N15k6j69j28k29n90j014j175r72p10p06q42p47k97K96
52420B31248P59R44P73L91J69L30O55R12J317K149L048L353L072K885L108L359
52404B58472L416L670M358M993N061M796M657M401L431J746o2j630l035m205m769
52389B85300m562l835k899j943j224r32q16m39J20L24J08J24P84J579J769J374
52373B74832J020J091J443J776J927J889J851J983K002J283k20j579j944j615
52359B85739j426j395q72M7L72k77r81q52k16J71L81R50J686J850J400J138J558
$$ plain form
52470 252272 253782 255591 257556 259103 259689 259325 258521 257762 257223 256971 257187 258015 259307 260558 260978 259826
52454 259826 257060 253715 251181 249876 248914 247272 244910 242480 240415 238830 237959 237944 238226 237861 236691 235684
52438 235684 235804 236905 238042 238557 238531 238362 238234 238005 237415 236401 235226 234254 233544 232838 231996 231249 230952 231248
52420 231248 232007 232951 233724 234115 234284 234614 235269 236181 237498 239647 242695 246048 249120 252005 255113 258472
52404 258472 261888 265558 269916 274909 279970 284766 289423 293824 297255 299001 298939 297309 294274 290069 285300
52389 285300 280738 276903 274004 272061 270837 269905 269089 268650 268770 269094 269202 269326 270110 271689 273458 274832
52373 274832 275852 276943 278386 280162 282089 283978 285829 287812 289814 291097 290877 289298 287354 285739
52359 285739 284313 282918 282046 282093 282465 282188 281207 280355 280139 280310 280691 281641 283327 285177 286577 287715 289273
52342B89273K262K683K736K544K095J526J313J769K621L285L435L179K912L112
52328C24745L975N153O097O677P210P806Q161Q088P818P554P227O931P060P642
52314D22144Q021P742P284P363P824P946P625P449P734Q146Q438Q865R557J0125
52300E36263J0149R689R018Q191P243O440O052N964N752N097M006K745J645Q35
52286F19089J58n20j038j161j025j021j233j323j073o25j32M67J169J707J826
52271F15265J529R43L15R8O59J723K565K992L598M779O007O495O212N746N517
52256F64443N632O171P050P692P582P006O807P287P839P734O869N680M696M207
52242G56695M084L780K838J434K26k63P7J101K402L205K845J492P1p25j020j284
$$ plain form
52342 289273 291535 294218 296954 299498 301593 303119 304432 306201 308822 312107 315542 318721 321633 324745
52328 324745 328720 333873 339970 346647 353857 361663 369824 377912 385730 393284 400511 407442 414502 422144
52314 422144 430165 437907 445191 452554 460378 468324 475949 483398 491132 499278 507716 516581 526138 536263
52300 536263 546412 556101 565119 573310 580553 586993 593045 599009 604761 609858 613864 616609 618254 619089
52286 619089 619247 618727 617689 616528 615503 614482 613249 611926 610853 610228 610096 610563 611732 613439 615265
52271 615265 616794 617737 618052 618150 618809 620532 623097 626089 629687 634466 640473 646968 653180 658926 664443
52256 664443 670075 676246 683296 690988 698570 705576 712383 719670 727509 735243 742112 747792 752488 756695
52242 756695 760779 764559 767397 768831 769057 768794 768871 769972 772374 775579 778424 779916 779987 779262 778242 776958
52226G76958j682k038k111j703p77K99Q78O84J54q4N7J63Mq4M73J767L146L726
52208G79830L302K566K341K697L092L231L324L518L638L628L823M439N135N409
52194H29973N210M886M660M511M399M332M242L998L487K634J466L34k76m21q60
52179H72575k169l838m768m652m309m526n112n408n241m853m183k984j632j090
52165H17810j677k407k131j001j62j11k00J46N11K54l78o38l65m1R7L13P40J126
52147H11886J314J436J537J452J205J089J137R68L29n04j111j348j267r71o85
52132H16467o46p50o37j49O31J856L726N734O826O792O752P688R090R795R708
52117H82883R755J0416J1226J1692J1913J2061J1915J1219J0054Q668P299O272
$$ plain form
52226 776958 775276 773238 771127 769424 768647 768946 769824 770508 770662 770578 770635 770798 770802 770718 771191 772958 776104 779830
52208 779830 783132 785698 788039 790736 793828 797059 800383 803901 807539 811167 814990 819429 824564 829973
52194 829973 835183 840069 844729 849240 853639 857971 862213 866211 869698 872332 873798 874132 873856 873435 872575
52179 872575 870406 866568 861800 857148 852839 848313 843201 837793 832552 827699 823516 820532 818900 817810
52165 817810 816133 813726 811595 810594 810432 810321 810121 810267 810778 811032 810654 810016 809651 809610 809707 810020 810760 811886
52147 811886 813200 814636 816173 817625 818830 819919 821056 822024 822353 821849 820738 819390 818123 817152 816467
52132 816467 815821 815071 814434 814285 814916 816772 820498 826232 833058 839850 846602 854290 863380 873175 882883
52117 882883 892638 903054 914280 925972 937885 949946 961861 973080 983134 991802 999101 1005373
52105A005373N961O445P399Q359Q949Q973Q550Q141Q049P989P487O516N451M445
52091A108087L375K304J426N17r58l050n126o612p448p638o991n648m376l804
52077A064058l641l152k235j541j474j561j022J89J234J377R31Q59J479K025J788
52062A059314J290J624K908M069M244L732L306L213L221L254L497M034M629M778
52048A107113L925K034l4j091r27o19j294k911m561n534n668n050l939k879k351
52033A076214k278k221k036k012k405l070l609l670l176k409j868j859k268k759
52019A040574l016k791k009j043n47p62j219j413j393j417j427j408j915l548
52005A016666n990q237r838j1314j3176j5174j6729j7717j8383j8872j9207j9434
$$ plain form
52105 1005373 1011334 1017779 1025178 1033537 1042486 1051459 1060009 1068150 1076199 1084188 1091675 1098191 1103642 1108087
52091 1108087 1111462 1113766 1115192 1115709 1114751 1111701 1106575 1099963 1092515 1084877 1077886 1072238 1067862 1064058
52077 1064058 1060417 1057265 1055030 1053489 1052015 1050454 1049432 1049621 1050855 1052232 1053163 1054022 1055501 1057526 1059314
52062 1059314 1060604 1062228 1065136 1069205 1073449 1077181 1080487 1083700 1086921 1090175 1093672 1097706 1102335 1107113
52048 1107113 1111038 1113072 1113038 1111947 1111020 1110401 1109107 1106196 1101635 1096101 1090433 1085383 1081444 1078565 1076214
52033 1076214 1073936 1071715 1069679 1067667 1065262 1062192 1058583 1054913 1051737 1049328 1047460 1045601 1043333 1040574
52019 1040574 1037558 1034767 1032758 1031715 1031168 1030406 1029187 1027774 1026381 1024964 1023537 1022129 1020214 1016666
52005 1016666 1010676 1002439 992601 981287 968111 952937 936208 918491 900108 881236 862029 842595
51993H42595j9457j8890j7505j5719j4388j3971j4128j4148j3599j2603j1629
51982F76558j1123j1175j1428j1379j0860j0190r798r744r703r430r001q540p919
51969E46268o866n312l426j477K52J522K428L397M627N634N811N285M621L797
51955E66561K198j51k183l094l333l713m124l931l220k659k253j251N92K488L662
51940E45589M298N071O243P625Q991J0096J0552J0109R013P765O560N096K939
51927F39947j6l383o563r211j1370j3035j3897j3839j3471j3602j4170j4192j3023
51914E00175j1183r675q835q172p092n423l396j441N6J044J808K638L570M490
$$ plain form
51993 842595 823138 804248 786743 771024 756636 742665 728537 714389 700790 688187 676558
51982 676558 665435 654260 642832 631453 620593 610403 600605 590861 581158 571728 562727 554187 546268
51969 546268 539402 534090 530664 529187 529439 530961 533389 536786 541413 547047 552858 558143 562764 566561
51955 566561 568759 568608 566425 563331 559998 556285 552161 548230 545010 542351 540098 538847 539439 541927 545589
51940 545589 549887 554958 561201 568826 577817 587913 598465 608574 617587 625352 631912 637008 639947
51927 639947 639931 636548 629985 620774 609404 596369 582472 568633 555162 541560 527390 513198 500175
51914 500175 488992 479317 470482 462310 455218 449795 446399 444958 445014 446058 447866 450504 454074 458564
$$ [...]
##END NTUPLES=NMR SPECTRUM
##END=
