##TITLE=AC1473_13FB002635_8026882_x02myc3yUk
##JCAMPDX= 6.0         $$ Bruker NMR JCAMP-DX V2.0
##DATA TYPE= NMR SPECTRUM
##DATA CLASS= NTUPLES
##ORIGIN= BRUKER
##OWNER= Administrator
$$ 1.72 TOPSPIN		Version 2.1
$$ 2013-07-11 22:29:38.362 -0700  Administrator@X
$$ Compression mode = diff/dup
##.OBSERVE FREQUENCY= 400.02188249412
##.OBSERVE NUCLEUS= ^1H
##.ACQUISITION MODE= SIMULTANEOUS (DQD)
##.ACQUISITION SCHEME= undefined
##.AVERAGES= 64
##.DIGITISER RES= 22
##SPECTROMETER/DATA SYSTEM= spect
##.PULSE SEQUENCE= noesygpps1d.comp
##.SOLVENT NAME= COFFEE_meoh
##.SHIFT REFERENCE= INTERNAL, COFFEE_meoh, 1, 14.96101
##AUDIT TRAIL= $$ (NUMBER, WHEN, WHO, WHERE, PROCESS, VERSION, WHAT)
$$ ##TITLE= Audit trail, TOPSPIN		Version 2.1
$$ ##JCAMPDX= 5.01
$$ ##ORIGIN= Bruker BioSpin GmbH
$$ ##OWNER= Administrator
$$ $$ E:\/data/COFFEE/nmr/AC1473_13FB002635_8026882_x02myc3yUk/12/pdata/1/auditp.txt
$$ ##AUDIT TRAIL=  $$ (NUMBER, WHEN, WHO, WHERE, PROCESS, VERSION, WHAT)
(   1,<2013-07-11 22:29:33.174 -0700>,<Administrator>,<X>,<go>,<TOPSPIN 2.1>,
      <created by zg
	started at 2013-07-11 22:18:03.081 -0700,
	POWCHK enabled, PULCHK disabled,
       configuration hash MD5:
       C8 4E 4E 5D D3 5C D8 9E 9F 52 82 E0 59 8A DE 15
       data hash MD5: 64K
       6C 15 81 4D D4 2F E2 45 18 3E 0B 20 30 20 F2 C5>)
(   2,<2013-07-11 22:29:36.221 -0700>,<Administrator>,<X>,<proc1d>,<TOPSPIN 2.1>,
      <Start of raw data processing
       efp LB = 0.3 FT_mod = 6 PKNL = 1 PHC0 = 0 PHC1 = 0 SI = 128K 
       data hash MD5: 128K
       05 8C EC 6F 62 FA 86 F8 5C 44 01 00 3F 38 3C 38>)
(   3,<2013-07-11 22:29:37.253 -0700>,<Administrator>,<X>,<proc1d>,<TOPSPIN 2.1>,
      <pk PHC0 = -79.60693 PHC1 = 0 
       data hash MD5: 128K
       CB 9D 1C AE F5 25 B3 E1 DE 3F 6C B0 B3 08 DF 69>)
(   4,<2013-07-11 22:29:37.674 -0700>,<Administrator>,<X>,<proc1d>,<TOPSPIN 2.1>,
      <abs ABSG = 1 
       data hash MD5: 128K
       B9 7F 5E 4B E2 A0 58 30 98 5B 40 C0 B4 4C CF BF>)
(   5,<2013-07-11 22:29:37.846 -0700>,<Administrator>,<X>,<proc1d>,<TOPSPIN 2.1>,
      <abs ABSG = 2 
       data hash MD5: 128K
       C4 C5 F8 92 EB 34 AC 1B 9F 67 02 01 BC 7A D7 5D>)
(   6,<2013-07-11 22:29:37.956 -0700>,<Administrator>,<X>,<proc1d>,<TOPSPIN 2.1>,
      <abs ABSG = 3 
       data hash MD5: 128K
       76 E5 60 CD 91 C2 E8 74 75 73 09 6D 10 47 FC 39>)
(   7,<2013-07-11 22:29:38.065 -0700>,<Administrator>,<X>,<proc1d>,<TOPSPIN 2.1>,
      <abs ABSG = 4 
       data hash MD5: 128K
       1C 57 B3 3B 88 D0 F6 C2 D1 E1 B3 BF 9F F4 AE 80>)
(   8,<2013-07-11 22:29:38.143 -0700>,<Administrator>,<X>,<proc1d>,<TOPSPIN 2.1>,
      <abs ABSG = 5 
       data hash MD5: 128K
       E8 F4 97 38 3E C3 3D 02 FA 78 79 B7 C6 79 06 B0>)
$$ ##END=
$$ 
$$ $$ hash MD5
$$ $$ 3F AE 79 50 E9 C4 3D 42 D0 56 42 D1 92 24 89 65
##$RELAX= 
##$RELAX= 
##$RELAX= 
##$RELAX= 
##$RELAX= 
##$RELAX= 
##$RELAX= 
##$RELAX= 
$$ Bruker specific parameters
$$ --------------------------
##$DU= <E:\>
##$EXPNO= 12
$$ [...]
##$TP07= 0
##$TPNAME0= <>
##$TPNAME1= <>
##$TPNAME2= <>
##$TPNAME3= <>
##$TPNAME4= <>
##$TPNAME5= <>
##$TPNAME6= <>
##$TPNAME7= <>
##$TPOAL= (0..7)
0.5 0.5 0.5 0.5 0.5 0.5 0.5 0.5
##$TPOFFS= (0..7)
0 0 0 0 0 0 0 0
##$TUNHIN= 0
##$TUNHOUT= 0
##$TUNXOUT= 0
##$USERA1= <user>
##$USERA2= <user>
##$USERA3= <user>
##$USERA4= <user>
##$USERA5= <user>
##$V9= 5
##$VALIST= <valist>
##$VCLIST= <CCCCCCCCCCCCCCC>
##$VD= 0
##$VDLIST= <DDDDDDDDDDDDDDD>
##$VPLIST= <PPPPPPPPPPPPPPP>
##$VTLIST= <TTTTTTTTTTTTTTT>
##$WBST= 1024
##$WBSW= 4
##$XGAIN= (0..3)
0 0 0 0
##$XL= 0
##$YL= 0
##$YMAX_a= 6177700
##$YMIN_a= -12357239
##$ZGOPTNS= <>
##$ZL1= 120
##$ZL2= 120
##$ZL3= 120
##$ZL4= 120
##$ABSF1= 14.96101
##$ABSF2= -5.597172
##$ABSG= 5
##$ABSL= 3
##$ALPHA= 0
##$AQORDER= 0
##$ASSFAC= 0
##$ASSFACI= 0
##$ASSFACX= 0
##$ASSWID= 0
##$AUNMP= <proc_prof1d_extract.lims>
##$AXLEFT= 0
##$AXNAME= <>
##$AXNUC= <1H>
##$AXRIGHT= 0
##$AXTYPE= 0
##$AXUNIT= <>
##$AZFE= 0.1
##$AZFW= 0.1
##$BCFW= 0
##$BC_mod= 0
##$BYTORDP= 0
##$COROFFS= 0
##$CY= 15
##$DATMOD= 1
##$DC= 0
##$DFILT= <>
##$DTYPP= 0
##$F1P= 0
##$F2P= 0
##$FCOR= 0.5
##$FTSIZE= 131072
##$FT_mod= 6
##$GAMMA= 0
##$GB= 0
##$INTBC= 1
##$INTSCL= 1
##$ISEN= 128
##$LB= 0.3
##$LEV0= 0
##$LPBIN= 0
##$MAXI= 10000
##$MC2= 0
##$MEAN= 0
##$ME_mod= 0
##$MI= 0
##$NCOEF= 0
##$NC_proc= -2
##$NLEV= 6
##$NOISF1= 0
##$NOISF2= 0
##$NSP= 0
##$NTH_PI= 0
##$NZP= 0
##$OFFSET= 14.96101
##$PC= 1
##$PHC0= -79.60693
##$PHC1= 0
##$PH_mod= 1
##$PKNL= yes
##$PPARMOD= 0
##$PPDIAG= 0
##$PPIPTYP= 0
##$PPMPNUM= 2147483647
##$PPRESOL= 1
##$PSCAL= 4
##$PSIGN= 0
##$PYNMP= <proc.py>
##$REVERSE= no
##$SF= 400.020009633303
##$SI= 131072
##$SIGF1= 0
##$SIGF2= 0
##$SINO= 400
##$SIOLD= 131072
##$SPECTYP= <>
##$SREGLST= <1H.CDCl3>
##$SSB= 0
##$STSI= 131072
##$STSR= 0
##$SW_p= 8223.68421052631
##$SYMM= 0
##$S_DEV= 0
##$TDeff= 65536
##$TDoff= 0
##$TI= <>
##$TILT= no
##$TM1= 0
##$TM2= 0
##$TOPLEV= 0
##$USERP1= <user>
##$USERP2= <user>
##$USERP3= <user>
##$USERP4= <user>
##$USERP5= <user>
##$WDW= 1
##$XDIM= 131072
##$YMAX_p= 371052800
##$YMIN_p= -12003
##$CURPLOT= <Network HP LaserJet P1505>
##$CURPRIN= <$Network HP LaserJet P1505>
##$DFORMAT= <normdp>
##$LAYOUT= <+/1D_H.xwp>
##$LFORMAT= <normlp>
##$PFORMAT= <normpl>
##$SURQMSG= 1
$$ End of Bruker specific parameters
$$ ---------------------------------
##NTUPLES= NMR SPECTRUM
##VAR_NAME=  FREQUENCY,     SPECTRUM/REAL,   SPECTRUM/IMAG
##SYMBOL=    X,             R,               I
##VAR_TYPE=  INDEPENDENT,   DEPENDENT,       DEPENDENT
##VAR_FORM=  AFFN,          ASDF,            ASDF
##VAR_DIM=   131072,        131072,          131072
##UNITS=     HZ,            ARBITRARY UNITS, ARBITRARY UNITS
##FACTOR=    0.0627417313425164, 1,          1
##FIRST=     8223.62146879497, -75,          -58742
##LAST=      0,             2249,            -59159
##MIN=       0,             -12003,          0
##MAX=       8223.62146879497, 371052800,    0
$$ Real data points
##PAGE= N=1
##DATA TABLE= (X++(R..R)), XYDATA
$$ [...]
$$ plain form
63868 722744 753347 787064 824160 864248 906620 950944 997121 1044535 1091970 1138403 1183421
63857 1183421 1226724 1267580 1305043 1338444 1367495 1392066 1412027 1427112 1436812 1440462 1437505 1427599
63845 1427599 1410683 1387250 1358456 1325444 1288448 1247096 1201721 1153776 1104663 1054737 1004030
63834 1004030 953437 904341 857251 811638 767286 725113 686308 651091 618769 588817 561516
63823 561516 537426 516447 497666 480280 464470 450930 439538 429020 418274 407509 397579 388592
63811 388592 379817 370719 361332 351740 341982 332550 324165 316825 309719 302354 295146 288619 282624 276780
63797 276780 271106 265764 260701 256044 252339 249791 247641 244954 241683 238400 235270 232053 228886 226226
63783 226226 224023 221689 219038 216569 214696 213336 212496 212540 213374 213865 212769 210108 207240 205547 205362 206113
$$ packed form
63868G22744L0603L3717L7096M0088M2372M4324M6177M7414M7435M6433M5018
63857A183421M3303M0856L7463L3401K9051K4571J9961J5085R700L650k957r906
63845A427599j6916k3433k8794l3012l6996m1352m5375m7945m9113m9926n0707
63834A004030n0593m9096m7090m5613m4352m2173l8805l5217l2322k9952k7301
63823E61516k4090k0979j8781j7386j5810j3540j1392j0518j0746j0765r930q987
63811C88592q775r098r387r592r758r432q385p340p106p365p208o527n995n844
63797B76780n674n342n063m657l705k548k150k687l271l283l130l217l167k660
63783B26226k203k334k651k469j873j360q40M4Q34M91j096k661k868j693j85P51
$$ plain form
63767 206113 207171 208346 209646 210759 211035 210119 208412 206728 205605 205126 205223 205739 206222 206130 205366 204345 203499
63750 203499 203004 202990 203586 204611 205616 206409 207233 208269 209393 210640 212439 215004 217854 220351 222487 224683
63734 224683 227055 229343 231433 233518 235759 238223 241097 244503 248052 251060 253383 255734 259010 263525
63720 263525 268999 274990 281089 286850 291783 295458 297598 298169 297440 295849 293722 291189 288343 285359 282376
63705 282376 279394 276330 273126 269818 266621 264023 262647 262816 264233 266156 267984 269726 271859 274719
63691 274719 278085 281431 284450 287154 289512 291310 292458 293171 293706 294210 294959 296335 298217 299786 300408
63676 300408 300499 300919 301697 302104 302023 302459 304303 307199 310134 312707 315221 317760 319829 320929 321067 320517 319353
63659 319353 317397 314513 310904 307051 303300 299453 295026 289986 284969 280595 276851 273488 270730 269083
$$ packed form
63767B06113J058J175J300J113K76r16j707j684j123m79R7N16M83r2p64j021q46
63750B03499m95j4N96J025J005P93Q24J036J124J247J799K565K850K497K136K196
63734B24683K372K288K090K085K241K464K874L406L549L008K323K351L276M515
63720B63525N474N991O099N761M933L675K140N71p29j591k127k533k846k984k983
63705B82376k982l064l204l308l197k598j376J69J417J923J828J742K133K860
63691B74719L366L346L019K704K358J798J148P13N35N04P49J376J882J569O22
63676C00408R1M20P78M07q1M36J844K896K935K573K514K539K069J100J38n50j164
63659C19353j956k884l609l853l751l847m427n040n017m374l744l363k758j647
$$ plain form
63645 269083 268563 268622 268931 269707 271124 272934 275006 277872 282166 287638 293188 297926 301936 305892 310280
63630 310280 315219 320822 327369 335053 343754 353186 363223 373966 385620 398455 412875 429272 447627
63617 447627 467351 487765 508791 531029 555060 580807 607741 635562 664436 694428 724928
63606 724928 754813 783034 808747 830927 848337 860181 866650 868539 866530 861162 853306 844091 834166
63593 834166 823459 811893 799873 787674 774640 759555 741814 721827 700316 677617 653840
63582 653840 629405 605247 582576 562424 545177 530463 517724 506951 498624 492871 489081 486563
63570 486563 485287 485661 487798 491415 496340 502643 510198 518528 527327 536847 547545 559534 572696 587173
63556 587173 603349 621318 640767 661648 684713 711045 741130 774647 811092 850085 890832
$$ packed form
63645B69083n20N9L09P76J417J810K072K866M294N472N550M738M010L956M388
63630C10280M939N603O547P684Q701R432J0037J0743J1654J2835J4420J6397J8355
63617D47627J9724K0414K1026K2238K4031K5747K6934K7821K8874K9992L0500
63606G24928K9885K8221K5713K2180J7410J1844O469J889k009n368p856r215r925
63593H34166j0707j1566j2020j2199j3034j5085j7741j9987k1511k2699k3777
63582F53840k4435k4158k2671k0152j7247j4714j2739j0773q327n753l790k518
63570D86563j276L74K137L617M925O303P555Q330Q799R520J0698J1989J3162J4477
63556E87173J6176J7969J9449K0881K3065K6332L0085L3517L6445L8993M0747
$$ plain form
63545 890832 931596 970012 1003802 1030933 1049414 1057706 1055707 1045140 1028771 1009310 989039 969967
63533 969967 953626 940415 929371 918836 907493 894824 880620 864259 844656 821084 793975
63522 793975 764714 734610 704195 673497 642737 612560 583724 556792 532079 509732 489768
63511 489768 472080 456352 442018 428526 415869 404708 395685 388522 382084 375409 368548 362288 357278
63498 357278 353599 350992 349156 347802 346669 345627 344610 343421 341857 340138 338978 338921 339782 341081 342854
63483 342854 345590 349324 353366 357204 361180 365833 370921 375627 379552 382932 385929 388248 389559 389810
63469 389810 388995 387046 384135 380693 376942 372769 368174 363420 358508 353133 347556 343003 340560 339941 339932
63454 339932 339806 339704 339879 340408 341764 344895 350342 357757 366565 376734 388556 402038 416959 433377
$$ packed form
63545H90832M0764L8416L3790K7131J8481Q292j999j0567j6369j9461k0271j9072
63533I69967j6341j3211j1044j0535j1343j2669j4204j6361j9603k3572k7109
63522G93975k9261l0104l0415l0698l0760l0177k8836k6932k4713k2347j9964
63511D89768j7688j5728j4334j3492j2657j1161r023p163o438o675o861o260n010
63498C57278l679k607j836j354j133j042j017j189j564j719j160n7Q61J299J773
63483C42854K736L734M042L838L976M653N088M706L925L380K997K319J311K51
63469C89810q15j949k911l442l751m173m595m754m912n375n577m553k443o19r
63454C39932j26j02J75N29J356L131N447P415Q808J0169J1822J3482J4921J6418
$$ plain form
63440 433377 451728 472476 495935 522433 552341 585685 621606 658226 693130 724111 749560
63429 749560 768429 780353 786164 788015 788515 789650 792657 798637 808732 823712 843797 868831 898146
63416 898146 930225 963058 995017 1025041 1051920 1074025 1090047 1099552 1102637 1099619 1091451 1079921
63404 1079921 1066846 1053201 1039216 1024853 1009785 993319 974832 953990 930172 902340 870222
63393 870222 835336 800039 765719 732536 700615 670573 642819 617268 593930 573122 554940
63382 554940 539219 526198 516421 509729 505119 502037 501070 502797 506673 511794 518288 527079 538476 551824
63368 551824 566498 582530 600123 619234 639914 662615 687837 715677 745923 778346 812618
63357 812618 848094 883900 919230 953428 985675 1014795 1039511 1058976 1072945 1081341 1083944 1080822
$$ packed form
63440D33377J8351K0748K3459K6498K9908L3344L5921L6620L4904L0981K5449
63429G49560J8869J1924N811J851N00J135L007N980J0095J4980K0085K5034K9315
63416H98146L2079L2833L1959L0024K6879K2105J6022R505L085l018q168j1530
63404A079921j3075j3645j3985j4363j5068j6466j8487k0842k3818k7832l2118
63393H70222l4886l5297l4320l3183l1921l0042k7754k5551k3338k0808j8182
63382E54940j5721j3021r777o692m610l082r67J727L876N121O494Q791J1397J3348
63368E51824J4674J6032J7593J9111K0680K2701K5222K7840L0246L2423L4272
63357H12618L5476L5806L5330L4198L2247K9120K4716J9465J3969Q396K603l122
$$ plain form
63345 1080822 1072986 1062179 1049807 1036366 1021971 1006993 991782 976052 958948 939655 917694
63334 917694 892806 865004 834831 803308 771581 740703 711635 685226 662163 643044 628286
63323 628286 617711 610415 605399 602173 600235 597974 592668 582008 565549 544666 521448 497780 475046
63310 475046 454078 435222 418613 404410 392650 382913 374373 366338 358711 351851 346034 341172 337011
63297 337011 333429 330419 327963 326103 324945 324274 323243 320961 317542 314191 311920 310536 309202 307656
63283 307656 306328 305427 304559 303340 301861 300378 298983 297865 297502 298216 299665 301061 301844 301949 301600 301119
63267 301119 300926 301388 302454 303526 303929 303599 303200 303404 304178 304981 305589 306390 307759 309551 311548 314090 317770
63250 317770 322609 327987 333400 338877 344627 350752 357453 365148 374086 384033 394529 405316 416449
$$ packed form
63345A080822p836j0807j2372j3441j4395j4978j5211j5730j7104j9293k1961
63334I17694k4888k7802l0173l1523l1727l0878k9068k6409k3063j9119j4758
63323F28286j0575p296n016l226j938k261n306j0660j6459k0883k3218k3668k2734
63310D75046k0968j8856j6609j4203j1760r737q540q035p627o860n817m862m161
63297C37011l582l010k456j860j158o71j031k282l419l351k271j384j334j546
63283C07656j328r01q68j219j479j483j395j118l63P14J449J396P83J05l49m81
63267C01119j93M62J066J072M03l30l99K04P74Q03O08Q01J369J792J997K542L680
63250C17770M839N378N413N477N750O125O701P695Q938R947J0496J0787J1133
$$ plain form
63237 416449 428227 441083 455371 471045 487683 504861 522394 540284 558693 577957 598288
63226 598288 619289 640072 659999 679131 697903 716678 735693 755065 774594 793823 812487
63215 812487 830703 848543 865672 881489 895294 906198 913251 915925 914141 907693 896108 879465
63203 879465 858889 835801 811064 785284 759513 734902 711863 690253 670302 652737 637973
63192 637973 625863 616384 609980 607031 607423 610817 616924 625323 635485 647282 661221 677846 697022
63179 697022 717934 739633 761529 783599 806169 829275 852152 873647 893233 911364 928674
63168 928674 945117 960060 972935 983398 990933 994621 993529 987333 976405 961145 941286 916264
63156 916264 886484 853883 820701 787870 755028 721973 689473 658576 629760 603053 578481
$$ packed form
63237D16449J1778J2856J4288J5674J6638J7178J7533J7890J8409J9264K0331
63226E98288K1001K0783J9927J9132J8772J8775J9015J9372J9529J9229J8664
63215H12487J8216J7840J7129J5817J3805J0904P053K674j784o448j1585j6643
63203H79465k0576k3088k4737k5780k5771k4611k3039k1610j9951j7565j4764
63192F37973j2110r479o404k949L92L394O107Q399J0162J1797J3939J6625J9176
63179F97022K0912K1699K1896K2070K2570K3106K2877K1495J9586J8131J7310
63168I28674J6443J4943J2875J0463P535L688j092o196j0928j5260j9859k5022
63156I16264k9780l2601l3182l2831l2842l3055l2500l0897k8816k6707k4572
$$ plain form
63145 578481 556068 535782 517782 502417 489634 478660 468608 459201 450716 443480 437695 433433
63133 433433 430439 428131 426148 424762 424437 425150 426421 427833 429137 430032 430344 430447 431119 432798 435178 437630
63117 437630 439911 442385 445611 449697 454068 457884 460708 462634 463894 464699 465455 466625 468162 469516 470518
63102 470518 471781 473780 475957 477400 478143 479056 480500 481852 482512 482718 483040 483571 484039 484457 485226 486650
63086 486650 488596 490659 492550 494307 496107 497910 499472 500837 502530 504996 508040 511197 514512 518502
63072 518502 523459 529235 535754 543182 551515 560493 570126 580852 592983 606363 620818 636506 653570
63059 653570 671827 691243 712439 736290 763111 792515 823939 857018 891641 928055 966918
63048 966918 1008898 1054005 1101381 1149785 1198318 1246779 1295406 1344307 1393124 1441361 1488899
$$ packed form
63145E78481k2413k0286j8000j5365j2783j0974j0052r407q485p236n785m262
63133D33433k994k308j983j386l25P13J271J412J304Q95L12J03O72J679K380K452
63117D37630K281K474L226M086M371L816K824J926J260Q05P56J170J537J354J002
63102D70518J263J999K177J443P43R13J444J352O60K06L22N31M68M18P69J424
63086D86650J946K063J891J757J800J803J562J365J693K466L044L157L315L990
63072E18502M957N776O519P428Q333Q978R633J0726J2131J3380J4455J5688J7064
63059F53570J8257J9416K1196K3851K6821K9404L1424L3079L4623L6414L8863
63048I66918M1980M5107M7376M8404M8533M8461M8627M8901M8817M8237M7538
$$ plain form
63037 1488899 1535990 1582775 1629104 1674785 1719642 1763216 1804704 1843244 1877874 1907128 1929181
63026 1929181 1942671 1947039 1941823 1926202 1899735 1863247 1818496 1767182 1710720 1650689 1588862 1526896
63014 1526896 1466392 1409155 1356789 1310031 1268949 1233818 1205366 1184130 1170034 1162688 1161737 1166766
63002 1166766 1177201 1192455 1212036 1235524 1262676 1293413 1327382 1363647 1401200 1439667 1479088
62991 1479088 1519111 1558997 1598336 1637022 1674374 1708995 1739842 1766861 1790125 1808869 1821766
62980 1821766 1827722 1825916 1815446 1795516 1765897 1726971 1679658 1625577 1566810 1504951 1440653 1374584
62968 1374584 1308429 1244278 1183200 1125182 1070370 1019564 973292 931095 892121 855967 822616
62957 822616 791919 763599 737586 713987 692690 673159 654604 636410 618547 601554 585890
$$ packed form
63037A488899M7091M6785M6329M5681M4857M3574M1488L8540L4630K9254K2053
63026A929181J3490M368n216j5621k6467l6488m4751n1314n6462o0031o1827o1966
63014A526896o0504n7237n2366m6758m1082l5131k8452k1236j4096p346r51N029
63002A166766J0435J5254J9581K3488K7152L0737L3969L6265L7553L8467L9421
62991A479088M0023L9886L9339L8686L7352L4621L0847K7019K3264J8744J2897
62980A821766N956j806j0470j9930k9619l8926m7313n4081n8767o1859o4298o6069
62968A374584o6155o4151o1078n8018n4812n0806m6272m2197l8974l6154l3351
62957H22616l0697k8320k6013k3599k1297j9531j8555j8194j7863j6993j5664
$$ plain form
62946 585890 571247 556767 542092 527957 515506 505164 496330 488044 479759 471570 463933 457220 451402
62933 451402 446052 440654 434998 429349 424305 420343 417403 414952 412564 410357 408704 407593 406488 404838
62919 404838 402546 399968 397694 396291 395955 396312 396711 396769 396475 395839 394820 393686 392982 392880 392814 392074 390554
62902 390554 388699 386969 385707 385299 385965 387408 389115 391046 393606 396793 399821 401840 402778 403134 403203 402913
62886 402913 402329 401813 401557 401339 401028 401105 402269 404596 407324 409497 410562 410443 409443 408202 407335 406771 405718
62869 405718 403597 400825 398338 396543 395187 394033 393058 391996 390389 388378 386844 386364 386416 386102 385287 384586
62853 384586 384481 385009 386169 388014 390283 392437 394177 395582 396670 397205 397115 396756 396588 396770 397145 397390 397105
62836 397105 396124 394937 394463 395099 396241 397052 397498 398213 399501 400978 402291 403716 405775 408534 411596 414608
$$ packed form
62946E85890j4643j4480j4675j4135j2451j0342q834q286q285q189p637o713n818
62933D51402n350n398n656n649n044l962k940k451k388k207j653j111j105j650
62919D04838k292k578k274j403l36L57L99N8k94o36j019j134p04j02o6p40j520
62902C90554j855j730j262m08O66J443J707J931K560L187L028K019R38L56O9k90
62886D02913n84n16k56k18l11P7J164K327K728K173J065j19j000j241q67n64j053
62869D05718k121k772k487j795j356j154r75j062j607k011j534m80N2l14q15p01
62853C84586j05N28J160J845K269K154J740J405J088N35r0l59j68J82L75K45k85
62836C97105r81j187m74O36J142Q11M46P15J288J477J313J425K059K759L062L012
$$ plain form
62820 414608 417415 419800 421529 422763 424169 426400 429654 433838 438809 444117 448866 452450 455410 458967
62806 458967 463536 468318 472634 477061 482629 489332 496242 502977 510248 518785 528440 538735 549746 561982
62792 561982 575740 591166 608789 629396 653229 679733 708439 739929 775626 816540 862432
62781 862432 912409 966168 1024309 1087279 1154435 1224520 1296825 1371291 1447362 1523149 1595936
62770 1595936 1663281 1723606 1776110 1820328 1855447 1879800 1891304 1888693 1872192 1842911 1802056
62759 1802056 1751036 1691885 1626831 1557454 1484731 1409892 1334677 1260672 1188869 1120165 1055768
62748 1055768 996627 942586 892554 845657 802017 762381 727171 696079 668503 644083 622652
62737 622652 603845 587089 572046 558781 547373 537602 529162 521974 515999 510977 506680 503310 501277
$$ packed form
62820D14608K807K385J729J234J406K231L254M184M971N308M749L584K960L557
62806D58967M569M782M316M427N568O703O910O735P271Q537R655J0295J1011J2236
62792E61982J3758J5426J7623K0607K3833K6504K8706L1490L5697M0914M5892
62781H62432M9977N3759N8141O2970O7156P0085P2305P4466P6071P5787P2787
62770A595936O7345O0325N2504M4218L5119K4353J1504k611j6501k9281m0855
62759A802056n1020n9151o5054o9377p2723p4839p5215p4005p1803o8704o4397
62748A055768n9141n4041n0032m6897m3640l9636l5210l1092k7576k4420k1431
62737F22652j8807j6756j5043j3265j1408r771q440p188n975n022m297l370k033
$$ plain form
62724 501277 500601 500888 501937 504009 507409 512078 517749 524294 531826 540639 551113 563472 577584 593304
62710 593304 611022 631439 654646 679919 706879 736493 770393 809251 852393 898933 948737
62699 948737 1002172 1059418 1120377 1184867 1252468 1322396 1393856 1466325 1538994 1609979 1676530
62688 1676530 1736141 1787117 1827989 1856959 1872430 1873916 1861999 1837421 1800619 1752264 1693923
62677 1693923 1627943 1556783 1482441 1406339 1329573 1253296 1178921 1107868 1041132 979192 922265
62666 922265 870408 823373 780690 742050 707432 676732 649464 624988 602879 582952 565126
62655 565126 549359 535491 522983 511083 499471 488510 478581 469490 460859 452849 446005 440455 435785
62642 435785 431659 428154 425397 423289 421684 420521 419714 419171 418906 418795 418240 416592 414036 411633 410210
$$ packed form
62724E01277o76K87J049K072L400M669N671O545P532Q813J0474J2359J4112J5720
62710E93304J7718K0417K3207K5273K6960K9614L3900L8858M3142M6540M9804
62699I48737N3435N7246O0959O4490O7601O9928P1460P2469P2669P0985O6551
62688A676530N9611N0976M0872K8970J5471J486j1917k4578l6802m8355n8341
62677A693923o5980p1160p4342p6102p6766p6277p4375p1053o6736o1940n6927
62666I22265n1857m7035m2683l8640l4618l0700k7268k4476k2109j9927j7826
62655E65126j5767j3868j2508j1900j1612j0961r929r091q631q010o844n550m670
62642D35785m126l505k757k108j605j163q07n43k65j11n55j648k556k403j423
$$ plain form
62627 410210 409511 408658 407167 405323 403847 403392 404127 405599 407200 408892 411237 414590 418582 422549 426147
62612 426147 429375 432388 435627 439780 445196 451486 458022 464742 472242 481257 492258 505335 520270
62599 520270 536939 555827 577744 602808 630143 658978 689548 722337 756886 792128 827561
62588 827561 863183 898298 931283 960670 985635 1005262 1018247 1023864 1022538 1014942 1001099 981034
62576 981034 955845 927330 896649 864007 829626 794427 759580 725820 693421 662578 633619
62565 633619 606937 582838 561357 542114 524436 507811 492337 478706 467572 458751 451113 443466
62553 443466 435533 427910 421161 415323 410313 406292 403272 400714 398032 395453 393902 393947 395145 396571 397785
62538 397785 399064 400835 403121 405612 408145 410956 414415 418574 423078 427571 432161 437547 444673 454121
$$ packed form
62627D10210o99q53j491j844j476m55P35J472J601J692K345L353L992L967L598
62612D26147L228L013L239M153N416O290O536O720P500R015J1001J3077J4935
62599E20270J6669J8888K1917K5064K7335K8835L0570L2789L4549L5242L5433
62588H27561L5622L5115L2985K9387K4965J9627J2985N617j326p596j3843k0065
62576I81034k5189k8515l0681l2642l4381l5199l4847l3760l2399l0843k8959
62565F33619k6682k4099k1481j9243j7678j6625j5474j3631j1134q821p638p647
62553D43466p933p623o749n838n010m021l020k558k682k579j551M5J198J426J214
62538C97785J279J771K286K491K533K811L459M159M504M493M590N386P126R448
$$ plain form
62524 454121 465693 478653 492531 507615 524540 543613 564860 588596 615378 645229 677391
62513 677391 711194 746839 784917 825321 867052 908963 950267 990220 1027694 1061318 1089986
62502 1089986 1113115 1130363 1141122 1144377 1139359 1126507 1107661 1085146 1060714 1035415 1010164 986026
62490 986026 963956 944521 927964 914395 903949 896865 893377 893455 896715 902630 910582 919597 928330
62477 928330 935678 941260 944917 945889 942966 935478 923739 908378 889595 867246 841377 812464 781316
62464 781316 748869 715918 682927 650224 618404 588317 560633 535652 513574 494534 478238
62453 478238 463946 451201 440334 431866 425534 420301 415398 411030 407908 406269 405510 404770 403763 402941
62439 402941 402865 403640 405105 407378 410705 414664 417954 419346 418744 417056 415183 413386 411450 409090 406146
$$ packed form
62524D54121J1572J2960J3878J5084J6925J9073K1247K3736K6782K9851L2162
62513F77391L3803L5645L8078M0404M1731M1911M1304L9953L7474L3624K8668
62502A089986K3129J7248J0759L255n018j2852j8846k2515k4432k5299k5251k4138
62490I86026k2070j9435j6557j3569j0446p084l488P8L260N915P952R015Q733
62477I28330P348N582L657R72k923p488j1739j5361j8783k2349k5869k8913l1148
62464G81316l2447l2951l2991l2703l1820l0087k7684k4981k2078j9040j6296
62453D78238j4292j2745j0867q468o332n233m903m368l122j639p59p40j007q22
62439D02941p6P75J465K273L327L959L290J392o02j688j873j797j936k360k944
$$ plain form
62424 406146 402665 398902 395137 391449 387746 383945 380099 376414 373250 370905 369246 367776 366287 365176
62410 365176 364782 364676 364130 363205 362734 363171 364029 364661 365073 365616 366374 367279 368495 370195 372203 374413 377359
62393 377359 381738 387347 392994 397616 401098 403969 406820 410211 414674 420334 426741 433427 440490 448331
62379 448331 457015 466217 475750 485704 496010 506247 516150 526115 536982 549367 563338 578632 594964
62366 594964 612162 630333 650135 672776 699390 730265 764855 802669 844010 889610 939627
62355 939627 993282 1049419 1107017 1164959 1221594 1274819 1322511 1362792 1394176 1415942 1428399
62344 1428399 1432521 1429252 1419237 1403029 1381183 1354073 1321905 1285027 1244088 1200020 1154155 1108311
62332 1108311 1064176 1022344 982329 943859 907805 875384 846672 820439 795420 771222 747919
$$ packed form
62424D06146l481l763l765l688l703l801l846l685l164k345j659j470j489j111
62410C65176l94j06n46r25m71M37Q58O32M12N43P58R05J216J700K008K210K946
62393C77359M379N609N647M622L482K871K851L391M463N660O407O686P063P841
62379D48331Q684R202R533R954J0306J0237R903R965J0867J2385J3971J5294J6332
62366E94964J7198J8171J9802K2641K6614L0875L4590L7814M1341M5600N0017
62355I39627N3655N6137N7598N7942N6635N3225M7692M0281L1384K1766J2457
62344A428399M122l269j0015j6208k1846k7110l2168l6878m0939m4068m5865m5844
62332A108311m4135m1832m0015l8470l6054l2421k8712k6233k5019k4198k3303
$$ plain form
62321 747919 725278 702837 680459 658473 637311 617284 598679 581760 566485 552356 538749
62310 538749 525457 512850 501459 491519 482963 475741 469914 465421 461988 459332 457276 455574 453910
62297 453910 452271 451079 450673 450854 451278 452158 454086 457139 460610 463821 466791 469861 472987 475743 477826
62282 477826 479286 480380 481510 483198 485827 489375 493580 498301 503548 509233 515175 521350 528025 535681
62268 535681 545000 556862 571941 590231 611187 634570 660982 691415 726355 765517 808451 855188
62256 855188 906091 961042 1018936 1078134 1137359 1195831 1252404 1304864 1350487 1387241 1414193
62245 1414193 1430954 1437287 1433453 1420436 1399451 1371380 1336879 1296653 1251272 1201020 1146468 1089169
62233 1089169 1031327 974698 920138 868135 819242 773840 732046 694190 661005 632931 609448
$$ packed form
62321G47919k2641k2441k2378k1986k1162k0027j8605j6919j5275j4129j3607
62310E38749j3292j2607j1391r940q556p222n827m493l433k656k056j702j664
62297D53910j639j192m06J81M24Q80J928L053L471L211K970L070L126K756K083
62282D77826J460J094J130J688K629L548M205M721N247N685N942O175O675P656
62268E35681R319J1862J5079J8290K0956K3383K6412L0433L4940L9162M2934M6737
62256H55188N0903N4951N7894N9198N9225N8472N6573N2460M5623L6754K6952
62245A414193J6761O333l834j3017k0985k8071l4501m0226m5381n0252n4552n7299
62233A089169n7842n6629n4560n2003m8893m5402m1794l7856l3185k8074k3483
$$ plain form
62222 609448 589465 572121 556848 542958 529915 517995 508071 500457 494389 488841 483441 478308 473482
62209 473482 468963 465049 462049 459728 457493 455170 453208 452073 451792 452167 453105 454619 456807 460009 464660
62194 464660 470759 477723 485015 492715 501235 510620 520464 530395 540377 550617 561449 573217 585819
62181 585819 598299 609300 618212 625675 632745 639831 646711 653420 660682 669451 680371 693852 710429
62168 710429 730812 755590 784980 818771 856369 896891 939369 982847 1026223 1067927 1105874
62157 1105874 1137910 1162512 1179198 1188342 1190559 1186294 1175997 1160509 1140962 1118126 1092005 1062276
62145 1062276 1029102 993396 956418 919321 883053 848383 815944 786399 760572 739173 722295
62134 722295 709361 699670 692855 688807 687517 689135 693863 701506 711372 722955 736477 752401 770600
$$ packed form
62222F09448j9983j7344j5273j3890j3043j1920r924p614o068n548n400n133m826
62209D73482m519l914l000k321k235k323j962j135k81L75R38J514K188L202M651
62194D64660O099O964P292P700Q520R385R844R931R982J0240J0832J1768J2602
62181E85819J2480J1001Q912P463P070P086O880O709P262Q769J0920J3481J6577
62168G10429K0383K4778K9390L3791L7598M0522M2478M3478M3376M1704L7947
62157A105874L2036K4602J6686R144K217m265j0297j5488j9547k2836k6121k9729
62145A062276l3174l5706l6978l7097l6268l4670l2439k9545k5827k1399j6878
62134G22295j2934r691o815m048j290J618M728P643R866J1583J3522J5924J8199
$$ plain form
62121 770600 790396 811262 833015 855422 878161 901049 923623 944329 960866 971807 977509 979200
62109 979200 977720 973593 967630 960530 952043 941316 928192 913577 898464 883226 868108 853872
62097 853872 841559 831943 825497 822562 823113 826550 832141 839645 849213 860700 873380 886450 899571
62084 899571 912843 926462 940603 955518 971511 988688 1006894 1026027 1046381 1068490 1092552
62073 1092552 1118168 1144710 1171824 1199376 1226999 1254043 1280101 1305438 1330652 1355954 1380894
62062 1380894 1404832 1427583 1449415 1470371 1489609 1505535 1516681 1522433 1522977 1518756 1510207 1497902
62050 1497902 1482573 1464729 1444253 1420496 1392811 1361030 1325529 1286959 1246021 1203460 1160092
62039 1160092 1116661 1073656 1031421 990410 951090 913616 877870 843970 812386 783329 756405
$$ packed form
62121G70600J9796K0866K1753K2407K2739K2888K2574K0706J6537J0941N702J691
62109I79200j480m127n963p100q487j0727j3124j4615j5113j5238j5118j4236
62097H53872j2313r616o446k935N51L437N591P504R568J1487J2680J3070J3121
62084H99571J3272J3619J4141J4915J5993J7177J8206J9133K0354K2109K4062
62073A092552K5616K6542K7114K7552K7623K7044K6058K5337K5214K5302K4940
62062A380894K3938K2751K1832K0956J9238J5926J1146N752N44m221q549j2305
62050A497902j5329j7844k0476k3757k7685l1781l5501l8570m0938m2561m3368
62039A160092m3431m3005m2235m1011l9320l7474l5746l3900l1584k9057k6924
$$ plain form
62028 756405 731296 708569 689192 673238 659573 646897 634633 622668 610831 599037 587603
62017 587603 576953 567116 557855 549151 541276 534448 528715 524142 520889 519076 518704 519639 521529 523908
62003 523908 526607 530025 534771 541013 548257 555563 561787 565899 567563 567464 566635 565323 562751 558121 551526
61988 551526 543700 535175 525952 515865 505010 493846 483089 473434 465154 457932 451200 444702 438618
61975 438618 433175 428282 423651 419225 415393 412718 411323 410516 409202 406891 404280 402568 402128 402158 401783
61960 401783 401193 401340 402732 405070 408057 411909 416747 421991 426934 431689 437093 443766 451791 461259 472527
61945 472527 485729 500534 516735 534791 555425 578848 604575 631823 659904 688366 716953
61934 716953 745303 772658 798192 821745 843862 864823 884046 900768 914859 926384 934693 938756
$$ packed form
62028G56405k5109k2727j9377j5954j3665j2676j2264j1965j1837j1794j1434
62017E87603j0650r837r261q704p875o828n733m573l253j813l72R35J890K379
62003E23908K699L418M746O242P244P306O224M112J664r9q29j312k572m630o595
61988E51526p826q525r223j0087j0855j1164j0757r655q280p222o732o498o084
61975D38618n443m893m631m426l832k675j395q07j314k311k611j712m40L0l75
61960D01783n90J47J392K338K987L852M838N244M943M755N404O673Q025R468J1268
61945D72527J3202J4805J6201J8056K0634K3423K5727K7248K8081K8462K8587
61934G16953K8350K7355K5534K3553K2117K0961J9223J6722J4091J1525Q309M063
$$ plain form
61922 938756 938385 934418 927630 918180 906407 893549 881154 870204 861172 854575 850985 850760 854226 861873
61908 861873 873762 888840 905364 922086 938613 954555 968867 980323 988234 992289 991910 986222
61896 986222 974776 958134 937648 914740 890293 864621 838004 811286 785809 762520 741229
61885 741229 720955 701016 681562 663076 645758 629602 614715 601128 588451 576169 564268
61874 564268 553235 543453 534995 528051 523081 520277 519289 519810 522075 526375 532366 539385 547393 557099
61860 557099 569146 583583 600267 619384 641369 666576 695168 727138 762252 800096 840320
61849 840320 882760 927231 973259 1019981 1066165 1110354 1151180 1187611 1218854 1244133 1262779
61838 1262779 1274480 1279278 1277420 1269521 1256825 1240991 1223540 1205775 1189142 1175259 1165436 1160428
$$ packed form
61922I38756l71l967o788r450j1773j2858j2395j0950r032o597l590k25L466P647
61908H61873J1889J5078J6524J6722J6527J5942J4312J1456P911M055l79n688
61896I86222j1446j6642k0486k2908k4447k5672k6617k6718k5477k3289k1291
61885G41229k0274j9939j9454j8486j7318j6156j4887j3587j2677j2282j1901
61874E64268j1033r782q458o944m970k804r88N21K265M300N991P019Q008R706
61860E57099J2047J4437J6684J9117K1985K5207K8592L1970L5114L7844M0224
61849H40320M2440M4471M6028M6722M6184M4189M0826L6431L1243K5279J8646
61838A262779J1701M798j858p899j2696j5834j7451j7765j6633j3883r823n008
$$ plain form
61826 1160428 1160622 1165969 1175604 1187998 1201738 1215791 1228797 1238613 1243007 1240568 1230743 1213413 1188946
61813 1188946 1158343 1122760 1082985 1039803 994713 949650 905893 863695 823157 785093 750792
61802 750792 721030 695395 672647 651854 633240 617642 604990 593743 582320 570878 561053 553939
61790 553939 548800 543937 538332 532230 526466 521513 517130 512717 507969 503099 498384 493767 489136 484728
61776 484728 480810 477204 473661 470605 468817 468303 468157 467754 467447 467698 468204 468484 468867 470181 472621 475563
61760 475563 478462 481360 484408 487408 490060 492357 494477 496441 498091 499384 500513 501710 502946 503960
61746 503960 504590 504937 505090 504829 503936 502753 502002 501947 502107 502073 502210 503153 504825 506469 507606 508589 510114 512490
61728 512490 515468 518567 521502 524442 527918 532292 537290 542194 546571 550723 555313 560601 566134 571251
$$ packed form
61826A160428J94N347R635J2394J3740J4053J3006R816M394k439r825j7330k4467
61813A188946l0603l5583l9775m3182m5090m5063m3757m2198m0538l8064l4301
61802G50792k9762k5635k2748k0793j8614j5598j2652j1247j1423j1442r825p114
61790E53939n139m863n605o102n764m953m383m413m748m870m715m617m631m408
61776D84728l918l606l543l056j788n14j46m03l07K51N06K80L83J314K440K942
61760D75563K899K898L048L000K652K297K120J964J650J293J129J197J236J014
61746E03960O30L47J53k61q93j183p51n5J60l4J37R43J672J644J137R83J525K376
61728E12490K978L099K935K940L476M374M998M904M377M152M590N288N533N117
$$ plain form
61714 571251 575863 580540 585631 590441 593609 594384 593218 591080 588583 585963 583373 580703 577402 573015
61700 573015 567782 562348 557021 551773 546811 542552 539037 535860 532734 529619 526278 522326 517907 513764
61686 513764 510295 507020 503377 499618 496428 493933 491647 489234 486782 484338 481665 478671 475722 473320
61672 473320 471627 470442 469527 468746 467959 466992 465810 464701 464083 464031 464073 463617 462581 461484 460975 461415 462865
61655 462865 465166 467894 470444 472417 473919 475510 477874 481468 486217 491519 496761 501847 506998 512135
61641 512135 516852 521038 524996 528717 531497 532644 532173 530377 527139 522278 516375 510639 505864 502017
61627 502017 498747 495774 492782 489546 486396 484081 482908 482488 482554 483520 485767 488713 491220 492778 493707
61612 493707 494127 493297 490341 485350 479374 473368 467440 461257 454862 448757 443244 438065 432817 427440 422035
$$ packed form
61714E71251M612M677N091M810L168P75j166k138k497k620k590k670l301m387
61700E73015n233n434n327n248m962m259l515l177l126l115l341l952m419m143
61686E13764l469l275l643l759l190k495k286k413k452k444k673k994k949k402
61672D73320j693j185r15p81p87r67j182j109o18n2M2m56j036j097n09M40J450
61655D62865K301K728K550J973J502J591K364L594M749N302N242N086N151N137
61641E12135M717M186L958L721K780J147m71j796l238m861n903n736m775l847
61627E02017l270k973k992l236l150k315j173m20O6R66K247K946K507J558R29
61612D93707M20q30k956m991n976o006n928o183o395o105n513n179n248n377n405
$$ plain form
61597 422035 416483 410605 404644 399155 394415 390279 386653 383717 381499 379610 377653 375641 373713 371620
61583 371620 368843 365162 360877 356499 352435 348966 346260 344282 342763 341323 339670 337672 335275 332396
61569 332396 329037 325624 322985 321594 320859 319603 317468 315463 314798 315496 316528 317037 316921 316335 315268 313848
61553 313848 312602 312108 312483 313372 314295 314898 315037 314824 314581 314663 315278 316437 317957 319556 321104 322768 324779
61536 324779 327091 329445 331775 334275 336965 339428 341153 342002 342228 342102 341687 340884 339561 337614 334942
61521 334942 331401 326884 321707 316868 313577 312242 312093 312051 311797 311710 311936 312049 311758 311451 311622 312037 311921
61504 311921 310959 309662 308610 307755 306686 305322 303946 302776 301864 301358 301431 301887 302275 302523 303056 304035 304893
61487 304893 305003 304501 304011 303814 303828 304244 305457 307237 308610 308892 308418 307891 307475 306945 306429 306379 306855 307374
$$ packed form
61597D22035n552n878n961n489m740m136l626k936k218j889j957k012j928k093
61583C71620k777l681m285m378m064l469k706j978j519j440j653j998k397k879
61569C32396l359l413k639j391p35j256k135k005o65O98J032N09j16n86j067j420
61553C13848j246m94L75Q89R23O03J39k13k43Q2O15J159J520J599J548J664K011
61536C24779K312K354K330K500K690K463J725Q49K26j26m15q03j323j947k672
61521C34942l541m517n177m839l291j335j49m2k54q7K26J13k91l07J71M15j16
61504C11921r62j297j052q55j069j364j376j170r12n06P3M56L88K48N33R79Q58
61487C04893J10n02m90j97J4M16J213J780J373K82m74n27m16n30n16n0M76N19
$$ plain form
61469 307374 307565 307563 307593 307554 307312 307142 307448 308095 308375 307820 306800 306068 305865 305796 305593 305545 305927 306304 305965 304992
61449 304992 304419 305058 306540 307819 308468 309105 310572 313012 315869 318616 321262 324163 327481 331018 334583
61434 334583 338331 342509 346984 351289 355185 358858 362446 365632 367947 369319 370077 370536 370823 371027 371305
61419 371305 371840 372793 374228 375941 377473 378530 379305 380109 380724 380354 378342 374803 370499 366241 362427 359012
61403 359012 355823 352915 350497 348454 346128 342985 339433 336557 334879 333773 332394 330823 329835 329719 329962
61388 329962 330155 330614 331698 332980 333644 333554 333358 333526 333882 334237 334866 335958 337096 337909 338932 341079 344291
61371 344291 347400 349473 350681 351682 352742 353859 355180 356783 358391 359821 361445 363736 366611 369764
61357 369764 373433 378194 384014 390164 396183 402429 409498 417559 426513 436418 447399 459277 471543
$$ packed form
61469C07374J91kL0l9k42j70L06O47K80n55j020p32k03o9k03m8L82L77l39r73
61449C04992n73O39J482J279O49O37J467K440K857K747K646K901L318L537L565
61434C34583L748M178M475M305L896L673L588L186K315J372P58M59K87K04K78
61419C71305N35R53J435J713J532J057P75Q04O15l70k012l539m304m258l814l415
61403C59012l189k908k418k043k326l143l552k876j678j106j379j571r88j16K43
61388C29962J93M59J084J282O64r0j96J68L56L55O29J092J138Q13J023K147L212
61371C44291L109K073J208J001J060J117J321J603J608J430J624K291K875L153
61357C69764L669M761N820O150O019O246P069Q061Q954R905J0981J1878J2266
$$ plain form
61344 471543 483581 494755 504489 512476 518812 523815 527750 530711 532696 533715 533898 533495 532771 531867 530732
61329 530732 529044 526224 521839 516158 510103 504464 499466 495225 492164 490451 489406 488161 486760 485875
61315 485875 485529 484915 483652 482464 482303 483388 485459 488416 492262 496861 502257 508856 516851 525700 534518
61300 534518 542706 549868 555532 559447 561848 562912 562182 559129 554185 548597 543202 537780 531729 524987
61286 524987 518170 512137 507543 504559 502755 501347 499753 498060 497012 497520 499978 503978 508741 513777
61272 513777 518990 524287 529549 535036 541328 548599 556372 564207 572220 580635 589277 597963 607023 616980
61258 616980 628008 640126 653476 667808 681984 694712 705621 715011 722753 728169 730919 731221 729185
61245 729185 724699 718136 710372 701837 692226 681554 670862 661387 653464 646720 640925 636102 631960 627879
$$ packed form
61344D71543J2038J1174R734P987O336N003L935K961J985J019J83m03p24r04j135
61329E30732j688k820m385n681o055n639m998m241l061j713j045j245j401q85
61315D85875l46o14j263j188j61J085K071K957L846M599N396O599P995Q849Q818
61300E34518Q188P162N664L915K401J064p30l053m944n588n395n422o051o742
61286E24987o817o033m594k984j804j408j594j693j048N08K458M000M763N036
61272E13777N213N297N262N487O292P271P773P835Q013Q415Q642Q686R060R957
61258F16980J1028J2118J3350J4332J4176J2728J0909R390P742N416K750L02k036
61245G29185m486o563p764q535r611j0672j0692r475p923o744n795m823m142m081
$$ plain form
61231 627879 623560 619433 616300 614669 614412 614994 616011 617441 619345 621488 623511 625341 627165 629092 631128
61216 631128 633384 635838 638005 639325 639926 640513 641412 642264 642792 643361 644479 646197 648275 650590 653166 656133
61200 656133 659897 665067 672021 680899 692087 706182 723161 742029 761617 781375 801170 820754
61188 820754 839768 857746 873823 886951 896922 904751 911538 917392 921937 925296 927810 929203 928914
61175 928914 927057 924158 920026 913790 905211 895155 884533 873451 861662 849181 836066 822132
61163 822132 807360 792260 777412 762883 748519 734576 721667 710118 699737 690225 681552 673859
61151 673859 667294 662210 659340 659322 661752 664963 667153 667768 667431 666646 665103 662375 658552 653763 647711
61136 647711 640434 633122 627361 623677 621540 620745 621966 625792 631928 639649 648527 658441 669375 681534
$$ packed form
61231F27879m319m127l133j631k57N82J017J430J904K143K023J830J824J927K036
61216F31128K256K454K167J320O01N87Q99Q52N28N69J118J718K078K315K576K967
61200F56133L764N170O954Q878J1188J4095J6979J8868J9588J9758J9795J9584
61188H20754J9014J7978J6077J3128R971P829O787N854M545L359K514J393k89
61175I28914j857k899m132o236q579j0056j0622j1082j1789j2481j3115j3934
61163H22132j4772j5100j4848j4529j4364j3943j2909j1549j0381r512q673p693
61151F73859o565n084k870j8K430L211K190O15l37p85j543k728l823m789o052
61136F47711p277p312n761l684k137p95J221L826O136P721Q878R914J0934J2159
$$ plain form
61122 681534 695316 710906 728166 747035 767616 789674 812484 835529 859022 883409 908628
61111 908628 934050 958912 982519 1004358 1024269 1042343 1058428 1072026 1082895 1091367 1097740 1101634
61099 1101634 1102433 1100137 1095253 1087839 1077140 1062321 1043348 1021042 996445 970271 942896 914731
61087 914731 886503 859015 832695 807563 783672 761357 741000 722764 706651 692470 679647
61076 679647 667437 655655 644954 636108 629217 623889 619866 617049 615154 613922 613633 614871 617606 620938
61062 620938 623960 626664 629829 634257 640190 647207 654457 661231 667632 674669 683503 694566 707482 721677
61048 721677 736884 753147 770637 789628 810407 833039 857257 882801 909763 938375 968458
61037 968458 999420 1030865 1062884 1095564 1128607 1161835 1195875 1231820 1270197 1310639 1352541
$$ packed form
61122F81534J3782J5590J7260J8869K0581K2058K2810K3045K3493K4387K5219
61111I08628K5422K4862K3607K1839J9911J8074J6085J3598J0869Q472O373L894
61099A101634P99k296m884p414j0699j4819j8973k2306k4597k6174k7375k8165
61087I14731k8228k7488k6320k5132k3891k2315k0357j8236j6113j4181j2823
61076F79647j2210j1782j0701q846o891n328m023k817j895j232k89J238K735L332
61062F20938L022K704L165M428N933P017P250O774O401P037Q834J1063J2916J4195
61048G21677J5207J6263J7490J8991K0779K2632K4218K5544K6962K8612L0083
61037I68458L0962L1445L2019L2680L3043L3228L4040L5945L8377M0442M1902
$$ plain form
61026 1352541 1395675 1440084 1485843 1533100 1582165 1633594 1688565 1749229 1818276 1898018 1990218
61015 1990218 2096780 2220145 2363274 2530467 2728802 2967918 3257388 3604544 4015491
61006 4015491 4497718 5060996 5716767 6478863 7365481 8398520 9598140 10975512 12527146
60997 12527146 14229073 16026714 17823040 19478135 20834289 21765441 22228167 22283455 22074506
60988 22074506 21773006 21521124 21390064 21361505 21332205 21143489 20633626 19697985 18330790
60979 18330790 16627171 14745110 12849397 11067042 9471070 8088691 6918158 5942239
60971 5942239 5136380 4474246 3931550 3487358 3123563 2824389 2576560 2369306 2193834
60962 2193834 2042885 1910800 1793731 1689450 1596640 1514138 1440668 1375233 1317348 1266515
$$ packed form
61026A352541M3134M4409M5759M7257M9065N1429N4971O0664O9047P9742R2200
61015A990218J06562J23365J43129J67193J98335K39116K89470L47156M10947
61006D015491M82227N63278O55771P62096Q86618J033039J199620J377372J551634
60997A2527146J701927J797641J796326J655095J356154R31152M62726N5288k08949
60988B2074506l01500k51882j31060k8559k9300j88716n09863r35641j367195
60979A8330790j703619j882061j895713j782355j595972j382379j170533r75919
60971E942239q05859o62134n42696m44192l63795k99174k47829k07254j75472
60962B193834j50949j32085j17069j04281r2810q2502p3470o5435n7885n0833
$$ plain form
60952 1266515 1221541 1180811 1143169 1108023 1074591 1041759 1009004 976806 945651 915155 884805
60941 884805 855145 827404 801986 778044 754596 731512 709251 688160 668334 649792 632423
60930 632423 615880 599817 584296 569866 557083 545837 535225 524365 513452 503698 495991 489851
60918 489851 484054 478069 472507 468259 465643 464383 463981 463967 464061 464276 464848 466060 468150 471103 474311 476741
60902 476741 477899 478459 479496 481222 482925 484050 484710 485124 485235 485056 484757 484152 482680 480284 477782 475915
60886 475915 474490 472892 470978 468801 465843 461362 455529 449540 444438 440209 436164 431737 426772 421429
60872 421429 416139 411460 407734 404899 402665 400750 398974 397341 396151 395916 397075 399831 404105 409490
60858 409490 415278 420787 425666 429813 433116 435561 437493 439438 441701 444443 448101 453155 459305 465352
$$ packed form
60952A266515m4974m0730l7642l5146l3432l2832l2755l2198l1155l0496l0350
60941H84805k9660k7741k5418k3942k3448k3084k2261k1091j9826j8542j7369
60930F32423j6543j6063j5521j4430j2783j1246j0612j0860j0913r754p707o140
60918D89851n797n985n562m248k616j260m02j4R4K15N72J212K090K953L208K430
60902D76741J158N60J037J726J703J125O60M14J11j79k99o05j472k396k502j867
60886D75915j425j598j914k177k958m481n833n989n102m229m045m427m965n343
60872D21429n290m679l726k835k234j915j776j633j190k35J159K756M274N385
60858D09490N788N509M879M147L303K445J932J945K263K742L658N054O150O047
$$ plain form
60844 465352 470250 473969 477013 479459 480980 481613 481871 482005 481632 480323 478229 475905 473758 471961 470722
60829 470722 470259 470439 470699 470487 469692 468537 467166 465497 463494 461349 459225 456857 453592 448919 442926
60814 442926 436266 429717 423651 417776 411461 404540 397759 392195 388154 384995 382126 379745 378233 377124
60800 377124 375260 371971 367720 363579 360462 358839 358681 359387 360194 360953 362207 364234 366415 367918 368786
60785 368786 369754 371157 372604 373819 375253 377553 380745 384267 387627 390790 394047 397740 402027 406767
60771 406767 411648 416526 421524 426768 432208 437782 443554 449536 455561 461508 467448 473346 478801 483356
60757 483356 486981 489987 492592 494844 496770 498207 498643 497746 496096 494829 494416 494270 493745 492947 492156 491032
60741 491032 489011 486212 483227 480069 476102 471137 466013 461703 458237 454899 451228 447436 443941 440920
$$ packed form
60844D65352M898L719L044K446J521O33K58J34l73j309k094k324k147j797j239
60829D70722m63J80K60k12p95j155j371j669k003k145k124k368l265m673n993
60814D42926o660o549o066n875o315o921o781n564m041l159k869k381j512j109
60800C77124j864l289m251m141l117j623j58P06Q07P59J254K027K181J503Q68
60785C68786R68J403J447J215J434K300L192L522L360L163L257L693M287M740
60771D06767M881M878M998N244N440N574N772N982O025N947N940N898N455M555
60757D83356L625L006K605K252J926J437M36q97j650j267m13j46n25p98p91j124
60741D91032k021k799k985l158l967m965n124m310l466l338l671l792l495l021
$$ plain form
60727 440920 438430 436682 435945 436227 437242 438813 441185 444710 449195 453892 458370 463141 469042 476109 483566
60712 483566 490976 498877 508034 518482 529688 541347 553582 566475 579863 593616 607748 622209
60700 622209 636833 651551 666339 680886 694591 707159 718989 730769 742671 754051 763890 771448
60688 771448 776594 779680 781132 781132 779628 776595 772100 766132 758523 749246 738698 727522 716132 704575
60674 704575 692829 680997 669054 656566 643021 628541 614035 600488 588154 576580 565285
60663 565285 554150 543202 532380 521728 511586 502357 494127 486737 480181 474693 470439 467326 465215
60650 465215 464096 463868 464027 463850 463033 461984 461327 461114 460748 459749 458352 457108 456069 454778 453127 451743
60634 451743 451302 451761 452582 453460 454474 455730 457268 459271 461884 464819 467484 469568 471154 472231 472517
$$ packed form
60727D40920k490j748p37K82J015J571K372L525M485M697M478M771N901P067P457
60712D83566P410P901R157J0448J1206J1659J2235J2893J3388J3753J4132J4461
60700F22209J4624J4718J4788J4547J3705J2568J1830J1780J1902J1380R839P558
60688G71448N146L086J452%j504l033m495n968p609r277j0548j1176j1390j1557
60674G04575j1746j1832j1943j2488j3545j4480j4506j3547j2334j1574j1295
60663E65285j1135j0948j0822j0652j0142r229q230p390o556n488m254l113k111
60650D65215j119k28J59j77q17j049o57k13l66r99j397j244j039j291j651j384
60634D51743m41M59Q21Q78J014J256J538K003K613K935K665K084J586J077K86
$$ plain form
60619 472517 471886 470536 468610 466098 463346 461174 459963 458937 456876 453422 449254 445092 440985 436623
60605 436623 431940 427280 423187 420051 417725 415554 413035 410372 408036 405907 403338 400151 397054 394822
60591 394822 393429 392242 390777 389103 387820 387808 389568 392442 394882 395908 396034 396341 397026 397507 397726 398508
60575 398508 400495 403437 406825 410630 415057 420081 425747 432596 441238 451609 463037 474929 486986
60562 486986 498808 509733 519162 526726 532104 534942 535089 532815 528821 524149 519862 516454 513618 510936
60548 510936 508802 508292 510102 514056 519722 527003 535852 545880 556744 568671 582085 596747 611577
60535 611577 625250 636736 645419 651066 653704 653291 649622 642905 634327 625597 617784 610893 604612 599082
60521 599082 594791 592004 590518 589791 589155 588167 586976 586217 586376 587427 589230 592075 596510 602642 609872
$$ packed form
60619D72517o31j350j926k512k752k172j211j026k061l454m168m162m107m362
60605D36623m683m660m093l136k326k171k519k663k336k129k569l187l097k232
60591C94822j393j187j465j674j283j2J760K874K440J026J26L07O85M81K19P82
60575C98508J987K942L388L805M427N024N666O849Q642J0371J1428J1892J2057
60562D86986J1822J0925R429P564N378K838J47k274l994m672m287l408k836k682
60548E10936k134n10J810L954N666P281Q849J0028J0864J1927J3414J4662J4830
60535F11577J3673J1486Q683N647K638m13l669o717q578q730p813o891o281n530
60521E99082m291k787j486p27o36r88j191p59J59J051J803K845M435O132P230
$$ plain form
60506 609872 617439 625267 634312 646081 661610 680789 702755 727096 754535 786305 822892 863544
60494 863544 906983 952300 998971 1045984 1091210 1131907 1165896 1192019 1209347 1216333 1211250 1193449
60482 1193449 1163841 1124206 1076551 1023224 966980 910436 855586 804012 757055 715342 678517
60471 678517 645973 617644 593581 573053 554756 537951 522782 509454 497748 487516 478974 472067
60459 472067 465961 459634 452741 445647 438928 433205 429082 426671 425210 423594 421348 418786 416308 413990
60445 413990 411886 410331 409633 409648 409823 409623 408854 407717 406601 405699 404766 403346 401344 399259 397798 397300
60429 397300 397534 397925 397935 397382 396496 395606 394758 393783 392784 392279 392664 393668 394631 395219 395631 396145 396815 397689 398996
60410 398996 400834 402788 404192 404809 405161 406047 407698 409398 410082 409495 408656 408876 410343 411981 412825 413046
$$ packed form
60506F09872P567P828R045J1769J5529J9179K1966K4341K7439L1770L6587M0652
60494H63544M3439M5317M6671M7013M5226M0697L3989K6123J7328O986n083j7801
60482A193449k9608l9635m7655n3327n6244n6544n4850n1574m6957m1713l6825
60471F78517l2544k8329k4063k0528j8297j6805j5169j3328j1706j0232q542o907
60459D72067o106o327o893p094o719n723m123k411j461j616k246k562k478k318
60445D13990k104j555o98J5J75k00p69j137j116r02r33j420k002k085j461m98
60429C97300K34L91J0n53q86q90q48r75r99n05L85J004R63N88M12N14O70Q74J307
60410C98996J838J954J404O17L52Q86J651J700O84n87q39K20J467J638Q44K21
$$ plain form
60394 413046 413356 413883 414248 414529 415425 417317 419681 421643 422799 423373 423976 425361 427956 431315 434366 436497
60378 436497 438149 440071 442298 444276 445742 447055 448695 450748 452876 454569 455550 456074 456636 457215 457209 456442
60362 456442 455785 456136 457101 457543 457337 457625 459134 461154 462701 463894 465441 467298 468798 469973 471902 475530
60346 475530 480741 486777 493105 499577 506098 512468 518358 523220 526410 527689 527458 526259 524119 520671
60332 520671 515850 510185 504390 498976 494303 490627 487806 485247 482515 479833 477674 476007 474433 472990
60318 472990 472251 472465 473142 473800 474733 476593 479520 483195 487614 493357 501077 511013 522946 536321 550518
60303 550518 565439 581835 600640 621805 643928 664897 682636 695422 702175 702780 697904 688381
60291 688381 675015 659004 642085 625924 611405 598576 587087 576589 566995 558435 550777 543225
$$ packed form
60394D13046L10N27L65K81Q96J892K364J962J156N74O03J385K595L359L051K131
60378D36497J652J922K227J978J466J313J640K053K128J693R81N24N62N79op67
60362D56442o57L51R65M42k06K88J509K020J547J193J547J857J500J175J929L628
60346D75530N211O036O328O472O521O370N890M862L190J279k31j199k140l448
60332E20671m821n665n795n414m673l676k821k559k732k682k159j667j574j443
60318D72990p39K14O77O58R33J860K927L675M419N743P720R936J1933J3375J4197
60303E50518J4921J6396J8805K1165K2123K0969J7739J2786O753O05m876r523
60291F88381j3366j6011j6919j6161j4519j2829j1489j0498r594q560p658p552
$$ plain form
60279 543225 534772 525200 515332 506139 497878 490218 482849 475757 469170 463511 459179 456158 453967 452119
60265 452119 450445 448879 447250 445474 443697 442059 440561 439303 438577 438484 438734 438983 439132 439150 438973 438765 438886
60248 438886 439302 439457 439102 438841 439372 440509 441523 442179 442832 443596 444106 444221 444538 445950 448872 452873 456903
60231 456903 460011 462132 464092 466649 469707 472737 475647 478821 482414 486078 489254 491454 492475 492776
60217 492776 493395 494954 496955 498678 500505 503499 507732 511986 515318 518106 521194 524807 528760 533040
60203 533040 537515 541577 544741 547253 549479 551017 551107 549892 548577 548208 548700 549194 549038 548280 547368 546553
60187 546553 545581 544006 541813 539528 537590 535834 533836 531638 529819 528897 528884 529393 529887 529863 529110 528005
60171 528005 527367 527766 528921 529925 530143 529812 529670 530036 530494 530583 530519 530943 532085 533547 534871 535974 536964
$$ packed form
60279E43225q453r572r868r193q261p660p369p092o587n659m332l021k191j848
60265D52119j674j566j629j776j777j638j498j258p26r3K50K49J49J8j77k08J21
60248D38886M16J55l55k61N31J137J014O56O53P64N10J15L17J412K922M001M030
60231D56903L108K121J960K557L058L030K910L174L593L664L176K200J021L01
60217D92776O19J559K001J723J827K994M233M254L332K788L088L613L953M280
60203E33040M475M062L164K512K226J538R0j215j315l69M92M94j56p58r12q15
60187E46553r72j575k193k285j938j756j998k198j819r22j3N09M94k4p53j105
60171E28005o38L99J155J004K18l31j42L66M58Q9o4M24J142J462J324J103R90
$$ plain form
60154 536964 537960 539273 541363 544290 547454 550179 552413 554557 556802 559015 561246 563926 567380 571425
60140 571425 575656 580055 585091 591227 598492 606582 615187 623936 632120 638844 643670 646849 648664 648886
60126 648886 647227 644081 640257 636085 631392 626342 621571 617322 613153 608849 605016 602205 599961 597380
60112 597380 594333 591526 589501 588129 586964 585606 583799 581642 579662 578218 576925 575176 573141 571628
60098 571628 570922 570405 569555 568797 569017 570658 573601 577516 581949 586339 590425 594562 599348 605024 611439
60083 611439 618397 625732 633114 640092 646334 651655 655877 658841 660504 660864 659842 657360 653411 647881
60069 647881 640490 631282 621092 611153 602110 593678 585321 576935 568739 560819 553196 546157 540120 535085
60055 535085 530458 525549 520189 514790 509953 506065 503232 501488 500902 501398 502485 503424 503870 504257 505377
$$ packed form
60154E36964R96J313K090K927L164K725K234K144K245K213K231K680L454M045
60140E71425M231M399N036O136P265Q090Q605Q749Q184O724M826L179J815K22
60126F48886j659l146l824m172m693n050m771m249m169m304l833k811k244k581
60112E97380l047k807k025j372j165j358j807k157j980j444j293j749k035j513
60098E71628p06n17q50p58K20J641K943L915M433M390M086M137M786N676O415
60083F11439O958P335P382O978O242N321M222K964J663L60j022k482l949n530
60069F47881p391r208j0190r939r043q432q357q386q196p920p623p039o037n035
60055E35085m627m909n360n399m837l888k833j744n86M96J087R39M46L87J120
$$ plain form
60040 505377 507577 510514 513571 516214 517952 518350 517343 515386 513049 510555 507858 505024 502251 499459
60026 499459 496139 491763 486367 480632 475312 470607 466143 461564 456969 452615 448451 444300 440383 437214
60012 437214 434909 433048 431373 430230 430046 430771 432102 433863 435833 437549 438817 440125 442127 444853 447845
59997 447845 450776 453509 455872 458001 460649 464421 468840 472823 476024 478990 482097 485200 488313 491670
59983 491670 494850 496775 497061 496613 496453 496607 496577 496194 495498 494436 493303 492872 493452 494348 494859 495251 496088 497283
59965 497283 498657 500846 504519 509020 512931 515900 518913 522686 526787 530509 533630 536034 537391 537653
59951 537653 537219 536212 534158 530804 526759 522876 519299 515448 510745 505150 499310 494290 490810 488493
59937 488493 486118 482796 478655 474375 470525 467434 465212 463545 461839 459919 458357 457816 458281 459162 459946
$$ packed form
60040E05377K200K937L057K643J738L98j007j957k337k494k697k834k773k792
60026D99459l320m376n396n735n320m705m464m579m595m354m164m151l917l169
60012D37214k305j861j675j143j84P25J331J761J970J716J268J308K002K726K992
59997D47845K931K733K363K129K648L772M419L983L201K966L107L103L113L357
59983D91670L180J925K86m48j60J54l0l83o96j062j133m31N80Q96N11L92Q37J195
59965D97283J374K189L673M501L911K969L013L773M101L722L121K404J357K62
59951E37653m34j007k054l354m045l883l577l851m703n595n840n020l480k317
59937D88493k375l322m141m280l850l091k222j667j706j920j562n41M65Q81P84
$$ plain form
59922 459946 460607 461594 463594 467002 471403 475798 479563 482960 486575 490571 494790 499257 504246 509922 516197
59907 516197 522817 529364 535308 540354 544724 548854 552773 555960 557869 558534 558617 558820 559266 559562 559471 559332
59891 559332 559646 560517 561850 563890 567009 570942 574752 577780 580290 583004 586379 590521 595356 600500 605140
59876 605140 608455 610201 610819 611097 611664 612558 613123 612573 610747 608217 605663 603510 602068 601482 601316 600676
59860 600676 599078 596881 594688 592679 590832 589353 588514 588356 588951 590647 593653 597652 602186 607173 612541
59845 612541 617585 621209 622823 622613 621061 618599 615692 612857 610489 608845 608030 607621 606447 603205 597459
59830 597459 589821 581231 572346 563531 555029 547007 539694 533454 528406 523907 518861 512820 506614 501620
59816 501620 498408 496207 493679 490127 485903 481750 477981 474464 471203 468547 466741 465593 464657 463566
$$ packed form
59922D59946O61R87K000L408M401M395L765L397L615L996M219M467M989N676O275
59907E16197O620O547N944N046M370M130L919L187J909O65Q3K03M46K96r1j39
59891E59332L14Q71J333K040L119L933L810L028K510K714L375M142M835N144M640
59876F05140L315J746O18K78N67Q94N65n50j826k530k554k153j442n86j66o40
59860F00676j598k197k193k009j847j479q39j58N95J696L006L999M534M987N368
59845F12541N044L624J614k10j552k462k907k835k368j644q15m09j174l242n746
59830E97459p638q590q885q815q502q022p313o240n048m499n046o041o206m994
59816E01620l212k201k528l552m224m153l769l517l261k656j806j148r36j091
$$ plain form
59802 463566 462154 460678 459905 460440 461700 462136 460895 458713 456735 454997 452855 450479 448894 448497 448461 447875
59786 447875 446815 445926 445456 445179 444977 445167 446244 448330 450744 452272 452236 451300 450849 451535 452812 453917 454819
59769 454819 456005 457761 459955 462333 464814 467614 471130 475557 480589 485744 490924 496375 502160 508009
59755 508009 513669 519032 523975 528557 533419 539421 546716 554622 562482 570155 577557 584366 590553 596564
59741 596564 602579 608078 612552 616124 618891 620231 619521 617296 614860 612872 610996 608913 606873 605035
59727 605035 602986 600359 597475 594936 592841 590836 588860 587391 586786 586623 585934 584183 581812 579732 578417
59712 578417 577707 577392 577569 578375 579779 581872 584951 588974 593200 596827 599813 602643 605427 607695 609081
59697 609081 609775 610224 610746 611509 612545 613634 614377 614480 613830 612390 610252 607713 604933 601609 597449 592952
$$ packed form
59802D63566j412j476p73N35J260M36j241k182j978j738k142k376j585l97l6n86
59786D47875j060q89m70k77k02J90J077K086K414J528l6r36m51O86J277J105R02
59769D54819J186J756K194K378K481K800L516M427N032N155N180N451N785N849
59755E08009N660N363M943M582M862O002P295P906P860P673P402O809O187O011
59741E96564O015N499M474L572K767J340p10k225k436j988j876k083k040j838
59727F05035k049k627k884k539k095k005j976j469o05j63o89j751k371k080j315
59712E78417p10l15J77Q06J404K093L079M023M226L627K986K830K784K268J386
59697F09081O94M49N22P63J036J089P43J03o50j440k138k539k780l324m160m497
$$ plain form
59681 592952 589178 586560 584450 582066 579359 576596 573599 569991 565866 561611 557225 552431 547488 543232
59667 543232 540138 537743 535242 532352 529417 526976 525435 524861 524796 524494 523686 523030 523515 525411 528034 530536
59651 530536 532664 534687 536750 538492 539333 539079 538185 537263 536261 534311 530610 525354 519598 514279 509658
59636 509658 505639 502157 499101 496293 493933 492793 493452 495386 497243 498131 498342 498695 499474 500213 500282 499392
59620 499392 497689 495646 493868 492697 491811 490313 487386 482978 477896 473243 469801 467839 467296 467975 469564
59605 469564 471660 473927 476172 478202 479742 480612 480950 481130 481511 482354 483886 486203 489049 491874 494179
59590 494179 495802 496908 497790 498607 499225 499394 499234 499315 499932 500432 499720 497459 494350 491138 487808 484028 479893
59573 479893 475776 471749 467653 463639 460173 457536 455663 454464 453953 454020 454332 454576 454600 454416 454238 454477 455422
$$ packed form
59681E92952l774k618k110k384k707k763k997l608m125m255m386m794m943m256
59667E43232l094k395k501k890k935k441j541n74o5l02q08o56M85J896K623K502
59651E30536K128K023K063J742Q41k54q94r22j002j950l701n256n756n319m621
59636E09658m019l482l056k808k360j140O59J934J857Q88K11L53P79P39O9q90
59620D99392j703k043j778j171q86j498k927m408n082m653l442j962n43O79J589
59605D69564K096K267K245K030J540Q70L38J80L81Q43J532K317K846K825K305
59590D94179J623J106Q82Q17O18J69j60Q1O17N00p12k261l109l212l330l780m135
59573D79893m117m027m096m014l466k637j873j199n11O7L12K44K4j84j78K39R45
$$ plain form
59556 455422 456960 458818 460928 463224 465288 466706 467818 469539 472259 475416 478422 481598 485846 491755
59542 491755 499418 508858 520162 533287 548057 564249 581351 598307 613756 626431 635223 639298
59530 639298 638788 635317 631259 628271 626830 627078 629454 634193 640641 647504 653589 658112 660557 660679 658631
59515 658631 654800 649455 642656 634439 624926 614331 603027 591623 580835 571147 562573 554733 547258
59502 547258 540266 534381 530025 526718 523390 519536 515760 512955 511249 510055 508983 508252 508316 509358 511191
59487 511191 513347 515336 517082 519151 522301 526813 532468 539050 546540 554836 563688 572984 582704 592460
59473 592460 601516 609464 616544 622969 628206 631306 631866 630402 627882 625206 623081 622056 622500 624629 628632
59458 628632 634728 643120 653885 666772 681054 695735 710101 724078 737974 751902 765529 778300
$$ packed form
59556D55422J538J858K110K296K064J418J112J721K720L157L006L176M248N909
59542D91755P663R440J1304J3125J4770J6192J7102J6956J5449J2675Q792M075
59530F39298n10l471m058k988j441K48K376M739O448O863O085M523K445J22k048
59515F58631l831n345o799q217r513j0595j1304j1404j0788r688q574p840p475
59502E47258o992n885m356l307l328l854l776k805j706j194j072p31O4J042J833
59487E11191K156J989J746K069L150M512N655O582P490Q296Q852R296R720R756
59473E92460R056P948P080O425N237L100N60j464k520k676k125j025M44K129M003
59458F28632O096Q392J0765J2887J4282J4681J4366J3977J3896J3928J3627J2771
$$ plain form
59446 778300 789781 799734 807820 813259 814844 811431 802501 788420 770559 751290 733346 718366 705934
59433 705934 694484 683161 672389 662762 654232 646696 640574 636212 633331 631734 632117 635422 641670 650181
59419 650181 660732 673746 689455 707573 727717 749393 771560 793000 813172 831778 847195
59408 847195 856204 855994 846226 829093 808131 787268 769980 758125 751494 748889 749332 751702 753622
59395 753622 751680 743137 727222 705007 678663 650963 624755 602116 583710 568924 556680 546320
59383 546320 537928 531886 528119 525840 524062 522224 520319 518641 517511 516989 516742 516400 516153 516638 518099
59368 518099 520048 522093 524632 528264 532773 537302 541362 545105 548746 552410 556656 562504 570620 580813
59354 580813 592523 605349 618952 632935 647241 662407 679027 697122 716252 735987 755902
$$ packed form
59446G78300J1481R953Q086N439J585l413q930j4081j7861j9269j7944j4980j2432
59433G05934j1450j1323j0772r627q530p536o122m362k881j597L83L305O248Q511
59419F50181J0551J3014J5709J8118K0144K1676K2167K1440K0172J8606J5417
59408H47195R009k10r768j7133k0962k0863j7288j1855o631k605M43K370J920
59395G53622j942q543j5915k2215k6344k7700k6208k2639j8406j4786j2244j0360
59383E46320q392o042l767k279j778j838j905j678j130n22k47l42k47M85J461
59368E18099J949K045K539L632M509M529M060L743L641L664M246N848Q116J0193
59354E80813J1710J2826J3603J3983J4306J5166J6620J8095J9130J9735J9915
$$ plain form
59343 755902 775317 793472 809934 824510 836815 846255 852435 855290 854820 851081 844471 835632 824848
59330 824848 811880 796687 780047 763132 746760 731399 717605 705739 695236 684918 674379
59319 674379 664619 656886 651297 647045 643570 640864 638839 637159 635773 635044 635173 636036 637788 641065 646225
59304 646225 652794 660093 668094 677255 687747 699186 710881 721792 730353 734893 734509 729416 720473
59291 720473 708662 695063 681080 668336 658167 651044 646508 643802 642641 643223 645566 649218 653744
59278 653744 659194 665869 673960 683633 695087 708128 721983 735968 750102 764572 778808 791623
59266 791623 802270 810901 818002 823775 828025 830199 829607 826052 820196 812819 803831 792658 779630 766158
59252 766158 753295 740858 728427 716511 706045 697145 689145 681764 675599 671321 668853 667474 666508
$$ packed form
59343G55902J9415J8155J6462J4576J2305R440O180K855m70l739o610q839j0784
59330H24848j2968j5193j6640j6915j6372j5361j3794j1866j0503j0318j0539
59319F74379r760p733n589m252l475k706k025j680j386p29J29Q63J752L277N160
59304F46225O569P299Q001R161J0492J1439J1695J0911Q561M540l84n093q943
59291G20473j1811j3599j3983j2744j0169p123m536k706j161N82K343L652M526
59278F53744N450O675Q091R673J1454J3041J3855J3985J4134J4470J4236J2815
59266G91623J0647Q631P101N773M250K174n92l555n856p377q988j1173j3028j3472
59252G66158j2863j2437j2431j1916j0466q900q000p381o165m278k468j379r66
$$ plain form
59239 666508 665815 665741 666655 668458 670605 672567 674094 674970 674885 673721 671657 668673 664292 658164 650745 642909
59223 642909 634970 626500 617080 606869 596420 586325 577110 569070 562071 555773 550099 545210 540948
59210 540948 536738 532294 528162 525272 524082 524320 525356 526583 527567 528160 528541 529045 529976 531595 534064 537219
59194 537219 540513 543457 546111 549022 552769 557625 563456 569716 575727 581300 586973 593342 600248 607041
59180 607041 613569 620329 627579 634867 641740 648389 655182 661989 668458 674670 680985 687460 693994 700882
59166 700882 708541 716651 724205 730594 736121 741252 745824 749219 750967 750889 749010 745595 740935 734889 726944
59151 726944 717014 705844 694392 683102 672063 661469 651520 642208 633673 626509 621223 617526 614580
59138 614580 611847 609314 607034 605029 603599 603277 604337 606605 609715 613276 616909 620571 624864 630606
$$ packed form
59239F66508o93p4R14J803K147J962J527Q76q5j164k064k984m381o128p419p836
59223F42909p939q470r420j0211j0449j0095r215q040o999o298n674m889m262
59210E40948m210m444m132k890j190K38J036J227R84N93L81N04R31J619K469L155
59194E37219L294K944K654K911L747M856N831O260O011N573N673O369O906O793
59180F07041O528O760P250P288O873O649O793O807O469O212O315O475O534O888
59166G00882P659Q110P554O389N527N131M572L395J748p8j879l415m660o046p945
59151G26944r930j1170j1452j1290j1039j0594r949r312q535p164n286l697k946
59138F14580k733k533k280k005j430l22J060K268L110L561L633L662M293N742
$$ plain form
59124 630606 637981 646411 655301 664602 674570 685316 696770 708865 721653 735275 749785 764875
59112 764875 779913 794405 808249 821314 833076 843051 851370 858474 864409 868876 871793 873231 872927
59099 872927 870505 866174 860645 854391 847632 840957 835112 829958 824443 817905 810728 803456 796082 788675
59085 788675 781912 776238 770971 764922 757559 749046 739601 729459 719160 709157 699334 689474 680007
59072 680007 671626 664356 657595 651023 644841 639135 633651 628303 623345 618874 614530 609902 604955 599982
59058 599982 595370 591443 588270 585560 582960 580362 577713 574709 571112 567351 564343 562630 561968 561866 562178
59043 562178 563041 564503 566437 568711 571348 574529 578398 582813 587406 591980 596682 601692 607036 612887
59029 612887 619723 627833 637027 647162 658606 671610 685554 699589 713901 729508 746690 764380
$$ packed form
59124F30606P375Q430Q890R301R968J0746J1454J2095J2788J3622J4510J5090
59112G64875J5038J4492J3844J3065J1762R975Q319P104N935M467K917J438l04
59099H72927k422m331n529o254o759o675n845n154n515o538p177p272p374p407
59085G88675o763n674n267o049p363q513r445j0142j0299j0003r823r860r467
59072F80007q381p270o761o572o182n706n484n348m958m471m344m628m947m973
59058E99982m612l927l173k710k600k598k649l004l597l761l008j713o62j02L12
59043E62178Q63J462J934K274K637L181L869M415M593M574M702N010N344N851
59029F12887O836Q110R194J0135J1444J3004J3944J4035J4312J5607J7182J7690
$$ plain form
59017 764380 781267 796699 810122 820356 826154 827224 824334 818782 812083 805673 800173 795057 789594
59004 789594 784073 779704 777411 777163 778443 780812 783847 786961 789618 791606 792916 793444 792947 791184 788041
58989 788041 783619 778273 772481 766535 760369 753767 746688 739342 732017 724925 718260 712323 707559 704441
58975 704441 703297 704181 706925 711367 717458 724966 733171 741232 749098 757743 768100 779922 792130 804039
58961 804039 815595 826457 835778 843303 849812 855738 859839 860235 856491 849822 841348 831109 818987
58948 818987 805623 791896 778134 764430 751292 739497 729579 721856 716568 713438 711319 708944 706009
58935 706009 703091 700482 697605 693700 688762 683549 678874 674997 671527 667800 663410 658471 653377 648415
58921 648415 643718 639492 635989 633158 630559 627818 625051 622718 621087 620092 619718 620278 622042 624743 627820
$$ packed form
59017G64380J6887J5432J3423J0234N798J070k890n552o699o410n500n116n463
59004G89594n521m369k293k48J280K369L035L114K657J988J310N28m97j763l143
58989G88041m422n346n792n946o166o602p079p346p325p092o665n937m764l118
58975G04441j144Q84K744M442O091P508Q205Q061P866Q645J0357J1822J2208J1909
58961H04039J1556J0862R321P525O509N926M101L96l744o669q474j0239j2122
58948H18987j3364j3727j3762j3704j3138j1795r918p723n288l130k119k375k935
58935G06009k918k609k877l905m938n213m675l877l470l727m390m939n094m962
58921F48415m697m226l503k831k599k741k767k333j631r95l74N60J764K701L077
$$ plain form
58906 627820 631310 636178 643392 652756 663087 673579 684631 697053 710776 724722 737869 750062
58894 750062 761751 773356 785182 797722 811602 827073 843825 861480 880096 899843 920184
58883 920184 939676 956804 970853 981714 989090 992327 991153 986171 978242 967550 953683 936685
58871 936685 917722 898450 879974 862683 846852 832808 820383 808778 797463 786906 777931 770512
58859 770512 763775 757136 750743 744701 738558 731888 724841 717677 710252 702435 694618 687286 680445 674071
58845 674071 668689 664732 661491 657515 652061 645420 637906 629399 620123 610980 602677 595118 588117 582129
58831 582129 577687 574542 571913 569382 567069 565080 563297 561638 560235 559321 559116 559710 560905 562288 563566
58816 563566 564719 565784 566821 568066 569674 571120 571374 570034 567924 566191 565129 564222 563023 561499 559785
$$ packed form
58906F27820L490M868P214R364J0331J0492J1052J2422J3723J3946J3147J2193
58894G50062J1689J1605J1826J2540J3880J5471J6752J7655J8616J9747K0341
58883I20184J9492J7128J4049J0861P376L237j174m982p929j0692j3867j6998
58871I36685j8963j9272j8476j7291j5831j4044j2425j1605j1315j0557q975p419
58859G70512o737o639o393o042o143o670p047p164p425p817p817p332o841o374
58845F74071n382l957l241l976n454o641p514q507r276r143q303p559p001n988
58831E82129m442l145k629k531k313j989j783j659j403r14k05N94J195J383J278
58816E63566J153J065J037J245J608J446K54j340k110j733j062r07j199j524j714
$$ plain form
58801 559785 558031 556369 554671 552632 550376 548618 547693 546825 545015 542398 539996 538326 537112 536325 536573
58786 536573 538227 540978 544603 549421 555463 561814 567411 572139 576587 581028 585202 588952 592467 595843
58772 595843 598801 600876 601651 600820 598327 594499 589878 584949 580149 575936 572542 569703 566990 564455 562738
58757 562738 562477 563758 566128 568935 571634 574070 576626 579929 584165 588748 592729 595567 597554 599603
58743 599603 602638 607015 612386 618174 624210 630900 638749 647839 657759 667952 678056 688059 698209
58730 698209 708675 719167 728984 737544 744733 750652 755138 757878 758997 759234 759326 759338 758802 757505 756015
58715 756015 755369 756284 758660 761810 765053 767956 770049 770587 768914 765024 759439 752481 743903 733398 721178
58700 721178 707780 693420 677867 661009 643305 625559 608401 592147 577125 563950 553235
$$ packed form
58801E59785j754j662j698k039k256j758r25q68j810k617k402j670j214p87K48
58786E36573J654K751L625M818O042O351N597M728M448M441M174L750L515L376
58772E95843K958K075P75q31k493l828m621m929m800m213l394k839k713k535j717
58757E62738k61J281K370K807K699K436K556L303M236M583L981K838J987K049
58743E99603L035M377N371N788O036O690P849R090R920J0193J0104J0003J0150
58730F98209J0466J0492R817Q560P189N919M486K740J119K37R2J2n36j297j490
58715G56015o46R15K376L150L243K903K093N38j673l890n585o958q578j0505j2220
58700G21178j3398j4360j5553j6858j7704j7746j7158j6254j5022j3175j0715
$$ plain form
58689 553235 544946 538237 532120 526234 520743 515595 510365 504974 500087 496348 493464 490529 487191 484107
58675 484107 482172 481652 482177 483327 485074 487726 491547 496433 502051 508372 515875 524993 535453 546425
58661 546425 557200 567391 576520 583826 588653 590799 590384 587615 582853 576782 570318 564258 558925 554107
58647 554107 549425 544837 540582 536621 532505 528109 524136 521374 519674 518224 516706 515598 515314 515700 516462
58632 516462 517450 518315 518442 517590 516152 514542 512772 510968 509800 509963 511446 513694 516251 519010 522171
58617 522171 526270 531894 538956 546541 553899 561350 569728 579058 588246 596100 602291 607201 611124 613809
58603 613809 614805 614178 612632 610744 608283 604754 600499 596585 593512 590722 587759 585280 584386 585485 588326
58588 588326 592725 598555 605398 612935 621494 631546 642803 654402 665867 677201 688094 697761 705720
$$ packed form
58689E53235q289o709o117n886n491n148n230n391m887l739k884k935l338l084
58675D84107j935n20N25J150J747K652L821M886N618O321P503R118J0460J0972
58661E46425J0775J0191R129P306M827K146m15k769m762o071o464o060n333m818
58647E54107m682m588m255l961m116m396l973k762j700j450j518j108k84L86P62
58632E16462R88Q65J27q52j438j610j770j804j168J63J483K248K557K759L161
58617E22171M099N624P062P585P358P451Q378R330R188P854O191M910L923K685
58603F13809R96o27j546j888k461l529m255l914l073k790k963k479q94J099K841
58588E88326M399N830O843P537Q559J0052J1257J1599J1465J1334J0893R667P959
$$ plain form
58575 705720 712192 717600 722168 726138 729927 733931 738545 744499 752723 763662 777003 792140 808633
58562 808633 826129 844271 862873 881952 901345 920409 938128 953386 965220 973189 977577 979073
58550 979073 978210 975266 970540 964274 956259 945964 933261 918813 903549 887861 871420 853691 834618
58537 834618 814902 795622 777481 760434 744115 728513 714151 701761 691861 684436 678825 674155
58525 674155 670110 667071 665319 664477 664011 663942 664578 665868 667566 669772 672707 676095 679437 682835 686911
58510 686911 691796 696820 701335 705350 709155 712776 716046 718856 721071 722387 722439 720993 718146 714452 710701
58495 710701 707186 703402 698842 693926 689665 686513 684066 681854 679980 679022 679747 682803 688221 695275 703331
58480 703331 712598 723427 735172 746558 757111 767255 776960 785262 791310 794940 795909 793637 788272
$$ packed form
58575G05720O472N408M568L970L789M004M614N954Q224J0939J3341J5137J6493
58562H08633J7496J8142J8602J9079J9393J9064J7719J5258J1834P969M388J496
58550I79073q63k944m726o266q015j0295j2703j4448j5264j5688j6441j7729j9073
58537H34618j9716j9280j8141j7047j6319j5602j4362j2390r900p425n611m670
58525F74155m045l039j752q42m66o9O36J290J698K206K935L388L342L398M076
58510F86911M885N024M515M015L805L621L270K810K215J316N2j446k847l694l751
58495G10701l515l784m560m916m261l152k447k212j874r58P25L056N418P054Q056
58480G03331R267J0829J1745J1386J0553J0144R705Q302O048L630R69k272n365
$$ plain form
58467 788272 781113 773284 764691 754969 744786 735394 727389 720692 715354 711546 709016 707427 707167 709065
58453 709065 713241 718740 724384 729509 733817 737002 738766 738990 737768 735417 732444 729322 726215 723008
58439 723008 719647 716438 714035 713108 713913 716264 719909 724723 730380 736265 742156 748702 756693 766015 776027
58424 776027 786699 798463 810839 822178 831154 837762 842518 845449 846394 845601 843425 839945 835345 830201
58410 830201 824921 819355 813432 807625 802327 797338 792519 788378 785379 783181 781283 779911 779498 779743 780029
58395 780029 780452 781469 782726 783210 782575 781462 780357 778937 776797 774156 771515 769102 767037 765741 765867
58380 765867 768018 772674 780195 790629 803441 817485 831292 843627 853909 862093 868230 872419 875160
58367 875160 877352 879767 882772 886663 891835 898443 906226 914818 923880 932853 941190 949074 957347 966339
$$ packed form
58467G88272p159p829q593r722j0183r392q005o697n338l808k530j589k60J898
58453G09065M176N499N644N125M308L185J764K24j222k351k973l122l107l207
58439G23008l361l209k403r27Q05K351L645M814N657N885N891O546P991R322J0012
58424G76027J0672J1764J2376J1339Q976O608M756K931R45p93k176l480m600n144
58410H30201n280n566n923n807n298m989m819m141k999k198j898j372m13K45K86
58395G80029M23J017J257M84o35j113j105j420k140k641k641k413k065j296J26
58380G65867K151M656P521J0434J2812J4044J3807J2335J0282Q184O137M189K741
58367H75160K192K415L005L891N172O608P783Q592R062Q973Q337P884Q273Q992
$$ plain form
58353 966339 975276 983127 989545 994623 998400 1001159 1003753 1007019 1011248 1016519 1023006 1030448 1038071 1045722
58339 1045722 1054467 1065269 1077575 1090121 1102698 1116150 1130873 1146277 1161678 1176762 1191077
58328 1191077 1203803 1214293 1222430 1228498 1233082 1237008 1240933 1245051 1249376 1254060 1259146 1264437 1269950
58315 1269950 1276001 1282542 1289089 1295864 1304235 1315243 1328324 1342311 1357085 1373270 1390862 1409189
58303 1409189 1427765 1446183 1463647 1479784 1495557 1512212 1529597 1546673 1563319 1580294 1597682
58292 1597682 1614846 1631925 1649936 1669160 1688818 1708647 1729548 1752220 1776186 1800639 1825327
58281 1825327 1850256 1875405 1901160 1928250 1956965 1987070 2018657 2052289 2088239 2126356 2166731
58270 2166731 2209555 2254329 2300208 2347331 2396769 2448939 2503070 2558539 2615764 2675347 2737166
$$ packed form
58353I66339Q937P851O418N078L777K759K594L266M229N271O487P442P623P651
58339A045722Q745J0802J2306J2546J2577J3452J4723J5404J5401J5084J4315
58328A191077J2726J0490Q137O068M584L926L925M118M325M684N086N291N513
58315A269950O051O541O547O775Q371J1008J3081J3987J4774J6185J7592J8327
58303A409189J8576J8418J7464J6137J5773J6655J7385J7076J6646J6975J7388
58292A597682J7164J7079J8011J9224J9658J9829K0901K2672K3966K4453K4688
58281A825327K4929K5149K5755K7090K8715L0105L1587L3632L5950L8117M0375
58270B166731M2824M4774M5879M7123M9438N2170N4131N5469N7225N9583O1819
$$ plain form
58259 2737166 2800709 2865619 2931581 2998274 3065608 3133432 3201125 3268278 3335796 3405515 3478739
58248 3478739 3556030 3638278 3726903 3822831 3926187 4036903 4154682 4278582 4407910 4543609
58238 4543609 4687717 4841397 5004542 5177152 5359908 5553543 5758972 5977978 6212468
58229 6212468 6463249 6730937 7017716 7326586 7659219 8016488 8400946 8816734 9267151
58220 9267151 9754588 10283037 10858393 11486102 12170976 12919928 13742746 14649927 15652433
58211 15652433 16764483 18004647 19394230 20957731 22726284 24739244 27043732 29698173
58203 29698173 32780310 36392256 40659032 45723400 51736244 58840787 67161732 76815173
58195 76815173 87933064 100677021 115233748 131809276 150622753 171866527 195613570
$$ packed form
58259B737166O3543O4910O5962O6693O7334O7824O7693O7153O7518O9719P3224
58248C478739P7291Q2248Q8625R5928J03356J10716J17779J23900J29328J35699
58238D543609J44108J53680J63145J72610J82756J93635K05429K19006K34490
58229F212468K50781K67688K86779L08870L32633L57269L84458M15788M50417
58220I267151M87437N28449N75356O27709O84874P48952Q22818R07181J002506
58211A5652433J112050J240164J389583J563501J768553K012960K304488K654441
58203B9698173L082137L611946M266776N064368O012844P104543Q320945R653441
58195G6815173J1117891J2743957J4556727J6575528J8813477K1243774K3747043
$$ plain form
58188 195613570 221705117 249657307 278572536 307028146 333000806 353975529 367347737
58181 367347737 371052800 364183945 347316459 322376645 292113327 259418520 226776944
58174 226776944 195989495 168142090 143713937 122742085 104994505 90112626 77699516
58167 77699516 67364208 58748368 51543970 45495857 40393089 36062322 32365567 29194316
58159 29194316 26459838 24087708 22017426 20200307 18595015 17166486 15887834 14739028
58151 14739028 13702598 12762661 11907554 11129895 10423264 9780879 9197199 8667833 8187311
58142 8187311 7749215 7348683 6982375 6645733 6332743 6038823 5761801 5499811 5250681
58133 5250681 5013943 4791040 4582572 4387244 4204092 4033551 3875301 3727065 3586795
$$ packed form
58188A95613570K6091547K7952190K8915229K8455610K5972660K0974723J3372208
58181C67347737L705063o868855j6867486k4939814l0263318l2694807l2641576
58174B26776944l0787449k7847405k4428153k0971852j7747580j4881879j2413110
58167G7699516j0335308q615840p204398o048113n102768m330767l696755l171251
58159B9194316k734478k372130k070282j817119j605292j428529j278652j148806
58151A4739028j036430r39937q55107p77659p06631o42385n83680n29366m80522
58142H187311m38096m00532l66308l36642l12990k93920k77022k61990k49130
58133E250681k36738k22903k08468j95328j83152j70541j58250j48236j40270
$$ plain form
58124 3586795 3454514 3330891 3215345 3106713 3004518 2908429 2817402 2730397 2647284 2568349
58114 2568349 2493590 2423017 2356754 2294215 2234001 2175171 2117976 2062900 2009764 1958130 1907824
58103 1907824 1858656 1810480 1763862 1719850 1678576 1638903 1599923 1562097 1526493 1493633 1463476
58092 1463476 1435743 1409750 1384614 1360177 1337213 1316294 1297006 1278621 1260922 1243941 1227332
58081 1227332 1210452 1192758 1173959 1154162 1133917 1113651 1093041 1071453 1049037 1026773 1005502
58070 1005502 985559 967232 950731 935660 921389 907935 895612 883896 871804 859474 848117
58059 848117 838077 828245 817888 807678 798239 788929 779040 769096 759753 750332 739751 728380 717747
58046 717747 708673 700779 693603 687050 680758 674023 666636 659098 651852 644797 637722 630738 624051 617602
$$ packed form
58124C586795j32281j23623j15546j08632j02195r6089r1027q7005q3113p8935
58114B568349p4759p0573o6263o2539o0214n8830n7195n5076n3136n1634n0306
58103A907824m9168m8176m6618m4012m1274l9673l8980l7826l5604l2860l0157
58092A463476k7733k5993k5136k4437k2964k0919j9288j8385j7699j6981j6609
58081A227332j6880j7694j8799j9797k0245k0266k0610k1588k2416k2264k1271
58070A005502j9943j8327j6501j5071j4271j3454j2323j1716j2092j2330j1357
58059H48117j0040r832j0357j0210r439r310r889r944r343r421j0581j1371j0633
58046G17747r074p894p176o553o292o735p387p538p246p055p075o984o687o449
$$ plain form
58032 617602 611063 604119 596761 589368 582346 575595 568609 561194 553799 546922 540511 534198 527824 521432
58018 521432 515012 508587 502457 497096 492892 489986 488162 486881 485713 484757 484364 484500 484842 485422 486616
58003 486616 488467 490707 493530 497543 502672 507900 512544 517081 522180 527564 532431 536509 539980 542742
57989 542742 544420 544888 544361 543191 541926 541172 540970 540651 539678 538204 536417 534020 530937 527929 525658 523559
57973 523559 520511 516352 511879 507587 503273 498839 494589 490690 487024 483606 480489 477240 473233 468610
57959 468610 464296 460942 458432 456526 455198 454061 452184 449059 445340 442142 439825 437891 435868 433906
57945 433906 432471 431781 431709 432162 433414 435889 439654 444386 449925 456535 464360 473007 482130 492137 503631
57930 503631 516156 528096 537963 545306 550311 553082 553621 552056 548512 542969 535514 526523 516397 505363
$$ packed form
58032F17602o539o944p358p393p022o751o986p415p395o877o411o313o374o392
58018E21432o420o425o130n361m204k906j824j281j168r56l93J36L42N80J194
58003D86616J851K240K823M013N129N228M644M537N099N384M867M078L471K762
57989E42742J678M68n27j170j265p54k02l19r73j474j787k397l083l008k271k099
57973E23559l048m159m473m292m314m434m250l899l666l418l117l249m007m623
57959D68610m314l354k510j906j328j137j877l125l719l198k317j934k023j962
57945D33906j435o90p2M53J252K475L765M732N539O610P825Q647R123J0007J1494
57930E03631J2525J1940R867P343N005K771N39j565l544n543p455q991j0126j1034
$$ plain form
57916 505363 493767 482269 471485 461501 452008 442799 433971 425763 418381 411865 405959 400205 394394
57903 394394 388856 384077 380011 376000 371381 366030 360282 354530 349108 344407 340772 338166 336118 334219
57889 334219 332657 332099 333019 335203 337931 340545 342848 345005 347059 348572 348916 348007 346558 345355 344449
57874 344449 343335 341743 339776 337370 334278 330784 327874 326286 325763 325647 325870 326966 329303 332734 336868
57859 336868 341312 345778 350282 355155 360571 366262 371967 377876 384236 390729 396736 402061 406826 410777
57845 410777 413301 414214 414010 413192 411863 410085 408094 405872 402978 399173 394873 390675 386701 382730 378713
57830 378713 374792 371072 367784 365488 364590 364689 364849 364694 364817 365953 368066 370546 373013 375565 378273 380899
57814 380899 383183 385089 386499 386884 385570 382290 377323 371146 364211 356984 349960 343516 337841 332932
$$ packed form
57916E05363j1596j1498j0784r984r493r209q828q208p382o516n906n754n811
57903C94394n538m779m066m011m619n351n748n752n422m701l635k606k048j899
57889C34219j562n58R20K184K728K614K303K157K054J513L44r09j449j203r06
57874C44449j114j592j967k406l092l494k910j588n23j16K23J096K337L431M134
57859C36868M444M466M504M873N416N691N705N909O360O493O007N325M765L951
57845D10777K524R13k04q18j329j778j991k222k894l805m300m198l974l971m017
57830C78713l921l720l288k296q98R9J60j55J23J136K113K480K467K552K708K626
57814C80899K284J906J410L85j314l280m967o177o935p227p024o444n675m909
$$ plain form
57800 332932 328546 324297 320088 316357 313542 311333 308906 305942 302958 300458 298225 295743 292937 290163
57786 290163 287830 286370 286203 287231 288578 289380 289749 290589 292514 295361 298723 302504 306844 311703 316634
57771 316634 320895 323926 325813 327021 327526 326663 324191 321020 318210 315521 311745 306415 300408 294765 289692
57756 289692 284920 280347 275866 271170 266253 261786 258542 256692 255955 256082 256749 257257 256995 256159 255592 255785
57740 255785 256370 256652 256358 255759 255305 255320 255919 256988 258246 259355 260058 260257 260087 259938 260246 261148 262352 263455
57722 263455 264353 265181 265929 266424 266834 267791 269579 271448 272294 272003 271507 271420 271273 270409 268995 267624 266377
57705 266377 264941 263384 262218 261814 262222 263362 264888 266130 266846 267847 270116 273304 275882 276880 276742
57690 276742 276233 275289 273454 270935 268639 267371 267389 268592 270937 274824 281218 291189 305183 322925 344058
$$ packed form
57800C32932m386m249m209l731k815k209k427k964k984k500k233k482k806k774
57786B90163k333j460j67J028J347Q02L69Q40J925K847L362L781M340M859M931
57771C16634M261L031J887J208N05q63k472l171k810k689l776n330o007n643n073
57756B89692m772m573m481m696m917m467l244j850p37J27O67N08k62q36n67J93
57740B55785N85K82k94n99m54J5N99J069J258J109P03J99j70j49L08R02J204J103
57722B63455Q98Q28P48M95M10R57J788J869Q46k91m96q7j47q64j414j371j247
57705B66377j436j557j166m04M08J140J526J242P16J001K269L188K578R98j38
57690B76742n09r44j835k519k296j268J8J203K345L887O394R971J3994J7742K1133
$$ plain form
57675 344058 368611 396878 429348 466899 510653 561310 618905 683168 753550 828331 903640
57664 903640 973201 1028846 1061879 1065691 1038601 984633 911526 827956 741925 660043 586755 524042
57652 524042 472164 430503 397513 370692 347739 327886 311603 299102 289598 281993 275633 270290
57640 270290 265814 262012 258629 255449 252582 250547 249718 249746 249863 249734 249660 249957 250502 250960 251200 251345 251537
57623 251537 251696 251409 250201 248101 245795 243971 242617 241239 239561 237608 235227 232107 228404 224905 222288
57608 222288 220439 218677 216498 214006 211796 210483 210146 210205 209968 209294 208498 207661 206440 204635 202583 200713
57592 200713 199024 197264 195396 193532 191554 189220 186637 184253 182254 180317 178192 176250 175095 174702
57578 174702 174277 173110 171312 169582 168391 167556 166534 165004 163184 161585 160403 159223 157527 155468 153722
$$ packed form
57675C44058K4553K8267L2470L7551M3754N0657N7595O4263P0382P4781P5309
57664I03640O9561N5645L3033L812k7090n3968p3107q3570q6031q1882p3288o2713
57652E24042n1878m1661l2990k6821k2953j9853j6283j2501r504p605o360n343
57640B70290m476l802l383l180k867k035q29K8J17j29p4K97N45M58K40J45J92
57623B51537J59k87j208k100k306j824j354j378j678j953k381l120l703l499k617
57608B22288j849j762k179k492k210j313l37N9k37o74p96q37j221j805k052j870
57592B00713j689j760j868j864j978k334k583k384j999j937k125j942j155l93
57578A74702m25j167j798j730j191q35j022j530j820j599j182j180j696k059j746
$$ plain form
57563 153722 152493 151155 149254 147393 146534 146700 147100 147440 148261 149824 151436 152349 152765 153469 154842 156713
57547 156713 158910 161371 163814 165734 166839 167323 167696 168429 169618 170900 171826 172308 172532 172475 171911 170909
57531 170909 169880 169027 168200 167461 167227 167598 168086 168340 168584 168899 168726 167730 166637 166417 166918 167146 166717 166303
57513 166303 166658 167897 169675 171452 172572 172781 172718 173298 174572 175787 176575 177350 178346 178962 178459 176786 174412
57496 174412 171797 169310 167222 165421 163449 161172 159085 157661 156734 155841 154869 153990 153193 152303 151315 150310
57480 150310 149094 147354 145276 143689 143342 144053 144769 144520 143298 141866 140792 139924 138949 138181 138369 139767
57464 139767 141748 143470 144725 145952 147527 149152 150015 149583 148222 146864 146112 145902 145981 146254 146472 146175
57448 146175 145370 144843 145257 146240 146923 147038 146847 146367 145576 145199 146223 148424 150319 150922 150768 150847 151291 151699
$$ packed form
57563A53722j229j338j901j861q59J66M00L40Q21J563J612R13M16P04J373J871
57547A56713K197K461K443J920J105M84L73P33J189J282R26M82K24n7n64j002
57531A70909j029q53q27p39k34L71M88K54K44L15j73r96j093k20N01K28m29m14
57513A66303L55J239J778J777J120K09o3N80J274J215P88P75R96O16n03j673k374
57496A74412k615k487k088j801j972k277k087j424r27q93r72q79p97q90r88j005
57480A50310j216j740k078j587l47P11P16k49j222j432j074q68r75p68J88J398
57464A39767J981J722J255J227J575J625Q63m32j361j358p52k10P9K73K18k97
57448A46175q05n27M14R83O83J15j91m80p91l77J024K201J895O03j54P9M44M08
$$ plain form
57430 151699 152045 152546 153058 153271 153270 153316 153282 152827 151979 151101 150341 149534 148593 147612 146595 145403 144039 142824 142221
57411 142221 142535 143625 144859 145491 145285 144687 144333 144494 145002 145466 145521 145091 144469 143911 143175 141847 140189 139184
57393 139184 139428 140310 140670 140081 139195 138896 139380 140115 140619 141171 142490 144589 146343 146663 145835 145058 144761 144213
57375 144213 142902 141422 140647 140753 141451 142513 143514 143720 142893 141778 141222 141222 141356 141687 142549 143822 145100
57358 145100 146342 147684 148876 149567 150011 150866 152360 154123 155648 156368 155693 153751 151962 152009 154108 156859
57342 156859 158852 159797 160171 160493 161180 162429 163931 165122 165891 166660 167699 168828 169827 170584 170747 169824 167942
57325 167942 165978 164629 163724 162762 161723 161009 160850 161108 161454 161547 161251 160909 161159 162246 163693 164813 165376
57308 165376 165565 165531 165271 164881 164624 164739 165219 165754 165850 165131 163628 161803 160305 159665 160038 161071 162095 162630
$$ packed form
57430A51699L46N01N12K13jM6l4m55q48q78p60q07r41r81j017j192j364j215o03
57411A42221L14J090J234O32k06n98l54J61N08M64N5m30o22n58p36j328j658j005
57393A39184K44Q82L60n89q86k99M84P35N04N52J319K099J754L20q28p77k97n48
57375A44213j311j480p75J06O98J062J001K06q27j115n56%J34L31Q62J273J278
57358A45100J242J342J192O91M44Q55J494J763J525P20o75j942j789M7K099K751
57342A56859J993R45L74L22O87J249J502J191P69P69J039J129R99P57J63r23j882
57325A67942j964j349r05r62j039p14j59K58L46R3k96l42K50J087J447J120N63
57308A65376J89l4k60l90k57J15M80N35R6p19j503j825j498o40L73J033J024N35
$$ plain form
57290 162630 162663 162424 162084 161785 161634 161379 160443 158705 157021 156407 156941 158015 159523 162077 166009 170933 176486
57273 176486 182818 189970 197300 203941 209440 213637 216328 217466 217472 217024 216720 217003 217967 219028 219344 218964
57257 218964 219082 220650 223135 225221 226437 227435 228931 231138 234197 238297 243077 247579 251231 254480 258051
57242 258051 261906 265393 268177 270561 273038 276027 280000 285236 291206 296731 301184 305280 310220 316298
57228 316298 322887 329635 336948 345179 353992 362940 372104 381678 391305 400409 409020 417782 427267 437705
57214 437705 449200 461771 475176 489119 503573 518653 534433 551263 569962 591008 613622
57203 613622 636272 658059 679043 699315 718580 736828 754696 772810 791219 809609 827545
57192 827545 844415 859834 874397 889365 905264 921382 936946 952109 967338 982482 997149
$$ packed form
57290A62630L3k39l40k99j51k55r36j738j684o14N34J074J508K554L932M924N553
57273A76486O332P152P330O641N499M197K691J138Om48l04K83R64J061L16l80
57257B18964J18J568K485K086J216R98J496K207L059M100M780M502L652L249L571
57242B58051L855L487K784K384K477K989L973N236N970N525M453M096M940O078
57228C16298O589O748P313Q231Q813Q948R164R574R627R104Q611Q762R485J0438
57214D37705J1495J2571J3405J3943J4454J5080J5780J6830J8699K1046K2614
57203F13622K2650K1787K0984K0272J9265J8248J7868J8114J8409J8390J7936
57192H27545J6870J5419J4563J4968J5899J6118J5564J5163J5229J5144J4667
$$ plain form
57181 997149 1011449 1025708 1039807 1053557 1067472 1082442 1098671 1115521 1132371 1149118 1165888
57170 1165888 1182749 1199864 1217630 1236570 1257077 1279142 1302180 1325480 1348986 1373301 1398692
57159 1398692 1424609 1450586 1477143 1505159 1534728 1565265 1596556 1628937 1662561 1697174 1732720
57148 1732720 1769517 1807601 1846284 1884486 1921301 1956369 1990230 2024418 2060812 2100624 2144060
57137 2144060 2190782 2240381 2292491 2346853 2403235 2461159 2519935 2579284 2639640 2701386 2764114
57126 2764114 2827285 2891370 2957576 3026531 3098054 3172234 3249782 3330987 3415115 3501310 3589536
57115 3589536 3680254 3773833 3870928 3973061 4082229 4200208 4328772 4470415 4628243 4805238
57105 4805238 5004189 5228561 5483137 5773708 6106609 6489004 6929658 7438963 8027680
$$ packed form
57181I97149J4300J4259J4099J3750J3915J4970J6229J6850J6850J6747J6770
57170A165888J6861J7115J7766J8940K0507K2065K3038K3300K3506K4315K5391
57159A398692K5917K5977K6557K8016K9569L0537L1291L2381L3624L4613L5546
57148A732720L6797L8084L8683L8202L6815L5068L3861L4188L6394L9812M3436
57137B144060M6722M9599N2110N4362N6382N7924N8776N9349O0356O1746O2728
57126B764114O3171O4085O6206O8955P1523P4180P7548Q1205Q4128Q6195Q8226
57115C589536R0718R3579R7095J02133J09168J17979J28564J41643J57828J76995
57105D805238J98951K24372K54576K90571L32901L82395M40654N09305N88717
$$ plain form
57096 8027680 8705249 9478615 10351136 11320644 12377684 13506571 14689650 15911225 17157941
57087 17157941 18416981 19675491 20921429 22143305 23328473 24461785 25523720 26485312
57079 26485312 27302547 27918843 28279210 28347145 28111597 27581654 26777632 25726152 24458960
57070 24458960 23012258 21426149 19744897 18016531 16289794 14609382 13012190 11525712
57062 11525712 10167771 8946891 7863473 6911804 6082242 5362947 4741082 4203725 3738813
57053 3738813 3336003 2986870 2684184 2421032 2190835 1988116 1808822 1649726 1507728
57044 1507728 1379887 1263988 1158886 1064334 980341 906444 841582 784882 736395 696626 665384
57033 665384 641721 625176 616420 616138 623798 638284 659337 687198 720151 752789 777183 786018
$$ packed form
57096H027680O77569P73366Q72521R69508J057040J128887J183079J221575J246716
57087A7157941J259040J258510J245938J221876J185168J133312J061935R61592
57079B6485312Q17235O16296L60367O7935k35548n29943q04022j051480j267192
57070B4458960j446702j586109j681252j728366j726737j680412j597192j486478
57062A1525712j357941j220880j083418r51669q29562p19295o21865n37357m64912
57053C738813m02810l49133l02686k63152k30197k02719j79294j59096j41998
57044A507728j27841j15899j05102r4552q3993p3897o4862n6700m8487l9769l1242
57033F65384k3663j6545q756k82P660J4486K1053K7861L2953L2638K4394Q835
$$ plain form
57021 786018 775106 744078 695812 635522 569633 504347 444141 391009 344957 305262 271355
57010 271355 242751 218727 198530 181749 168109 156908 147095 137987 129606 122194 115664 109679 103940
56997 103940 98189 92188 86004 80123 75078 71154 68679 68265 70300 74353 79565 85575 92579 100532
56983 100532 108897 117301 125777 133862 139920 142089 139928 134774 128419 121778 114821 107450 100173 94008
56969 94008 89786 87491 86398 86031 86921 90070 95602 102354 109105 116040 124558 135647 148766 162436
56955 162436 175468 187197 196626 201995 201724 195725 185528 173108 159816 146403 133683 122683
56943 122683 114116 107989 103925 101849 102184 105304 110950 118374 127127 137535 150232 165311 182069
56930 182069 199468 216537 232199 244978 253094 254911 249440 236806 218500 197044 174969 153937
$$ packed form
57021G86018j0912l1028m8266o0290o5889o5286o0206n3132m6052l9695l3907
57010B71355k8604k4024k0197j6781j3640j1201r813r108q381p412o530n985n739
56997A03940n751o001o184n881n045l924k475m14K035M053N212O010P004P953
56983A00532Q365Q404Q476Q085O058K169k161n154o355o641o957p371p277o165
56969I4008m222k295j093l67Q90L149N532O752O751O935Q518J1089J3119J3670
56955A62436J3032J1729R429N369k71n999j0197j2420j3292j3413j2720j1000
56943A22683q567o127m064k076L35L120N646P424Q753J0408J2697J5079J6758
56930A82069J7399J7069J5662J2779Q116J817n471j2634j8306k1456k2075k1032
$$ plain form
56918 153937 134723 117813 103711 92644 84253 77733 72270 67355 62905 59233 56753 55518 55072
56905 55072 54990 55541 57522 61275 66213 71638 77773 85424 94691 104655 114566 124705 135641 147192
56891 147192 158818 170625 183124 196124 208770 220798 232896 245443 257521 267546 274362 277366
56879 277366 276246 271267 263451 253949 243509 232977 223807 217435 214361 214495 218081 225542 236615 250529
56865 250529 267100 286980 310704 338180 369183 403447 439841 476080 509683 538676 560932
56854 560932 573590 574243 562924 542454 516739 489028 461651 436670 416123 401532 393442 391683
56842 391683 396108 406982 424706 449379 480858 518977 563343 612940 666282 722014 778751 833912
56830 833912 882849 919544 938506 936501 913318 871748 816999 755491 693260 634661 582127 536983
$$ packed form
56918A53937j9214j6910j4102j1067q391o520n463m915m450l672k480j235m46
56905E5072q2N51J981L753M938N425O135P651R267R964R911J0139J0936J1551
56891A47192J1626J1807J2499J3000J2646J2028J2098J2547J2078J0025O816L004
56879B77366j120m979p816r502j0440j0532r170o372l074J34L586P461J1073J3914
56865B50529J6571J9880K3724K7476L1003L4264L6394L6239L3603K8993K2256
56854E60932J2658O53j1319k0470k5715k7711k7377k4981k0547j4591q090j759
56842C91683M425J0874J7724K4673L1479L8119M4366M9597N3342N5732N6737N5161
56830H33912M8937L6695J8962k005k3183m1570n4749o1508o2231n8599n2534m5144
$$ plain form
56818 536983 500348 473134 455386 446181 444534 450186 463213 483185 509201 540516 576485 615847
56806 615847 656554 696268 732258 760556 776141 775004 756281 722360 677304 625505 571260 518558
56794 518558 470554 429120 394823 367294 345888 330347 320922 317771 320384 327707 338728 352772
56782 352772 369385 388147 408435 429010 447800 462230 469876 468895 458302 438387 410985 378984
56770 378984 345225 311716 279715 250261 224343 202546 184644 169756 156967 145791 136058 127588
56758 127588 120211 114020 109259 105852 103214 100626 97673 94353 90969 87973 85646 83826 82100 80332
56744 80332 78791 77670 76733 75593 74155 72637 71315 70370 69860 69663 69561 69454 69400 69450 69602 69927 70449 70907
56726 70907 70955 70703 70736 71453 72672 74003 75311 76613 77908 79285 80942 82854 84737 86442 88030 89277
$$ packed form
56818E36983l6635k7214j7748r205j647N652J3027J9972K6016L1315L5969L9362
56806F15847M0707L9714L5990K8298J5585j137j8723l3921m5056n1799n4245n2702
56794E18558m8004m1434l4297k7529k1406j5541r425l151K613P323J1021J4044
56782C52772J6613J8762K0288K0575J8790J4430P646r81j0593j9915k7402l2001
56770C78984l3759l3509l2001k9454k5918k1797j7902j4888j2789j1176r733q470
56758A27588p377o191m761l407k638k588k953l320l384k996k327j820j726j768
56744H0332j541j121r37j140j438j518j322r45n10j97j02j07n4N0J52L25N22M58
56726G0907M8k52L3P17J219J331J308J302J295J377J657J912J883J705J588J247
$$ plain form
56710 89277 89650 89166 88782 89375 90646 91546 91508 90728 89553 88221 87098 86532 86443 86539 86870 87653 88624 89179 89184
56691 89184 89126 89325 89566 89597 89524 89475 89322 88957 88527 88224 88159 88502 89330 90206 90377 89659 88760 88466 88843 89506 90287
56670 90287 91215 92094 92616 92846 93219 94008 94983 95651 95709 95273 94727 94346 94107 93961 94190 95178 96826 98542 99991
56651 99991 101490 103437 105593 107309 108267 108675 108856 109010 109314 109833 110274 110187 109652 109448 110267 111821 113060
56634 113060 113277 112791 112459 112751 113523 114572 115995 117890 119973 121787 123160 124228 125074 125672 126149 126746
56618 126746 127393 127570 126862 125506 124197 123417 123092 122862 122467 121943 121619 121986 123311 125185 126577 126653 125592
56601 125592 124386 123697 123162 122084 120574 119553 119593 120258 120816 121165 121689 122485 123194 123521 123538 123473 123517 123782 124197
56582 124197 124481 124495 124584 125203 126258 127206 127863 128707 130233 132330 134494 136380 137944 139290 140664 142495
$$ packed form
56710H9277L73m84l84N93J271R00l8p80j175j332j123n66q9R6L31P83R71N55N
56691H9184n8J99K41L1p3m9j53l65m30l03o5L43Q28Q76J71p18q99k94L77O63P81
56670I0287R28Q79N22K30L73P89R75O68N8m36n46l81k39j46K29R88J648J716J449
56651I9991J499J947K156J716R58M08J81J54L04N19M41q7n35k04Q19J554J239
56634A13060K17m86l32K92P72J049J423J895K083J814J373J068Q46N98M77N97
56618A26746O47J77p08j356j309p80l25k30l95n24l24L67J325J874J392P6j061
56601A25592j206o89n35j078j510j021M0O65N58L49N24P96P09L27J7o5M4K65M15
56582A24197K84J4Q9O19J055R48O57Q44J526K097K164J886J564J346J374J831
$$ plain form
56566 142495 145234 149165 154345 160517 167004 173006 178315 183650 189994 197584 205652 213138 219536 225009
56552 225009 229858 234084 237556 240475 243378 246525 249523 251738 252947 253358 253197 252649 252058 251663 251091 249598
56536 249598 246939 243586 239889 235572 230412 224994 220279 216578 213401 210111 206295 201675 196288 190839
56522 190839 186364 183245 180879 178468 175804 173059 170176 166897 163329 160026 157448 155552 154007 152565
56508 152565 151148 149754 148439 147262 146149 144969 143857 143225 143222 143353 143011 142350 142167 142873 143938 144566 144584
56491 144584 144419 144425 144553 144529 144127 143383 142712 142652 143289 144070 144349 143971 143156 142133 141118 140402 140127 140204 140711 142004
56471 142004 143991 145762 146602 147095 148433 150685 152596 153169 152710 152116 151998 152789 154856 157858 160562 161991
56455 161991 162481 163101 164329 165821 167105 167908 168007 167376 166503 166045 166167 166550 166957 167352 167545 167290 166870 167079
$$ packed form
56566A42495K739L931N180O172O487O002N309N335O344P590Q068P486O398N473
56552B25009M849M226L472K919K903L147K998K215J209M11j61n48n91l95n72j493
56536B49598k659l353l697m317n160n418m715l701l177l290l816m620n387n449
56522A90839m475l119k366k411k664k745k883l279l568l303k578j896j545j442
56508A52565j417j394j315j177j113j180j112o32lJ31l42o61j83P06J065O28J8
56491A44584j65OJ28k4m02p44o71o0O37P81K79l78q15j023j015p16k75P7N07J293
56471A42004J987J771Q40M93J338K252J911N73m59n94j18P91K067L002K704J429
56455A61991M90O20J228J492J284Q03R9o31q73m58J22L83M07L95J93k55m20K09
$$ plain form
56437 167079 168375 170275 171846 172600 172738 172683 172615 172467 172174 171822 171610 171698 172113 172735 173361 173877 174372 174957 175413
56418 175413 175280 174486 173636 173327 173370 173240 173166 174066 176144 178210 178863 177962 176524 175524 175301 175781 176677 177512
56400 177512 177969 178254 178717 179208 179265 178984 179146 180237 181727 182692 182999 183529 185177 187848 190583 192589 193896
56383 193896 194964 195984 196926 198065 199837 202050 203813 204570 204708 204750 204512 203694 202960 203529 205652 208274
56367 208274 210344 211826 213134 214255 214928 215259 215507 215448 214543 212818 211074 210081 209850 209957 210272 211004 212100
56350 212100 213027 213380 213453 213957 215211 216885 218478 219802 220890 221709 222196 222500 222971 223857 225044 226157 226955
56333 226955 227661 228761 230350 231821 232452 232247 231949 232247 233285 234888 236857 238917 240825 242669 244778
56318 244778 247134 249256 250878 252313 253863 255251 256100 256682 257636 259083 260555 261782 263098 264909 267089
$$ packed form
56437A67079J296J900J571P54J38n5o8j48k93l52k12Q8M15O22O26N16M95N85M56
56418A75413j33p94q50l09M3j30p4R00K078K066O53r01j438j000k23M80Q96Q35
56400A77512M57K85M63M91N7k81J62J091J490R65L07N30J648K671K735K006J307
56383A93896J068J020R42J139J772K213J763P57J38M2k38q18p34N69K123K622
56367B08274K070J482J308J121O73L31K48n9r05j725j744r93k31J07L15P32J096
56350B12100R27L53P3N04J254J674J593J324J088Q19M87L04M71Q86J187J113P98
56333B26955P06J100J589J471O31k05k98K98J038J603J969K060J908J844K109
56318B44778K356K122J622J435J550J388Q49N82R54J447J472J227J316J811K180
$$ plain form
56303 267089 269142 270887 272812 275627 279357 283026 285580 287124 288786 291224 293823 295683 296860 298098
56289 298098 299802 301929 304531 307615 310624 312940 314932 317712 321703 326190 330533 335048 340215 345724
56275 345724 350987 356158 361880 368195 374424 380215 386158 393130 401404 410610 420274 430167 440332 451134
56261 451134 463251 477362 493796 512576 533727 557341 583377 611770 642828 677183 715141
56250 715141 756422 800883 849134 901888 958806 1018540 1079868 1142237 1205211 1268033 1329850
56239 1329850 1389688 1445950 1496538 1539896 1575381 1602320 1619412 1625652 1621280 1607136 1583558 1550743
56227 1550743 1509844 1462848 1411409 1356550 1299419 1241477 1183824 1126996 1071616 1018667 968864
56216 968864 922275 878779 838490 801491 767455 735778 706037 678278 653064 631090 612412
$$ packed form
56303B67089K053J745J925K815L730L669K554J544J662K438K599J860J177J238
56289B98098J704K127K602L084L009K316J992K780L991M487M343M515N167N509
56275C45724N263N171N722O315O229N791N943O972Q274R206R664R893J0165J0802
56261D51134J2117J4111J6434J8780K1151K3614K6036K8393L1058L4355L7958
56250G15141M1281M4461M8251N2754N6918N9734O1328O2369O2974O2822O1817
56239A329850N9838N6262N0588M3358L5485K6939J7092O240m372j4144k3578l2815
56227A550743m0899m6996n1439n4859n7131n7942n7653n6828n5380n2949m9803
56216I68864m6589m3496m0289l6999l4036l1677k9741k7759k5214k1974j8678
$$ plain form
56205 612412 596081 580850 566181 552328 539640 528287 518550 510728 504673 499789 495630 492059 488824
56192 488824 485512 482102 479149 477158 476085 475561 475305 475089 474623 473778 472850 472487 473341 475646 478976 482440
56176 482440 485323 487539 489424 491358 493668 496530 499622 502284 504420 506877 510436 514809 519248 523751
56162 523751 528873 534631 540521 546575 553478 561534 570386 579880 590388 602051 614504 627639 641910
56149 641910 657550 674300 692369 713042 737822 767447 802184 842616 889600 943807 1005800
56138 1005800 1076394 1156558 1246951 1347418 1456386 1570523 1685296 1796117 1898939 1990319
56128 1990319 2068066 2132301 2185305 2229958 2268506 2302454 2332286 2356565 2372124 2376097 2367787 2348536
56116 2348536 2320516 2286027 2246978 2203874 2155321 2099025 2033206 1957041 1870667 1775801 1676175
$$ packed form
56205F12412j6331j5231j4669j3853j2688j1353r737p822o055m884m159l571l235
56192D88824l312l410k953j991j073n24k56k16m66q45r28l63Q54K305L330L464
56176D82440K883K216J885J934K310K862L092K662K136K457L559M373M439M503
56162E23751N122N758N890O054O903Q056Q852R494J0508J1663J2453J3135J4271
56149F41910J5640J6750J8069K0673K4780K9625L4737M0432M6984N4207O1993
56138A005800P0594Q0164R0393J00467J08968J14137J14773J10821J02822R1380
56128A990319P7747O4235N3004M4653L8548L3948K9832K4279J5559L973q310j9251
56116B348536k8020l4489l9049m3104m8553n6296o5819p6165q6374r4866r9626
$$ plain form
56105 1676175 1576532 1480948 1392172 1312001 1241522 1181017 1130186 1088540 1055280 1029009 1008070
56094 1008070 991271 978057 968058 960780 955758 952789 951894 953017 955677 959006 962332 965660 969351 973506
56080 973506 978097 983512 990372 998755 1008160 1018269 1029081 1040324 1051543 1062982 1075527 1089418
56068 1089418 1103814 1118053 1132555 1147906 1163849 1179942 1196609 1214586 1233636 1252600 1270596
56057 1270596 1287529 1303557 1318698 1333093 1347196 1361490 1376105 1390765 1405201 1419740 1435320
56046 1435320 1452622 1471416 1491211 1512254 1535144 1559634 1584791 1610358 1637040 1665261 1694642
56035 1694642 1724933 1756423 1789083 1822388 1856461 1892323 1930381 1969644 2009180 2049443 2091456
56024 2091456 2135440 2180987 2227843 2275831 2324697 2374682 2426638 2481062 2537825 2597262 2660550
$$ packed form
56105A676175r9643r5584q8776q0171p0479o0505n0831m1646l3260k6271k0939
56094A008070j6799j3214r999p278n022k969q95J123K660L329L326L328L691M155
56080I73506M591N415O860Q383R405J0109J0812J1243J1219J1439J2545J3891
56068A089418J4396J4239J4502J5351J5943J6093J6667J7977J9050J8964J7996
56057A270596J6933J6028J5141J4395J4103J4294J4615J4660J4436J4539J5580
56046A435320J7302J8794J9795K1043K2890K4490K5157K5567K6682K8221K9381
56035A694642L0291L1490L2660L3305L4073L5862L8058L9263L9536M0263M2013
56024B091456M3984M5547M6856M7988M8866M9985N1956N4424N6763N9437O3288
$$ plain form
56013 2660550 2728379 2800218 2875523 2954700 3038196 3125723 3217132 3312981 3413512 3518213 3627203
56002 3627203 3741829 3863063 3990626 4124633 4266569 4417411 4576239 4742136 4916182
55993 4916182 5100146 5294624 5500032 5718188 5951233 6200208 6466323 6752317 7060765
55984 7060765 7392404 7748110 8131295 8546326 8995908 9482298 10009962 10584755 11211680
55975 11211680 11896049 12646012 13471776 14383655 15393674 16518303 17777527 19193186 20791964
55966 20791964 22609818 24691998 27092485 29879997 33146832 37010477 41606466 47077309
55958 47077309 53558400 61164978 69995193 80155744 91788629 105074022 120216164
55951 120216164 137431718 156924792 178812167 203007104 229115862 256363666 283503169
$$ packed form
56013B660550O7829P1839P5305P9177Q3496Q7527R1409R5849J00531J04701J08990
56002C627203J14626J21234J27563J34007J41936J50842J58828J65897J74046
55993D916182J83964J94478K05408K18156K33045K48975K66115K85994L08448
55984G060765L31639L55706L83185M15031M49582M86390N27664N74793O26925
55975A1211680O84369P49963Q25764R11879J010019J124629J259224J415659J598778
55966B0791964J817854K082180K400487K787512L266835L863645M595989N470843
55958D7077309O481091P606578Q830215J0160551J1632885J3285393J5142142
55951A20216164J7215554J9493074K1887375K4194937K6108758K7247804K7139503
$$ plain form
55944 283503169 308703237 329557810 343404530 347975364 342134264 326328620 302505603
55937 302505603 273529969 242393788 211574383 182747768 156827777 134158758 114713683
55930 114713683 98248530 84417613 72851130 63194248 55123233 48356252 42659265
55923 42659265 37841316 33745131 30242351 27231345 24631175 22374474 20405214 18678919
55915 18678919 17159689 15816125 14621215 13554064 12598389 11739287 10962947 10258355 9617012
55906 9617012 9031367 8494931 8003021 7551598 7135872 6751299 6395172 6065864 5761327
55897 5761327 5479527 5219253 4979070 4756436 4549267 4357363 4180664 4017107 3864021
55888 3864021 3720899 3588911 3468130 3357092 3254758 3160983 3074934 2994625 2918206 2844384
$$ packed form
55944B83503169K5200068K0854573J3846720M570834n841100j5805644k3823017
55937C02505603k8975634l1136181l0819405k8826615k5919991k2669019j9445075
55930A14713683j6465153j3830917j1566483r656882q071015o766981n696987
55923D2659265m817949m096185l502780l011006k600170k256701j969260j726295
55915A8678919j519230j343564j194910j067151r55675q59102p76340p04592o41343
55906I617012n85645n36436m91910m51423m15726l84573l56127l29308l04537
55897E761327k81800k60274k40183k22634k07169j91904j76699j63557j53086
55888C864021j43122j31988j20781j11038j02334r3775q6049q0309p6419p3822
$$ plain form
55878 2844384 2771575 2698100 2623698 2549784 2477757 2407683 2338576 2269122 2198101 2125176 2051634
55867 2051634 1979724 1910966 1845509 1783102 1723973 1668589 1617080 1569177 1524430 1482334 1442419
55856 1442419 1404287 1367601 1332299 1298869 1267941 1239348 1212022 1185096 1158640 1132955 1107729
55845 1107729 1082422 1057095 1032319 1008581 986210 965485 946272 927873 909673 891726 874346
55834 874346 857578 841426 826173 811967 798519 785636 773643 762812 752881 743552 734897 726700
55822 726700 718016 708165 697676 687432 677229 666093 653845 641507 630128 619925 610619 602120
55810 602120 594672 588628 584120 580903 578722 577867 578883 581578 584938 588331 592123 596654 601355 605531
55796 605531 609324 613022 615932 616789 614988 610643 603928 595223 585605 576239 567365 558680 550437 543292
$$ packed form
55878B844384p2809p3475p4402p3914p2027p0074o9107o9454p1021p2925p3542
55867B051634p1910o8758o5457o2407n9129n5384n1509m7903m4747m2096l9915
55856A442419l8132l6686l5302l3430l0928k8593k7326k6926k6456k5685k5226
55845A107729k5307k5327k4776k3738k2371k0725j9213j8399j8200j7947j7380
55834H74346j6768j6152j5253j4206j3448j2883j1993j0831r931r329q655q197
55822G26700q684r851j0489j0244j0203j1136j2248j2338j1379j0203r306q499
55810F02120p448o044m508l217k181q55J016K695L360L393L792M531M701M176
55796F05531L793L698K910Q57j801m345o715q705r618r366q874q685q243p145
$$ plain form
55782 543292 537110 530794 523351 514524 504518 493938 484044 476331 471640 470066 471553 475949 482544 490081
55768 490081 497134 502086 503172 499461 491762 481904 471132 459802 448314 437371 427279 417907 409494
55755 409494 402799 398174 395014 392190 388536 383017 375181 365611 355482 345605 336320 328027 321059 315153
55741 315153 309825 305225 301797 299188 296416 293220 290258 287788 285120 281755 278168 275010 272324 270034
55727 270034 268431 267530 266468 264205 260606 256439 252583 249560 247468 246036 244902 244054 243799 244316 245626
55712 245626 247932 251387 255505 259357 262492 265020 266752 267034 265731 263615 261371 258847 255656 251857
55698 251857 247587 242679 237210 231911 227449 223657 219930 216032 212144 208563 205714 204021 203369 203183 203365
55683 203365 204595 207211 210444 213342 215877 218508 221175 223451 225287 226835 227860 228080 227796 227480 227035
$$ packed form
55782E43292o182o316p443q827j0006j0580r894p713m691j574J487M396O595P537
55768D90081P053M952J086l711p699r858j0772j1330j1488j0943j0092r372q413
55755D09494o695m625l160k824l654n519p836r570j0129r877r285q293o968n906
55741C15153n328m600l428k609k772l196k962k470k668l365l587l158k686k290
55727B70034j603r01j062k263l599m167l856l023k092j432j134q48k55N17J310
55712B45626K306L455M118L852L135K528J732K82j303k116k244k524l191l799
55698B51857m270m908n469n299m462l792l727l898l888l581k849j693o52j86J82
55683B03365J230K616L233K898K535K631K667K276J836J548J025K20k84l16m45
$$ plain form
55668 227035 226194 225336 225050 225118 224838 224246 224029 224243 224121 223387 222891 223563 225480 228322 231999 236247 240182
55651 240182 242910 244360 245114 245630 245953 245884 244989 242616 238364 232575 226142 219827 213879 208120 202205 195912
55635 195912 189458 183484 178500 174315 170195 165670 161023 156930 153747 151278 149143 147200 145538 144275
55621 144275 143502 143337 143802 144707 145805 146983 148011 148273 147211 145115 142992 141389 139792 137484 134610
55606 134610 131904 129682 127686 125806 124394 123767 123792 124013 123967 123376 122393 121581 121334 121337 120929 120035 119363 119584
55588 119584 120614 121801 122548 122689 122480 122365 122616 123250 124350 126243 129012 132034 134485 136295 138147 140530
55572 140530 143345 146549 150594 155873 162103 168478 174113 178191 180183 180293 179348 177896 175716 172495 168531
55557 168531 164348 159972 155162 150087 145187 140547 135996 131726 128146 125152 122187 119192 116846 115576
$$ packed form
55668B27035q41q58k86O8k80n92k17K14j22p34m96O72J917K842L677M248L935
55651B40182K728J450P54N16L23o9q95k373m252n789o433o315n948n759n915o293
55635A95912o454n974m984m185m120m525m647m093l183k469k135j943j662j263
55621A44275p73j65M65R05J098J178J028K62j062k096k123j603j597k308k874
55606A34610k706k222j996j880j412o27K5K21m6n91r83q12k47Lm08q94o72K21
55588A19584J030J187P47J41k09j15K51O34J100J893K769L022K451J810J852K383
55572A40530K815L204M045N279O230O375N635M078J992J10r45j452k180l221l964
55557A68531m183m376m810n075m900m640m551m270l580k994k965k995k346j270
$$ plain form
55543 115576 114896 114098 113183 112632 112619 112932 113496 114467 115862 117463 119040 120364 121042 120784 119884 119063 118752 118802
55525 118802 118980 119369 120035 120598 120440 119223 116994 113980 110566 107373 104972 103441 102429 101645 101067 100683
55509 100683 100352 100046 99929 100034 100034 99579 98684 97579 96299 94734 93010 91501 90424 89686 89238 89264 89850 90638
55491 90638 91123 91185 91084 90896 90285 88972 87290 86041 85811 86582 87953 89552 91126 92421 93137 93007 91874
55474 91874 89848 87532 85938 85754 86635 87454 87444 86873 86518 86715 87258 87936 88711 89360 89440 88798 87831 87031 86549
55455 86549 86384 86711 87681 89049 90314 91172 91575 91474 90875 90092 89559 89354 89195 88978 88906 88993 88894 88447 87999
55436 87999 87772 87324 86179 84741 83946 84014 84234 84118 84134 84950 86467 88051 89406 90718 92126 93542 94871
55419 94871 96029 96767 96918 96787 96907 97369 97778 97937 98161 98745 99500 100070 100370 100450 100199 99537 98678 97851 96893
$$ packed form
55543A15576o80p98r15n51j3L13N64R71J395J601J577J324O78k58r00q21l11N0
55525A18802J78L89O66N63j58j217k229l014l414l193k401j531j012p84n78l84
55509A00683l31l06j17J05%m55q95j105j280j565j724j509j077p38m48K6N86P88
55491I0638M85O2j01j88o11j313j682j249k30P71J371J599J574J295P16j30j133
55474I1874k026k316j594j84Q81Q19j0n71l55J97N43O78P75O49Q0o42r67q00m82
55455H6549j65L27R70J368J265Q58M03j01n99p83n33k05j59k17p2Q7r9m47m48
55436H7999k27m48j145j438p95O8K20j16J6Q16J517J584J355J312J408J416J329
55419I4871J158P38J51j31J20M62M09J59K24N84P55N70L00Q0k51o62q59q27r58
$$ plain form
55400 96893 95564 94149 93227 92786 92054 90523 88728 87611 87294 86964 85971 84647 83898 84295 85727 87656
55384 87656 89433 90589 91180 91809 92914 94063 94386 93859 93642 94734 96556 97464 96595 94667 92847 91395
55368 91395 89815 87958 86372 85599 85579 85901 86327 86806 87140 86951 86077 84863 83943 83686 83857 83844 83269 82381
55350 82381 81813 81954 82584 83157 83347 83222 82935 82476 81822 81204 80933 81015 81171 81322 81786 82803 84049 84937 85308
55331 85308 85520 85812 85881 85313 84234 83297 83015 83238 83350 82869 81825 80570 79376 78289 77375 76845 76824 77127
55313 77127 77451 77751 78183 78704 79008 78960 78885 79215 79980 80792 81300 81518 81744 82259 83057 83765 83877 83240 82315 81835
55293 81835 82075 82545 82468 81634 80709 80650 81842 83824 85845 87483 88683 89393 89446 88817 87762 86559 85282
55276 85282 83970 82924 82543 82853 83374 83646 83781 84269 85219 86074 86288 86082 86166 86773 87386 87514 87328 87278 87429
$$ packed form
55400I6893j329j415r22m41p32j531j795j117l17l30r93j324p49L97J432J929
55384H7656J777J156N91O29J105J149L23n27k17J092J822R08q69j928j820j452
55368I1395j580j857j586p73k0L22M26M79L34j89q74j214r20k57J71j3n75q88
55350H2381n68J41O30N73J90j25k87m59o54o18k71Q2J56J51M64J017J246Q88L71
55331H5308K12K92O9n68j079r37k82K23J12m81j044j255j194j087r14n30k1L03
55313G7127L24L00M32N21L04m8p5L30P65Q12N08K18K26N15P98P08J12o37r25m80
55293H1835K40M70p7q34r25n9J192J982K021J638J200P10N3o29j055j203j277
55276H5282j312j046l81L10N21K72J35M88R50Q55K14k06Q4O07O13J28j86n0J51
$$ plain form
55257 87429 87592 87860 88576 89772 91047 91978 92374 92181 91503 90696 90071 89501 88652 87608 86810 86317 85648 84538
55239 84538 83429 82884 82918 83160 83382 83515 83496 83478 83945 85151 86561 87239 86786 85643 84631 84430 85332 87012
55221 87012 88507 88806 87660 85739 84014 83131 83265 84249 85718 87284 88675 89728 90411 90890 91380 91795
55205 91795 91761 91256 90996 91741 93279 94479 94488 93602 92841 92867 93355 93338 92145 90093 88207 87224 86971 86857 86674
55186 86674 86644 86889 87317 87925 88776 89604 89926 89671 89384 89538 89913 89857 89062 87906 87171 87467 88781 90482 91864
55167 91864 92767 93592 94705 96001 97075 97642 97766 97827 98293 99347 100665 101651 101916 101460 100553 99629 99152 99167
55149 99167 98964 97585 94881 91793 89508 88599 89013 90459 92453 94274 95286 95323 94646 93689 93010 93157 94178
55132 94178 95310 95539 94539 92848 91152 89677 88357 87278 86687 86674 87069 87633 88265 89002 89936 91132 92533
$$ packed form
55257H7429J63K68P16J196J275R31L96j93o78q07o25n70q49j044p98m93o69j110
55239H4538j109n45L4K42K22J33j9j8M67J206J410O78m53j143j012k01R02J680
55221H7012J495K99j146j921j725q83J34R84J469J566J391J053O83M79M90M15
55205I1795l4n05k60P45J538J200Rq86p61K6M88j7j193k052j886r83k53j14j83
55186H6674l0K45M28O08Q51Q28L22k55k87J54L75n6p95j156p35K96J314J701J382
55167I1864R03Q25J113J296J074N67J24O1M66J054J318R86K65m56r07r24m77J5
55149I9167k03j379k704l088k285r09M14J446J994J821J012L7o77r57o79J47J021
55132I4178J132K29j000j691j696j475j320j079n91j3L95N64O32P37R34J196J401
$$ plain form
55115 92533 93857 94698 94907 94840 95119 96041 97284 98204 98380 97935 97475 97643 98535 99536 99994 100033 100352 101148 101738
55096 101738 101567 101119 101339 102415 103696 104637 105272 105739 105937 105788 105411 104936 104440 104096 104034 104091 104091 104287 105017
55077 105017 105951 106330 106043 105764 105779 105425 104148 102529 101611 101601 101766 101388 100323 98901 97723 97388 97938 98702
55059 98702 99016 98948 98984 99303 99746 100239 100704 100799 100266 99465 99111 99543 100713 102581 104881 106594 106491 104501
55041 104501 101993 100467 100308 100948 101699 102115 102032 101670 101577 102090 102931 103421 103039 101742 100025 98727 98499 99235
55023 99235 100121 100308 99456 97774 95926 94884 95333 96950 98579 99372 99502 99553 99625 99430 98994 98746 98940 99382
55005 99382 99778 100049 100277 100588 101180 102186 103387 104285 104644 104810 105275 105997 106407 106129 105467 105035 105071 105385 105823
54986 105823 106439 107147 107622 107798 108143 109105 110399 111203 111015 110077 109053 108531 108778 109565 110197 110047 109239 108639
$$ packed form
55115I2533J324Q41K09o7K79R22J243R20J76m45m60J68Q92J001M58L9L19P96N90
55096A01738j71m48K20J076J281R41O35M67J98j49l77m75m96l44o2N7%J96P30
55077A05017R34L79k87k79J5l54j277j619r18j0J65l78j065j422j178l35N50P64
55059I8702L14o8L6L19M43M93M65R5n33q01l54M32J170J868K300J713j03j990
55041A04501k508j526j59O40P51M16q3l62r3N13Q41M90l82j297j717j298k28P36
55023I9235Q86J87q52j682j848j042M49J617J629P93J30N1P2j95m36k48J94M42
55005I9382L96K71K28L11N92J006J201Q98L59J66M65P22M10k78o62m32L6L14M38
54986A05823O16P08M75J76L45R62J294Q04j88r38j024n22K47P87O32j50q08o00
$$ plain form
54968 108639 109099 110823 113355 115854 117437 117699 117072 116455 116400 116856 117631 118653 119687 120315 120445 120419 120346 119724
54950 119724 118165 116184 114768 114275 114180 113874 113337 112992 113208 114035 115263 116630 117987 119200 119959 120020 119757
54933 119757 120147 121842 124450 127068 129350 131741 134778 138586 143019 147962 153424 159584 166727 174917
54919 174917 183772 192716 201288 208927 214623 217300 216571 212869 206933 199561 191710 184175 177018 169803
54905 169803 162562 156048 150779 146365 142166 138235 135186 133399 132696 132616 132625 132265 131454 130562 129918 129453 129114
54888 129114 129365 130830 133551 137044 141015 145572 150733 156193 161733 167487 173722 180566 187958 195582
54874 195582 202794 208944 213749 217067 218348 216875 212623 206401 198940 190412 181139 172163 164520 158233
54860 158233 152599 147269 142522 138636 135597 133342 131717 130188 128147 125643 123309 121470 119813 118119
$$ packed form
54968A08639M60J724K532K499J583K62o27o17n5M56P75J022J034O28J30k6p3o22
54950A19724j559j981j416m93r5l06n37l45K16Q27J228J367J357J213P59O1k63
54933A19757L90J695K608K618K282K391L037L808M433M943N462O160P143Q190
54919A74917Q855Q944Q572P639N696K677p29l702n936p372p851p535p157p215
54905A69803p241o514n269m414m199l931l049j787p03q0Rl60q11q92o44m65l39
54888A29114K51J465K721L493L971M557N161N460N540N754O235O844P392P624
54874A95582P212O150M805L318J281j473m252o222p461q528r273q976p643o287
54860A58233n634n330m747l886l039k255j625j529k041k504k334j839j657j694
$$ plain form
54846 118119 116752 116087 115936 115912 115941 115938 115354 113695 111397 109588 108926 109083 109360 109376 109061 108432 107644 106981 106573
54827 106573 106296 106059 106035 106457 107376 108699 110273 111719 112420 111930 110424 108606 107212 106608 106712 107148 107571
54810 107571 107960 108543 109390 110255 110931 111536 112238 112879 113229 113518 114269 115554 116731 117150 116818 116182 115472 114637
54792 114637 113776 113224 113084 112984 112524 111827 111506 112148 113971 116807 120160 123249 125326 126255 126753 127886 130164
54775 130164 133129 135899 138237 141037 145615 152410 160531 168766 176867 185442 194614 203360 210554 216204
54761 216204 221103 225361 227972 227915 225146 220253 213668 205708 197054 188571 180609 172900 165260 158084 152008
54746 152008 147310 143786 141084 139013 137607 136989 137117 137626 138006 138015 137836 137793 138034 138568 139527 141206 143834
54729 143834 147362 151510 156016 160858 166291 172592 179681 187032 194038 200473 206451 211884 216113 218246
$$ packed form
54846A18119j367o65j51k4K9ln84j659k298j809o62J57K77J6l15o29p88o63m08
54827A06573k77k37k4M22R19J323J574J446P01m90j506j818j394o04J04M36M23
54810A07571L89N83Q47Q65O76O05P02O41L50K89P51J285J177M19l32o36p10q35
54792A14637q61n52j40j00m60o97l21O42J823K836L353L089K077R29M98J133K278
54775A30164K965K770K338K800M578O795Q121Q235Q101Q575R172Q746P194N650
54761B16204M899M258K611n7k769m893o585p960q654q483p962p709p640p176o076
54746A52008m698l524k702k071j406o18J28N09L80Rj79m3K41N34R59J679K628
54729A43834L528M148M506M842N433O301P089P351P006O435N978N433M229K133
$$ plain form
54715 218246 217886 215404 211464 206348 199806 191573 182015 172315 163981 157960 154022 150996 147779 144223
54701 144223 141062 138992 137909 137030 135661 133742 131692 129852 128205 126638 125320 124621 124572 124651 124320 123699
54685 123699 123390 123634 123940 123774 123360 123409 124115 124786 124611 123558 122268 121223 120330 119352 118456 118065 118250 118503
54667 118503 118216 117300 116224 115512 115275 115233 115130 115037 115184 115489 115450 114727 113785 113562 114378 115484 116012 116124 116752
54648 116752 118304 120156 121489 122156 122499 122749 122950 123249 123799 124446 124820 124718 124236 123627 123244 123419 124108 124653
54630 124653 124270 122854 121120 119952 119735 120273 121071 121685 121991 122212 122547 122861 122905 122743 122662 122697 122571 122139 121577
54611 121577 121105 120842 120998 121797 123014 124012 124484 124807 125303 125564 124975 123698 122550 122000 121782 121544 121353 121405
54593 121405 121674 122098 122786 123710 124420 124368 123489 122296 121450 121305 121721 122180 122264 122166 122570 123840 125506 126792
$$ packed form
54715B18246l60k482l940n116o542q233r558r700q334o021l938l026l217l556
54701A44223l161k070j083q79j369j919k050j840j647j567j318o99m9P9l31o21
54685A23699l09K44L06j66m14M9P06O71j75j053j290j045q93r78q96l91J85K53
54667A18503k87r16j076p12k37m2j03r3J47L05l9p23r42k23Q16J106N28J12O28
54648A16752J552J852J333O67L43K50K01K99N50O47L74j02m82o09l83J75O89N45
54630A24653l83j416j734j168k17N38P98O14L06K21L35L14M4j62q1L5j26m32n62
54611A21577m72k63J56P99J217R98M72L23M96K61n89j277j148n50k18k38j91N2
54593A21405K69M24O88R24P10n2q79j193q46j45M16M59Q4r8M04J270J666J286
$$ plain form
54575 126792 127502 128078 128874 129710 130153 129895 128796 126951 124914 123540 123250 123584 123726 123350 122718 122170 121908
54558 121908 122246 123562 125750 128030 129518 129905 129454 128636 127970 127953 128684 129561 129757 129084 128194 127836 128180 128939
54540 128939 129841 130778 131735 132849 134398 136439 138517 140025 140826 141283 141654 141799 141548 141056 140609 140256 139834
54523 139834 139271 138721 138521 139005 140101 141021 140748 139209 137650 137336 138023 138289 137342 135856 134883 134628 134697 134897
54505 134897 135176 135150 134516 133782 133885 135012 136415 137465 138205 138703 138597 137791 137050 137257 138312 139363 139964
54488 139964 140459 141234 142124 142641 142478 141718 140865 140646 141427 142708 143562 143692 143704 144187 144955 145485 145789 146357 147358
54469 147358 148374 149012 149458 150130 151014 151621 151656 151499 151776 152517 152962 152390 150998 149688 149037 148764 148320 147677
54451 147677 147238 147115 146886 146166 145178 144524 144510 144828 144970 144783 144538 144532 144777 145084 145323 145473 145500 145295 144769 143981
$$ packed form
54575A26792P10N76P96Q36M43k58j099j845k037j374k90L34J42l76o32n48k62
54558A21908L38J316K188K280J488L87m51q18o66j7P31Q77J96o73q90l58L44P59
54540A28939R02R37R57J114J549K041K078J508Q01M57L71J45k51m92m47l53m22
54523A39834n63n50k00M84J096R20k73j539j559l14O87K66r47j486r73k55O9K00
54505A34897K79k6o34p34J03J127J403J050P40M98j06q06p41K07J055J051O01
54488A39964M95P75Q90N17j63p60q53k19P81J281Q54J30J2M83P68N30L04N68J001
54469A47358J016O38M46O72Q84O07L5j57K77P41M45n72j392j310o51k73m44o43
54451A47677m39j23k29p20r88o54j4L18J42j87k45oK45L07K39J50K7k05n26p88
$$ plain form
54431 143981 143164 142639 142619 143120 144063 145404 146977 148322 149006 149210 149601 150336 150581 149495 147446 145715 145107
54414 145107 145424 146204 147212 148070 148191 147522 146806 146639 146758 146786 147132 148414 150286 151722 152383 152949 153989
54397 153989 155256 156297 157150 158037 158828 159167 158860 157903 156441 154908 153837 153311 152938 152593 152759 153714 154803
54380 154803 155088 154491 153744 153331 153107 152917 152961 153302 153525 153233 152524 151734 151015 150476 150445 151132 152153 152836 153012
54361 153012 153145 153563 153955 153866 153446 153311 153669 153961 153578 152724 152253 152634 153399 153782 153674 153637 154063 154679 155025
54342 155025 155083 155114 155114 154782 154042 153226 152672 152391 152220 152070 151861 151480 151011 150814 151133 151722 152098 152012 151508 150681
54322 150681 149698 148873 148319 147655 146565 145599 145777 147229 148850 149656 149943 150627 151935 153392 154761 156245
54306 156245 157856 159366 160919 162946 165254 166892 167281 166949 166723 166671 166334 165663 165014 164347 163054 160780
$$ packed form
54431A43981q17n25k0N01R43J341J573J345O84K04L91P35K45j086k049j731o08
54414A45107L17P80J008Q58J21o69p16j67J19K8L46J282J872J436O61N66J040
54397A53989J267J041Q53Q87P91L39l07r57j462j533j071n26l73l45J66R55J089
54380A54803K85n97p47m13k24j90M4L41K23k92p09p90p19n39l1O87J021O83J76
54361A53012J33M18L92q9m20j35L58K92l83q54m71L81P65L83j08l7M26O16L46
54342A55025N8L1%l32p40q16n54k81j71j50k09l81m69j97L19N89L76q6n04q27
54322A50681r83q25n54o64j090r66J78J452J621Q06K87O84J308J457J369J484
54306A56245J611J510J553K027K308J638L89l32k26n2l37o71o49o67j293k274
$$ plain form
54290 160780 157972 155384 153260 151292 149291 147663 147089 147747 148979 149847 150023 149962 150234 150874 151460 151586 151165
54273 151165 150455 149961 150099 150764 151380 151522 151325 151109 150919 150685 150559 150686 150793 150459 149765 149263 149338 149986 151175
54254 151175 152921 154909 156487 157262 157393 157174 156729 156295 156325 156851 157120 156348 154733 153256 152581 152501 152452 152080
54236 152080 151314 150308 149511 149391 149815 149970 149180 147644 146050 144662 143221 141689 140604 140407 140791 141040
54220 141040 140903 140755 140903 141114 140973 140462 139987 139908 140218 140543 140435 139758 138885 138331 138147 137872 137214 136463 136042
54201 136042 135985 136252 137169 138965 141047 142470 143181 144051 145491 146754 147049 146657 146374 146314 146029 145517 145318 145630
54183 145630 146030 146068 145594 144423 142410 140102 138721 139006 140397 141748 142568 143198 143987 144739 144967 144398 143231
54166 143231 142101 141699 142249 143348 144375 144933 144820 143933 142508 141237 140689 140652 140391 139581 138640 138148 138315
$$ packed form
54290A60780k808k588k124j968k001j628n74O58J232Q68J76o1K72O40N86J26m21
54273A51165p10m94J38O65O16J42j97k16j90k34j26J27J07l34o94n02P5O48J189
54254A51175J746J988J578P75J31k19m45m34L0N26K69p72j615j477o75q0m9l72
54236A52080p66j006p97j20M24J55p90j536j594j388j441j532j085j97L84K49
54220A41040j37j48J48K11j41n11m75p9L10L25j08o77q73n54j84k75o58p51m21
54201A36042n7K67R17J796K082J423P11Q70J440J263K95l92k83o0k85n12j99L12
54183A45630M00L8m74j171k013k308j381K85J391J351Q20O30P89P52K28n69j167
54166A43231j130m02N50J099J027N58j13q87j425j271n48l7k61q10r41m92J67
$$ plain form
54149 138315 139063 140192 141240 141596 141168 140691 140956 141866 142618 142776 142724 143021 143739 144639 145650 146845 148121
54132 148121 149207 149928 150233 150039 149309 148330 147682 147816 148689 149830 150670 150907 150717 150644 151096 151924 152692 153343
54114 153343 154311 155852 157530 158667 159100 159201 159212 158933 158076 156671 155002 153381 152111 151428 151273 151236 150921
54097 150921 150385 150013 150001 150145 150134 149906 149595 149242 148751 148110 147552 147385 147763 148685 150112 151923 153763 155183
54079 155183 156013 156517 157064 157821 158846 160255 161959 163397 163917 163596 163342 163946 165197 166160 166208 165543 164755
54062 164755 164189 163838 163663 163738 164083 164559 165079 165835 167090 168683 169979 170568 170836 171583 173040 174647 175880
54045 175880 176966 178534 180821 183552 186473 189633 193107 196777 200548 204632 209403 214942 220817 226411
54031 226411 231522 236547 241930 247487 252546 256756 260343 263415 265486 266199 266172 266459 267213 267561 266865 265460
$$ packed form
54149A38315P48J129J048L56m28m77K65R10P52J58n2K97P18R00J011J195J276
54132A48121J086P21L05j94p30r79o48J34Q73J141Q40K37j90p3M52Q28P68O51
54114A53343R68J541J678J137M33J01J1k79q57j405j669j621j270o83j55l7l15
54097A50921n36l72j2J44j1k28l11l53m91o41n58j67L78R22J427J811J840J420
54079A55183Q30N04N47P57J025J409J704J438N20l21k54O04J251R63M8o65p88
54062A64755n66l51j75P5L45M76N20P56J255J593J296N89K68P47J457J607J233
54045A75880J086J568K287K731K921L160L474L670L771M084M771N539N875N594
54031B26411N111N025N383N557N059M210L587L072K071P13k7K87P54L48o96j405
$$ plain form
54015 265460 263944 262349 260440 258241 255714 252363 247839 242714 238016 234124 230714 227635 225065 222783
54001 222783 220121 216957 214098 212268 211234 210330 209325 208303 207139 205781 204661 204078 203382 201626 199086
53986 199086 197284 197253 198381 199342 199542 199198 198600 198052 198313 200265 203950 208460 213040 217977 224164 231995
53970 231995 240962 250307 259830 269976 281133 292878 303964 312967 318801 320698 318084 310940 300241
53957 300241 287711 274949 262905 252086 242927 235735 230479 226836 224406 222772 221551 220604 220150 220487
53943 220487 221526 222735 223633 224288 225328 227410 230657 234549 238420 242123 246144 250999 256603 262390 267950
53928 267950 273282 278357 282792 286249 289004 291727 294683 297563 300185 302978 306430 310386 314329 318219
53914 318219 322530 327447 332598 337750 343210 349120 354773 359133 361860 363362 364032 363945 363244 362209 360802
$$ packed form
54015B65460j516j595j909k199k527l351m524n125m698l892l410l079k570k282
54001B22783k662l164k859j830j034r04j005j022j164j358j120n83o96j756k540
53986A99086j802l1J128R61K00l44n98n48K61J952L685M510M580M937O187P831
53970B31995Q967R345R523J0146J1157J1745J1086R003N834J897k614p144j0699
53957C00241j2530j2762j2044j0819r159p192n256l643k430j634j221r47m54L37
53943B20487J039J209Q98O55J040K082L247L892L871L703M021M855N604N787N560
53928B67950N332N075M435L457K755K723K956K880K622K793L452L956L943L890
53914C18219M311M917N151N152N460N910N653M360K727J502O70q7p01j035j407
$$ plain form
53899 360802 358632 355569 352010 348336 344569 340740 337159 333835 330009 324843 318478 311896 305727 299706
53885 299706 293409 287005 280987 275502 270344 265378 260594 255868 251131 246820 243659 241741 240213 238194
53871 238194 235753 233560 231751 229805 227529 225435 223814 222053 219488 216523 214235 213058 212528 212172 211869
53856 211869 211300 209850 207400 204607 202099 199960 198247 197310 197092 196779 195812 194711 194142 193623 192136 189853
53840 189853 188251 188338 189596 190883 191690 192183 192620 193122 193610 193660 192866 191659 191265 192474 194747 196942 198585
53823 198585 199962 201253 202193 202622 202896 203524 204568 205576 206122 206414 207300 209492 212869 216755 220845 225481
53807 225481 231004 237338 244434 252596 261947 272060 282659 294402 308279 324362 341738 359694
53795 359694 378218 397039 414688 428950 438120 441604 439581 432531 421218 406939 391501 376578
$$ packed form
53899C60802k170l063l559l674l767l829l581l324l826n166o365o582o169o021
53885B99706o297o404o018n485n158m966m784m726m737m311l161j918j528k019
53871B38194k441k193j809j946k276k094j621j761k565k965k288j177n30l56l03
53856B11869n69j450k450k793k508k139j713r37k18l13r67j101n69n19j487k283
53840A89853j602Q7J258J287Q07M93M37N02M88N0p94j207l94J209K273K195J643
53823A98585J377J291R40M29K74O28J044J008N46K92Q86K192L377L886M090M636
53807B25481N523O334P096Q162R351J0113J0599J1743J3877J6083J7376J7956
53795C59694J8524J8821J7649J4262R170L484k023p050j1313j4279j5438j4923
$$ plain form
53783 376578 362889 350120 337811 326195 315925 307142 299243 291576 284005 276731 269931 263774 258509
53770 258509 254287 250993 248304 245736 242684 238806 234568 231053 228914 227708 226427 224457 221814 218759
53756 218759 215667 213144 211774 211582 211995 212386 212497 212367 212128 211974 212078 212449 212994 213834 215392 218002 221453
53739 221453 225033 228081 230596 233304 237006 241710 246439 250040 252131 253143 253565 253431 252505 250691 248206
53724 248206 245576 243488 242372 241980 241600 240780 239624 238365 237036 235797 235224 235904 237855 240612 243671
53709 243671 246576 248890 250557 252168 254330 256853 259083 260993 263250 266070 268716 270519 271827 273442
53695 273442 275554 277814 280136 282783 285842 289203 292914 296870 300223 301819 301523 300479 299766 299309 298469
53680 298469 297289 296524 296652 297335 297886 297938 297588 297090 296470 295381 293469 290962 288746 287646 287685 288181 288371
$$ packed form
53783C76578j3689j2769j2309j1616j0270q783p899p667p571p274o800o157n265
53770B58509m222l294k689k568l052l878m238l515k139j206j281j970k643l055
53756B18759l092k523j370j92M13L91J11j30k39j54J04L71N45Q40J558K610L451
53739B21453L580L048K515K708L702M704M729L601K091J012M22j34r26j814k485
53724B48206k630k088j116l92l80q20j156j259j329j239n73O80J951K757L059
53709B43671K905K314J667J611K162K523K230J910K257K820K646J803J308J615
53695B73442K112K260K322K647L059L361L711L956L353J596k96j044p13m57q40
53680B98469j180p65J28O83N51N2l50m98o20j089j912k507k216j100L9M96J90
$$ plain form
53663 288371 287798 286349 284274 282193 280727 280021 279791 279806 280096 280642 281151 281316 281184 281149 281597 282548 283547 283910
53645 283910 283251 281875 280615 280162 280518 281129 281463 281508 281720 282497 283677 284660 285104 285475 286695 289210 292520
53628 292520 295746 298542 301255 304190 306966 308845 309660 310180 311426 313785 316931 320413 324033 327745 331517
53613 331517 335305 338916 341974 344449 347226 351579 357749 364451 370119 374299 377489 380074 382061 383638
53599 383638 385289 387294 389572 392006 394464 396541 397804 398356 398731 399178 399581 400019 400691 401186 400613 398869
53583 398869 397067 396167 395724 394614 392486 389843 387072 384202 381360 378615 375470 371395 366959 363573 361851
53568 361851 360968 360029 359298 359464 360291 360865 360948 361192 361959 362665 362679 362324 362445 363134 363428 362441 360503 358875 358457
53549 358457 359062 359982 360976 362427 364675 367571 370751 374031 377363 380609 383636 386586 389850 393754 398434
$$ packed form
53663B88371n73j449k075k081j466p06k30J5K90N46N09J65j32l5M48R51R99L63
53645B83910o59j376j260m53L56O11L34M5K12P77J180R83M44L71J220K515L310
53628B92520L226K796K713K935K776J879Q15N20J246K359L146L482L620L712L772
53613C31517L788L611L058K475K777M353O170O702N668M180L190K585J987J577
53599C83638J651K005K278K434K458K077J263N52L75M47M03M38O72M95n73j744
53583C98869j802r00m43j110k128k643k771k870k842k745l145m075m436l386j722
53568C61851q83r39p31J66Q27N74Q3K44P67P06J4l55J21O89K94r87j938j628m18
53549C58457O05R20R94J451K248K896L180L280L332L246L027K950L264L904M680
$$ plain form
53534 398434 404000 410627 418377 427034 436284 446123 457038 469684 484235 500049 516039 531547 546840
53521 546840 562674 579408 596685 613994 631305 648925 666868 684730 702319 720140 738946
53510 738946 758934 779691 800990 823258 847042 872173 897854 923495 949147 975002 1000794
53499 1000794 1025965 1050207 1073588 1096192 1118061 1139566 1161461 1184272 1207789 1231420 1254929
53488 1254929 1278418 1301699 1324175 1345591 1366425 1387171 1407469 1426376 1443453 1459244 1474751
53477 1474751 1490726 1507310 1523867 1539128 1552024 1562563 1571495 1578965 1583980 1585509 1583672 1579456
53465 1579456 1573583 1566103 1556755 1545216 1531228 1515064 1497718 1480075 1461982 1442748 1422488 1402184
53453 1402184 1382245 1361742 1339504 1315417 1290264 1264857 1239898 1216206 1194291 1173740 1153588
$$ packed form
53534C98434N566O627P750Q657R250R839J0915J2646J4551J5814J5990J5508J5293
53521E46840J5834J6734J7277J7309J7311J7620J7943J7862J7589J7821J8806
53510G38946J9988K0757K1299K2268K3784K5131K5681K5641K5652K5855K5792
53499A000794K5171K4242K3381K2604K1869K1505K1895K2811K3517K3631K3509
53488A254929K3489K3281K2476K1416K0834K0746K0298J8907J7077J5791J5507
53477A474751J5975J6584J6557J5261J2896J0539Q932P470N015J529j837m216
53465A579456n873p480r348j1539j3988j6164j7346j7643j8093j9234k0260k0304
53453A402184j9939k0503k2238k4087k5153k5407k4959k3692k1915k0551k0152
$$ plain form
53442 1153588 1133328 1113253 1093993 1076172 1060394 1046981 1035603 1025580 1016693 1009367 1004021 1000604
53430 1000604 998838 998508 999378 1001243 1004308 1009191 1016324 1025574 1036644 1049467 1063932 1079615 1096240
53417 1096240 1114147 1133818 1155055 1177203 1200168 1224661 1251263 1279769 1309685 1340922 1373674
53406 1373674 1407940 1443655 1481105 1520717 1562491 1606098 1651596 1699646 1750828 1804992 1861497
53395 1861497 1919814 1979685 2040871 2103090 2166123 2229753 2293615 2357295 2420582 2483373 2545337
53384 2545337 2605845 2664271 2720175 2773150 2822733 2868608 2910705 2948997 2983357 3013759 3040371
53373 3040371 3063186 3081674 3095135 3103441 3107153 3106777 3102015 3091816 3075069 3051183 3020119 2982042
53361 2982042 2937052 2885395 2827936 2766211 2701903 2636255 2570126 2504317 2439513 2375952 2313575
$$ packed form
53442A153588k0260k0075j9260j7821j5778j3413j1378j0023q887p326n346l417
53430A000604j766l30Q70J865L065M883P133R250J1070J2823J4465J5683J6625
53417A096240J7907J9671K1237K2148K2965K4493K6602K8506K9916L1237L2752
53406A373674L4266L5715L7450L9612M1774M3607M5498M8050N1182N4164N6505
53395A861497N8317N9871O1186O2219O3033O3630O3862O3680O3287O2791O1964
53384B545337O0508N8426N5904N2975M9583M5875M2097L8292L4360L0402K6612
53373C040371K2815J8488J3461Q306L712l76m762j0199j6747k3886l1064l8077
53361B982042m4990n1657n7459o1725o4308o5648o6129o5809o4804o3561o2377
$$ plain form
53350 2313575 2252585 2193497 2136486 2081046 2026602 1973163 1920989 1869814 1818878 1767785 1717022
53339 1717022 1667541 1620141 1575283 1533212 1493956 1457292 1422938 1390828 1361171 1334281 1310365
53328 1310365 1289358 1270879 1254292 1238861 1223954 1209259 1194895 1181186 1168262 1155968 1144300
53317 1144300 1133687 1124612 1117051 1110612 1105138 1100859 1097979 1096591 1097040 1099836 1104826 1110869 1116829 1122786
53303 1122786 1129884 1139084 1150458 1163640 1178462 1194964 1213138 1232967 1254561 1278032 1303258 1329967
53291 1329967 1358011 1387395 1417986 1449332 1480830 1511998 1542415 1571425 1598238 1622528 1644736
53280 1644736 1665401 1684253 1700392 1713384 1723745 1732101 1738323 1741865 1742595 1740731 1736165 1728471 1717551
53267 1717551 1703820 1687638 1668985 1647767 1624011 1597686 1568810 1537992 1506418 1474936 1443376
$$ packed form
53350B313575o0990n9088n7011n5440n4444n3439n2174n1175n0936n1093n0763
53339A717022m9481m7400m4858m2071l9256l6664l4354l2110k9657k6890k3916
53328A310365k1007j8479j6587j5431j4907j4695j4364j3709j2924j2294j1668
53317A144300j0613r075p561o439n474m279k880j388M49K796M990O043N960N957
53303A122786P098R200J1374J3182J4822J6502J8174J9829K1594K3471K5226K6709
53291A329967K8044K9384L0591L1346L1498L1168L0417K9010K6813K4290K2208
53280A644736K0665J8852J6139J2992J0361Q356O222L542P30j864m566p694j0920
53267A717551j3731j6182j8653k1218k3756k6325k8876l0818l1574l1482l1560
$$ plain form
53256 1443376 1411078 1377818 1343883 1309407 1274109 1237802 1200989 1164808 1130376 1098078 1067482
53245 1067482 1037976 1009386 981737 954556 926964 898678 870488 843406 817609 792592 768108
53234 768108 744501 722235 701500 682329 664828 649199 635630 624036 613761 603742 593328
53223 593328 582792 572798 563460 554294 544854 534961 524324 512542 499672 486380 473298 460524
53211 460524 448010 436132 425555 416579 408835 401618 394411 387158 380092 373356 366877 360661 354977
53198 354977 349943 345040 339424 332843 325987 319810 314707 310398 306375 302378 298607 295544 293361 291498
53184 291498 289097 285921 282557 279633 277217 275100 273298 271970 271090 270494 270107 269877 269617 269152 268503 267813
53168 267813 267178 266655 266240 265777 265124 264525 264438 264813 264903 264145 262913 262037 261829 261977 262124 262046 261461 260286 259100
$$ packed form
53256A443376l2298l3260l3935l4476l5298l6307l6813l6181l4432l2298l0596
53245A067482k9506k8590k7649k7181k7592k8286k8190k7082k5797k5017k4484
53234G68108k3607k2266k0735j9171j7501j5629j3569j1594j0275j0019j0414
53223E93328j0536r994r338r166r440r893j0637j1782j2870j3292j3082j2774
53211D60524j2514j1878j0577q976p744p217p207p253p066o736o479o216n684
53198C54977n034m903n616o581o856o177n103m309m023l997l771l063k183j863
53184B91498k401l176l364k924k416k117j802j328q80n96l87k30k60m65o49o90
53168B67813o35n23m15m63o53n99q7L75R0p58j232q76k08J48J47p8n85j175j186
$$ plain form
53149 259100 258793 259608 260916 262010 262704 263031 262809 261807 260124 258166 256364 254959 253940 253142 252541 252379
53133 252379 252773 253275 253252 252712 252308 252439 252746 252720 252371 251955 251420 250583 249657 249189 249474 250325 251333 252050 251993
53114 251993 250867 248898 246701 244736 243065 241623 240460 239593 238832 237958 236953 235870 234591 233023 231533
53099 231533 230874 231407 232537 233237 233106 232638 232406 232317 231865 230807 229306 227637 226035 224668 223399 221773
53083 221773 219626 217577 216431 216204 216276 216484 217316 218854 220334 221227 222136 223920 226302 228082 228567 228127
53067 228127 227374 226426 225220 224047 223456 223722 224528 225123 224895 223943 223029 222822 223364 224393 225792 227386 228686
53050 228686 229441 230188 231597 233328 234266 233967 233153 232594 232230 231762 231428 231637 232256 232840 233244 233515 233450 232801
53032 232801 231755 230772 230036 229447 229001 228706 228271 227392 226355 225883 226339 227436 228741 230048 231151 231721 231618
$$ packed form
53149B59100l07Q15J308J094O94L27k22j002j683j958j802j405j019p98o01j62
53133B52379L94N02k3n40m04J31L07k6l49m16n35q37r26m68K85Q51J008P17n7
53114B51993j126j969k197j965j671j442j163q67p61q74j005j083j279j568j490
53099B31533o59N33J130P00j31m68k32q9m52j058j501j669j602j367j269j626
53083B21773k147k049j146k27P2K08Q32J538J480Q93R09J784K382J780M85m40
53067B28127p53r48j206j173n91K66Q06N95k28r52r14k07N42J029J399J594J300
53050B28686P55P47J409J731R38k99q14n59l64m68l34K09O19N84M04K71o5o49
53032B32801j046r83p36n89m46k95m35q79j037m72M56J097J305J307J103N70j03
$$ plain form
53015 231618 231083 230414 229692 228943 228312 227928 227787 227893 228386 229389 230816 232355 233544 233957 233601 233107 233176 233821
52997 233821 234478 234899 235411 236131 236478 235938 234937 234412 234686 235291 235766 236097 236378 236583 236848 237481 238469 239291
52979 239291 239534 239457 239680 240466 241564 242675 243822 245228 246910 248472 249398 249708 250244 251944 254724 257447
52963 257447 259180 260137 261032 261876 262021 261248 260044 258671 256636 253518 249842 246639 244410 243014 242292 242179
52947 242179 242237 241764 240581 239280 238450 237995 237449 236631 235715 234917 234511 234956 236528 238727 240342 240331 238695
52930 238695 236527 235202 235317 236254 236852 236551 235684 234641 233238 231263 229276 228188 228116 228299 228223 228261 228925
52913 228925 229963 230641 230634 230276 230016 229893 229507 228387 226562 224823 224149 224693 225632 226250 226822 228071 230035
52896 230035 231979 233289 233989 234372 234603 234789 235005 235111 234886 234504 234561 235330 236195 236135 234747 232581 230502 228893
$$ packed form
53015B31618n35o69p22p49o31l84j41J06M93J003J427J539J189M13l56m94O9O45
52997B33821O57M21N12P20L47n40j001n25K74O05M75L31K81K05K65O33R88Q22
52979B39291K43p7K23P86J098J111J147J406J682J562R26L10N36J700K780K723
52963B57447J733R57Q95Q44J45p73j204j373k035l118l676l203k229j396p22j13
52947B42179N8m73j183j301q30m55n46q18r16p98m06M45J572K199J615j1j636
52930B38695k168j325J15R37N98l01q67j043j403j975j987j088p2J83p6L8O64
52913B28925J038O78pl58k60j23l86j120j825j739o74N44R39O18N72J249J964
52896B30035J944J310P00L83K31J86K16J06k25l82N7P69Q65o0j388k166k079j609
$$ plain form
52878 228893 227563 226345 225539 225558 226214 226698 226481 225955 225871 226310 226675 226665 226709 227260 228071 228529 228486 228427 228929 230150
52858 230150 231750 233107 233705 233587 233421 233884 234880 235458 234607 232130 228768 225543 222947 220772 218572 216177
52842 216177 213721 211383 209369 208034 207651 207922 208018 207358 206293 205801 206500 208010 209317 209749 209627 209840 210715
52825 210715 211510 211250 209951 208561 207738 207145 206159 204855 203963 204165 205706 208439 211873 215412 218921 222917
52809 222917 227828 233127 237530 239955 240078 238107 234547 230202 225952 222263 219018 215894 212803 209973
52795 209973 207780 206481 205971 205826 205701 205565 205454 205272 205048 205074 205392 205422 204663 203565 203087 203427 203807 203547
52777 203547 202676 201418 199886 198615 198568 200018 201985 203420 204476 205897 207537 208419 208221 207844 208329 209832
52761 209832 211886 214102 216231 217878 218614 218287 217085 215381 213588 212033 210843 210050 209795 210271 211406
$$ packed form
52878B28893j330j218q06J9O56M84k17n26q4M39L65j0M4N51Q11M58m3n9N02J221
52858B30150J600J357N98j18j66M63R96N78q51k477l362l225k596k175k200k395
52842B16177k456k338k014j335l83K71R6o60j065m92O99J510J307M32j22K13Q75
52825B10715P95k60j299j390q23n93r86j304q92K02J541K733L434L539L509L996
52809B22917M911N299M403K425J23j971l560m345m250l689l245l124l091k830
52795B09973k193j299n10j45j25j36j11j82k24K6L18L0p59j098m78L40L80k60
52777B03547q71j258j532j271m7J450J967J435J056J421J640Q82j98l77M85J503
52761B09832K054K216K129J647P36l27j202j704j793j555j190p93k55M76J135
$$ plain form
52746 211406 212798 214028 214917 215479 215830 216164 216594 216931 216871 216507 216418 217052 218133 218886 218816 218130 217529 217632 218484
52727 218484 219416 219459 218175 216112 214298 213261 212672 211961 211108 210618 210812 211418 211977 212425 212991 213594 213773 213413
52709 213413 213213 213974 215534 216799 216927 216122 215149 214479 214167 214215 214602 215075 215314 215348 215446 215610 215522 215142 214988
52690 214988 215557 216721 218015 219337 220963 222914 224720 225949 226667 227197 227658 227975 228149 228212 228031 227445 226658
52673 226658 226208 226443 227177 227959 228526 228857 228951 228755 228352 228101 228505 229839 231879 234013 235728 236984 238053
52656 238053 239047 239800 240183 240328 240440 240537 240495 240212 239618 238607 237057 234866 232018 228753 225712 223634 222779
52639 222779 222802 223340 224487 226512 229273 232203 234808 236991 238977 241103 243571 246231 248718 250923 253043
52624 253043 254964 255885 255007 252450 249086 245604 242234 239263 237174 236116 235699 235461 235098 234203 232410 230128
$$ packed form
52746B11406J392J230Q89N62L51L34M30L37o0l64q9O34J081P53p0o86o01J03Q52
52727B18484R32M3j284k063j814j037n89p11q53m90J94O06N59M48N66O03J79l60
52709B13413k00P61J560J265J28q05r73o70l12M8L87M73K39L4R8J64q8l80j54
52690B14988N69J164J294J322J626J951J806J229P18N30M61L17J74O3j81n86p87
52673B26658m50K35P34P82N67L31R4j96m03k51M04J334K040K134J715J256J069
52656B38053R94P53L83J45J12R7m2k83n94j011j550k191k848l265l041k078q55
52639B22779K3N38J147K025K761K930K605K183J986K126K468K660K487K205K120
52624B53043J921R21q78k557l364l482l370k971k089j058m17k38l63q95j793k282
$$ plain form
52608 230128 228579 228632 229894 231303 232250 232730 232747 232227 231397 230762 230682 231266 232523 234258 235903 236969 237652
52591 237652 238629 240232 242201 244228 246298 248379 250181 251453 252195 252404 251931 250889 249956 249859 250584 251368
52575 251368 251560 251308 251256 251677 252117 251989 251352 250818 250706 250615 250006 248911 247781 246798 245734 244460 243253 242497
52557 242497 242270 242306 242258 242039 241951 242345 243097 243659 243875 244365 245675 247357 248522 249144 249994 251258 252052 251654
52539 251654 250489 249389 248527 247706 247225 247596 248622 249450 249552 249036 248016 246333 244093 241946 240493 239781
52523 239781 239594 239901 240656 241390 241456 240744 239917 239784 240569 241831 243043 244103 245212 246472 247768 249055 250413
52506 250413 251696 252375 252022 250848 249491 248268 246925 245226 243525 242491 242269 242189 241507 240349 239590 239691
52490 239691 240011 239614 238531 237636 237359 237222 236825 236595 237042 237861 238405 238754 239621 241318 243459 245597 247621
$$ packed form
52608B30128j549N3J262J409R47M80J7n20q30o35q0N84J257J735J645J066O83
52591B37652R77J603J969K027K070K081J802J272P42K09m73j042r33r7P25P84
52575B51368J92k52n2M21M40j28o37n34j12r1o09j095j130r83j064j274j207p56
52557B42497k27L6m8k19q8L94P52N62K16M90J310J682J165O22Q50J264P94l98
52539B51654j165j100q62q21m81L71J026Q28J02n16j020j683k240k147j453p12
52523B39781j87L07P55P34O6p12q27j33P85J262J212J060J109J260J296J287J358
52506B50413J283O79l53j174j357j223j343j699j701j034k22q0o82j158p59J01
52490B39691L20l97j083q95k77j37l97k30M47Q19N44L49Q67J697K141K138K024
$$ plain form
52473 247621 249473 251033 252354 253562 254590 255405 256443 258182 260245 261654 262151 262613 263836 265541 266949
52458 266949 267754 267997 267441 265769 263242 260620 258492 256983 255956 255163 254320 253311 252225 250996 249377
52443 249377 247561 246393 246449 247195 247600 247345 246811 246099 244870 243207 241865 241357 241383 241440 241510 241791 242165 242364
52425 242364 242379 242331 242185 241929 241879 242359 243211 244006 244775 246143 248609 251997 255764 259673 263951 268916 274662
52408 274662 281099 288063 295334 302699 310067 317314 323844 328551 330563 329963 327463 323415 317641 310327
52394 310327 302542 295478 289539 284556 280478 277300 274582 271797 269244 267955 268501 270282 272149 273338
52380 273338 273712 273602 273693 274612 276223 277688 278583 279757 282603 287593 293842 300015 305292 309441 312408 314146
52364 314146 314788 314766 314613 314562 314404 313850 312932 311920 310991 310351 310604 312432 315655 319048 321441 322739 323587
$$ packed form
52473B47621J852J560J321J208J028Q15J038J739K063J409M97M62J223J705J408
52458B66949Q05K43n56j672k527k622k128j509j027p93q43j009j086j229j619
52443B49377j816j168N6P46M05k55n34p12j229j663j342n08K6N7P0K81L74J99
52425B42364J5m8j46k56n0M80Q52P95P69J368K466L388L767L909M278M965N746
52408B74662O437O964P271P365P368P247O530M707K012o00k500m048n774p314
52394C10327p785p064n939m983m078l178k718k785k553j289N46J781J867J189
52380B73338L74j10R1R19J611J465Q95J174K846M990O249O173N277M149K967J738
52364C14146O42k2j53n1j58n54r18j012r29o40K53J828L223L393K393J298Q48
$$ plain form
52347 323587 324438 325421 326797 328872 331500 334217 336878 339699 342697 345606 348456 351742 355899 361110 367768
52332 367768 376429 386905 397977 408674 419483 431605 445205 459151 472563 485893 500128 515482
52320 515482 531328 547088 562713 578389 594212 610174 626140 641831 657072 672085 687298
52309 687298 702836 718485 734167 750117 766423 782716 798578 813988 828994 843139 855660
52298 855660 866291 875412 883328 889777 894421 897451 899379 900391 900217 898561 895366 890730 884913 878476
52284 878476 872114 866211 860756 855798 851703 848688 846270 843574 840375 837650 836867 838766 842913 848393
52270 848393 854710 861922 870168 879394 889534 900643 912666 925231 937877 950479 963270 976467
52258 976467 989949 1003347 1016370 1029047 1041705 1054628 1067575 1079614 1089644 1097228 1102885 1107478
$$ packed form
52347C23587Q51R83J376K075K628K717K661K821K998K909K850L286M157N211O658
52332C67768Q661J0476J1072J0697J0809J2122J3600J3946J3412J3330J4235J5354
52320E15482J5846J5760J5625J5676J5823J5962J5966J5691J5241J5013J5213
52309F87298J5538J5649J5682J5950J6306J6293J5862J5410J5006J4145J2521
52298H55660J0631R121P916O449M644L030J928J012j74j656l195m636n817o437
52284H78476o362n903n455m958m095l015k418k696l199k725p83J899M147N480
52270H48393O317P212Q246R226J0140J1109J2023J2565J2646J2602J2791J3197
52258I76467J3482J3398J3023J2677J2658J2923J2947J2039J0030P584N657M593
$$ plain form
52246 1107478 1111388 1114333 1115842 1115653 1113674 1109932 1104774 1098939 1093045 1086992 1080196 1072539 1064793 1057866
52232 1057866 1051834 1045991 1039790 1033426 1027538 1022667 1019001 1016263 1013689 1010475 1006554 1002776 1000077 998640
52218 998640 998056 998113 999042 1001017 1003838 1007195 1011000 1015330 1020223 1025654 1031484 1037347 1042844 1048074 1053769
52203 1053769 1060575 1068259 1075933 1083009 1089597 1095933 1101905 1107478 1113223 1119843 1127173 1134177 1140043 1144878
52189 1144878 1149078 1152382 1153977 1153371 1150802 1146856 1142028 1136621 1130725 1124210 1116953 1109180 1101427 1094140
52175 1094140 1087400 1080933 1074232 1066802 1058679 1050710 1044071 1039408 1036617 1035283 1034950 1035020 1034964 1034801 1035017 1035882
52159 1035882 1037212 1038950 1041400 1044614 1047952 1050629 1052351 1053144 1053059 1052496 1052401 1053441 1055170 1056553 1057182 1057447
52143 1057447 1057704 1057882 1057869 1057664 1057091 1055940 1054499 1053457 1053159 1053410 1054130 1055677 1058325 1061981 1066747 1073320
$$ packed form
52246A107478L910K945J509j89j979l742n158n835n894o053o796p657p746o927
52232A057866o032n843o201o364n888m871l666k738k574l214l921l778k699j437
52218I98640n84N7R29J975K821L357L805M330M893N431N830N863N497N230N695
52203A053769O806P684P674P076O588O336N972N573N745O620P330P004N866M835
52189A144878M200L304J595o06k569l946m828n407n896o515p257p773p753p287
52175A094140o740o467o701p430q123p969o639m663k791j334l33P0n6j63K16Q65
52159A035882J330J738K450L214L338K677J722P93q5n63r5J040J729J383O29K65
52143A057447K57J78j3k05n73j151j441j042k98K51P20J547K648L656M766O573
$$ plain form
52127 1073320 1082360 1093676 1106447 1120225 1135471 1153095 1173476 1195840 1218631 1240711 1262236
52116 1262236 1284107 1306575 1328794 1349827 1369647 1388879 1407874 1426363 1443849 1460040 1474998
52105 1474998 1489004 1502176 1514206 1524771 1534266 1543633 1553139 1561676 1567702 1570659 1571073 1569486 1565815
52092 1565815 1559714 1551132 1540366 1527884 1514191 1499678 1484588 1469311 1454666 1441602 1430574 1421446
52080 1421446 1414025 1408382 1404603 1402474 1401644 1401969 1403577 1406695 1411524 1418093 1426119 1435088 1444684 1455035
52066 1455035 1466349 1478390 1490584 1502722 1515202 1528331 1541667 1554423 1566411 1578074 1589549
52055 1589549 1600258 1609612 1617510 1623675 1627062 1626719 1623077 1617594 1611103 1603248 1593667 1582907 1571729
52042 1571729 1560098 1547435 1533593 1519084 1504524 1490244 1476307 1462638 1449252 1436493 1424772
$$ packed form
52127A073320R040J1316J2771J3778J5246J7624K0381K2364K2791K2080K1525
52116A262236K1871K2468K2219K1033J9820J9232J8995J8489J7486J6191J4958
52105A474998J4006J3172J2030J0565R495R367R506Q537O026K957M14j587l671
52092A565815o101q582j0766j2482j3693j4513j5090j5277j4645j3064j1028r128
52080A421446p421n643l779k129q30L25J608L118M829O569Q026Q969R596J0351
52066A455035J1314J2041J2194J2138J2480J3129J3336J2756J1988J1663J1475
52055A589549J0709R354P898O165L387l43l642n483o491p855r581j0760j1178
52042A571729j1631j2663j3842j4509j4560j4280j3937j3669j3386j2759j1721
$$ plain form
52031 1424772 1413915 1403179 1392162 1381309 1371161 1361499 1351753 1341910 1332442 1323613 1315474 1308329 1302411
52018 1302411 1297070 1291028 1283704 1275821 1268546 1262398 1257085 1251843 1245684 1237738 1227754 1216044 1202725
52005 1202725 1187278 1169062 1148097 1125093 1100877 1075942 1050437 1024507 998648 973729 950465
51994 950465 928877 908510 889069 870507 852560 834755 817091 800256 784815 770450 756302
$$ packed form
52031A424772j0857j0736j1017j0853j0148r662r746r843r468q829q139p145n918
52018A302411n341o042p324p883p275o148n313n242o159p946r984j1710j3319
52005A202725j5447j8216k0965k3004k4216k4935k5505k5930k5859k4919k3264
51994I50465k1588k0367j9441j8562j7947j7805j7664j6835j5441j4365j4148
$$ [...]
##END NTUPLES=NMR SPECTRUM
##END=
