##TITLE=AC1473_13FB002635_8026882_x02myc3yUk
##JCAMPDX= 6.0         $$ Bruker NMR JCAMP-DX V2.0
##DATA TYPE= NMR SPECTRUM
##DATA CLASS= NTUPLES
##ORIGIN= BRUKER
##OWNER= Administrator
$$ 1.72 TOPSPIN		Version 2.1
$$ 2013-07-18 18:39:57.271 -0700  Administrator@X
$$ Compression mode = diff/dup
##.OBSERVE FREQUENCY= 400.02188249412
##.OBSERVE NUCLEUS= ^1H
##.ACQUISITION MODE= SIMULTANEOUS (DQD)
##.ACQUISITION SCHEME= undefined
##.AVERAGES= 64
##.DIGITISER RES= 22
##SPECTROMETER/DATA SYSTEM= spect
##.PULSE SEQUENCE= noesygpps1d.comp
##.SOLVENT NAME= COFFEE_meoh
##.SHIFT REFERENCE= INTERNAL, COFFEE_meoh, 1, 14.96091
##AUDIT TRAIL= $$ (NUMBER, WHEN, WHO, WHERE, PROCESS, VERSION, WHAT)
$$ ##TITLE= Audit trail, TOPSPIN		Version 2.1
$$ ##JCAMPDX= 5.01
$$ ##ORIGIN= Bruker BioSpin GmbH
$$ ##OWNER= Administrator
$$ $$ E:\/data/COFFEE/nmr/AC1473_13FB002635_8026882_x02myc3yUk/22/pdata/1/auditp.txt
$$ ##AUDIT TRAIL=  $$ (NUMBER, WHEN, WHO, WHERE, PROCESS, VERSION, WHAT)
(   1,<2013-07-18 18:39:52.412 -0700>,<Administrator>,<X>,<go>,<TOPSPIN 2.1>,
      <created by zg
	started at 2013-07-18 18:28:23.519 -0700,
	POWCHK enabled, PULCHK disabled,
       configuration hash MD5:
       C8 4E 4E 5D D3 5C D8 9E 9F 52 82 E0 59 8A DE 15
       data hash MD5: 64K
       41 6D 5A E8 EB 92 05 77 6F 15 71 9A D4 DC 17 CB>)
(   2,<2013-07-18 18:39:55.318 -0700>,<Administrator>,<X>,<proc1d>,<TOPSPIN 2.1>,
      <Start of raw data processing
       efp LB = 0.3 FT_mod = 6 PKNL = 1 PHC0 = 0 PHC1 = 0 SI = 128K 
       data hash MD5: 128K
       72 17 86 F8 F7 5F 7C E4 05 22 A2 D1 FD 13 DD D5>)
(   3,<2013-07-18 18:39:56.256 -0700>,<Administrator>,<X>,<proc1d>,<TOPSPIN 2.1>,
      <pk PHC0 = -82.83691 PHC1 = 0 
       data hash MD5: 128K
       C1 BB DE 86 39 8E 07 B7 AA 30 53 E7 AD 8F F5 43>)
(   4,<2013-07-18 18:39:56.662 -0700>,<Administrator>,<X>,<proc1d>,<TOPSPIN 2.1>,
      <abs ABSG = 1 
       data hash MD5: 128K
       AF BD EA 50 E8 FF 58 88 ED 88 9D 1B 48 97 D7 42>)
(   5,<2013-07-18 18:39:56.818 -0700>,<Administrator>,<X>,<proc1d>,<TOPSPIN 2.1>,
      <abs ABSG = 2 
       data hash MD5: 128K
       71 F0 6A BB 4F A4 F0 00 CE 4D A4 1B 18 6C 73 73>)
(   6,<2013-07-18 18:39:56.896 -0700>,<Administrator>,<X>,<proc1d>,<TOPSPIN 2.1>,
      <abs ABSG = 3 
       data hash MD5: 128K
       9B EF 4B 7A 30 96 4F D6 ED DA 7B 70 BC 29 5C 5C>)
(   7,<2013-07-18 18:39:56.990 -0700>,<Administrator>,<X>,<proc1d>,<TOPSPIN 2.1>,
      <abs ABSG = 4 
       data hash MD5: 128K
       6E 70 B2 31 55 3B 54 08 14 14 DD A8 AF 41 51 09>)
(   8,<2013-07-18 18:39:57.084 -0700>,<Administrator>,<X>,<proc1d>,<TOPSPIN 2.1>,
      <abs ABSG = 5 
       data hash MD5: 128K
       1F 58 47 06 E7 22 31 4C FE 81 60 2E 07 1E 7D E3>)
$$ ##END=
$$ 
$$ $$ hash MD5
$$ $$ 71 1D E4 4A AD 04 00 B1 AF 40 49 6B E8 0E 82 17
##$RELAX= 
##$RELAX= 
##$RELAX= 
##$RELAX= 
##$RELAX= 
##$RELAX= 
##$RELAX= 
##$RELAX= 
$$ Bruker specific parameters
$$ --------------------------
##$DU= <E:\>
##$EXPNO= 22
$$ [...]
##$TP07= 0
##$TPNAME0= <>
##$TPNAME1= <>
##$TPNAME2= <>
##$TPNAME3= <>
##$TPNAME4= <>
##$TPNAME5= <>
##$TPNAME6= <>
##$TPNAME7= <>
##$TPOAL= (0..7)
0.5 0.5 0.5 0.5 0.5 0.5 0.5 0.5
##$TPOFFS= (0..7)
0 0 0 0 0 0 0 0
##$TUNHIN= 0
##$TUNHOUT= 0
##$TUNXOUT= 0
##$USERA1= <user>
##$USERA2= <user>
##$USERA3= <user>
##$USERA4= <user>
##$USERA5= <user>
##$V9= 5
##$VALIST= <valist>
##$VCLIST= <CCCCCCCCCCCCCCC>
##$VD= 0
##$VDLIST= <DDDDDDDDDDDDDDD>
##$VPLIST= <PPPPPPPPPPPPPPP>
##$VTLIST= <TTTTTTTTTTTTTTT>
##$WBST= 1024
##$WBSW= 4
##$XGAIN= (0..3)
0 0 0 0
##$XL= 0
##$YL= 0
##$YMAX_a= 6578434
##$YMIN_a= -13775887
##$ZGOPTNS= <>
##$ZL1= 120
##$ZL2= 120
##$ZL3= 120
##$ZL4= 120
##$ABSF1= 14.96091
##$ABSF2= -5.597272
##$ABSG= 5
##$ABSL= 3
##$ALPHA= 0
##$AQORDER= 0
##$ASSFAC= 0
##$ASSFACI= 0
##$ASSFACX= 0
##$ASSWID= 0
##$AUNMP= <proc_prof1d_extract.lims>
##$AXLEFT= 0
##$AXNAME= <>
##$AXNUC= <1H>
##$AXRIGHT= 0
##$AXTYPE= 0
##$AXUNIT= <>
##$AZFE= 0.1
##$AZFW= 0.1
##$BCFW= 0
##$BC_mod= 0
##$BYTORDP= 0
##$COROFFS= 0
##$CY= 15
##$DATMOD= 1
##$DC= 0
##$DFILT= <>
##$DTYPP= 0
##$F1P= 0
##$F2P= 0
##$FCOR= 0.5
##$FTSIZE= 131072
##$FT_mod= 6
##$GAMMA= 0
##$GB= 0
##$INTBC= 1
##$INTSCL= 1
##$ISEN= 128
##$LB= 0.3
##$LEV0= 0
##$LPBIN= 0
##$MAXI= 10000
##$MC2= 0
##$MEAN= 0
##$ME_mod= 0
##$MI= 0
##$NCOEF= 0
##$NC_proc= -2
##$NLEV= 6
##$NOISF1= 0
##$NOISF2= 0
##$NSP= 0
##$NTH_PI= 0
##$NZP= 0
##$OFFSET= 14.96091
##$PC= 1
##$PHC0= -82.83691
##$PHC1= 0
##$PH_mod= 1
##$PKNL= yes
##$PPARMOD= 0
##$PPDIAG= 0
##$PPIPTYP= 0
##$PPMPNUM= 2147483647
##$PPRESOL= 1
##$PSCAL= 4
##$PSIGN= 0
##$PYNMP= <proc.py>
##$REVERSE= no
##$SF= 400.020009671536
##$SI= 131072
##$SIGF1= 0
##$SIGF2= 0
##$SINO= 400
##$SIOLD= 131072
##$SPECTYP= <>
##$SREGLST= <1H.CDCl3>
##$SSB= 0
##$STSI= 131072
##$STSR= 0
##$SW_p= 8223.68421052631
##$SYMM= 0
##$S_DEV= 0
##$TDeff= 65536
##$TDoff= 0
##$TI= <>
##$TILT= no
##$TM1= 0
##$TM2= 0
##$TOPLEV= 0
##$USERP1= <user>
##$USERP2= <user>
##$USERP3= <user>
##$USERP4= <user>
##$USERP5= <user>
##$WDW= 1
##$XDIM= 131072
##$YMAX_p= 351265523
##$YMIN_p= -10935
##$CURPLOT= <Network HP LaserJet P1505>
##$CURPRIN= <$Network HP LaserJet P1505>
##$DFORMAT= <normdp>
##$LAYOUT= <+/1D_H.xwp>
##$LFORMAT= <normlp>
##$PFORMAT= <normpl>
##$SURQMSG= 1
$$ End of Bruker specific parameters
$$ ---------------------------------
##NTUPLES= NMR SPECTRUM
##VAR_NAME=  FREQUENCY,     SPECTRUM/REAL,   SPECTRUM/IMAG
##SYMBOL=    X,             R,               I
##VAR_TYPE=  INDEPENDENT,   DEPENDENT,       DEPENDENT
##VAR_FORM=  AFFN,          ASDF,            ASDF
##VAR_DIM=   131072,        131072,          131072
##UNITS=     HZ,            ARBITRARY UNITS, ARBITRARY UNITS
##FACTOR=    0.0627417313425164, 1,          1
##FIRST=     8223.62146879497, -1565,        -73466
##LAST=      0,             619,             -74002
##MIN=       0,             -10935,          0
##MAX=       8223.62146879497, 351265523,    0
$$ Real data points
##PAGE= N=1
##DATA TABLE= (X++(R..R)), XYDATA
$$ [...]
65047 157125 154725 152410 150903 150286 150247 150627 151475 152615 153439 153318 152231 150768 149401 147955 146049 143935
65031 143935 142467 142120 142365 142282 141635 141021 141019 141425 141415 140380 138549 136909 136531 137871 140545 143663 146392
65014 146392 148429 150112 152019 154313 156512 158076 159189 160681 163086 165994 168534 170325 171729 173233
65000 173233 174858 176239 177083 177412 177428 177370 177562 178369 179841 181375 182070 181616 180723 180471 181366 183151 185319
64983 185319 187447 189140 190112 190426 190386 190099 189415 188273 186761 184783 182149 179176 176727 175262 174215 172762
64967 172762 170937 169488 168782 168388 167734 166718 165550 164409 163399 162589 161965 161535 161498 162031 162837 163209 162666
64950 162666 161357 159804 158559 158135 158795 160108 161032 160848 159883 159023 158694 158700 158880 159351 160069 160655 160933 161239
64932 161239 161858 162419 162262 161304 160157 159378 158937 158463 157715 156672 155464 154398 153871 154026 154618 155335 156043
64915 156043 156610 156755 156458 156272 156790 157859 158833 159577 160696 162603 164953 167381 170310 174444 179738 185483
64899 185483 191284 197317 203568 209497 214774 219855 225427 231496 237435 242762 247477 251689 255332 258367
64885 258367 260945 263182 264853 265466 264627 262290 258747 254459 249906 245454 241307 237539 234169 231211 228629
64870 228629 226275 223951 221650 219707 218529 218017 217358 215594 212502 208789 205418 202808 200700 198556 195933
64855 195933 192671 189021 185622 183058 181300 179699 177648 175133 172572 170315 168488 167156 166304 165605 164532
64840 164532 162908 161262 160430 160772 161881 163090 164117 165103 166107 166813 166885 166448 165994 165855 166062 166697 168017
64823 168017 170073 172486 174879 177322 180134 183473 187416 192118 197356 202110 205267 206870 208179 210329
64809 210329 213368 216763 220248 223778 227047 229575 231121 231630 230951 229008 226164 223090 220248 217742 215557
64794 215557 213683 212056 210639 209502 208680 208038 207481 207146 207182 207480 207867 208385 209092 209787 210306 210936 212044
64777 212044 213387 214242 214326 214181 214581 215916 218191 221228 224786 228811 233659 239613 246152 252172 257157
64762 257157 261627 266220 270845 275153 279315 283715 288141 291957 295017 297865 300943 304063 306746 308699
64748 308699 309799 309870 308677 306023 301835 296328 290076 283656 277229 270697 264262 258486 253706 249749 246462
64733 246462 244132 243009 242633 242104 241046 239890 239143 238810 238763 239364 241228 244438 248341 252152 255533 258522
64717 258522 261287 264081 267162 270443 273428 275745 277586 279234 280257 279603 276650 271839 266153 260225
64703 260225 254121 247726 241098 234504 228310 222798 218069 214160 211200 209218 207807 206319 204484 202594
64689 202594 200966 199609 198593 198318 199025 200382 201983 203987 206732 209959 213059 216079 219747 224283 228838
64674 228838 232500 235407 238425 241995 245728 248921 251039 251759 251014 249172 246953 245023 243668 242691 241499
64659 241499 239392 236103 232165 228599 226147 224840 224213 223843 223677 223987 225050 226871 229259 232179 235838
64644 235838 240198 244568 248043 250506 252985 256793 262294 268612 274510 279489 284045 288980 294557 300308
64630 300308 305429 309193 311120 311138 309718 307528 304674 300490 294407 286886 279142 272021 265528 259437 253840
64615 253840 248894 244418 240063 235712 231541 227879 225114 223424 222360 221014 218970 216897 215792 215782 216021
64600 216021 215649 214431 212556 210370 208496 207810 208889 211515 214778 217634 219562 221025 223303 227456 233350
64585 233350 239905 246322 252698 259411 266440 273541 280629 287604 294173 300221 306080 311955 317347 321460
64571 321460 324003 325145 324911 323217 320401 317081 313423 309106 304192 299435 295440 291984 288502 284871
64557 284871 281342 277971 274626 271342 268303 265483 262667 259801 257071 254655 252657 251274 250676 250669 250739 250611
64541 250611 250565 251022 251858 252259 251277 248544 244584 240500 237294 235233 233740 231924 229363 226465 224066 222634
64525 222634 221931 221419 220847 220322 219890 219364 218613 217877 217610 218068 219087 220209 220976 221174 220924 220622 220781 221906
64507 221906 224342 228049 232474 236798 240388 243107 245313 247669 250787 254809 259250 263396 266797 269284
64493 269284 270766 271374 271703 272357 273151 273222 272178 270756 270017 270218 270847 271459 272063 272860 274036 275677 277468
64476 277468 278564 278246 276703 274809 273148 271652 270116 268557 266940 265104 263238 262058 262198 263644 265937
64461 265937 268565 270978 272598 273316 273756 274593 275687 276242 275793 274714 273747 273368 273644 274454 275657 277191
64445 277191 279111 281489 284340 287778 292176 297964 305199 313468 322286 331494 341316 352193 364525 378398
64431 378398 393579 410047 428573 450471 476603 506794 540398 577205 617627 662231 711477
64420 711477 765823 825640 890966 961532 1036983 1116580 1198507 1279828 1357592 1429914 1495824
64409 1495824 1554373 1604287 1644371 1673684 1691231 1696016 1687768 1667317 1635930 1594441 1543315 1483302
64397 1483302 1415552 1341118 1260887 1176262 1089621 1003778 921040 842844 770127 703725 644369
64386 644369 592425 547669 509277 476161 447454 422717 401671 383804 368399 354931 343320
64375 343320 333769 326370 320781 316128 311292 305493 298766 291789 285165 278913 272692 266403 260387 255027
64361 255027 250369 246234 242607 239711 237641 236086 234584 233052 231925 231674 232241 233072 233723 234350 235509
64346 235509 237521 240064 242361 243674 243644 242358 240292 238148 236517 235489 234584 233208 231236 229147 227547
64331 227547 226601 225981 225378 224988 225362 226787 228885 230947 232581 233924 235237 236542 237729 238886 240245
64316 240245 241840 243359 244385 244695 244306 243355 241966 240108 237519 233914 229400 224560 219992 215842 212004
64301 212004 208632 206120 204449 202932 200898 198473 196358 194928 193949 193235 193125 193993 195541 196971 197865
64286 197865 198623 200055 202706 206524 210897 214981 218280 221033 223900 227193 230625 233841 236856 239777
64272 239777 242396 244377 245724 246727 247544 248146 248575 248945 249177 249072 248743 248597 248752 248759 248126 246893 245416
64255 245416 243806 241869 239499 236833 234037 231218 228512 225975 223418 220621 217772 215356 213457 211537
64241 211537 209186 206811 205270 204940 205531 206665 208114 209420 209868 209259 208405 208394 209414 210649 211277 211273 211243
64224 211243 211732 212774 213838 214221 213726 213079 213382 214998 217139 218645 218957 218249 217033 215950 215661 216409
64208 216409 217658 218533 218683 218472 218356 218400 218475 218588 218817 219160 219686 220672 222384 224805 227748 231121 234892
64191 234892 238917 243049 247500 252847 259501 267137 274713 281107 285791 288926 290851 291570 290769 288252 284160
64176 284160 278787 272395 265290 257920 250696 243824 237401 231607 226667 222639 219367 216555 213823 210835
64162 210835 207633 204742 202712 201548 200849 200509 200940 202417 204518 206529 208232 209996 212153 214588 216968
64147 216968 219072 220822 222262 223656 225378 227525 229731 231477 232472 232676 232178 231210 230087 228914 227504
64132 227504 225826 224345 223560 223319 223036 222587 222554 223449 225163 227372 230112 233534 237395 241189 244679 247949
64116 247949 251114 254372 258224 263127 268807 274299 278854 282506 285635 288295 290291 291753 293230 295196
64102 295196 297622 300123 302395 304436 306421 308474 310595 312725 314739 316352 317140 316788 315273 312789 309649
64087 309649 306370 303626 301758 300258 298038 294395 289642 284753 280464 276799 273349 269903 266728 264255
64073 264255 262617 261652 261341 261889 263229 264772 265944 266748 267483 268203 268969 270397 273211 277241 281552 285710
64057 285710 290171 295112 299732 303327 306486 310351 315047 319700 323835 327898 332297 336702 340535 343602
64043 343602 345888 347243 347610 347325 346854 346423 346029 345538 344621 342952 340784 338978 338075 337470 335930 332966
64027 332966 329432 326784 325930 326742 328324 329626 329992 329419 328411 327562 327108 326695 325561 323113 319493 315534
64011 315534 312062 309311 307023 304969 303174 301722 300579 299653 298868 298110 297224 296221 295453 295483 296651 298792
63995 298792 301453 304360 307514 310825 313960 316837 320014 324121 328933 333525 337490 341475 346163 351234
63981 351234 355923 360326 365445 371904 379285 386866 394408 401972 409466 416887 424711 433559 443591 454563
63967 454563 466309 478827 492015 505811 520569 536883 554995 574808 596626 621396 649897
63956 649897 681995 717160 755617 798574 847288 902228 963309 1030756 1105571 1189218 1282991
63945 1282991 1387648 1503438 1630334 1768095 1916137 2073389 2238342 2409259 2584304
63936 2584304 2761430 2938131 3111378 3277874 3434354 3577490 3703589 3808862 3890466 3947200
63926 3947200 3978789 3984595 3963573 3915595 3842106 3745040 3625719 3485646 3328117 3158091 2980263
63915 2980263 2797948 2613982 2431742 2254434 2083867 1920854 1766782 1623941 1494030
63906 1494030 1376974 1271639 1177342 1094098 1021619 958733 904066 856910 817079 784012 756331
63895 756331 732377 711034 691994 675326 660928 648373 637192 627165 618292 610529 603778 598275
63883 598275 594781 594026 595948 599748 604806 611271 619637 630123 642741 657702 675310 695638 718687
63870 718687 744714 773853 805479 838570 872869 909172 948219 989736 1032893 1077185 1122325
63859 1122325 1167578 1211853 1254452 1295239 1333996 1369966 1402174 1429931 1452898 1470818 1483301
63848 1483301 1489848 1490043 1483761 1471181 1452576 1428237 1398650 1364525 1326465 1284784 1239835 1192382
63836 1192382 1143391 1093628 1043708 994341 946200 899600 854643 811573 770663 731828 694815
63825 694815 659846 627663 598873 573585 551729 533165 517259 502810 488877 475490 463220
63814 463220 452217 441941 431689 421078 410128 399205 388813 379115 369635 359663 349118 338850
63802 338850 330032 323228 317975 313119 307629 301306 294814 288971 283999 279470 274953 270606 267102 264959
63788 264959 263895 262862 260835 257671 254149 251187 249172 248020 247552 247555 247646 247425 246794 245895 244774 243353
63772 243353 241840 240863 240937 241817 242628 242671 241962 240927 239735 238165 236137 234085 232644 232074 232202 232812 233787
63755 233787 234876 235632 235765 235396 234846 234346 234032 234061 234501 235231 236077 236946 237774 238551 239559 241322 243997 246952
63737 246952 249314 250902 252291 254005 256011 258072 260264 262940 266393 270718 275761 281043 285879 289854
63723 289854 293183 296521 300420 304946 309629 313704 316586 318306 319419 320358 320966 320722 319321 316908 313861
63708 313861 310534 307147 303766 300397 297212 294640 293084 292581 292844 293569 294540 295502 296266 297044 298474 301099
63692 301099 304802 308822 312278 314665 316004 316710 317349 318390 319999 321948 323719 324857 325344 325610 326053
63677 326053 326669 327309 328163 329597 331517 333279 334488 335588 337355 339999 343024 345789 347882 349109 349542
63662 349542 349534 349289 348385 346099 342230 337257 331681 325682 319574 314036 309567 306090 303419 301732 301177 301308
63646 301308 301416 301264 301111 301218 301797 303214 305620 308457 310964 313190 315899 319361 322925 326138 329689
63631 329689 334699 341370 348843 356215 363337 370678 378776 387816 397556 407697 418417 430362 443961
63618 443961 458956 474799 491314 508704 527087 546354 566359 586986 608092 629620 651695
63607 651695 674328 697051 719003 739265 756902 770874 780383 785417 786719 785204 781569 776405 770311
63594 770311 763757 756982 750072 742894 734930 725388 713696 699862 684304 667441 649521 630836 612056
63581 612056 594203 578042 563518 550086 537726 527232 519244 513396 508928 505813 504591 505255 507023
63568 507023 509307 512197 515838 520044 524899 531041 538787 547487 556360 565622 576140 588264 601701
63555 601701 616390 632725 650808 670166 690531 712417 736600 763362 792458 823405 855307
63544 855307 886533 914965 938642 956074 966228 968749 964363 954808 942103 927921 913607 900413
63532 900413 889203 879853 871211 861875 850917 837867 822340 804073 783236 760369 735995 710564
63520 710564 684721 659210 634400 610268 586968 564996 544539 525163 506627 489608 474996
63509 474996 462590 451172 439973 429463 420477 413053 406530 400472 395059 390603 387003 383756 380434
63496 380434 377114 374297 372365 371176 370286 369460 368775 368358 368354 369038 370555 372517 374374 376298 379244 383803
63480 383803 389359 394684 399031 402357 404896 407046 409374 412123 414782 416601 417477 417774 417354 415416 411465
63465 411465 406030 400186 394775 390210 386571 383565 380706 377821 375153 372843 370700 368821 368021 369189
63451 369189 372391 377046 382764 389517 397140 405307 414097 424034 435335 447598 460572 474872 491521
63438 491521 510947 532895 557190 584108 613735 645143 676353 705044 729366 748428 762360
63427 762360 771981 778273 782091 784357 786389 789808 795983 805597 818688 834942 853846 874698 896626
63414 896626 918662 939755 958742 974436 985818 992267 993766 990987 985045 976966 967390 956737 945423
63401 945423 933619 920960 906835 890985 873463 853998 831898 806914 779908 752327 725163
63390 725163 698721 673183 648972 626511 605950 587267 570478 555683 543004 532454 523802 516656
63378 516656 510879 506820 504971 505457 508072 512661 519145 527274 536780 547826 560855 575820 591886
63365 591886 608207 624802 642427 661787 683085 706234 731187 757985 786541 816318 846141
63354 846141 874537 900412 923385 943346 959850 972077 979339 981530 979240 973613 965930 957041 947164
63341 947164 936335 924893 913214 900997 887150 870590 851085 829260 806029 782157 758245
63330 758245 734776 712062 690265 669679 650949 634864 621843 611722 604124 598865 595774 594115
63318 594115 592424 589015 582571 572347 558209 540781 521471 502009 483740 467215 452298 438621
63306 438621 426092 415028 405719 397909 390951 384546 379029 374638 370854 366886 362685 358983 356320 354463
63292 354463 352922 351559 350333 348829 346610 343988 341884 340757 340048 339035 337926 337544 337957 338011 336619
63277 336619 334121 331913 330867 330673 330734 331070 332025 333462 334740 335395 335502 335454 335679 336519 338115 340293 342699
63260 342699 345097 347469 349929 352602 355518 358555 361633 365023 369227 374330 379737 384820 389637 394724
63246 394724 400398 406678 413679 421508 429843 438240 447039 457359 469887 484109 499086 514590 531001
63233 531001 548417 566458 584890 603912 623701 644059 664626 685196 705648 725795 745483
63222 745483 764738 783728 802687 821901 841577 861516 881076 899619 916942 933014 947369
63211 947369 959115 967628 972927 975094 973607 967664 957085 942490 924591 903791 880658 856337
63199 856337 832097 808626 786092 764741 745129 727896 713589 702570 694821 689942 687625 688036
63187 688036 691447 697723 706562 718076 732519 749444 767709 786512 805920 826191 847031 867808
63175 867808 888067 907551 926072 943791 961279 978829 995900 1011563 1025283 1036825 1045641 1050950
63163 1050950 1052391 1050079 1043881 1033137 1017352 996794 972202 944157 913125 879960 845934 812159
63151 812159 779167 747120 716328 687409 660953 637146 615790 596660 579824 565519 553654
63140 553654 543460 533801 524048 514664 506717 500752 496301 492585 489430 487184 485957 485285 484588 483725 483093
63125 483093 483388 485146 488186 491538 494255 496278 498201 500310 502334 504145 506045 508204 510443 512867
63111 512867 516068 520145 524034 526541 527784 529002 531030 533571 535919 537812 539396 540816 542032 542871
63097 542871 543247 543464 544133 545466 546820 547408 547367 547625 548720 550294 551868 553575 555860 558829 562179 565474
63081 565474 568292 570415 572191 574447 577728 581759 585933 590212 595232 601564 609103 617235 625449 633763
63067 633763 642618 652494 663696 676477 691149 707853 726241 745642 765653 786505 808920 833701
63055 833701 861405 892147 925674 961738 1000382 1041678 1085289 1130537 1176900 1224188 1272243
63044 1272243 1320814 1369744 1418932 1468017 1516420 1563866 1610586 1656875 1702740 1748047 1792603
63033 1792603 1835811 1876628 1914149 1947927 1977371 2001156 2017734 2026229 2026388 2017809 1999853 1972479
63021 1972479 1936737 1894219 1846318 1794131 1738749 1681395 1623418 1566369 1511906 1461428 1415808
63010 1415808 1375594 1341374 1313784 1293222 1279707 1272998 1272742 1278539 1290019 1306846 1328494 1354061
62998 1354061 1382536 1413379 1446588 1481961 1518508 1554983 1591016 1627232 1664073 1700915 1736592
62987 1736592 1770402 1802066 1830903 1855686 1875426 1889835 1898830 1901823 1897662 1885079 1863211 1832046
62975 1832046 1792541 1746048 1693553 1635719 1573639 1509068 1443726 1378747 1315013 1253546 1195233
62964 1195233 1140485 1089542 1042719 999923 960303 922970 887954 855886 826844 800060 774806
62953 774806 751056 729168 709329 691386 674808 658667 642151 625354 609287 594831 581860
62942 581860 569525 557248 545279 534403 525196 517443 510276 503054 496070 490152 485634 482039 478765
62929 478765 475601 472495 469303 466038 462977 460212 457405 454254 450924 447727 444741 442069 440125 439194
62915 439194 438898 438585 438036 437360 436428 435014 433424 432295 431733 431245 430627 430305 430536 430900 430965 430956 431305 431940 432542
62896 432542 433173 434075 435028 435563 435751 436210 437243 438489 439548 440482 441456 442329 442930 443442 444186 445142 445906 445972
62878 445972 444919 442630 439678 437295 436513 437232 438307 438525 437320 434760 431311 427717 424720 422611 421106
62863 421106 419762 418385 417036 415888 415168 415020 415214 415173 414559 413723 413377 413846 414847 415950 416995 417987 418773
62846 418773 419060 418726 418039 417474 417301 417331 417166 416697 416292 416374 416897 417411 417621 417699 418022 418782 420023 421864 424435
62827 424435 427525 430486 432648 433884 434738 435966 437961 440583 443524 446716 450302 454279 458382 462389
62813 462389 466385 470590 475062 479799 485011 490972 497530 504109 510440 517060 524730 533412 542224 550548
62799 550548 558938 568711 580734 594710 609569 624434 639306 655019 672576 692482 714704 739201
62787 739201 766334 796675 830643 868483 910488 956918 1007646 1062097 1119628 1179893 1242831
62776 1242831 1308377 1376273 1446037 1516970 1588101 1657973 1724480 1785105 1837631 1880784 1914144
62765 1914144 1937440 1950060 1951189 1940222 1917041 1882094 1836407 1781503 1719275 1651879 1581532
62754 1581532 1510071 1438576 1367583 1297687 1229785 1164702 1102889 1044649 990407 940486 894760
62743 894760 852847 814554 779902 748810 721074 696690 675783 658082 642759 629068 616944
62732 616944 606665 598022 590259 582940 576539 571915 569374 568504 568779 569895 571565 573560 576238 580606
62718 580606 587296 595617 604234 612868 622844 635710 651699 669937 689841 711724 736021 762515
62706 762515 790722 820909 854285 892061 934523 981171 1031560 1085646 1143341 1204159 1267506
62695 1267506 1332967 1399960 1467430 1534356 1600377 1665241 1727614 1784946 1834684 1875150 1905206
62684 1905206 1923787 1930170 1924193 1905786 1874828 1832047 1779573 1719839 1654132 1582966 1507697 1430902
62672 1430902 1355011 1281243 1210121 1142296 1078403 1018590 962760 911161 864281 822232 784469
62661 784469 750196 718923 690644 665528 643451 623901 606358 590574 576279 562884 549907
62650 549907 537548 526349 516308 506893 498027 490386 484403 479514 474859 470284 466149 462495 459101
62637 459101 456221 454524 454078 453890 452807 450652 448273 446562 445692 445255 444924 444727 444668 444357 443370 441981 441127
62620 441127 441454 442666 443998 445164 446537 448595 451445 454834 458402 461995 465889 470585 476247 482611
62606 482611 489632 497923 508122 520027 532863 546360 561102 577812 596745 617844 641044 666233
62594 666233 693256 722137 753001 785617 819327 853523 887814 921508 953295 981813 1006295
62583 1006295 1026392 1041605 1051205 1054553 1051202 1040937 1024122 1001932 975846 946941 915856 883251
62571 883251 849808 815915 781949 748906 718110 689981 663621 638106 613820 591955 572945
62560 572945 556080 540671 526886 515098 504922 495439 486194 477520 469936 463612 458499 454590 451798
62547 451798 449754 448016 446510 445658 445974 447467 449426 450906 451553 451951 452987 454925 457333 459875 462778
62532 462778 466384 470624 475336 480804 487510 495443 504201 513834 525062 538413 553535 569730 586961
62519 586961 605968 627503 651762 678625 708152 740593 775902 813329 851733 890448 929716
62508 929716 969946 1010563 1049914 1086329 1118849 1146817 1169380 1185882 1196303 1200789 1199058 1190989
62496 1190989 1177601 1160665 1141340 1119953 1097210 1074726 1053872 1034836 1017451 1002387 990767
62485 990767 982869 978076 975981 976845 980729 986764 993505 999642 1004231 1006604 1006352 1003222 996928 987195 973988
62470 973988 957400 937248 913141 885140 854180 821650 788695 755952 723672 691932 660943
62459 660943 631359 604126 579874 558560 539736 522947 507838 494280 482601 473378 466650 461548
62447 461548 457045 452932 449744 447894 447228 447314 447741 448155 448406 448742 449488 450494 451215 451413 451416 451503 451407 450644 449082
62428 449082 446894 444165 440934 437476 434147 430912 427297 422991 418327 414113 411081 409492 409036 408942 408336
62413 408336 406742 404342 401691 399253 397248 395777 394829 394146 393409 392740 392804 394163 396636 399530 402362 405099
62397 405099 407812 410536 413520 417166 421551 426279 430936 435377 439476 443110 446677 451138 457035 463767
62383 463767 470349 476637 483288 490774 499076 508174 518054 528205 537906 547237 557061 567731 578519
62370 578519 588801 599137 610622 623690 638263 654612 673211 693889 716004 739595 765656
62359 765656 795055 827756 863339 901749 943058 986734 1031594 1076467 1120561 1163080 1202647
62348 1202647 1237335 1265493 1286577 1301006 1309162 1310882 1306159 1296031 1282105 1265178 1244807 1220426
62336 1220426 1192436 1162000 1130105 1097209 1063523 1029274 994853 960989 928676 898585 870616
62325 870616 844286 819456 796330 774753 753968 733283 712677 692532 672987 653896 635325
62314 635325 617783 601801 587413 574121 561382 549170 538118 529028 522072 516553 511614 507152
62302 507152 503787 501913 501088 500529 499943 499618 499857 500686 502028 503798 505792 507774 509723 511772 513845 515702
62286 515702 517438 519591 522498 525789 528759 531100 533049 534968 537035 539270 541645 544221 547246 550972
62272 550972 555330 560097 565564 572684 582187 593913 607478 623247 641927 663370 686620 711315
62260 711315 738277 768416 801706 837698 876426 918122 962395 1008315 1055088 1101994 1147707
62249 1147707 1190275 1227858 1259056 1282641 1297670 1304124 1302955 1295197 1281329 1261672 1236866 1207538
62237 1207538 1173805 1135630 1093559 1048711 1002237 955225 909124 865618 825780 789557 756315
62226 756315 725673 697674 672453 650061 630496 613579 598792 585488 573300 562244 552473 544098
62214 544098 537208 531753 527300 523186 519077 515260 512243 510163 508774 507886 507552 507768 508230 508597 508987 510056
62198 510056 512465 516267 520919 525931 531385 537635 544624 551821 558923 566355 574812 584407 594559 604646
62184 604646 614544 624491 634620 644757 654506 663440 671325 678290 684768 691145 697465 703563 709556 716191
62170 716191 724684 736147 751104 769444 790723 814562 840910 870050 902157 936588 971624 1005165
62158 1005165 1035719 1062561 1085037 1102207 1113398 1118759 1118962 1114549 1105836 1093230 1077204 1058018
62146 1058018 1035845 1011151 984787 957725 930958 905412 881558 859238 838324 819556 804209
62135 804209 792869 785014 779963 777631 778068 780810 785293 791623 800351 811513 824411 838457 853821
62122 853821 871000 889952 909888 929931 949784 969630 989420 1008438 1025571 1039773 1050111
62111 1050111 1055755 1056517 1053364 1047839 1040832 1032331 1022377 1011607 1000488 988697 975874 962619 950126
62098 950126 939105 929798 922826 919181 919133 921743 925829 931067 937920 946766 957354 968992 981071 993454
62084 993454 1006345 1019727 1033142 1046319 1059878 1074972 1092146 1110890 1130372 1150256 1170735
62073 1170735 1192149 1214717 1238300 1262171 1285246 1306663 1326048 1343280 1358451 1372220 1385692
62062 1385692 1399594 1413694 1427158 1439162 1449061 1456443 1461427 1464499 1465701 1464268 1459497 1451632 1441360
62049 1441360 1428732 1413215 1394668 1373487 1349668 1322499 1291585 1257715 1222263 1185991 1148841
62038 1148841 1110703 1071963 1033301 995283 958285 922651 888816 857264 828360 802175 778484
62027 778484 756973 737488 720115 704967 691816 679886 668151 656017 643664 631699 620544
62016 620544 610312 601091 593070 586318 580601 575546 570945 566989 564263 563342 564203 566157 568604 571703
62002 571703 575988 581399 587103 592256 596536 599917 602392 604093 605184 605338 603679 599622 593489 586073
61988 586073 577939 569476 561198 553364 545491 536861 527513 518233 509569 501423 493676 486653 480632 475342
61974 475342 470303 465522 461550 458888 457470 456588 455291 453136 450654 448893 448378 448721 449328 450056 450967 451841
61958 451841 452520 453614 456269 461057 467410 474369 481636 489654 498780 508720 518936 529476 541134 554715
61944 554715 570305 587509 606305 627353 651300 677969 706340 735171 763507 790852 817178
61933 817178 842711 867420 890694 911709 930175 946519 961283 974388 985039 992234 995367 994527
61921 994527 990395 983894 975903 967122 958055 949099 940787 933954 929546 928180 930033 935099 943295 954206
61907 954206 967023 980959 995512 1010084 1023617 1034911 1043124 1047704 1048064 1043800 1035164 1022843 1007300
61894 1007300 988708 967490 944425 920175 895135 869865 845181 821683 799560 778998 760234
61883 760234 742995 726442 710164 694800 681199 669254 658062 647016 636236 626088 616895 609127
61871 609127 603334 599701 597970 597889 599460 602710 607611 614355 623373 634863 648460 663572 680017 698236
61857 698236 719017 743019 770426 800989 834394 870500 909112 949701 991581 1034260 1077338
61846 1077338 1120104 1161500 1200498 1236270 1268040 1295102 1317003 1333396 1343737 1347577 1345279 1338044
61834 1338044 1327085 1313207 1297458 1281675 1267836 1257067 1249725 1246162 1246744 1251150 1258297 1267224 1277529
61821 1277529 1288587 1298660 1305254 1306340 1301013 1289150 1270864 1246429 1216429 1181733 1143376 1102547
61809 1102547 1060579 1018734 977995 939068 902440 868263 836330 806498 779144 754878 733710
61798 733710 714828 697440 681509 667423 655226 644623 635461 627664 620795 614289 608147 602771 597958
61785 597958 592731 586564 580216 574816 570540 566771 563245 560282 557986 555916 553757 551809 550572 550121
61771 550121 550050 549798 548997 547798 546951 547250 548739 550717 552618 554592 557051 559945 562761 565166 567410 570098
61755 570098 573587 577546 581099 583566 585045 586143 587221 588199 588985 589628 589934 589440 588127 586744 586068 586040
61739 586040 585961 585350 584260 583005 581983 581623 582069 582957 583908 585169 587313 590332 593499 596267 598877 601903
61723 601903 605599 609922 614911 620665 627025 633500 639526 644784 649392 653740 657962 661532 663668 664170
61709 664170 663571 662392 660575 657817 654137 649884 645452 641233 637528 634200 630598 626215 621232 616122
61695 616122 610950 605508 600016 595110 591046 587347 583417 579173 574899 570797 566920 563334 560114 557236
61681 557236 554618 552182 549776 547167 544254 541265 538672 536903 536067 535827 535547 534747 533513 532404 531909
61666 531909 532053 532427 532460 531729 530277 528715 527817 527922 528890 530544 532894 535849 539038 542081 544837 547230
61650 547230 549145 550654 552177 554164 556799 560069 563815 567509 570400 572312 574031 576370 578978 580652
61636 580652 580810 580066 579176 577977 575712 572075 567521 562740 558197 554121 550586 547560 544985 542869 541230
61621 541230 540026 539218 538789 538611 538442 538212 538164 538458 538699 538102 536115 532672 527918 522015 515336 508473 501845
61604 501845 495414 488982 482559 476201 469713 462945 456346 450808 446783 443853 441274 438599 435536 431670
61590 431670 426916 422053 418135 415215 412143 407969 403155 399007 396078 393560 390271 385914 381298 377508
61576 377508 375027 373528 372377 371238 370168 369259 368380 367322 365982 364288 362137 359645 357315 355697 354886
61561 354886 354555 354496 354870 355875 357362 358922 360269 361407 362445 363311 363734 363509 362801 362061 361635 361577 361873
61544 361873 362651 363989 365690 367466 369295 371350 373629 375869 377878 379759 381783 384162 386922 389834
61530 389834 392477 394480 395665 395839 394677 392154 388991 386179 383941 381552 378380 374755 371566 369279
61516 369279 367663 366306 365077 364113 363562 363351 363081 362255 360772 359089 357770 356939 356298 355559 354662 353659
61500 353659 352626 351716 351142 351043 351358 351808 352010 351733 351110 350472 349942 349424 348997 349028 349659 350456 350888 351020 351353
61481 351353 352101 352979 353645 354000 354005 353582 352864 352264 352153 352590 353410 354384 355219 355676 355799 355850 355930 355894 355726 355713 355981
61460 355981 356157 355782 354969 354324 354275 354783 355655 356776 357980 359033 359946 361073 362678 364531 366106 367090 367526
61443 367526 367579 367416 367312 367631 368681 370653 373706 377809 382491 387018 391044 394897 399027 403283 406978
61428 406978 409564 411046 411806 412300 412902 413767 414746 415667 416708 418289 420537 423140 425760 428277 430482 431972
61412 431972 432613 432784 432749 432043 429998 426761 423274 420178 417237 413996 410527 407219 404178 401240 398384
61397 398384 395736 393273 390912 388896 387694 387327 387064 386087 384368 382689 381852 382051 382984 384249 385489 386411
61381 386411 387002 387657 388792 390313 391704 392742 393835 395506 397800 400424 403180 405943 408397 410266 411793
61366 411793 413604 416016 418830 421870 425275 429007 432531 435447 438248 441942 446956 452811 458908 465206
61352 465206 471939 479120 486710 495078 504799 515909 527673 539225 550211 560626 570279 578740 585791
61339 585791 591604 596373 599968 602105 602765 602310 601272 600086 598894 597483 595426 592425 588534 584054 579327
61324 579327 574671 570355 566501 563088 560145 557808 556083 554737 553645 553053 553215 553910 554702 555657 557411
61309 557411 560465 564727 569840 575581 581831 588497 595667 603521 611861 620023 627458 634026 639411 642676
61295 642676 642968 640525 636452 631595 626126 620180 614208 608503 602919 597409 592442 588500 585467 582947
61281 582947 580981 579992 580081 580855 582053 583957 586977 591060 595771 600874 606621 613366 620995 628864 636400
61266 636400 643721 651465 659978 668894 677778 686938 697157 708631 720735 733024 745925 759921 774324
61253 774324 787540 798492 807198 813836 817953 819033 817379 813796 808583 801449 792455 782480 772573 763194
61239 763194 754291 745769 737635 729933 722880 716900 712261 708754 705952 703726 702284 701784 702235 703740 706457
61224 706457 710147 714033 717375 720090 722591 725065 727142 728366 728822 729138 729900 731203 732824 734665 736887
61209 736887 739642 742840 746225 749479 752209 754091 755351 757054 760576 766608 774793 784411 795312 808062
61195 808062 823302 841064 860658 881102 901630 921863 941533 960134 977009 991786 1004532
61184 1004532 1015369 1024149 1030719 1035409 1038941 1041813 1043922 1044822 1044111 1041508 1036818 1030045 1021429 1011247
61170 1011247 999701 987120 974070 961005 947898 934375 920140 905032 888876 871805 854747
61159 854747 839093 825516 813428 801902 790877 781099 773065 766546 761165 756994 754330 753188 753308
61146 753308 754494 756660 759424 761835 762718 761388 758055 753438 748049 742070 736004 731018 728204 727573 728272
61131 728272 729843 732846 738034 745399 754371 764665 776500 790087 805361 822225 840744 860978
61119 860978 882827 906052 930306 955133 980162 1005320 1030695 1056143 1081206 1105398 1128368
61108 1128368 1149762 1169180 1186403 1201428 1214172 1224362 1231905 1237135 1240382 1241327 1239022 1232626 1221944
61095 1221944 1207313 1189223 1168141 1144548 1118897 1091527 1062700 1032796 1002482 972664 944291
61084 944291 918106 894506 873539 854986 838461 823543 809922 797488 786300 776483 768120 761188
61072 761188 755515 750842 747008 744117 742498 742435 743879 746385 749357 752437 755692 759437 763881 769071 775234
61057 775234 782986 792866 804613 817184 829767 842684 856987 873247 891083 910038 930438 952960
61045 952960 977562 1003360 1029665 1056700 1085113 1115099 1146281 1178255 1210901 1244236 1278294
61034 1278294 1313213 1349213 1386456 1425001 1464891 1506209 1549061 1593678 1640409 1689422 1740498
61023 1740498 1793345 1848125 1905517 1966496 2032505 2105883 2189592 2286273 2397934 2526832 2676212
61012 2676212 2849787 3050873 3282741 3549890 3858568 4216101 4630136 5108406 5658422
61003 5658422 6287110 7001561 7811325 8730612 9778673 10977997 12349289 13899803 15603637
60994 15603637 17382055 19100804 20596966 21729066 22426116 22710608 22687026 22504879 22310994
60985 22310994 22203089 22196029 22214122 22117589 21755502 21022064 19891917 18423042 16731755
60976 16731755 14953861 13208290 11576049 10098552 8788972 7645390 6658769 5816203
60968 5816203 5102789 4503294 4002782 3586422 3239737 2949651 2705231 2497532 2319181
60959 2319181 2164318 2028587 1908785 1802416 1707566 1622902 1547432 1480241 1420527 1367660
60949 1367660 1320794 1278359 1238261 1198788 1159298 1120039 1081575 1044485 1009197 975695 943456
60938 943456 912007 881543 852681 825674 800212 776037 753387 732635 713791 696596 680829
60927 680829 666321 652860 640320 628669 617696 607002 596597 587203 579563 573579 568528 563987
60915 563987 560075 556887 554252 552135 550724 550005 549752 550130 551812 555101 559249 563021 565721 567479 568831
60900 568831 570369 572473 574936 576916 577611 576912 575223 572876 570042 567016 564100 561198 557897 553997 549683
60885 549683 545158 540408 535363 530035 524432 518529 512386 506174 500051 494142 488573 483385 478505 473991
60871 473991 470179 467364 465450 464159 463471 463613 464685 466606 469283 472514 475910 479351 483420 488802 495223
60856 495223 501537 506994 511892 516757 521455 525475 528721 531645 534862 538926 544156 550240 556167 560859
60842 560859 563848 565268 565530 565193 564736 564066 562554 559940 556933 554474 552648 550768 548360 545516 542421
60827 542421 539154 536048 533674 532254 531387 530452 528921 526283 522130 516548 510119 503308 496140 488626 481134
60812 481134 474034 467270 460645 454426 449254 445440 442655 440383 438473 437087 436176 435283 433991 432519 431629
60797 431629 431790 432521 432784 432023 430680 429673 429594 430405 431725 433195 434708 436487 438951 442373 446575 450931
60781 450931 454761 457809 460456 463432 467271 472013 477340 482854 488190 493174 498063 503464 509657 516096
60767 516096 521900 526880 531764 537295 543360 549149 554009 558019 561856 566131 570694 574547 576688 577175
60753 577175 577120 577517 578279 578614 578036 576649 574679 572294 569962 568455 568123 568401 568321 567394 565683 563179 559639
60736 559639 555152 550450 546253 542582 539158 536295 534819 535026 536264 537859 540014 543380 548061 553548
60722 553548 559380 565388 571452 577678 584857 594059 605449 617935 630266 642132 653968 666158 678926
60709 678926 692686 707895 724474 741751 759030 776015 792650 808804 824122 838008 849811
60698 849811 859252 866721 872881 877922 881351 882577 881450 878033 872156 863581 852699 840675 828537
60685 828537 816209 802772 787740 771784 756002 740819 725973 711399 697554 684782 672794
60674 672794 661063 649439 638139 627361 617119 607290 597614 587897 578467 570172 563541 558051 552565
60661 552565 546461 540083 534155 529100 524851 520987 517033 512980 509531 507479 506759 506435 505797 505096 505047 505909
60645 505909 507329 508803 509954 510549 510643 510700 511274 512472 513910 515126 515898 516216 516266 516522 517568 519612 522284
60628 522284 525004 527478 529716 531698 533225 534028 533877 532638 530446 527810 525265 522771 519652 515381 510309
60613 510309 505393 501252 497732 494390 491056 487779 484511 481197 478054 475454 473460 471706 469816 467820
60599 467820 466029 464597 463271 461548 459092 456071 453152 451055 450009 449600 449168 448374 447400 446642 446338 446473
60583 446473 446991 447881 449063 450378 451932 454283 457948 462668 467487 471746 475746 480147 485017 489922 494917
60568 494917 500946 509028 519227 530599 541968 552655 562662 572341 581883 590984 599018 605462 610031
60555 610031 612414 612232 609526 605149 600446 596523 593912 592810 593299 595290 598497 602683 607923 614536 622765
60540 622765 632527 643517 655570 668831 683407 698769 713632 726597 736882 744314 748789 750039
60528 750039 747949 742839 735360 726338 716811 707832 699945 693020 686914 682077 679078 677569 676352 674797
60514 674797 673791 674831 678303 683115 688005 692756 697988 704244 711678 720482 731069 743705 758309
60501 758309 774956 794435 817883 845741 877324 911651 948501 988274 1030871 1075104 1119368
60490 1119368 1162454 1203334 1240401 1271432 1294393 1307967 1311373 1304111 1286134 1258012 1220794 1175888
60478 1175888 1125184 1071011 1015706 961273 909430 861577 818386 779659 744885 713844 686506
60467 686506 662578 641532 622933 606473 591798 578672 567165 557259 548353 539674 531201 523677
60455 523677 517555 512372 507396 502495 498063 494406 491476 488978 486463 483568 480414 477590 475516 474049
60441 474049 472946 472339 472301 472259 471361 469471 467324 465695 464774 464347 464121 463780 463114 462275 461622 461161 460459 459262
60423 459262 457910 456906 456347 456046 455998 456435 457453 458814 460125 461170 462119 463402 465219 467197 468776 469981
60407 469981 471462 473585 475815 477233 477455 476821 476006 475725 476507 478262 480212 481625 482492 483159 483558 483346
60391 483346 482688 482256 482410 483003 484078 486134 489412 493432 497531 501410 504842 507314 508516 508874 509180 509866
60375 509866 511034 512880 515520 518459 520795 522079 522693 523347 524415 525725 526796 527352 527729 528566 529911
60360 529911 531014 531401 531785 533229 535650 537897 539321 540477 542088 544102 546184 548567 551816 556060 560914
60345 560914 565957 570911 575589 580048 584607 589375 593861 597333 599390 599972 599071 596783 593523 589813 585967
60330 585967 582204 578834 575969 573236 570219 567044 564119 561376 558344 555046 552284 550814 550569 550907 551405
60315 551405 552247 554049 557371 562169 567630 572829 577674 582991 589601 597647 606921 617497 629733 643902
60301 643902 660049 677934 696749 715100 731575 745210 755152 760220 759439 753102 742769 730082
60289 730082 715993 701274 687098 674500 663502 653388 643842 635281 627916 620986 613301 604344 594570
60276 594570 584820 575711 567486 560056 553137 546588 540692 535900 532257 529287 526579 524265 522727 521928
60262 521928 521294 520292 518995 517985 517725 518059 518367 518157 517450 516554 515655 514799 514148 513987 514408 515140 515738 515868
60244 515868 515483 514883 514561 514784 515383 516119 517112 518572 520241 521626 522855 524713 527641 531159 534584 537816
60228 537816 541070 544289 547332 550411 553778 557253 560526 563741 567185 570643 573639 576209 578767 581374
60214 581374 583842 586547 590281 595034 599691 603331 606248 609256 612530 615663 618438 620939 623074 624546
60200 624546 625279 625460 625247 624763 624353 624433 625009 625537 625382 624338 622734 621110 619749 618459 616880 615002 613216
60183 613216 611823 610695 609589 608551 607804 607367 606994 606471 605869 605544 605884 606897 608019 608512 608130 607191 606060
60166 606060 604872 603871 603567 604252 605625 607167 608663 610077 611213 611912 612493 613582 615489 618004 620747
60151 620747 623470 626084 628614 631169 633788 636417 639158 642397 646521 651606 657527 664075 670736 676723
60137 676723 681758 686716 692931 700800 709372 717312 723838 728774 732169 734120 734636 733482 730412 725660
60123 725660 719991 714100 708213 702346 696674 691459 686794 682627 678924 675674 672871 670582 668910 667813
60109 667813 667070 666496 666029 665561 664886 663911 662714 661324 659695 657997 656707 656169 656263 656742 657696 659430 661959
60092 661959 664988 668378 672376 677263 682958 689086 695319 701556 707797 713990 720035 725915 731748 737637
60078 737637 743390 748400 751824 752948 751554 748063 743304 737962 732107 725244 716810 706642 695114 683016
60064 683016 671279 660598 651121 642583 634738 627573 621055 614931 609001 603475 598764 594848 591085 586850
60050 586850 582264 578181 575429 574226 574311 575440 577479 580067 582471 584024 584706 585163 586145 587884 589975
60035 589975 591699 592549 592518 591921 590879 589090 586204 582390 578277 574282 570152 565280 559391 552848 546344
60020 546344 540365 534934 529765 524697 519993 516232 513817 512603 511971 511284 510323 509358 508879 509242 510509 512475
60004 512475 514747 516853 518523 519967 521800 524486 527930 531643 535202 538385 540990 542902 544431 546332
59990 546332 549238 553050 557017 560390 562972 565070 567026 568874 570395 571406 571904 571997 571867 571763 571802 571663
59974 571663 570703 568689 566280 564572 564185 565005 566680 568922 571312 573252 574532 575782 578049 581928 587199
59959 587199 593187 599252 604899 609689 613240 615371 616235 616277 615967 615471 614535 612697 609619 605321 600261 595160
59943 595160 590590 586581 582698 578543 574131 569705 565343 560932 556490 552290 548603 545449 542730 540482
59929 540482 538831 537734 536962 536411 536257 536678 537521 538484 539567 541153 543594 546940 551110 556129 562026 568623
59913 568623 575565 582476 589063 595231 601197 607261 613337 618942 623848 628475 633334 638278 642624 645855
59899 645855 647821 648493 648027 647048 646286 645862 645411 644997 645312 646679 648464 649948 651383 653588 656767 660377
59883 660377 664101 668293 673213 678357 682966 686915 690692 694531 698042 700886 703415 706188 708894 710262
59869 710262 709341 706550 703154 699966 697034 694387 692365 691041 689867 688222 685975 683252 680094 676759
59855 676759 673974 672325 671481 670474 668790 666906 665844 666527 669440 674364 680315 686074 690992 695072 698211
59840 698211 699706 698796 695600 691326 687591 685478 685006 685186 684581 682051 677252 670634 663030 655125 647115
59825 647115 638792 629957 620800 611865 603672 596371 589669 583096 576447 570005 564233 559267 554917 551193
59811 551193 548474 546893 545829 544386 542282 539901 537600 535424 533543 532436 532371 533004 533763 534356 534665 534412
59795 534412 533373 531844 530503 529748 529414 529154 528832 528426 527855 527108 526414 526024 525924 525932 526016 526239 526511 526704 527083
59776 527083 528205 530161 532243 533722 534766 536155 538226 540606 542986 545611 548738 552159 555638 559461
59762 559461 564037 569194 574391 579515 584917 590638 596202 601462 607127 613988 621832 629609 636620 643163
59748 643163 649916 657070 664299 671348 678276 685124 691618 697312 701828 704873 706278 706221 705249 703807 701807
59733 701807 698997 695659 692573 690231 688450 686856 685309 683636 681387 678301 674757 671366 668271 665278
59719 665278 662511 660473 659433 659138 659145 659056 658469 657217 655818 655334 656460 658971 662119 665307 668250 670866
59703 670866 673360 676172 679475 682754 685184 686446 686973 687417 688033 688673 689132 689307 688963 687571 684721 680816
59687 680816 677132 674846 673977 673426 672045 669518 666298 663080 660393 658369 656628 654540 651769 648478 644956
59672 644956 641240 637212 632843 628206 623453 618959 615268 612577 610390 607969 605184 602708 601363 601389 602357
59657 602357 603641 604887 606018 606896 607145 606500 605207 603832 602706 601884 601620 602357 603949 605283 605136 603232
59641 603232 600201 596730 593217 589933 586903 583679 579834 575799 572663 570987 570307 569944 569701 569462 568704
59626 568704 567021 564757 562537 560341 557684 554673 552349 551782 553090 555333 557058 557052 555162 552561 550791
59611 550791 550253 549939 548782 546862 545021 543787 543238 543578 545101 547468 549641 550827 551117 551051 550949 550979 551549
59594 551549 553054 555250 557272 558479 559059 559687 560775 562216 563680 564890 565580 565468 564462 562814 560891
59579 560891 558787 556310 553383 550325 547611 545446 543617 541706 539365 536476 533277 530306 528109 526848
59565 526848 526211 525702 525031 524292 523800 523770 524128 524666 525367 526400 527763 529173 530504 532143 534665 538215 542462
59548 542462 547042 551816 556809 562266 568701 576455 585167 594111 603210 613326 625320 639191 654288
59535 654288 669940 685402 699457 710630 717936 721322 721579 720091 718429 717762 718466 720287 722776 725506
59521 725506 728190 730802 733358 735374 735803 733824 729481 723317 715673 706725 696888 686633 676039 664997
59507 664997 653778 642976 632988 624023 616449 610518 605730 601081 596097 591140 586594 582340 578250 574697
59493 574697 572234 571061 571016 571756 572810 573836 574983 576650 578764 580739 582379 584306 587244 591280 596114
59478 596114 601591 607613 613916 620340 627014 633931 640637 646683 652012 656588 660103 662512 664393 666210
59464 666210 667651 668415 669326 671798 676307 682200 689013 697100 706793 717709 729212 740983 752790 764248
59450 764248 775187 785776 795925 804899 811930 816865 819830 820553 818472 813366 805513 795397 783610
59437 783610 770985 758407 746493 735687 726544 719517 714367 710164 706104 702236 699277 697894 698318
59424 698318 700597 704962 711745 720929 731900 743806 756181 769141 783005 797870 813668 830463
59412 830463 848352 866826 884191 897816 905200 905072 897718 884550 867584 849197 831832 817433
59400 817433 807011 800746 798220 798221 798468 796142 789112 776772 759879 739952 718857 698455 680060
59387 680060 664099 650333 638357 627857 618659 610780 604396 599538 595910 593143 591220 590439 590970 592571
59373 592571 594730 596976 599090 601185 603557 606331 609275 612190 615406 619647 625262 631860 638817 645974
59359 645974 653665 662266 671995 682965 695102 707990 721150 734582 748782 764185 780844 798730
59347 798730 817929 838102 858029 876243 892282 906961 921175 934645 945977 953790 957561 957542
59335 957542 954211 947983 939315 928766 916731 903205 888063 871711 855205 839543 824985 811313
59323 811313 798518 786838 776284 766682 758201 751232 745518 740029 734127 728436 724067 721347 719849
59310 719849 719381 720187 722231 724941 727848 730922 734213 737727 741946 747930 756374 766794 778021 789359
59296 789359 800827 812206 822149 828487 829507 825091 816693 806308 795504 785428 777234 771808 769006
59283 769006 767776 767424 768437 771715 777355 784685 793325 803516 815292 827882 840311 852325 864359
59270 864359 876660 888760 899898 909688 918154 925169 930130 932386 931822 928819 923676 916353 906868 895634
59256 895634 883176 869704 855332 840606 826501 813767 802493 792402 783343 775394 768665 763237
59244 763237 759249 756836 755911 756073 756840 757969 759541 761683 764179 766375 767557 767504 766634 765498 764079 761682
59228 761682 757609 751887 745112 737535 728605 717752 705546 693633 683318 674490 666190 657983 650355
59215 650355 643889 638546 633965 630030 626751 623835 620831 617777 615329 614057 613789 613814 613635 613410 613736 615160
59199 615160 617802 621266 624853 628024 630816 633819 637712 642755 648652 654847 660970 667050 673342 679992
59185 679992 686967 694307 702216 710672 719118 726865 733864 740755 748029 755448 762566 769507 776764 784353
59171 784353 791658 798317 804827 811894 819441 826651 832921 838375 843323 847569 850557 852018 852179 851322 849336
59156 849336 845761 840151 832427 823092 813106 803312 793848 784301 774569 765321 757322 750467 743877 736991
59142 736991 730278 724782 721191 719412 718799 718588 718294 717886 717624 717762 718536 720316 723453 727875 733109 738868
59126 738868 745382 752997 761663 771002 780701 790640 800862 811639 823347 835987 848986 861757 874286
59113 874286 886864 899401 911369 922329 932111 940486 947079 951733 954685 956306 956940 956990 956809 956347
59099 956347 955115 952599 948551 942918 935885 928119 920606 913938 907868 901797 895541 889499 884107 879328
59085 879328 874598 869256 863036 856140 848738 840544 831188 820990 810983 801943 793641 785286 776499 767634
59071 767634 759289 751747 744909 738514 732335 726245 720189 714252 708748 704026 699974 695852 690970 685519
59057 685519 680329 675799 671522 667076 662698 658825 655478 652594 650595 649974 650404 650923 651144 651743 653505
59042 653505 656313 659389 662230 664909 667637 670554 673997 678538 684440 691249 698283 705493 713600 723278
59028 723278 734457 746549 759157 772366 786488 801782 818310 835731 853203 869745 884741
59017 884741 897861 908600 916293 920734 922359 921632 918566 913184 906163 898597 891294 884653 879089 875082
59003 875082 872664 871345 870766 871166 872889 875631 878543 881063 883244 885089 885932 884919 882035 878205 874209
58988 874209 869850 864415 857658 850057 842296 834872 828059 821804 815705 809499 803623 799029 796469 796235
58974 796235 798396 802745 808600 815271 822849 831972 842628 853850 864842 875758 886983 898239 908938
58961 908938 918869 927932 935600 941328 945150 947171 946770 943166 936642 928344 918804 907485 894059 879452
58947 879452 865118 851754 839148 827058 815873 806475 799613 795294 792682 790734 789044 787930 787751
58934 787751 788306 788882 788681 787225 784613 781375 777861 773823 768844 763066 757091 751230 745268 739023 732697
58919 732697 726621 721074 716461 713204 711284 710256 709869 710244 711354 712858 714760 717692 722122 727787 734372
58904 734372 742297 752133 763495 775306 787137 799574 813124 827413 841781 856105 870622 885390
58892 885390 900472 916427 934002 953251 973403 993692 1013933 1034037 1053341 1070790 1085592
58881 1085592 1097317 1105505 1109718 1110096 1107323 1101745 1092856 1080098 1063944 1045743 1026621 1007039 987429
58868 987429 968716 951824 936905 923416 910878 899335 889036 879844 871098 862091 852627 843076
58856 843076 833944 825554 818074 811529 805654 800011 794493 789471 785179 781211 776961 772290 767251 761375
58842 761375 753915 744846 735080 725512 716375 707595 699222 691247 683576 676549 670971 667161 664323 661387
58828 661387 658196 655388 653276 651509 649894 649029 649778 652216 655295 657644 658762 659343 660352 661898 663370
58813 663370 664498 665618 666743 667142 666328 664915 663805 662954 661663 659854 658176 656852 655247 652832 649946
58798 649946 647348 645478 644358 643702 642889 641316 639193 637592 637373 638350 639802 641446 643505 646209 649720
58783 649720 654294 659918 665892 671364 676278 681269 686509 691201 694458 696223 697050 697302 696996 696136 694759
58768 694759 692710 689760 686015 681955 678044 674478 671291 668453 665966 664134 663734 665491 669221 673839
58754 673839 678425 682912 687441 691470 694202 695812 697580 700596 704781 709513 714755 721073 728637 736787
58740 736787 744841 753000 762136 772666 783909 794707 804561 813960 823588 833494 843156 852147 860419
58727 860419 868020 874837 880689 885408 888769 890535 890731 889773 888252 886705 885557 885017 884960 885134 885573 886544
58711 886544 887902 888771 888130 885551 881106 874760 866287 855768 843780 830881 817095 802032 785466
58698 785466 767704 749501 731669 714726 698863 684189 670945 659386 649531 641138 633921 627726
58686 627726 622523 618294 614887 611898 608779 605179 601208 597291 593859 591232 589636 589044 589050 589181 589430 590330
58670 590330 592462 596084 601247 607945 615942 624730 633982 643906 654778 666057 676355 684395 689809
58657 689809 692847 693669 692249 688809 683955 678339 672469 666844 661918 657738 653852 649764 645401 641066
58643 641066 637141 633943 631631 629986 628450 626643 624810 623552 623151 623415 624085 625164 626689 628375 629608
58628 629608 629897 629362 628736 628768 629575 630745 632016 633638 636068 639704 645009 652342 661304 670678 679487 687861
58612 687861 696428 705206 713625 721258 727809 732642 735208 735983 736162 736339 736182 735494 734693 733975 732811 730736
58596 730736 727992 725051 722225 720129 719766 721519 724687 728643 733874 741202 750512 761017 772287 784190
58582 784190 796218 807827 819237 830984 842735 853392 862302 869607 875470 879916 883585 887779 893442
58569 893442 900678 909461 920105 932774 947192 963170 980856 1000117 1020236 1040556 1060827 1080454
58557 1080454 1098012 1112223 1123081 1131346 1137124 1139641 1138426 1134159 1128090 1120972 1112765 1103170 1092156
58544 1092156 1079968 1066779 1052533 1037183 1020917 1003959 986226 967517 948114 928936 911032
58533 911032 895087 881420 870049 860552 852169 844423 837549 832119 828352 825998 824786 824661 825588 827333
58519 827333 829536 831946 834573 837638 841307 845393 849374 852826 855845 858959 862588 866583 870296 873087
58505 873087 874827 875929 876934 878077 879170 879750 879301 877556 874710 871263 867490 863230 858416 853646 849910
58490 849910 847768 847078 847561 849264 852370 856853 862580 869577 877914 887411 897678 908453 919720 931402
58476 931402 943072 954081 963898 972112 978108 981034 980432 976807 971255 964509 956669 947898 938984 930927
58462 930927 924291 919199 915760 914127 914264 915905 918636 921899 925217 928672 932866 937995 943185 947136
58448 947136 949224 949607 948512 946004 942392 938253 934052 930198 927386 926321 926982 928757 931365 935099 939970
58433 939970 945269 950360 955498 961476 968828 977662 987871 999049 1010493 1021768 1033182 1045288 1057880
58420 1057880 1069773 1079540 1086337 1090090 1091197 1090150 1087295 1082888 1077346 1071397 1065877 1061317 1057671 1054465
58406 1054465 1051270 1048176 1045733 1044393 1044041 1044161 1044399 1044889 1046129 1048610 1052398 1056977 1061621 1065964 1070015
58391 1070015 1073613 1076298 1077915 1078904 1079676 1080161 1080343 1080758 1081910 1083596 1085439 1087681 1090702 1094087 1097044
58376 1097044 1099591 1102486 1106136 1110457 1115759 1122664 1130991 1139751 1148605 1158465 1170222 1183619 1197747
58363 1197747 1211926 1225701 1238724 1251178 1263714 1276547 1289098 1300828 1311743 1321786 1330588
58352 1330588 1338347 1346061 1354257 1362238 1369399 1376537 1384869 1394299 1403766 1413033 1423052 1434591 1447464
58339 1447464 1461315 1476356 1493016 1511362 1531033 1551395 1571632 1591039 1609411 1626940 1643748
58328 1643748 1659675 1674460 1687919 1699956 1710581 1719951 1728400 1736558 1745318 1755326 1766465 1778196
58316 1778196 1790432 1803645 1818115 1833620 1850054 1867696 1886593 1906294 1926575 1947897 1970757
58305 1970757 1995059 2020519 2047136 2074808 2102916 2130824 2158434 2185918 2213337 2240898 2269021
58294 2269021 2297667 2326112 2353835 2381213 2408917 2437222 2466401 2497135 2529791 2563708 2597923
58283 2597923 2632349 2667759 2705038 2744869 2787562 2832579 2878722 2925447 2973559 3024014 3076642
58272 3076642 3130712 3186229 3243859 3304017 3366837 3432747 3502274 3575501 3652248 3732436 3815779
58261 3815779 3901582 3989438 4079642 4172301 4266569 4361312 4455968 4550373 4644655 4740040 4838822
58250 4838822 4942554 5051035 5163923 5282326 5407668 5539908 5678315 5823348 5976425
58241 5976425 6138383 6309453 6490274 6681683 6884033 7097877 7324707 7565824 7821244
58232 7821244 8091044 8376985 8681411 9005466 9350054 9717677 10111461 10533148 10984068
58223 10984068 11467401 11987476 12547507 13150404 13801491 14508255 15277831 16117192 17035719
58214 17035719 18045572 19160050 20394368 21768442 23307287 25039783 27000470 29233252
58206 29233252 31791769 34737356 38139763 42078970 46641765 51915176 57985187 64940546
58198 64940546 72872620 81869358 92011483 103375737 116043746 130117861 145743736
58191 145743736 163124144 182499850 204080618 227908645 253633173 280231737 305839028
58184 305839028 327902726 343736872 351265523 349596775 339177794 321529708 298740581
58177 298740581 272937757 245916916 219009279 193141086 168953561 146877179 127151085
58170 127151085 109836220 94850061 82012892 71091207 61835082 54005595 47386646
58163 47386646 41785706 37034434 32991122 29539028 26580537 24033283 21829301 19912911
58155 19912911 18237129 16762349 15456836 14295291 13256106 12320924 11475735 10709920
58147 10709920 10014137 9380490 8803845 8280551 7805735 7373469 6979209 6620032 6292442
58138 6292442 5991739 5713735 5455456 5213904 4985738 4768731 4562464 4367162 4182650
58129 4182650 4008516 3844277 3689169 3542495 3404220 3274564 3153107 3039002 2931834
58120 2931834 2831445 2737166 2648099 2563973 2484903 2410478 2339991 2273381 2210963 2152292 2096209
58109 2096209 2042080 1990164 1940678 1893250 1847371 1802792 1759388 1717126 1676151 1636546 1598214
58098 1598214 1561377 1526747 1494543 1463766 1433208 1402994 1374376 1348235 1324468 1302626 1282314
58087 1282314 1263057 1244542 1227029 1210912 1195896 1181054 1165563 1148898 1130630 1110756 1090070
58076 1090070 1069588 1049686 1030264 1011422 993321 975637 957884 940206 923243 907428 892947
58065 892947 880091 868975 859196 850390 842806 836606 830915 824386 816534 807806 798694 789565 780973 773128
58051 773128 765282 756661 747819 740015 733392 726917 720178 714044 709277 705460 701625 697135 691756 685641
58037 685641 679471 673911 668846 663786 658867 654498 650130 644603 637883 631196 625090 618646 611106 603163
58023 603163 595887 589417 583417 577893 572730 567308 561531 556551 553477 551875 550493 549027 548156 548122 548308
58008 548308 548275 548377 549177 550797 552927 555073 556796 558101 559551 561718 564575 567693 570800 573828 576617
57993 576617 578993 580989 582698 584042 585035 586085 587661 589797 592222 594730 597084 598783 599433 599249 598815
57978 598815 598391 597878 597306 596882 596524 595876 594870 593886 593140 592261 590707 588401 585754 583211 580981 579094
57962 579094 577510 576077 574564 572792 570763 568609 566401 564067 561508 558716 555737 552610 549481 546721
57948 546721 544792 543943 544129 545167 546910 549316 552486 556553 561501 567221 573933 582265 592578 604271
57934 604271 616124 627320 637808 647733 656945 665181 672307 678118 682187 684135 683950 681910 678356 673583
57920 673583 667733 660695 652303 642748 632643 622624 612971 603596 594246 584714 575116 565975 557906 551258
57906 551258 546157 542585 540084 537645 534477 530848 527652 525129 522618 519610 516402 513488 510946 508768
57892 508768 507296 506835 507181 507885 508777 509967 511563 513608 516064 518708 521347 524208 527635 531259 534007
57877 534007 535233 535334 534935 534095 532762 531417 530565 530049 529573 529631 531071 533818 536739 538884 540331 541791
57861 541791 543920 547152 551692 557421 563969 570964 578094 585101 591978 599061 606616 614431 622054 629183
57847 629183 635482 640332 643421 645418 647349 649238 650001 648894 646438 643659 640955 638110 634955 631518
57833 631518 627792 623891 620369 617919 616676 616117 615707 615457 615745 616854 618798 621436 624493 627504 630005
57818 630005 631926 633679 635747 638304 641359 645017 649149 652839 654681 653922 651132 647541 643915 640196
57804 640196 635947 630863 625068 619261 614468 611364 609831 609274 609183 609168 608753 607552 605669 603614 601867 600670
57788 600670 600137 600274 600952 602040 603543 605457 607669 610197 613267 616902 620700 624420 628508 633516 639123
57773 639123 644344 648703 652652 656718 660764 664228 666664 667862 667851 667029 665946 664755 663175 661055 658551
57758 658551 655603 651855 647449 643407 640669 639036 637617 636168 635432 636176 638371 641326 644223 646428 647706
57743 647706 648360 649016 650125 651789 653952 656495 659127 661574 663987 666854 670274 673633 676279 678300 680347
57728 680347 682822 685640 688691 692053 695627 699019 702013 704904 708041 711290 714292 717062 719925 722912
57714 722912 725694 728135 730478 732823 734813 736132 737033 738030 739303 740729 742360 744411 746774 748912 750421
57699 750421 751490 752678 754376 756608 759214 762041 765015 768240 772122 777255 783963 791890 800199 808331
57685 808331 816526 825504 835788 847603 861345 877772 897514 920673 947028 976360 1008409 1042866
57673 1042866 1079911 1120674 1166715 1218939 1277234 1341130 1410155 1482781 1554686 1618316 1664838
57662 1664838 1687362 1683210 1654014 1604418 1540781 1470198 1399228 1332530 1272386 1219429 1173589
57651 1173589 1134488 1101577 1074415 1052725 1035969 1023082 1012950 1005038 999376 996040 994818 995205
57639 995205 996502 998108 999877 1002102 1004980 1008288 1011675 1014957 1017993 1020705 1023536 1027382 1032557 1038141
57625 1038141 1042934 1046806 1050541 1054583 1058644 1062484 1066303 1070199 1073919 1077405 1081026 1084977 1088929 1092675
57611 1092675 1096675 1101537 1107156 1112774 1117800 1122277 1126629 1131191 1136014 1140973 1146012 1151296 1157090 1163448
57597 1163448 1170005 1176115 1181217 1185263 1188789 1192390 1196028 1199170 1201741 1204513 1208246 1212840 1217749 1222864
57583 1222864 1228420 1234289 1240095 1245867 1251885 1257902 1263339 1268380 1274074 1281015 1288552 1295645 1301986 1307976
57569 1307976 1314093 1320638 1327628 1334565 1340742 1346144 1351739 1358530 1366665 1375690 1385140 1394546 1403398 1411662
57555 1411662 1419987 1428895 1438089 1447068 1456097 1465910 1476648 1487675 1498436 1508959 1519500 1530092
57543 1530092 1540538 1550619 1560338 1570140 1580678 1592062 1603580 1614408 1624372 1633665 1642285 1650339
57531 1650339 1658538 1667623 1677376 1687016 1696565 1706983 1718647 1730568 1741666 1752187 1763185 1774943
57519 1774943 1786716 1797940 1809000 1820573 1832743 1845163 1857785 1870993 1884984 1899334 1913271
57508 1913271 1926254 1938241 1949637 1961172 1973613 1987202 2001292 2014830 2027314 2039175 2051163
57497 2051163 2063566 2076124 2088501 2100658 2112918 2125746 2139349 2153366 2167149 2180411 2193416
57486 2193416 2206446 2219399 2232203 2245301 2259284 2274052 2288757 2302702 2316084 2329698 2344045
57475 2344045 2358937 2373979 2389269 2405347 2422377 2439678 2456367 2472343 2488278 2504700 2521563
57464 2521563 2538775 2556604 2575223 2594233 2613025 2631353 2649347 2667212 2685240 2703821 2723088
57453 2723088 2742722 2762304 2781615 2800385 2818231 2835262 2852445 2870785 2890348 2910499 2930928
57442 2930928 2951912 2973729 2996282 3019230 3042067 3064235 3085644 3106895 3128481 3149983 3170746
57431 3170746 3191111 3212166 3234222 3256444 3278197 3299943 3322347 3345281 3368226 3391109 3414079
57420 3414079 3436871 3459091 3480960 3503212 3526220 3549663 3573024 3596063 3618838 3641577 3664567
57409 3664567 3687952 3711597 3735322 3759255 3783835 3809462 3836163 3863444 3890379 3916139 3940698
57398 3940698 3964967 3990038 4016346 4043640 4071548 4099870 4128452 4157190 4186200 4215754 4245875
57387 4245875 4276216 4306494 4336902 4367922 4399727 4431884 4463746 4495088 4526305 4557983 4590339
57376 4590339 4623158 4656178 4689394 4722933 4756756 4790585 4824116 4857250 4890118 4922921 4955745
57365 4955745 4988552 5021281 5053949 5086670 5119640 5153059 5186970 5221237 5255723 5290397 5325064
57354 5325064 5359151 5392210 5424706 5457847 5492365 5527796 5563251 5598521 5633954 5669608 5705159
57343 5705159 5740547 5776078 5811765 5847098 5881689 5915747 5949686 5983607 6017355 6050890 6084381
57332 6084381 6118081 6152157 6186481 6220588 6254161 6287581 6321669 6356786 6392516 6428296 6463990
57321 6463990 6499695 6535448 6571428 6608067 6645552 6683431 6721056 6758261 6795261 6832110 6868686
57310 6868686 6905082 6941614 6978408 7015428 7052937 7091490 7131227 7171459 7211332 7250808 7290691
57299 7290691 7331675 7373597 7415692 7457343 7498416 7539010 7579165 7618777 7657552 7694974 7730619
57288 7730619 7764658 7797832 7830770 7863506 7895814 7927787 7959823 7992236 8025126 8058415 8091724
57277 8091724 8124476 8156531 8188570 8221412 8255034 8288726 8322007 8354864 8387209 8418822 8449961
57266 8449961 8481279 8512855 8543918 8573875 8603109 8632331 8661618 8690591 8719211 8747865 8776806
57255 8776806 8805861 8834585 8862483 8889342 8915611 8942160 8969262 8996037 9021256 9044522 9066413
57244 9066413 9087718 9108982 9130550 9152604 9175147 9198161 9221574 9244763 9266449 9285658 9302621
57233 9302621 9318191 9332435 9344379 9353155 9358875 9362264 9363995 9364558 9364360 9363594 9362314 9360845 9359822 9359559
57219 9359559 9359622 9359323 9358408 9356950 9354761 9351387 9346848 9342011 9337842 9334325 9330332 9324718 9317387 9309203 9300997
57204 9300997 9292931 9284803 9276636 9268752 9261403 9254463 9247443 9239775 9231311 9222690 9215030 9209039 9204463 9200464
57190 9200464 9196427 9192282 9188210 9184206 9179834 9174276 9166785 9157169 9145734 9132771 9118314 9102446 9085402
57177 9085402 9067180 9047422 9025911 9002811 8978132 8951487 8923007 8894147 8866768 8841377 8816878
57166 8816878 8792045 8766653 8741042 8715212 8688712 8660988 8631465 8599486 8564494 8526197 8484475
57155 8484475 8439316 8390865 8339338 8284808 8227305 8167201 8105151 8041502 7976061 7908611 7839402
57144 7839402 7768943 7697558 7625452 7552980 7480557 7408339 7336328 7264845 7194711 7126855 7061784
57133 7061784 6999495 6939826 6882817 6828670 6777304 6727904 6678830 6627965 6573367 6514008 6450171
57122 6450171 6383074 6314048 6244297 6175552 6110549 6052267 6002570 5961707 5929022 5903881 5886128
57111 5886128 5876280 5875613 5886011 5909844 5950323 6011960 6100276 6220905 6379239 6580992 6832933
57100 6832933 7143235 7521661 7979665 8530078 9186769 9965159 10883306 11961992 13223403
57091 13223403 14689418 16379867 18309526 20483814 22895513 25523300 28328985 31251110
57083 31251110 34199675 37060789 39713219 42047504 43976042 45432384 46368196 46755862
57075 46755862 46595647 45919811 44788033 43275213 41457242 39400496 37158245 34773962
57067 34773962 32288264 29744656 27190841 24675942 22246299 19941915 17793947 15823132
57059 15823132 14039521 12443783 11029473 9785407 8697531 7750274 6927587 6213898
57051 6213898 5594919 5057929 4591463 4185020 3829323 3516752 3241270 2997916 2782499
57042 2782499 2591569 2422213 2271753 2137827 2018697 1913087 1819752 1737560 1666034 1605215
57032 1605215 1554836 1514024 1482104 1459266 1446197 1443577 1452197 1472589 1503119 1537973 1567602 1581791
57020 1581791 1573000 1538124 1478771 1400570 1311358 1218658 1127910 1042289 963489 892307 828859
57009 828859 772825 723775 681257 644688 613220 585764 561245 539043 519244 502247 487968
56998 487968 475483 463572 451629 440080 430038 422530 417825 415280 413875 413015 412926 414282 417537 422535
56984 422535 428632 435115 441512 447507 452448 455041 453821 448139 438693 427034 414640 402347 390419
56971 390419 378932 368216 359021 352127 347655 344965 343448 343294 345202 349503 355941 364230 374358 386216
56957 386216 399266 412695 425453 435845 441631 441217 434821 424122 410819 395877 380085 364641
56945 364641 350785 339085 329432 321687 316098 313135 313013 315440 319828 325864 333817 344127 356779
56932 356779 371305 387255 404119 420560 434183 442531 444200 438907 426990 409385 387841 364443
56920 364443 340780 317850 296574 277810 261736 247802 235518 224917 216048 208474 201653 195564
56908 195564 190622 187060 184670 182982 181543 180159 179121 179045 180279 182592 185652 189563 194640 200836 207804
56893 207804 215480 224161 233946 244522 255733 268062 282216 298277 315325 331775 346002 356845
56881 356845 363830 366924 366142 361580 353970 344964 336456 329676 325165 323372 324743 329139 335861 344650
56867 344650 356170 371022 388701 408371 430524 456909 488413 523627 559782 594434 625643
56856 625643 651175 668605 676355 674195 662890 644028 620280 595040 571353 551245 535974 526349
56844 526349 522651 524800 532923 547393 568071 594031 624500 659720 700477 746998 798600 853833
56832 853833 910036 962719 1006153 1035053 1045828 1036890 1008998 965776 913090 856918 801544 749639
56820 749639 703272 664028 632432 608165 591054 581323 578817 582738 592498 608355 630695 659107
56808 659107 692560 729937 769432 807432 838808 858715 864020 853445 827471 788685 741551 690965
56796 690965 640789 593582 551026 514015 482680 456943 436966 422759 413604 408437 406729 408625
56784 408625 414316 423723 436659 452725 470812 488891 504305 514232 516332 509635 494886 473705
56772 473705 447515 417645 386043 354981 325836 298776 273821 251584 232680 216953 203716
56761 203716 192381 182582 173947 166167 159110 152688 146834 141736 137773 134987 132885 130966 129212 127877
56747 127877 127019 126419 125715 124515 122650 120467 118620 117424 116656 116047 115631 115539 115788 116373 117136 117485 116815
56730 116815 115433 114507 114790 115836 116777 117316 117572 117527 117268 117364 118420 120433 123006 125867 128695 130903 132228
56713 132228 133243 134610 136029 136645 136302 135634 135005 134204 133323 133104 133965 135209 135690 135007 133764 132887 132930
56696 132930 133846 135083 135909 135876 135155 134431 134395 135178 136206 136763 136646 136099 135220 133863 132239 131008 130536 130474
56678 130474 130446 130613 131104 131396 130953 130145 129819 130164 130690 131123 131599 132061 132326 132781 134164 136446 138624 139904
56660 139904 140451 140758 140940 141032 141390 142238 143236 143985 144686 145871 147616 149420 150767 151537 151949 152301 152755 153278
56642 153278 153859 154743 156130 157640 158451 158240 157713 157920 159165 160821 162049 162460 162155 161374 160240 158849
56626 158849 157549 156918 157252 158173 159020 159645 160516 161947 163540 164601 164978 165196 165772 166538 166808 166221 165238
56609 165238 164605 164442 164246 163869 163960 165153 167183 169208 170669 171418 171335 170472 169382 168662 168147 167140 165456
56592 165456 163710 162514 161921 161726 161820 162106 162520 163267 164593 166272 167699 168545 168912 168894 168593 168560 169505 171342
56574 171342 173153 174416 175672 177624 180121 182539 184768 187372 190951 195678 201246 207074 212833 218920
56560 218920 226181 235009 244934 255094 264687 273013 279683 285008 289617 293538 296270 297981 299842 302715
56546 302715 306118 308961 310739 311442 310945 309253 306965 304684 302183 298800 294458 289704 284938 280231 275766
56531 275766 271759 267930 263593 258340 252245 245501 238390 231558 225746 221141 217347 214063 211402 209455
56517 209455 207960 206547 205066 203524 201898 200135 198258 196418 194865 193824 193346 193330 193617 193882 193604 192531
56501 192531 191187 190363 190012 189259 187778 186469 186292 187042 187872 188474 188989 189214 188790 187991 187465 187299 187145 187157
56483 187157 187901 189242 190181 190090 189396 188795 188386 187946 187513 187311 187455 188034 189148 190684 192333 194000 195804
56466 195804 197627 199127 200355 201783 203450 204680 205061 205235 206066 207393 208247 208178 207779 207867 208662 209846 210953
56449 210953 211482 211090 210020 209148 209230 210083 210796 210768 210296 210051 210258 210636 210958 211263 211554 211666 211579 211532 211639 211696
56429 211696 211594 211632 212077 212663 212889 212690 212416 212241 212001 211660 211579 212193 213628 215587 217442 218555 218817 218839
56411 218839 219268 219935 220130 219658 219074 218717 218174 217120 216233 216581 218275 220355 222073 223652 225533 227433
56395 227433 228745 229619 230988 233381 236205 238488 239951 241021 242073 243117 244121 245170 246308 247595
56381 247595 249293 251574 254052 256051 257453 258804 260428 261908 262667 262666 262316 262146 262767 264560 266952 268535
56365 268535 268505 267657 267375 267945 268463 268157 267150 266042 265344 265335 265949 266787 267596 268611 270009 271260 271671 271481
56347 271481 271695 272814 274364 275807 277216 278799 280369 281705 282952 284293 285580 286666 287799 289306
56333 289306 291113 292911 294640 296445 298254 299765 300899 302040 303669 305864 308263 310495 312592 314917
56319 314917 317702 320752 323581 325771 327220 328204 329159 330269 331301 332062 332912 334396 336441 338468 340353
56304 340353 342558 345092 347209 348692 350630 354026 358208 361669 364104 366518 369483 372544 375461 378849
56290 378849 383052 387337 390830 393591 396221 398991 401951 405449 409855 414981 420299 425611 431146 437157
56276 437157 443799 451189 459160 467018 474001 480160 486557 494421 504129 515084 526525 538318 550907
56263 550907 564706 579843 596464 614850 635073 656966 680717 707152 737075 770640 807647
56252 807647 848006 891476 937421 985527 1036417 1090816 1148393 1208136 1269581 1332675 1396527
56241 1396527 1459360 1519889 1577727 1632120 1681167 1722842 1756109 1780536 1795462 1800206 1794784 1779896
56229 1779896 1756371 1724935 1686396 1641748 1592145 1538763 1482539 1424224 1365014 1306880 1251666
56218 1251666 1199799 1150426 1102751 1056742 1012739 971193 932802 898051 866482 837204 810249
56207 810249 786496 766023 747505 729750 713051 698553 686930 678071 671292 665370 659085 652356
56195 652356 646316 641858 638731 636329 634542 633247 631944 630647 630299 631345 632609 632669 631873 631871 633446 635914
56179 635914 638556 641510 644982 648475 651285 653364 655358 657936 661196 664725 668300 672573 678626 686678
56165 686678 695630 704236 712354 720716 729860 739735 750083 760761 771937 784205 798250 814107 831160
56152 831160 849124 868566 890212 914302 941050 971092 1004888 1042168 1082588 1126541 1174799
56141 1174799 1227833 1286161 1350923 1423336 1503745 1591739 1686782 1787948 1893209 1999529 2103553
56130 2103553 2201821 2290951 2368704 2435041 2491702 2540772 2583775 2621407 2653138 2677173 2691500
56119 2691500 2695198 2688550 2672449 2648333 2618219 2583756 2544952 2500198 2447462 2385171 2312482 2229669
56107 2229669 2138517 2042044 1943874 1847889 1757791 1676151 1603895 1541000 1487333 1442433 1405153
56096 1405153 1374361 1349737 1331211 1317996 1308892 1303256 1300826 1300862 1302323 1304879 1308978 1314927 1322519
56083 1322519 1331526 1341833 1353105 1364890 1377144 1390205 1404249 1419166 1434856 1451262 1468253
56072 1468253 1485807 1504133 1523330 1543243 1563934 1585829 1609038 1633031 1657388 1682268 1707647
56061 1707647 1732759 1756900 1780198 1802981 1825121 1846715 1868626 1891437 1914573 1937402 1960503
56050 1960503 1984790 2010076 2035729 2062093 2089908 2118824 2148008 2177987 2210401 2245922 2283710
56039 2283710 2322930 2363592 2405787 2449195 2493568 2538916 2585251 2632816 2682313 2734013 2787042
56028 2787042 2840509 2895056 2952273 3012935 3076758 3143411 3212575 3283530 3356009 3431123 3510151
56017 3510151 3592801 3677993 3765904 3857796 3954263 4055167 4160826 4271536 4386285 4503809
56007 4503809 4624834 4751483 4884590 5023397 5167807 5318957 5477468 5643118 5816534
55998 5816534 5999462 6193059 6397500 6613426 6842085 7083988 7339172 7608948 7895704
55989 7895704 8200987 8525520 8871025 9240106 9634454 10055279 10505489 10989368 11510351
55980 11510351 12071506 12678107 13337201 14054720 14835874 15688683 16624659 17656368 18797869
55971 18797869 20068168 21491492 23094427 24906971 26967774 29325957 32038477 35170359
55963 35170359 38797965 43006879 47884158 53515243 59987380 67389220 75803982 85306757
55955 85306757 95970288 107872001 121103096 135789612 152117105 170328028 190667581
55948 190667581 213265548 237930522 263858467 289379990 311988112 328806360 337369584
55941 337369584 336350968 325901157 307506237 283494356 256412732 228493544 201362340
55934 201362340 176015846 152965424 132406813 114343697 98665657 85196724 73721152
55927 73721152 63998288 55781684 48840770 42971704 37996565 33762509 30143841 27039445
55919 27039445 24365323 22050541 20037778 18281367 16742095 15385450 14183875 13116400
55911 13116400 12164711 11311706 10543593 9850029 9221372 8648158 8123497 7643381 7203961
55902 7203961 6800537 6429311 6087746 5772828 5481154 5211061 4962396 4733691 4521642
55893 4521642 4323837 4139869 3969100 3809363 3658811 3517418 3385781 3263808 3151250
55884 3151250 3048159 2954100 2868044 2789478 2718306 2653093 2590661 2528165 2464659 2400223 2334721
55873 2334721 2268034 2200582 2132903 2065299 1998163 1931979 1866836 1802712 1740309 1680780 1624503
55862 1624503 1571022 1520214 1472514 1427890 1385707 1345802 1308606 1273905 1240594 1208088 1177017
55851 1177017 1148029 1120827 1094837 1069975 1046129 1022676 999132 975812 953315 931805 911120
55840 911120 891135 871680 852490 833524 815012 797095 779825 763526 748664 735256 722933
55829 722933 711565 701302 691991 683207 674877 667183 659780 651843 643059 633984 625243 616949 609001 601374
55815 601374 593976 586749 579978 573987 568628 563639 559417 556685 555460 555180 555816 557942 561602 566051 570828
55800 570828 576135 581841 587048 591015 593647 594616 592951 588163 581074 572835 563674 553288 541981 530695
55786 530695 520171 510630 502092 494550 487880 481843 476000 469572 461850 453010 444225 436742 431145 427604
55772 427604 426299 427332 430518 435453 441350 446745 449945 450036 447147 441689 433938 424487 414292 403873
55758 403873 393068 381926 371207 361486 352394 343278 334119 325215 316468 307654 299050 291131 283869
55745 283869 276914 270266 264230 258875 254106 250157 247473 246075 245440 245027 244559 243810 242499 240581 238505
55730 238505 237032 236666 237093 237247 236206 234060 231669 229568 227479 224891 221696 218244 215233 213590 213743
55715 213743 214842 215415 215122 215117 216297 218073 219576 221221 223947 227358 229802 230259 229160 227242 224573 221006
55699 221006 216858 212632 208521 204539 200828 197537 194596 191848 189279 186991 185104 183712 182851 182486 182623
55684 182623 183350 184593 186018 187380 188815 190546 192489 194474 196672 199333 202130 204171 204760 203893 202063
55669 202063 199908 197976 196467 195133 193780 192845 193113 194829 197397 200009 202236 204023 205574 207330 209690
55654 209690 212518 215246 217554 219597 221445 222777 223377 223495 223278 222147 219207 214213 207813 200950 194314
55639 194314 188204 182504 176841 171060 165524 160637 156181 151581 146894 143025 140708 139607 138786 137825 137049
55624 137049 136725 136485 135694 134166 132304 130602 129163 127730 126079 124283 122568 121034 119614 118231 116850
55609 116850 115394 113846 112506 111866 112017 112356 112172 111402 110510 109737 108799 107334 105305 102926 100549 98712
55593 98712 97912 98062 98401 98209 97496 96884 96968 97890 99295 100531 101141 101274 101427 101683 101567 100813 99842 99127 98517
55574 98517 97688 96951 97036 98168 99870 101587 103029 103999 104477 104916 105908 107406 108669 109127 108907 108457 108039
55557 108039 107725 107432 106815 105466 103490 101601 100460 100148 100391 100997 101957 103361 105317 107644 109609 110374
55541 110374 109872 108878 108107 107614 107256 107206 107617 108144 108310 108181 108276 108874 109727 110405 110708 110788 110936 111208 111153 110130
55521 110130 107984 105200 102352 99702 97444 95918 95215 94833 94095 92823 91362 90118 89341 89171 89553 90135
55505 90135 90483 90380 89855 89091 88433 88271 88644 89068 88966 88171 86889 85397 84020 83171 83134 83796 84751 85573
55487 85573 85891 85485 84591 83950 84216 85360 86810 88093 89078 89697 89750 89083 87849 86511 85500 84783 83872
55470 83872 82492 81137 80601 80959 81500 81764 82062 82652 83003 82510 81582 81296 82002 82818 82633 81248 79456 78262
55452 78262 78058 78356 78339 77797 77382 77778 78833 79772 80103 79993 79878 79997 80279 80447 80313 80084 80171 80515 80415
55433 80415 79422 78129 77630 78304 79543 80580 81147 81364 81366 81156 80629 79704 78567 77647 77237 77308 77772 78490 78903
55414 78903 78299 76922 76198 77108 78787 79609 79358 79307 80269 81685 82797 83661 84537 85105 84892 83964 82758 81618
55396 81618 80803 80455 80262 79621 78552 77932 78403 79500 80319 80625 80805 81052 81220 81315 81620 82316 83326 84421
55378 84421 85242 85364 84697 83715 83028 82792 82799 82889 82970 82799 82185 81350 80773 80624 80687 80794 81029 81374 81430 80752 79413
55357 79413 78082 77401 77312 77147 76432 75467 74887 74838 74902 74818 74838 75279 76051 76794 77189 77068 76604 76514 77561 79557
55337 79557 81272 81748 81335 80977 80861 80454 79685 79302 79839 80813 81313 81089 80690 80660 80883 80792 80052 78933 78011
55318 78011 77632 77785 78385 79395 80585 81508 81937 82139 82484 82931 83159 83060 82819 82574 82297 82034 82019 82489 83538
55299 83538 85096 86874 88350 89071 89037 88689 88486 88610 89015 89543 89943 89923 89360 88470 87739 87556 87878 88245 88243
55280 88243 87914 87578 87357 87120 86914 87051 87599 88130 88255 88147 88212 88449 88578 88666 89148 90158 91183 91522 90868
55261 90868 89404 87594 86010 85130 85126 85835 86981 88353 89828 91323 92710 93685 93832 93010 91604 90219
55245 90219 89184 88529 88335 88754 89605 90276 90212 89447 88555 88132 88332 88807 89108 89207 89539 90423 91654 92836 93932
55226 93932 95095 96088 96363 95776 94751 93555 91862 89445 86953 85481 85391 85947 86213 86002 85836 86180 86930
55209 86930 87567 87645 87123 86307 85608 85373 85805 86882 88296 89556 90272 90352 89960 89325 88627 87999 87600 87612 88102
55190 88102 88862 89500 89774 89763 89607 89225 88486 87620 87159 87365 87927 88354 88534 88761 89340 90325 91512 92577 93274
55171 93274 93716 94367 95552 97013 98215 99083 100138 101692 103219 103890 103590 103004 102685 102513 102306 102487 103637
55154 103637 105499 106994 107301 106531 105218 103599 101714 99892 98670 98266 98394 98555 98353 97652 96678 95976
55138 95976 95984 96580 97241 97628 97860 98176 98513 98498 97856 96806 96061 96228 97088 97674 97287 96267 95517 95461 95864 96498
55118 96498 97368 98233 98526 98045 97308 96933 96996 97276 97714 98278 98718 98971 99509 100797 102520 103925 104821 105671
55100 105671 106683 107389 107324 106670 105976 105604 105639 105962 106195 105993 105687 106177 107732 109300 109565 108491 107218 106566
55082 106566 106335 106088 105852 105791 105773 105682 105757 106196 106685 106675 105905 104432 102483 100606 99557 99505 99679 99299 98644
55063 98644 98571 99196 99839 100248 101017 102483 104040 104978 105403 105792 106147 106171 105918 105659 105382 105001 104830 105223 105927
55044 105927 106390 106565 106704 106496 105351 103701 103081 104367 106564 107990 108167 107866 107686 107464 107068 106896 107264
55027 107264 107874 108295 108555 108794 108655 107587 105775 104200 103588 103668 103748 103668 103696 103710 103135 101828 100532 100079 100502
55008 100502 101269 102090 102971 103666 103721 103212 102894 103302 104057 104455 104526 105078 106716 109126 111454 113158 114326 115275
54990 115275 116053 116493 116642 116918 117690 118814 119798 120373 120685 120874 120712 119834 118247 116472 115256 115170 116340
54973 116340 118343 120349 121562 121733 121298 120993 121229 121786 122151 122155 122177 122638 123444 124120 124477 124919 125976 127635
54955 127635 129217 129903 129385 128107 126884 126288 126336 126775 127510 128617 130029 131417 132410 132817 132674 132195 131714
54938 131714 131547 131869 132723 134056 135719 137574 139691 142244 145080 147681 149895 152467 156413 161966 168592
54923 168592 175929 184131 193229 202682 211727 219734 226085 230260 232317 232828 231984 229177 223812 216222 207460
54908 207460 198530 190104 182593 175991 169975 164489 159974 156638 153925 151220 148699 146903 145810 144989
54894 144989 144412 144321 144487 144454 144514 145504 147540 149818 151921 154417 157742 161382 164844 168771 174216 181188
54878 181188 188712 196127 203512 210866 217640 223267 227588 230400 231006 228630 223246 215837 207860 200396
54864 200396 193641 187069 180147 172887 165707 158883 152375 146185 140625 136105 132745 130318 128480 126991
54850 126991 125719 124555 123423 122334 121340 120402 119354 118102 116789 115674 114910 114556 114702 115326 116053 116398
54834 116398 116353 116439 117022 117801 118203 118181 118263 118881 119842 120534 120523 119908 119165 118723 118678 118938 119513 120509 121889 123412
54814 123412 124828 125922 126408 126125 125439 125071 125297 125507 124877 123329 121620 120638 120807 121972 123577 125012
54798 125012 126036 126810 127392 127462 126807 125917 125708 126703 128631 130663 131805 131410 129874 128686 129187 131189 133293
54781 133293 134611 135667 137491 140406 143983 147710 151307 154693 158080 161978 166865 172906 180043 188035
54767 188035 196310 204156 211361 218290 225029 230780 234485 235776 234868 231853 226745 220214 213573 207752
54753 207752 202518 196907 190208 182519 174656 167693 162381 158755 156284 154380 152726 151264 150088 149346
54739 149346 149043 148937 148824 148861 149407 150559 152143 154165 156907 160434 164342 168275 172568 178010 184930 192678
54723 192678 200122 206583 212180 217200 221356 223966 224873 224735 224130 222653 219397 214181 207823 201193 194505
54708 194505 187684 180978 174890 169771 165676 162400 159457 156337 153026 150057 147810 146019 144214 142321
54694 142321 140473 138563 136512 134850 134377 135055 135734 135297 133849 132513 132197 132813 133662 134308 134873 135561 136142
54677 136142 136084 135087 133342 131339 129706 129142 130039 131913 133583 134212 133936 133294 132453 131412 130547 130322 130571
54660 130571 130718 130640 130664 130717 130240 129180 128389 128621 129673 130900 132110 133418 134611 135278 135402 135327 135296 135432
54642 135432 136006 137110 138171 138376 137663 136789 136315 136022 135519 134912 134565 134530 134598 134713 134951 135212 135286 135174 135070
54623 135070 135018 134811 134277 133519 132785 132254 131940 131765 131673 131721 132065 132778 133704 134561 135153 135425 135323 134806 134057 133489
54603 133489 133375 133495 133354 132778 132160 132068 132719 133883 135096 135888 135973 135493 134962 134728 134596 134253 133935 134191 134983
54584 134983 135572 135567 135549 136184 137185 137770 137847 137981 138307 138255 137539 136624 135940 135339 134839 135144 136652 138356 138703
54565 138703 137485 136076 135707 136292 137208 138459 140387 142650 144217 144372 143332 141798 140325 139146 138285
54550 138285 137578 136749 135732 134900 134804 135584 136757 137659 138123 138600 139618 141225 143036 144688 146114 147417
54534 147417 148740 150214 151818 153218 153969 154017 153835 153882 154081 154028 153621 153235 153225 153488 153579 153209 152551 152095 152197
54515 152197 152744 153255 153310 152824 151949 150927 150172 150195 151067 152011 151924 150478 148469 146914 146048 145425 144774 144403
54497 144403 144767 145893 147345 148569 149154 148898 147853 146408 145247 145018 145859 147203 148195 148416 148235 148394
54481 148394 149266 150532 151534 151903 151891 152154 153181 154883 156753 158381 159748 160980 161995 162577 162735 162784
54465 162784 163037 163540 164136 164639 164886 164790 164484 164314 164504 164810 164691 163891 162757 161880 161582 161788 162250 162570 162163
54446 162163 160693 158741 157594 157898 158783 158827 157808 156846 156774 157032 156605 155487 154554 154269 154202 153879 153466 153379
54428 153379 153681 154165 154789 155684 156795 157816 158491 158872 159209 159604 159866 159760 159388 159169 159355 159775 160126 160329
54410 160329 160375 160075 159310 158415 157917 157984 158509 159575 161311 163225 164369 164397 163987 163873 163942 163701 163224 163106 163678
54391 163678 164735 165920 166950 167611 167943 168364 169180 170010 170129 169434 168657 168529 169024 169601 169896 170010 170256 170724
54373 170724 171050 170696 169623 168610 168599 169692 171047 171749 171546 170747 169729 168699 167714 166809 166155 166035 166455
54356 166455 166899 166835 166458 166467 167017 167358 166831 165778 165043 164883 164881 164846 165217 166365 167848 168666 168267 167147 166419
54337 166419 166735 167636 168049 167398 166107 164986 164351 163933 163453 162959 162575 162197 161660 161095 160986 161748 163241 164771
54319 164771 165717 166113 166534 167367 168381 169063 169219 169132 169311 170265 172322 175324 178478 180831 182118 182990 184225
54302 184225 185830 187101 187509 187202 186543 185486 183796 181737 180031 179009 178230 177241 176297 175928 176009 175870 175225
54285 175225 174356 173303 171547 168886 166129 164360 163771 163674 163487 163217 163029 162867 162671 162604 162838 163276 163669 163918
54267 163918 164138 164430 164645 164448 163725 162927 162795 163589 164705 165256 164966 164349 164130 164729 166218 168371 170595
54250 170595 171978 171771 169932 167218 164636 162739 161422 160451 160081 160847 162700 164657 165579 165192 164120 163072
54234 163072 162309 161765 161315 160833 160257 159690 159300 159018 158576 157922 157457 157685 158664 159888 160732 161004 161019 161118 161196
54215 161196 160901 160294 159974 160332 160964 161117 160587 159840 159328 159065 158882 158745 158713 158820 159114 159606 160063 160047 159282
54196 159282 157972 156723 156172 156562 157486 158175 158234 158040 158167 158628 159037 159408 160265 161842 163608 164819 165243
54179 165243 165137 164779 164281 163648 162813 161687 160356 159124 158287 157935 157967 158138 158087 157594 156841 156256 156093 156388
54161 156388 157179 158370 159394 159581 159040 158696 159220 160287 161162 161562 161647 161586 161558 161817 162301 162488 162139 161874 162457
54142 162457 163596 164107 163290 161692 160414 160085 160581 161403 162077 162381 162363 162172 161961 161935 162261 162761 162968 162699
54124 162699 162350 162334 162538 162720 163189 164537 166765 169167 171032 172075 172268 171738 170897 170280 170179 170631 171583
54107 171583 172700 173245 172723 171498 170261 169069 167633 166388 166284 167373 168517 168887 168886 169125 169350 169070 168538
54090 168538 168281 168132 167615 166996 167074 168042 169282 170263 170974 171450 171524 171227 170923 170896 171163 171732 172645 173681 174479
54071 174479 175053 175793 176826 177728 178064 177901 177671 177810 178675 180461 182912 185283 186847 187418 187371 187278 187556 188247
54053 188247 189029 189574 189916 190334 190897 191429 191954 192893 194639 197167 200219 203713 207748 212384 217583 223275
54037 223275 229294 235344 241197 246933 252845 259076 265369 271179 276036 279877 283078 286110 289118 291793
54023 291793 293592 294099 293345 291942 290792 290460 290777 291132 290999 290065 288083 285067 281618 278626 276405 274267
54007 274267 271129 266443 260577 254531 249340 245471 242615 240103 237559 235013 232539 230182 228234 227140
53993 227140 226939 227116 227168 226992 226607 225968 225366 225587 227207 229961 233145 236369 239577 242679 245723 249273
53977 249273 254023 260110 267292 275648 285437 296231 306847 316335 324407 330610 333697 332506 327237 319406
53963 319406 310537 301219 291441 281508 272346 264826 258858 253475 247997 242873 239029 236587 234858 233506
53949 233506 233047 233925 235789 238008 240337 242619 244435 245734 247346 250063 253479 256570 259276 262623 267210
53934 267210 272454 277566 282483 287413 292173 296536 300763 305170 309494 313215 316261 318952 321477 323924
53920 323924 326613 329839 333426 337062 340953 345588 350871 356150 361136 366156 371300 376019 380004 383821
53906 383821 388064 392173 394781 395130 393602 390937 387578 383923 380597 378022 375893 373382 369812 365040
53892 365040 359409 353542 348025 343005 338091 332778 326930 320741 314381 307898 301462 295409 289958 285061
53878 285061 280625 276729 273462 270658 267964 265153 262267 259479 256953 254775 252855 250872 248498 245741
53864 245741 242914 240212 237547 234952 232885 231743 231180 230300 228641 226560 224538 222558 220508 218816 218067
53849 218067 218157 218357 218246 218034 217924 217773 217633 217970 218848 219388 218710 217135 215773 215113 214772 214607 215140 216555
53831 216555 218063 218839 219089 219618 220731 222157 223731 225403 226745 227224 227138 227627 229465 232274 235139 237594
53815 237594 239786 242087 244941 248810 253880 259911 266639 274143 282570 291726 301351 311700 323507 337313
53801 337313 353057 370334 388761 407904 426882 444074 457329 464734 465558 460538 451269 439399
53789 439399 426348 413315 401053 389656 378895 368749 359342 350530 342048 334066 327089 321120 315409
53776 315409 309339 303204 297724 293089 288994 285455 282910 281360 279912 277537 274062 270088 266124 262248
53762 262248 258624 255840 254317 253654 252971 251877 250728 249896 249292 248856 249081 250539 253103 256086 259059 262066
53746 262066 265098 267848 270066 271681 272468 272081 270590 268501 266010 262753 258702 254844 252366 251397 251052
53731 251052 250563 249807 248884 247835 246904 246527 246840 247571 248560 250012 252042 254256 256030 256988 257088 256549 255882
53714 255882 255747 256488 257932 259807 262128 264934 267796 270022 271353 272273 273539 275517 277961 280339 282360
53699 282360 284234 286362 288776 291082 293053 295057 297626 300709 303652 305866 307310 308308 309232 310422 312068
53684 312068 313939 315468 316358 316934 317593 318076 317704 316364 314817 313792 313101 312014 310364 308866 308315 308780
53668 308780 309706 310525 310966 310934 310424 309625 309011 309116 310023 311022 310943 309137 306172 303372 301672 301069 301072 301247 301206
53649 301206 300569 299348 298137 297514 297383 297295 297277 297888 299379 301221 302617 303238 303355 303525 304279 305843 307926
53632 307926 309885 311309 312382 313592 315186 317025 318864 320617 322320 323973 325526 327020 328689 330810
53618 330810 333486 336699 340513 344962 349650 353855 357253 360340 363778 367603 371421 375136 378958 382865
53604 382865 386678 390668 395352 400470 404805 407427 408688 409590 410597 411557 412442 413545 414965 416361 417309
53589 417309 417643 417421 416803 415995 415187 414543 414206 414153 413993 413223 411848 410436 409319 408024 405849 402799 399548
53572 399548 396626 394009 391492 389114 387154 385948 385762 386609 388125 389655 390535 390408 389524 388745 388900 389914
53556 389914 390845 390992 390629 390410 390455 390460 390398 390555 391099 392108 393805 396206 398668 400517 402114 404619 408501
53539 408501 412945 417026 420999 425987 432670 440619 448807 456544 464005 471932 480820 490492 500622 511407
53525 511407 523364 536636 550971 566299 582797 600358 618493 636760 654819 672180 688628
53514 688628 704977 722588 741845 761767 781445 801094 821355 842352 864051 886775 910507
53503 910507 934280 957184 979639 1002760 1026632 1050170 1072667 1094640 1117042 1140306 1164289
53492 1164289 1188497 1212169 1234727 1256343 1277661 1298912 1319799 1340221 1360417 1380207 1398806
53481 1398806 1415754 1431513 1446831 1462038 1477285 1492849 1508610 1523632 1536855 1548021 1557427
53470 1557427 1565072 1570586 1573820 1574923 1573868 1570407 1564514 1556417 1546264 1534222 1520936 1507301 1493570
53457 1493570 1479122 1463362 1446463 1428985 1411108 1392655 1373576 1354001 1333901 1313123 1291809
53446 1291809 1270424 1249246 1228110 1206854 1185934 1166397 1149152 1134232 1120791 1107908 1095453
53435 1095453 1084168 1074893 1067886 1062896 1059641 1057922 1057479 1058071 1059740 1062730 1067145 1073004 1080622 1090481
53421 1090481 1102567 1116196 1130792 1146497 1163717 1182357 1201956 1222413 1244051 1267008 1291071
53410 1291071 1316222 1342913 1371508 1401705 1432860 1464808 1498211 1534014 1572585 1613350 1655400
53399 1655400 1698551 1743662 1791727 1842778 1895915 1950246 2005423 2061349 2117905 2175098 2233020
53388 2233020 2291441 2349742 2407437 2464388 2520326 2574499 2626079 2674680 2720250 2762799 2802505
53377 2802505 2839754 2874617 2906506 2934684 2958950 2979503 2996369 3009394 3018607 3024067 3025388 3021792
53365 3021792 3012660 2997595 2976001 2947101 2910562 2866913 2817350 2763396 2706664 2648439 2589298
53354 2589298 2529394 2469178 2409532 2351160 2294229 2238695 2184549 2131581 2079322 2027568 1976678
53343 1976678 1926987 1878146 1829437 1780637 1732267 1685078 1639663 1596596 1556567 1520029 1486788
53332 1486788 1456144 1427526 1400925 1376710 1355059 1335668 1317952 1301391 1285584 1270176 1254946
53321 1254946 1240020 1225792 1212548 1200263 1188803 1178200 1168653 1160288 1153015 1146700 1141529 1138096
53309 1138096 1136947 1137971 1140455 1143817 1148076 1153469 1159901 1167129 1175276 1184753 1195768 1208328 1222732
53296 1222732 1239524 1258773 1279727 1301461 1323668 1346638 1370690 1395805 1421665 1447801 1473775
53285 1473775 1499325 1524273 1548276 1570803 1591504 1610449 1627991 1644462 1659961 1674194 1686438
53274 1686438 1695879 1702157 1705491 1706281 1704748 1700952 1694836 1686148 1674518 1659739 1641850 1620993 1597514
53261 1597514 1572195 1545891 1518683 1489791 1458707 1426133 1393451 1361469 1329974 1298310 1266035
53250 1266035 1233235 1200579 1168977 1138872 1109969 1081884 1054748 1028761 1003439 977913 951881
53239 951881 925662 899370 872823 846459 821498 798659 777259 756236 735721 716915 700513
53228 700513 685924 672102 658618 645726 633814 623041 613194 603653 593714 583181 572421 561648
53216 561648 550447 538330 525542 512905 500963 489742 479253 469639 460683 451756 442635 433915
53204 433915 426147 418911 411348 403390 395834 389178 383042 376861 370594 364458 358493 352744 347493 342892
53190 342892 338627 334400 330490 327366 324819 321994 318400 314468 310966 308135 305633 303168 300921 299324
53176 299324 298539 298227 297850 297169 296348 295620 295026 294559 294308 294237 294008 293312 292332 291555 291111 290586 289572 288165
53158 288165 286846 286106 286280 287431 289108 290428 290822 290649 290744 291346 291848 291736 291317 291174 291218 290807 289734 288551
53140 288551 287800 287386 286880 286023 284632 282483 279754 277303 275955 275620 275589 275479 275352 275035 274129 272886 272335
53123 272335 273096 274559 275656 276065 276215 276412 276584 276729 277053 277509 277565 276672 274877 272869 271392 270590 269930
53106 269930 268795 267020 264741 262056 259214 256906 255613 254697 252957 250380 248477 248321 248991 248814 247567
53091 247567 246495 246393 246782 246975 246960 246930 246764 246401 246208 246549 247349 248342 249389 250320 250855 250944 250908 250966 250942 250642
53071 250642 250241 250038 250085 250276 250569 250864 250944 250805 250811 251211 251666 251610 251009 250457 250543 251351 252570 253848 254911 255554
53051 255554 255716 255652 255922 257004 258816 260713 262066 262767 263055 263082 262924 262867 263223 263791 263880 263067 261690 260453
53033 260453 259787 259710 260018 260358 260312 259720 258886 258273 258023 257909 257747 257702 258141 259128 260134 260376 259588 258374 257586
53014 257586 257441 257462 257215 256790 256546 256712 257357 258392 259465 260058 259884 259072 257962 256986 256736 257702 259657 261588
52996 261588 262620 262905 263337 264478 265982 267062 267372 267315 267595 268511 269753 270854 271629 272108 272343 272588 273409
52979 273409 275074 276919 277850 277517 276548 275633 274997 274869 275651 277221 278683 279417 279891 280838 282025 282654 282768
52962 282768 283422 285285 287677 289265 289360 288287 286839 285672 285071 284966 285004 284690 283682 282166 280816 280125
52946 280125 279728 278731 276820 274739 273485 273306 273671 273937 273781 273255 272741 272627 272794 272636 271828 270774 270007
52929 270007 269486 268860 268123 267504 266939 266199 265446 265151 265395 265669 265404 264452 263141 262153 262220 263511 265328 266637
52911 266637 266833 265830 263801 261276 259142 257876 256998 255824 254619 254238 254786 255497 256027 256912 258427 259794
52895 259794 260111 259490 258746 258384 258422 258827 259575 260406 260970 261110 260797 259971 258803 257870 257660 258001 258277 258117 257632
52876 257632 257092 256694 256612 256989 257794 258800 259707 260211 260079 259342 258401 257860 258150 259243 260642 261691 262053 261952
52858 261952 261904 262341 263524 265507 267821 269446 269609 268600 267320 266089 264519 262534 260699 259198 257237
52843 257237 254057 250047 246237 243075 240334 237890 235892 234256 232747 231613 231470 232377 233505 234028 233925
52828 233925 233658 233418 233114 232940 233453 234905 236730 237980 238265 238090 238149 238492 238643 238465 238560 239691 241975 244794
52810 244794 247423 249701 252129 255219 258594 260952 261245 259750 257549 255114 252063 248341 244782 242082
52796 242082 239924 237652 235297 233287 231580 229819 228119 227006 226692 226920 227378 227765 227679 227078 226667 227145
52780 227145 228193 228912 229200 229859 231245 232646 233303 233335 233304 233403 233488 233426 233054 232233 231297 231057 231962 233548 235010
52761 235010 236019 236782 237673 238982 240592 241663 241285 239744 238487 238274 238140 237019 235689 235838 237461 238637
52745 238637 238136 237017 237039 238490 240452 242396 244398 246098 246654 245982 245170 245247 246021 246578 246533 246298 246286 246331
52727 246331 245971 245014 243699 242479 241729 241533 241665 241857 242075 242426 242782 242722 241973 240775 239677 239059 239052 239761
52709 239761 241261 243293 245190 246321 246595 246516 246715 247369 248047 248236 248064 248303 249440 250915 251662 251359 250744
52692 250744 250645 251075 251489 251592 251566 251704 252163 252985 254113 255391 256741 258242 259902 261432 262490 263110 263691
52675 263691 264544 265600 266525 267052 267244 267503 268170 269052 269519 269286 268843 268856 269314 269671 269652 269486 269401 269438 269844 271061
52655 271061 273048 275010 276148 276356 275909 274853 273170 271268 269716 268534 267188 265321 263090 260787 258568
52640 258568 256718 255774 256107 257541 259572 261788 264004 266148 268174 269966 271326 272330 273702 276342 280218
52625 280218 284076 286672 287979 288663 288624 286891 283130 278636 275279 273728 273102 272206 270710 269112 267948
52610 267948 267221 266458 265205 263440 261593 260161 259370 259246 259828 261119 262817 264341 265295 265849 266523 267615
52594 267615 268966 270291 271519 272692 273690 274400 275129 276463 278521 280613 281953 282573 283215 284461 286305
52579 286305 288503 290836 292918 294156 294245 293507 292515 291588 290780 290106 289495 288749 287796 286885 286212 285501 284283
52562 284283 282521 280659 279044 277587 276091 274667 273734 273647 274351 275296 275737 275273 274133 272925 272191 272241 273121
52545 273121 274434 275354 275155 273802 271862 269965 268516 267771 267763 268195 268714 269318 270202 271259 272117 272677 273280
52528 273280 274246 275560 277005 278229 278689 278039 276748 275860 275897 276378 276702 277082 278202 280222 282550 284473
52512 284473 285693 286375 286958 287876 289191 290562 291656 292426 292829 292592 291494 289688 287491 285108 282797 281004
52496 281004 279912 279038 277706 275894 274241 273345 273302 273859 274643 275303 275719 276058 276464 276902 277500 278673 280487
52479 280487 282241 283270 283920 285053 286689 287927 288264 288191 288312 288646 289152 290209 292012 293975 295329 295994
52463 295994 296375 296639 296720 296779 297054 297342 297123 296234 295005 293730 292360 290752 288896 286853 284741 282861 281545
52446 281545 280788 280216 279514 278762 278265 278209 278601 279430 280658 281981 282735 282345 280929 279268 277975 276929 275768
52429 275768 274687 274188 274183 274016 273555 273545 274504 275834 276573 276626 276692 277326 278625 280615 283303 286470 289946 293913
52411 293913 298433 302886 306612 310074 314548 320562 327396 334334 341532 349127 356185 361271 363770 363990
52397 363990 362167 358051 351651 343935 336477 330435 325913 322289 319126 316632 315148 314401 313709 312864 312353
52382 312353 312542 313124 313639 314164 315188 317053 319797 323195 326687 329621 331936 334311 337241 340285 342640
52367 342640 344201 345483 346732 347751 348540 349474 350691 351842 352567 352881 352965 352989 353248 354101 355601 357492 359699
52350 359699 362479 365968 369870 373738 377307 380490 383303 385911 388487 391031 393634 396858 401316 406772
52336 406772 412271 417417 422997 429942 438149 446849 455741 465207 475654 487190 499813 513390 527541
52323 527541 542017 557073 573035 589558 605786 621201 635912 650169 664174 678351 693279
52312 693279 709174 725898 743488 762108 781375 800381 818681 836730 854969 873017 890154
52301 890154 906126 920925 934253 945897 956323 966122 974942 981750 986203 989047 990978 991790 991064
52288 991064 989132 986742 984060 980567 975889 970291 964345 958500 953090 948443 944774 942092 940326 939513
52274 939513 939811 941342 944032 947513 951257 954992 959103 964528 972113 982033 993884 1007217 1021722 1036890
52260 1036890 1051813 1065735 1078767 1091683 1104948 1118236 1131100 1143717 1156563 1169511 1181762
52249 1181762 1192625 1201908 1209454 1214828 1217808 1218859 1218792 1218110 1216933 1215332 1213338 1210761 1207326 1202972
52235 1202972 1197848 1192176 1186363 1180947 1176027 1170925 1164958 1158487 1152604 1147720 1143112 1138089 1133004 1128716
52221 1128716 1125552 1123269 1121639 1120472 1119368 1118145 1117469 1118453 1121531 1126157 1131621 1137657 1144136 1150717
52207 1150717 1157093 1163289 1169423 1175422 1181137 1186486 1191369 1195768 1200160 1205423 1211957 1219097 1225768 1231580
52193 1231580 1236912 1242121 1247107 1251673 1255802 1259431 1262220 1263751 1263773 1262183 1258959 1254270 1248509 1242054
52179 1242054 1235028 1227374 1219141 1210731 1202863 1196136 1190426 1184867 1178695 1172119 1166096 1161278 1157571 1154761
52165 1154761 1153073 1152764 1153455 1154317 1154847 1155194 1155788 1156960 1158805 1161054 1163070 1164268 1164656 1164754 1164974 1165336 1165848
52148 1165848 1166771 1168339 1170450 1172828 1175281 1177530 1179055 1179452 1178898 1177955 1176955 1175873 1174865 1174545 1175528
52133 1175528 1177897 1181281 1185351 1190076 1195650 1202383 1210637 1220643 1232325 1245452 1260016 1276353 1294789
52120 1294789 1315108 1336469 1357902 1379000 1400103 1421718 1443708 1465197 1485376 1504265 1522513
52109 1522513 1540503 1557970 1574532 1590241 1605376 1619901 1633551 1646437 1659165 1672073 1684561
52098 1684561 1695475 1704088 1710409 1714522 1716005 1714315 1709571 1702580 1694031 1683956 1672172 1659016 1645355
52085 1645355 1631934 1619013 1606725 1595498 1585886 1578024 1571504 1565805 1560749 1556482 1553218 1551193 1550844
52072 1550844 1552708 1556942 1563035 1570245 1578302 1587490 1597992 1609454 1621378 1633681 1646546 1659793
52060 1659793 1672794 1685001 1696279 1706686 1716245 1725108 1733617 1741867 1749332 1755125 1758577 1759417 1757597
52047 1757597 1753272 1746908 1739101 1730203 1720294 1709503 1698141 1686422 1674317 1661737 1648707 1635204
52035 1635204 1621029 1606128 1590986 1576488 1563181 1550686 1537971 1524321 1510094 1496422 1484150
52024 1484150 1473213 1463086 1453544 1444624 1436040 1427229 1418124 1409432 1401782 1394906 1388038 1380893 1373779
52011 1373779 1366764 1359201 1350235 1339495 1327062 1312961 1296897 1278453 1257461 1234204 1209329 1183546
51999 1183546 1157399 1131353 1105970 1081785 1059013 1037523 1017028 997116 977156 956666 935939
51988 935939 916014 897681 880716 864291 847913 831663 815673 799911 784517 769918 756330
51977 756330 743401 730586 717757 705307 693760 683486 674776 668042 663793 662289 663145 665406 668196
51964 668196 671300 674930 679003 682928 686076 688098 688652 687248 683725 678713 673216 667773 662297 656701
51950 656701 651386 646982 643808 641733 640554 640477 642107 645911 651688 658791 666788 675622 684985 693986 701765
51935 701765 708178 713493 717617 720000 720143 717754 712554 704482 694109 682323 669550 655726 641081
51922 641081 626357 612075 598159 584535 571632 559938 549515 540291 532388 525741 519867 514553
51910 514553 510459 508408 508319 509345 510900 512941 515415 518136 521269 525243 529915 534286 537242 538258 537227
51895 537227 534062 528727 521455 512683 502969 493027 483702 475742 469717 466040 464751 465313 466980 469491
51881 469491 473105 477981 483925 490802 498710 507544 516798 526043 535180 543943 551543 557232 560927 562917
51867 562917 563238 561806 558965 555437 551804 548511 546313 546181 548501 552687 557802 563502 570274 578836 589343
51852 589343 601076 612927 624226 634983 645104 653415 657806 656586 649767 638949 625951 611594
51840 611594 595828 578910 562077 546788 533531 521843 511457 502818 496263 491283 487173 483981
51828 483981 482148 481327 480373 478592 476405 474417 472391 469635 466206 463222 461923 462612 464530 466598 468224
51813 468224 469557 471029 472672 473953 474307 473701 472538 471049 469057 466474 463844 462051 461360 461015 460017
51798 460017 458213 456329 454976 453991 452837 451344 449758 448254 446725 445034 443271 441751 440909 441132 442452
51783 442452 444374 446087 446975 446929 446222 445157 443822 442276 440960 440707 442053 444602 447508 450616 454621
51768 454621 459881 465667 471058 476090 481306 486385 490055 491444 490834 488882 485701 481117 475381 469152
51754 469152 462953 456999 451465 446576 442454 439030 436190 433975 432642 432494 433561 435534 438131 441393
51740 441393 445377 449746 454097 458752 464703 472547 481773 491286 500283 508295 514716 518849 520554 520654
51726 520654 520624 521804 524660 528564 532333 535104 536658 536918 535505 532064 526985 521527 517148 514585 513423
51711 513423 512400 510303 506827 502661 498899 496392 495465 495855 496850 497740 498247 498320 497642 495802 493090 490590
51695 490590 489250 489246 490482 493088 496895 500817 503503 504448 503935 502040 498461 493412 488022 483528 480391
51680 480391 478377 477170 476678 477001 478274 480374 482793 485048 487272 490047 493595 497525 501504 505790 510817
51665 510817 516570 522692 528875 534727 539431 541988 541871 539186 534286 527607 519969 512618 506634 502329
51651 502329 499418 497699 497334 498368 500110 501185 500222 496508 490105 481568 471635 461041 450401 440176
51637 440176 430684 422063 414224 407027 400580 395235 391230 388574 387321 387592 389009 390492 391162 391322 392005
51622 392005 393566 395270 396317 396634 396444 395684 394267 392505 390838 389475 388693 388995 390352 391623 391535 390225
51606 390225 389106 389154 390032 391102 392529 394854 398039 401597 405483 410297 416608 424529 433855 444186 454819
51591 454819 464880 473746 481148 486879 490735 492888 494040 494982 496174 497940 500924 506087 514242 525713
51577 525713 540340 557621 576888 597562 619370 642296 666339 691367 717154 743414 769804
51566 769804 796029 821880 847167 871773 896120 921528 949746 981831 1017524 1055626 1094573
51555 1094573 1132392 1166484 1194059 1212970 1222029 1220717 1209074 1187945 1158854 1123257 1082017 1035829
51543 1035829 986046 934809 884347 836280 791484 750330 712876 678943 648224 620487 595716
51532 595716 574090 555747 540509 527855 517191 508120 500444 493960 488388 483451 478987 474961 471441
51519 471441 468486 465960 463441 460456 456897 453146 449732 446902 444560 442470 440422 438275 436019 433759
51505 433759 431507 429028 426106 423000 420343 418407 416751 414829 412751 411075 409963 409013 408011 407366 407563
51490 407563 408522 409803 411134 412401 413320 413634 413517 413331 412974 411914 410019 407929 406391 405435 404400 402604
51474 402604 399879 396740 394147 392848 392669 392623 391896 390534 389002 387456 385852 384518 384046 384595 385687 386753
51458 386753 387593 388326 389305 391110 394191 398310 402701 406991 411663 417415 424419 432474 441487 451385 461842
51443 461842 472670 484340 497508 511856 525828 537643 546337 551764 554158 554033 552222 549471 545902
51430 545902 541029 534300 525523 514941 503112 490802 478838 467959 458690 451191 445197 440283 436315
51417 436315 433504 431971 431448 431563 432208 433416 435053 436961 439254 442131 445396 448524 451248 453776 456343
51402 456343 458938 461677 465091 469661 475232 481244 487547 494587 502678 511427 520248 529398 540130 553632
51388 553632 570039 588736 609526 633060 660066 690705 725056 763819 807792 856627 908696
51377 908696 962363 1016912 1071928 1126194 1177528 1223405 1261339 1289000 1304554 1307095 1296590 1273626
51365 1273626 1239490 1196241 1146190 1091154 1032531 971997 911689 853565 798914 748532 702922
51354 702922 662114 625692 593359 565210 541206 520659 502621 486637 472708 460634 449912
51343 449912 440297 432020 425229 419539 414426 409811 405929 402754 399891 397080 394452 392175 390072 387804
51329 387804 385315 382854 380582 378301 375719 372962 370713 369730 370138 371282 372446 373617 375222 377092 378213
51314 378213 377962 377286 377941 380531 383829 386203 387149 387172 386790 386306 386253 387254 389288 391541 393129 393678 393175
51297 393175 391691 389474 386950 384327 381359 377762 373826 370389 368165 367177 366818 366442 365954 365886 366901 369217
51281 369217 372495 376219 379968 383378 386048 387652 388198 388157 388329 389430 391601 394316 396887 399049 400974
51266 400974 402867 404779 406834 409295 412247 415401 418317 420731 422526 423501 423360 421932 419344 415995 412385
51251 412385 408907 405675 402485 398991 395045 390998 387638 385590 384692 384102 383146 381881 380746 379939 379393
51236 379393 379057 378814 378277 377154 375723 374477 373389 372060 370625 369849 370072 370652 370792 370530 370496 371109 372451
51219 372451 374631 377718 381344 384785 387487 389355 390678 391943 393521 395270 396663 397530 398461 400134 402509
51204 402509 405081 407730 410833 414619 418889 423319 427588 431179 433529 434567 434779 434670 434436 434212 434221 434487
51188 434487 434668 434366 433460 432114 430687 429675 429389 429536 429349 428367 426908 425656 424972 424669 424249 423180 421193
51171 421193 418497 415622 412948 410570 408651 407589 407582 408258 409062 409887 411002 412469 413948 415067 415659 415573
51155 415573 414586 412744 410540 408464 406447 404026 401126 398409 396663 395990 395787 395413 394614 393375 391749
51140 391749 390053 388897 388690 389158 389611 389620 389291 388982 389056 389817 391396 393585 396014 398562 401431 404797 408536
51123 408536 412326 415879 419071 421997 424857 427647 430004 431629 432771 434004 435566 437264 438973 440769
51109 440769 442561 444120 445677 447916 451032 454249 456742 458584 460262 461663 462286 462292 462534 463382 464193 464148
51093 464148 463067 461145 458515 455532 453014 451561 450839 450086 449187 448723 448975 449478 449720 449766 449963 450460 451404
51076 451404 453171 455867 458816 461185 463067 465371 468542 472050 475452 479335 484574 491002 497501 503272
51062 503272 508465 513594 519077 525429 533155 541923 550329 557073 562147 566429 570393 573829 576720 579680
51048 579680 583289 587501 592016 596919 602546 608874 615355 621338 626504 630904 634760 638215 641208 643610
51034 643610 645470 646871 647378 645865 641263 633558 623829 613337 602847 592821 583759 575994 569348 563400
51020 563400 558106 553908 551252 550215 550600 552095 554338 557073 560395 564621 569849 575885 582690 590559
51006 590559 599598 609281 618785 627656 635941 643861 651643 659517 667514 675273 682381 688891 695292 702077
50992 702077 709587 718153 727954 738726 750070 762137 775616 790925 807797 825862 845258 866317
50980 866317 888894 912295 935812 959189 982759 1007226 1033095 1060089 1087314 1114154 1140862
50969 1140862 1168188 1196752 1227005 1259437 1294453 1332169 1372643 1416130 1462745 1512007 1563005
50958 1563005 1614910 1667006 1718357 1767899 1814895 1858987 1899764 1936564 1968767 1996096 2018696
50947 2018696 2037152 2052367 2065089 2075586 2084069 2091342 2098508 2105903 2112645 2117323 2118840 2116554 2110200
50934 2110200 2100093 2087023 2071457 2052948 2030692 2004554 1975095 1942556 1906337 1865715 1820865
50923 1820865 1772779 1722288 1669524 1614517 1558056 1501637 1446583 1393463 1342416 1293710 1247758
50912 1247758 1204851 1165202 1129116 1096767 1067828 1041645 1017851 996514 977630 960770 945434
50901 945434 931485 919000 907866 897814 888825 881260 875444 871212 867929 864990 862290 860192 859064
50888 859064 858971 859804 861508 863986 866937 870045 873333 877143 881797 887467 894279 902292 911390 921491 932818
50873 932818 945582 959355 973230 986842 1000918 1016571 1034310 1053997 1075532 1099150 1125186
50862 1125186 1153908 1185633 1220773 1259744 1303002 1351159 1404853 1464434 1529842 1600891 1677725
50851 1677725 1760953 1851202 1948416 2051733 2160316 2274175 2393732 2518587 2647170 2777683
50841 2777683 2908805 3039124 3166411 3287980 3401397 3504402 3594633 3670268 3730956 3777457
50831 3777457 3810400 3830014 3837167 3834019 3823344 3807645 3789124 3770016 3752525 3738545 3729407 3725411
50819 3725411 3725329 3726703 3726974 3724065 3715848 3699570 3672402 3632473 3579150 3512537 3433045 3341300 3238237
50806 3238237 3125356 3004933 2879657 2751874 2623528 2497088 2375972 2263396 2160908
50797 2160908 2068522 1986035 1913588 1851102 1797941 1753403 1717088 1688580 1667167 1652074 1642656
50786 1642656 1638165 1637642 1640078 1644368 1649057 1652617 1654199 1653755 1651220 1646048 1637849 1627015 1614226 1599658
50772 1599658 1583176 1564967 1545354 1524117 1500683 1475078 1448109 1420410 1391815 1362000 1331380
50761 1331380 1301025 1271944 1244742 1219784 1197287 1177207 1159335 1143602 1130215 1119511 1111801
50750 1111801 1107352 1106310 1108541 1113612 1121108 1131058 1144033 1160743 1181485 1206011 1233955 1265344
50738 1265344 1300654 1340450 1385001 1434147 1487419 1544346 1604732 1668543 1735431 1804497 1874771
50727 1874771 1945842 2017721 2090043 2161671 2231197 2297580 2360149 2418157 2470489 2515638 2551863
50716 2551863 2577650 2592362 2596392 2590623 2576020 2554133 2527735 2500288 2474433 2451301 2431324 2415283
50704 2415283 2404088 2397804 2395412 2395598 2397341 2399591 2400728 2398634 2391185 2376447 2352686 2318825 2275176
50691 2275176 2223487 2165985 2104458 2040400 1975807 1913298 1855184 1802610 1755782 1714943 1680903
50680 1680903 1654689 1636894 1627516 1626227 1632612 1646212 1666647 1693808 1727710 1767872 1812859 1860692
50668 1860692 1909714 1958832 2006916 2052369 2093616 2129873 2161185 2187831 2209976 2227855 2241927
50657 2241927 2252714 2260637 2266043 2269237 2270416 2269643 2266889 2262070 2255256 2247095 2238878 2231931 2226940 2224145
50643 2224145 2223994 2227179 2234052 2244517 2258575 2276506 2298258 2323037 2349760 2377550 2405591 2432916
50631 2432916 2458829 2483309 2506640 2528794 2549432 2568170 2584253 2595893 2600280 2594412 2576133 2544913
50619 2544913 2502292 2451685 2397523 2344249 2295574 2253802 2219350 2191213 2168435 2151025 2139296
50608 2139296 2132648 2129426 2127630 2125366 2121007 2113517 2102478 2087225 2066258 2038115 2002613 1960532
50596 1960532 1912332 1858154 1799138 1737794 1676734 1617588 1561232 1508216 1458631 1412262 1369342
50585 1369342 1330638 1296584 1266944 1241521 1220381 1203001 1188044 1174660 1163435 1155452 1150972 1149666
50573 1149666 1151497 1156602 1164716 1175424 1188565 1203646 1219342 1234503 1249331 1264739 1280895 1297460
50561 1297460 1314971 1334748 1357367 1382446 1410231 1442084 1478745 1519089 1561455 1605599 1652445
50550 1652445 1702268 1753897 1805513 1855570 1902975 1947032 1987490 2024543 2058838 2091616 2124620
50539 2124620 2159447 2196915 2237122 2279975 2325512 2373909 2425461 2480569 2539566 2602597 2669802
50528 2669802 2741541 2818319 2900446 2987727 3079318 3173826 3269618 3365102 3458593 3548005 3630980
50517 3630980 3705467 3770000 3823317 3863941 3890395 3901692 3897488 3877827 3842928 3793251 3729705
50506 3729705 3653876 3568085 3475213 3378415 3280946 3186042 3096727 3015656 2945112 2886910 2841927
50495 2841927 2809854 2789748 2780920 2783003 2795130 2815306 2840550 2867231 2891247 2908437 2915211 2908745
50483 2908745 2886660 2847220 2790318 2717986 2633528 2540188 2440737 2337813 2234092 2132012 2033578
50472 2033578 1940250 1852687 1770699 1693811 1621979 1555630 1495084 1440146 1390243 1344822 1303629
50461 1303629 1266703 1234079 1205516 1180640 1159304 1141574 1127291 1115989 1107274 1100920 1096452 1093136
50449 1093136 1090695 1089575 1090120 1091919 1094502 1098246 1103835 1110941 1118229 1124760 1130825 1137303 1144728 1153170
50435 1153170 1162509 1172517 1183006 1194107 1206145 1219172 1232986 1247695 1263811 1281574 1300621
50424 1300621 1320645 1341973 1365127 1390121 1416695 1445033 1475692 1508835 1544100 1581456 1621769
50413 1621769 1666111 1714605 1766311 1820238 1876104 1933924 1993246 2053183 2113047 2172418 2230486
50402 2230486 2285811 2336983 2383084 2423181 2455744 2479153 2492569 2495752 2488153 2468842 2437474 2394899
50390 2394899 2342724 2282692 2216614 2146457 2074378 2002875 1934801 1872521 1816869 1767409 1724005
50379 1724005 1687648 1659468 1639564 1627230 1621769 1622402 1627670 1635636 1644603 1653054 1659036 1660259 1654996
50366 1654996 1642499 1622535 1595082 1560678 1520659 1476688 1430246 1382710 1335566 1290123 1247016
50355 1247016 1206182 1167364 1130500 1095705 1063105 1032883 1005426 981159 960131 941843 925640
50344 925640 911144 898221 886746 876710 868356 861703 856012 850311 844537 839517 835592 832012 828182
50331 828182 824824 823120 823153 824038 825343 827390 830207 833192 836101 839566 844188 849696 855437 861302 867717
50316 867717 875025 883175 891772 900251 908306 916350 925160 934880 944749 954061 962928 971753 980386 988231
50302 988231 994907 1000387 1004793 1008521 1012283 1016512 1020869 1024763 1028170 1031483 1034799 1037926 1040913 1043964
50288 1043964 1046905 1049433 1052035 1055999 1062351 1071227 1082424 1095889 1111209 1127152 1142187 1155269
50276 1155269 1165725 1172717 1175421 1173790 1168773 1161704 1153661 1145327 1137134 1129299 1121767 1114251 1106468 1098468
50262 1098468 1090699 1083591 1077052 1070586 1063984 1057709 1052487 1048693 1046219 1044663 1043416 1041812 1039558 1037016
50248 1037016 1034879 1033582 1033151 1033497 1034584 1036324 1038511 1040908 1043311 1045575 1047674 1049679 1051601 1053370
50234 1053370 1055072 1057011 1059301 1061516 1062981 1063334 1062614 1060918 1058301 1054962 1051171 1046942 1042087 1036637
50220 1036637 1030956 1025339 1019770 1014181 1008677 1003371 998244 993353 989088 986130 985206 986796 990745 996221
50206 996221 1002492 1009953 1019985 1033547 1050311 1069502 1091179 1116104 1144699 1176861 1212805 1253355
50194 1253355 1299052 1349367 1402978 1458489 1514684 1570526 1625266 1678335 1728824 1775314 1816645
50183 1816645 1852788 1884804 1914039 1941496 1967584 1991769 2012259 2026323 2031218 2024927 2006263 1974739
50171 1974739 1930644 1875244 1810791 1740247 1666789 1593218 1521688 1453919 1391430 1335298 1285745
50160 1285745 1242359 1204896 1173649 1148806 1129569 1114149 1100547 1087299 1073632 1059255 1044091
50149 1044091 1028102 1011292 993929 976713 960570 946130 933320 921446 909672 897577 885407
50138 885407 873919 863978 856243 851053 848352 847666 848306 849792 852011 854916 858137 861095 863419 865121
50124 865121 866358 867272 868065 869054 870529 872649 875536 879332 884051 889466 895288 901423 908065 915543 924095
50109 924095 933621 943577 953291 962547 971800 981670 992305 1003404 1014772 1026565 1038912 1051591 1064318
50096 1064318 1077300 1091321 1107264 1125570 1146147 1168691 1193159 1220025 1250119 1284221 1322787
50085 1322787 1366059 1414237 1467455 1525732 1589201 1658394 1734056 1816571 1905769 2001353 2103178
50074 2103178 2210715 2322320 2435327 2546923 2654786 2757098 2852622 2941151 3023622 3101339
50064 3101339 3175055 3244812 3310117 3369522 3419967 3457118 3476846 3476406 3454440 3410616 3345796 3262286
50052 3262286 3163266 3051820 2930759 2803281 2673243 2544442 2419653 2300483 2188010 2083410
50042 2083410 1988010 1902829 1828087 1763143 1706981 1658759 1617885 1583677 1555179 1531353 1511276
50031 1511276 1494074 1478787 1464523 1450776 1437474 1424666 1412157 1399513 1386335 1372484 1357941
50020 1357941 1342551 1326040 1308321 1289591 1270040 1249634 1228352 1206556 1184949 1164244 1144987
50009 1144987 1127511 1111797 1097481 1084301 1072504 1062506 1054280 1047585 1042813 1040940 1042296 1045826 1050006
49996 1050006 1054095 1058013 1061400 1063614 1064619 1065122 1065521 1065229 1063352 1059684 1054671 1048688 1041780 1034048 1025975
49981 1025975 1018307 1011696 1006411 1002290 999108 997137 997218 1000062 1005505 1012655 1020828 1030240 1041766 1056154
49967 1056154 1073507 1093425 1115544 1140009 1167495 1198833 1234567 1274863 1319815 1369797 1425455
49956 1425455 1487245 1554924 1627492 1703582 1781705 1860011 1936063 2007271 2071784 2128896 2178623
49945 2178623 2221164 2256936 2286921 2312503 2334554 2352457 2363815 2365106 2352818 2324370 2278451
49934 2278451 2215020 2135407 2042491 1940443 1833828 1726548 1621405 1520436 1425429 1338031
49924 1338031 1259350 1189649 1128583 1075707 1030587 992467 960192 932758 909705 890744 875213
49913 875213 862352 852021 844646 840367 838667 838980 841232 845509 851516 858728 866847 875860 885770 896388
49899 896388 907068 916459 922990 926081 926616 925756 923463 918655 910621 899699 886653 872016 856145
49886 856145 839395 822010 804276 786860 770567 755537 741135 726844 712856 699592 687105
49875 687105 675343 664608 655284 647371 640710 635449 631911 630178 630221 632220 636237 641649 647513 653574
49861 653574 660481 668867 678649 689452 701300 714484 728914 743876 758371 771481 782514 791146
49849 791146 797550 802233 805595 807563 807603 805078 799693 791708 781783 770589 758541 745876 732945 720333
49835 720333 708666 698317 689394 682020 676498 673079 671671 671878 673263 675432 678066 681229 685670 692406
49821 692406 701783 713192 725872 739632 754461 769732 784279 797221 808344 817752 825596 832214
49809 832214 838037 843093 846848 848713 848532 846492 842758 837390 830420 821934 812351 802724 794364 787739
49795 787739 781873 775253 767332 758869 750887 743680 736972 730604 724745 719587 715196 711687 709284 708105
49781 708105 708018 708811 710396 712666 715244 717607 719582 721656 724674 729187 735059 741597 748042 754026 759608
49766 759608 764830 769259 772093 772790 771432 768453 764222 759024 753129 746558 738884 729626 718844 707112
49752 707112 694952 682617 670372 658569 647333 636553 626396 617540 610722 606190 603730 602937 603247
49739 603247 603987 604717 605491 606586 608151 610237 612909 616123 619684 623637 628426 634331 640962 647755 654855
49724 654855 663018 672631 683307 694470 705793 716883 727070 735913 743579 750303 755677 758895 759623
49711 759623 758215 755115 750430 744179 736539 727636 717427 706214 695092 685421 677674 671155 665118
49698 665118 659825 656074 653799 651806 649178 646471 645071 645556 647282 649563 652711 657578 664370 672269
49684 672269 680204 687808 695614 704456 714708 726126 738402 751708 766405 782202 797949 812419
49672 812419 825074 835762 843862 848239 848238 844549 838895 832902 827309 822092 817052 812111 807097 801512
49658 801512 794674 786067 775417 762538 747436 730739 713797 698039 684128 671821 660637 650479
49646 650479 641569 633990 627484 621739 616698 612504 609240 606864 605389 604844 604940 604974 604408 603430 602571 601746
49630 601746 600116 597114 593171 589065 584810 579813 574028 568358 563705 560164 557441 555596 554784 554519 553910
49615 553910 552756 551934 552361 553864 555375 556071 556064 556007 556378 557191 558228 559333 560452 561434 561951 561860 561678 562381
49597 562381 564419 567026 568846 569231 568716 568249 568365 569089 570186 571200 571611 571352 571030 571311 572268 573589 575179
49580 575179 577170 579481 581894 584540 587840 591938 596644 602055 608688 616711 625469 634165 642685 651396
49566 651396 660385 669412 678473 687845 697441 706426 713693 718631 721418 722755 723331 723380 722698 721058 718538
49551 718538 715394 711835 708169 705050 703206 702813 703311 703930 704283 704442 704629 704990 705585 706488 707779 709425
49535 709425 711228 713077 715294 718563 723417 729962 738105 747745 758554 769974 781830 794708 809229
49522 809229 825078 841165 856661 871280 884590 895719 904087 910056 914588 918573 922601 926986 931718
49509 931718 936699 942105 948012 953404 956114 954303 947744 937378 924128 908780 892542 876809 862292
49496 862292 848900 836477 825099 814718 805092 796199 788219 781140 774853 769576 765537 762252 758847
49483 758847 755261 752331 750481 749164 748002 747576 748350 749613 750402 750978 752369 754716 757072 758742 759902
49468 759902 760927 762033 763723 766637 770626 774767 778616 782680 787193 791208 793577 794235 793813 792401 789585
49453 789585 785444 780700 775858 770840 765518 760008 754289 748075 741317 734520 728356 723234 719327 716664
49439 716664 715008 713953 713387 713710 715427 718678 723313 729200 736194 743972 752211 760964 770603 781219
49425 781219 792236 802795 812524 821755 830930 839914 847992 854298 858034 858519 855651 850518 845076 840863
49411 840863 838245 837095 837743 840817 846459 854308 864080 875538 887975 900425 912573 924931 937944
49398 937944 951391 964824 978049 990837 1002659 1013133 1022430 1030836 1038119 1043650 1046921 1047690 1045948
49385 1045948 1042164 1037295 1032051 1026230 1019158 1010773 1001885 993417 985767 978983 973234 968922 966439 965900
49371 965900 967056 969514 973036 977447 982163 986120 988462 989238 989211 989123 989316 989783 990196 989942 988481 985670
49355 985670 981583 976237 969799 962882 956209 950026 944200 938835 934372 931072 928745 927013 925511 923906
49341 923906 922074 920246 918589 916675 913779 909685 904814 899595 894296 889480 885966 884047 883189 882765 882693
49326 882693 883215 884580 887203 891486 896985 902244 906064 908756 911666 915701 920738 926201 931627 936742
49312 936742 941466 945894 950004 953495 956265 958896 962153 966053 969820 972804 975055 976982 978840 980716
49298 980716 982736 985070 987850 991062 994369 997120 998824 999621 1000039 1000277 1000033 999140 998069 997600 998086 999183
49282 999183 1000238 1000922 1001549 1002817 1005243 1008864 1013499 1019112 1025804 1033571 1042279 1051795 1062009 1072779
49268 1072779 1083987 1095538 1107230 1118844 1130516 1142779 1155959 1169778 1183904 1198681 1214863
49257 1214863 1232759 1252076 1272519 1293986 1316113 1338002 1358548 1376636 1391008 1400373 1403823 1400918
49245 1400918 1391453 1375735 1355310 1332883 1310984 1290751 1272069 1254609 1238555 1224488 1212726
49234 1212726 1202658 1192881 1182425 1171846 1162691 1155881 1151143 1148061 1146800 1147410 1149229 1151666 1155091
49221 1155091 1160186 1166762 1173917 1181054 1188023 1194501 1200137 1205394 1211413 1218778 1227010 1235515 1244493 1254615
49207 1254615 1266228 1279191 1293126 1307486 1321628 1335146 1348086 1360783 1373688 1387296 1401811
49196 1401811 1416697 1430860 1443548 1454904 1465543 1475882 1486103 1496403 1506952 1517738 1528752
49185 1528752 1540198 1552289 1564942 1577897 1591022 1604355 1618084 1632812 1649684 1669897 1693932
49174 1693932 1721553 1752597 1787497 1826745 1869692 1913795 1955000 1989089 2013122 2026167 2029188
49163 2029188 2024533 2015364 2004983 1995999 1989769 1986412 1985318 1985774 1987417 1990283 1994440 1999698 2005809 2012817
49149 2012817 2020832 2029472 2037996 2046145 2054431 2063293 2072423 2081324 2090189 2099663 2109918 2120669 2132037
49136 2132037 2144753 2159190 2174611 2189702 2203643 2216550 2229170 2242270 2256072 2270112 2283899
49125 2283899 2297831 2313089 2330418 2349343 2368884 2388741 2409378 2431235 2454479 2479495 2507115
49114 2507115 2538089 2572661 2610897 2653257 2700631 2753934 2813701 2879727 2950562 3023294 3094290
49103 3094290 3160818 3222276 3279687 3333557 3381726 3419119 3439739 3439597 3418644 3380638 3331141 3274961
49091 3274961 3214649 3150871 3083902 3014747 2945267 2877894 2815432 2760513 2714530 2676964 2646059
49080 2646059 2620271 2598923 2581621 2567516 2555406 2544347 2533926 2524032 2514524 2505148 2495655 2486032
49068 2486032 2476577 2467733 2459797 2452835 2446782 2441500 2436694 2431926 2426803 2421162 2415156 2409267 2404069 2399734
49054 2399734 2395763 2391411 2386452 2381325 2376564 2372408 2369034 2366729 2365521 2364987 2364790 2365234 2366837 2369493 2372598
49039 2372598 2376063 2380728 2387530 2396620 2407528 2419896 2433654 2448620 2464278 2479937 2494811 2507872
49027 2507872 2517937 2524194 2526716 2526416 2524484 2521814 2518820 2515671 2512584 2509915 2508057 2507336 2507994 2510206
49013 2510206 2514104 2519826 2527438 2536612 2546425 2555794 2564375 2572917 2582483 2593317 2604646 2615560 2625804
49000 2625804 2635594 2644901 2653231 2660162 2665856 2670849 2675375 2679098 2681647 2683230 2684434 2685435 2685746 2684990
48986 2684990 2683618 2682442 2681508 2679936 2677055 2673323 2669807 2666849 2663577 2658689 2651582 2642790 2633511 2624756
48972 2624756 2616781 2609259 2601975 2595175 2589238 2584292 2580407 2577935 2577290 2578479 2581160 2585175 2590670 2597653
48958 2597653 2605807 2614854 2624832 2635898 2648127 2661569 2676121 2691218 2706133 2720899 2736550 2753979
48946 2753979 2772875 2792224 2811595 2831414 2852177 2874112 2897619 2923318 2951400 2981436 3013191
48935 3013191 3047222 3084309 3124583 3167539 3212701 3259946 3309341 3360959 3414775 3470580 3528130
48924 3528130 3587549 3649414 3714149 3781426 3850354 3920093 3990001 4059318 4127118 4192687 4255795
48913 4255795 4316608 4375510 4432910 4488941 4543321 4595678 4645987 4694433 4740851 4784639 4825340
48902 4825340 4863099 4898357 4931300 4961802 4989793 5015494 5039314 5061624 5082586 5102048 5119545
48891 5119545 5134521 5146639 5155902 5162440 5166254 5167237 5165477 5161406 5155457 5147466 5136472 5121207 5100868
48878 5100868 5075514 5045807 5012369 4975328 4934440 4889597 4841051 4789076 4733689 4675060 4614109
48867 4614109 4552237 4490420 4428880 4367713 4307384 4248394 4190856 4134707 4079955 4026483 3974036
48856 3974036 3922850 3873872 3827773 3784109 3742163 3702314 3665711 3632629 3602153 3573726 3548118
48845 3548118 3526366 3508446 3493558 3481140 3470984 3462822 3456608 3453058 3453135 3456923 3463456 3471745 3481565
48832 3481565 3493252 3507102 3523102 3540949 3560218 3580672 3602403 3625545 3649920 3675185 3701246
48821 3701246 3728230 3756141 3784786 3814011 3843675 3873468 3903127 3932865 3963236 3994446 4026067
48810 4026067 4057576 4088858 4120068 4151313 4182718 4214580 4247154 4280471 4314572 4349774 4386320
48799 4386320 4423719 4460767 4496455 4530718 4564118 4596814 4628094 4657017 4683311 4707341 4729154
48788 4729154 4747963 4762841 4773694 4781126 4785351 4785742 4781662 4773401 4761903 4747728 4730668 4710408
48776 4710408 4687218 4661815 4634808 4606463 4576881 4546041 4513622 4479116 4442297 4403426 4362795
48765 4362795 4320297 4275792 4229839 4183520 4137317 4090519 4042123 3992124 3941605 3891708 3843073
48754 3843073 3796225 3751930 3710712 3672192 3635261 3598986 3563284 3528831 3496433 3466482 3438888
48743 3438888 3413515 3390609 3370718 3354161 3340671 3329638 3320557 3313165 3307208 3302238 3297692 3293170
48731 3293170 3288626 3284297 3280462 3277267 3274762 3272897 3271465 3270251 3269471 3269906 3272220 3276182 3280839 3285429
48717 3285429 3289743 3293545 3296272 3297734 3298735 3300497 3303573 3307750 3312868 3319118 3326467 3334334 3342198 3350202
48703 3350202 3358889 3368538 3379006 3389966 3401018 3411701 3421817 3431714 3441912 3452443 3462831 3472647
48691 3472647 3481600 3488996 3493691 3495093 3494044 3492222 3490694 3489438 3488200 3487232 3486871 3486772 3485997 3483798 3480005
48676 3480005 3474662 3467581 3458391 3446954 3433687 3419471 3405119 3390765 3375778 3359447 3341758 3323423
48664 3323423 3305192 3287256 3269252 3250643 3231031 3210235 3188166 3164514 3138539 3109321 3076363
48653 3076363 3040020 3001380 2961900 2923145 2886578 2853138 2822742 2794249 2766172 2737722 2709196
48642 2709196 2681320 2654283 2627592 2600791 2574003 2547625 2521836 2496609 2471950 2447696 2423235
48631 2423235 2397887 2371521 2344491 2317020 2289118 2261122 2233791 2207723 2183155 2160512 2140565
48620 2140565 2123643 2109164 2096432 2085552 2077028 2070838 2066593 2064329 2064202 2065284 2065605 2063881 2060604
48607 2060604 2056919 2052962 2047997 2041868 2035459 2029671 2024651 2020285 2016845 2014560 2012805 2010244 2005879 1999653
48593 1999653 1992007 1983169 1973100 1961910 1950061 1938156 1926690 1915956 1905960 1896405 1886961 1877727
48581 1877727 1869315 1862329 1856786 1852228 1848384 1845604 1844491 1845159 1846933 1848922 1850926 1853791 1858738 1866289
48567 1866289 1875788 1885894 1895421 1903704 1910296 1914541 1915561 1912693 1905919 1895836 1883274 1869114 1854435
48554 1854435 1840445 1827788 1816011 1804044 1791223 1777521 1762837 1746642 1728600 1709094 1688818
48543 1688818 1668199 1647586 1627612 1608810 1591072 1574082 1558154 1544107 1532351 1522624 1514664 1508500
48531 1508500 1504033 1500911 1499073 1498876 1500397 1503169 1506910 1512112 1519436 1528925 1540120 1552487 1565164
48518 1565164 1576557 1584831 1588816 1588210 1583293 1575111 1565728 1557536 1551996 1549303 1549173 1551435 1555871 1562065
48504 1562065 1569672 1578443 1587778 1596633 1604175 1610400 1616067 1622202 1629580 1638101 1646279 1651591 1651684 1645387
48490 1645387 1632755 1614677 1592644 1568437 1543526 1518737 1494588 1471751 1450956 1432668 1417037
48479 1417037 1404006 1393298 1384441 1377008 1370760 1365531 1361220 1357937 1355786 1354423 1353321 1352765 1353973 1357658
48465 1357658 1362840 1367787 1372019 1376684 1382982 1390859 1399358 1407573 1414907 1420872 1425181 1427900 1429253 1429311
48451 1429311 1428004 1425392 1421859 1418106 1414851 1412243 1409531 1405582 1399823 1392525 1384248 1375333 1365965 1356342
48437 1356342 1346575 1336710 1327037 1318230 1310969 1305508 1301566 1298505 1295665 1292870 1290587 1289287 1288621 1287685
48423 1287685 1286084 1284191 1282215 1279670 1276150 1272005 1267674 1262871 1257111 1250700 1244450 1238588 1232775 1227155
48409 1227155 1222494 1218997 1215731 1211647 1206722 1201650 1196789 1191944 1186921 1181803 1176674 1171459 1166064 1160432
48395 1160432 1154414 1147821 1140595 1132799 1124431 1115511 1106367 1097569 1089437 1081793 1074421 1067524 1061398 1055743
48381 1055743 1049827 1043541 1037836 1033682 1030885 1028412 1025685 1022919 1020245 1017351 1014336 1012155 1011565 1012014
48367 1012014 1012333 1012233 1012385 1013079 1013595 1013136 1011790 1010267 1009079 1008303 1007751 1007011 1005520 1002973 999643 996107
48351 996107 992743 989632 986782 984171 981553 978467 974635 970305 966088 962367 958887 955118 950997 947156
48337 947156 944235 942122 940035 937348 934202 931457 930115 930628 932493 934599 936132 937100 937917 938808 939873
48322 939873 941396 943582 946085 948274 949929 951273 952346 952803 952360 951007 948812 945991 943215 941304 940403
48307 940403 939844 939008 937982 937256 937156 937707 938823 940556 943437 948282 955129 962570 969070 975009 982401
48292 982401 992265 1003296 1013717 1023520 1034017 1046002 1059408 1074259 1090774 1108650 1127255 1146551
48280 1146551 1167055 1188906 1211742 1235493 1260422 1286206 1311693 1335900 1358711 1380387 1400902
48269 1400902 1420116 1438271 1456054 1474352 1494021 1515638 1539383 1565261 1593327 1623434 1655024
48258 1655024 1687670 1721783 1758412 1798436 1842374 1890842 1944672 2004726 2072235 2149382 2239016
48247 2239016 2343828 2466319 2609655 2777969 2975784 3207595 3478031 3791858 4153657
48238 4153657 4567751 5038154 5568377 6162426 6827763 7577821 8431237 9408727 10528395
48229 10528395 11793944 13170520 14558888 15793879 16683046 17070112 16887425 16171770 15043355
48220 15043355 13663739 12190582 10744549 9398038 8183915 7111681 6179232 5378181
48212 5378181 4696767 4122229 3641629 3241522 2908437 2630282 2397034 2200323 2033154
48203 2033154 1890087 1767033 1660560 1567678 1486211 1414791 1352166 1296821 1247375 1203004 1163190
48192 1163190 1127257 1094396 1064057 1036129 1010769 988094 968007 950201 934362 920410 908482
48181 908482 898635 890651 884181 879012 875108 872419 870793 870092 870194 870675 870583 868748 864470 857808 849267
48166 849267 839416 828866 818273 808060 798244 788774 779964 772372 766334 761861 758877 757212 756387 755780
48152 755780 755121 754592 754354 754262 754122 753909 753658 753460 753666 754668 756247 757543 757994 757989 758167 758439 758263 757663 757336
48133 757336 757761 758813 760349 762524 765269 768042 770555 773337 777063 781561 785999 789963 793859 798184
48119 798184 802899 807676 812448 817418 822695 828156 833668 839304 845327 852030 859620 868162 877582 887640
48105 887640 897962 908255 918570 929275 940615 952434 964433 976593 989138 1002182 1015700
48094 1015700 1029761 1044449 1059482 1074216 1088226 1101744 1115404 1129736 1144917 1160739 1176628
48083 1176628 1191888 1206120 1219294 1231409 1242463 1252927 1263767 1275510 1287505 1298588 1308362
48072 1308362 1317330 1325933 1334151 1342158 1350703 1360413 1371097 1382099 1393033 1403813 1414181 1423604 1431548
48059 1431548 1437595 1441418 1443026 1442979 1442007 1440280 1437253 1432274 1425177 1416233 1405683 1393577 1380096 1365891
48045 1365891 1351849 1338333 1324727 1310024 1293898 1276940 1259741 1242077 1223302 1203324 1182855
48034 1182855 1162815 1143784 1125824 1108434 1090758 1072377 1054005 1036918 1021474 1006599 990995
48023 990995 974505 957925 941903 926584 912166 899062 887318 876455 866178 856881 848991 842118
48011 842118 835383 828460 821825 815928 810661 805838 801712 798585 796243 794248 792676 792025 792334 792828 792705
47996 792705 791939 791090 790575 790464 790839 791958 793867 796080 797845 798858 799601 800866 802838 804738 805564 805167
47980 805167 804370 803983 803974 803765 803009 801767 800034 797593 794482 791302 788764 786983 785439 783636 781570 779492
47964 779492 777414 775130 772666 770354 768352 766387 764243 762303 761134 760579 759741 758069 756137 755074 755491
47949 755491 757201 759801 763061 766818 770898 775308 780270 785887 791921 798028 804131 810405 816895 823322
47935 823322 829356 835024 840723 846781 853073 859149 864576 869116 872679 875282 876972 877672 877169 875455 872924
47920 872924 869998 866649 862641 858087 853324 848229 842181 834885 826813 818664 810801 803462 796951 791209
47906 791209 785622 779730 773943 769105 765615 763372 762250 762085 762423 762916 763887 765904 768793 771655 773962
47891 773962 776187 779259 783843 790114 797737 805873 813702 821148 828755 836777 844880 852863 861082 869751
47877 869751 878269 885765 892059 897603 902557 906433 908798 910015 910982 912090 912646 911492 908245 903620 898450
47862 898450 892738 886067 878625 871195 864228 857543 850984 844733 838771 832671 826239 819812 813576 807154
47848 807154 800362 793934 788855 785296 782705 780724 779458 778997 779274 780378 782497 785518 789040 792831 796872
47833 796872 801023 805061 809116 813624 818745 824158 829572 835076 840839 846791 852856 859287 866508 874711
47819 874711 883807 893737 904666 916897 930710 946297 963753 982994 1003646 1025150 1047123 1069561
47807 1069561 1092490 1115416 1137370 1157598 1175910 1192195 1205854 1216036 1222226 1224290 1222126 1215707
47795 1215707 1205442 1192143 1176614 1159557 1141806 1124132 1106703 1089160 1071546 1054815 1040109
47784 1040109 1027794 1017571 1009356 1003515 1000182 998782 998502 998914 999863 1000949 1001647 1001942 1002395 1003348 1004350
47769 1004350 1004658 1004084 1003019 1001794 1000442 999017 997694 996474 995134 993522 991570 989024 985661 981890
47755 981890 978579 976043 973729 971273 969265 968397 968275 967819 966689 965590 965224 965575 966314 967349 968856 971210
47739 971210 974973 980428 987048 993937 1000992 1009152 1019224 1030850 1042907 1054521 1065329 1075096 1083550
47726 1083550 1090552 1096139 1100450 1103756 1106373 1108310 1109105 1108223 1105510 1101160 1095385 1088365 1080309 1071311
47712 1071311 1061197 1049802 1037401 1024618 1011846 998941 985613 972021 958853 946829 936197
47701 936197 926732 918152 910391 903551 897823 893553 891060 890131 889900 889635 889566 890593 893202 897149 902206
47686 902206 908678 916832 926250 936170 946278 956772 967807 979238 990882 1002720 1014721 1026641
47674 1026641 1038097 1048788 1058612 1067611 1075769 1082893 1088793 1093496 1097050 1099098 1099020 1096695 1092925 1088754
47660 1088754 1084477 1079503 1073110 1065169 1056191 1046909 1037792 1028810 1019699 1010589 1002302 995910 991938 990063
47646 990063 989557 989923 991191 993698 997616 1002739 1008824 1016087 1025117 1036313 1049640 1065006 1082627 1102814
47632 1102814 1125646 1150997 1178634 1208064 1238586 1269804 1301971 1335523 1370406 1406073 1441837
47621 1441837 1476790 1509521 1538449 1562529 1581276 1594113 1600114 1598518 1589134 1572126 1547844 1517132
47609 1517132 1481424 1442060 1399604 1354140 1306213 1257174 1208526 1161213 1115695 1072469 1032147
47598 1032147 994987 960654 928718 899235 872626 849036 828150 809615 793295 778962 766132
47587 766132 754407 743733 734083 725141 716635 708748 701840 695957 690921 686702 683260 680182 676936 673441
47573 673441 669968 666604 663332 660525 658720 657805 657087 656351 656203 657049 658321 659218 659699 660199 660749 661042 661216
47556 661216 661881 663321 665114 666618 667506 667784 667657 667486 667606 668084 668787 669645 670618 671423 671630 671157 670461 670086
47538 670086 670176 670489 670749 670870 670896 670831 670588 670148 669808 670100 671306 673078 674728 675922 676952 678392 680572
47521 680572 683328 686051 688023 688933 689114 689211 689608 690347 691441 692871 694232 694802 694296 693310 692653 692280 691217
47504 691217 688579 684459 679753 675357 671678 668686 666089 663473 660556 657462 654597 652132 649787 647301
47490 647301 644955 643317 642508 642044 641471 640929 640916 641702 643117 644773 646352 647824 649477 651603 654096 656586
47474 656586 659037 661880 665391 669289 673247 677461 682250 687277 691667 694855 696961 698423 699673 701105
47460 701105 702843 704465 705365 705472 705215 704873 704530 704735 706451 710060 714979 720708 727691 736640 747470
47445 747470 759593 772949 788106 805397 824526 844957 866199 887760 909381 931363 954139
47434 954139 977449 1000368 1022130 1042367 1060455 1075352 1086511 1094463 1100110 1103734 1105094 1104161 1101276
47421 1101276 1096724 1090653 1083317 1074939 1065334 1054174 1041778 1029214 1017329 1005958 994407 982524
47409 982524 970922 960209 950315 940696 930913 920838 910585 900506 891130 882766 875127 867637 860130
47396 860130 853018 846670 840983 835785 831408 828509 827434 828003 829830 832577 835911 839470 842992 846425
47382 846425 850010 854253 859575 865776 872103 878138 884330 891192 898200 904087 908169 910799 912508 913387
47368 913387 913473 912958 911585 908464 902980 895532 886902 877384 867017 856205 845303 833855 821043 806946
47354 806946 792703 779366 767150 755848 745301 735272 725423 715805 706927 699060 691875 685066 678924
47341 678924 673867 669720 665965 662529 659835 658106 657035 656196 655382 654466 653354 652283 651948 652948 655201
47326 655201 658103 661220 664525 667915 670825 672626 673333 673672 674445 676019 678379 681315 684373 686900 688414
47311 688414 688854 688365 687033 685050 682871 680881 679017 677047 675094 673505 672333 671367 670635 670337 670266 669928
47295 669928 669543 670312 673161 677588 682260 686521 690759 695492 700797 706759 713795 722060 730902 739371 747227
47280 747227 755099 763609 772600 781344 789280 796380 802952 809349 815895 822716 829483 835523 840491 844794
47266 844794 849055 853194 856394 858088 858660 858989 859530 859960 859540 857617 854000 849087 843583 837925 832106
47251 832106 826151 820500 815628 811433 807381 803225 799278 795946 793325 791442 790618 791267 793359 796278 799301
47236 799301 802120 804844 807672 810788 814541 819368 825277 831619 837726 843659 850010 856997 864238 871494
47222 871494 879098 887395 896127 904755 913090 921262 929266 936909 944043 950476 955782 959513 961556 961998
47208 961998 960900 958503 955490 952560 949863 947160 944410 941757 939229 937069 936214 937651 941118 945039
47194 945039 947913 949251 949124 947571 944822 941375 937395 932633 927517 923706 922831 925012 929330 935375 943475
47179 943475 953583 965016 977527 991781 1008273 1026282 1044414 1061951 1079273 1097041 1115216
47168 1115216 1132899 1149015 1163182 1175840 1187386 1197363 1204835 1209470 1211804 1212392 1211207 1208008 1202838
47155 1202838 1195875 1187210 1177186 1166622 1156261 1146165 1136003 1125719 1115472 1105183 1094761 1084836
47143 1084836 1076605 1070618 1066052 1061554 1056686 1052314 1049670 1049241 1050540 1052824 1055941 1060376 1066385 1073257
47129 1073257 1079739 1085247 1090299 1095639 1101193 1106154 1109898 1112478 1114272 1115418 1115550 1113908 1109668 1102503
47115 1102503 1092941 1082087 1070886 1059668 1048338 1036859 1025530 1014893 1005326 996623 988001 978699
47103 978699 968568 958010 947477 937260 927646 918835 910616 902496 894419 887022 880888 875799 871044
47090 871044 866335 862057 858734 856638 855822 856077 856808 857365 857752 858675 860727 863731 867148 870821 874946 879453
47074 879453 883801 887507 890568 893224 895452 896904 897320 896905 896215 895650 895103 894157 892603 890618 888435 886101
47058 886101 883730 881782 880737 880546 880769 881366 882994 886293 891120 896766 902771 909174 916028 923120 930285
47043 930285 937683 945540 953801 962281 970981 979975 989040 997687 1005589 1012786 1019450 1025674 1031561 1037305
47029 1037305 1043062 1048884 1054916 1061476 1068735 1076389 1083791 1090383 1095927 1100453 1104158 1107355 1110261 1112714
47015 1112714 1114192 1114236 1112928 1110882 1108665 1106247 1103143 1099145 1094617 1089891 1084683 1078663 1072515 1067639
47001 1067639 1064462 1061670 1057699 1052637 1047999 1044916 1043324 1042872 1043695 1045927 1049097 1052534 1056090 1060087
46987 1060087 1064796 1070271 1076453 1083158 1090193 1097705 1106218 1116038 1126873 1138291 1150231 1162710 1175298
46974 1175298 1187459 1199278 1211315 1223735 1236065 1247868 1259184 1270114 1280403 1289710 1297968 1305239
46962 1305239 1311456 1316607 1320979 1324904 1328287 1330665 1331731 1331658 1330920 1329959 1329074 1328523 1328557 1329333 1330777 1332594
46946 1332594 1334506 1336507 1338890 1342095 1346469 1352000 1358126 1363991 1369159 1374055 1379448 1385579 1392123 1399001
46932 1399001 1406715 1415609 1425113 1434138 1442063 1449057 1455516 1461586 1467223 1472432 1477275 1481726 1485529 1488081
46918 1488081 1488589 1486590 1482298 1476319 1469111 1460902 1451980 1442614 1432682 1421893 1410558 1399760 1390466
46905 1390466 1382783 1376370 1371245 1367701 1365636 1364624 1364728 1366692 1371105 1377753 1386138 1396282 1408649 1423425
46891 1423425 1440301 1458870 1478882 1500072 1522049 1544458 1566945 1588844 1609232 1627628 1644438
46880 1644438 1660378 1675526 1689304 1701399 1712202 1722071 1730512 1736631 1740400 1743039 1745942 1749521 1753332
46867 1753332 1757101 1761268 1766511 1773042 1780562 1788786 1797879 1808308 1820316 1833553 1847255 1860769 1873833
46854 1873833 1886441 1898601 1910312 1921553 1932109 1941544 1949488 1955797 1960272 1962514 1962455 1960833 1958582
46841 1958582 1955754 1951586 1945766 1939042 1932322 1925729 1919032 1912584 1907222 1903395 1900947 1899698 1899785 1901419
46827 1901419 1904728 1909850 1916822 1925392 1935313 1946831 1960416 1975893 1992226 2008330 2023777 2038582
46815 2038582 2052682 2065911 2078253 2089778 2100373 2109617 2116857 2121409 2122987 2122036 2119458 2115829 2111027
46802 2111027 2104658 2096621 2087236 2077111 2066993 2057480 2048627 2039980 2031082 2021846 2012489 2003496 1995619
46789 1995619 1989405 1984503 1979882 1975100 1970980 1968611 1968007 1968188 1968303 1968157 1967738 1966868 1965437 1963732 1962387
46774 1962387 1962107 1963244 1965454 1967862 1969854 1971543 1973338 1975450 1978119 1981873 1986988 1992980 1999321 2006422
46760 2006422 2015186 2025652 2036974 2048822 2061907 2076803 2093038 2109811 2126922 2144385 2161682
46749 2161682 2178144 2193712 2208671 2222858 2235847 2247779 2259271 2270413 2280481 2288818 2295509 2300934
46737 2300934 2305143 2308075 2310113 2311975 2314046 2316115 2317820 2319149 2320409 2321914 2323925 2326831 2331079 2336720
46723 2336720 2343134 2349468 2355346 2360986 2366631 2372091 2376915 2380705 2383202 2384243 2383805 2381895 2378293 2372595
46709 2372595 2364646 2354639 2342662 2328499 2312141 2294065 2274539 2252945 2228471 2201410 2173108
46698 2173108 2144556 2115751 2086649 2057989 2030570 2004213 1978180 1952341 1927220 1902907 1878780
46687 1878780 1854562 1831069 1809428 1789932 1772089 1755504 1740237 1726380 1713794 1702274 1691592
46676 1691592 1681295 1670862 1660330 1650425 1641899 1634901 1629194 1624702 1621472 1619287 1617759 1616839 1616936 1618415
46662 1618415 1621239 1625219 1630410 1637082 1645334 1654811 1664788 1674586 1684022 1693460 1703306 1713416 1723067 1731460
46648 1731460 1738095 1742796 1745779 1747823 1750048 1753159 1756940 1760610 1763626 1766094 1768591 1771873 1776644 1783348
46634 1783348 1792048 1802644 1815196 1829930 1846896 1865794 1886142 1907488 1929311 1950900 1971567
46623 1971567 1991013 2009275 2026181 2040977 2052676 2060715 2065059 2065771 2062836 2056526 2047545 2036469 2023267
46610 2023267 2007712 1990113 1971212 1951446 1930860 1909791 1889113 1869449 1850549 1831850 1813419
46599 1813419 1795915 1779708 1764518 1750007 1736317 1723802 1712429 1701725 1691284 1681079 1671231
46588 1671231 1661689 1652372 1643521 1635575 1628574 1621958 1615149 1608093 1601015 1593914 1586734 1579857 1573818 1568499
46574 1568499 1563128 1557297 1551500 1546405 1542059 1538178 1534801 1532229 1530535 1529663 1529815 1531234 1533600 1536089
46560 1536089 1538102 1539658 1541096 1542706 1544722 1547397 1550945 1555479 1560929 1566962 1573158 1579517 1586652 1595142
46546 1595142 1604757 1614672 1624400 1634189 1644492 1655460 1667109 1679636 1693308 1708131 1723763 1739769
46534 1739769 1755987 1772778 1790819 1810498 1831578 1853629 1876603 1900692 1925749 1951330 1977335
46523 1977335 2004205 2032319 2061485 2091103 2120534 2149235 2176856 2203344 2228659 2252302 2273526
46512 2273526 2292142 2308690 2323564 2336411 2346738 2354747 2361025 2365662 2368218 2368493 2366847 2363788 2359697
46499 2359697 2355031 2350323 2345730 2340830 2335010 2327880 2319275 2309248 2298248 2287004 2275837 2264184 2251100
46486 2251100 2236213 2219912 2202583 2183989 2163576 2141212 2117385 2092758 2067693 2042212 2016165
46475 2016165 1989336 1961535 1932841 1903806 1875284 1847924 1821845 1796913 1773351 1752001 1733807
46464 1733807 1719043 1707217 1697785 1690803 1686664 1685446 1686793 1690373 1696085 1703787 1713241 1724465 1737700
46451 1737700 1752733 1768584 1784193 1799172 1813585 1827308 1840043 1851673 1862057 1870683 1877112 1881689
46439 1881689 1885149 1887510 1888049 1886568 1883949 1881108 1877989 1874067 1869354 1864326 1859237 1854154 1849510 1846014
46425 1846014 1843994 1843376 1844386 1847811 1854281 1863565 1874769 1887115 1900412 1914974 1931380 1950280 1972173
$$ [...]
##END NTUPLES=NMR SPECTRUM
##END=
