##TITLE=AC1474_ZNESNA300_8100857_HIgwmcBgB9
##JCAMPDX= 6.0         $$ Bruker NMR JCAMP-DX V2.0
##DATA TYPE= NMR SPECTRUM
##DATA CLASS= NTUPLES
##ORIGIN= BRUKER
##OWNER= Administrator
$$ 1.72 TOPSPIN		Version 2.1
$$ 2013-07-31 15:25:28.683 -0700  Administrator@X
$$ Compression mode = diff/dup
##.OBSERVE FREQUENCY= 400.02188249412
##.OBSERVE NUCLEUS= ^1H
##.ACQUISITION MODE= SIMULTANEOUS (DQD)
##.ACQUISITION SCHEME= undefined
##.AVERAGES= 64
##.DIGITISER RES= 22
##SPECTROMETER/DATA SYSTEM= spect
##.PULSE SEQUENCE= noesygpps1d.comp
##.SOLVENT NAME= COFFEE_meoh
##.SHIFT REFERENCE= INTERNAL, COFFEE_meoh, 1, 14.96118
##AUDIT TRAIL= $$ (NUMBER, WHEN, WHO, WHERE, PROCESS, VERSION, WHAT)
$$ ##TITLE= Audit trail, TOPSPIN		Version 2.1
$$ ##JCAMPDX= 5.01
$$ ##ORIGIN= Bruker BioSpin GmbH
$$ ##OWNER= Administrator
$$ $$ E:\/data/COFFEE/nmr/AC1474_ZNESNA300_8100857_HIgwmcBgB9/12/pdata/1/auditp.txt
$$ ##AUDIT TRAIL=  $$ (NUMBER, WHEN, WHO, WHERE, PROCESS, VERSION, WHAT)
(   1,<2013-07-31 15:25:23.902 -0700>,<Administrator>,<X>,<go>,<TOPSPIN 2.1>,
      <created by zg
	started at 2013-07-31 15:13:54.431 -0700,
	POWCHK enabled, PULCHK disabled,
       configuration hash MD5:
       C8 4E 4E 5D D3 5C D8 9E 9F 52 82 E0 59 8A DE 15
       data hash MD5: 64K
       0C E7 34 3E 4D 11 90 91 D2 3A EE 77 61 85 B4 7B>)
(   2,<2013-07-31 15:25:26.824 -0700>,<Administrator>,<X>,<proc1d>,<TOPSPIN 2.1>,
      <Start of raw data processing
       efp LB = 0.3 FT_mod = 6 PKNL = 1 PHC0 = 0 PHC1 = 0 SI = 128K 
       data hash MD5: 128K
       EB D0 3B 2C FE DA 3D 91 1A B4 9C A2 97 D6 C7 00>)
(   3,<2013-07-31 15:25:27.699 -0700>,<Administrator>,<X>,<proc1d>,<TOPSPIN 2.1>,
      <pk PHC0 = -77.64038 PHC1 = 0 
       data hash MD5: 128K
       48 29 5D FE 17 1B 87 D4 9C 08 7E 75 CE 54 92 36>)
(   4,<2013-07-31 15:25:28.136 -0700>,<Administrator>,<X>,<proc1d>,<TOPSPIN 2.1>,
      <abs ABSG = 1 
       data hash MD5: 128K
       F2 7C 17 22 A9 26 48 06 40 1F CD 23 B1 FF 4F 45>)
(   5,<2013-07-31 15:25:28.246 -0700>,<Administrator>,<X>,<proc1d>,<TOPSPIN 2.1>,
      <abs ABSG = 2 
       data hash MD5: 128K
       96 FA 3C 01 34 10 A5 5A 8B 3C DB 60 84 EE 10 F9>)
(   6,<2013-07-31 15:25:28.324 -0700>,<Administrator>,<X>,<proc1d>,<TOPSPIN 2.1>,
      <abs ABSG = 3 
       data hash MD5: 128K
       A2 A1 27 C8 6D CE 9F 43 07 92 AA 79 4D 3D 71 56>)
(   7,<2013-07-31 15:25:28.402 -0700>,<Administrator>,<X>,<proc1d>,<TOPSPIN 2.1>,
      <abs ABSG = 4 
       data hash MD5: 128K
       31 6B F9 EC 61 6E C9 92 13 65 4C 6D 32 F3 FA C6>)
(   8,<2013-07-31 15:25:28.496 -0700>,<Administrator>,<X>,<proc1d>,<TOPSPIN 2.1>,
      <abs ABSG = 5 
       data hash MD5: 128K
       D9 B9 84 85 32 8B 12 85 DA 85 4A 77 3C 5D 37 1C>)
$$ ##END=
$$ 
$$ $$ hash MD5
$$ $$ 8A 32 F9 36 59 E0 1B C1 3D 2B 24 79 D3 A0 CF 15
##$RELAX= 
##$RELAX= 
##$RELAX= 
##$RELAX= 
##$RELAX= 
##$RELAX= 
##$RELAX= 
##$RELAX= 
$$ Bruker specific parameters
$$ --------------------------
##$DU= <E:\>
##$EXPNO= 12
$$ [...]
##$TP07= 0
##$TPNAME0= <>
##$TPNAME1= <>
##$TPNAME2= <>
##$TPNAME3= <>
##$TPNAME4= <>
##$TPNAME5= <>
##$TPNAME6= <>
##$TPNAME7= <>
##$TPOAL= (0..7)
0.5 0.5 0.5 0.5 0.5 0.5 0.5 0.5
##$TPOFFS= (0..7)
0 0 0 0 0 0 0 0
##$TUNHIN= 0
##$TUNHOUT= 0
##$TUNXOUT= 0
##$USERA1= <user>
##$USERA2= <user>
##$USERA3= <user>
##$USERA4= <user>
##$USERA5= <user>
##$V9= 5
##$VALIST= <valist>
##$VCLIST= <CCCCCCCCCCCCCCC>
##$VD= 0
##$VDLIST= <DDDDDDDDDDDDDDD>
##$VPLIST= <PPPPPPPPPPPPPPP>
##$VTLIST= <TTTTTTTTTTTTTTT>
##$WBST= 2048
##$WBSW= 25
##$XGAIN= (0..3)
0 0 0 0
##$XL= 0
##$YL= 0
##$YMAX_a= 6398650
##$YMIN_a= -15017428
##$ZGOPTNS= <>
##$ZL1= 120
##$ZL2= 120
##$ZL3= 120
##$ZL4= 120
##$ABSF1= 14.96118
##$ABSF2= -5.597002
##$ABSG= 5
##$ABSL= 3
##$ALPHA= 0
##$AQORDER= 0
##$ASSFAC= 0
##$ASSFACI= 0
##$ASSFACX= 0
##$ASSWID= 0
##$AUNMP= <proc_prof1d_extract.lims>
##$AXLEFT= 0
##$AXNAME= <>
##$AXNUC= <1H>
##$AXRIGHT= 0
##$AXTYPE= 0
##$AXUNIT= <>
##$AZFE= 0.1
##$AZFW= 0.1
##$BCFW= 0
##$BC_mod= 0
##$BYTORDP= 0
##$COROFFS= 0
##$CY= 15
##$DATMOD= 1
##$DC= 0
##$DFILT= <>
##$DTYPP= 0
##$F1P= 0
##$F2P= 0
##$FCOR= 0.5
##$FTSIZE= 131072
##$FT_mod= 6
##$GAMMA= 0
##$GB= 0
##$INTBC= 1
##$INTSCL= 1
##$ISEN= 128
##$LB= 0.3
##$LEV0= 0
##$LPBIN= 0
##$MAXI= 10000
##$MC2= 0
##$MEAN= 0
##$ME_mod= 0
##$MI= 0
##$NCOEF= 0
##$NC_proc= -2
##$NLEV= 6
##$NOISF1= 0
##$NOISF2= 0
##$NSP= 0
##$NTH_PI= 0
##$NZP= 0
##$OFFSET= 14.96118
##$PC= 1
##$PHC0= -77.64038
##$PHC1= 0
##$PH_mod= 1
##$PKNL= yes
##$PPARMOD= 0
##$PPDIAG= 0
##$PPIPTYP= 0
##$PPMPNUM= 2147483647
##$PPRESOL= 1
##$PSCAL= 4
##$PSIGN= 0
##$PYNMP= <proc.py>
##$REVERSE= no
##$SF= 400.02000956615
##$SI= 131072
##$SIGF1= 0
##$SIGF2= 0
##$SINO= 400
##$SIOLD= 131072
##$SPECTYP= <>
##$SREGLST= <1H.CDCl3>
##$SSB= 0
##$STSI= 131072
##$STSR= 0
##$SW_p= 8223.68421052631
##$SYMM= 0
##$S_DEV= 0
##$TDeff= 65536
##$TDoff= 0
##$TI= <>
##$TILT= no
##$TM1= 0
##$TM2= 0
##$TOPLEV= 0
##$USERP1= <user>
##$USERP2= <user>
##$USERP3= <user>
##$USERP4= <user>
##$USERP5= <user>
##$WDW= 1
##$XDIM= 131072
##$YMAX_p= 411149322
##$YMIN_p= -13395
##$CURPLOT= <Network HP LaserJet P1505>
##$CURPRIN= <$Network HP LaserJet P1505>
##$DFORMAT= <normdp>
##$LAYOUT= <+/1D_H.xwp>
##$LFORMAT= <normlp>
##$PFORMAT= <normpl>
##$SURQMSG= 1
$$ End of Bruker specific parameters
$$ ---------------------------------
##NTUPLES= NMR SPECTRUM
##VAR_NAME=  FREQUENCY,     SPECTRUM/REAL,   SPECTRUM/IMAG
##SYMBOL=    X,             R,               I
##VAR_TYPE=  INDEPENDENT,   DEPENDENT,       DEPENDENT
##VAR_FORM=  AFFN,          ASDF,            ASDF
##VAR_DIM=   131072,        131072,          131072
##UNITS=     HZ,            ARBITRARY UNITS, ARBITRARY UNITS
##FACTOR=    0.0627417313425164, 1,          1
##FIRST=     8223.62146879497, 2665,         -76208
##LAST=      0,             4728,            -76342
##MIN=       0,             -13395,          0
##MAX=       8223.62146879497, 411149322,    0
$$ Real data points
##PAGE= N=1
##DATA TABLE= (X++(R..R)), XYDATA
$$ [...]
61444D09610j869j408k28M72K65j41J31J193K444L237L396L324L544M053M308
$$ 409610 407741 406333 406105 406577 406842 406701 406832 408025 410469 413706 417102 420426 423970 428023 432331
61429D32331L961L302K765K373J971J647J505J334R96Q73J431K531L550M054L947
$$ 432331 436292 439594 442359 444732 446703 448350 449855 451189 452185 453058 454489 457020 460570 464624 468571
61414D68571L263K218J266O90L04j66o66j108j708k598l460l980m262m392m039
$$ 468571 471834 474052 475318 476008 476312 476146 475480 474372 472664 470066 466606 462626 458364 453972 449933
61399D49933l152k532k906l813m140l629k923k339j533m84J25j39p56q56j45R39
$$ 449933 446781 444249 441343 437530 433390 429761 426838 424499 422966 422482 422607 422468 421712 420856 420711 421650
61383D21650J675J568Q01J53J92N63N06nj59O35J965K900K882K054R78J60k00
$$ 421650 423325 424893 425694 425847 426039 426602 427108 427103 426944 427579 429544 432444 435326 437380 438358 438518 438318
61366D38318q0O51K016L469M111L673K846K412K450K747L363M312N164N577N808
$$ 438318 438238 438889 440905 444374 448485 452158 455004 457416 459866 462613 465976 470288 475452 481029 486837
61351D86837O217O686P048P592Q505R409J0078J1041J2594J3879J3905J2972J2027
$$ 486837 493054 499740 506788 514380 522885 532294 542372 553413 566007 579886 593791 606763 618790
61338F18790J1083R570P849O902O615N776L961K021N48q48k347l301l439l546
$$ 618790 629873 639443 647292 654194 660809 666585 670546 672567 673115 672267 669920 666619 663180 659634
61324F59634m291n291n898o162o277n906m738l154j713m91N69J211J345J487K134
$$ 659634 655343 650052 644154 637992 631715 625809 621071 617917 616204 615713 616282 617493 618838 620325 622459
61309F22459L033L638L990M690O135Q133J0102J1511J2356J3237J4601J5891J5925
$$ 622459 625492 629130 633120 637810 643945 652078 662180 673691 686047 699284 713885 729776 745701
61296G45701J4223J1440Q333N028J514j752m267o096p680r233j0625j1483j1389
$$ 745701 759924 771364 779697 784725 786239 784487 780220 774124 766444 757211 746586 735103 723714
61283G23714j0249q661p438o703n880m649l328k205j075K66J673K952L993M447
$$ 723714 713465 704804 697366 690663 684783 680134 676806 674601 673526 673792 675465 678417 682410 686857
61269F86857L933K898K541L458M886N770O035O322O943P664Q256Q733R242J0047
$$ 686857 690790 693688 696229 699687 704573 710343 716378 722700 729643 737307 745563 754296 763538 773585
61255G73585J1403J3201J4946J6272J7130J7299J6187J3479R702N759K124j183
$$ 773585 784988 798189 813135 829407 846537 863836 880023 893502 903204 908963 911087 909904
61243I09904m181o748q823j0397j1340j1419j0561r126p833p165o758n760m053
$$ 909904 905723 898975 890152 879755 868415 856996 846435 837309 829476 822311 815553 809793 805740
61230H05740k592k100j978j147M28J921L024M158N472O658P679Q746R532R440
$$ 805740 803148 801048 799070 797923 798351 800272 803296 807454 812926 819584 827263 836009 845541 854981
61216H54981Q670Q037P649O913N940N634O114O297N545M572M130L960L634L394
$$ 854981 863651 871688 879337 886250 892190 897824 903938 910235 915780 920352 924482 928442 932076 935470
61202I35470L406L281L065L673N574Q009J0350J3128J6734K0171K2333K3674K5336
$$ 935470 938876 942157 945222 948895 954469 962478 972828 985956 1002690 1022861 1045194 1068868 1094204
61189A094204K7308K8726K9420K9716K9195K7090K3762K0470J7692J4845J1751
$$ 1094204 1121512 1150238 1179658 1209374 1238569 1265659 1289421 1309891 1327583 1342428 1354179
61178A354179R168P574O363M658K253n00l250n924q641j1473j4093j5989j7249
$$ 1354179 1363347 1370921 1377284 1381942 1384195 1383695 1380445 1374521 1365880 1354407 1340314 1324325 1307076
61165A307076j8671k0675k2693k4185k5619k7602k9526l0097k8991k7110k5346
$$ 1307076 1288405 1267730 1245037 1220852 1195233 1167631 1138105 1108008 1079017 1051907 1026561
61154A026561k3889k2579k1055j8731j5485j2245j0065q704o990m533k170o12
$$ 1026561 1002672 980093 959038 940307 924822 912577 902512 893808 886818 882285 880115 879503
61142H79503L74J218J777J685Q59n68k299l731m262l903l155k183o49J588M156
$$ 879503 879877 881095 882872 884557 885416 884848 882549 878818 874556 870653 867498 865315 864666 866254 870410
61127H70410O681R167J1709J4284J6996K0128K3787K7634L1173L4058L6263L8058
$$ 870410 877091 886258 897967 912251 929247 949375 973162 1000796 1031969 1066027 1102290 1140348
61115A140348L9805M1513M2799M3445M3757M4072M4229M3836M2714M0711L7542
$$ 1140348 1180153 1221666 1264465 1307910 1351667 1395739 1439968 1483804 1526518 1567229 1604771
61104A604771L3319K8875K4977K1464J7693J3540R307M939L3n550j1675j8300
$$ 1604771 1638090 1666965 1691942 1713406 1731099 1744639 1753946 1758885 1758918 1753368 1741693 1723393
61092A723393k5255l1807l7129m1031m3829m5770m7122m8342m9415m9448m7701
$$ 1723393 1698138 1666331 1629202 1588171 1544342 1498572 1451450 1403108 1353693 1304245 1256544
61081A256544m4741m1681l8753l5597l2587l0508k9011k6685k2973j8885j5522
$$ 1256544 1211803 1170122 1131369 1095772 1063185 1032677 1003666 976981 954008 935123 919601
61070I19601j2882j0559q692p579o998o357n227l495j430L94J650K767M334O190
$$ 919601 906719 896160 887468 879889 872891 866534 861307 857812 856382 856776 858426 861193 865527 871717
61056H71717P705Q769R731J0477J0555J0266J0631J2149J4336J6719J9375K2334
$$ 871717 879422 888191 897922 908399 918954 929220 939851 952000 966336 983055 1002430 1024764
61044A024764K5194K7583K9383L0502L1167L2229L4280L6497L7464L7108L6676
$$ 1024764 1049958 1077541 1106924 1137426 1168593 1200822 1235102 1271599 1309063 1346171 1382847
61033A382847L6757L6737L6362L6320L6756L6616L5200L3255L1818L1143L1347
$$ 1382847 1419604 1456341 1492703 1529023 1565779 1602395 1637595 1670850 1702668 1733811 1765158
61022A765158L2897L5631L8409M0499M2221M3630M3987M3442M3899M6928N2073
$$ 1765158 1798055 1833686 1872095 1912594 1954815 1998445 2042432 2085874 2129773 2176701 2228774
61011B228774N8380O6356P6964Q9788J03819J19060J35981J54497J75281K01096
$$ 2228774 2287154 2353510 2430474 2520262 2624081 2743141 2879122 3033619 3208900 3409996
61001C409996K35012K78318L31938L98361M79718N75737O87516Q22106R88392
$$ 3409996 3645008 3923326 4255264 4653625 5133343 5709080 6396596 7218702 8207094
60992H207094J188622J419783J682614J976130K270406K488064K529315K330135
$$ 8207094 9395716 10815499 12498113 14474243 16744649 19232713 21762028 24092163
60984B4092163J903215J330397P26350K09151j19318k03791p3268J52208L10271
$$ 24092163 25995378 27325775 28052125 28261276 28141958 27938167 27864899 28017107 28327378
60975B8327378K72377o720m88955j080845j663150k120907k378800k426596k312127
$$ 28327378 28599755 28593035 28104080 27023235 25360085 23239178 20860378 18433782 16121655
60966A6121655k105131j862374j616925j385671j177148r93820q34222o96711
$$ 16121655 14016524 12154150 10537225 9151554 7974406 6980586 6146364 5449653
60958E449653n80755m85068m06717l42730k91240k50567k18365j92257j70591
$$ 5449653 4868898 4383830 3977113 3634383 3343143 3092576 2874211 2681954 2511363
60949B511363j52192j36093j21795j09226r8102q7821p8193o9796o3375n9230
$$ 2511363 2359171 2223078 2101283 1992057 1893955 1806134 1727941 1658145 1594770 1535540
60939A535540n7185n6645n6547n5829n4228n2268n0297m7958m4856m1254l7754
$$ 1535540 1478355 1421710 1365163 1309334 1255106 1202838 1152541 1104583 1059727 1018473 980719
60928I80719l4530l1279k7848k4588k2047k0407j9212j7741j5757j3785j2451
$$ 980719 946189 914910 887062 862474 840427 820020 800808 783067 767310 753525 741074
60917G41074j1671j0798r495q056o908o107n416m531l196j434K82J422J960K204
$$ 741074 729403 718605 709110 701054 694146 688039 682623 678092 674896 673462 673744 675166 677126 679330
60903F79330K130J518P50P10J580K421K354J514M02j035k916m623n402n466n627
$$ 679330 681460 682978 683728 684438 686018 688439 690793 692307 692709 691674 688758 684135 678733 673267 667640
60888F67640n992n886n091m306m199m714n451o166o656o731o476o161n833n477
$$ 667640 661648 655762 650671 646365 642166 637452 632001 625835 619179 612448 605972 599811 593978 588501
60874E88501n410n888o313n747m364l456l620l876l165j840r28n93k03N54J536
$$ 588501 583091 577203 570890 565143 560779 557323 553703 549827 546662 544822 543894 543301 543098 543652 545188
60859E45188K758M166N135N119M733N192O654P989Q380Q207Q117Q008P480O663
$$ 545188 547946 552112 557247 562366 567099 572291 578945 586934 595314 603521 611638 619646 627126 633789
60845F33789O032N803N884O124O200N655M455L130J968M67j814m125n089m483
$$ 633789 639821 645624 651508 657632 663832 669487 673942 677072 679040 679507 677693 673568 668479 663996
60831F63996l703m064n210n732n083m147l946m453m960n084m887m337l365k445
$$ 663996 660293 656229 651019 645287 640204 636057 632111 627658 622698 617614 612727 608390 605025 602580
60817F02580k451l634n182o079o127n793n475n291n329n586n752n467m773m020
$$ 602580 600129 596495 591313 585234 579107 573314 567839 562548 557219 551633 545881 540414 535641 531621
60803E31621l408k950k734k779k686j969q03L2J31l3J82P63J247J380J281J095
$$ 531621 528213 525263 522529 519750 517064 515095 514292 514324 514455 514422 514604 515367 516614 517994 519275 520370
60787E20370R45J054J608K462L237L763M204M741N312N700N776N612N438N488
$$ 520370 521315 522369 523977 526439 529676 533439 537643 542384 547696 553396 559172 564784 570222 575710
60773E75710N761N955N846N724O164P224Q112P999P021O166O180O919P795Q479
$$ 575710 581471 587426 593272 598996 605160 612384 620496 628495 635516 641682 647862 654781 662576 671055
60759F71055Q934R084Q741P811O418M936M022M235N391O459O481N424L971K730
$$ 671055 679989 689073 697814 705625 712043 716979 721001 725236 730627 737086 743567 748991 752962 755692
60745G55692K044K207L189M311M724M354L848L573L202K440J663J575K535M328
$$ 755692 757736 759943 763132 767443 772167 776521 780369 783942 787144 789584 791247 792822 795357 799685
60731G99685O382Q140R484J0761J2113J3096J3450J3922J5482J7786J9441J9971
$$ 799685 806067 814207 823691 834452 846565 859661 873111 887033 902515 920301 939742 959713
60719I59713K0502K2123K4408K6186K6943K6937K6506K5948K5519K5003K3703
$$ 959713 980215 1002338 1026746 1052932 1079875 1106812 1133318 1159266 1184785 1209788 1233491
60708A233491K1389J8705J6217J3664J0696P631M749J514k603p020j0739j3737
$$ 1233491 1254880 1273585 1289802 1303466 1314162 1321793 1326542 1328056 1325453 1318433 1307694 1293957
60696A293957j6777k0057k3018k5280k6938k7965k8215k8024k8039k8399k8602
$$ 1293957 1277180 1257123 1234105 1208825 1181887 1153922 1125707 1097683 1069644 1041245 1012643
60685A012643k8203k7138k5509k3636k2144k1397k0958k0102j8777j7482j6461
$$ 1012643 984440 957302 931793 908157 886013 864616 843658 823556 804779 787297 770836
60674G70836j5533j4547j3440j2114j0742r857r557r111q078p228p428q119q005
$$ 770836 755303 740756 727316 715202 704460 694603 685046 675935 667857 660629 653201 645082 637077
60661F37077o968o038n677n350m802m457m387m073l416k879k348j065R50K504
$$ 637077 630109 624071 618394 613044 608242 603785 599398 595325 591909 589030 586682 585617 586567 589071
60647E89071K838K572K481K302J532O02L71Q17J021L54p93j398q29M55J290J149
$$ 589071 591909 594481 596962 599264 600796 601398 601769 602586 603607 603961 603168 601770 600941 601396 602686 603835
60631F03835P87J086J739J874J545J552J967K095J888K012K376J940M34j019j662
$$ 603835 604622 605708 607447 609321 610866 612418 614385 616480 618368 620380 622756 624696 625130 624111 622449
60616F22449k191l393m790n449n283m801m371m378n183o204o023m209k208j530
$$ 622449 620258 616865 612075 606626 601343 596542 592171 587793 582610 576406 570383 566174 563966 562436
60602E62436j972k524l082m028m865m755m011l712m029m069l339k323j503q33
$$ 562436 560464 557940 554858 550830 545965 541210 537199 533487 529458 525389 522050 519727 518224 517391
60588E17391k26J69L51M66M14J4m60n51l32k69l92k56K07M55J58k43o8P87J785
$$ 517391 517165 517334 517685 518151 518565 518579 518119 517568 517236 516967 516575 516319 516526 516981 517139 516896 516828 517615 519400
60569E19400K375K597L023M030N221N887O034O463P656R108J0107J0640J1073
$$ 519400 521775 524372 527395 531425 536646 542533 548567 555030 562686 571794 581901 592541 603614
60556F03614J1354J1040R861P799M950J744r43k452l017l445m182m999n364m912
$$ 603614 614968 626008 635869 643668 648618 650362 649419 646967 643950 640505 636323 631324 625960 621048
60542F21048l713k282j124k00Q87K202L473M825O694Q808J0050R878R112Q680
$$ 621048 617335 615053 613929 613729 614616 616818 620291 625116 631810 640618 650668 660546 669658 678338
60528F78338Q213O695M056J313o39j752k419l010l649m072l866l073k274j842
$$ 678338 686551 693246 697302 698615 697976 696224 693805 690795 687146 683074 679208 676135 673861 672019
60514F72019j527j085p48o64m39K65J148J809K309K707K635J982J456J750K663
$$ 672019 670492 669407 668659 667995 667556 667821 668969 670778 673087 675794 678429 680411 681867 683617 686280
60499F86280L714N111P262R780J1932J3789J6158J9492K3632K8241L2783L6320
$$ 686280 689994 695105 702367 712147 724079 737868 754026 773518 797150 825391 858174 894494
60487H94494L8193L8716L8463L6967L2955K5766J5955M627p130j8208k7603l4734
$$ 894494 932687 971403 1009866 1046833 1079788 1105554 1121509 1126136 1119006 1100798 1073195 1038461
60475A038461l9404m1632m1793m0524l8161l4701l0717k7448k5405k3585k0959
$$ 1038461 999057 957425 915632 875108 836947 802246 771529 744081 718676 695091 674132
60464F74132j8018j5851j4359j2645j0683r240q383p433o303n637n547n383m937
$$ 674132 656114 640263 625904 613259 602576 593336 584953 577520 571217 565580 560033 554650 549713
60451E49713m688m719m412l524k577j996j685j589j846k215k233k030k047k025
$$ 549713 545025 540306 535894 532370 529793 527797 526112 524523 522677 520462 518229 516199 514152 512127
60437E12127j261p2K48p94k214l022l264l205k633j615r34r83j035m09M18O17
$$ 512127 510866 510794 511042 510248 508034 505012 501748 498543 495910 494295 493361 492378 491343 490934 491352 491969
60421D91969L08K05M57O44O15O13P56J027J521K155K410J926J114P00P89Q93P41
$$ 491969 492277 492482 492939 493583 494198 494811 495567 496594 498115 500270 502680 504606 505720 506420 507209 508102 508843
60404E08843N61O10Q67J226J588J786J724J636J858K285K326J641P23M64J132
$$ 508843 509404 510014 510881 512107 513695 515481 517205 518841 520699 522984 525310 526951 527674 528138 529270
60389E29270K056K470K456K674L284L672L362K729K400K356K096J487R67R68J419
$$ 529270 531326 533796 536252 538926 542210 545882 549244 551973 554373 556729 558825 560312 561279 562247 563666
60374E63666J881J933J579J293J464J737J418N73J20M78Q89N97Om1M53Q85J079
$$ 563666 565547 567480 569059 570352 571816 573553 574971 575544 575664 576142 577031 577628 577634 577593 578046 578931 580010
60357E80010J256J335J221J340J957K333J646M99L68J601L090L965M487N106N749
$$ 580010 581266 582601 583822 585162 587119 589452 591098 591597 591965 593566 596656 600621 605108 610214 615963
60342F15963O384P331Q621R754J0395J0623J0386R386P672N643L352O24k132m113
$$ 615963 622347 629678 638299 648053 658448 669071 679457 688843 696515 702158 705510 706134 704002 699889
60328F99889n326o581q018q678p976o752o168o292o324n703m430k833j447q25
$$ 699889 694563 687982 679964 671286 663310 656558 650390 644098 637774 632071 627641 624808 623361 622536
60314F22536j003j392j438j078m98J66Q51J673K964M783O563P896R351J1732J4798
$$ 622536 621533 620141 618703 617625 617127 617293 618144 619817 622781 627564 634127 642023 651374 663106 677904
60299F77904J7650K0215K3059K5783K6906K5652K2547J7963J1480L394m451j0214
$$ 677904 695554 715769 738828 764611 791517 817169 839716 857679 869159 872553 868102 857888
60287H57888j3636j5313j5412j3979j1689r409p488o191o035p066q464r594j0727
$$ 857888 844252 828939 813527 799548 787859 778450 770962 764771 758736 751670 743206 733612 722885
60274G22885j2069j2929j2750j2226j2351j2894j2777j1565r681p558n512m053
$$ 722885 710816 697887 685137 672911 660560 647666 634889 623324 613643 606085 600573 596520
60262E96520l444l189k717k255k235k284j777j037r15j310j217k80O52P41J57
$$ 596520 593076 589887 587170 584915 582680 580396 578619 577582 576667 575357 574140 573860 574512 575253 575410
60247E75410l93m56L6Q39J435J430J084J011J277J350J048Q93J310J919K029J506
$$ 575410 575017 574561 574597 575436 576871 578301 579385 580396 581673 583023 584071 584964 586274 588193 590222 591728
60231E91728Q14M08M79J117K250L426M009L852L582L868M518M716M123L335L041
$$ 591728 592542 592950 593429 594546 596796 600222 604231 608083 611665 615533 620051 624767 628890 632225 635266
60216F35266L225L512L876M552N501O482P411Q200Q459P958P171O786O813O783
$$ 635266 638491 642003 645879 650431 655932 662414 669825 678025 686484 694442 701613 708399 715212 721995
60202G21995O582O450O303N785M894L893K773J555P90Q48J011L78n70o81k84r94
$$ 721995 728577 735027 741330 747115 752009 755902 758675 760230 761020 761868 762879 763257 762687 762006 761722 760728
60186G60728l126m878m835l772l167l222l328l436l733l886l625l492l961m469
$$ 760728 757602 752724 747889 744117 740950 737728 734400 730964 727231 723345 719720 716228 712267 707798
60172G07798m189l298k576k209j817j256n96K70J316K051K164K051K184K469K769
$$ 707798 703609 700311 697735 695526 693709 692453 691857 692127 693443 695494 697658 699709 701893 704362 707131
60157G07131L381M263M526L494J812O70M00M99O09P23Q76J276K219L289L365K225
$$ 707131 710512 714775 719301 722795 724607 725277 725677 726176 726785 727508 728384 729660 731879 735168 738533 740758
60141G40758J373K271M391O051O664O987P569Q134Q460Q759R138R424R457R043
$$ 740758 742131 744402 748793 754844 761508 768495 776064 784198 792658 801417 810555 819979 829436 838479
60127H38479P872O039M219K750J109j038k914l684l716l792l694k807j561q92
$$ 838479 846351 852390 856609 859359 860468 859430 856516 852832 849116 845324 841630 838823 837262 836370
60113H36370o66j8Q89J006J75o07r34j558k852m022m342m221m472n239o044o358
$$ 836370 835704 835686 836575 837581 837756 837149 836215 834657 831805 827783 823441 819220 814748 809509 803465 797107
60097G97107n898m972m490m896n184l952j437O44J371J617K386L392M007M538
$$ 797107 791209 786237 781747 776851 771667 767715 766278 766922 768293 769910 772296 775688 779695 784233
60083G84233N604O870P418P055O487O327O503O530N920M356J921q87l566o040
$$ 784233 789837 796707 804125 811180 817667 823994 830497 837027 842947 847303 849224 848337 844771 838731
60069H38731q493j0829j2457j2774j1876j0736j0379j0773j0845r772q012o685
$$ 838731 830238 819409 806952 794178 782302 771566 761187 750414 739569 729797 721785 715100
60057G15100o227o113n731n029m277l596k908k165j534j298j419j315l77J218
$$ 715100 708873 702760 697029 692000 687723 684127 681219 679054 677520 676222 674803 673488 673111 674329
60043F74329K712L732M592N501O267O914P800Q660Q434O724M629L308K442J044
$$ 674329 677041 680773 685365 690866 697133 704047 711847 720507 728941 735665 740294 743602 746044 747088
60029G47088p88k132k798l592n044o854q554r976j1093j1958j2749j3366j3320
$$ 747088 746300 744168 741370 737778 732734 725880 717326 707350 696257 684299 671550 658184 644864
60016F44864j2474j1389j0365q802o361m008k864k576j983r47k32K5L62P54P51
$$ 644864 632390 621001 610636 601834 595473 591465 588601 586025 584042 583095 582863 582888 583250 584004 584755
60001E84755P47J604K945L306K294J245J315K191L148M185N418O356O560O316
$$ 584755 585502 587106 590051 593357 595651 596896 598211 600402 603550 607735 613153 619509 626069 632385
59987F32385O059N781N387N066M845M376L522K561J578K43j495l120m305n244
$$ 632385 638444 644225 649612 654678 659523 663899 667421 669982 671560 671803 670308 667188 662883 657639
59973F57639o025o241n647m699m064l935m056m074l669k801j840j147n55L16J371
$$ 657639 651614 645373 639726 635027 630963 627028 622972 618898 615229 612428 610588 609441 608886 609202 610573
59958F10573K233K978L933M857N076M410L284J957M60p47r72l06L75N65N73P11
$$ 610573 612806 615784 619717 624574 629650 634060 637344 639301 639761 639014 638042 637736 638111 638676 639249 639960
59942F39960P68M66k43j358k739l856m361m735n522o206n867m818m270m394m046
$$ 639960 640728 641194 640951 639593 636854 632998 628637 623902 618380 612174 606307 601489 597219 592825 588779
59927E88779k691j199l30K87J015J315Q14K85O59J747K644K855K513K018J915
$$ 588779 586088 584889 584559 584846 585861 587176 587990 588275 588934 590681 593325 596180 598693 600711 602626
59912F02626K503L324L658L714M380N565O020N274M543M878N574N379M361L441
$$ 602626 605129 608453 612111 615825 620205 625770 631790 637064 641607 646485 652059 657438 661799 665240
59898F65240K840K153J508J469J964K327K362K587L468M976O818Q565R643R759
$$ 665240 668080 670233 671741 673210 675174 677501 679863 682450 685918 690894 697712 706277 715920 725679
59884G25679R258Q759Q479Q154P544O682N793N098M562L855K714J305q8j552l228
$$ 725679 734937 743696 752175 760329 767873 774555 780348 785446 790008 793863 796577 797882 797794 796242 793014
59869G93014m720n518n915o681p792q490q598q780r164q854p408n764m990m876
$$ 793014 788294 782776 776861 770180 762388 753898 745300 736520 727356 718502 711094 705330 700340 695464
59855F95464m562l878l261k792k136j137J16J540K977M190N202O251P141P305
$$ 695464 690902 687024 683763 680971 678835 677698 677814 679354 682331 686521 691723 697974 705115 712420
59841G12420O836O813Q004R838J1164J1475J0859R369P210N174M142M263M977
$$ 712420 719256 726069 734073 743911 755075 766550 777409 786778 793988 799162 803304 807567 812544
59828H12544N700O079N858M859K928j85m510r267j3167j5551j6799j7439j7429
$$ 812544 818244 824323 830181 835040 837968 837783 833273 824006 810839 795288 778489 761050 743621
59815G43621j6580j5092j3277j1253r234p604o444n474m658m249m026l285j876
$$ 743621 727041 711949 698672 687419 678185 670581 664137 658663 654005 649756 645730 642445 640569
59802F40569o35k75n58q96j167j466j693j867k300l028l548l440k824k004j189
$$ 640569 639934 639659 639101 638205 637038 635572 633879 632012 629712 626684 623136 619696 616872 614868 613679
59787F13679p69j106j806j942j256m82k12k44l25n91r75j063r34j174j706j610
$$ 613679 612910 611804 609998 608056 606800 606318 606106 605862 605537 604946 603971 602908 601974 600800 599094 597484
59771E97484n81M61P79Q08J133J555J812K230K929L358L334L434L704L178J685
$$ 597484 596903 597364 598143 598951 600084 601639 603451 605681 608610 611968 615302 618736 622440 625618 627303
59756F27303Q06J849L930N359N941O519P068O927O373O363O944P266O950O356
$$ 627303 628109 629958 633888 639247 645188 651707 658775 665702 672075 678438 685382 692648 699598 705954
59742G05954N642M706L880L567L393K671J521O28Q5n26j147j320j100r93j032
$$ 705954 711596 716302 720182 723749 727142 729813 731334 731962 732047 731521 730374 729054 727954 726961 725929
59727G25929q21l70o7R3N07J168J592J476R34K75k8M91J572K156J648Q59R72J958
$$ 725929 725108 724738 724671 724764 725271 726439 728031 729507 730441 730716 730688 731179 732751 734907 736555 737414 738386 740344
59709G40344K817K983K747K493K303K153J974J641J320J389J737J729J254J035
$$ 740344 743161 746144 748891 751384 753687 755840 757814 759455 760775 762164 763901 765630 766884 767919
59695G67919J402J714J570J706K755M033M473L969K813Q56j656l379l394k667
$$ 767919 769321 771035 772605 774311 777066 781099 785572 789541 792354 793210 791554 788175 784781 782114
59681G82114k594k830k160q22k04m84m20N11J340J179K66p58j532j904k095k867
$$ 782114 779520 776690 774530 773708 773504 773020 772600 773111 774451 775630 775896 775138 773606 771702 769607 766740
59665G66740m563o307p086p234p656q054p474o185n404n195m348k515q39q5M08
$$ 766740 762177 755870 748784 741550 733894 725840 718366 712181 706777 701582 697234 694719 693880 693795 694203
59650F94203J441K872M236N330N706M717K554L52j144k275l511m643n274n346
$$ 694203 695644 698516 702752 708082 713788 718505 721059 721411 720267 717992 714481 709838 704564 699218
59636F99218m901l977k904k057j300l22O04J006J139J593K113J908J064M73L90
$$ 699218 694317 690340 687436 685379 684079 683757 684361 685367 686506 688099 690212 692120 693184 693657 694047
59621F94047K14r9K71J636L084L635L156J912J61j498k252j991j433j075o75J05
$$ 694047 694261 694162 694433 696069 699153 702788 705944 707856 708017 706519 704267 702276 700843 699768 699093 699198
59605F99198J194K407L535M167M003L305K415J074r10k751l467l257l000k721
$$ 699198 700392 702799 706334 710501 714504 717809 720224 721298 720388 717637 714170 710913 707913 705192
59591G05192j831o81l28p86r67n36l36p66j234j531k277l549m385m260l782l469
$$ 705192 703361 702680 702352 701566 700599 700063 699727 698961 697727 696196 693919 690370 685985 681725 677943 674474
59575F74474l040k418k190k445k424j867j573j986k376k116j633j382r31J80J562
$$ 674474 671434 669016 666826 664381 661957 660090 658517 656531 654155 652039 650406 649024 648093 648273 649835
59560F49835K641L336L523K838J588Q88J238J956K458K993L504L137J796Q99J503
$$ 649835 652476 655812 659335 662173 663761 664649 665887 667843 670301 673294 676798 679935 681731 682630 684133
59545F84133K665K898K336K202K917M032N449P401R570J1493J3636J6849K0726
$$ 684133 686798 689696 692032 694234 697151 701183 706632 714033 723603 735096 748732 765581 786307
59532G86307K3476K3601K1033J6680J1559O622K849J045J409L284N401O736P139
$$ 786307 809783 833384 854417 871097 882656 889278 892127 893172 894581 897865 903266 910002 917141
59519I17141O977O345N082L353J475p42l662o915r678j1884j4107j6130j6861
$$ 917141 924118 930463 935545 938898 940373 939631 935969 929054 919376 907492 893385 877255 860394
59506H60394j5985j4567j3464j2266j0475q632p377o327m839l158j893q96L80
$$ 860394 844409 829842 816378 804112 793637 785005 777628 771301 766462 763304 761411 760515 760895
59493G60895J876L037L645L841L711L408L403M136N534P220Q817R942J0534J1331
$$ 760895 762771 765808 769453 773294 777005 780413 783816 787952 793486 800706 809523 819465 829999 841330
59479H41330J3277J6159J8646K0120K1564K4083K7384L0292L1940L1714K8797
$$ 841330 854607 870766 889412 909532 931096 955179 982563 1012855 1044795 1076509 1105306
59468A105306K2856J4840O380j360p734j2059j3784j2990j0236o108j105M357
$$ 1105306 1128162 1143002 1149382 1148022 1140288 1128229 1114445 1101455 1091219 1085111 1084006 1088363
59456A088363J0122J6126K1929K6938L1059L4429L6613L7116L6841L7719M0403
$$ 1088363 1098485 1114611 1136540 1163478 1194537 1228966 1265579 1302695 1339536 1377255 1417658
59445A417658M3345M4609M3323L8867L0142J6909Q80j5610l1086m4211n2815n5365
$$ 1417658 1461003 1505612 1548935 1587802 1617944 1634853 1635733 1620123 1589037 1544826 1492011 1436646
59433A436646n2894m8160m3218l8849l5639l4033l3410l2390l0199k6965k2829
$$ 1436646 1383752 1335592 1292374 1253525 1217886 1183853 1150443 1118053 1087854 1060889 1038060
59422A038060j7797j2334p110k136L062Q445J3392J7535K0841K3026K3814K3924
$$ 1038060 1020263 1007929 1000819 998683 1001745 1010190 1023582 1041117 1061958 1084984 1108798 1132722
59410A132722K4836K6969K8517K6571J9391P701n902j8568k8407l4496l6341l3848
$$ 1132722 1157558 1184527 1213044 1239615 1259006 1266707 1260805 1242237 1213830 1179334 1142993 1109145
59398A109145k7648j8948r144l0N919O606J909o407j6371k6374l4281l7724l6234
$$ 1109145 1081497 1062549 1053405 1053375 1059294 1065900 1067809 1061402 1045031 1018657 984376 946652 910418
59385I10418l1986k7498k3460j9455j5718j2879j0798q895p236o234n717n159
$$ 910418 878432 850934 827474 808019 792301 779422 768624 759729 752493 746259 740542 735383
59373G35383m471l697k488p89M90N53Q9M18J581K393K327K211K941M447O075P406
$$ 735383 730912 727215 724727 723938 724428 724981 725070 725488 727069 729462 731789 734000 736941 741388 747463 754869
59357G54869Q447R562J1205J3320J5164J6182J6901J8387K0974K3989K6635K8636
$$ 754869 763316 772878 784083 797403 812567 828749 845650 864037 885011 909000 935635 964271
59345I64271L0102L1215L1989L2137L1272K9408K6920K3885J9902J4785Q932K778
$$ 964271 994373 1025588 1057577 1089714 1120986 1150394 1177314 1201199 1221101 1235886 1244818 1247596
59333A247596l547r784j5347j9973k3907k7197k9489l0849l1840l2377l1435k8663
$$ 1247596 1244049 1234265 1218918 1198945 1175038 1147841 1118352 1087503 1055663 1023286 991851 963188
59321I63188k5336k2905k1293j9549j7449j5480j3803j2150j0474q894p431o271
$$ 963188 937852 914947 893654 874105 856656 841176 827373 815223 804749 795855 788424 782153
59309G82153n796n758n218l882k645k033j171P26K719L419L104L162L952M687
$$ 782153 776357 770599 765381 761499 758854 756821 755650 756376 759095 762514 765618 768780 772732 777419
59295G77419N202O314Q417J0988J3644J6602J9790K2399K3474K2430J9055J3659
$$ 777419 782621 788935 797352 808340 821984 838586 858376 880775 904249 926679 945734 959393
59283I59393P191P07n088r395j1076r724o578l397o65K347O006R741J2883J5341
$$ 959393 966584 967291 962203 952808 941732 932008 925430 922033 921368 923715 929721 939462 952345 967686
59269I67686J7391J9299K0963K1594K0204J6908J3056R499N518K97n379j0042
$$ 967686 985077 1004376 1025339 1046933 1067137 1084045 1097101 1106600 1112118 1112415 1107036 1096994
59257A096994j3521j6713j9791k1939k2725k2581k1924k0774j9247j7581j5747
$$ 1096994 1083473 1066760 1046969 1025030 1002305 979724 957800 937026 917779 900198 884451
59246H84451j3689j1710r931p766m705j263J685M048O175P888Q916R765J1102
$$ 884451 870762 859052 849121 841355 836650 835387 837072 841120 847295 855183 864099 873864 884966
59233H84966J2510J2930J2077J0460Q343N673K703l50l905q256j2561j5669j7555
$$ 884966 897476 910406 922483 932943 941286 946959 949662 949312 945407 937151 924590 908921 891366
59220H91366j8905j9690j9451j8505j7583j6525j4698j2475j0805r567p798n565
$$ 891366 872461 852771 833320 814815 797232 780707 766009 753534 742729 733162 725364 719799
59208G19799m007l392k649j229l9K8o45j173j251r51k57P24J616K171K449K493
$$ 719799 715792 712400 709751 708522 708483 708511 707866 706693 705442 704491 704234 704958 706574 708745 711194 713687
59192G13687K361K331K575K796K777K957L794M990O058P194Q632R692R576Q764
$$ 713687 716048 718379 720954 723750 726527 729484 733278 738268 744326 751520 760152 769844 779420 788184
59178G88184Q462Q948R488R600R248Q255O724N702O136P554Q949J0459J2595J4454
$$ 788184 796646 805594 815082 824682 833930 842185 848909 854611 860747 868301 877250 887709 900304 914758
59164I14758J4640J3710J3613J4622J4819J3006J0115P157L721n99m908q188j0610
$$ 914758 929398 943108 956721 971343 986162 999168 1009283 1016440 1020161 1019562 1014654 1006466 995856
59151I95856j2767j4661j6200j7642j8881j9189j8320j7012j5850j4615j3108
$$ 995856 983089 968428 952228 934586 915705 896516 878196 861184 845334 830719 817611
59140H17611j1701j0534r160p533o349n880n406m375l245k611k296j864j248m49
$$ 817611 805910 795376 786216 778683 772334 766454 761048 756673 753428 750817 748521 746657 745409 744960
59126G44960O91K016L043L769M714N860O491O425O487P346Q639R759J0723J1772
$$ 744960 745651 747667 750710 754479 759193 765053 771544 777969 784456 791802 800441 810200 820923 832695
59112H32695J2815J3638J4100J3831J2450J0323Q394P070N890M548L340K481J720
$$ 832695 845510 859148 873248 887079 899529 909852 918246 925316 931206 935754 939094 941575 943295
59099I43295R27K36n35j727l001l558l465l718m663n367m964l782k630j759j153
$$ 943295 944222 944458 943923 942196 939195 935637 932172 928454 923791 918424 913460 909678 907048 905289 904136
59084I04136j108j899l299m900o601q420j0118j1197j1268j0475r691r789j0514
$$ 904136 903028 901129 897830 892930 886329 877909 867791 856594 845326 834851 825160 815371 804857
59071H04857j0641r672q566q072p433n817m037l348l402l052k514k785l356k703
$$ 804857 794216 784544 775978 767906 760473 754656 750619 747271 743869 740817 738303 735518 732162 729459
59057G29459j005k21j164k439k708k240j676r71k00P6j63k77k68p62j497j326
$$ 729459 728454 728233 727069 724630 721922 719682 718006 717035 716835 716911 716748 716471 716203 715441 713944 712618
59041G12618j11R38J202J367J893K357K788L885N462O387O561P163Q289Q437P174
$$ 712618 712507 713445 714647 716014 717907 720264 723052 726937 732399 738786 745347 752510 760799 769236 776410
59026G76410O318P296R083J0086J0412J0901J1407J1428J1324J1465J1200R803
$$ 776410 782728 790024 799107 809193 819605 830506 841913 853341 864665 876130 887330 897133
59014H97133P568M974J882j471l781m103l064j792o13L76P51P35J563L826O433
$$ 897133 904701 909675 911557 910086 906305 902202 899138 897346 896733 897109 897860 898595 900158 903984 910417
58999I10417Q198R388J0761J2189J3251J4151J4952J5009J4039J2846J1944J0562
$$ 910417 918615 928003 938764 950953 964204 978355 993307 1008316 1022355 1035201 1047145 1057707
58987A057707P927M483Q98k968p037j0120j1330j1402j1477j1417j0441q563o317
$$ 1057707 1065634 1070117 1071015 1068047 1061010 1050890 1039560 1028158 1016681 1005264 994823 986260 979943
58974I79943l834j167J290L589O519J0207J3429J5254J6407J8081K0264K2246
$$ 979943 976109 974942 976232 979821 986340 996547 1009976 1025230 1041637 1059718 1079982 1102228
58962A102228K3726K4566K4302K2831K0735J8143J4324R000K986l178r793j6535
$$ 1102228 1125954 1150520 1174822 1197653 1218388 1236531 1250855 1259855 1262841 1259663 1249870 1233335
58950A233335k1980k5504k8099l0277l0949k9629k7897k6997k5691k2383j7950
$$ 1233335 1211355 1185851 1157752 1127475 1096526 1066897 1039000 1012003 986312 963929 945979
58939I45979j4369j1709q648n159k600j579j527j987k765l309l355l695m941o208
$$ 945979 931610 919901 911253 906094 903494 901915 900388 898401 895636 892327 888972 885277 880336 874128
58925H74128o243n331m669m595m663m742m726l971k318r10o27o20K90J718K706
$$ 874128 867885 862554 857885 853290 848627 843885 839159 835188 832870 831960 831333 830713 831003 832721 835427
58910H35427L568N056O637P374P845R323J1567J3266J4203J5327J7006J8809K0684
$$ 835427 838995 844051 850688 858062 865907 875230 886797 900063 914266 929593 946599 965408 986092
58897I86092K2832K4713K5649K6025K6654K7389K7693K8074K9523L2035L5024
$$ 986092 1008924 1033637 1059286 1085311 1111965 1139354 1167047 1195121 1224644 1256679 1291703
58886A291703L8512M2403M5211M5210M2481L8387L3438K7165J9606J1453K988
$$ 1291703 1330215 1372618 1417829 1463039 1505520 1543907 1577345 1604510 1624116 1635569 1638557
58875A638557n792j4433k2568l0540l8203m3983m6639m7159m7225m6565m3743
$$ 1638557 1632765 1618332 1595764 1565224 1527021 1483038 1436399 1389240 1342015 1295450 1251707
58864A251707l8915l3841k9527k5770k2642k0532j8859j6623j4139j2629j2222
$$ 1251707 1212792 1178951 1149424 1123654 1101012 1080480 1061621 1044998 1030859 1018230 1006008
58853A006008j2002j1756j1983j2251j1394r417p680p039p166p642q395r087r406
$$ 1006008 994006 982250 970267 958016 946622 937205 929525 922486 915320 907678 899283 890196 880790
58840H80790r801j0734j1534j1278j0377r902r787r169q066p184o435n299m245
$$ 880790 870989 860255 848721 837443 827066 817164 807377 798208 790142 782958 776523 771224 766979
58827G66979m135m487l967k401p25P81K583M508N830O587P301P715P319O674O622
$$ 766979 762844 758357 754390 751989 751264 752045 754628 759136 764966 771553 778854 786569 793888 800562 807184
58812H07184O667N822M478L640K882J159q70j573j096j133k033k533k360k780
$$ 807184 813851 819673 824151 827791 830673 831832 830962 829389 828293 827160 825127 822594 820234 817454
58798H17454m099m945m561l893l872m252m695n315n704n008l354j757m99R85K623
$$ 817454 813355 808410 803849 799956 796084 791832 787137 781822 776118 771110 767756 765999 765500 766485 769108
58783G69108L765M688O214P773P815O375N247N218N059L763J998O68k94j043j271
$$ 769108 772873 777561 783775 791548 799363 805738 810985 816203 821262 825025 827023 827691 827397 826354 825083
58768H25083j177j650k883l991m369m334m188l811l285k746j739O4J730K134J813
$$ 825083 823906 822256 819373 815382 811013 806679 802491 798680 795395 792649 790910 790974 792704 794838 796651
58753G96651K178L200L725L733M226N051N039M365M511N641O338O233O655Q038
$$ 796651 798829 802029 805754 809487 813713 818764 823803 828168 832679 838320 844658 850891 857546 865584
58739H65584Q953Q503P679P491P634P741Q219R013R274Q928Q974R641R890R368
$$ 865584 874537 883040 890719 898210 905844 913585 921804 930817 940091 949019 957993 967634 977524 986892
58725I86892R020R119Q509O642M635L517K934K458K559L468M507N308O346P620
$$ 986892 995912 1005031 1013540 1020182 1024817 1028334 1031268 1033726 1036285 1039753 1044260 1049568 1055914 1063534
58711A063534Q184P562O293M577J947j262l773n303p047r607j2045j3675j5190
$$ 1063534 1071718 1079280 1085573 1090150 1092097 1090835 1087062 1081759 1074712 1065105 1053060 1039385 1024195
58698A024195j7267j9500k1420k3174k4551k4739k3639k2075k0291j7710j4543
$$ 1024195 1006928 987428 966008 942834 918283 893544 869905 847830 827539 809829 795286
58687G95286j1998j0459r055p527o750o895o868o264o050o646o937o084m671l319
$$ 795286 783288 772829 763774 756247 749497 742602 735734 729470 723420 716774 709837 703753 699082 695763
58673F95763j752M7J373K243L806O541R464J1803J3952J6190J7939J8944J9694
$$ 695763 694011 694058 695431 697674 701480 708021 717485 729288 743240 759430 777369 796313 816007
58660H16007K0104J9115J6114J1523N871j67m901o832o896p518r172j0069r458
$$ 816007 836111 855226 871340 882863 888734 888567 883666 876834 869938 862420 853248 843179 833721
58647H33721q731q680q284p119o459o850o821n230k853n99J771M090N104M606
$$ 833721 824990 816310 808026 800907 794448 787598 780777 775547 772694 772095 773866 777956 783060 787666
58633G87666M225M888N420M783L654K650J081j169k611k382j677j554j122O87
$$ 787666 791891 796779 802199 806982 810636 813286 814367 813198 810587 808205 806528 804974 803852 804539
58619H04539L266N646P978J0544J2880J5037J7935K1388K3628K3753K2689K0793
$$ 804539 807805 813451 821429 831973 844853 859890 877825 899213 922841 946594 969283 990076
58607I90076J6852J0767M866Q96k114n329p774q431q589r851j1462j1723j0725
$$ 990076 1006928 1017695 1022561 1023457 1021343 1016014 1008240 999809 991220 981369 969907 958184 947459
58594I47459r767r233q811q565q207o546l174N07L236N600Q576J1785J4437J6564
$$ 947459 937692 928459 919648 911083 902876 896330 893156 893663 896899 902499 911075 922860 937297 953861
58580I53861J8082J8248J7226J6468J6397J5409J2561R372P567O763N956N553
$$ 953861 971943 990191 1007417 1023885 1040282 1055691 1068252 1077624 1085191 1091954 1097910 1103463
58568A103463O303P785R453J1777J4991J8188K0839K3533K6229K7606K7286K6534
$$ 1103463 1109766 1117551 1127004 1138781 1153772 1171960 1192799 1216332 1242561 1270167 1297453 1323987
58556A323987K5620K2784J7327J1349O738K655k159o787r819j1597j2846j2982
$$ 1323987 1349607 1372391 1389718 1401067 1407805 1410460 1408301 1401514 1391695 1380098 1367252 1354270
58544A354270j1759j0742j1272j2664j4043j6023j8864k1136k1993k2696k4009
$$ 1354270 1342511 1331769 1320497 1307833 1293790 1277767 1258903 1237767 1215774 1193078 1169069
58533A169069k4328k2369j9545j7484j5428j2306r262p676o600m477j635J018
$$ 1169069 1144741 1122372 1102827 1085343 1069915 1057609 1048347 1040671 1034071 1029594 1027959 1028977
58521A028977L830O841Q514Q216P911R063J0077R189P604P168P079N775M086L616
$$ 1028977 1032807 1039648 1048162 1056378 1064289 1073352 1083429 1092618 1100222 1107390 1114469 1120244 1124330 1127946
58507A127946L766L100K085J761J453L09n89k99l44k366n214p005q156r738j0794
$$ 1127946 1131712 1134812 1136897 1138658 1140111 1140420 1139831 1139532 1139188 1136822 1131608 1124603 1116447 1106709 1095915
58492A095915j0191r242r543r954q662o463n060l873j518J290L333N611R393J3266
$$ 1095915 1085724 1076482 1066939 1056985 1048323 1041860 1036800 1032927 1031409 1032699 1036032 1041643 1051036 1064302
58478A064302J5277J6372J8505K0874K1145J9048J5766J1319N479k96m759q934
$$ 1064302 1079579 1095951 1114456 1135330 1156475 1175523 1191289 1202608 1208087 1207791 1203032 1194098
58466A194098j3600j6772j6752j5448j5254j4941j2278q569o521n519l067O13
$$ 1194098 1180498 1163726 1146974 1131526 1116272 1101331 1089053 1080484 1073963 1068444 1065377 1065990
58454A065990L499N728Q620J1132J1304R921Q914P446L540j785n917q776j1643
$$ 1065990 1069489 1075217 1083837 1094969 1106273 1116194 1125108 1132554 1136094 1134309 1128392 1119616 1107973
58441A107973j3352j1964q914p138o250l863m84J335J757L069N193O136O199P427
$$ 1107973 1094621 1082657 1073743 1066605 1060355 1056492 1056008 1057343 1059100 1062169 1067362 1073498 1079697 1087124
58427A087124R506J0435J0606J2100J4568J5869J5936J6071J5400J2325Q398O353
$$ 1087124 1096630 1107065 1117671 1129771 1144339 1160208 1176144 1192215 1207615 1219940 1228338 1234691
58415A234691N304K484j304k896k527l356n738p049o981p994j0486j2184j2485
$$ 1234691 1239995 1242479 1241175 1238279 1235752 1232396 1226658 1219609 1212628 1204634 1194148 1181964 1169479
58402A169479j2905j3264j1779q901o894n797l935j888j570k036q06J314J414
$$ 1169479 1156574 1143310 1131531 1122630 1115736 1109939 1106004 1104116 1102546 1100510 1099704 1101018 1102432
58389A102432j83o44k6q50k788l046j699j387j975q89J380J688K52O47L537N768
$$ 1102432 1102249 1101605 1101579 1100729 1097941 1094895 1093196 1091809 1089834 1088945 1090325 1092013 1092265 1092912 1096449 1102217
58373A102217O138O786Q307Q754Q100Q685J0669J1814J2053J3453J5617J6170
$$ 1102217 1108355 1115141 1123448 1132202 1140302 1148987 1159656 1171470 1183523 1196976 1212593 1228763
58361A228763J5650J6745J8862J8899J7162J6724J7139J4887J0103O666N286K868
$$ 1228763 1244413 1261158 1280020 1298919 1316081 1332805 1349944 1364831 1374934 1381600 1386886 1389754
58349A389754q88k641j831j540k208q63K547M520M611O228R834J1931J1905J3260
$$ 1389754 1388866 1386225 1384394 1382854 1380646 1379783 1382330 1386850 1391461 1397689 1407523 1419454 1431359 1444619
58335A444619J6767J8972J8900J9647K1863K2259K0173J8933J9132J7268J2777
$$ 1444619 1461386 1480358 1499258 1518905 1540768 1563027 1583200 1602133 1621265 1638533 1651310
58324A651310R693R388Q387N318L394L960M200L232L923O715Q170P560Q306J1156
$$ 1651310 1661003 1670391 1678778 1684096 1687490 1691450 1695650 1698882 1702805 1709520 1717690 1725250 1733556 1744712
58310A744712J2737J2482J4014J7871K0075J9655K0270K2643K2983K0783K0374
$$ 1744712 1757449 1769931 1783945 1801816 1821891 1841546 1861816 1884459 1907442 1928225 1948599
58299A948599K2756K3775K2391K2580K4952K5022K2179K1653K4936K7049K5987
$$ 1948599 1971355 1995130 2017521 2040101 2065053 2090075 2112254 2133907 2158843 2185892 2211879
58288B211879K5968K8360K8657K5726K4739K7374K8449K5882K4527K6382K6710
$$ 2211879 2237847 2266207 2294864 2320590 2345329 2372703 2401152 2427034 2451561 2477943 2504653
58277B504653K3925K3562K8022L2223L3818L7661M5614N2047N4400N7928O4896
$$ 2504653 2528578 2552140 2580162 2612385 2646203 2683864 2729478 2781525 2835925 2893853 2958749
58266B958749O9612O9444P0227P5095P8658P7989P8488Q2881Q5324Q2703Q0725
$$ 2958749 3028361 3097805 3168032 3243127 3321785 3399774 3478262 3561143 3646467 3729170 3809895
58255C809895Q2625Q3091P9712P8751Q2997Q5910Q4631Q6331R4496J01740J03791
$$ 3809895 3892520 3975611 4055323 4134074 4217071 4302981 4387612 4473943 4568439 4670179 4773970
58244D773970J07453J16799J25009J28261J33848J45664J55882J60178J66687
$$ 4773970 4881423 4998222 5123231 5251492 5385340 5531004 5686886 5847064 6013751
58235F013751J80272J92994K00086K09764K26714K42212K51652K64914K87629
$$ 6013751 6194023 6387017 6587103 6796867 7023581 7265793 7517445 7782359 8069988
58226H069988L09850L25711L45693L76201M06418M29783M58268M99911N43417
$$ 8069988 8379838 8705549 9051242 9427443 9833861 10263644 10721912 11221823 11765240
58217A1765240N81527O27387O89925P56474Q19226Q94297R93610J104018J217232
$$ 11765240 12346767 12974154 13664079 14420553 15239779 16134076 17127686 18231704 19448936
58208A9448936J352681J525793J723632J940188K204287K541999K946484L420401
$$ 19448936 20801617 22327410 24051042 25991230 28195517 30737516 33684000 37104401
58200C7104401M010620M760234N665658O726270P993895R526877J1352669J3536489
$$ 37104401 41115021 45875255 51540913 58267183 66261078 75787955 87140624 100677113
58192A00677113J6213280J9459784K3205350K7363345L1887701L6385630L9633224
$$ 100677113 116890393 136350177 159555527 186918872 218806573 255192203 294825427
58185B94825427L9798180L5453507K6457225J3946237k36523j3987798k5242767
$$ 294825427 334623607 370077114 396534339 410480576 410244053 396256255 371013488
58178C71013488l2508364l5455418l4922435l2219121k8408549k4144640j9897085
$$ 371013488 338505124 303049706 268127271 235908150 207499601 183354961 163457876
58171A63457876j6093152j3059576j0950726r750817r291011r274229r356353
$$ 163457876 147364724 134305148 123354422 113603605 104312594 95038365 85682012
58164H5682012r260585q851155q142159p256012o341503n491229m725568m042772
$$ 85682012 76421427 67570272 59428113 52172101 45830598 40339369 35613801 31571029
58156C1571029l453184k959810k542387k182415j881328j638291j433404j250010
$$ 31571029 28117845 25158035 22615648 20433233 18551905 16913614 15480210 14230200
58148A4230200j092845r67710q62830p66621o84989o24350n74424n24123m78708
$$ 14230200 13137355 12169645 11306815 10540194 9855205 9230855 8656431 8132308 7653600
58139G653600m45425m16678l82880l48603l21283k96261k67084k38920k18348
$$ 7653600 7208175 6791497 6408617 6060014 5738731 5442470 5175386 4936466 4718118
58130D718118k00984j81727j66268j60158j57096j49959j42990j41422j39593
$$ 4718118 4517134 4335407 4169139 4008981 3851885 3701926 3558936 3417514 3277921
58121C277921j31206j21468j17062j13569j04622r4532q9991q7578q1115p3596
$$ 3277921 3146715 3025247 2908185 2794616 2689994 2595462 2505471 2417893 2336778 2263182
58111B263182p0528o8793o3172n6943n5355n5155n0974m5671m4188m3503l8723
$$ 2263182 2192654 2123861 2060689 2003746 1948391 1893236 1842262 1796591 1752403 1708900 1670177
58100A670177l3094l1987l2678k9983k6430k7090k9510k8597k6579k8498l2199
$$ 1670177 1637083 1605096 1572418 1542435 1516005 1488915 1459405 1430808 1404229 1375731 1343532
58089A343532l2212k9523k8529k8104k4556j9840j8312j8602j6791j4366j5127
$$ 1343532 1311320 1281797 1253268 1225164 1200608 1180768 1162456 1143854 1127063 1112697 1097570
58078A097570j7493j7530j6482j7786j9801j8858j6467j6312j7158j5721j3508
$$ 1097570 1080077 1062547 1046065 1028279 1008478 989620 973153 956841 939683 923962 910454
58067I10454j3792j4876j3283j0624j0424j1128r201o221n989p327o704n325o670
$$ 910454 896662 881786 868503 857879 847455 836327 827126 820905 814916 807589 800885 795560 788890
58054G88890r342r385p541p521q943q581o805o460p036o020m295m345n009l787
$$ 788890 779548 770163 762622 755101 746158 737577 730772 724312 717276 711256 706961 702616 697607 693820
58040F93820k267l440n721n614m253n143p389p408n677n541o842o829o026p118
$$ 693820 691553 688113 682392 676778 672525 667382 659993 652585 646908 641367 634525 627696 621670 614552
58026F14552r198r194p808q141r514q639o079n436o739o537m298k980l358l235
$$ 614552 605354 596160 588352 580211 570697 562058 555979 550543 543804 537267 532969 529989 526631 523396
58012E23396k258k344l262k697q30k59j264j572o88k85n20L5J141J449J594K876
$$ 523396 521138 518794 515532 512835 512005 511746 510482 508910 508222 507937 507417 507452 508593 510042 511636 514512
57996E14512L939K815J087J666L644L999L132L809N573N472L686L233M360M376
$$ 514512 518451 521266 522353 524019 527663 531662 534794 538603 544176 549648 553334 556567 560927 565303
57982E65303K976K621L501L125J287N95J572J793N30j58M17N64p7M5O87l00k738
$$ 565303 568279 570900 574401 577526 578813 579408 580980 582773 583303 583145 583562 584126 584049 584094 584781 584481 581743
57965E81743l746k428j067r07n42O15R71j14j197j626k447l718m038l435l664
$$ 581743 577997 575569 574502 573595 573053 573668 574639 574525 573328 571702 569255 565537 561499 558064 554400
57950E54400n040n853n470n046m849l764j910p79m70M39K025K928L224M424O431
$$ 554400 549360 543507 538037 532991 528142 524378 522468 521689 521219 521658 523683 526611 529835 534259 540690
57935E40690P499P374P610Q556Q992Q808R145R758R220P736O835O334M714K335
$$ 540690 548189 555563 563173 571729 580721 589529 598674 608432 617652 625388 632223 638557 643271 645606
57921F45606R83L58j550m525o229o378p156r050r942r043q221q500q578p682o829
$$ 645606 646589 646947 645397 640872 634643 628265 621109 612059 602117 593074 584853 576353 567775 560093 553264
57906E53264o361n282l848l784n148n936n617n965p622q884q848q759r191q785
$$ 553264 546903 541621 537773 533989 528841 522905 517288 511323 503701 494817 485969 477210 468019 459234
57892D59234o950n104m135l133j600m34P4P93J582J192j08m60M63J016Q10J349
$$ 459234 452284 447180 443045 439912 438312 437878 437952 438745 440327 441519 441411 440951 441414 442430 443240 444589
57876D44589K708K702N21j742k438k481k961l311l103l129l467k878j257k41l99
$$ 444589 447297 449999 450520 448778 446340 443859 440898 437587 434484 431355 427888 425010 423753 423512 423113
57861D23113k42R33J834J842K229L549M398M176M424O022P444P412P033P693Q857
$$ 423113 422871 423804 425638 427480 429709 433258 437656 441832 446256 452278 459722 467134 474167 481860 490717
57846D90717R388R246Q623P185N257L968L352K311R56P08J356P46j681l744m051
$$ 490717 500105 509351 517974 525159 530416 534384 537736 540047 541003 541711 543067 543813 542132 538388 534337
57831E34337l957m586m762l590k486k684l043k255j115p97q22n25n66j237j194
$$ 534337 530380 525794 521032 517442 514956 512272 509229 506974 505859 505062 504240 503715 503149 501912 500718
57816E00718L54J964K177J666J477J128J13m59L92J736K431K869L411K861M44
$$ 500718 501072 503036 505213 506879 508356 509484 509597 509138 509530 511266 513697 516566 519977 522838 523282
57801E23282k385l983m892o222p301o954n835n338n262m507l170k219j853j748
$$ 523282 520897 516914 512022 505800 498499 491545 485710 480372 475110 470603 467433 465214 463361 461613
57787D61613k038k651k653j641p72j046j676j505q66n50j59R78K235K683K741
$$ 461613 459575 456924 454271 452630 451858 450812 449136 447631 446765 446215 446056 447034 449269 451952 454693
57772D54693L304M019L833K703J476P05M90P79R80J51j585k908l255l623m663
$$ 454693 457997 462016 465849 468552 470028 470733 471223 472002 472982 473133 471548 468640 465385 461762 457099
57757D57099n432n114m458m362m395l979l664l903l895k933j683q98k00O80Q96
$$ 457099 451667 446553 442095 437733 433338 429359 425695 421792 417897 414964 413281 412383 412183 412863 413759
57742D13759P3n74j20M35l2q22q29n39q61j212o01M26P46N98Q06J011M62k37M4
$$ 413759 413832 413258 413138 413573 413541 412719 411890 411351 410490 409278 408677 409103 409849 410447 411253 412264 412726 412489 412533
57723D12533J013J489J327J252J374J340J334J595J535P21KL08J044R91J97m33
$$ 412533 413546 415035 416362 417614 418988 420328 421662 423257 424792 425513 425515 425823 426867 427858 428055 427622
57707D27622o72q81r68p50p00j165j529j184o18l82KR91J850J789J369J423J606
$$ 427622 426950 426069 425101 424351 423651 422486 420957 419773 419155 418773 418775 419766 421616 423405 424774 426197 427803
57690D27803J247P14N98N41K21L58J337K027J617J382K890N495P569R157J1396
$$ 427803 429050 429764 430362 430903 431124 431482 432819 434846 436463 437845 440735 446230 453799 462956 474352
57675D74352J4104J6290J8474K2375K8396L5338M2400M9768N7448O5032P2135
$$ 474352 488456 504746 523220 545595 573991 609329 651729 701497 758945 823977 896112
57664H96112P7324P7095O7892M9280K4029m175l1476n3377o6393p0637o9111o4349
$$ 896112 973436 1050531 1118423 1167703 1191732 1187557 1156081 1102704 1036311 965674 896563 832214
57652H32214n7250m8862m1018l4729k9567k5050k1269j7947j4413j0818q122o602
$$ 832214 774964 726102 685084 650355 620788 595738 574469 556522 542109 531291 523169 516567
57640E16567n537m530l949l813l424k357r18M67J531J905J561J326J944K829K773
$$ 516567 511030 506500 502551 498738 495314 492957 492039 492506 494037 495942 497503 498829 500773 503602 506375
57625E06375J731P92N72P32Q88R37O91J72M4P33J455J205L05j73j15j36j31N23
$$ 506375 508106 508898 509470 510202 511090 512027 512718 512890 512934 513667 515122 516327 516632 516459 516344 516208 516077 516600
57607E16600J554K016J848J804J999J897J630J849K365K307J701J486J876K059
$$ 516600 518154 520170 522018 523822 525821 527718 529348 531197 533562 535869 537570 539056 540932 542991
57593E42991J670J304J302J199O04k95j199j782j456j03J201J282N52L52Q62J006
$$ 542991 544661 545965 547267 548466 549070 548775 547576 545794 544338 544235 545436 546718 547270 547622 548484 549490
57577E49490L71k47k45J06N56J179J675J531R99Q53J128J171Q72P44Q73J016J527
$$ 549490 549861 549614 549369 549475 550031 551210 552885 554416 555415 556268 557396 558567 559439 560183 561056 562072 563599
57560E63599K836M129M109L018K434K934L511L484L356L410L125K546K730M132
$$ 563599 566435 570564 574673 577691 580125 583059 586570 590054 593410 596820 599945 602491 605221 609353
57546F09353N707O369O197N652M705L470K693K912L818M891N926O593O406N517
$$ 609353 615060 621429 627626 633278 637983 641453 644146 647058 650876 655767 661693 668286 674692 680209
57532F80209M723M320L792K958K461K739L351L751L937L990L720L182K840K885
$$ 680209 684932 689252 693044 696002 698463 701202 704553 708304 712241 716231 719951 723133 725973 728858
57518G28858L052L292L845M558M893M834M976N519O011O213O433O754O804O504
$$ 728858 731910 735202 739047 743605 748498 753332 758308 763827 769838 776051 782484 789238 796042 802546
57504H02546O216O044N709N336N490O207O795O793O433O036N572M978M246L252
$$ 802546 808762 814806 820515 825851 831341 837548 844343 851136 857569 863605 869177 874155 878401 881653
57490H81653K209J974L076M623N251M907M637M809M832M576M625N042N185M980
$$ 881653 883862 885836 888912 893535 898786 903693 908330 913139 917971 922547 927172 932214 937399 942379
57476I42379N073N578N909O107O888Q080Q417P455O376O301O936P442P556P318
$$ 942379 947452 953030 958939 965046 971934 980014 988431 995886 1002262 1008563 1015499 1022941 1030497 1037815
57462A037815O748O354O949Q366R315R017Q154P787Q218R222J0432J1120J0645
$$ 1037815 1044563 1050917 1057866 1066232 1075547 1084564 1092718 1100505 1108723 1117945 1128377 1139497 1150142
57449A150142R485Q777Q690Q401P895Q288R886J1413J1876J1762J1674J1197J0162
$$ 1150142 1159627 1168404 1177094 1185495 1193390 1201678 1211564 1222977 1234853 1246615 1258289 1269486 1279648
57436A279648R620J0283J1169J1073J0497J0713J1617J1931J1148J0106R732J0162
$$ 1279648 1289268 1299551 1310720 1321793 1332290 1343003 1354620 1366551 1377699 1387805 1397537 1407699
57424A407699J1041J1958J2577J2801J2689J2195J1324J0661J0958J2047J2879
$$ 1407699 1418740 1430698 1443275 1456076 1468765 1480960 1492284 1502945 1513903 1525950 1538829
57413A538829J2966J2838J2873J2669J2135J2059J2888J3815J3943J3573J3532
$$ 1538829 1551795 1564633 1577506 1590175 1602310 1614369 1627257 1641072 1655015 1668588 1682120
57402A682120J3854J3994J3834J3708J3788J4057J4525J4974J5000J4640J4545
$$ 1682120 1695974 1709968 1723802 1737510 1751298 1765355 1779880 1794854 1809854 1824494 1839039
57391A839039J5073J5835J6410J6842J7095J6799J5989J5454J5776J6621J7411
$$ 1839039 1854112 1869947 1886357 1903199 1920294 1937093 1953082 1968536 1984312 2000933 2018344
57380B018344J8057J8676J9221J9784K0582K1396K1685K1491K1431K1561K1254
$$ 2018344 2036401 2055077 2074298 2094082 2114664 2136060 2157745 2179236 2200667 2222228 2243482
57369B243482K0405J9768J9734J9873K0056K0822K2122K2918K2682K2200K2227
$$ 2243482 2263887 2283655 2303389 2323262 2343318 2364140 2386262 2409180 2431862 2454062 2476289
57358B476289K2474K2628K3149K4211K4967K4770K4150K3817K3766K4060K5177
$$ 2476289 2498763 2521391 2544540 2568751 2593718 2618488 2642638 2666455 2690221 2714281 2739458
57347B739458K6685K7025K5775K4747K5414K6591K6386K5323K5495K7312K9093
$$ 2739458 2766143 2793168 2818943 2843690 2869104 2895695 2922081 2947404 2972899 3000211 3029304
57336C029304K9648K9462K9310K9274K9296K9468K9544K9200K8757K8840K9402
$$ 3029304 3058952 3088414 3117724 3146998 3176294 3205762 3235306 3264506 3293263 3322103 3351505
57325C351505K9929L0334L0756L0849L0288K9791L0445L2043L3152L2934L2043
$$ 3351505 3381434 3411768 3442524 3473373 3503661 3533452 3563897 3595940 3629092 3662026 3694069
57314C694069L1554L1743L2086L2066L1836L2210L3726L5581L6160L5009L3538
$$ 3694069 3725623 3757366 3789452 3821518 3853354 3885564 3919290 3954871 3991031 4026040 4059578
57303D059578L3261L4124L5197L6112L6843L6936L6169L5412L5658L6628L7338
$$ 4059578 4092839 4126963 4162160 4198272 4235115 4272051 4308220 4343632 4379290 4415918 4453256
57292D453256L7566L7720L7686L7053L6213L6050L6694L7503L8149L8787L9423
$$ 4453256 4490822 4528542 4566228 4603281 4639494 4675544 4712238 4749741 4787890 4826677 4866100
57281D866100L9963M0613M1445M1947M1851M1912M2816M3835M3724M2551M1388
$$ 4866100 4906063 4946676 4988121 5030068 5071919 5113831 5156647 5200482 5244206 5286757 5328145
57270E328145M0566L9600L8642L8528L9305L9975L9892L9357L8760L8189L7982
$$ 5328145 5368711 5408311 5446953 5485481 5524786 5564761 5604653 5644010 5682770 5720959 5758941
57259E758941L8571L9572M0010L9687L9440L9917M0994M2396M3964M5214M5584
$$ 5758941 5797512 5837084 5877094 5916781 5956221 5996138 6037132 6079528 6123492 6168706 6214290
57248F214290M5276M5026M4975M4608M3859M3248M2798M1813M0018L8069L6649
$$ 6214290 6259566 6304592 6349567 6394175 6438034 6481282 6524080 6565893 6605911 6643980 6680629
57237F680629L5781L5212L4729L3885L2203K9939K8023K7054K6924K7373K8173
$$ 6680629 6716410 6751622 6786351 6820236 6852439 6882378 6910401 6937455 6964379 6991752 7019925
57226G019925K8773K8677K8216K8206K8761K9290K9760L0846L2643L4278L5213
$$ 7019925 7048698 7077375 7105591 7133797 7162558 7191848 7221608 7252454 7285097 7319375 7354588
57215G354588L6019L7281L8581L9166L8989L8525L8094L7797L7624L7170L5812
$$ 7354588 7390607 7427888 7466469 7505635 7544624 7583149 7621243 7659040 7696664 7733834 7769646
57204G769646L3612L1575L0435K9663K8161K5627K2735K0177J8027J5926J3529
$$ 7769646 7803258 7834833 7865268 7894931 7923092 7948719 7971454 7991631 8009658 8025584 8039113
57193H039113J0853Q385O729O017N829N818O014O364O312N324L604J806Q6k034
$$ 8039113 8049966 8058351 8065080 8071097 8076926 8082744 8088758 8095122 8101434 8106758 8110362 8112168 8112254 8110220
57179H110220m785p594r797j1603j3761j6355j8537j9645k0082k0620k1353k1945
$$ 8110220 8105435 8097841 8088044 8076441 8062680 8046325 8027788 8008143 7988061 7967441 7946088 7924143
57167G924143k2491k3417k4672k5804k6812k8177l0052l2131l4356l6935l9613
$$ 7924143 7901652 7878235 7853563 7827759 7800947 7772770 7742718 7710587 7676231 7639296 7599683
57156G599683m1737m3193m4445m5488m5725m4978m3592m1313l7236l1416k5277
$$ 7599683 7557946 7514753 7470308 7424820 7379095 7334117 7290525 7249212 7211976 7180560 7155283
57145G155283j9804j4465q712l454J8J638K040J068k042p468j4639k2860l1295
$$ 7155283 7135479 7121014 7112302 7108848 7108866 7110504 7112544 7113612 7111570 7104102 7089463 7066603 7035308
57132G035308l8824m4668m8722n0715m9644m4846l7072k7832j8151q594j8O555
$$ 7035308 6996484 6951816 6903094 6852379 6802735 6757889 6720817 6692985 6674834 6666240 6666222 6672777
57120F672777J0649J2553J3204J4064J6557K1436K9089M0213N5257P3329R2998
$$ 6672777 6683426 6695979 6709183 6723247 6739804 6761240 6790329 6830542 6885799 6959128 7052126
57109G052126J14211J38233J66005J98253K37201K86246L47700M22789N13868
$$ 7052126 7166337 7304570 7470575 7668828 7906029 8192275 8539975 8962764 9476632
57100I476632O24587P57945R16978J107399J336324J607615J921197K276785K674134
$$ 9476632 10101219 10859164 11776142 12883541 14219865 15827480 17748677 20025462 22699596
57091B2699596L109117L573478M057802M548202N019920N442234N788673O025394
$$ 22699596 25808713 29382191 33439993 37988195 43008115 48450349 54239022 60264416
57083F0264416O080091N841986N224783M242708L017458J706758M28560p57330
$$ 60264416 66344507 72186493 77411276 81653984 84671442 86378200 86806760 86049430
57075H6049430j823722k752331l527646m137936m578959m860746n007815n046659
$$ 86049430 84225708 81473377 77945731 73807795 69228836 64368090 59360275 54313616
57067E4313616m993509m856701m646417m376685m060915l711939l345406k977724
$$ 54313616 49320107 44463406 39816989 35440304 31379389 27667450 24322044 21344320
57059B1344320k620670k281658j968171j687441j442117j230219j049487q98509
$$ 21344320 18723650 16441992 14473821 12786380 11344263 10114044 9064557 8166048
57051H166048p73876o69918n82063n08246m47209l97790l59619l31716l10330
$$ 8166048 7392172 6722254 6140191 5631945 5184736 4786946 4427327 4095611 3785281
57042C785281k90460k69712k48743k28287k07976j87958j69275j52254j36304
$$ 3785281 3494821 3225109 2976366 2748079 2540103 2352145 2182870 2030616 1894312
57033A894312j21459j08412r7016q6348p6249o7270n9198n1125m2835l4668k6145
$$ 1894312 1772853 1664441 1567425 1481077 1404828 1337558 1278360 1227235 1184400 1149732 1123587
57022A123587j6243m906P043J9312L2236M5631N8453O8967P3930O8583M9575J8349
$$ 1123587 1107344 1102438 1109481 1128793 1161029 1206660 1265113 1334080 1408010 1476593 1526168 1544517
57010A544517j9152n5748q5407j04131j11109j09132j02346r3386q3300p3195
$$ 1544517 1525365 1469617 1384210 1280079 1168970 1059838 957492 864106 780806 707611
57000G07611o4143n5981m7959m0445l4453k9805k5276k0482j6209j2931j0308
$$ 707611 643468 587487 539528 499083 464630 434825 409549 389067 372858 359927 349619
56989C49619p953n544k477J482N442Q408J0510J2093J2308R977N344l19o164j1405
$$ 349619 341666 336122 333645 335127 340569 348977 359487 371580 383888 393865 399209 398890 392726 381321
56975C81321j4510j4586j3060j2087j1720j0401p825n311l574k049l77J253L270
$$ 381321 366811 352225 339165 327078 315358 304957 297132 291821 288247 286198 285821 287074 290344
56962B90344O411J0181J3260J5541J8096K1067K3148K3172K0738J5412P093k668
$$ 290344 296755 306936 320196 335737 353833 374900 398048 421220 441958 457370 464463 461795
56950D61795j1340j7656k1851k3922k3384k0833j7901j5283j2420r237o505m216
$$ 461795 450455 432799 410948 387026 363642 342809 324908 309625 297205 287968 281463 277247
56938B77247j266K716O816J0519J4478J9188K4214K9007L2995L4468L1046K2056
$$ 277247 275981 278697 285513 296032 310510 329698 353912 382919 415914 450382 481428 503484
56926E03484R479l866j5932k5279l0940l3164l3166l1723k8936k5432k2328j9791
$$ 503484 512963 509097 493165 467886 436946 403782 370616 338893 309957 284525 262197 242406
56914B42406j7013j3929j1573j0406r685q852q141p434o003l933k330j611r48
$$ 242406 225393 211464 199891 189485 179800 170948 162807 155373 149370 145437 143107 141496 140548
56901A40548R9Q36R05J045J720K370K736L587N312P109Q490J0283J3215J6569
$$ 140548 140647 141483 142388 143433 145153 147523 150259 153846 159158 166267 174757 185040 198255 214824
56887B14824J9310K1481K3412K4313K2801J8428J1946M540k579q350j2239j4203
$$ 214824 234134 255615 279027 303340 326141 344569 356515 361055 358476 350126 337887 323684
56875C23684j4223j2419r634o922m344j190K467N666Q263J1464J6090K1467K6785
$$ 323684 309461 297042 287408 280486 276142 274952 277419 283085 291348 302812 318902 340369 367154
56862C67154L2423L9023M5969N1505N3834N1543M3713L0446J3250n249k1847l3552
$$ 367154 399577 438600 484569 536074 589908 641451 685164 715610 728860 723611 701764 668212
56850F68212l8994l9239l6531l2297k6949k1044j5169q890j414O722J4211K1298
$$ 668212 629218 589979 553448 521151 494202 473158 457989 449099 447685 454407 468618 489916
56838D89916K9727M0046N0824O1086P1413Q1455Q7922Q6576P5377N4946K7402
$$ 489916 519643 559689 610513 671599 743012 824467 912389 998965 1074342 1129288 1156690
56827A156690l749l3580n7389p2657p9243p8495p2684o4335n5131m5626l6200
$$ 1156690 1152941 1119361 1061972 989315 910072 831577 758893 694558 639427 593801 557601
56816E57601k7389j9054j0336r29Q456J7357K6349L6044M6173N5733O2850O4355
$$ 557601 530212 511158 500822 499893 508349 525706 552055 588099 634272 690005 752855 817210
56804H17210N7172M1109J9315m401k7377m7052o0366o5863o5127o0882n4558m6695
$$ 817210 874382 915491 934806 930405 903028 855976 795610 729747 664620 603738 549180 502485
56792E02485l8475l1206k4906j8668j2110n584N63O161J1181J6099K1659K7595
$$ 502485 464010 432804 407898 389230 377120 371536 372099 378260 389441 405540 427199 454794
56780D54794L2160L3404L0347K2820J1282k607j6241k7554l5595l9760l9862l7305
$$ 454794 486954 520358 550705 573525 584807 582200 565959 538405 502810 463050 423188 385883
56768C85883l4462l2136k9145k5005k1174j8652j6273j2926r744q323q103p383
$$ 385883 351421 319285 290140 265135 243961 225309 209036 196110 186366 178043 169940 162557
56756A62557n947m823m210l513k841k837l278l312k805k238j670j010q29j635
$$ 162557 156610 151787 147577 144064 141223 138386 135108 131796 128991 126753 125083 124073 123244 121609
56742A21609k731k996k464k033j944j731j321j091j027q22o23p55q91l99O77J609
$$ 121609 118878 115882 113418 111385 109441 107710 106389 105298 104271 103449 102826 102071 101180 100781 101458 103067
56726A03067J892J550Q76L07K22M86O09N71Q10J228J113M39J38O73J365J719K145
$$ 103067 104959 106509 107385 107692 107914 108400 109009 109580 110390 111618 112731 113170 113308 113981 115346 117065 119210
56709A19210K767K780J849R32Q23J009Q83Q41J199J274O15k3k9qm08m59L28Q78
$$ 119210 121977 124757 126606 127538 128361 129370 130253 131094 132293 133567 134182 134159 134130 134122 133714 133255 133583 134461
56691A34461K51o62o36q2M5J45R41J684J169j69r63r77q86o74M5P57O99J53l05
$$ 134461 134712 134050 133414 133332 133377 133522 134463 136147 137316 137147 136184 135207 134321 133647 133692 134449 135148 135301 134996
56672A34996j018k209k683j384N55J259Q93J031J818J881Q08k72o12n79m39M9
$$ 134996 133978 131769 129086 127702 128257 129516 130409 131440 133258 135139 135947 135675 135063 134484 134045 134094
56656A34094P56J218J416J500J108J53l52L63J347J287O24O86J306J226L69j00
$$ 134094 134850 136068 137484 138984 140092 140245 139893 140256 141603 142890 143514 144200 145506 146732 147101 147001
56640A47001K18O73J009J511J949J949K015K677L105K274R59P21J441J771J615
$$ 147001 147219 147892 148901 150412 152361 154310 156325 159002 162107 164381 165340 166061 167502 169273 170888
56625A70888J976K639K221O17o81q21l43L80J489K351J877L72o29o02m51o15n16
$$ 170888 172864 175503 177724 178341 177660 176839 176496 176876 178365 180716 182593 182965 182336 181734 181283 180668 180152
56608A80152l8J63N6K96P82P29K73L18P32M68m89j027q69q06q73k24Q80R65l11
$$ 180152 180114 180277 180333 180629 181411 182140 182413 182731 183463 183931 183442 182415 181546 180740 179867 179643 180523 181488 181177
56589A81177j458j372o77l41m26o93j059j105m47K54K9o46m46N39Q87L17J70J116
$$ 181177 179719 178347 177670 177329 176903 176210 175151 174046 173599 173853 173882 173236 172790 173329 174216 174533 174703 175819
56571A75819K126K288K003J885J916K105K649L176L118K891L413M550N520O520
$$ 175819 177945 180233 182236 184121 186037 188142 190791 193967 197085 199976 203389 207939 213459 219979
56557B19979Q154R605R332P565N939M836L298J521R44J635J996J491J213J312
$$ 219979 228133 237738 247070 254635 260574 265410 268708 270229 271173 272808 274804 276295 277508 278820
56543B78820M61j481k837k872k829l282l052j791j109j829k468j902j381k257
$$ 278820 279281 277800 274963 272091 269262 265980 262928 261137 260028 258199 255731 253829 252448 250191
56529B50191l672m131l703l149k437j534j224j737k018j511j256k009k742k307
$$ 250191 246519 242388 238685 235536 233099 231565 230341 228604 226586 225075 223819 221810 219068 216761
56515B16761j153l10J9j60j115k277k190o94L73j89j208j215o55p04j355j977
$$ 216761 215608 215298 215317 215157 214042 211765 209575 208881 209254 209065 207857 206642 205987 205283 203928 201951
56499B01951k505k856k428j318o44p32m53O10J080Q2j092j065n17o67j021m23
$$ 201951 199446 196590 194162 192844 192200 191468 191015 191625 192705 192787 191695 190630 190113 189446 188425 188002
56483A88002Q47J625J606J167L40p40j286r22l95k54R0J036J697J235K65j10L14
$$ 188002 188849 190474 192080 193247 193587 192847 191561 190639 190244 189990 190080 191116 192813 194048 194313 194203 194517
56466A94517J219K372L085K441Q25q6L72R79P65L47K99L8o34o96K17R14O79M78
$$ 194517 195736 198108 201193 203634 204459 204373 204745 205724 206489 206836 207135 207173 206539 205843 206060 206974 207653 208131
56448B08131Q92R33J56o6J055K033J553O77P48J058N75J55Q13J408M64j108j380
$$ 208131 209023 209956 210112 210046 211101 213134 214687 215364 216112 217170 217745 217900 218713 220121 220585 219477 218097
56431B18097m51J34oj69k86n34j66J247K360J782M50K37J065J372P87K93K76K95
$$ 218097 217646 217780 217774 217605 217319 216785 216619 217866 220226 222008 222458 222695 223760 225132 225919 226212 226488 226783
56413B26783L62Q01J222J095Q26R23Q91K24l49l9M92K83k13j02K71J46l6M70J062
$$ 226783 227145 227946 229168 230263 231089 232012 232903 233127 232778 232739 233231 233514 233301 233199 233470 233616 233580 234050 235112
56394B35112P26p8o3R64K135K850K897K110J048R72K064K805K288J676K003K238
$$ 235112 235838 235760 235697 236661 238796 241646 244543 246653 247701 248673 250737 253542 255830 257506 259509 261747
56378B61747J210o2j1Q74J106P43Q13J197J071O36N62N36O4k05M22J217J251R74
$$ 261747 262957 262895 262884 263758 264864 265607 266420 267617 268688 269324 269886 270422 270486 270281 270703 271920 273171 274145
56360B74145R98P16k61p10J93J019L60n81kJ319J401M38J50O12M49m14p05j59
$$ 274145 275143 275859 275598 274888 275081 276100 276460 275879 275877 277196 278597 279035 279185 279797 280246 279832 279127 278968
56342B78968L63O89J262J663J288Q59J464K598K995K718K660K726K394K191K774
$$ 278968 279331 280020 281282 282945 284233 285092 286556 289154 292149 294867 297527 300253 302647 304838 307612
56327C07612L361K919K016J715J670J179Q86J536K233J990J682K322K876K105
$$ 307612 310973 313892 315908 317623 319293 320472 321358 322894 325127 327117 328799 331121 333997 336102
56313C36102J119J496K301J728N04O62J969K571K391K904M178M916M977N191N297
$$ 336102 337221 338717 341018 342746 343250 343912 345881 348452 350843 353747 357925 362841 367818 373009 378306
56298C78306M661M312N566P296P216N323L487K332J177L62Q54K024K478K539L423
$$ 378306 382967 387279 392845 400141 407357 412680 416167 418499 419676 420038 420892 422916 425394 427933 431356
56283D31356M727N213N274N964O567N898N037N836P648Q487Q508R290J0561J0862
$$ 431356 436083 441296 446570 452534 459101 464999 470036 475872 483520 492007 500515 509805 520366 531228
56269E31228J0604J1280J2391J2487J2371J3896J6409J7845J8609K0685K3667
$$ 531228 541832 553112 565503 577990 590361 604257 620666 638511 657120 677805 701472
56258G01472K5481K6569K9417L4254L9024M3436M9087N5765O1537O6622P3312
$$ 701472 726953 753522 782939 817193 856217 899653 948740 1004505 1066042 1132664 1205976
56247A205976Q1831Q9957R6926J03999J11056J16359J19899J23244J25832J25118
$$ 1205976 1287807 1377764 1474690 1578689 1689745 1806104 1926003 2049247 2175079 2300197
56237B300197J20698J14535J06866R5594Q0193O2460M3083K1264j868k3248m1856
$$ 2300197 2420895 2535430 2642296 2737890 2818083 2880543 2923626 2944890 2943022 2919774 2877918
56226B877918n9137p5111q7837r7137j04955j11444j14580j14245j12783j10839
$$ 2877918 2818781 2743670 2655833 2558696 2453741 2342297 2227717 2113472 2000689 1889850
56216A889850j06629j00089r3824q8935q3655p7115p0788o5268n9336n3090m8412
$$ 1889850 1783221 1683132 1589308 1500373 1416718 1339603 1268815 1203547 1144211 1091121 1042709
56205A042709m5387m1830l7167l3223l0468k7185k3119k0157j8652j6830j4504
$$ 1042709 997322 955492 918325 885102 854634 827449 804330 784173 765521 748691 734187
56194G34187j3487j3636j2534r950q446q684q216o061m330m195m200l642l721
$$ 734187 720700 707064 694530 684580 676134 667450 659234 653173 648843 644648 640448 636806 633085
56181F33085m263l390j338o43j633j817n41J09k13O14K561K841J097M64K128L588
$$ 633085 628822 625432 624094 623451 621818 620001 619460 619569 619356 619970 622531 625372 626469 626933 629061 632649
56165F32649L594L992N252N147L494L268N254O504N837N884P842R224Q851R138
$$ 632649 636243 640235 645487 650634 654128 657396 662650 669154 674991 680875 688717 697941 706792 715930
56151G15930J1238J2856J2976J3873J6341J7981J8254K0118K4473K8205L0003
$$ 715930 727168 740024 753000 766873 783214 801195 819449 839567 864040 892245 922248
56140I22248L2754L7728M1988M4304M8119N5656O4398P2441Q1873R3477J03357
$$ 922248 955002 992730 1034718 1079022 1127141 1182797 1247195 1319636 1401509 1494986 1598343
56129A598343J08197J09042J06862R9704Q7623P5289O6122N8575N1212M6012M3270
$$ 1598343 1706540 1815582 1922444 2022148 2109771 2185060 2251182 2309757 2360969 2406981 2450251
56118B450251L8724K9606J8620Q496j990j3191k1532k5368k8614l4673m2028m9425
$$ 2450251 2488975 2518581 2537201 2545697 2543707 2530516 2508984 2483616 2455002 2420329 2378301 2328876
56106B328876n9504p2953q4830r1261r4416r6542r4945q7646p8294p0396o2024
$$ 2328876 2269372 2196419 2111589 2020328 1925912 1829370 1734425 1646779 1568485 1498089 1436065
56095A436065n1236m1228l4938k9758k2889j6735j3785j1395o928k955k075j694
$$ 1436065 1384829 1343601 1308663 1278905 1256016 1239281 1225496 1214101 1207173 1204218 1202143 1200449
56083A200449Q58L161K914K948N756Q388Q127P758R845J1456J0137R327J1962
$$ 1200449 1201307 1204468 1207382 1210330 1216086 1224474 1232601 1240359 1250204 1261660 1271797 1281124 1293086
56070A293086J4583J3823J2858J5239J8189J8402J8562K1563K4176K3184K1891
$$ 1293086 1307669 1321492 1334350 1349589 1367778 1386180 1404742 1426305 1450481 1473665 1495556
56059A495556K3747K5411K3177K0266K0621K1498J9437J7504J9115K0848J9025
$$ 1495556 1519303 1544714 1567891 1588157 1608778 1630276 1649713 1667217 1686332 1707180 1726205
56048A726205J7200J9412K2302K1818K1246K4333K7121K5187K2437K3860K6184
$$ 1726205 1743405 1762817 1785119 1806937 1828183 1852516 1879637 1904824 1927261 1951121 1977305
56037A977305K4734K2880K5349K8846K8908K9326L4935M1754M4391M6355N2684
$$ 1977305 2002039 2024919 2050268 2079114 2108022 2137348 2172283 2214037 2258428 2304783 2357467
56026B357467N9347O0696O0429O4118O8048O6822O4809O8150P2577P1444O8622
$$ 2357467 2416814 2477510 2537939 2602057 2670105 2736927 2801736 2869886 2942463 3013907 3082529
56015C082529P0946P5148P5258P5526Q2489R1443R4611R5503J01183J07939J09174
$$ 3082529 3153475 3228623 3303881 3379407 3461896 3553339 3647950 3743453 3844636 3952575 4061749
56004D061749J09716J17088J26359J29352J30861J39522J50753J55835J59522
$$ 4061749 4171465 4288553 4414912 4544264 4675125 4814647 4965400 5121235 5280757
55995E280757J70968J85464J93613K00155K14586K31797K42016K51035K69760
$$ 5280757 5451725 5637189 5830802 6030957 6245543 6477340 6719356 6970391 7240151
55986G240151K92786L09206L25163L52642L85597M11503M36620M74288N18455
$$ 7240151 7532937 7842143 8167306 8519948 8905545 9317048 9753668 10227956 10746411
55977A0746411N56091N95258O51880P19443P82656Q50062R40381J048065J157632
$$ 10746411 11302502 11897760 12549640 13269083 14051739 14901801 15842182 16890247 18047879
55968A8047879J280284J438724J628531J835773K079709K393748K779144L227783
$$ 18047879 19328163 20766887 22395418 24231191 26310900 28704648 31483792 34711575
55960C4711575L775505M476736N341189O357239P562152R023862J0780165J2880028
$$ 34711575 38487080 42963816 48305005 54662244 62224396 71248258 82028423 94908451
55952I4908451J5450491J8603941K2299590K6426450L0946407L5627138L9469463
$$ 94908451 110358942 128962883 151262473 177688923 208635330 244262468 283731931
55945B83731931M0659769L7468233K9340017J7171031K778341j1679705k4052648
$$ 283731931 324391700 361859933 391199950 408370981 411149322 399469617 375416969
55938C75416969l2664542l6913602l7422500l5466740l2224625k8474361k4693930
$$ 375416969 342752427 305838825 268416325 232949585 200724960 172250599 147556669
55931A47556669k1167130j7999779j5194030j2758833j0712843r019154p599910
$$ 147556669 126389539 108389760 93195730 80436897 69724054 60704900 53104990
55924E3104990o408840n432358m634640l960917l387425k917535k534965k205576
$$ 53104990 46696150 41263792 36629152 32668235 29280810 26363275 23828310 21622734
55916B1622734j918617j684034j493939j324735j172232j048822r50025q56949
$$ 21622734 19704117 18020083 16526144 15201409 14029177 12980355 12030330 11173381
55908A1173381p67868o95894o38837n81030n22068m75423m40920m05046l66592
$$ 11173381 10405513 9709619 9070782 8489752 7967684 7492261 7051341 6646295 6279703
55899F279703l36771l15550k91709k65076k45939k33665k17446j97214j83181
$$ 6279703 5942932 5627382 5335673 5070597 4824658 4590993 4373547 4176333 3993152
55890C993152j75642j65008j50901j42062j38095j29759j16939j08623j05450
$$ 3993152 3817510 3652502 3501601 3359539 3221444 3091685 2974746 2866123 2760673
55881B760673r9224q9293q3013q0308p3684o3218n6261n2792m6016l7005l3979
$$ 2760673 2661449 2572156 2489143 2408835 2335151 2271933 2215672 2162880 2116864 2079859 2045880
55870B045880l7405m0097m1503m7590n6793o0460n7458n4902n4203m9824m1948
$$ 2045880 2008475 1968378 1926875 1879285 1822492 1762032 1704574 1649672 1595469 1545645 1503697
55859A503697l7054l5310l0336k2210j8215j9804k1094k0954k4441l1182l4413
$$ 1503697 1466643 1431333 1400997 1378787 1360572 1340768 1319674 1298720 1274279 1243097 1208684
55848A208684l3006l3083l6125l6616l3010l0195k9554k7002k2503k1158k3174
$$ 1208684 1175678 1142595 1106470 1069854 1036844 1006649 977095 950093 927590 906432 883258
55837H83258k2739j8576j5958j6578j6027j2973j1502j2499j1802q693p458q806
$$ 883258 860519 841943 825985 809407 793380 780407 768905 756406 744604 735911 728453 719647
55825G19647q455n813n413q096r294p743p545r810j0590q918q695j0708j0740
$$ 719647 711192 705379 699966 691870 682576 674833 667288 657478 646888 637970 629275 618567 607827
55812F07827p629n467n827n350k904j642k137q07K892M995M497N093P788Q904
$$ 607827 600198 594731 588904 583554 580650 579008 576871 576064 578956 583951 588448 593541 601329 610233
55798F10233P318O460P193N836J340k501m071o324j0203j2464j2151j2554j4548
$$ 610233 617551 624011 631204 637040 638380 635879 631808 625484 615281 602817 590666 578112 563564
55785E63564j4605j1573q921q099o197k460n11j652k364j075j053l767n537l790
$$ 563564 548959 537386 528465 520366 514169 511709 511198 509546 507182 506107 505054 501287 495750 491960
55771D91960r84O59K805O589R773J0976J1803J2334R654L187l539q571j3743j9315
$$ 491960 490976 491635 494440 501029 510802 521778 533581 545915 555569 558756 555217 546646 532903 513588
55757E13588k1921k0399j8266j7835j6962j4150j1697j1037r967p287n400n693
$$ 513588 491667 471268 453002 435167 418205 404055 392358 381321 371354 364067 358667 352974
55745C52974n936m837m547o103p015n885m818m865l738n84J711J546J293K351
$$ 352974 347038 342201 337654 331551 324536 318651 313833 308968 305230 304646 306357 307903 309196 311547
55731C11547K298k21k505k661k928n070o852o398n758o841p685o229m098l409
$$ 311547 313845 313624 311119 308458 305530 300460 293608 287210 281452 274611 266926 260697 256599 253190
55717B53190l161j949r12j017o44J337L165L462L721N110O113N766N813P080P180
$$ 253190 250029 248080 247168 246151 245507 246844 250009 253471 257192 262302 268415 274181 279994 287074 294254
55702B94254M462R32j344l422o437q787r032q561q712q300o472m864m509l756
$$ 294254 298716 299648 298304 294882 288445 279658 270626 262065 253353 245053 238581 233717 229208 225452
55688B25452j674k47p24j103J82J425J121Q89K133L122K362J727L066M712M413
$$ 225452 223778 223531 222807 221704 221886 223311 224432 225321 227454 230576 232938 234665 237731 242443 246856
55673B46856L009K173J215p59k219j789j014j607k359j571j93L06P66K237L398
$$ 246856 249865 252038 253253 252494 250275 248486 247472 245865 243506 241935 241742 242048 242814 245051 248449
55658B48449K854J853J969K305J655J174K170L409L267K514K382K017L71j439
$$ 248449 251303 253156 255125 257430 259085 260259 262429 265838 269105 271619 274001 276018 276389 274950
55644B74950k228k963m565n665n124m433n012n492m341k996l351m377m099l111
$$ 274950 272722 269759 265194 259529 254405 249972 244960 239468 235127 232131 228780 224403 220304 217193
55630B17193l143l836l815l359l300k869j265J71j24j227j417j038j372k103k247
$$ 217193 214050 210214 206399 203040 199740 196871 195606 195777 195653 194426 193009 191971 190599 188496 186249
55615A86249k113k220j828o16j22j358k703k341j099p18j052j133j272j888k026
$$ 186249 184136 181916 180088 179472 179350 177992 175289 172948 171849 171131 170079 168946 167674 165786 163760
55600A63760j126n56j290j917j065J10L3o21o17n08j070j323m53K51l21q36P3
$$ 163760 162634 162078 160788 158871 157806 157916 157949 157328 156711 156203 155133 153810 153357 153608 153287 152451 152524
55583A52524J186R17J58L34O12k31j104n00O15N81M6N00J457J674J645K254K634
$$ 152524 153710 154627 154785 155119 155731 155500 154396 153896 154511 155092 155138 155638 157095 158769 160414 162668 165302
55566A65302J954J593K871M329M003K687K194K095J107l1j6K01r30k561l021k871
$$ 165302 167256 168849 171720 176049 180052 182739 184933 187028 188135 188104 188088 188289 187359 184798 181777 178906
55550A78906l418l818k750j481j896k921k244m38J14o01n98L66P99N72P79J124
$$ 178906 175488 171670 168920 167439 165543 162622 160378 159940 160054 159453 158855 159221 160020 160592 161371 162495
55534A62495M98l55J53J344J238L9l36K16Kj207j922j795j932k445k338j698j604
$$ 162495 162993 162638 162791 164135 165373 165412 165076 165292 165294 164087 162165 160370 158438 155993 153655 151957 150353
55517A50353j987j881j418j374j291l89L73m06j847j985r83n69r33q72m22o24
$$ 150353 148366 146485 145067 143693 142402 142013 142386 141980 140133 138148 137165 136596 135663 134791 134369 133745
55501A33745j131p83n3l17j150j056l37m52j076o63M66O21j5K87J435J556M05
$$ 133745 132614 131831 131778 131461 130311 129255 128918 128466 127390 126727 127193 127814 127799 128086 129521 131077 131482
55484A31482k88Rk8p36q55kP40J024J510J828Q28r48j560o99P2J60M63R42L56
$$ 131482 131194 131203 131175 130439 129584 129582 130322 131346 132856 134684 135512 134564 133004 132305 132377 132537 133000 133942 134298
55465A34298j145j848j273p76q74n31N13J063P20M96P10M80k69n69m80j043j880
$$ 134298 133153 131305 130032 129256 128382 127851 128364 129427 130147 130643 131353 131833 131564 130995 130515 129472 127592
55448A27592j278P10J856J166K83O04J247J018L45R7J11np0p9m04p80m05N32R34
$$ 127592 126314 127024 128880 130046 130329 130933 132180 133198 133543 133640 133751 133746 133676 133597 133193 132413 132008 132540 133474
55429A33474N92L74M63J28n66o38m2J13m95j006j154j570k062j530o3Q06M58Q8
$$ 133474 134066 134440 134903 135031 134465 133827 133785 133898 133403 132397 131243 129673 127611 126081 126018 126824 127282 127370
55411A27370O56J611K199K443K333J519L16l28k53k06l86k81N6%l04j39K90J03
$$ 127370 128026 129637 131836 134279 136612 138131 138447 138119 137866 137660 137274 136993 137049 137049 136745 136606 136896 136999
55393A36999n87q72p93j153j730j510o54l04m78j25P95J225R98R25Q73n1j381
$$ 136999 136412 135540 134747 133594 131864 130354 129700 129396 128918 128793 129588 130813 131811 132736 133609 133558 132177
55376A32177j532m29K53k30q11o74k26K67J046J655J373Q18J131J665Q78o71q48
$$ 132177 130645 130216 130469 130239 129428 128754 128528 128795 129841 131496 132869 133687 134818 136483 137361 136690 135842
55359A35842M60J169O62N75J357J189n83j926j446n09o09j053q20m18l07L32J629
$$ 135842 136302 137471 138133 138708 140065 141254 140671 138745 137299 136790 136181 135128 134308 133890 133583 133915 135544
55342A35544J952M69j074r34L1Q6o38r03n38j70J76O78Q19K22m84o31m89m76l98
$$ 135544 137496 137965 136891 135957 135988 136074 135436 134533 133995 133825 134001 134679 135498 135720 135236 134605 134116 133640 133242
55323A33242j99l33p18n06M62J212J193R75Q48K66p12r95j91P06R80J095J308
$$ 133242 133043 132710 131992 131486 131948 133160 134353 135328 136176 136442 135730 134735 134544 135250 136230 137325 138633
55306A38633J019J71l72m55r13j663j387Q5J054N07m55o94o50q35o44J69O35L15
$$ 138633 139652 139823 139451 138996 138083 136420 135033 135118 136172 136679 136224 135530 134880 134045 133401 133570 134205 134520
55288A34520K42R23J252N49j17Q9K84k59o35q0M87K46P4Q09J464Q97k27p09p22
$$ 134520 134762 135685 136937 137486 137369 137458 137742 137483 136848 136768 137255 137501 137575 138384 139848 140745 140518 139809 139087
55269A39087r24r72m75p8k10o8P53J077P8j081j116o09m77q4J221K163J333k79
$$ 139087 138163 137191 136716 136638 136428 136360 137113 138190 138268 137187 136071 135462 134985 134901 136122 138285 139618 139339
55251A39339o84J03N74L85M23Q19Q84O76Q29J088O50l47j028j112q32n6J139J679
$$ 139339 138655 138758 139332 139717 140140 140959 141843 142519 143348 144436 145086 144739 143711 142599 141767 141711 142850 144529
55233A44529O45j172k115j722q61l72m77j007j271m27J158J869R88j93m09k67
$$ 144529 145174 144002 141887 140165 139304 138932 138455 137448 136177 135750 136908 138777 139765 139572 139163 138896
55217A38896p36j213o31N58J223J406J666J510K88j131j357n88m4J00N04R62P12
$$ 138896 138160 136947 136316 136874 138097 139503 141169 142679 142967 141836 140479 139891 139847 139947 140451 141413 142125
55200A42125N9K5N59P74N92O06O54R3o80o55MJ57l32m30K05O69L51k86p36j122
$$ 142125 142184 142209 142768 143542 144134 144740 145394 145487 144807 144152 144156 144313 143981 143551 143756 144425 144776 144490 143754 142632
55180A42632j556j818j909k043j955j024O71K109K385J558M21j97q0K32R5l06
$$ 142632 141076 139258 137349 135306 133351 132327 132998 135107 137492 139050 139471 139274 139194 139426 139521 139215
55164A39215k34L53P53R01J609K881L354K329J034P37Q27J50p83o67L11P71K76
$$ 139215 138981 139334 140087 140988 142597 145478 148832 151161 152195 152932 153759 153909 153126 152459 152770 153541 153817
55147A53817l43n83p23q41o80m13m70o71n31k59m38j004j361j303j003m39L31
$$ 153817 153474 152891 152168 151327 150647 150234 149764 149093 148562 148303 147865 146861 145500 144197 143194 142755 143086
55130A43086P40M07j30j54K50O67J152J707J694P66k54m74k50l35m91j06M91O63
$$ 143086 143826 144233 144103 143949 144199 144866 146018 147725 149419 150185 149931 149457 149207 148872 148381 148275 148766 149429
55112A49429P41J340J954J653P52K97K97o0p06o71J75Q56Q58P36J010J498J890
$$ 149429 150170 151510 153464 155117 155869 156166 156463 156403 155697 155026 155201 156057 156915 157651 158661 160159 162049
55095A62049K111K014J457P23J72k83p81r31m31J30j1o09p80k78L60O70N28o4
$$ 162049 164160 166174 167631 168354 168526 168243 167462 166531 166100 166230 166219 165610 164830 164552 164912 165582 166110 166046
55077A66046p92j018o57m52p97j015m81K90O51R33J501J617O12n94o05L42Q09
$$ 166046 165254 164236 163579 163127 162330 161315 160834 161124 161775 162708 164209 165826 166438 165844 165239 165581 166390
55060A66390L18l01m65l96k84o4J5m07j175j868k331k352j518j26O16J98l27n4
$$ 166390 166708 166407 165942 165546 165262 165198 165213 164806 163631 161763 159432 157080 155562 155436 156052 156250 155923 155869
55042A55869K65k93r73o46Q0p4o69k56R90J426N40m84q07p72o87l93j78n60j049
$$ 155869 156134 155841 154868 154222 154302 154228 153559 153303 154293 155719 156259 155775 154968 154196 153509 153116 152938 152378 151329
55023A51329n89O90J431J007K04j44n6J69L70L26oj43J61K46m45j197j007k14
$$ 151329 150740 151430 152861 153868 154072 153928 153872 154041 154411 154737 154731 154588 154749 154995 154550 153353 152346 152132
55005A52132J50J2l0l4l10l16M74J199Q34J68O94K037K535J991J673J837J491
$$ 152132 152282 152294 152264 152230 151920 151604 152078 153277 154111 154279 154973 157010 159545 161536 163209 165046 166537
54988A66537O39M70R90P95m05j175q08l62n29m53M66J327J276P49L24k27r35j075
$$ 166537 167176 167646 168636 169431 169026 167851 167043 166681 166152 165699 166165 167492 168768 169517 169841 169614 168679 167604
54970A67604m65Pj43j81L88Q21M46j74j80L88R91J369J375R21M75P19J379J410
$$ 167604 167139 167146 167003 166822 167210 168031 168477 168303 168123 168511 169502 170871 172246 173167 173642 174361 175740 177150
54952A77150O26mJ5O0k17j73N00R62N03l03n21j50J71J24j25k37P3O76R24M98
$$ 177150 177776 177772 177787 177847 177630 177457 177957 178919 179422 179119 178598 178448 178619 178743 178618 178381 178454 179130 180054 180552
54932A80552Q4M47J148J308J197J737K748L238L293L935N158N911O157P001Q458
$$ 180552 180636 181083 182231 183539 184736 186473 189221 192459 195752 199687 204845 210756 216913 223914 232372
54917B32372R031Q115O852N896M254J321j677l516m640n851o749o782o581o892
$$ 232372 241403 249518 256370 262266 266520 267841 266164 262648 258008 252157 245408 238626 232045 225153
54903B25153p163o473n045l711k656j754j370j772k285k066j243n75l63l69l18
$$ 225153 217990 211517 206472 202761 200105 198351 196981 195209 192924 190858 189615 189040 188677 188308 187990
54888A87990lO09J099J000P08J165K448L645M330N058O067O750O945P462Q603
$$ 187990 187987 188596 189695 190695 191403 192568 195016 198661 202991 208049 214116 220866 227811 235273 243876
54873B43876R305Q505O435L842R97j810l819m749n292n974o404o322o340o770
$$ 243876 253181 261686 268121 271963 272960 271150 267331 262582 257290 251316 244912 238590 232250 225480
54859B25480o771n628m118l541l985m473m311l577k709k211k353k685k401j510
$$ 225480 218709 213081 208963 205422 201437 196964 192653 189076 186367 184156 181803 179118 176717 175207
54845A75207r08j073j455j566j674j924j790r59N1P12J052J067N57K0M68J726
$$ 175207 174299 173226 171771 170205 168531 166607 164817 163858 163909 164621 165673 166740 167297 167317 167785 169511
54829A69511K112O78j329k145j643q96m73k44j41r6L09J222J998J981J316N30
$$ 169511 171623 172301 170972 168827 167184 166288 165815 165571 165430 165334 165643 166865 168863 170844 172160 172690
54813A72690j12m27j64L97M74o8l95lN31N63L16J99J05LL53J245J911J761J156
$$ 172690 172578 172151 171987 172384 172858 172790 172395 172392 172923 173486 173802 174001 174106 174109 174462 175707 177618 179379 180535
54794A80535O47K84J06L98Q99P65q3n83n3Q72J391J585J675J356N75j4q6l7J10
$$ 180535 181182 181466 181572 181970 182869 183634 183551 182968 182915 183787 185178 186763 188438 189794 190369 190355 190269 190232 190342
54775A90342R95K495L397L278L288M141M854M639M557N850P838R010R199R138
$$ 190342 191337 193832 197229 200507 203795 207936 212790 217429 221986 227836 235674 244684 253883 263021
54761B63021Q739P379N281L206J270p78k661m072n468p243q721r052q469p692
$$ 263021 271760 279139 284420 287626 288896 288118 285457 281385 275917 268674 259953 250901 242432 234740
54747B34740o779n553m455l873l375k560j928j889j799j075l34k68k69M69J419
$$ 234740 227961 222408 217953 214080 210705 208145 206217 204328 202529 201454 201120 200852 200583 201052 202471
54732B02471J595J187R44P76L89M32J527K864L416L804N220P094P729O908N979
$$ 202471 204066 205253 206197 206973 207362 207794 209321 212185 215601 219405 224625 231719 239448 246356 252335
54717B52335N471M469K491K68j541l048m318n090n555o237o913o766n770m843
$$ 252335 257806 262275 264766 265034 263493 260445 256127 251037 245482 239245 232332 225566 219796 214953
54703B14953m466m082l174k055j377j418j949k367k088j278q73j334j938j835
$$ 214953 210487 206405 203231 201176 199799 198381 196432 194065 191977 190699 189826 188492 186554 184719
54689A84719j189o24k02J41j8p17r00J95J545J579L93n77o68l67N7Q00J489J332
$$ 184719 183530 182906 182704 182845 182827 182110 181210 181405 182950 184529 184922 184345 183677 183310 183367 184167 185656 186988
54671A86988L86m36o63n63k82K20N09Rr61j441j087l60L65Q91P60k52j375j550
$$ 186988 187374 186938 186275 185712 185430 185650 186159 186168 185207 183766 182679 182319 182684 183575 184335 184083 182708 181158
54653A81158q10q4J63J98J60l2k37l03m93q79q23M1R23J012Q47J313J906J491
$$ 181158 180348 180264 180427 180625 180785 180753 180516 180213 179720 178841 178018 178059 178982 179994 180841 182154 184060 185551
54635A85551L69q0L82N66j54j055j451j529j552j352r43o58n21k69L7J72L59Q84
$$ 185551 185920 185840 186222 186788 186634 185579 184128 182599 181047 179695 178752 178094 177573 177304 177341 177513 177872 178756
54617A78756J373J354J128J152J018K15o25n24J61K93j06rP02J017N71J31J86
$$ 178756 180129 181483 182611 183763 184781 184996 184371 183847 184008 184301 184195 184186 184888 185905 186476 186607 186793
54600A86793L44L33L76M35J80j77j10K28K45L0J04K20k93j111j182m03K52L09
$$ 186793 187137 187470 187846 188281 188461 188284 188174 188402 188647 188677 188781 189001 188708 187597 186415 186012 186264 186573
54582A86573J96J36r2l10j49l8o94j684j844j057k47K58Q54J325R81J97J14O75
$$ 186573 186769 186905 186813 186503 186354 186316 185622 183938 182094 181037 180790 181048 181902 183227 184208 184405 184519 185194
54564A85194O78o9l47L34R37P11J90p0k85m54o1O74P55O1l44l5J05l96p82n67
$$ 185194 185872 185803 185456 185790 186727 187438 187628 187558 187273 186819 186758 187432 188187 188248 187904 187869 187974 187578 186796 186229
54544A86229m10p54r86o59k75j35K85J161J768J758J699J792J389M54P6P53J539
$$ 186229 185819 185065 184079 183420 183145 183010 183295 184456 186224 187982 189681 191473 192862 193316 193392 194145 195684
54527A95684J686J724K036J808N55o57p16j42p6n67r51j105j155p85J07P03K42
$$ 195684 197370 199094 201130 202938 203493 202836 202120 201978 201902 201335 200384 199279 198124 197339 197446 198149 198391
54510A98391q05j353j037k74M76Q79O96J53j60p2N7J23L21L15m36j389j219J46
$$ 198391 197586 196233 195196 194922 195398 196277 196973 197126 196966 196894 196951 197074 197395 197710 197274 195885 194666 194812
54492A94812J189R91L61J63J5m51n55J28O66J66p30r08l70K82R61J645J710Q01
$$ 194812 196001 196992 197353 197516 197531 197080 196525 196653 197319 197485 196755 195847 195477 195759 196720 198365 200075 200876
54474B00876m03j163j567j693j016L93J219O94J1O16K003K588K028J222N81k44
$$ 200876 200473 199310 197743 196050 195034 195427 196646 197340 197351 197967 199970 202558 204586 205808 206389 206145
54458B06145j190j613j241l81N65J200J124M98O7N9j60p99r95k78M10K60L8P04
$$ 206145 204955 203342 202101 201720 202285 203485 204609 205107 205174 205233 205073 204274 203279 203001 203411 203671 203709 204413
54440B04413J586J371K40n50o62q10j213j382j213j059q21j51O51R59R16J177
$$ 204413 205999 207370 207610 207060 206398 205588 204375 202993 201780 200721 199900 199749 200400 201359 202275 203452
54424B03452J692J730R68k23j367k034j753o23L86N48L11L75M59M1m18j74M12
$$ 203452 205144 206874 207842 207619 206252 204218 202465 201842 202228 202776 203087 203462 203921 203962 203544 203370 203782
54407B03782M42K8l4K61K89J89O25J343J386P74N62J111J557J312Q70P67Q02O58
$$ 203782 204224 204252 204218 204479 204768 204957 205582 206925 208311 209085 209647 210758 212315 213627 214497 215264 216066 216724
54389B16724M31J13n18j187j066J22J521K075J553M89m22p12m57k53m73o49j48
$$ 216724 217155 217268 216750 215563 214497 214619 216140 218215 219768 220257 219835 219123 218666 218413 217940 217291 217143
54372B17143O05M57p95j836j408J06J191J013K21n3L94P43M14n8J52Q30J008M97
$$ 217143 217748 218205 217410 215574 214166 214272 215463 216476 216697 216644 217038 217781 218195 218137 218289 219119 220127 220624
54354B20624J83N76J059J021P88P41M37n26j506j631j110p04n23k07M0k18o34
$$ 220624 220807 221383 222442 223463 224251 224992 225429 224903 223397 221766 220656 219952 219429 219222 219262 219044 218410
54337B18410m27M07J142J413J387J080L63m16o99n53m95n47k63M15J055J447J748
$$ 218410 217983 218390 219532 220945 222332 223412 223775 223359 222660 222107 221612 221065 220802 221217 222272 223719 225467
54320B25467J911J692J128N76K81L51Q76J579J775J243P58J136K149L043L674
$$ 225467 227378 229070 230198 230774 231055 231406 232282 233861 235636 236879 237637 238773 240922 243965 247639
54305B47639M337M925N203N438N849N785M443K215K75r45j932k983l882m587n200
$$ 247639 251976 256901 262104 267542 273391 279176 283619 285834 286109 285164 283232 280249 276367 271780 266580
54290B66580n422m992m511m768n335m987l508j990j169o23J07O17L76l95j027
$$ 266580 261158 256166 251655 246887 241552 236565 233057 231067 229898 229275 229382 229999 230375 229980 228953
54275B28953j114o82j10M6l57p43n83k96n88j117p37Q01K251K271Q51q21j516
$$ 228953 227839 227157 227047 227093 226736 225993 225410 225114 224526 223409 222672 223473 225724 227995 228846 228025 226509
54258B26509r07J90O38K47o9K54N50J99j46L05Q14P4j489k036r62L12M93j00o11
$$ 226509 225602 225792 226430 226677 226608 226862 227412 227611 227465 227770 228584 228658 227169 225133 224171 224483 224976 224876 224265
54239B24265q59q70l11Q08J708J781J314Q42M16o9m47n87n90m27J9M32L07r5Q3
$$ 224265 223406 222536 222225 223033 224741 226522 227836 228678 229094 229025 228578 227991 227401 226974 226993 227425 227732 227637 227720
54220B27720R34J477J069K44l57r70j981k914k931j893l75R31J449Q65m42j495
$$ 227720 228654 230131 231200 231444 231087 230117 228136 225222 222291 220398 220023 220954 222403 223268 222826 221331
54204B21331j707j412j140p83JJ049J786J852J273L15n24p40l42R5J56N9J96N20
$$ 221331 219624 218212 217072 216289 216290 217339 219125 220977 222250 222565 222041 221301 220959 221054 221210 221269 221465 221985
54186B21985P08O48M68K41n4l64n50m71j26K20J62l57q32p82l76j51k15k04N7
$$ 221985 222693 223341 223809 224050 223996 223632 223082 222611 222485 222705 222867 222510 221678 220896 220520 220369 220154 219950 220007
54167B20007L41M15K64qj71O7O18Q29L07l89m32N9K69m3l01q1M21R77J592K100
$$ 220007 220348 220763 221027 221019 220848 220915 221533 222362 222669 222280 221848 221907 222176 222133 221832 221751 222172 223149 224741 226841
54147B26841K140J748J346J066O53N4m91r41j337j276l38R71J568J209O94M82
$$ 226841 228981 230729 232075 233141 233794 233848 233357 232416 231079 229803 229465 230436 232004 233213 233907 234389
54131B34389R0p85j515j458q76l51L8L78L15m52j389j537o14P16J629J884J840
$$ 234389 234479 233694 232179 230721 229845 229494 229532 229910 230225 229773 228384 226847 226233 226949 228578 230462 232302
54114B32302J901K062J980J531J038Q04O75L85L7j12j16j34m9K54N04M54L13K65
$$ 232302 234203 236265 238245 239776 240814 241618 242293 242678 242715 242603 242487 242353 242304 242558 243062 243516 243829 244094
54096B44094l8q09j446j375j094j339j679j130P3O88L75J9P9K0k87n5R38J649
$$ 244094 244056 243247 241801 240426 239332 237993 236314 235184 235257 235945 236320 236339 236418 236438 236151 236096 237034 238683
54078B38683J274M55J88M74P08P38P85Q87R80J079R82L60n24q83m28K77P41J040
$$ 238683 239957 240412 240600 241074 241782 242520 243305 244192 245172 246251 247233 247593 247069 246186 245758 246035 246776 247816
54060B47816J112N78l23n42L58J354J281L38l92m02n6J77J60K6O6M56R35J116
$$ 247816 248928 249506 249183 248641 248999 250353 251634 251972 251580 251178 251122 251299 251459 251485 251551 252007 252942 254058
54042B54058J131J427J932K176K233K662L411L806L809M166M958N252M733M454
$$ 254058 255189 256616 258548 260724 262957 265619 269030 272836 276645 280811 285769 291021 295754 300208
54028C00208N128N859N557M666M310M465M213L392K792K885L249L202K456J241
$$ 300208 305336 311195 316752 321418 325728 330193 334406 337798 340590 343475 346724 349926 352382 353623
54014C53623K10m5K67K87k95q11p74p60j508k756l663l890l684l281k862k708
$$ 353623 353833 353788 354055 354342 354047 353236 352462 351702 350194 347438 343775 339885 336201 332920 330058 327350
53998C27350k861k882k369j386j60J062J741J445Q13J165K693M060M360M413N309
$$ 327350 324489 321607 319238 317852 317692 318754 320495 321940 322753 323918 326611 330671 335031 339444 344753
53983C44753O833Q390J0481J3909J8202K2104K5070K7001K6937K3534J6763Q014
$$ 344753 351586 359976 370457 384366 402568 424672 449742 476743 503680 527214 543977 551991
53971E51991j376j0577j8422k3475k5298k4833k3291k1286j9073j6816j4484j2078
$$ 551991 550615 540038 521616 498141 472843 448010 424719 403433 384360 367544 353060 340982
53959C40982j0042q839q167p158n471l658k362j609r65j08Q61J456J333Q43P51
$$ 340982 330940 322101 313934 306776 301305 297647 295285 293676 292711 292603 293464 294920 296253 297096 297847
53944B97847J261J747J767J698K002K441K561K505K652L034L506M063M388L849
$$ 297847 299108 300855 302622 304320 306322 308763 311324 313829 316481 319515 323021 327084 331472 335321
53930C35321K644K121L051M231L942K307R65P21R01Q87R80J463J992K342K932
$$ 335321 337965 340086 343137 347368 351310 353617 354582 355303 356204 357091 358071 359534 361526 363868 366800
53915C66800M023N075N373M914M364M336M871N499N716N473N123M866M573M193
$$ 366800 370823 375898 381271 386185 390549 394885 399756 405255 410971 416444 421567 426433 431006 435199
53901D35199L839L297K140O19l23l93n26j451k485k623k131k031k567l254m018
$$ 435199 439038 442335 444475 445094 444771 444378 443852 442401 439916 437293 435162 433131 430564 427310 423292
53886D23292n093o095o307n787n224m864m509m337m699n196m968l960k934k381
$$ 423292 418199 412104 405797 400010 394786 389922 385413 381076 376377 371181 366213 362253 359319 356938
53872C56938k282k735l797m738m577l430k428k247k615l181l856m226l744k623
$$ 356938 354656 351921 348124 343386 338809 335379 332951 330704 328089 324908 321052 316826 313082 310459
53858C10459j746j511j642k009k562k661j679l45j31j077j656j147o29j015j554
$$ 310459 308713 307202 305560 303551 300989 298328 296649 296304 296173 295096 293440 292293 291664 290649 289095
53843B89095j228m27r0j38R8N67P42O69P25P19K11m77n39P8N23K52k34o7R24K006
$$ 289095 287867 287440 287350 287212 287310 287877 288619 289288 290013 290732 290943 290466 289927 290005 290528 290780 290546 290479 291403 293409
53823B93409K245J442M13J73Q09J440J394R89R92J685K730L700M462N273O607
$$ 293409 295654 297096 297509 297682 298491 299931 301325 302314 303306 304991 307721 311421 315883 321156 327763
53808C27763Q613J0746J2352J3668J5687J8899K2761K6667L0639L4465L6745L5612
$$ 327763 336376 347122 359474 373142 388829 407728 430489 457156 487795 522260 559005 594617
53796E94617L0335K1723J1138j79j0903j9453k4623k6270k5287k2888j9933j6809
$$ 594617 624952 646675 657813 657634 646731 627278 602655 576385 551098 528210 508277 491468
53784D91468j3824j1473j0124r521q864p591n993m880m623m638l937k254m28N94
$$ 491468 477644 466171 456047 446526 437662 430071 424078 419198 414575 409937 406000 403746 403318 403912
53770D03912R07J454K668L985M834N391N901N909M865L033J023j205l970o798
$$ 403912 404819 406273 408941 412926 417760 423151 429052 434961 439826 442859 443882 442677 438707 431909
53756D31909q676r397r752j0276j0610j0372r823r361q911q222p267o128m875
$$ 431909 423233 413836 404084 393808 383198 372826 363003 353642 344731 336509 329242 323114 318239
53743C18239l793l283l304l286k799k020j362r89p77m85O5P09R06M16j69q5N53
$$ 318239 314446 311163 307859 304573 301774 299754 298392 297403 296626 296141 296206 296915 297821 298237 298068 297983 298536
53726B98536R31P79O60R86J504J944K447L053L424L402L310L341L173K532J686
$$ 298536 299467 300246 300906 301892 303396 305340 307787 310840 314264 317666 320976 324317 327490 330022 331708
53711C31708J101R72J366K220K984K793J465j26j012j098q34l50N42J751K792
$$ 331708 332809 333781 335147 337367 340351 343144 344609 344483 343471 342373 341539 341189 341731 343482 346274
53696C46274L250L139K870K914L338L652L312K414J519R61O39M72M44L12j56n43
$$ 346274 349524 352663 355533 358447 361785 365437 368749 371163 372682 373643 374282 374754 375198 375510 375354 374811
53680C74811j05J024J663R81m54j502j735j540j275j000p00m09j21Q8%n03j259
$$ 374811 374706 375730 377393 378374 377920 376418 374683 373143 371868 370868 370168 369759 369638 369726 369726 369223 367964
53663C67964j989k446k411j831j028m29j20O2R5j14k61O5O24P25K84jK48N77N29
$$ 367964 365975 363529 361118 359287 358259 357830 357710 357772 357867 357753 357492 357557 358181 358906 359190 359189 359437 360014 360543
53644C60543K89J69R5PJ42M82N63K65J87P04J260J239R72J119J507J414P56K45
$$ 360543 360832 361001 361096 361103 361245 361727 362290 362555 362742 363446 364706 365945 366917 368036 369543 370957 371713 371958
53626C71958L74R08J391J663J835K096K573L140L491L548L582L715L660L256K916
$$ 371958 372332 373240 374631 376294 378129 380225 382798 385938 389429 392977 396559 400274 403934 407190 410106
53611D10106L099L632L985L976L834L724L688L827M103M159L758L228L035L064
$$ 410106 413205 416837 420822 424798 428632 432356 436044 439871 443974 448133 451891 455119 458154 461218
53597D61218K852K406K201K418K644K450J781P67m06j314j445q16j44q6n60j045
$$ 461218 464070 466476 468677 471095 473739 476189 477970 478737 478331 477017 475572 474756 474612 474526 473966 472921
53581D72921j347j684k108k332k258k294k761l236k985k013j189j097j318j161
$$ 472921 471574 469890 467782 465450 463192 460898 458137 454901 451916 449903 448714 447617 446299 445138
53567D45138o57l28k98k53j60l71r98j693k101k096j599o48L05P03N52L69L74
$$ 445138 444481 444153 443855 443602 443442 443071 442073 440380 438279 436183 434584 433936 434241 434944 435496 435865 436239
53550D36239L08J62M73J557K862L528L360K936K893L303L657L438K754K335K742
$$ 436239 436547 436709 437182 438739 441601 445129 448489 451425 454318 457621 461278 464716 467470 469805 472547
53535D72547L795M918N773O219O088N613N678O897Q653R805J0198J0675J1688
$$ 472547 476342 481260 487033 493252 499340 504953 510631 517528 526181 535986 546184 556859 568547
53522E68547J2849J3909J5172J6737J8247J9591K1053K2562K3683K4467K5314
$$ 568547 581396 595305 610477 627214 645461 665052 686105 708667 732350 756817 782131
53511G82131K5852K5118K3217K1553K0843K0118J8469J6594J5673J5698J6005
$$ 782131 807983 833101 856318 877871 898714 918832 937301 953895 969568 985266 1001271
53500A001271J6552J7516J8391J8694J8962J9845K0707K0414J9171J8213J7982
$$ 1001271 1017823 1035339 1053730 1072424 1091386 1111231 1131938 1152352 1171523 1189736 1207718
53489A207718J7956J8104J9039K0544K1336K0804J9801J9173J8554J7403J6343
$$ 1207718 1225674 1243778 1262817 1283361 1304697 1325501 1345302 1364475 1383029 1400432 1416775
53478A416775J6391J7305J7742J7083J6172J5986J6208J5652J3801J1285Q862
$$ 1416775 1433166 1450471 1468213 1485296 1501468 1517454 1533662 1549314 1563115 1574400 1583262
53467A583262O574M160J675p73l517o804j0073j2495j4033j5123j5586j4923j3735
$$ 1583262 1589836 1593996 1595671 1594898 1591381 1584577 1574504 1562009 1547976 1532853 1517267 1502344 1488609
53454A488609j3516j4649j5870j6273j6637j7922j9660k0881k1683k2512k2693
$$ 1488609 1475093 1460444 1444574 1428301 1411664 1393742 1374082 1353201 1331518 1309006 1286313
53443A286313k1282j8965j7555j7548j7568j6507j4916j3808j3052j1700r434
$$ 1286313 1265031 1246066 1228511 1210963 1193395 1176888 1161972 1148164 1135112 1123412 1113978
53432A113978o962n158m136l315k210j048k34N26K005M197O089P086P905R361
$$ 1113978 1107016 1101858 1097722 1094407 1092197 1091149 1090915 1091441 1093446 1097643 1103732 1110818 1118723 1128084
53418A128084J1075J2250J3165J4759J7051J9056K0203K0887K1667K2671K3812
$$ 1128084 1139159 1151409 1164574 1179333 1196384 1215440 1235643 1256530 1278197 1300868 1324680
53407A324680K4894K5601K6021K6975K9110L1857L4151L5853L7589L9466M1015
$$ 1324680 1349574 1375175 1401196 1428171 1457281 1489138 1523289 1559142 1596731 1636197 1677212
53396A677212M2349M4138M6355M8204M9506N1050N3183N5096N6019N6201N6252
$$ 1677212 1719561 1763699 1810054 1858258 1907764 1958814 2011997 2067093 2123112 2179313 2235565
53385B235565N6249N6100N5955N5667N4479N1916M8526M5214M2273L9543L6984
$$ 2235565 2291814 2347914 2403869 2459536 2514015 2565931 2614457 2659671 2701944 2741487 2778471
53374B778471L4520L1680K8091K4067K0247J6770J3241R346N139P23m072r698
$$ 2778471 2812991 2844671 2872762 2896829 2917076 2933846 2947087 2956433 2961572 2962295 2958223 2948525
53362B948525j6571k4537l2539l9197m3957m7403n0362n3023n5071n6329n6849
$$ 2948525 2931954 2907417 2874878 2835681 2791724 2744321 2693959 2640936 2585865 2529536 2472687
53351B472687n6691n5884n4569n2947n1253m9755m8649m7754m6655m5292m4157
$$ 2472687 2415996 2360112 2305543 2252596 2201343 2151588 2102939 2055185 2008530 1963238 1919081
53340A919081m3682m3635m3361m2462m0993l9125l6961l4647l2433l0369k8119
$$ 1919081 1875399 1831764 1788403 1745941 1704948 1665823 1628862 1594215 1561782 1531413 1503294
53329A503294k5308k2085j9144j6998j5523j4395j3770j3953j4552j4644j3998
$$ 1503294 1477986 1455901 1436757 1419759 1404236 1389841 1376071 1362118 1347566 1332922 1318924
53318A318924j3388j3326j3225j2363j1105j0304r918r059p318n244l555k482
$$ 1318924 1305536 1292210 1278985 1266622 1255517 1245213 1235295 1226236 1218918 1213674 1210119 1207637
53306A207637j948j700j261k07J387L199N184P402R480J0882J1701J2585J3973
$$ 1207637 1205689 1203989 1202728 1202521 1203908 1207107 1212291 1219693 1229173 1240055 1251756 1264341 1278314
53293A278314J5889J8287K0941K3103K4126K4421K5024K6122K6868K6807K6548
$$ 1278314 1294203 1312490 1333431 1356534 1380660 1405081 1430105 1456227 1483095 1509902 1536450
53282A536450K6591K6321K4769K1960J8917J6656J5486J4919J3950J1724Q284
$$ 1536450 1563041 1589362 1614131 1636091 1655008 1671664 1687150 1702069 1716019 1727743 1736027
53271A736027M469J000k028m781p267r520j1698j3807j5707j7534j9635k1928
$$ 1736027 1740496 1741496 1739468 1734687 1727420 1717900 1706202 1692395 1676688 1659154 1639519 1617591
53259A617591k3821k5019k5899k6839k7670k8175k8608k9263k9871k9965k9590
$$ 1617591 1593770 1568751 1542852 1516013 1488343 1460168 1431560 1402297 1372426 1342461 1312871
53248A312871k9189k8887k8366k7474k6519k5934k5766k5725k5597k5500k5596
$$ 1312871 1283682 1254795 1226429 1198955 1172436 1146502 1120736 1095011 1069414 1043914 1018318
53237A018318k5661k5156k3890k2329k1049k0150j9457j8931j8456j7491j5581
$$ 1018318 992657 967501 943611 921282 900233 880083 860626 841695 823239 805748 790167
53226G90167j3079j0877r448q621q137p893p754p774q461j0103j1944j2822j2678
$$ 790167 777088 766211 756763 748142 740005 732112 724358 716584 708123 698020 686076 673254 660576
53213F60576j2563j2984j3216j2595j1635j1183j1254j1290j1107j0883j0542
$$ 660576 648013 635029 621813 609218 597583 586400 575146 563856 552749 541866 531324
53202E31324r801q682p497o454n665n395n891o969q031q493q195p462o799o366
$$ 531324 521523 512841 505344 498890 493225 487830 481939 474970 466939 458446 450251 442789 435990 429624
53188D29624n815m848l810l307l364l419l124k647k140j534r39p08r06j185j315
$$ 429624 423809 418961 415151 411844 408480 405061 401937 399290 397150 395616 394677 393969 393063 391878 390563
53173C90563j325j084l53M96N55m99j862k523k241j369k55Q15J537J836J888J693
$$ 390563 389238 388154 387801 388297 388852 388353 386491 383968 381727 380358 380103 380918 382455 384291 386179 387872
53157C87872J049Q8o68j026j331j738j840j327m44M86J401K078K031J260N06K46
$$ 387872 388921 389009 388341 387315 385984 384246 382406 381079 380635 381121 382522 384600 386631 387891 388397 388643
53141C88643M6o29j514k063k293k534k733k639k323j974j495p78m2N08R75J259
$$ 388643 388689 388060 386546 384483 382190 379656 376923 374284 371961 369987 368492 367714 367672 368180 369155 370414
53125C70414Q29m50j761k202j834j255o51L9M37J24m86n21J37P40P61M31J43q8
$$ 370414 371243 370793 369032 366830 364996 363741 363090 363129 363566 363690 363204 362683 362820 363560 364321 364752 364895 364807
53107C64807m03p66j036j115j028r67j127j412j584j772k339l052l039j994q20
$$ 364807 364404 363638 362602 361487 360459 359492 358365 356953 355369 353597 351258 348206 345167 343173 342353
53092C42353n12r58j453j786k014j739o74M17L75p85j892k138j746j118l22M60
$$ 342353 341841 340883 339430 337644 335630 333891 333217 333634 334009 333224 331332 329194 327448 326330 326008 326468
53076C26468Q16P13O34R05J371J793K024J802J019J93l3J25j31r21j484j391j089
$$ 326468 327284 327997 328631 329536 330907 332700 334724 336526 337545 337738 337705 337830 337699 336778 335294 333903 332814
53059C32814r87q11l17J42K56L45P55J238J405J394J506J618J545J559K007K657
$$ 332814 331827 331016 330699 330841 331097 331442 332197 333435 334840 336234 337740 339358 340903 342462 344469 347126
53043C47126K927K646K090J482Q83L95M7l48q55j125q44k94N4L00Q57J524J500
$$ 347126 350053 352699 354789 356271 357154 357549 357596 357248 356393 355268 354424 354130 354184 354484 355341 356865 358365
53026C58365M66q85j698j864j784j637j348r98q79j105j471j710j666j240m28
$$ 358365 358831 357946 356248 354384 352600 350963 349615 348617 347738 346633 345162 343452 341786 340546 340118
53011C40118N40J230J313Q29J59k48k64k27o57j566k227j912p67K71N36K59O4
$$ 340118 340658 341888 343201 344030 344189 343941 343677 343450 342793 341227 339000 337088 336321 336592 337128 337387 337451
52994C37451J67L11K80J56J64M14P44P69K88k94k61M65J026O93o5j27Q11J824
$$ 337451 337618 337929 338209 338365 338529 338943 339687 340456 340744 340450 340189 340654 341680 342373 342308 342181 342992 344816
52976C44816J915J132L58L05R43J631J732J171M30p0l96o88n96L38J852L033L331
$$ 344816 346731 347863 348221 348526 349469 351100 352832 354003 354433 354363 353967 353279 352683 353021 354873 357906 361237
52959C61237L091K915K891K656J984J062L49J96N35Q65P09l7j230k606l603l506
$$ 361237 364328 367243 370134 372790 374774 375836 376185 376381 376916 377781 378490 378453 377223 374617 371014 367508
52943C67508k366j342j466k306k598j955j137o44k25K15K52j32l10o3l2n59r46
$$ 367508 365142 363800 362334 360028 357430 355475 354338 353694 353469 353684 353936 353804 353494 353431 353399 352840 351894
52926C51894n90k3r7p07j131j173j229j482j735j757j421p03L2K24n4k1O47J205
$$ 351894 351304 351281 351184 350477 349346 348173 346944 345462 343727 341970 340549 339846 339878 340102 340048 340027 340674 341879
52908C41879R66L12o8l09q05j160p81m1J68j18j00L97O73L83l2k12k59j37M11
$$ 341879 342845 343157 343089 342780 341975 340815 340034 339993 340161 340043 339943 340340 341013 341396 341364 341152 340893 340756 341167
52889C41167J120J245O45M2r6j68n21p22l13L26N80O47J135J838J768N79p31j031
$$ 341167 342287 343532 344177 344219 344123 343955 343434 342712 342399 342725 343305 343952 345087 346925 348693 349272 348541 347510
52871C47510n74n88j495k246j792n67J96K10K69P63J087Q56O55R98J362J065M86
$$ 347510 346936 346348 344853 342607 340815 340248 340444 340654 340923 341686 342773 343629 344284 345282 346644 347709 348195
52854C48195N61J363K009J822Q41n52j868k436j891p60n9k64j052j915k600l051
$$ 348195 348756 350119 352128 353950 354791 354239 352371 349935 348044 347284 347225 346961 345909 343994 341394 338343
52838C38343l297l324k856j657k42K63m73j374j386q75p35p97k81O46J038Q34
$$ 338343 335046 331722 328866 327209 326967 327230 326757 325383 323997 323122 322387 321590 321309 321955 322993 323827
52822C23827R30J498J572N99o43j253j255j008n05J70M98L13K98J014K017K612
$$ 323827 324757 326255 327827 328426 327783 326530 325275 324267 323762 323932 324430 324743 325041 326055 328072 330684
52806C30684K952L631M500M704L901K640J487K65j423l358m698m936m432l870
$$ 330684 333636 337267 341767 346471 350372 353012 354499 354764 353341 349983 345285 340349 335917 332047
52792C32047l396k681j773j263j434j766j705j415j309j220p25L3M84M73L21K09
$$ 332047 328651 325970 324197 322934 321500 319734 318029 316614 315305 314085 313360 313393 313877 314350 314671 314880
52776C14880O2o9j9K08N97J283K047K129J204J54oM06L74p7J5Q00J255P43j47
$$ 314880 314942 314873 314854 315062 315659 316942 318989 321118 322322 322476 322470 322876 323250 323173 323188 323988 325243 325986 325839
52757C25839o55o90l65L17R95J104P95P89J069Q08n7m21K94J146J174P59P22R85
$$ 325839 325184 324494 324129 324446 325441 326545 327340 328129 329198 330006 329949 329528 329822 330968 332142 332901 333623 334608
52739C34608J061J072J276J265O13k79q46j283j854j997j168p1J95j28J39J191
$$ 334608 335669 336741 338017 339282 339895 339616 338770 337487 335633 333636 332468 332397 332592 332464 332603 333794
52723C33794J975J860J338Q73K25p04j395j554j564j566r64M47J577J183m39j725
$$ 333794 335769 337629 338967 339840 340065 339361 337966 336412 334848 333282 332318 332765 334342 335525 335086 333361
52707C33361j745r86k79K80R10J360J120K75n10q39r70j174j152m82O02J311J177
$$ 333361 331616 330630 330351 330631 331541 332901 334021 334296 333786 332947 331977 330803 329651 329169 329771 331082 332259
52690C32259N69K41N36J060J181P54L58O20J379J904J852J580J338Q37K7l62K70
$$ 332259 332828 333069 333605 334665 335846 336600 336958 337578 338957 340861 342713 344293 345631 346468 346495 346133 346403
52673C46403J368J916J780J632J734J725J495J351J315J070P23P11Q53M46n03
$$ 346403 347771 349687 351467 353099 354833 356558 358053 359404 360719 361789 362512 363223 364076 364522 364019
52658C64019j026n70K38O16O02N42M03K35N84J758L149L857L651K808J520M9r39
$$ 364019 362993 362423 362661 363277 363879 364421 364824 365059 365643 367401 370550 374407 378058 380866 382386 382435 381496
52641C81496q77j2Q06R10J59j104k163k374j818j227j052j016p97n42l72j2O30
$$ 381496 380619 380607 381413 382323 382482 381378 379215 376841 375023 373796 372744 371728 370931 370389 370017 370005 370635
52624C70635J054Q69M06J17j55p23j311j404j066q35r64j257j400j150n11M4q9
$$ 370635 371689 372558 372964 373081 372926 372203 370892 369488 368422 367587 366623 365366 363966 362816 362305 362349 362260
52607C62260p68j130q18n27p85r56k70Q42J336J088Q10P27M42J4J04Q57J473J283
$$ 362260 361492 360362 359544 359017 358232 357276 357006 357848 359184 360272 361082 361809 362251 362265 362369 363226 364699 365982
52589C65982O18K90O02J182J516J470J396J685K163K126J292L86L42J134J815
$$ 365982 366600 366890 367492 368674 370190 371660 373056 374741 376904 379030 380322 380708 381050 382184 383999
52574C83999J697J042O12Q93J706K370K279J527P73M13J62l29r11j268j417j482
$$ 383999 385696 386738 387350 388243 389949 392319 394598 396125 396898 397311 397473 397144 396233 394965 393548 392066
52558C92066j335r29o30p28r29q08m83m03o64r60r99o55pN22M29j17k99J87O21
$$ 392066 390731 389802 389172 388444 387515 386707 386224 385821 385157 384197 383198 382543 382536 383058 383487 383370 383071 383258 383879
52539C83879L58k49n92p86j086j095m58J80P0l47j59M32M61j13m43l83o00j061
$$ 383879 384237 383988 383396 382610 381524 380429 379971 380151 380221 379874 379715 380147 380608 380495 380052 379669 379069 378008
52521C78008q70J34R39R71R11J315J689J655J897K946L982L854K806K074K162
$$ 378008 377138 377272 378211 379182 380093 381408 383097 384752 386649 389595 393577 397431 400237 402311 404473
52506D04473K436K284J790J233O18j98j252k485l726m614m785m161l049k003j490
$$ 404473 406909 409193 410983 412216 412834 412636 411384 408899 405173 400559 395774 391613 388564 386561 385071
52491C85071j466j273m17O38Q48o2j193j575j226p54l95RM03M81K11kK61J064
$$ 385071 383605 382332 381915 382553 383401 383339 382146 380571 379345 378591 378196 378205 378608 379089 379300 379298 379559 380623
52473C80623K141L075L462L158K440J870J898K501L192L417L096K645K431K342
$$ 380623 382764 385839 389301 392459 394899 396769 398667 401168 404360 407777 410873 413518 415949 418291
52459D18291K112J793J566J216K73j278k845l864m274m329m238m084l840l415
$$ 418291 420403 422196 423762 424978 425251 423973 421128 417264 412990 408661 404423 400339 396499 393084
52445C93084k880k586k712k834k307j118N5O60O83K56n53j376j587j031k90Q0
$$ 393084 390204 387618 384906 382072 379765 378647 378702 379362 380045 380301 379748 378372 376785 375754 375464 375544
52429C75544J82L10K15n25j641k243j858r66l79l26l24J29R62J665J894J791J689
$$ 375544 375726 376036 376251 375726 374085 371842 369984 369018 368639 368313 367989 368118 369080 370745 372639 374430 376119
52412C76119J695J739J897K416L349M375N073N300N399O056P766J0281J2676J4136
$$ 376119 377814 379553 381450 383866 387215 391590 396663 401963 407362 413418 421184 431465 444141 458277
52398D58277J4540J4070J2526R439M876k79m940q508j0880j2052j1941j0635q722
$$ 458277 472817 486887 499413 508852 513728 513449 508509 500001 489121 477069 465128 454493 445771
52385D45771p148o498o396n927m679l021j353K78J653K184J871J732K596L894
$$ 445771 438623 432125 425729 419802 415123 412102 410749 411027 412680 414864 416735 418467 421063 424957
52371D24957M467M175L758L455K880K203K142K603K426J031o41j429j373j221
$$ 424957 429424 433599 437357 440812 443692 445895 448037 450640 453066 454097 453456 452027 450654 449433
52357D49433j216j143j071j251j517j411p97P3R29J505J501J016P86J494K864
$$ 449433 448217 447074 446003 444752 443235 441824 441027 441100 442029 443534 445035 446051 446837 448331 451195
52342D51195L859L754K745J665J334K017L192L945L907L631L757M149M336M503
$$ 451195 455054 458808 461553 463218 464552 466569 469761 473706 477613 481244 485001 489150 493486 497989
52328D97989N362P000Q624R652J0445J1543J2681J3158J2854J2297J1819J1264
$$ 497989 503351 510351 518975 528627 539072 550615 563296 576454 589308 601605 613424 624688
52316F24688J0544R911R463Q967Q493Q769J0316J2583J4545J5903J7120J8397
$$ 624688 635232 645143 654606 663573 672066 680835 691151 703734 718279 734182 751302 769699
52304G69699J9367J9872K0282K0825K1244K1382K1486K1583K1196K0059J8623
$$ 769699 789066 808938 829220 850045 871289 892671 914157 935740 956936 976995 995618
52293I95618J7320J5916J3985J1597R035O418M092K781K637K649J829N17k80m25
$$ 995618 1012938 1028854 1042839 1054436 1063471 1069889 1073981 1076762 1079399 1082048 1083877 1084394 1084114 1083689
52279A083689n63q81j050j191j796k658k948k449j798j397j043o55m73k97M41
$$ 1083689 1083126 1082245 1081195 1080004 1078208 1075550 1072602 1070153 1068355 1066958 1065915 1065260 1064787 1064490 1064931
52264A064931J692K759L492M471N780O665O876P224Q230R275R868J0711J2505
$$ 1064931 1066623 1069382 1072874 1077345 1083125 1089790 1096666 1103890 1112120 1121395 1131263 1141974 1154479
52251A154479J4486J5307J4920J4403J4244J3777J2335J0133P910O325N725N937
$$ 1154479 1168965 1184272 1199192 1213595 1227839 1241616 1253951 1264084 1271994 1278319 1284044 1289981
52239A289981O248N975N067L851K486J068Jm16o70j580l163m535n130n430o194
$$ 1289981 1296229 1302204 1307271 1311122 1313608 1314676 1314677 1314261 1313591 1312011 1308848 1304313 1299183 1293753 1287559
52224A287559p369q240q429q297q315q415q196p596p037o876p025p204p235o906
$$ 1287559 1280190 1271950 1263521 1255224 1246909 1238494 1230298 1222702 1215665 1208789 1201764 1194560 1187325 1180419
52210A180419n844l975j911m57K40P10J399K330L429M611N493N524M687L680L221
$$ 1180419 1174575 1170600 1168689 1168232 1168472 1169182 1170581 1172911 1176340 1180951 1186444 1191968 1196655 1200335 1203556
52195A203556L449M094M871N556N969O143O319O656P057P238O869N750M026K101
$$ 1203556 1207005 1211099 1215970 1221526 1227495 1233638 1239957 1246613 1253670 1260908 1267777 1273527 1277553 1279654
52181A279654J66j884l871n250n994o949q556r869r840q985q652q870q452p108
$$ 1279654 1279820 1277936 1274065 1268815 1262821 1255872 1247316 1237447 1227607 1218622 1209970 1201100 1192648 1185540
52167A185540n937n477m871l507k076j207k96J295K923L601L475L264K985K243
$$ 1185540 1179603 1174126 1169255 1165748 1163672 1162465 1162169 1163464 1166387 1169988 1173463 1176727 1179712 1181955
52153A181955J277O61L89J19j5K82P41R67J272K204L539M543N044N394N534M958
$$ 1181955 1183232 1183893 1184282 1184401 1184386 1184668 1185409 1186376 1187648 1189852 1193391 1197934 1202978 1208372 1213906 1218864
52137A218864L526J743J97p88j103r69q95j015p25N11K300L881N161O582Q209
$$ 1218864 1222390 1224133 1224330 1223542 1222439 1221470 1220575 1219560 1218835 1219346 1221646 1225527 1230688 1237270 1245479
52122A245479R733J1220J3128J5478J7637J8983J9469J9550J9717J9964J9592
$$ 1245479 1255212 1266432 1279560 1295038 1312675 1331658 1351127 1370677 1390394 1410358 1429950
52111A429950J8010J5885J4820J5414J6389J6308J5475J5317J6464J8466K0875
$$ 1429950 1447960 1463845 1478665 1494079 1510468 1526776 1542251 1557568 1574032 1592498 1613373
52100A613373K3514K5836K7167K7531K7448K6940K5566K3311K0509J7033J2451
$$ 1613373 1636887 1662723 1689890 1717421 1744869 1771809 1797375 1820686 1841195 1858228 1870679
52089A870679P097K002k272n937r016j1072j2045j2510j2814j2696j2118j1605
$$ 1870679 1877776 1879778 1877506 1871569 1862553 1851481 1839436 1826926 1814112 1801416 1789298 1777693
52077A777693j1466j1345j0951j0654j0851j1233j1140j0354r183p957o668m960
$$ 1777693 1766227 1754882 1743931 1733277 1722426 1711193 1700053 1689699 1680516 1672559 1665891 1660931
52065A660931k474N39L056M151M064L972M702O164P907R682J1271J2386J3002
$$ 1660931 1658457 1658996 1662052 1666203 1670267 1674239 1678941 1685105 1693012 1702694 1713965 1726351 1739353
52052A739353J3423J3826J4045J3883J3264J2077J0250Q067N989M147K370P68
$$ 1739353 1752776 1766602 1780647 1794530 1807794 1819871 1830121 1838188 1844177 1848324 1850694 1851462
52040A851462k40n69p23j195j923k513k764k907l425m535n765o283n923n605o247
$$ 1851462 1851222 1850653 1849930 1848735 1846812 1844299 1841535 1838628 1835203 1830668 1824903 1818620 1812697 1807092 1800845
52025A800845p696r171j0378j1526j2560j3193j3542j3869j3850j2919j1354j0063
$$ 1800845 1793149 1783978 1773600 1762074 1749514 1736321 1722779 1708910 1695060 1682141 1670787 1660724
52013A660724r259q244o661n013l757k712j830j633k474m066o210r272j3469j8181
$$ 1660724 1651465 1643221 1636560 1631547 1627790 1625078 1623248 1621615 1619141 1615075 1608865 1599593 1586124 1567943
51999A567943k2549k6130k8582k9318k8194k6045k3940k2157k0446j8915j8021
$$ 1567943 1545394 1519264 1490682 1461364 1433170 1407125 1383185 1361028 1340582 1321667 1303646
51988A303646j7931j8423j9284k0319k1073k1077k0453j9852j9683j9657j9233
$$ 1303646 1285715 1267292 1248008 1227689 1206616 1185539 1165086 1145234 1125551 1105894 1086661
51977A086661j8391j7830j8295j9661k0966k1345k0732j9394j7184j3883j0009
$$ 1086661 1068270 1050440 1032145 1012484 991518 970173 949441 930047 912863 898980 888971
51966H88971o551l822j237J616M396O640Q332R474R678Q678O820M572J866j619
$$ 888971 882420 878598 877361 878977 883373 890013 898345 907819 917497 926175 932995 937567 939433 937814
51952I37814n689r571j2451j3950j4137j3324j1741r382o308k951J46K816N141
$$ 937814 932125 922554 910103 896153 882016 868692 856951 847569 841261 838310 838456 841272 846413
51939H46413P031Q446R789J1341J2351J1625R247O777N328M248K315n54l481n971
$$ 846413 853444 861890 871679 883020 895371 906996 916243 923020 928348 932596 934911 934357 930876 924905
51925I24905q274j0681j3153j5489j7362j8340j8356j7943j7633j7349j6673j5465
$$ 924905 916631 905950 892797 877308 859946 841606 823250 805307 787674 770325 753652 738187
51913G38187j3819j1776r517p492n829l935j251J826M428O444Q550J1083J3502
$$ 738187 724368 712592 703075 695583 689754 685819 684568 686394 690822 697266 705816 716899 730401
51900G30401J5114J5759J5559J4479J2433R459N559N94n317j1306j6072j8763
$$ 730401 745515 761274 776833 791312 803745 813204 818763 819357 814040 802734 786662 767899
51888G67899j9544j9168j8081j6153j3344j0222p517n263k848J26L467O921J0503
$$ 767899 748355 729187 711106 694953 681609 671387 663870 658607 655759 655885 659352 666273 676776
51875F76776J4100J7208J9433K0915K1865K1960K0609J7633J3392Q316K720k930
$$ 676776 690876 708084 727517 748432 770297 792257 812866 830499 843891 852207 854927 851997
51863H51997p903j1447j3135j3025j1577r403o963m470j945P89M008P752J1562
$$ 851997 844094 832647 819512 806487 794910 785507 778544 774074 772129 772918 776926 784678 796240
51850G96240J4810J7167J8506J8437J6495J2760P839K190m053j0488j6207k0415
$$ 796240 811050 828217 846723 865160 881655 894415 902254 904444 900391 889903 873696 853281
51838H53281k2885k3700k3006k1227j9006j6615j3807j0468o974l718q66J178
$$ 853281 830396 806696 783690 762463 743457 726842 713035 702567 695593 691875 691009 692187
51826F92187J757Q15p21j984l103m511n863o385n976n257m582l637k053J8J998
$$ 692187 693944 694759 694038 692054 688951 684440 678577 672192 666216 660959 656377 652740 650687 650705 652703
51811F52703L297L709L629L658L725K959P91k166m748o474p556q064p745o688
$$ 652703 656000 659709 663338 666996 670721 673680 674471 672305 667557 661083 653527 645463 637718 631030
51797F31030n446m452l672k922k163j447r13p40q16o25J06Q34Q26K59Q6O94J317
$$ 631030 625584 621132 617460 614538 612375 610928 610015 609275 608459 607834 607940 608774 609600 609859 609945 610639 611956
51780F11956J056j1j116j809k243k570k498j614J2J744L035M080N648Q124J0922
$$ 611956 613012 613001 611885 610076 607833 605263 602765 601151 601163 602907 605942 610022 615670 623794 634716
51765F34716J3001J3897J3970J3693J2913J1001P624L247j254n381r156j2413
$$ 634716 647717 661614 675584 689277 702190 713191 720815 724062 722808 717427 708271 695858
51753F95858j4383j4458j3187j1849j0983r984q332o556n490n030m278k715p37
$$ 695858 681475 667017 653830 641981 630998 621014 612682 606126 600636 595606 591328 588613 587876
51740E87876R26K030L004M507O647Q706R880J0330J0953J1988J2436J1297Q812
$$ 587876 588802 590832 593836 598343 604990 613696 623576 633906 644859 656847 669283 680580 689392
51727F89392N966L278P28j408k435j994m39J544L263M052L453J523j207l999o103
$$ 689392 695358 698636 699364 697956 695521 693527 693088 694632 697895 701947 705400 706923 705716 701717 695614
51712F95614o995o691n639m168k410q32k27p70j550j518l93J723M887Q654J1507
$$ 695614 688619 681928 676289 672121 669711 668879 668652 667882 666332 664814 664421 666144 671031 679685 691192
51697F91192J1933R932O728L329K84j607j483N19L326O043Q235R197Q069M943
$$ 691192 703125 713057 719785 723114 723398 721791 720308 720827 724153 730196 738431 747628 755697 760640
51683G60640J006k718n991q574r770r199p401n234l183j501m24N2J02m59j973
$$ 760640 761646 758928 752937 744363 734593 725394 717993 712759 709576 708075 707651 707703 707805 707346 705373
51668G05373m053n614o046n636m588k522N62L743O203P966Q962Q180M888J39l998
$$ 705373 701320 695706 689660 684024 679436 676914 677476 681219 687422 695388 704350 712530 717418 717557 713559
51653G13559o516p827q287p530n394k591K5K257M303O058O956O350L916p2m810
$$ 713559 707043 699216 690929 683399 678005 675414 675439 677696 681999 688057 695013 701363 705279 705207 700397
51638G00397r439j3334j5908j6548j5267j3190j1695j1100j0672r853q804p643
$$ 700397 690958 677624 661716 645168 629901 616711 605016 593916 583244 573391 564587 556944
51626E56944o003l749j572k82J32K94N72Q37R39R31Q71Q04Q79J148J249P01m14
$$ 556944 550941 547192 545620 545338 545470 545764 546336 547173 548112 549043 549914 550718 551597 552745 553994 554695 554281
51609E54281j475k090k502l007l368l189k668k429k583k408j241O38K281L204
$$ 554281 552806 550716 548214 545207 541839 538650 535982 533553 530970 528562 527321 527959 530240 533444
51595E33444L912N241P416R964J2387J4613J6688J8200J8369J6722J3629J0043
$$ 533444 537356 542597 550013 559977 572364 586977 603665 621865 640234 656956 670585 680628
51583F80628O821M332K596J619J516K377M079O348R165J2979J8266K4736L1175
$$ 680628 687449 691781 694377 695996 697512 699889 703968 710316 719481 732460 750726 775462 806637
51570H06637L6317L9753M1968M3743M5675M7996N0372N1961N2080N0915M9342
$$ 806637 842954 882707 924675 968418 1014093 1062089 1112461 1164422 1216502 1267417 1316759
51559A316759M8227M8232N0099N4359O0483O6621P0475P0221O4732N3574L7291
$$ 1316759 1364986 1413218 1463317 1517676 1578159 1644780 1715255 1785476 1850208 1903782 1941073
51548A941073J7455l898k4874m3909n9921p2561q2001q8229r0965r0455q7795
$$ 1941073 1958528 1954630 1929756 1885847 1825926 1753365 1671364 1583135 1492170 1401715 1313920
51537A313920q3974p8995p2385o4361n5880m7815m0556l4308k9136k4721k0615
$$ 1313920 1229946 1150951 1078566 1014205 958325 910510 869954 835646 806510 781789 761174
51526G61174j6921j4315j3187j2993j2561j1057q658o424n331n304n352m748l799
$$ 761174 744253 729938 716751 703758 691197 680140 671482 665058 659727 654423 649071 644323 640524
51513F40524l163k856k393j714j333j600k303l078l844m658n434n961o064n712
$$ 640524 637361 634505 632112 630398 629065 627465 625162 622084 618240 613582 608148 602187 596123 590411
51499E90411n107m551m099l496k621j794j353j134o96M4P86J342J815K338K877
$$ 590411 585304 580753 576654 573158 570537 568743 567390 566256 565560 565604 566390 567732 569547 571885 574762
51484E74762L176K746J186j034k614k769k270k429l224l383k296q78j45J15O50
$$ 574762 577938 580684 581870 580836 578222 575453 573183 570754 567530 564147 561851 560973 560828 560943 561593
51469E61593J288J072l66k218l384l501k983k401j997j624j018j14Q25J351J223
$$ 561593 562881 563953 563587 561369 557985 554484 551501 549100 547103 545479 544461 544347 545172 546523 547746
51454E47746P01M52R78K153L450M548N502O369P117P943R228J0996J2951J5280
$$ 547746 548447 548899 549877 552030 555480 560028 565530 571899 579016 586959 596187 607183 620134 635414
51440F35414J8740K3270K7162K8360K6395K2314J7082J1028M861K7k351k448j456
$$ 635414 654154 677424 704586 732946 759341 781655 798737 809765 814626 814653 812302 809854 808398
51427H08398p85j640m611r263j4340j8569k1026k1096j8829j5427j2592j1023
$$ 808398 807613 805973 801362 792099 777759 759190 738164 717068 698239 682812 670220 659197
51415F59197j0024q705o957m998k860p19Q23J417J539J912K676L469L938L837
$$ 659197 649173 640468 633511 628513 625653 624934 625757 627174 628713 630625 633301 636770 640708 644545
51401F44545L143K502L056N202P794R232R139Q454Q080Q137Q445R075J0149J1622
$$ 644545 647688 650190 653246 658448 666242 675474 684613 693067 701147 709284 717729 726804 736953 748575
51387G48575J3606J6514K0616K5547L0666L5918M2082M9927N9224O8835P7766
$$ 748575 762181 778695 799311 824858 855524 891442 933524 983451 1042675 1111510 1189276
51376A189276Q5849R3238R9618J04193J06146J04642R8665Q7424P1003N0255K6254
$$ 1189276 1275125 1368363 1467981 1572174 1678320 1782962 1881627 1969051 2040054 2090309 2116563
51365B116563L87k5225m8275o7526q2935r4469j01634j04483j04134j01664r7047
$$ 2116563 2116950 2091725 2043450 1975924 1892989 1798520 1696886 1592403 1488269 1386605 1289558
51354A289558q9914q0847p1214o1983n3416m5683l9068l3584k9014k5367k2741
$$ 1289558 1199644 1118797 1047583 985600 932184 886501 847433 813849 784835 759468 736727
51343G36727k0829j9090j7448j6155j4959j3077j0400q051p170p465p541o621
$$ 736727 715898 696808 679360 663205 648246 635169 624769 616718 609548 602083 594542 587921
51331E87921n324m667m844n230n202m559l426k306j987k771l757l536j884o9Q51
$$ 587921 582597 577930 573086 567856 562654 558095 554669 552363 550376 547605 543848 540312 538428 538359 539210
51316E39210J381K539M026M466L351J803J204J802K840L512L415K652J835J650
$$ 539210 540591 543130 547156 551622 554973 556776 557980 559782 562622 566134 569549 572201 574036 575686
51302E75686K115K575K576K345K208J948J073n39k568m581o254p453q272q739
$$ 575686 577801 580376 582952 585297 587505 589453 590526 589987 587419 582838 576584 569131 560859 552120
51288E52120q530p295n343l600k689k340j800n62J365L480N030N632N681N846
$$ 552120 543590 536295 530952 527352 524663 522323 520523 519961 521326 524806 529836 535468 541149 546995
51274E46995O143O045N425M724M117L301K349J935K377L102L592M179N364O840
$$ 546995 553138 559183 564608 569332 573449 576750 579099 581034 583411 586513 590105 594284 599648 606488
51260F06488P737P591O612N318M139L028J316j489m647o703p344p758q708r331
$$ 606488 614225 621816 628428 633746 637885 640913 642229 640740 636093 629390 622046 614288 605580 596249
51246E96249q716p632p381p749p446o229n121m560l784k342r66m15l72j19L93
$$ 596249 587533 579901 572520 564771 557325 551096 545975 541415 537631 535289 534323 533908 533536 533417 533810
51231E33810P03N98K64q1k77j96J46N91R79J140Q07m8p54l15J451L478M387L748
$$ 533810 534513 535111 535375 535294 535017 534821 534967 535558 536537 537677 538484 538436 537682 537367 538818 542296 546683 550431
51213E50431K288J111Q07J194J675J848J795J771J793J738J737K189L280M623
$$ 550431 552719 553830 554637 555831 557506 559354 561149 562920 564713 566451 568188 570377 573657 578280
51199E78280N561N826N832O162O787O983O223M852L511K250P81o33j357j475j834
$$ 578280 583841 589667 595499 601661 608448 615431 621654 626506 630017 632267 633048 632415 631058 629583 627749
51184F27749k718l328k943j868p82L4L35k99j632k519k372k129k811l832l882
$$ 627749 625031 621703 618760 616892 616110 616144 616479 616180 614548 612029 609657 607528 604717 600885 597003
51169E97003k938k123j907j791j502j239p26N65K122K620J777Q52Q79J422J577
$$ 597003 594065 591942 590035 588244 586742 585503 584777 585342 587464 590084 591861 592713 593592 595014 596591
51154E96591J141K79j043k633l795m182m330m756n128m891m174l471k950k512
$$ 596591 597732 598011 596968 594335 590540 586358 582028 577272 572144 567253 563079 559608 556658 554146
51140E54146k171j846j272n62k98n93o41J34J089J302J003J115J698J964J755
$$ 554146 551975 550129 548857 548295 547997 547404 546763 546897 547986 549288 550291 551406 553104 555068 556823
51125E56823J909K873L860L917L238K828L191L872M154L787L064K425K058J782
$$ 556823 558732 561605 565465 569382 572620 575448 578639 582511 586665 590452 593516 595941 597999 599781
51111E99781J280N56K1P2O61J420K165L047M134N017N111M341L301K636K325J779
$$ 599781 601061 601617 601638 601710 602371 603791 605956 609003 613137 618154 623265 627606 630907 633543 635868 637647
51095F37647N71j081k585l566m115m494m759m796m628m445m211l487k094o60j12
$$ 637647 638218 637137 634552 630986 626871 622377 617618 612822 608194 603749 599538 596051 593957 593297 593185
51080E93185m84p70j08J266K512L075K866J995R09L72Q42J978L179M271N259N824
$$ 593185 592701 591931 591823 593089 595601 598676 601542 603537 604446 604818 605660 607638 610817 615088 620347 626171
51064F26171N696N317N418O096O911P768Q909J0141J0933J1233J1438J1375J0192
$$ 626171 631867 637184 642602 648698 655609 663377 672286 682427 693360 704593 716031 727406 737598
51051G37598P630M641K433J507J991M003P068R859J1360J2026J2943J4229J4938
$$ 737598 745228 749869 752302 753809 755800 759803 766871 776730 788090 800116 813059 827288 842226
51038H42226J4437J3021J1237R382P841P122P088O673M854J665k185o411j1262
$$ 842226 856663 869684 880921 890303 898144 905266 912354 919027 923881 925546 923361 916950 905688
51025I05688j6560k1220k3993k4387k2757j9830j6450j3361j0790q337n638k954
$$ 905688 889128 867908 843915 819528 796771 776941 760491 747130 736340 728003 722365 719411
51013G19411p07J275L413N401O449O572O811P862R210J0102J0617J1107J1289
$$ 719411 718704 719979 723392 728793 735242 741814 748625 756487 765697 775799 786416 797523 808812
51000H08812J0723R749R060Q639P952O997O368O258O236O043O001O518P746R742
$$ 808812 819535 829284 838344 846983 854935 861932 868300 874558 880794 886837 892838 899356 907102 916844
50986I16844J2466J5510J8297K0580K2446K3953K5179K6303K7246K7540K7195
$$ 916844 929310 944820 963117 983697 1006143 1030096 1055275 1081578 1108824 1136364 1163559
50975A163559K7186K8266K9704L0150K9440K8394K7014K4385K0592J7356J6128
$$ 1163559 1190745 1219011 1248715 1278865 1308305 1336699 1363713 1388098 1408690 1426046 1442174
50964A442174J6679J8199K0724K4682K9783L5276M0774M6110N0836N4417N6716
$$ 1442174 1458853 1477052 1497776 1522458 1552241 1587517 1628291 1674401 1725237 1779654 1836370
50953A836370N7739N7371N5609N2649M8409M2580L5555K8649K2883J8012J3332
$$ 1836370 1894109 1951480 2007089 2059738 2108147 2150727 2186282 2214931 2237814 2255826 2269158
50942B269158Q816N033K366Q91N32P09K87j599m963r538j5221k1389k6506k9349
$$ 2269158 2277974 2283007 2285373 2286264 2286796 2287505 2287792 2286193 2281230 2271692 2256471 2235082 2208576 2179227
50928B179227l0313l0730l1313l2086l3366l5713l8880m1815m3951m5792m7952
$$ 2179227 2148914 2118184 2086871 2054785 2021419 1985706 1946826 1905011 1861060 1815268 1767316
50917A767316n0162n1561n1638n0620m9127m7541m5738m3377m0479l7386l4238
$$ 1767316 1717154 1665593 1613955 1563335 1514208 1466667 1420929 1377552 1337073 1299687 1265449
50906A265449l0844k7263k4046k1634j9902j8565j7521j6547j5208j3485j1914
$$ 1265449 1234605 1207342 1183296 1161662 1141760 1123195 1105674 1089127 1073919 1060434 1048520
50895A048520j0655r043o675m327k993k483j869q57J16Q51J452J696J335R13J263
$$ 1048520 1037865 1028822 1022147 1017820 1014827 1012344 1010475 1009618 1009734 1010585 1012037 1013733 1015068 1015981 1017244
50880A017244K270L081L575M550O198P589Q028Q031Q348Q878R208R517J0163J0892
$$ 1017244 1019514 1022595 1026170 1030720 1036918 1044507 1052535 1060566 1068914 1077792 1087000 1096517 1106680 1117572
50866A117572J1257J1659J3052J5687J8718K1246K3277K5417K7963L0660L3228
$$ 1117572 1128829 1140488 1153540 1169227 1187945 1209191 1232468 1257885 1285848 1316508 1349736
50855A349736L5903L9347M4074N0093N6989O4262P1634P9265Q7644R7027J06879
$$ 1349736 1385639 1424986 1469060 1519153 1576142 1640404 1712038 1791303 1878947 1975974 2082853
50844B082853J16171J24294J31494J38200J44268J49176J52570J54242J53658
$$ 2082853 2199024 2323318 2454812 2593012 2737280 2886456 3039026 3193268 3346926
50835C346926J49983J42538J31082J15832R7503P7219N6077L4840J4112n436k3160
$$ 3346926 3496909 3639447 3770529 3886361 3983864 4061083 4117160 4152000 4166112 4160676 4137516
50824D137516l8481n0503n8077o0627n8840n4173m7872m0668l3075k5631j9193
$$ 4137516 4099035 4048532 3990455 3929828 3870988 3816815 3768943 3728275 3695200 3669569 3650376
50813C650376j5241j5369j9860k7288l6029m5749n6689o8190p9025q8860r8175
$$ 3650376 3635135 3619766 3599906 3572618 3536589 3490840 3434151 3365961 3286936 3198076 3099901
50802C099901j06714j13205j16819j17871j16794j13363j07421r9579r0716q1341
$$ 3099901 2993187 2879982 2763163 2645292 2528498 2415135 2307714 2208135 2117419 2036078
50792B036078p1777o2349n3091m3823l4846k6846j9864j3176o673j450J671L424
$$ 2036078 1964301 1901952 1848861 1805038 1770192 1743346 1723482 1710306 1703633 1702183 1703854 1707278
50780A707278N017O357O355M722K412L64j312k824m207n653p607j0110j2460j4012
$$ 1707278 1712295 1718652 1725007 1729729 1732141 1732505 1731193 1728369 1724162 1718509 1710902 1700792 1688332 1674320
50766A674320j5050j6525j8965k1968k4761k6965k8615k9637k9720k8820k7432
$$ 1674320 1659270 1642745 1623780 1601812 1577051 1550086 1521471 1491834 1462114 1433294 1405862
50755A405862k6036k4474k2316j9717j7311j5281j3097j0383p420m493j257K671
$$ 1405862 1379826 1355352 1333036 1313319 1296008 1280727 1267630 1257247 1249827 1245334 1244077 1246748
50743A246748O940J0832J4170J7339K0601K3977K7662L1921L6574M1133M5511
$$ 1246748 1253688 1264520 1278690 1296029 1316630 1340607 1368269 1400190 1436764 1477897 1523408
50732A523408N0051N4720N8960O2596O6342P0808P5416P8925Q0924Q2224Q3672
$$ 1523408 1573459 1628179 1687139 1749735 1816077 1886885 1962301 2041226 2122150 2204374 2288046
50721B288046Q5069Q5536Q4479Q1840P7561P1229O2326N0713L6786K1272M959
$$ 2288046 2373115 2458651 2543130 2624970 2702531 2773760 2836086 2886799 2923585 2944857 2949816
50710B949816j1376k6701l9595m8777n3999n6118n6008n3652m8692m1582l3596
$$ 2949816 2938440 2911739 2872144 2823367 2769368 2713250 2657242 2603590 2554898 2513316 2479720
50699B479720k5796j8659j2712q749p132p531r763j4220k0944k8882l6790m4343
$$ 2479720 2453924 2435265 2422553 2413804 2406672 2399141 2389378 2375158 2354214 2325332 2288542 2244199
50687B244199n1614n7824o1606o2405o0813n7600n3203m8141m3018l7833l1990
$$ 2244199 2192585 2134761 2073155 2010750 1949937 1892337 1839134 1790993 1747975 1710142 1678152
50676A678152k5225j7860j0032j526P381J5727K2934K9359L5321M0325M3860M6275
$$ 1678152 1652927 1635067 1625035 1623509 1630890 1646617 1669551 1698910 1734231 1774556 1818416 1864691
50664A864691M8070M8833M7695M4576M0208L5234L0045K5278K1588J8903J6592
$$ 1864691 1912761 1961594 2009289 2053865 2094073 2129307 2159352 2184630 2206218 2225121 2241713
50653B241713J4396J2569J1139R736Q225O820N441L712J900J004J516K724L876
$$ 2241713 2256109 2268678 2279817 2289553 2297778 2304598 2310039 2313751 2315651 2316655 2318171 2320895 2324771
50640B324771N466Q596J3370J8746K3882K8818L3702L8070M1283M3386M5020M6709
$$ 2324771 2330237 2338833 2352203 2370949 2394831 2423649 2457351 2495421 2536704 2580090 2625110 2671819
50628B671819M8461N0003N1298N2789N5075N7919N9385N6278M5968K8079M596
$$ 2671819 2720280 2770283 2821581 2874370 2929445 2987364 3046749 3103027 3148995 3177074 3181670
50617C181670k1142m5378o4481p5878p9070p5688o8219n8767m8748l9137l0430
$$ 3181670 3160528 3115150 3050669 2974791 2895721 2820033 2751814 2693047 2644299 2605162 2574732
50606B574732k2618j5648r949o230m841n666q624j3876k1333l0222l9369m7878
$$ 2574732 2552114 2536466 2526517 2520287 2515446 2509780 2501156 2487280 2465947 2435725 2396356 2348478
50594B348478n5361o1625o6360o9244p0264o9736o8029o5366o1982n8247n4401
$$ 2348478 2293117 2231492 2165132 2095888 2025624 1955888 1887859 1822493 1760511 1702264 1647863
50583A647863n0291m5636m0598l5716l1313k7226k3226j9292j5329j1070o504
$$ 1647863 1597572 1551936 1511338 1475622 1444309 1417083 1393857 1374565 1359236 1348166 1341662
50572A341662k091J921N925J0290J4494J7528J9016J9404J9172J8465J7463J6426
$$ 1341662 1339571 1341492 1347417 1357707 1372201 1389729 1408745 1428149 1447321 1465786 1483249 1499675
50560A499675J5249J3641J2013J1558J2982J5648J8509K1539K5606L1037L6909
$$ 1499675 1514924 1528565 1540578 1552136 1565118 1580766 1599275 1620814 1646420 1677457 1714366
50549A714366M1880M5287M7243M7940M7202M4705M0520L5401L0500K6773K4536
$$ 1714366 1756246 1801533 1848776 1896716 1943918 1988623 2029143 2064544 2095044 2121817 2146353
50538B146353K3581K3684K4932K7494L1220L5616M0269M5081M9919N4346N8160
$$ 2146353 2169934 2193618 2218550 2246044 2277264 2312880 2353149 2398230 2448149 2502495 2560655
50527B560655O2043O7121P3669Q0767Q7456R3663R9655J05061J09142J11688J12875
$$ 2560655 2622698 2689819 2763488 2844255 2931711 3025374 3125029 3230090 3339232 3450920 3563795
50516C563795J12362J09283J03202R4494Q3595P0481N5081L7794J9268M6j9361
$$ 3563795 3676157 3785440 3888642 3983136 4066731 4137212 4192293 4230087 4249355 4249401 4230040
50505D230040l8213n5626p0826q3354r3158j00236j04050j03591r8560r0102p9704
$$ 4230040 4191827 4136201 4065375 3982021 3888863 3788627 3684577 3580986 3482426 3392324 3312620
50494C312620o7546n2887l6070j8996l362J0593K2900L2469L7713L7976L3460
$$ 3312620 3245074 3192187 3156117 3137121 3133759 3144352 3167252 3199721 3237434 3275410 3308870
50483C308870K4233J0252p742k8178m9370o9741q7596j01583j11407j17453j19835
$$ 3308870 3333103 3343355 3335613 3307435 3258065 3188324 3100728 2999145 2887738 2770285 2650450
50472B650450j18465j14057j08104j01620r4553q6752p8867p1798o5784o0464
$$ 2650450 2531985 2417928 2309824 2208204 2113651 2026899 1948032 1876234 1810450 1749986
50462A749986n5649n1447m7788m4234m0327l5976l1494k7296k3497j9805j5930
$$ 1749986 1694337 1642890 1595102 1550868 1510541 1474565 1443071 1415775 1392278 1372473 1356543
50451A356543j2086q804o202l813j293J032K645L675M808O471Q406J0060J1084
$$ 1356543 1344457 1335653 1329451 1325638 1324345 1325377 1328022 1331697 1336505 1342976 1351382 1361442 1372526
50438A372526J1466J1456J1393J1406J1135J0098Q393O825O108O174O490O727
$$ 1372526 1383992 1395448 1406841 1418247 1429382 1439480 1447873 1454698 1460806 1466980 1473470 1480197
50426A480197O831O692O314O221P086Q783J0464J1732J3200J5464J8069K0246
$$ 1480197 1487028 1493720 1500034 1506255 1513341 1522124 1532588 1544320 1557520 1572984 1591053 1611299
50414A611299K2254K5178K9453L4332L9046M3728M8867N4338N9531O4051O7899
$$ 1611299 1633553 1658731 1688184 1722516 1761562 1805290 1854157 1908495 1968026 2032077 2099976
50403B099976P1068P3334P4443P4311P3057P0872O7629O2665N5216M5193L3262
$$ 2099976 2171044 2244378 2318821 2393132 2466189 2537061 2604690 2667355 2722571 2767764 2801026
50392B801026K0001N452j0268k6267m1273n4512o5799p4871q1142q4206q4218
$$ 2801026 2821027 2826479 2816211 2789944 2748671 2694159 2628360 2553489 2472347 2388141 2303923
50381B303923q1659p6900p0110o1515n1681m1454l1506k1911j2500l658L608Q607
$$ 2303923 2222264 2145364 2075254 2013739 1962058 1920604 1889098 1867187 1854687 1851029 1854637 1863244
50369A863244J1599J3047J2581R324L174m862j3658k2685l1540l9381m5319m9152
$$ 1863244 1874843 1887890 1900471 1909795 1912969 1908107 1894449 1871764 1840224 1800843 1755524 1706372
50357A706372n1319n2245n2057n0789m8572m5650m2439l9520l7238l5296l3025
$$ 1706372 1655053 1602808 1550751 1499962 1451390 1405740 1363301 1323781 1286543 1251247 1218222
50346A218222l0199k7240k4527k1787j8516j4895j1884j0245r778r675r376q833
$$ 1218222 1188023 1160783 1136256 1114469 1095953 1081058 1069174 1058929 1049151 1039476 1030100 1021267
50334A021267q066o922n448m172l633l701l620k898j878j263j179r85q6J362K714
$$ 1021267 1013201 1006279 1000831 996659 993026 989325 985705 982807 980929 979666 978487 977502 977416 978778 981492
50319I81492L596M175M762N419N977O207N972N428N037N192N697N948N634N037
$$ 981492 985088 989263 994025 999444 1005421 1011628 1017600 1023028 1028065 1033257 1038954 1044902 1050536 1055573
50305A055573M605M548M985N987P168P627O796N178L856L357L413L669M156M962
$$ 1055573 1060178 1064726 1069711 1075698 1082866 1090493 1097289 1102467 1106323 1109680 1113093 1116762 1120918 1125880
50291A125880N821O166N548L966J978L40n47p42k60J176L546O082P860Q732R248
$$ 1125880 1131701 1137867 1143415 1147381 1149359 1149699 1149152 1148410 1148150 1149326 1152872 1158954 1166814 1175546 1184794
50276A184794R821J0251R873P803L407k797q954j3149j4793j4311j2018q247m271
$$ 1184794 1194615 1204866 1214739 1222542 1225949 1223152 1214198 1201049 1186256 1171945 1159927 1151680 1147409
50263A147409j706q20m59P9K12m16q10J07J900L276L794L976M039L495K005qj759
$$ 1147409 1145703 1144883 1144424 1144503 1144715 1144299 1143489 1143596 1145496 1148772 1152566 1156542 1160581 1164076 1166081 1166073 1164314
50246A164314k752k964k717k290j634p37j34n27j701k556k518k256k490k899k886
$$ 1164314 1161562 1158598 1155881 1153591 1151957 1151220 1151086 1150559 1148858 1146302 1143784 1141528 1139038 1136139 1133253
50231A133253k682k847l194l235l269l923m849n031m356l787l850l953l577l147
$$ 1133253 1130571 1127724 1124530 1121295 1118026 1114103 1109254 1104223 1099867 1096080 1092230 1088277 1084700 1081553
50217A081553l260l786m166m198l966l546l079k844k796k485j704q85n18m28m2
$$ 1081553 1078293 1074507 1070341 1066143 1062177 1058631 1055552 1052708 1049912 1047427 1045723 1044838 1044320 1043892 1043850
50202A043850R14K289L861N525P226R068J1375J4408J8064K1947K5650K8879L1485
$$ 1043850 1044764 1047053 1050914 1056439 1063665 1072733 1084108 1098516 1116580 1138527 1164177 1193056 1224541
50189A224541L3511L5030L5893L5813L4920L3906L3399L3280L2942L2165L1398
$$ 1224541 1258052 1293082 1328975 1364788 1399708 1433614 1467013 1500293 1533235 1565400 1596798
50178A596798L1087L0946K9989K7219K2157J4884N819m403j4998k5139l3996m0747
$$ 1596798 1627885 1658831 1688820 1716039 1738196 1753080 1758899 1754496 1739498 1714359 1680363 1639616
50166A639616m4779m6140m5552m3657m0299l4963k7964k0617j4075q522l867o50
$$ 1639616 1594837 1548697 1503145 1459488 1419189 1384226 1356262 1335645 1321570 1313048 1309181 1308531
50154A308531L81p51l342o928j1332j5824j9038k0184j9876j9425j9602k0373
$$ 1308531 1308912 1308161 1304819 1297891 1286559 1270735 1251697 1231513 1211637 1192212 1172610 1152237
50142A152237k1407k2380k2883k2576k1554k0317j9243j8165j6538j3980j0622
$$ 1152237 1130830 1108450 1085567 1062991 1041437 1021120 1001877 983712 967174 953194 942572
50131I42572o989l584o26J879L872N105N357M726L649K575J614N96m59j204j388
$$ 942572 935583 931999 931373 933252 937124 942229 947586 952312 955961 958536 960150 960746 960287 959083 957695
50116I57695j271j403j981k647k977k856k368j502r6J912M181N934O552O371O518
$$ 957695 956424 955021 953040 950393 947416 944560 942192 940690 940594 942506 946687 952621 959173 965544 972062
50101I72062P566Q746R045Q776R118J0294J1200J1064J0391R890R490R093R430
$$ 972062 979628 988374 997419 1006195 1015313 1025607 1036807 1047871 1058262 1068152 1077642 1086735 1096165
50088A096165J1185J3929J6705J9232K1674K3768K5184K6456K8561L1710L5383
$$ 1096165 1107350 1121279 1137984 1157216 1178890 1202658 1227842 1254298 1282859 1314569 1349952
50077A349952L9403M4022M9037N3858N8465O3335O8204P1798P3164P2616P1183
$$ 1349952 1389355 1433377 1482414 1536272 1594737 1658072 1726276 1798074 1871238 1943854 2015037
50066B015037O9810O9281P0024P1557P2680P2578P1150O7974O1663N0891L5708
$$ 2015037 2084847 2154128 2224152 2295709 2368389 2440967 2512117 2580091 2641754 2692645 2728353
50055B728353J7495j974k1070l8490n3536o6172p6426q3992q8634r0617r0416
$$ 2728353 2745848 2743874 2722804 2684314 2630778 2564606 2488180 2404188 2315554 2224937 2134521
50044B134521q8342q4706p9974p4305o7257n8483m8591l8893l0400k3418j7942
$$ 2134521 2046179 1961473 1881499 1807194 1739937 1681454 1632863 1593970 1563570 1540152 1522210
50033A522210j3968j1330r573q174o700m868k610k19J790L013L353K930J940O52
$$ 1522210 1508242 1496912 1487339 1479165 1472465 1467597 1464987 1464768 1466558 1469571 1472924 1475854 1477794 1478446
50019A478446o02j550k132k559l220m468o489r315j2827j6658k0213k2861k4145
$$ 1478446 1477844 1476294 1474162 1471603 1468383 1463915 1457426 1448111 1435284 1418626 1398413 1375552 1351407
50006A351407k3896k2364k0251j8268j6519j4580j2251r811p282m080Q1M355P599
$$ 1351407 1327511 1305147 1284896 1266628 1250109 1235529 1223278 1213467 1206185 1202105 1202186 1206541 1214140
49993A214140R692J1209J2004J1188Q673N718L424J490r24l692n960p570r425
$$ 1214140 1223832 1235041 1247045 1258233 1266906 1272624 1276048 1277538 1276614 1272922 1266962 1259392 1249967
49980A249967j2198j5194j6808j6062j3492j0567q318o646m888k744l96J934M062
$$ 1249967 1237769 1222575 1205767 1189705 1176213 1165646 1157328 1150682 1145794 1143050 1142654 1144588 1148650
49967A148650N608O294O530P259R027J1601J4538J7736K1272K5196K9637L4704
$$ 1148650 1154258 1160552 1167082 1174341 1183368 1194969 1209507 1227243 1248515 1273711 1303348 1338052
49955A338052M0165M5533N0721N6015O1254O5438O7586O7550O5731O2397N7816
$$ 1338052 1378217 1423750 1474471 1530486 1591740 1657178 1724764 1792314 1858045 1920442 1978258
49944A978258N2683M7827M3534L9553L5631L1565K6708J9858R824l855k0610l8861
$$ 1978258 2030941 2078768 2122302 2161855 2197486 2229051 2255759 2275617 2285441 2281586 2260976 2222115
49932B222115n6511p1722q3527r1745r6402r7462r5064q9779q2519p4249o5825
$$ 2222115 2165604 2093882 2010355 1918610 1822208 1724746 1629682 1539903 1457384 1383135 1317310
49921A317310n7892n0709m4019l7349l0684k4655j9800j5813j1974q280n522m027
$$ 1317310 1259418 1208709 1164690 1127341 1096657 1072002 1052202 1036389 1024415 1016135 1010613 1006586
$$ [...]
##END NTUPLES=NMR SPECTRUM
##END=
