##TITLE=AC1474_ZNESNA300_8100857_HIgwmcBgB9
##JCAMPDX= 6.0         $$ Bruker NMR JCAMP-DX V2.0
##DATA TYPE= NMR SPECTRUM
##DATA CLASS= NTUPLES
##ORIGIN= BRUKER
##OWNER= Administrator
$$ 1.72 TOPSPIN		Version 2.1
$$ 2013-08-15 15:44:55.474 -0700  Administrator@X
$$ Compression mode = diff/dup
##.OBSERVE FREQUENCY= 400.02188249412
##.OBSERVE NUCLEUS= ^1H
##.ACQUISITION MODE= SIMULTANEOUS (DQD)
##.ACQUISITION SCHEME= undefined
##.AVERAGES= 8
##.DIGITISER RES= 22
##SPECTROMETER/DATA SYSTEM= spect
##.PULSE SEQUENCE= zg30
##.SOLVENT NAME= COFFEE_meoh
##.SHIFT REFERENCE= INTERNAL, COFFEE_meoh, 1, 14.98509
##AUDIT TRAIL= $$ (NUMBER, WHEN, WHO, WHERE, PROCESS, VERSION, WHAT)
$$ ##TITLE= Audit trail, TOPSPIN		Version 2.1
$$ ##JCAMPDX= 5.01
$$ ##ORIGIN= Bruker BioSpin GmbH
$$ ##OWNER= Administrator
$$ $$ E:\/data/COFFEE/nmr/AC1474_ZNESNA300_8100857_HIgwmcBgB9/30/pdata/1/auditp.txt
$$ ##AUDIT TRAIL=  $$ (NUMBER, WHEN, WHO, WHERE, PROCESS, VERSION, WHAT)
(   1,<2013-08-15 15:44:48.193 -0700>,<Administrator>,<X>,<go>,<TOPSPIN 2.1>,
      <created by zg
	started at 2013-08-15 15:43:42.537 -0700,
	POWCHK enabled, PULCHK disabled,
       configuration hash MD5:
       C8 4E 4E 5D D3 5C D8 9E 9F 52 82 E0 59 8A DE 15
       data hash MD5: 64K
       00 8A 3F 04 4C B4 05 81 4E 68 37 95 B0 64 01 18>)
(   2,<2013-08-15 15:44:51.615 -0700>,<Administrator>,<X>,<proc1d>,<TOPSPIN 2.1>,
      <Start of raw data processing
       efp LB = 0 FT_mod = 6 PKNL = 1 PHC0 = 0 PHC1 = 0 SI = 32K 
       data hash MD5: 32K
       01 51 95 74 5D DA 34 C1 94 EE A2 78 36 1B DD BB>)
(   3,<2013-08-15 15:44:51.959 -0700>,<Administrator>,<X>,<proc1d>,<TOPSPIN 2.1>,
      <pk PHC0 = 99.37683 PHC1 = 0 
       data hash MD5: 32K
       80 BA 8A 1B CF B2 5D A1 8F C1 76 94 EC 90 81 0C>)
(   4,<2013-08-15 15:44:52.068 -0700>,<Administrator>,<X>,<proc1d>,<TOPSPIN 2.1>,
      <abs ABSG = 1 
       data hash MD5: 32K
       F8 6A DE 2F 14 43 D3 EE 43 01 70 42 AC C0 92 FD>)
(   5,<2013-08-15 15:44:52.131 -0700>,<Administrator>,<X>,<proc1d>,<TOPSPIN 2.1>,
      <abs ABSG = 2 
       data hash MD5: 32K
       6B 94 A1 51 F0 2B 0D A0 C8 05 C3 41 66 CB D8 53>)
(   6,<2013-08-15 15:44:52.177 -0700>,<Administrator>,<X>,<proc1d>,<TOPSPIN 2.1>,
      <abs ABSG = 3 
       data hash MD5: 32K
       64 15 13 D7 92 78 65 FF 03 A6 C2 BD 83 A0 27 1F>)
(   7,<2013-08-15 15:44:52.334 -0700>,<Administrator>,<X>,<proc1d>,<TOPSPIN 2.1>,
      <abs ABSG = 4 
       data hash MD5: 32K
       74 6B C4 7A 43 02 E7 6B D8 43 31 DA F4 94 7D 4C>)
(   8,<2013-08-15 15:44:52.646 -0700>,<Administrator>,<X>,<proc1d>,<TOPSPIN 2.1>,
      <abs ABSG = 5 
       data hash MD5: 32K
       76 8A 8B 00 D1 D9 EB 64 6B 07 71 3F CC 93 97 6A>)
$$ ##END=
$$ 
$$ $$ hash MD5
$$ $$ 3C A2 6B AF 18 CA CB F8 41 4D 88 1B 06 E7 47 E5
##$RELAX= 
##$RELAX= 
##$RELAX= 
##$RELAX= 
##$RELAX= 
##$RELAX= 
##$RELAX= 
$$ Bruker specific parameters
$$ --------------------------
##$DU= <E:\>
##$EXPNO= 30
##$NAME= <AC1474_ZNESNA300_8100857_HIgwmcBgB9>
$$ [...]
150 150 150 150 150 150 150 150
##$TP07= 0
##$TPNAME0= <>
##$TPNAME1= <>
##$TPNAME2= <>
##$TPNAME3= <>
##$TPNAME4= <>
##$TPNAME5= <>
##$TPNAME6= <>
##$TPNAME7= <>
##$TPOAL= (0..7)
0.5 0.5 0.5 0.5 0.5 0.5 0.5 0.5
##$TPOFFS= (0..7)
0 0 0 0 0 0 0 0
##$TUNHIN= 0
##$TUNHOUT= 0
##$TUNXOUT= 0
##$USERA1= <user>
##$USERA2= <user>
##$USERA3= <user>
##$USERA4= <user>
##$USERA5= <user>
##$V9= 5
##$VALIST= <valist>
##$VCLIST= <CCCCCCCCCCCCCCC>
##$VD= 0
##$VDLIST= <DDDDDDDDDDDDDDD>
##$VPLIST= <PPPPPPPPPPPPPPP>
##$VTLIST= <TTTTTTTTTTTTTTT>
##$WBST= 1024
##$WBSW= 4
##$XGAIN= (0..3)
0 0 0 0
##$XL= 0
##$YL= 0
##$YMAX_a= 648265
##$YMIN_a= -551553
##$ZGOPTNS= <>
##$ZL1= 120
##$ZL2= 120
##$ZL3= 120
##$ZL4= 120
##$ABSF1= 14.98509
##$ABSF2= -5.573092
##$ABSG= 5
##$ABSL= 3
##$ALPHA= 0
##$AQORDER= 0
##$ASSFAC= 0
##$ASSFACI= 0
##$ASSFACX= 0
##$ASSWID= 0
##$AUNMP= <proc_prof1d_extract_pilot.lims>
##$AXLEFT= 0
##$AXNAME= <>
##$AXNUC= <1H>
##$AXRIGHT= 0
##$AXTYPE= 0
##$AXUNIT= <>
##$AZFE= 0.1
##$AZFW= 0.1
##$BCFW= 0
##$BC_mod= 0
##$BYTORDP= 0
##$COROFFS= 0
##$CY= 15
##$DATMOD= 1
##$DC= 0
##$DFILT= <>
##$DTYPP= 0
##$F1P= 0
##$F2P= 0
##$FCOR= 0.5
##$FTSIZE= 32768
##$FT_mod= 6
##$GAMMA= 0
##$GB= 0
##$INTBC= 1
##$INTSCL= 1
##$ISEN= 128
##$LB= 0
##$LEV0= 0
##$LPBIN= 0
##$MAXI= 10000
##$MC2= 0
##$MEAN= 0
##$ME_mod= 0
##$MI= 0
##$NCOEF= 0
##$NC_proc= -8
##$NLEV= 6
##$NOISF1= 0
##$NOISF2= 0
##$NSP= 0
##$NTH_PI= 0
##$NZP= 0
##$OFFSET= 14.98509
##$PC= 1
##$PHC0= 99.37683
##$PHC1= 0
##$PH_mod= 1
##$PKNL= yes
##$PPARMOD= 0
##$PPDIAG= 0
##$PPIPTYP= 0
##$PPMPNUM= 2147483647
##$PPRESOL= 1
##$PSCAL= 4
##$PSIGN= 0
##$PYNMP= <proc.py>
##$REVERSE= no
##$SF= 400.02
##$SI= 32768
##$SIGF1= 0
##$SIGF2= 0
##$SINO= 400
##$SIOLD= 32768
##$SPECTYP= <>
##$SREGLST= <1H.CDCl3>
##$SSB= 0
##$STSI= 32768
##$STSR= 0
##$SW_p= 8223.68421052631
##$SYMM= 0
##$S_DEV= 0
##$TDeff= 65536
##$TDoff= 0
##$TI= <>
##$TILT= no
##$TM1= 0
##$TM2= 0
##$TOPLEV= 0
##$USERP1= <user>
##$USERP2= <user>
##$USERP3= <user>
##$USERP4= <user>
##$USERP5= <user>
##$WDW= 1
##$XDIM= 32768
##$YMAX_p= 453385115
##$YMIN_p= -693959
##$CURPLOT= <Network HP LaserJet P1505>
##$CURPRIN= <$Network HP LaserJet P1505>
##$DFORMAT= <normdp>
##$LAYOUT= <+/1D_H.xwp>
##$LFORMAT= <normlp>
##$PFORMAT= <normpl>
##$SURQMSG= 1
$$ End of Bruker specific parameters
$$ ---------------------------------
##NTUPLES= NMR SPECTRUM
##VAR_NAME=  FREQUENCY,     SPECTRUM/REAL,   SPECTRUM/IMAG
##SYMBOL=    X,             R,               I
##VAR_TYPE=  INDEPENDENT,   DEPENDENT,       DEPENDENT
##VAR_FORM=  AFFN,          ASDF,            ASDF
##VAR_DIM=   32768,         32768,           32768
##UNITS=     HZ,            ARBITRARY UNITS, ARBITRARY UNITS
##FACTOR=    0.250966925370066, 1,           1
##FIRST=     8223.43324360094, -166610,      -128615
##LAST=      0,             -134568,         103330
##MIN=       0,             -693959,         0
##MAX=       8223.43324360094, 453385115,    0
$$ Real data points
##PAGE= N=1
##DATA TABLE= (X++(R..R)), XYDATA
$$ [...]
19535d110n5639C3341L6524b54893E9949b31407m6904J28644A04216O7934a09556
19523c32932A09266d08023N0180B23690a0330B02854d17954F2766b08825c526
19512D16406A7067Q2634m3381a96911c1430p0331j16784k863N4284A76832G3974
19500a17601r6317c3521j83069A24424l1119i6762E6815A0482a34447l5986H4358
19488A24306b96940M9969f9829B83614a54296k66009D4796c07435F9594b11759
19477A83176a00780o7595B9918g631l3448f787q5372A36645a5820B06316a06429
19465I8446j9076J2048a28294r819A18952c76863A82972C3522M25368C1369d6160
19453H0950c06392N3533i1959j0431j66900A50974a15488H6951a64602A3009e6303
$$ plain form
19535 -4110 -59749 33341 69865 -254893 59949 -231407 -278311 -149667 104216 172150 -109556
19523 -332932 109266 -408023 -357843 223690 -10330 202854 -417954 62766 -208825 -3526
19512 416406 17067 99701 56320 -196911 -31430 -101761 -218545 -221408 -167124 176832 73974
19500 -117601 -213918 -33521 -216590 124424 93305 -96762 56815 10482 -134447 -170433 84358
19488 124306 -296940 -246971 -69829 283614 -154296 -420305 44796 -307435 69594 -211759
19477 183176 -100780 -168375 29918 -7631 -41079 -6787 -92159 136645 -15820 206316 -106429
19465 98446 79370 91418 -128294 -138113 118952 -376863 182972 33522 458890 31369 -46160
19453 80950 -306392 -252859 -91959 -102390 -269290 150974 -115488 86951 -164602 13009 -56303
19441C0559a38360C95855I1447c82745A03370a34650J7706f048j2802m25659a18075
19429b3501J0437j17537k20181A19730b48994l42058b45964c5332m70403a43926
19418C73166a12677g091j54005F8969b2076k05469E0204O4869m1504A9508a56504
19406a79087C58372f9729k77343Q1683d4641B85020a46035A63022f5303j08235
19396a73538k20370R1846B93672a70571O4658k9945C4899a61719c6245r8343C8560
19384A2915d5767D5484a36235A69396d095l0620a4770F1448a31561I3690b08314
19372a81706j3101c4059I9211C1277K2732a39427B890b03694d7645A10603b94730
19360a78454D6723K13539C8132Q3819m8347b49977C4422f509B49829D3204k0864
$$ plain form
19441 30559 -138360 395855 91447 -382745 103370 -134650 -116944 -6048 -18850 -444509 -118075
19429 -23501 -13064 -130601 -350782 119730 -248994 -591052 -245964 -35332 -505735 -143926
19418 373166 -112677 -7091 -161096 68969 -22076 -227545 50204 115073 73569 19508 -156504
19406 -179087 358372 -69729 -347072 -265389 -44641 285020 -146035 163022 -65303 -173538
19396 -173538 -393908 -302062 293672 -170571 -105913 -135858 34899 -161719 -36245 -134588 38560
19384 12915 -45767 45484 -136235 169396 -4095 -34715 -14770 61448 -131561 93690 -208314
19372 -181706 -194807 -34059 99211 31277 54009 -139427 2890 -203694 -47645 110603 -294730
19360 -178454 46723 260262 38132 121951 73604 -249977 34422 -6509 249829 43204 22340
19349B2340J47871a78044B06279D0935a3568j22443L9096I0364A9506b38898a08735
19337d15855I5665C5202J60901I4248a43650O9693A74633n4148P2815F3510h8782
19325c40834h1404j9663k31387J06991A27729l0531K5411J44262b89357G4049
19314A76772a11148j82700m8300B39822m5409B6766c59971A21670a34818K0692
19304a14126o3030f2956k47317Q2677j74252E8572b29963o9623A48014f1485B2757
19292A57209C1288e172D3792b5602c795m2432a7738B40960g6307A02081K6261
19281A28342P0834B3905b9560A10216b84230J05285D0960a58014j19974A66560
19270C9164g289k3868q2194m52898A42012b65458h0521A77717c65175J2757d5655
$$ plain form
19349 22340 170211 -178044 206279 40935 -13568 -136011 -96915 90364 19506 -238898 -108735
19337 -415855 95665 35202 196103 94248 -143650 -73957 174633 120485 193300 63510 -88782
19325 -340834 -81404 -101067 -332454 -225463 127729 97198 122609 266871 -289357 74049
19314 176772 -111148 -293848 -342148 239822 194413 26766 -359971 121670 -134818 -114126
19304 -114126 -177156 -62956 -310273 -227596 -401848 58572 -229963 -299586 148014 -61485 22757
19292 157209 31288 -5172 43792 -25602 -3795 -46227 -17738 240960 -76307 102081 128342
19281 128342 199176 23905 -29560 110216 -284230 -178945 40960 -158014 -277988 166560
19270 39164 -7289 -31157 -113351 -566249 142012 -265458 -80521 177717 -365175 -352418 -45655
19258D68925a28201k09846J49316i2547P88m18068a865j15374C50175b34272j14418
19247c48690i8247G2932h7310R543c7919E3541e6379j0916A65936b01387O9534
19236a31853e3325k12262C2842a2249j82842g8905A92791e2043E8422a22998d2436
19224c2441m2740j71965K532g8938I4331dA51520h0081B62252A11135B077i7001
19211b53382j30097A12592b1330j89547b8609E9006J18713g2282A65227b65248
19200a27782j5302K6895a4562n0335E579h3585A4372K45451a74109h0721D8909
19188C25954f3453B4142K2073a60692m8392q7967F1051b1196D1866M9837b34964
19176d9986k60150F0883K578a31180a4872k21457A62087k123a87792A65882a24675
$$ plain form
19258 468925 -128201 -338047 -188731 -92547 -91759 -509827 -1865 -117239 350175 -234272 -348690
19247 -348690 -98247 72932 -87310 -77767 -37919 53541 -56379 -67295 165936 -201387 -131853
19236 -131853 -53325 -265587 32842 -12249 -195091 -78905 192791 -52043 58422 -122998 -42436
19224 -32441 -75181 -247146 -244614 -78938 94331 -4 151520 -80081 262252 111135 2077 -97001
19211 -253382 -383479 112592 -21330 -210877 -28609 59006 177719 -72282 165227 -265248
19200 -127782 -143084 -116189 -14562 -64897 5579 -83585 14372 259823 -174109 -80721 48909
19188 325954 -63453 24142 46215 -160692 -209084 -297051 61051 -21196 41866 91703 -234964
19176 -49986 -310136 60883 63461 -131180 -14872 -236329 162087 159964 -187792 165882 -124675
19164b1116H8017R0119b38785D0246a91540C1533M11916A50172b56489I4539h7023
19152a39437E2196a12033A22229J72402f9982A21856F0572k3032c81286J75237
19142b06049d2193B55207A17288c14355A5127a42943d1237j13273A51535e6616
19131a70687k08371e730n8567j31734k57564a33425k73883a26699o5391R5549
19121i6541C37237H0346a91463R3303k82513A4990a57092C46870b13027B83826
19110a72968A8403K901b98632O556B93646I2214c84473A25611f5445q7138A86376
19098A56365a39228G50a74078H3134K97175E8674d09233F7956a24488j62314k0368
19087c07170B16959a17478D46501B7682b55349G0173a32770j92486h4977I2457
$$ plain form
19164 -21116 88017 178136 -238785 40246 -191540 31533 443449 150172 -256489 94539 -87023
19152 -139437 52196 -112033 122229 294631 -69982 121856 60572 37540 -381286 -206049
19142 -206049 -42193 255207 117288 -314355 15127 -142943 -41237 -154510 151535 -56616
19131 -170687 -379058 -5730 -64297 -196031 -453595 -133425 -407308 -126699 -192090 -96541
19121 -96541 337237 80346 -191463 -98160 -380673 14990 -157092 346870 -213027 283826
19110 -172968 18403 21304 -298632 -292076 293646 92214 -384473 125611 -65445 -152583 186376
19098 156365 -139228 750 -174078 83134 380309 58674 -409233 67956 -124488 -286802 -307170
19087 -307170 216959 -117478 446501 27682 -255349 70173 -132770 -325256 -84977 92457
19076b93727C5144c8362A38354B3218c7484B07515b4189p0990L9149k50253A65408
19064a28163C2531a07464B09631a19381A04354b03100A56975h4071M186G7117
19053b5846j04288o5587A2813K42736A24424L403a30100A93049D4237a81589E2858
19041b17417D7983c09520d7475n7250j33788A6837e5967H3173b62079e3615q9189
19030a42804A95688j8557A8084M4248M5326O4870c36485F0837J87429a07700a1860
19018a7834q3977c9670k03125e3693I4218b27672b9601k11003B29255c2891a5811
19006a13013j66781J21577g8352j27284a7659k28851j08757a38425p6429a4761
18995c10654a50655n542D8714c92461c7277D7231A355f5726C5395P7935Q5177
$$ plain form
19076 -293727 35144 -38362 138354 23218 -37484 207515 -24189 -95179 -56030 -306283 165408
19064 -128163 32531 -107464 209631 -119381 104354 -203100 156975 -84071 -79885 77117
19053 -25846 -130134 -195721 12813 255549 124424 127827 -130100 193049 44237 -181589 52858
19041 -217417 47983 -309520 -47475 -104725 -238513 16837 -55967 83173 -262079 -53615 -142804
19030 -142804 195688 177131 18084 62332 107658 172528 -336485 60837 248266 -107700 -11860
19018 -17834 -101811 -39670 -242795 -53693 94218 -227672 -29601 -240604 229255 -32891 -15811
19006 -113013 -279794 -158217 -78352 -205636 -17659 -246510 -355267 -138425 -214854 -14761
18995 -310654 -150655 -156197 48714 -392461 -37277 47231 1355 -65726 35395 113330 198507
18984A98507i1717D84988I9048e5556A35797h1434c9333j11379l8445C2356c8185
18972a30453a4623G5313J64982b59169D7222g973C2423L8393c42284J49443P8296
18961a14545F2921c11726G6974B8494M6128C3787J7310b201A83717e4606k1493
18950g6099B39720A00018a90458C747J65601a13323E9846K6096a44791L9413C48014
18938f7879j30580j26006i4321o0750g6955k80974A04206a68320B55244C6237
18927A85014i1597r3361m6540A13394c2516k26370A16618L309l2951a75849j67711
18916c43560g7498B72233b17823k07407B34995a22272l0089D4150a7987D77706
18905a78987D9015b86369F9431b5104j6152A37471K5074a93489q2177e4324C58491
$$ plain form
18984 198507 -91717 484988 99048 -55556 135797 -81434 -39333 -150712 -189157 32356 -38185
18972 -130453 -14623 75313 240295 -259169 47222 -7973 32423 70816 -342284 -192841 -114545
18961 -114545 62921 -311726 76974 28494 74622 33787 51097 -2201 183717 -54606 -76099
18950 -76099 239720 100018 -190458 3747 169348 -113323 59846 85942 -144791 -105378 348014
18938 -67879 -198459 -324465 -94321 -155071 -76955 -357929 104206 -168320 255244 36237
18927 185014 -91597 -184958 -231498 113394 -32516 -258886 116618 119927 86976 -175849 -343560
18916 -343560 -77498 272233 -217823 -425230 234995 -122272 -152361 44150 -17987 477706
18905 -178987 49015 -286369 69431 -25104 -41256 137471 162545 -193489 -275666 -54324 358491
18893F0823c35569m7138A05554a11410a7100j66381F7663a43872A48386c79027
18882a44218n1308d2583B40887c81807Q9444J08937A19275a96411g0426K4998
18872d5428n2822j043l23185A68543b837k6998A0389a88435f7670a2123B48112
18860I9993l7408a35854J6967F7862b86248h1055k32346g3671A17151O9284h2414
18848C9016f5457m8896J6098j33760m335H1372a30417A33631e1270o7049e4643
18836A69654a98817d9856j68074n4136E3719J1754a83472A55006b26433M8451
18826a77982b2631A57939a87012J819B02751L8214D4662a44117A35199F5195c9946
18814A48668b38710k2958J30541A78807M5547J57645A20293O7569n8648Q2367
$$ plain form
18893 60823 -335569 -382707 105554 -111410 -17100 -183481 67663 -143872 148386 -379027
18882 -144218 -195526 -42583 240887 -381807 -292363 -183426 119275 -196411 -70426 -45428
18872 -45428 -98250 -99293 -422478 168543 -2837 -29835 10389 -188435 -67670 -12123 248112
18860 99993 62585 -135854 -118887 67862 -286248 -81055 -313401 -73671 117151 186435 -82414
18848 39016 -65457 -114353 -98255 -232015 -236350 81372 -130417 133631 -51270 -118319 -54643
18836 169654 -198817 -49856 -217930 -272066 53719 65473 -183472 155006 -226433 -177982
18826 -177982 -22631 157939 -187012 -185193 202751 240965 44662 -144117 135199 65195 -39946
18814 148668 -238710 -261668 -131127 178807 224354 381999 120293 187862 129214 211581
18804B11581G7024b11173D8484a61146l758f9403j35050C10786e6889i936j08263
18793a18199q0394e8425A23745D231f7135L1170B05549a99456N9169k38581J27175
18782b51693B58827a21855O0037k91242C17149h2460E1659b7504j68267l5999
18772b31770c8277A78Q13a05698c3206j77577a02298A843e9785j41508E8336c98427
18759A46751b65677p7818N7569E9437b14000a506B2564e6424A97920b37217N5442
18748a81775F7114c17377h4863m15618K30613B80045d0418A768K1992J71793H6234
18736a97492N7896G1381B9375J28069i7766j52437i6819A08283K54731b74383
18725a27314J8220b3557r380D5055a20679G565a25896l53705a49944L166I4625
$$ plain form
18804 211581 77024 -211173 48484 -161146 -164904 -69403 -204453 310786 -56889 -9936 -118199
18793 -118199 -198593 -58425 123745 4231 -67135 -35965 205549 -199456 -140287 -378868 -251693
18782 -251693 258827 -121855 -61818 -353060 317149 -82460 51659 -27504 -195771 -231770
18772 -231770 -38277 178 991 -105698 -33206 -210783 -102298 1843 -59785 -201293 58336 -398427
18759 146751 -265677 -343495 -285926 59437 -214000 -1506 22564 -56424 197920 -237217 -181775
18748 -181775 67114 -317377 -84863 -500481 -269868 280045 -40418 1768 23760 195553 86234
18736 -197492 -139596 71381 29375 157444 -97766 -250203 -96819 108283 363014 -274383
18725 -127314 -109094 -23557 -32937 45055 -120679 7565 -125896 -479601 -149944 -146778 94625
18713d3817G769K14138d83572h3820j72338C57407e8628o4837A65933g4674m7268
18702a21942A59435b24076F1474B739a96826A44463C3276j4359b706j39389p9228
18691b21323n4432c9169j4563k79457a1577j32525e2646k8154A3161R1957b79175
18679h014k7125n2634g091A00389K37818I5982A585c03971N1953g7108j59469
18668b36577A31754a9540C5033a61840e2423C5829H662a51965o6567r0118A26523
18656B2298a25980r2746B19244a66620A71439C330J2202b48729l729F802K96b81945
18643D9842c44564A29821a36704B34599B4547K31505a58913K7389j96834g9028
18632C13518F0260h3724j00326A32996a66785C3594c6451j56464h2835F9058N2070
$$ plain form
18713 -43817 7769 221907 -483572 -83820 -256158 357407 -58628 -123465 165933 -74674 -121942
18702 -121942 159435 -224076 61474 2739 -196826 144463 33276 18917 -2706 -142095 -221323
18691 -221323 -275755 -39169 -53732 -333189 -11577 -144102 -52646 -80800 13161 105118 -279175
18679 -8014 -35139 -87773 -7091 100389 338207 95982 1585 -303971 -252018 -77108 -236577
18668 -236577 131754 -19540 35033 -161840 -52423 35829 8662 -151965 -218532 -308650 126523
18656 22298 -125980 -218726 219244 -166620 171439 3330 15532 -248729 -252458 6802 7098 -281945
18643 49842 -344564 129821 -136704 234599 24547 256052 -158913 -131524 -328358 -79028
18632 313518 60260 -83724 -184050 132996 -166785 33594 -36451 -192915 -82835 69058 121128
18621A21128K655a53700p0497e1790o608A23212b30728o6917d3373A66784a90418
18609B40946c0499A46534b63685E7203b02327l03449B33151c64888F8556P7280
18599A45836a90914G5997a51839k97325a641o1118b801A51388a98165a4125m7540
18588f1665n9678D2080a83794B78079a831D3024a5765q8990B81329a70112G2016
18576b11081K8299L8223K885f9515k57304h4811j5790j33640A46629k3987J66093
18565B88735b12364B0809f219r6752A3504N6465h0434l297B56926f6834A06874
18553i6025k25509j12217a16019l42825a05039l0806D5949a73390G6134K03389
18543B79523E2215a56181E9345J25180a61606q9433B42346a62500d6989f764A92466
$$ plain form
18621 121128 123783 -153700 -224197 -51790 -58398 123212 -230728 -297645 -43373 166784 -190418
18609 240946 -30499 146534 -263685 57203 -202327 -505776 233151 -364888 68556 145836
18599 145836 -190914 75997 -151839 -449164 -1641 -62759 -2801 151388 -198165 -14125 -61665
18588 -61665 -121343 42080 -183794 278079 -1831 43024 -15765 -104755 281329 -170112 72016
18576 -211081 -182782 -144559 -141674 -69515 -326819 -84811 -100601 -234241 146629 122642 288735
18565 288735 -212364 20809 -6219 -102971 13504 69969 -80434 -83731 256926 -66834 106874
18553 -96025 -321534 -433751 -116019 -458844 -105039 -135845 45949 -173390 76134 279523
18543 279523 52215 -156181 59345 184525 -161606 -251039 242346 -162500 -46989 -6764 192466
18531B51410e419j24580A0710a0953C1256a93546e4145G8036b23169K790a9273
18519a05274C06672c73456A23446J69932F9339a76910H6774L894a4921A96067
18508a0952l08489E3633a82906D3868R4766d7186b3419k9886J7258n1327l06026
18497c93400O8311g1195I6336a74148I0771L1755j1086O138c97834J26218I2923
18485a71123q3617N3269a1255l2196H7712a57160E3909b39113D5451A0098J52211
18474A62309d8678B17286d25146B26644c35091A45599B4624J98460c3954I5919
18463b16619a4131j42992g4241b4441k70715F0520a46497j297A32186n6930a60511
18451a52899A47612a62771C5924K23218j06073f0113B21095a08308l19535G4597
$$ plain form
18531 251410 -5419 -129999 10710 -10953 31256 -193546 -54145 78036 -223169 -220379 -19273
18519 -105274 306672 -373456 123446 293378 69339 -176910 86774 90668 -14921 196067
18508 -10952 -319441 53633 -182906 43868 138634 -47186 -23419 -53305 -36047 -87374 -393400
18497 -393400 -325089 -71195 96336 -174148 90771 122526 111440 117578 -397834 -271616 92923
18485 -171123 -254740 -201471 -11255 -43451 87712 -157160 53909 -239113 45451 10098 162309
18474 162309 -48678 217286 -425146 226644 -335091 145599 24624 223084 -33954 95919
18463 -216619 -14131 -157123 -74241 -24441 -295156 60520 -146497 -147794 132186 75256 -160511
18451 -152899 147612 -162771 35924 259142 153069 -60113 221095 -108308 -427843 74597
18440c79442a9234A36322h1215C3757h2994j18201B2847g9529n7263H4723J27586
18429B12309b00997B06764c31181H563g7884o6746d3159q7796F683d12519J81876
18418b30643j73532D11438A95080J24422d69553J85817c9976A13027B1123L6729
18408E7852b6427C03978f2443H3550a61052E2787a48172E2191b19624B0571C198
18396a3944D6811L0957c77477a06291C16782C1981c13211H0626j1473c93058I2995
18384d6494A82139K07157a2682A33635k2054L4468c17301p193c9457j83376A21797
18372f2265j59656q879C7845L9556e7709m65425J0601B39209e598I6512J03438
18361A99950E031K6019c06880J45742A37710f4421c231j82462I7250a12402B42776
$$ plain form
18440 -379442 -19234 136322 -81215 33757 -82994 -201195 22847 -79529 -136792 84723 212309
18429 212309 -200997 206764 -331181 8563 -77884 -144630 -43159 -130955 6683 -412519 -230643
18418 -230643 -404175 411438 195080 319502 -469553 -283736 -39976 113027 21123 57852
18408 57852 -26427 303978 -62443 83550 -161052 52787 -148172 52191 -219624 20571 3198
18396 -13944 46811 77768 -377477 -106291 316782 31981 -313211 80626 69153 -393058 92995
18384 -46494 182139 389296 -12682 133635 111581 146049 -317301 -324494 -39457 -222833 121797
18372 -62265 -221921 -230800 37845 77401 -57709 -523134 -512533 239209 -5598 96512 199950
18361 199950 5031 31050 -306880 -161138 137710 -64421 -3231 -185693 97250 -112402 242776
18349C3349J43651K32846b72341a29904A40246F5381d13178a44090j39909J10117
18339a73882A7733R5280a7508Q269m29625H4835J75063b26156a3857H5363a9264
18327B05564b6370r409k0884F8189M5518a39057A76677a08153A84030K1073r5456
18316A09647L0799c93722a29045d0952q4647A705K01151a15426E9576a57213o5449
18305b22662b6030n5098k4455F3242a42869A10536L9795b37814o9283E03921b72325
18293a59755q3465P9895p9205j8659E6914K43365c0369D7437a21851J9505A9283
18281B03797c11798A29968A2549g7082A65829c16758A62497L3294a41040l9454
18271a80494c2050G3711c9778o5813j30292J15775A9342J03172c6406a4805e376
$$ plain form
18349 33349 177000 409846 -272341 -129904 140246 65381 -413178 -144090 -283999 -173882
18339 -173882 17733 113013 -17508 -9239 -438864 84835 259898 -226156 -13857 85363 -19264
18327 205564 -26370 -35779 -56663 68189 113707 -139057 176677 -108153 184030 205103 109647
18316 109647 140446 -393722 -129045 -40952 -125599 1705 202856 -115426 59576 -157213 -222662
18305 -222662 -26030 -81128 -105583 63242 -142869 110536 150331 -237814 -307097 503921 -272325
18293 -159755 -243220 -163325 -242530 -261189 56914 300279 -30369 47437 -121851 -102346 19283
18281 203797 -311798 129968 12549 -77082 165829 -316758 162497 195791 -141040 -180494
18271 -180494 -32050 73711 -39778 -105591 -235883 -120108 19342 122514 -36406 -14805 -5376
18259F6415b98411B69718b97680b517p1926m0558D19015a26638G8753C7589a84014
18247C13149c47180N5291Q5952N4412p2770O9724C7727a34897O6292k48451C2513
18235A47071a72429K7882m8340A644J6848J57849H1350b3680A54813O7127e4844
18223e7082B44584b13351i9573k21070J04352d5395m9946B21084I350J06636a36777
18211a79398g5326a3314A92379Q9787k5908A25475a18067A71992n071i4925q3025
18200a77950P2950l04417B56196a50767A29268n6276J86614e0535p3420c2437
18189a6961A6983a75378D8566P0544a12349C43743D2440c08776C45382b05093
18178a33038H1172a60866A67483a43818C14376f3360I9432K35967c30230B44829
$$ plain form
18259 66415 -298411 269718 -297680 -2517 -74443 -115001 419015 -126638 78753 37589 -184014
18247 313149 -347180 -291889 -205937 -151525 -224295 -154571 37727 -134897 -68605 -317056 32513
18235 147071 -172429 -144547 -192887 1644 18492 176341 81350 -23680 154813 221940 -54844
18223 -57082 244584 -213351 -99573 -320643 -216291 -45395 -95341 221084 9350 115986 -136777
18211 -179398 -75326 -13314 192379 282166 256258 125475 -118067 171992 166921 -94925 -177950
18200 -177950 -105000 -409417 256196 -150767 129268 72992 259606 -50535 -123955 -32437
18189 -16961 16983 -175378 48566 119110 -112349 343743 42440 -308776 345382 -205093
18178 -133038 81172 -160866 167483 -143818 314376 -63360 99432 335399 -330230 244829
18167b61433B52245b08807b7170j76515R1193m2789D2735a67645B93024M7502
18157C40526b24455L8587c6841j60463M3794B25817c9058a8230k06092c0724o8532
18146i9256r9182j0070f3203b448A81592A6695J36675E7117J19452F8768L8591
18135A07359i9548H9572f3396B4959i0398J9590o5337e2492b3269l852k55158
18124b82279j64596a39024A79312i1867a9933k87592J21635B86811b01460C7926
18113A19945b67424j02113J32399k8622L6214O0098j93349C20422o573A56245
18102C07839b172l1802k14609K9423a07794H7443c06132D8176J15796p8767d10302
18090B79607F4170g9943j33552N5827b2418E9689b20021A35937a60357j78603
$$ plain form
18167 -261433 252245 -208807 -27170 -203685 -112492 -155281 42735 -167645 293024 340526
18157 340526 -224455 -185868 -36841 -197304 -153510 225817 -39058 -18230 -224322 -30724 -99256
18146 -99256 -198438 -208508 -63203 -2448 181592 16695 153370 57117 176569 68768 107359
18135 107359 -99548 89572 -63396 24959 -90398 -70808 -136145 -52492 -23269 -27121 -282279
18124 -282279 -446875 -139024 179312 -91867 -19933 -307525 -185890 286811 -201460 37926
18113 119945 -267424 -369537 -237138 -265760 -229546 -169448 -362797 320422 313849 156245
18102 307839 -2172 -33974 -248583 -219160 -107794 87443 -306132 48176 163972 85205 -410302
18090 279607 64170 -79943 -213495 -157668 -22418 59689 -220021 135937 -160357 -338960
18080c38960a0281A04427g4184q8609g8822k21051I3737Q0820G9252K3198a99946
18068a45084j3918C18768j46986b56281J04539B70204A23636n1798a64543B9537
18057B93698b67186a20305A89494h6646m9773p4815B26937A0858L44135b05790
18046a67281g852k3377p7514i347D9739A668a39498O5566B26982c80280a00948
18034a81860f7299H7457g979n3185j72154H5809H003b07708F9798f6300A94597
18022b29469M8828A15767g9354J8039E0151a43492k6596A02612J15931A08645
18011f0853D8660K47290j31758b1781k3205l0660A07156H186f64576a25737b7252
17999A11719J9614E3633J21246C1881J02067D6042c27161a14320B68357A25277
$$ plain form
18080 -338960 -10281 104427 -74184 -162793 -78822 -299873 93737 174557 79252 102450 -199946
18068 -145084 -159002 318768 171782 -256281 -151742 270204 123636 71838 -164543 29537
18057 293698 -267186 -120305 189494 -86646 -136419 -211234 226937 10858 354993 -205790
18046 -167281 -7852 -31229 -108743 -9347 49739 1668 -139498 -73932 226982 -380280 -100948
18034 -181860 -67299 87457 -7979 -61164 -233318 85809 8003 -207708 69798 -66300 194597
18022 -229469 -180641 115767 -79354 -61315 50151 -143492 -170088 102612 218543 108645
18011 -60853 48660 295950 164192 -21781 -44986 -75646 107156 8186 -664576 -125737 -27252
17999 111719 131333 53633 174879 31881 133948 46042 -327161 -114320 268357 125277
17988A7573k170b88101a12767l45694A52611a6670p392n6240j63934h1025A71228
17976C13296j05500E8731b68383b1576j36309E3665A4392b11770A05236B6883
17965B03030m7450m3731i8263r7127B1749O2736b51861A37593D9611M05771c20593
17953c10818I3846c54400A96432r527c7421D458J0754J39497a71425a4F5089J57760
17941B22849q8456k8263i6454G5526J88005f0839G4428a35779C63915A3080d0208
17929d06671a38281j17922A07568J89999a60311l9897H042b0289C5072e3745H5102
17917a03812n1646j15831B46481d05261A39984b64865A33761K3703C5479N9828
17907I5307F117b6072j48630G8994c8472o4893j47525D0536a67339E882b17933
$$ plain form
17988 17573 15403 -288101 -112767 -458461 152611 -16670 -24062 -80302 -244236 -81025 171228
17976 313296 207796 58731 -268383 -21576 -157885 53665 14392 -211770 105236 26883
17965 203030 155580 111849 -98263 -195390 21749 84485 -251861 137593 49611 455382 -320593
17953 -310818 93846 -354400 196432 186905 -37421 4458 15212 154709 -171425 -14 65089 222849
17941 222849 134393 106130 -96454 75526 263531 -60839 74428 -135779 363915 13080 -40208
17929 -406671 -138281 -256203 107568 297567 -160311 -200208 8042 -20289 35072 -53745 85102
17917 -103812 -155458 -271289 246481 -405261 139984 -264865 133761 157464 35479 95307
17907 95307 6117 -26072 -174702 78994 -38472 -103365 -250890 40536 -167339 5882 -217933
17895c9097k2886j86069D7561J07802d17309a21936c3201C75151a51840A28364
17884a99781C7428b9263m2056j60005E3053K4405J30907D0866c9751A03074h4981
17872C6923J73774A01512D7864f3993n4116c9042F0684f5178A67428a68531B12700
17860a14391J3602A29132b7057C54443b06511G9503M3499K5280D8840a67862N9651
17849a08211A15009f3287m5113B2702J95635H6016H644i4964H8905J98330a74818
17837d6004j37582k7622C4136b6096H4427a56769b7049k8105j43020A6092K01860
17826B17952a34558G406J04931R8101c0884G0343i7150L0753k37179d4096j77832
17815b21928g2409J5030j31382A65768K08733a32395N7635J2183A29987K2379
$$ plain form
17895 -39097 -61983 -248052 47561 155363 -417309 -121936 -33201 375151 -151840 128364
17884 -199781 37428 -29263 -71319 -231324 53053 77458 208365 40866 -39751 103074 -84981
17872 36923 210697 101512 47864 -63993 -118109 -39042 60684 -65178 167428 -168531 212700
17860 -114391 -100789 129132 -27057 354443 -206511 79503 123002 148282 48840 -167862 -108211
17849 -108211 115009 -63287 -108400 22702 218337 86016 8644 -94964 88905 287235 -174818
17837 -46004 -183586 -211208 34136 -26096 84427 -156769 -27049 -55154 -198174 16092 217952
17826 217952 -134558 7406 112337 210438 -30884 70343 -97150 -66397 -303576 -44096 -221928
17815 -221928 -72409 -57379 -188761 165768 374501 -132395 -74760 -62577 129987 152366
17805A52366g7968m8482k11670c802r6424j06665c7407I1917R767K28821a6601
17793A21242J18552b13325I6068J36004f0559k78029J65155L8894A06604m4820
17783F1784f9420j22679K5557B10774a74816D5999J6373A0882M12601b04432H1401
17771b54470A3022J26831L3469f1823E8801j7032K60955b4969Q591A128a29079
17759h704b91H5964L385a09888C6699a25765A74725b63610e3174l15293A52971
17747e3398j08561A61618a47159A16943q22R4739a22646D4103b53166B46522n8470
17736A88052c66873B77456B6679b83234b3689A02725a61166r0759H9050K22814
17726C11864A50552J7985g9244m2072E4625P2222J73940b56732b2947A30444K3386
$$ plain form
17805 152366 -77968 -126450 -338120 -3802 -100226 -206891 -37407 91917 101684 330505 -16601
17793 121242 239794 -213325 96068 232072 -60559 -338588 -173433 -134539 106604 61784
17783 61784 -69420 -192099 -166542 210774 -174816 45999 62372 10882 423483 -204432 81401
17771 -254470 13022 139853 173322 -61823 58801 41769 302724 -24969 -16378 1128 -129079
17759 -8704 -291 85964 89349 -109888 36699 -125765 174725 -263610 -53174 -368467 152971
17747 -53398 -161959 161618 -147159 116943 116121 210860 -122646 44103 -253166 246522 188052
17736 188052 -366873 277456 26679 -283234 -23689 102725 -161166 -251925 89050 311864
17726 311864 150552 168537 -79244 -121316 54625 126847 300787 -256732 -22947 130444 153830
17715A53830p3816J15102R6015A13975a57773L3073A19289J54776l3170o5121
17705A75774M25601B6639L01331a50204m445H0998J10826J61887f7489j18695
17695a86184B29583C8392f7987A96176a6661l6785b566j43451B40431o8096c31242
17683e0976A19707a43058o6234B94733B3538M7285A3016c07874B5420m668J63086
17672A83838G763J47108a46853O8637B52619D904L1406O6260J19172b51516C09650
17660D9714a63492E2682a37096q4911D1299J27406E9490J22621A3538a57018I8194
17648C24352a22434H7645i8694A92012b1790A3029a7184r1587I8693f2559j27980
17637a90539B7490M41463G5140R9336E8445M3781P4871b94947a31012A35030c12703
$$ plain form
17715 153830 80014 195116 291131 113975 -157773 -124700 119289 274065 240895 175774
17705 175774 601375 26639 327970 -150204 -154649 80998 191824 353711 -67489 -186184
17695 -186184 229583 38392 -67987 196176 -16661 -53446 -2566 -146017 240431 172335 -331242
17683 -50976 119707 -143058 -209292 294733 23538 70823 13016 -307874 25420 20752 183838
17672 183838 7763 154871 -146853 -78216 252619 4904 36310 102570 221742 -251516 309650
17660 49714 -163492 52682 -137096 -222007 41299 168705 59490 182111 13538 -157018 98194
17648 324352 -122434 87645 -98694 192012 -21790 13029 -17184 -108771 98693 -62559 -190539
17637 -190539 27490 468953 75140 174476 58445 102226 177097 -294947 -131012 135030 -312703
17625F2267a36095A2048M724J33062Q4364d7935G4684h960A52138b85091J35001
17614a50090g3272n3551o675A63136a19192b2072j23018A29084M6657J5511a72843
17602A20108K04463n6481F7631O622J13278b06775L1154l0876A77049b5180m2009
17591f7189O685k1060A83340a48861B327K28677e3189j16046j93270a65949F2186
17579a91861B17345C9800M0328J64655i6165m0114A2602L11682D5542J95356D726
17567A42483L5916F9072J70977F4830L9928N9419A9463a28408j10472I8816D5144
17555C11336d6571C9526d3873j38627q511a4997B50465a39072B43446b317C34400
17543G1212b10400A21584a59450B01760p4280N7184J42224b96155h3756m8733
$$ plain form
17625 62267 -136095 12048 16772 149834 234198 -47935 74684 -8960 152138 -285091 -150090
17614 -150090 -73272 -126823 -133498 163136 -119192 -22072 -145090 129084 175741 191252 -172843
17602 120108 324571 268090 67631 74253 187531 -206775 -175621 -206497 177049 -25180 -67189
17591 -67189 -60504 -81564 183340 -148861 2327 231004 -53189 -169235 -362505 -165949 62186
17579 -191861 217345 39800 80128 244783 -96165 -136279 12602 324284 45542 240898 4726
17567 142483 178399 69072 240049 64830 104758 164177 19463 -128408 -238880 98816 45144
17555 311336 -46571 39526 -43873 -182500 -191011 -14997 250465 -139072 243446 -2317 334400
17543 71212 -210400 121584 -159450 201760 127480 184664 326888 -296155 -83756 -132489
17533a32489D5881N0538b6860B07596J997E3907J92894c72263L6479I0702f5135
17521B4641J35336g7775D9792b5440C65106a08545A93156J11705A20591R0528
17511B11119E8331J9385q83C0626K34322j0907A11378h3569B21467J58443A86773
17499A01388L46738A78310F167K85486r6059F0221K57844b63306D0393J97997
17489B38390a81968C16869j15368l8419M8255B1716J74439J15644A23613N7700
17479A81313K61757a07168j43266i576A48426N2673i3177B80200A27630f3861
17468D19658k4270I4958j7550M9974L30520h6688B53926r4456b6337r6813B70586
17456A63390n1703L94118F5672M8401k9019Q4915O6353D7785K78191A46363K61683
$$ plain form
17533 -132489 45881 96419 -26860 207596 209593 53907 246801 -372263 -335784 90702 -65135
17521 24641 159977 -77775 49792 -25440 365106 -108545 193156 304861 120591 211119
17511 211119 58331 77716 76833 30626 264948 254041 111378 -83569 221467 379910 186773
17499 101388 448126 178310 6167 291653 195594 60221 318065 -263306 40393 238390
17489 238390 -181968 316869 201501 163082 211337 21716 196155 311799 123613 181313
17479 181313 443070 -107168 -250434 -9576 148426 201099 -93177 280200 127630 -63861
17468 419658 395388 94958 77408 127382 457902 -86688 253926 159470 -26337 -123150 270586
17456 163390 111687 505805 65672 114073 85054 169969 236322 47785 325976 146363 408046
17445D08046l0596q6252j41504a54881A21093j5533n1282M23557K61011B01903
17434A39262K38259A69560K52966A72381L9476J964m0225O3157A17820M1751J48262
17423C07833j12492o5171N0131n1553j7229N7286J8110d2687C18180j56873R4717
17412B56024J78322A69130J21721l4988o2429D6702O8537K11444i5383B73472
17401a20950G616J91837r0643l4254K45337n2878b2052B67955C50K43825j10074
17390A34101l6606b03665F8900Q2415c9941j8501B07740q0627K6343J06164A04043
17378A60538l0061n6925A9217L05265o4585A26905j2664M3349a40142I6963J54682
17367B51645R3693q1711d9145C85231i2910A3407Q1346M9222L9159d4780E38457
$$ plain form
17445 408046 377450 291198 149694 -154881 121093 105560 54278 477835 738846 201903
17434 139262 377521 169560 422526 172381 211857 213821 173596 236753 117820 159571 307833
17423 307833 195341 130170 180301 128748 111519 168805 186915 -42687 318180 161307 256024
17412 256024 434346 169130 290851 255863 193434 46702 115239 326683 -95383 273472
17401 -120950 7616 199453 108810 74556 319893 267015 -22052 267955 350 244175 134101
17390 134101 97495 -203665 68900 151315 -39941 -58442 207740 127113 153456 259620 104043
17378 160538 130477 73552 19217 324482 259897 126905 114241 157590 -140142 96963 251645
17367 251645 345338 263627 -49145 385231 -92910 13407 94753 143975 183134 -44780 538457
17355A38048q903f0707C50877j61449m3887P0014m2841J28663H4514l287J53839
17344B35066A8960J27616G123L5681J11864G2145L0548J53204J54830F8840J72232
17333B41072M9674Q9699f0856l9106A84283e0838B16821o6221R8507p0024J03458
17322B82541E5999K29729e6801B14178f6936I7679O8059o8364J59721j21119l0869
17311A05107K35931j48475a35654A27122J37920J64006m369D7987M34799e1111
17300A47275l1850J21887a59308P2660E6497J29300a60194B44388J46873A71235
17289D3578J39850F3964L59621b60936A66845K21158i4827D53415o4002C8329
17278C38877E9724L39539j00104A28848L83203G1451M22309k42282D8885K00901
$$ plain form
17355 138048 129145 -60707 350877 189428 145541 215555 172714 301377 84514 81227 235066
17344 235066 18960 146576 7123 42804 154668 72145 102693 255897 410727 68840 241072
17333 241072 290746 380445 -60856 -99962 184283 -50838 216821 150600 249107 179083 282541
17322 282541 55999 285728 -56801 214178 -66936 97679 165738 97374 257095 135976 105107
17311 105107 341038 192563 -135654 127122 265042 429048 424679 47987 482786 -51111
17300 147275 115425 237312 -159308 -86648 56497 185797 -160194 244388 391261 171235
17289 43578 183428 63964 423585 -260936 166845 388003 -94827 453415 389413 38329
17278 338877 59724 399263 299159 128848 512051 71451 493760 251478 48885 249786
17268B49786j18766J4046f7874B63760A16089N1189b2807A59449J93918j40738
17258B12629d2878D70095j59352K05866k09682j48646J48374C0094M09264j86228
17248B53130j01540L6130a2945D69158j29383r5154L3231m2044F4261O5762J10094
17237B40117b0359B93863J6274k531m8821j8136p6603M4595L4226b4027D07283
17225D86492A17603Q0796R5097e376r7889A48964F9906a1583C67259r5466K28647
17214E00440l5077a02762B81279J03142K26170A02477J59481l1771J12015A06345
17203H7269L65184B09685n8032K4964G6995L29879Q6466a8796A84349q7875J9288
17192A15762J59101M2585j40866K5793K85566P522A86876L23091A41258L72021
$$ plain form
17268 249786 131020 145066 -67874 263760 116089 167278 -22807 159449 353367 212629
17258 212629 -42878 470095 310743 516609 306927 158281 306655 30094 439358 253130
17248 253130 151590 187720 -12945 469158 339775 244621 277852 235808 64261 130023 240117
17237 240117 -20359 293863 310137 307606 258785 240649 164046 208641 242867 -24027 407283
17225 486492 117603 198399 293496 -5376 -103265 148964 69906 -11583 367259 271793 500440
17214 500440 465363 -102762 281279 384421 610591 102477 261958 230187 342202 106345
17203 87269 452453 209685 151653 176617 76995 406874 493340 -18796 184349 96474 115762
17192 115762 274863 317448 176582 202375 487941 495463 186876 509967 141258 513279
17182E13279B06154J2554J60668A23200K65558j7602j24522J3018G2801M25572
17172D98373k47091N75L0406J14911p445m2163j47785K62871p8583j46892P0944
17161C08121l7421J47130j43583H1600K05253A12116C6691M80733B20789J36449
17151C57238j76839L8675N5200a3396B04282K01213F815L33546E1714J51973N8527
17140B62214Q6986J68169k48881M08435C02369K15096A48306R7620l5301N2767
17130B63392J96789P333j97107J35100j13722J6296R8882j60341J60312j20784
17120B86150Q1618E5984M69519B02610J17202L13405k93478J45227o6669L0608
17110D48905k03770Q6862J33411N1647M5591k38306K22217j6030J69762k23540
$$ plain form
17182 513279 206154 218708 379376 123200 388758 371156 246634 259652 72801 498373
17172 498373 251282 251857 282263 397174 389729 347566 199781 462652 384069 237177 308121
17161 308121 270700 417830 274247 81600 286853 112116 36691 517424 220789 357238
17151 357238 180399 219074 274274 -13396 204282 405495 6815 340361 51714 203687 262214
17140 262214 349200 517369 268488 676923 302369 517465 148306 245926 210625 263392
17130 263392 460181 467514 270407 405507 291785 308081 406963 246622 406934 286150
17120 286150 367768 55984 525503 202610 319812 633217 339739 484966 418297 448905
17110 448905 245135 331997 465408 517055 562646 324340 546557 530527 700289 476749
17100D76749O1204K8950J28661k25318M10936m07919m569A97734L09813B33076
17089E25295A46517M30560K9006k67649J29709k6611q4909L83537k93121l6019
17079D11020J68188k27750C7265J99034N79091o4344l20163L5814j1360B06021
17068B41368K10599l8622J34395J58228m9420j19290J04598j3190j10246L65380
17058H83800j69835j37217k2030j18412P0985o9497j60637L99345j9209B11610
17047G54060j68284j26899J08504r0251J65513k18160r9142j38926Q1165K64151
17037E31731Q1947k71402L58833P8544J54133m38056L97738k82466l01230L87484
17027F97256B93870N5645J61675j5387L01878l89576J70478L90550l17652J7820
$$ plain form
17100 476749 537953 566903 695564 470246 881182 473263 468694 197734 507547 233076
17089 525295 146517 577077 606083 338434 468143 441532 356623 740160 447039 411020
17079 411020 579208 351458 37265 236299 815390 751046 430883 466697 455337 206021
17068 241368 451967 413345 547740 705968 656548 537258 641856 628666 518420 883800
17058 883800 713965 576748 554718 436306 507291 437794 277157 676502 657293 211610
17047 754060 585776 458877 567381 477130 642643 424483 325341 186415 267580 531731
17037 531731 613678 342276 701109 779653 933786 495730 893468 611002 309772 697256
17027 697256 293870 349515 511190 495803 797681 408105 578583 969133 651481 669301
17017F69301J51336L9753k9034J30053l75300L45871k13269C15102O25061K5747
17007I65910k19297j38656P5497O8898k80414L90272l88712L14033J20827q1907
16997H26451m7784k43116J25262K44479j76223j25317L00440M2006k55199J49859
16987H40858m1081n2682K56544l46778L15514p6341J33544L19131F27990J32845
16977G60835L00378m23323J73016o8374k08999Q02310l35086R6909k59889N0074
16967H87851N9157K28404j69714J45203k01298j35044m2767j4276N36081j35666
16957A157931j64771M09761l36431q3084N9083J32257P9059Q4676l83004J21670
16947A077147K829Q1519m6248j07528L7467J21454N06707l44138j91374R3647
$$ plain form
17017 669301 820637 860390 831356 961409 586109 931980 718711 315102 940163 965910
17007 965910 746613 607957 683454 752352 471938 862210 473498 787531 908358 826451
16997 826451 778667 535551 660813 905292 729069 603752 904192 946198 690999 840858
16987 840858 799777 747095 1003639 656861 972375 896034 1029578 1348709 627990 760835
16977 760835 1061213 637890 810906 742532 533533 1335843 1000757 1097666 837777 887851
16967 887851 947008 1175412 1005698 1150901 949603 814559 771792 757516 1293597 1157931
16957 1157931 993160 1402921 1066490 983406 1042489 1174746 1253805 1338481 955477 1077147
16947 1077147 1079976 1161495 1115247 1007719 1045186 1166640 1673347 1329209 1137835 1231482
16937A231482m8608j51312L35637R6864r1995J13318k54909K38454l55805J45536
16927A258662M32649l08629K21304j07043j30913J66654l6487r0204j33708J28163
16917A400448P4737O4749J76004l28012J79671j08059J29217p144j56967J47135
16907A571779j65212L13389J14875r4817j88683M51317n03117L41228j17276K95341
16897B018824k33562o1861J63005p1071j61598L43079J60997N389k02534j5338
16887A945330J15775J09794K72335j88131n1443K08465r3379N1653j13056j02456
16877B154887P4458p4778J20505Q9207O2571j57014K01087P4795J25476m3004
16867B628190k9747K82128R006K85900j71398j78419J34049l5195K72588K4759
$$ plain form
16937 1231482 1182874 1031562 1367199 1464063 1372068 1485386 1230477 1468931 1113126 1258662
16927 1258662 1691311 1382682 1603986 1496943 1366030 1532684 1496197 1405993 1272285 1400448
16917 1400448 1475185 1539934 1715938 1387926 1567597 1459538 1588755 1581611 1424644 1571779
16907 1571779 1406567 1719956 1834831 1740014 1551331 2002648 1499531 1840759 1723483 2018824
16897 2018824 1785262 1723401 1886406 1815335 1653737 1996816 2157813 2163202 1960668 1945330
16887 1945330 2061105 2170899 2443234 2255103 2203660 2412125 2318746 2370399 2257343 2154887
16877 2154887 2229345 2154567 2275072 2364279 2426850 2269836 2470923 2545718 2671194 2628190
16867 2628190 2598443 2880571 2889577 3175477 3004079 2825660 2959709 2924514 3197102 3221861
16857C221861j11235j42051J42678Q8687j22475P4770K76135k13784J98741K63225
16847C676552j76908j41851M5361K45367K46924m66169L69548K40937k16645r9478
16837C723638L96185R0210L8068l3709J21906J20408k66784M76349r1625J54879
16827D729525J32056J15541j93872K68322K06966n7928J71621J71450J35091j51346
16817E527426J60996M63420l69003K92491K75072K1908K5846J83822K05308L38534
16807G125820m8493j25845M03552k29508N43996J66208R4639M20885p1626N03096
16797H782724O2088L46440k98793O64547j6064N40370L50387n28706P25290N17376
16787A1145659j65696O06130J75371L12669O60943j98124N30628L77041P93728
$$ plain form
16857 3221861 3110626 2968575 3111253 3199940 3077465 3152235 3428370 3214586 3413327 3676552
16847 3676552 3499644 3357793 3403154 3648521 3895445 3429276 3798824 4039761 3823116 3723638
16837 3723638 4119823 4210033 4248101 4214392 4336298 4456706 4189922 4666271 4574646 4729525
16827 4729525 4861581 4977122 4783250 5051572 5258538 5200610 5372231 5543681 5678772 5527426
16817 5527426 5688422 6151842 5782839 6075330 6350402 6372310 6398156 6581978 6787286 7125820
16807 7125820 7077327 6951482 7355034 7125526 7669522 7835730 7930369 8351254 8279628 8782724
16797 8782724 8844812 9191252 8892459 9557006 9540942 10081312 10431699 9902993 10628283 11145659
16787 11145659 10979963 11586093 11761464 12074133 12735076 12536952 13067580 13444621 14238349
16778A4238349n6351P51324P8244P44043N91700N56167M17919M91029Q70511O36063
16768A9318998O07459L94102J080041O17455Q84248R26286P75071Q79942J419851
16759B6903453P37769J244563J338200J507156J039204R62500J687430J614996
16751C7035271J741137K113876J950619K231650J879283K514749K168446K785610
16743E4420641K851801L033387L499827K985745M204713L738311M338782M789655
16735H3862862M756803N140033N286712N586241O071543O108764O749203O830326
16727A30392487O706949O530270P188973O168685P050214N417926N556937M591716
16719A79604157L484760K350675J811296L90550j035807j880815k924593m592541
$$ plain form
16778 14238349 14181998 14933322 15011566 15755609 16347309 16903476 17321395 17812424 18682935 19318998
16768 19318998 19926457 20320559 21400600 22018055 22902303 23828589 24603660 25483602 26903453
16759 26903453 27641222 28885785 30223985 31731141 32770345 33732845 35420275 37035271
16751 37035271 38776408 40890284 42840903 45072553 46951836 49466585 51635031 54420641
16743 54420641 57272442 60305829 63805656 66791401 70996114 74734425 79073207 83862862
16735 83862862 88619665 93759698 99046410 104632651 110704194 116812958 123562161 130392487
16727 130392487 137099436 143629706 150818679 156987364 164037578 169455504 175012441 179604157
16719 179604157 183088917 185439592 187250888 187641438 186605631 184724816 181800223 177207682
16711A77207682m681844n704339o523589o643508p021459o846487p695195o891885
16703A25199376o428792o688862o610203n825457n752693n428958n443237m227099
16695G8794075m489704m667675l702015l588140l513677k828974l323505k790258
16687D9890127k603366k409059k039789k485950j787611j735196j993440j125191
16679C3710525j827061j039522j286229j879886q77636j044206j353526n56601
16671B3845858j251618p31273r55400p71090p12680o31019n52336o94697o47797
16662A6897948q87062m46123k11424o08232n14215k56535o71220l5199r41016
16653A2326922k83583k52228m34248m06894j83313J8329n79084k86657k22139
$$ plain form
16711 177207682 172525838 166821499 160297910 153654402 146632943 139786456 132091261 125199376
16703 125199376 118770584 112081722 105471519 99646062 93893369 88464411 83021174 78794075
16695 78794075 74304371 69636696 65934681 62346541 58832864 56003890 52680385 49890127
16687 49890127 47286761 44877702 42837913 40351963 38564352 36829156 34835716 33710525
16679 33710525 31883464 30843942 29557713 27677827 26800191 25755985 24402459 23845858
16671 23845858 22594240 21862967 20907567 20136477 19423797 18792778 18240442 17545745 16897948
16662 16897948 16010886 15564763 15353339 14745107 14230892 13974357 13303137 13267938 12326922
16653 12326922 12043339 11791111 11356863 10949969 10766656 10784985 10205901 9919244 9697105
16644I697105k67071l42239l33529k28886j07836j04168l25773j00971n09141
16635G377491J18885k21027j52678j22391l85744n8423l39125K3013j89843k2517
16625F027641k35154L114n8244k38810j20757j76048j06282q3891J8057l9438
16615D990188k84047l14432L13187m36189r9534J43348j55397m6801L25827m39447
16605C996703o6631k60014O9420k79779J45279k18552J46449O0313R2932l85077
16595C301043M4353m4115j92903k34437k3062K75889l47651J40152j1298J11817
16585C019788j57668k06496k06307L09280j9731K231m85974L31943m60199K64024
16575B390891j38777O5008m6234l4842m8589n4469o3803J12734m0054k43835K87841
$$ plain form
16644 9697105 9430034 9087795 8754266 8525380 8417544 8313376 7987603 7886632 7377491
16635 7377491 7496376 7275349 7122671 7000280 6614536 6556113 6216988 6240001 6050158 6027641
16625 6027641 5792487 5795601 5737357 5498547 5377790 5201742 5095460 5011569 5029626 4990188
16615 4990188 4706141 4391709 4704896 4268707 4169173 4312521 4157124 4110323 4436150 3996703
16605 3996703 3930072 3670058 3739478 3459699 3604978 3386426 3532875 3593188 3686120 3301043
16595 3301043 3345396 3301281 3108378 2873941 2850879 3126768 2779117 2919269 2907971 3019788
16585 3019788 2862120 2655624 2449317 2758597 2738866 2741097 2255123 2587066 2126867 2390891
16575 2390891 2252114 2317122 2270888 2236046 2187457 2132988 2069185 2181919 2141865 1898030 2185871
16564B185871o5283P4280l79173K10685k42147P5310K01006k33386J6367n5322
16554A788208k75708K91508m0864k62381K94287j27082p7454r5866J82123k34875
16544A441896k03515K53869j67617J70488m83028L61966Q8357j0251k74699L88394
16534A565860l26779R2528q8699J02357j31824M14554l93512j85507K0196J97640
16524A266814Q8002l56644L33053k22379R9577m29186L72416r3513K30934l61940
16514I27134J16885m2324j29457L10532q9707J67034n06126m9301o7641J64677
16504H01706L45890j00882J03585k42663p9123L21106m29197J92248l81952P75198
16494A305916m82095K0012J02837m13613m3020K71042j67490J12415J49105O400
$$ plain form
16564 2185871 2120588 2194868 1815695 2026380 1784233 1859543 2060549 1827163 1843530 1788208
16554 1788208 1512500 1804008 1763144 1500763 1795050 1667968 1590514 1494648 1676771 1441896
16544 1441896 1238381 1492250 1324633 1495121 1012093 1374059 1462416 1452165 1177466 1565860
16534 1565860 1239081 1331609 1242910 1345267 1213443 1627997 1234485 1048978 1069174 1266814
16524 1266814 1354816 998172 1331225 1108846 1208423 779237 1151653 1058140 1289074 927134
16514 927134 1044019 1001695 872238 1182770 1093063 1260097 753971 704670 637029 801706
16504 801706 1147596 1046714 1150299 907636 828513 1149619 720422 912670 530718 1305916
16494 1305916 823821 843833 946670 533057 490037 761079 593589 706004 855109 861509
16484H61509l86314J11165L35782o5094C11188N24670K8026j37510R1341l70898
16474D46817M00337C77942N47654D20394K34399J2913J00641j13808q2852K58621
16464H30308k37442k7242K6685q9164r5834J19894M60469m03456j3934J77417
16454G47701k59930r5453N8494J97755k1431J36821k05239J94398C29380M33246
16444G62626k95399p5037K44808k09850J12447J08312r5800R1369j98743J45352
16434E90085o996R8348A83549R2561K05841A26360J64553J10150k9765J84341
16424E55639k4776j8383D1404L52161K43596C12842D8458L95482j88339K71813
16414E27414M5492B39044L2972J38351D7845L2540M15158j52462O206A60616K74333
$$ plain form
16484 861509 475195 586360 922142 857048 311188 835858 863884 726374 817715 446817
16474 446817 847154 377942 925596 420394 654793 667706 768347 654539 571687 830308
16464 830308 592866 565624 592309 503145 407311 527205 987674 584218 570284 747701
16454 747701 487771 392318 450812 648567 627136 763957 558718 753116 329380 762626
16444 762626 467227 392190 636998 427148 539595 647907 552107 643476 444733 590085
16434 590085 583089 681437 183549 276110 481951 126360 290913 401063 371298 555639
16424 555639 530863 512480 41404 393565 637161 312842 48458 443940 255601 527414
16414 527414 572906 239044 272016 410367 47845 80385 495543 343081 349287 160616 434949
16403D34949r4601k4661N4211j05292J17765M1659k9836j27917O3760R7434J4867
16392D42338j67780K90535A46173L25167o880B11481l6774L01199j32096R5654
16382D39464j97286K20993O7098A49091K91265j7573p4422L620J17740n49m798
16371D64374G775N95035B22430F8159K30345J8974o5595K5761H4892N4457l8653
16360A00696J0270L16282k06538J10192N2135m5425j1599D9308J05574a08888
16349A75591N9120J1009K25823A89238F2688M7849K8661K78646j29368g0021C20582
16337D84830A95884O3162m0857h0744B75705j08626A1812M71765a16195E07205
16326D62783r6560J2193p4747j20271b0622A34390K88453j2019a84335C8339J91252
$$ plain form
16403 434949 340348 315687 369898 264606 382371 424030 394194 266277 330037 427471 442338
16392 442338 274558 565093 146173 471340 464460 211481 174707 475906 343810 439464
16382 439464 242178 463171 530269 149091 440356 422783 348361 351981 469721 469172 464374
16371 464374 7775 602810 222430 68159 298504 317478 251883 277644 84892 139349 100696
16360 100696 110966 427248 220710 330902 383037 337612 326013 49308 154882 -108888
16349 175591 234711 245720 471543 189238 62688 110537 139198 417844 288476 -70021 320582
16337 484830 195884 259046 218189 -80744 275705 167079 11812 483577 -116195 507205
16326 462783 366223 378416 303669 183398 -20622 134390 422843 410824 -184335 38339 229591
16315B29591j4332b14699E9827J79488I6068L43335A27795B1613K47188E6168
16304B97793p0620L6268A01014M05507G8217M33364j35266D1639O16M13067A791
16292A4808b00857D37975N018c2864B1092M48472a47983A5961J58542J86950j46555
16281B14898B3299O6881l937L41058j92961a9505p5636C95466j01476J29153i1233
16269i8872A30681a20788A99541b2564A46015O4651F33J66560j882O2611C0833
16257B38170a12176D26036H6449a06287E773K24722n5135L44904k30462H8350
16246i596B48828m8855g3834B32070a27453B30918A11752J79088b5031C3839J95653
16235B29492E2424J47729O7805a48879a9831j24046f015B92575F2028a18834l25735
$$ plain form
16315 229591 215259 -214699 59827 239315 96068 439403 127795 21613 268801 56168
16304 297793 227173 263441 101014 506521 78217 511581 376315 41639 42255 455322 1791
16292 14808 -200857 437975 442993 -32864 21092 469564 -147983 15961 174503 361453 214898
16281 214898 23299 90180 86243 427301 234340 -19505 -95141 395466 293990 423143 -91233
16269 -98872 130681 -120788 199541 -22564 146015 210666 633 167193 165311 227922 30833
16257 238170 -112176 426036 86449 -106287 5773 230495 175360 520264 289802 88350
16246 -9596 248828 199973 -73834 232070 -127453 230918 111752 290840 -25031 33839 229492
16235 229492 52424 200153 267958 -148879 -19831 -143877 -6015 292575 62028 -118834 -444569
16224d44569I8047c9868C06022j35043M0861b08480A96261i2116A65205a98295
16213d5357B05404a9024A17510J51991j1891a8226j14p7202A9732N4681a88392
16201C74955A13947m3076a06537l2835M8823A22081L6984a96994k69166H8606
16190H076a00515d9450D40506m3895b1307j04209h622A14980a6509j15260p6137
16179b07906P3133G7266b33790L0993A07508m8435J128P1961Q4201I5731h0805
16167B7552a72004B27408r8564d8323Q819B10224h7814E4229c53391J76089A31298
16155A96838G0524L89659a99228a1765A42193J8838l7092c67469A03327i3806
16144A84932C5360a089B10150l1127n1129K88458j54373f4856j84373j3094J08586
$$ plain form
16224 -444569 98047 -39868 306022 170979 211840 -208480 196261 -92116 165205 -198295
16213 -45357 205404 -19024 117510 269501 257610 -18226 -18340 -95542 19732 74413 -188392
16201 374955 113947 70871 -106537 -139372 -90549 122081 159065 -196994 -466160 88606
16190 8076 -100515 -49450 440506 396611 -21307 -125516 -8622 114980 -16509 -131769 -207906
16179 -207906 -134773 77266 -233790 -202797 107508 59073 60201 132162 216363 95731 -80805
16167 27552 -172004 227408 128844 -48323 -39504 210224 -87814 54229 -353391 -177302 131298
16155 196838 70524 460183 -199228 -11765 142193 161031 123939 -367469 103327 -93806
16144 184932 35360 -1089 210150 179023 127894 416352 261979 -64856 -249229 -262323 -153737
16133a53737k21298a73322k7033e3178j49562A52436c6276n2361G8691K09284
16123B87975C8742K33613o1215n9610g4647j86946I47c28573e8410H6357a25456
16111g0130A07899a6881k33200A5963L9640b93638A79253a103B67635f950I5368
16099a6743A12963B8282I480b82164a7677C9393a41805k5651O6985D4107a16880
16087B49942a19574C105K36076J35079A16235b83569I7381a82595m3311a05418
16076B74723A16935a20835j45925p5273b6700k7087A11160A1913K4598a49086
16065d2583m94050a29167C1358d06061J20809H6989a25508a3853j07072A85233
16054F0821K0165a61466A33753e9305A88355d0082C50442j52817E8055K2503g321
$$ plain form
16133 -153737 -375035 -173322 -200355 -53178 -202740 152436 -36276 -88637 78691 287975
16123 287975 38742 272355 211140 151530 -74647 -261593 947 -328573 -58410 86357 -125456
16111 -70130 107899 -16881 -250081 15963 55603 -293638 179253 -1103 267635 -6950 95368
16099 -16743 112963 28282 9480 -282164 -17677 39393 -141805 -167456 -100471 44107 -116880
16087 249942 -119574 3105 239181 374260 116235 -283569 97381 -182595 -225906 -105418
16076 274723 116935 -120835 -266760 -342033 -26700 -53787 111160 11913 36511 -149086
16065 -42583 -536633 -129167 31358 -406061 -285252 86989 -125508 -13853 -120925 185233
16054 60821 80986 -161466 133753 -59305 188355 -40082 350442 197625 58055 80558 -7321
16042B06224a89038R1373b7812C69156b15571g9915j28469C6518b42181E8760
16031a2485j48816F0812d71120b10292b1988p8230K7780q0473C4222b76793D7668
16019A71399f4769a5320r8321D56636f1158J127F119b09913R0892o2908C03369
16007C2415K29045o4493b1661r2697B52727j01338a43831N9794A08382a6351k36105
15996b52456d4711k94175C36082A17016L32873g5632J0421r5537H615a84952B37444
15984B70988a08843A33109a85504A01729D0086M8928K12503J25435d0922j61401
15974b02323K4902E4507c509D04416C2630d6634k13911M8754A57624g3751j2797
15963h6548B75158C0735M35461E1792J80197K47295A27934D527J7594a11844G3965
$$ plain form
16042 206224 -189038 -97665 -27812 369156 -215571 -79915 -208384 36518 -242181 58760
16031 -12485 -161301 60812 -471120 -210292 -21988 -100218 -72438 -152911 34222 -276793 47668
16019 171399 -64769 -15320 -113641 456636 -61158 -60031 6119 -209913 -119021 -181929 303369
16007 32415 261460 196967 -21661 -114358 252727 151389 -143831 -84037 108382 -16351 -252456
15996 -252456 -44711 -338886 336082 117016 449889 -75632 -65211 -160748 8615 -184952 237444
15984 270988 -108843 133109 -185504 101729 40086 89014 301517 426952 -40922 -202323
15974 -202323 -177421 54507 -3509 404416 32630 -46634 -260545 -211791 157624 -73751 -86548
15963 -86548 275158 30735 466196 51792 231989 479284 127934 4527 22121 -111844 73965
15951a41790A6275K52589J5281a96387A41261C997a1938j32243c2491j1700k57554
15940c01745R1218c4295B13653f7706n5840E8022a54444p9913l00190H5009J92533
15929B77542G024c5259q3734A73698c56445a60015m7576H2078e28900i6776q3914
15918a80690A2771a27108I4143c80893B74144A01197j3604b15563B9003J0247
15908C9250c55341C65272F881J83530d2519n8801b1393n140L045l6752A84223
15896a80377A46401d23727a42414f2299k68229a6541m1540k67809A59737J64368
15886C24105b2300p1529C28176F820b19768A1015b4670C5923J8124O7101f3737
15874a13197J54k76876g9213j52338E7663R9150c21581J09371E0615a62155B41003
$$ plain form
15951 -141790 16275 268864 284145 -196387 141261 3997 -11938 -144181 -32491 -44191 -301745
15940 -301745 -210527 -34295 213653 -67706 -123546 58022 -154444 -234357 -534547 85009 277542
15929 277542 7024 -35259 -118993 173698 -356445 -160015 -207591 82078 -528900 -96776 -180690
15918 -180690 12771 -127108 94143 -380893 274144 101197 87593 -215563 29003 39250
15908 39250 -355341 365272 6881 190411 -42519 -101320 -21393 -26533 -23488 -60240 184223
15896 -180377 146401 -423727 -142414 -62299 -330528 -16541 -58081 -325890 159737 324105
15886 324105 -22300 -93829 328176 6820 -219768 11015 -24670 35923 54047 121148 -63737
15874 -113197 -113043 -389919 -79213 -231551 57663 156813 -321581 -212210 50615 -162155 241003
15862b79563B17247j9648b75703I6112h5730j49514h812B3021b96605A17410J22536
15851B39946B6737J7819K01689i0748B0853d3066j6372g290k1984k41874J08713
15840a62435j25628E7001a19365B00486J00561c6318k9904m5000B92301b86204
15829B85822e2929j8632C34430g4609l1765G8266a0679j21034C7150a37053j3228
15818a50281j03602C06498a74573P3531g314m1291q753H80a29801r100A19901
15806h8515C0669a12383A49122a55224B06449a84637G0064i9770q8052D6366b1493
15794G855a01662A96592c68326a71322K8713a5180j07893N7811J5129r9986a4639
15782B2459J83597b50997m1887g3517m7808j65903d0981A59664a92115r0853a12355
$$ plain form
15862 -279563 217247 197599 -275703 96112 -85730 -235244 -8812 23021 -296605 117410 239946
15851 239946 26737 44556 246245 -90748 20853 -43066 -59438 -7290 -29274 -271148 -162435
15840 -162435 -288063 57001 -119365 200486 301047 -36318 -66222 -111222 292301 -286204
15829 285822 -52929 -71561 334430 -74609 -106374 78266 -10679 -131713 37150 -137053 -150281
15818 -150281 -253883 306498 -174573 -101042 -7314 -48605 -57358 880 -129801 -138901 119901
15806 -88515 30669 -112383 149122 -155224 206449 -184637 70064 -99770 -187822 46366 -21493
15794 7855 -101662 196592 -368326 -171322 -142609 -15180 -123073 -65262 -50133 -150119 -14639
15782 22459 206056 -250997 -292884 -73517 -121325 -287228 -40981 159664 -192115 -282968 -112355
15770d50536h1562b8584N454C34591d1867B21527a74586B88185I8075a10783C1417
15758C8806a19713I0027b09043A73100B092a15623A44317a35963B6346a286m4090
15747d5376j09387A29246J19218c69748O3497A6609a90827f1204j0804B3671a89551
15735A9457G655K92891F0847a35309J7876A2051b67187f9319A14540P9908c27371
15723I5220J16722m8121f1134A2200d98k75461E2711J87786a94214d6684a0038
15711A11577D7337a54814o8660k4236B75518B2491K15788c5937C5803b40121f811
15699C1055b7121j22367p1339d0061B4016O8175i3463A00629b32481G8769A1205
15687G9654J86670e03245E7565K18523G8275C6368f0327p1219D19744E1994p618
$$ plain form
15770 -450536 -81562 -28584 -23130 334591 -41867 221527 -174586 288185 98075 -110783 31417
15758 38806 -119713 90027 -209043 173100 2092 -115623 144317 -135963 26346 -1286 -45376
15747 -45376 -154763 129246 248464 -369748 -306251 16609 -190827 -61204 -72008 23671 -189551
15735 19457 7655 300546 60847 -135309 -117433 12051 -267187 -69319 114540 194448 -327371
15723 95220 211942 163821 -61134 12200 -498 -275959 52711 240497 -194214 -46684 -10038
15711 111577 47337 -154814 -223474 -247710 275518 22491 238279 -35937 35803 -240121 -6811
15699 31055 -27121 -149488 -220827 -40061 24016 92191 -93463 100629 -232481 78769 11205
15687 79654 266324 -503245 57565 276088 78275 36368 -60327 -131546 419744 51994 44376
15676D4376i7024B3772c4210E3249K37056j43075J61340i1861c8338r3749A19561
15664A46835e6862m368l01806A27744d6669o4551B98070c23859J40513B46170
15653a51739A97142E3948k6493N2076e6914m7569a7147A2717b84883C77673A50244
15641C03286g563F3593A2249b8502o7819d364H7172a36168p8065H7883e5204j96504
15629b51708J20373N0150e619F8847J48225a53104G6670b47429b6557C00582h9470
15617b44043E0263a7950k15437j00076B82319a84993g5324A44015J68295D6149
15606e1783B73652k0670j21066L2064c5860A2915b9541C3522K09260A359L4673
15595C6032c26466B16873I5413Q7118c0783j85043h3000j87205b8846q7837r9718
$$ plain form
15676 44376 -97024 23772 -34210 53249 290305 147230 308570 -91861 -38338 -132087 119561
15664 146835 -56862 -61230 -363036 127744 -46669 -111220 298070 -323859 -183346 246170
15653 -151739 197142 53948 27455 79531 -56914 -104483 -17147 12717 -284883 377673 150244
15641 303286 -7563 63593 12249 -28502 -96321 -4364 87172 -136168 -214233 87883 -55204 -251708
15629 -251708 -131335 -81185 -5619 68847 217072 -153104 76670 -247429 -26557 300582 -89470
15617 -244043 50263 -17950 -233387 -333463 282319 -184993 -75324 144015 312310 46149
15606 -51783 273652 252982 131916 163980 -35860 12915 -29541 33522 242782 1359 36032
15595 36032 -326466 216873 95413 182531 -30783 -215826 -83000 -270205 -28846 -116683 -216401
15584b16401b8124j30602e5519G0139g1026L4768l2769F6723f7683A14322R4009
15573B08331J26210a40233n047J1570A65063a6435B49255D837L9082Q4741e7229
15561G7537J11838a80578A2181J80347q7256K16122c3122k41860c0684C5918D400
15549e0985k41431G920d97622b29959M4282p7451c2192G3582a10785A21709g154
15537b1453m2764j66130G0969a58755A71154b22989C32072j43614a1136F2630
15526c1610I8357c24902a9433C90771E7475L0863K80525e4416A51173P3948R2856
15515C17977a32832A21015i2091a767l58370B94409j08969g3463c4057B84449
15504A1320a91299b821A03137k8643L6712g7481A50479i8041F48609A05788f0949
$$ plain form
15584 -216401 -28124 -158726 -55519 70139 -71026 -36258 -69027 66723 -67683 114322 208331
15573 208331 334541 -140233 -145280 -133710 165063 -16435 249255 4837 43919 128660 -57229
15561 77537 189375 -180578 12181 192528 105272 321394 -33122 -274982 -30684 35918 4400
15549 -50985 -292416 7920 -497622 -229959 -185677 -263128 -32192 73582 -110785 121709 -7154
15537 -21453 -64217 -230347 70969 -158755 171154 -222989 332072 188458 -11136 62630
15526 -31610 98357 -324902 -19433 390771 57475 88338 368863 -54416 151173 225121 317977
15515 317977 -132832 121015 -92091 -1767 -360137 294409 185440 -73463 -34057 284449
15504 11320 -191299 -2821 103137 74494 111206 -77481 150479 -98041 648609 105788 -60949
15492I4685R8212B9221a42701D5570M8296a51294B26893i9485A09224a28167d0708
15480E4711A058a68417e4426M026i822B25753a35558r823A33387h3584j11220
15469a94804p5492C3938R3499b04138K1486A12750c8956n6452L6700A35093A3793
15457C59953a1960A43983o7903j928e2937J4282m1033q843j91484a8718C6989
15445B57545e4578F5986a89356B49172i941B49102j23608J61616i4827K1007A19029
15433A00687d2779E7764a48339B18892R2721p0239E5167a39681A42528K6651a76503
15421e1550B18802a8026m6344c1002I3273l0052J65102a60043L9731A34690n7050
15410G7640C960b42115D8685K46439N2466d5008m0014A42166F4792O0001a01521
$$ plain form
15492 94685 192897 29221 -142701 45570 93866 -151294 226893 -99485 109224 -128167 -40708
15480 54711 1058 -168417 -54426 -50400 -9822 225753 -135558 -145381 133387 -83584 -194804
15469 -194804 -270296 33938 127437 -204138 -182652 112750 -38956 -95408 -58708 135093 13793
15457 359953 -11960 143983 76080 74152 -52937 -38655 -79688 -88531 -280015 -18718 36989
15445 257545 -54578 65986 -189356 249172 -9941 249102 125494 287110 -94827 -73820 119029
15433 100687 -42779 57764 -148339 218892 311613 241374 55167 -139681 142528 169179 -176503
15421 -51550 218802 -18026 -64370 -31002 93273 63221 228323 -160043 -120312 134690 77640
15410 77640 3960 -242115 48685 295124 347590 -45008 -85022 142166 64792 124793 -101521
15398a41327a412D4885a45085L0028A12201b59206b4234D6703L1267M04813B06002
15386H9880j5176c4627B1612L4919B1791a15024a7518j2547j08725O1260B75214
15374B0995d6181I5575C2198a12586B0700M9844f0630A74062d4207B8438a31337
15362B4574K51132K011f2579j0522B77899b68156J02167n6766A08151f1373b5423
15350c2069C37624A33195a16930J7980A23726h4704B10048C2278b1057j19797
15340a40854L2291l06277b9098q2885A5130a00668C68898A68119a3272j65205
15330a78477F8724a66549D0284M3478P3186a54975I1527b9888B3682B549K71614
15319B74163E4454M7793K4491Q4612e693p9351l64889F2292L46368j25562g9289
$$ plain form
15398 -141327 -1412 44885 -145085 -115057 112201 -259206 -24234 46703 77970 482783 206002
15386 89880 74704 -34627 21612 56531 21791 -115024 -17518 -30065 -138790 -77530 275214
15374 20995 -46181 95575 32198 -112586 20700 70544 -60630 174062 -44207 28438 -131337
15362 24574 275706 277717 -62579 -73101 277899 -268156 -165989 -222755 108151 -61373 -25423
15350 -32069 337624 133195 -116930 -98950 123726 -84704 210048 32278 -21057 -140854
15340 -140854 -108563 -414840 -29098 -111983 15130 -100668 368898 168119 -13272 -178477
15330 -178477 68724 -166549 40284 83762 156948 -154975 91527 -29888 23682 2549 274163
15319 274163 54454 102247 126738 211350 -5693 -85044 -449933 62292 408660 283098 -79289
15307a00687A00769b41061C0639J24637h8492A45303g4191A65992a24360A69763
15296B06643K01002A15746J94791b0070B38150e8806A4711L6829f4555j14385
15286a78940H5520M76108G6956Q9522b20609B07017H3819i6078l6281A53216F4437
15274A0195g0319G7587a54615d8612B07862N2194j28558a7185b754A88296G1723
15262C5291a22578A74505J57200A11422K19950B8533a8982B47994l8088R7792
15252C07698K09800D9115J59565N834L1188Q58720N49666J98925k60545j2092
15242A580376m15276A86108A0571K24499b80644I2109K15538F3412g5474Q64G3652
15230H8404J38956o5917I183L35448j51194a11329A60723g4937K0007B51157D8295
$$ plain form
15307 -100687 100769 -241061 30639 155276 -88492 145303 -74191 165992 -124360 169763
15296 206643 407645 115746 310537 -20070 238150 -58806 14711 51540 -64555 -178940
15286 -178940 85520 561628 76956 166478 -220609 207017 83819 -96078 -132359 153216 64437
15274 10195 -70319 77587 -154615 -48612 207862 260056 131498 -17185 -2754 188296 71723
15262 35291 -122578 174505 331705 111422 331372 28533 -18982 247994 209906 307698
15252 307698 517498 49115 208680 214514 245702 1104422 1654088 1853013 1592468 1580376
15242 1580376 1165100 186108 10571 235070 -280644 92109 307647 63412 -75474 -74610 73652
15230 88404 227360 161443 9183 344631 193437 -111329 160723 -74937 -54930 251157 48295
15218c259j11945d9250a1651j48789d0233A17176B9744h8324H8560L3682J97552
15207C19794f6317j31316A79559p8915a60881K0532e5354A87802a61708e6416
15196A48339G2922K26954a35474B30797e1202C18380d3591f114E6615N5173a05584
15184D6806N9004Q379J70998p3921J48707b1195A49790F7970K55623c22469C3262
15172B9376L09814A21460L9943l6818M06532F0527a0742A12928E2086J27846J69985
15161C49917b38506a04853B35653p6360A8674K5453J69051j6545A3497J3757d3255
15149D10709A94536l4056r3L65950f2126B82621j20169R2496F5021K14861j22633
15138A57249a6156G4050a3380m1356j34655B58579p9726r818J23365P5660A54684
$$ plain form
15218 -3259 -115204 -49250 -11651 -160440 -40233 117176 29744 -88324 88560 122242 319794
15207 319794 -66317 -197633 179559 100644 -160881 -140349 -55354 187802 -161708 -56416
15196 148339 72922 299876 -135474 230797 -51202 318380 -43591 -6114 56615 111788 -105584
15184 46806 105810 114189 285187 211266 359973 -21195 149790 67970 323593 -322469 33262
15172 29376 339190 121460 161403 124585 531117 60527 -10742 112928 52086 179932 349917
15161 349917 -238506 -104853 235653 159293 18674 44127 213178 196633 13497 27254 -43255
15149 410709 194536 160480 160387 526337 -62126 282621 162452 254948 65021 279882 157249
15138 157249 -16156 74050 -13380 -54736 -189391 258579 178853 169035 292400 368060 154684
15126a32593f457A01028a2238C20419Q5532G5531h501A43844i1458B21619f9825
15114A50231E5790J07974E890J31253n9920P8585j129c9229A65344D0291b19243
15102C03521l6814a32912B19448I9654L85956A10143J00455a8685B29927b1118
15091B35455n6847B9388K33847e3695B55163d1287D22572h1277D6219M1555b041
15079A59532K27488K25717E3520J30172e4263A46169b77870A01657g3182B85415
15068i161k3475A06322J53737k5604L2176o7901o9550R071J68488F7526J01451
15057A68977b2849F6981J04056J65787A55068J20513K5575E6502L92190q0119
15047C68573f3416C90610p6335H3563L4062M60109a09021C13095j27670l3869
$$ plain form
15126 -132593 -6457 101028 -12238 320419 405951 75531 -8501 143844 -91458 221619 -69825
15114 150231 55790 163764 5890 137143 77223 155808 154679 -39229 165344 40291 -219243
15102 303521 266707 -132912 219448 99654 485610 110143 210598 -18685 229927 -21118
15091 235455 178608 29388 263235 -53695 255163 -41287 422572 -81277 46219 87774 -2041
15079 159532 387020 612737 53520 183692 -54263 146169 -277870 101657 -73182 285415
15068 -9161 -32636 106322 260059 234455 266631 198730 129180 138251 306739 67526 168977
15057 168977 -22849 66981 171037 336824 155068 275581 301156 56502 448692 368573
15047 368573 -63416 390610 314275 83563 117625 577734 -109021 313095 185425 151556
15037A51556R1099a40756f0466F5308h6981C07213E5241L2807a16138I0663J15263
15026B05926N76J01960O9210A07260L74955E2732L1778a40097K250K8008F7790
15014D35553H8564J32434J86134j46079o8227k0831J2961p7863K73298A54238
15003B07769a94633D36660A74133j242a51893C05359L8131B5705J47765P6899
14993B50369J99908o3699m7095J85768K821b8683j82035A41620q200b7445B34674
14981D54007B13440m3187G6745L27237A11253K07355J53541o9161A02311L10381
14971D12692J40022K08262E4865L99441A77761L0044q4474J81216e9622E53357
14960A19463N32007A33210L65443j38714j02861F6227J63696l3397K32621k6855
$$ plain form
15037 151556 242655 -140756 -60466 65308 -86981 307213 55241 88048 -116138 90663 205926
15026 205926 206502 308462 377672 107260 482215 52732 84510 -140097 -137847 -109839 67790
15014 435553 88564 220998 407132 261053 192826 171995 184956 107093 380391 154238
15003 207769 -194633 436660 174133 172891 -151893 305359 343490 25705 173470 250369
14993 250369 450277 386578 339483 525251 528072 -28683 -210718 141620 133420 -27445 234674
14981 454007 213440 170253 76745 403982 111253 318608 472149 402988 102311 412692
14971 412692 552714 760976 54865 454306 177761 207805 123331 304547 -59622 553357
14960 119463 651470 133210 498653 359939 257078 66227 229923 196526 429147 402292
14950D02292j17557k4482K34361k37386m4151J50418O933H8803B208L24933Q9035
14939D16176j4166o9330K57189K8269B50561r2926O2199I684M8355M69691B49687
14927C04152M01648l41275A77343c3610B49247M7889q7951K5907P6022A31584
14916C59283A62816n174J39463A32404k6068L33790J6496B12306K13239L79927
14906H05472C59052d4173E08149A77923N3791J29255j52591k1812J12132r993
14896B88705L21507B95651j20242K6405Q704O0380K9041J96871Q6472a33904D55631
14884C71363k31A62899L82778j84884A63534K54569A37334L27115j95517K14309
14874D83241Q0223k33780M3034L33297B82156J77416Q9223j1544P8282P8479a96450
$$ plain form
14950 402292 284735 260253 494614 257228 213077 363495 370428 88803 2208 327141 416176
14939 416176 402010 332680 589869 618138 250561 157635 219834 9684 58039 527730 249687
14927 304152 705800 364525 177343 -33610 249247 297136 209185 235092 311114 131584
14916 359283 162816 157642 297105 132404 106336 440126 456622 212306 425545 805472
14906 805472 359052 -44173 508149 177923 231714 360969 208378 186566 298698 288705
14896 288705 610212 295651 175409 201814 210518 270898 299939 496810 583282 -133904 455631
14884 371363 371132 162899 545677 360793 163534 418103 137334 464449 268932 483241
14874 483241 563464 329684 372718 706015 282156 459572 548795 537251 615533 694012 -196450
14862C03442K15763j80093j26223R3218L12681r3161k45664L24928O5487j81775
14852D88603k15889J16849j37401J62030K24563B87212K39564k11264K32231q762
14842E38981B16879K29903J56396q59k85285L38286C12942K01090Q6601K16628
14832H17261n8026k06940A25843J58160j23619M63731B12117K02032r0957A36807
14821F55442C14417k1506b7504D92433J40493r2681L3011J70794j56159J34576
14811G22467k56030L3751K76308k16527j35323o4623K99099O9003k95959K88217
14801G20383p8602j91472k7759J06719J47304j28746J42169A23722M88284j09742
14791E02264j03782J98079P5366O0080j18977r156B41512M52300j83069N564j26071
$$ plain form
14862 303442 519205 339112 212889 306107 618788 525627 279963 604891 670378 488603
14852 488603 272714 389563 252162 414192 638755 287212 526776 315512 547743 538981
14842 538981 216879 446782 603178 602319 317034 655320 312942 514032 600633 817261
14832 817261 759235 552295 125843 284003 160384 624115 212117 414149 323192 136807
14821 655442 314417 292911 -27504 492433 632926 540245 573256 744050 587891 722467
14811 722467 466437 500188 776496 559969 424646 360023 659122 728125 432166 720383
14801 720383 641781 450309 422550 529269 676573 547827 689996 123722 612006 502264
14791 502264 398482 596561 671927 732007 613030 603874 241512 693812 510743 516307 390236
14780C90236L14383O4333k00347j4753n040J1095k75737M49151K02303C26485
14769D96015K77759K4133k08646J68691p5058p3247N8587j53682K44563k74779
14759D84336J85005L07432m21166L90219j39606n7194l7663J77636j68130j00993
14749F19876Q7229o7344J82174j14051k00203K27776J61776k90927k6896K16287
14739G95697K8924o2336N5367k18838L7673p9323j35202Q9410K93732k3418J68357
14728I50043l60610K70741m1292p611l04034L07712j16269J75453m6164l6675
14718G91294k3121l15321K32559K26036k8541k77080K32575L3890n8193K07820
14708A021918j68822K34656l09684r0980o7138K63674M026M6746P8399J27301
$$ plain form
14780 390236 704619 768952 568605 553852 548812 559907 284170 733321 935624 326485
14769 496015 773774 797907 589261 757952 682894 609647 668234 514552 759115 484336
14759 484336 669341 976773 555607 945826 806220 749026 711363 888999 720869 619876
14749 619876 707105 639761 821935 707884 507681 735457 897233 606306 579410 795697
14739 795697 824621 762285 817652 598814 636487 557164 421962 511372 805104 781686 950043
14728 950043 589433 860174 818882 811271 507237 814949 698680 874133 827969 791294
14718 791294 768173 452852 685411 911447 882906 605826 838401 872291 814098 1021918
14708 1021918 853096 1087752 778068 687088 619950 883624 887650 934396 1012795 1140096
14698A140096k67470J1430J4953j4002q6718j66673L29439l80716j14115O83386
14688A149610K7499l49048m3718M20233k38223L1714J98477r072k06539j45698
14678H35235K22632n7257L9990j03759Q6782J7427j21756K54805k69223J82780
14668A087656m81274M90570J44751o8055k33277L53672r9803j82767L85783l52403
14658A044853o072J96666J94057k56036q1002J83110l80844K12495L34843l88534
14648A053536m1077J11869j29328K74948k09741O7476j87143K59275M26917m33925
14638A192807K68478m81705L06113L2759J02269R8j97408M30106k86869O4967
14628A431615m0827O7548L87358n92617J66276J50391N2101l12497L25916l1887
$$ plain form
14698 1140096 872626 884056 899009 885007 798289 631616 961055 580339 466224 1149610
14688 1149610 1177109 828061 784343 1204576 966353 998067 1196544 1187472 980933 835235
14678 835235 1057867 1000610 1040600 936841 1023623 1041050 919294 1174099 904876 1087656
14668 1087656 606382 1096952 1241703 1173648 940371 1294043 1194240 1011473 1397256 1044853
14658 1044853 1038781 1235447 1429504 1173468 1092466 1275576 894732 1107227 1442070 1053536
14648 1053536 1012459 1124328 995000 1269948 1060207 1127683 940540 1199815 1626732 1192807
14638 1192807 1461285 979580 1285693 1318452 1420721 1420819 1223411 1653517 1366648 1431615
14628 1431615 1390788 1458336 1845694 1253077 1419353 1569744 1621845 1309348 1635264 1603377
14618A603377j78925l59221N31169k75090p4208M50811m3507l94052J04889J880
14608A367123R9811p5965N7574m1499j85960K65660j2653L51228k16158p9030
14598A530131J13528K78574l363j28244k35737K80628P3704k66153K44168l84729
14588A502507K83429k4843J39930J72099j53960J86867m7710j48728K06765j0518
14578B105838r206k2063K44520j31081n3132Q3355l885J37088o7262k42277L72545
14567B414440j75993L1912K26800l4076K46934j3547q8322Q100J86510j00252
14557B702506M46435M24467n64341R17021p84878N18054Q12266Q94824K029765
14548G396119L920054Q430889J6298346P293619j8791123A1370520l732615k526687
$$ plain form
14618 1603377 1424452 1065231 1596400 1321310 1247102 1697913 1654406 1260354 1365243 1367123
14608 1367123 1466934 1390969 1448543 1407044 1221084 1486744 1474091 1825319 1609161 1530131
14598 1530131 1643659 1922233 1918870 1790626 1554889 1835517 1909221 1643068 1887236 1502507
14588 1502507 1785936 1761093 1901023 2073122 1919162 2106029 2058319 1909591 2116356 2105838
14578 2105838 2096632 2074569 2319089 2188008 2134876 2218231 2214346 2351434 2284172 2041895 2414440
14567 2414440 2238447 2270359 2497159 2463083 2710017 2696470 2608148 2616248 2802758 2702506
14557 2702506 3148941 3573408 3009067 3926088 3141210 3659264 4471530 5366354 7396119
14548 7396119 11316173 19747062 36045408 43339027 24547904 11370520 7637905 5111218
14540E111218k095884j000950Q2276j56605k15771L19987P3974k32108p8827K95038
14530B102348k39818J90285L23932l73442M51669r8289K79148l29165K06073n2315
14520B460426R4490K67549l31227m2374J08570J22034k12092M55198O8711k14744
14510B776541j04557Q9374o2439N28260j34274P3684k34700L06666J43965k57472
14500C125048J0857L6481J24725r7820p126L90833l24735K22631J07210j74203
14490C413901J95744J26059j56192J38374N8391k05823J96563j30813L90680l94161
14480C632723J98667n8872J79560K33182q1108K56828j26734k18219K97542l95109
14470C918460J70869M59967j90518J76373J16522J13733m37821L26161N7374j79561
$$ plain form
14540 5111218 3015334 2014384 2096660 1940055 1724284 2044271 2118245 1886137 1807310 2102348
14530 2102348 1862530 2052815 2376747 2003305 2454974 2356685 2635833 2306668 2512741 2460426
14520 2460426 2554916 2822465 2491238 2448864 2557434 2679468 2467376 2922574 2991285 2776541
14510 2776541 2671984 2761358 2698919 3227179 3092905 3166589 2931889 3238555 3382520 3125048
14500 3125048 3135905 3172386 3297111 3199291 3192165 3582998 3258263 3480894 3588104 3413901
14490 3413901 3609645 3735704 3579512 3717886 3776277 3570454 3767017 3636204 4026884 3632723
14480 3632723 3831390 3772518 3952078 4185260 4104152 4360980 4234246 4016027 4313569 3918460
14470 3918460 4089329 4549296 4358778 4535151 4651673 4765406 4327585 4653746 4711120 4531559
14460D531559K19027K21302J76952J02580k80694o0830K51325J57428K94304m72268
14450E140685L69079k55264M67280m6520o5588K47532M4129L3534O3016J02930
14440F100813L5225n9394M47282p7553J03625j01052N3053K31330J39908J78942
14430G052179j11568k72480J39212M43437J57030j39124M68817k90260N9533K92072
14420G798848O5146Q8776o2979K91876J70257M1683K87355J45681j43730N359
14410H688272K00188L93787r922L43483J26958K36161j29169L35047J96070j87377
14400A0193498P23817O2751k03884K60963M20622r0859L14220K23390N7106M71201
14390A2432825l32182M67507K66425L09418j97111O13792o3270M99356P3136N26923
$$ plain form
14460 4531559 4750586 4971888 5148840 5251420 4970726 4909896 5161221 5318649 5612953 5140685
14450 5140685 5509764 5254500 5721780 5675260 5609672 5857204 5901333 5934867 5997883 6100813
14440 6100813 6136038 6076644 6523926 6446373 6549998 6448946 6501999 6733329 6873237 7052179
14430 7052179 6940611 6668131 6807343 7250780 7407810 7268686 7737503 7447243 7506776 7798848
14420 7798848 7863994 7952770 7889791 8181667 8351924 8393607 8680962 8826643 8682913 8688272
14410 8688272 8888460 9282247 9272325 9615808 9742766 9978927 9849758 10184805 10380875 10193498
14400 10193498 10917315 10980066 10776182 11037145 11457767 11366908 11681128 11904518 11961624 12432825
14390 12432825 12100643 12568150 12834575 13143993 12946882 13560674 13497404 13996760 14069896 14596819
14380A4596819k10085L67327M47311O66948J57982j16635N31083K52561K03463
14371A6896774N72105K97627J84325M64009Q38879l23250J012352n1664J078013
14362B0969170q253J29893R01416J61614O24682N51662O81265L19133L71113P64713
14352B5466408L56970P63825P96786Q82355M39637P46041M11197J275100O77088
14343C1815407Q24804O55048J372402M73186J211029P65867Q09357J343074Q45311
14334D0115485J308142J666323R69285J168054J699848J287235J629427J482306
14326E1326105J572741J932533J645680K223922J706357K245856K044975K499213
14318F7197382K420826K622549K524871L078886L127387L120175L086630L146016
$$ plain form
14380 14596819 14386734 14754061 15201372 15868320 16026302 15909667 16440750 16693311 16896774
14371 16896774 17468879 17766506 17950831 18414840 19253719 18930469 19942821 19891157 20969170
14362 20969170 20960917 21090810 21992226 22153840 22778522 23330184 24011449 24330582 24701695 25466408
14352 25466408 25823378 26587203 27383989 28266344 28705981 29452022 29863219 31138319 31815407
14343 31815407 32640211 33295259 34667661 35140847 36351876 37117743 37927100 39270174 40115485
14334 40115485 41423627 43089950 44059235 45227289 46927137 48214372 49843799 51326105
14326 51326105 52898846 54831379 56477059 58700981 60407338 62653194 64698169 67197382
14318 67197382 69618208 72240757 74765628 77844514 80971901 84092076 87178706 90324722
14310I0324722M080649L696998M074866M532605M574096M833980N157993N436447
14302A26712356N754625O270912O462644O547854P153933P536029Q198658Q438119
14294A83075130R127706R698921J0035835J0490693J1325270J1246378J2336785
14287B57336718J2930371J2754875J3782568J4221616J4095628J4243706J4956402
14280C54321884J4599085J4413960J3765361J3586544J2702027J1292494R806794
14273D44488149O093304K311188M92474k60740m24041O37222k786850m020081
14265D46530625n498189r101180j1526132j3499700j4083391j5024849j5273319
14258C62523865j5748346j5760657j5553270j4898742j4908223j3444803j2644388
$$ plain form
14310 90324722 94405371 98102369 102177235 106709840 111283936 116117916 121275909 126712356
14302 126712356 132466981 138737893 145200537 151748391 158902324 166438353 174637011 183075130
14294 183075130 192202836 201901757 211937592 222428285 233753555 244999933 257336718
14287 257336718 270267089 283021964 296804532 311026148 325121776 339365482 354321884
14280 354321884 368920969 383334929 397100290 410686834 423388861 434681355 444488149
14273 444488149 450581453 452892641 453385115 453124375 452700334 453337556 450550706 446530625
14265 446530625 441032436 431931256 420405124 406905424 392822033 377797184 362523865
14258 362523865 346775519 331014862 315461592 300562850 285654627 272209824 259565436
14251B59565436j3021137j2503127j1563963j1262041j0146994j0125558q987226
14244A81955390q824571p869394q258764p057325p053142o553136n853357n620381
14236A24865320n859249m760563n296054m357078m269012l467076m045324l905233
14228H8905731l536444l276165l162099k870846l287560k130214k565245k339000
14220F5738158k042650j961740k495141k022320j747847k058734j310986q89286
14212E1209454k145950j074859j964690j311474r14818q82170j456715j091419
14204D0367359j535447r60813j083375j018798m07996j147022r56341j219038
14196C2038529p06450o16144j031921p30747m80899q46595r43704l97585n93607
$$ plain form
14251 259565436 246544299 234041172 222477209 211215168 201068174 190942616 181955390
14244 181955390 173130819 165261425 157002661 149945336 142892194 136339058 130485701 124865320
14236 124865320 119006071 114245508 108949454 104592376 100323364 96856288 92810964 88905731
14228 88905731 85369287 82093122 78931023 76060177 72772617 70642403 68077158 65738158
14220 65738158 63695508 61733768 59238627 57216307 55468460 53409726 52098740 51209454
14212 51209454 49063504 47988645 46023955 44712481 43797663 42915493 41458778 40367359
14204 40367359 38831912 37871099 36787724 35768926 35360930 34213908 33257567 32038529
14196 32038529 31332079 30715935 29684014 28953267 28472368 27625773 26682069 26284484 25690877
14187B5690877m97684p07288n35864m71822n14158l70232j026633k57132m61719
14178B0848345l36858m41845j99108n43169l70042l72960k84127p51332K70050
14169A7818954q20693j85681m77327j21506o6384r26928K4855k03716p5742m32642
14159A4533190m46812J17522l71134l62916O6465m69049o8171l33229k76329r7330
14149A2292207J12381o04628m56876j44812N1754n385k00546m31708L69041m03036
14139A0578392l10963K3026m47898J60652p01425r700j08770j27319K47961l96545
14129H907411J68397m32457k34869K2130m2411P4096m87612J96428k44276l80580
14119G546257J14415r6871j94408K49014l70349J83237j39252j18700m1592j53966
$$ plain form
14187 25690877 25193193 24485905 23950041 23478219 22964061 22593829 21567196 21310064 20848345
14178 20848345 20511487 20069642 19870534 19327365 18957323 18584363 18300236 17548904 17818954
14169 17818954 16998261 16812580 16335253 16213747 16147363 15220435 15245290 15041574 14965832 14533190
14159 14533190 14086378 14203900 13832766 13469850 13536315 13067266 12999095 12665866 12389537 12292207
14149 12292207 12404588 11799960 11343084 11198272 11250026 11244641 11044095 10612387 10981428 10578392
14139 10578392 10267429 10290455 9842557 10003209 9301784 9292084 9183314 9055995 9303956 8907411
14129 8907411 9075808 8643351 8408482 8430612 8388201 8462297 7974685 8171113 7926837 7546257
14119 7546257 7660672 7563801 7369393 7618407 7248058 7431295 7292043 7173343 7131751 6977785
14109F977785l80071p8614K1056J81852l65514r4183J38982l33994M21257n09087
14099E979469K72196k56380J11977n92792M34027l99630J2185J14498O840l12520
14089E369870n2871M73536n92436l9532K6388k94014j42056J12490K69367m50757
14079D679985K46610j70166k79307n7422N5334Q8717J4412m1088o8909k10975
14069D257191O3993r0982J91723o05053K50625L9233J28046K5119j51116J64214
14059D272993l30728L9781n7350J35594l43202N07299n54978j40188N0816j24048
14049C455989o3348j06212J84851l9440j70897J17770O562K74866m48017J50564
14039C362688l16864J73381k37145M33696j90323p3190j81954J65624l3879j29850
$$ plain form
14109 6977785 6597714 6519100 6540156 6722008 6356494 6262311 6401293 6067299 6488556 5979469
14099 5979469 6251665 5995285 6107262 5514470 5948497 5548867 5561052 5675550 5682390 5369870
14089 5369870 5316999 5790535 5198099 5158567 5184955 4890941 4748885 4861375 5130742 4679985
14079 4679985 4926595 4756429 4477122 4419700 4475034 4563751 4578163 4537075 4468166 4257191
14069 4257191 4321184 4230202 4421925 3816872 4067497 4106730 4234776 4259895 4108779 4272993
14059 4272993 3942265 3982046 3924696 4060290 3717088 4224387 3669409 3529221 3580037 3455989
14049 3455989 3392641 3286429 3471280 3431840 3260943 3378713 3385275 3660141 3212124 3362688
14039 3362688 3045824 3219205 2982060 3415756 3225433 3152243 2970289 3135913 3102034 2972184
14029B972184J31345n0364K51842l28840k81153K54227j62171J82700l64733R9046
14019B704083k31282K41637j79428J718p1953j51025q6302M68013j34512m16244
14009B144705J11032m8101K70625l33600L12326j68908l22340M83684k20789l79892
13999A848742N16344Q6579o7748n9750l02915j82945L16295L22014k76547L43011
13989B543080J038197K667093O800185J6147721J4495972j3441230j5055956o277479
13981H917583k878856j198875j069142k70614k44956q4214l05689j74404q866
13972B681967K14004l26611J81524o42286N9977L92674l11720K54993k42370l7988
13962B224164l9748k52272L11908k0697m04829j2811M45883k52564J27039m01031
$$ plain form
14029 2972184 3103529 3053165 3305007 2976167 2695014 2949241 2787070 2969770 2605037 2704083
14019 2704083 2472801 2714438 2535010 2536728 2464775 2313750 2227448 2695461 2560949 2144705
14009 2144705 2255737 2207636 2478261 2144661 2456987 2288079 1965739 2449423 2228634 1848742
13999 1848742 2365086 2451665 2383917 2324167 2021252 1838307 2154602 2476616 2200069 2543080
13989 2543080 3581277 6248370 13048555 29196276 43692248 30251018 15195062 8917583
13981 8917583 6038727 4839852 3770710 3500096 3255140 3170926 2865237 2690833 2681967
13972 2681967 2895971 2569360 2750884 2108598 2168575 2561249 2249529 2504522 2262152 2224164
13962 2224164 2184416 1932144 2244052 2223355 1818526 1805715 2251598 1999034 2126073 1725042
13952A725042M02943j97549N1486j57013j08630M7493J25867m6934J06566m6516
13942A902755k62063K9172K65489k8374j20096l0655l25534N00331k82682q4159
13932A564184J85375r2118K5402j65444L8669k88651P64023k67872j99608Q5025
13922A648985j2107j14962q895K74976l09318L15123l93603m6610J30228j1705
13912A472112j24155J36365l4674L32963o89758M52333J70727j49583l34123K05013
13902A437220l44737K98967R6465k32637J84368j36349L9077J37235j50782J02567
13892A431394j994J6279j90512n7430J86756l66729K13074N4215k44958l998J38397
13881A174494L3482J19857j33026q2685Q6162R3947M0825k61498j07557L32760
$$ plain form
13952 1725042 2127985 1930436 1981922 1824909 1716279 1763772 1889639 1842705 1949271 1902755
13942 1902755 1640692 1669864 1935353 1906979 1786883 1756228 1430694 1931025 1648343 1564184
13932 1564184 1749559 1657441 1682843 1517399 1556068 1267417 2031440 1763568 1563960 1648985
13922 1648985 1636878 1521916 1513021 1787997 1478679 1793802 1400199 1353589 1483817 1472112
13912 1472112 1347957 1484322 1449648 1782611 1092853 1545186 1715913 1566330 1232207 1437220
13902 1437220 1092483 1391450 1487915 1255278 1439646 1303297 1342374 1479609 1328827 1431394
13892 1431394 1429400 1445679 1255167 1197737 1384493 1017764 1230838 1285053 1040095 1036097 1174494
13881 1174494 1207976 1327833 1194807 1112122 1198284 1292231 1333056 1071558 964001 1296761
13871A296761O2229p0075l25394N88826l20898Q0161k54206P8090P5484J19286
13861A330264J9981k34869l03243L24534j09904k3387K0493j86592P1028L8898
13851I47203j46916K61017j18908K86996n0357j20115j97575l363O949J68650
13841A033581o3145J78756l44966K76150J58160n23972K39683l648J23076j25244
13831I48431k46492M9466o89J57190R21k88653L17296j98576J95227J72577m07511
13820F99187j44860L00448M7568R3666N9403K0564l38494L44340k49753M0636
13810H72705O54k17136J36995l08965J25786M56538m08042J40168j06290O2378
13800G54791p4309j64374J22272K07090n585P3724M1177o4627j42617k71997M95832
$$ plain form
13871 1296761 1358990 1288915 963521 1552347 1231449 1311610 1057404 1135494 1210978 1330264
13861 1330264 1350245 1115376 812133 1136667 1026763 1003376 1023869 837277 908305 947203
13851 947203 800287 1061304 942396 1229392 1179035 1058920 861345 857982 864931 1033581
13841 1033581 970436 1149192 804226 1080376 1238536 714564 954247 950599 1073675 948431
13831 948431 701939 751405 750716 907906 908827 620174 937470 738894 934121 1106698 699187
13820 699187 554327 854775 902343 996009 1055412 1075976 737482 1081822 832069 872705
13810 872705 873359 656223 793218 484253 610039 1066577 658535 798703 692413 754791
13800 754791 680482 516108 638380 845470 839885 913609 954786 890159 747542 475545 971377
13789I71377o12k10941j88434K44211j67118K68108k66927J1050K71521r8559
13779H33676l53358M47425l01449q0703K93188l43743M20739k66894K21972j42716
13769G28137l0934k27289K69044j21578J37449j39127J00224k45729J11356k09164
13759C72389M10345k05928j87627M90283m00697m8114L95669k11807p0542l2888
13749E11083j54983J89366K07227C63983L28642P7525l45008K30653m0431J49183
13739G64547j76262l6707K12171C71107L34871j18679J82176k25188n9648N03890
13729I88529j28361C15812L02228L16409k86781j40270K09534j14047O2152Q9417
13719G54454j99076k52372M57357n4540j28048R976J82178j65753m2908J58625
$$ plain form
13789 971377 970765 759824 571390 815601 648483 916591 649664 660714 932235 833676
13779 833676 480318 927743 626294 545591 838779 495036 915775 648881 870853 728137
13769 728137 697203 469914 738958 617380 754829 615702 715926 470197 581553 372389
13759 372389 782734 576806 389179 879462 478765 430651 826320 614513 543971 511083
13749 511083 356100 545466 752693 363983 692625 770150 425142 655795 615364 764547
13739 764547 588285 551578 763749 371107 705978 587299 769475 544287 484639 988529
13729 988529 860168 315812 618040 934449 647668 507398 716932 602885 665037 754454
13719 754454 555378 303006 760363 705823 577775 587751 769929 604176 561268 719893
13709G19893k11464J75465l2226B33706M49919k51075J6539O61282D97505J79698
13699F77203j63558J08370j55045J90870k71800L47893j56677A16159L25392k02765
13689B38786M08793j42931j53480A21393L31539A82511L94044A78589K0216k3180
13679A75625J10922J03144q9355K92124L8259j64453k4556K40218j86703K20359
13669G15584k34807j54023o9715j25700N64393k35017j8066L07748l30286k6900
13659C93211j77736K56444J27993j69612A59287J13554J27606O3758A95042o4684
13649A30358K43479J32586J49610k79061j13585K0706r5109J27402j16512Q8045
13639B87919Q5013K46403q0094J08868k54442O5867K49856l25226K63738r865
$$ plain form
13709 719893 508429 683894 651668 233706 683625 432550 449089 1110371 497505 677203
13699 677203 513645 622015 466970 657840 386040 733933 577256 116159 441551 238786
13689 238786 647579 504648 351168 121393 452932 182511 576555 178589 198805 175625
13679 175625 286547 389691 300336 592460 630719 466266 441710 681928 495225 715584
13669 715584 480777 326754 257039 131339 695732 460715 442649 750397 420111 393211
13659 393211 215475 471919 599912 430300 159287 272841 400447 464205 195042 130358
13649 130358 373837 506423 656033 376972 263387 284093 188984 316386 199874 287919
13639 287919 372932 619335 539241 648109 393667 459534 709390 384164 647902 638037
13629F38037l01540K42378B89158L78125k34772j01889J26160J49571B28598L1290
13619B59888J98906A53699K4209M03456j59039J18047r4335K7261N5341k34097
13609B94542r0120L89682B82635J91363p8156A35277L45084k28532J1298J7030
13599B80157A36522J91965K19598o9939A88398N5119A12375L93070k34421J49396
13589D20420J2814Q8391J14381k44090p7972j8809J7321K3900J48287O9028B53236
13577E85563A11730j2664J47613M8094j9519R5640j70153m42K03261J70924k08580
13566C65904A76263K72070k14230K80429o5049j70125q2070J43503G2031J29936
13556B01967J26155A10342K76793j79014m1288L73050A74152J63102j494j0978
$$ plain form
13629 638037 336497 578875 289158 667283 432511 330622 456782 606353 228598 259888
13619 259888 458794 153699 177908 581364 422325 540372 446037 473298 528639 294542
13609 294542 204422 594104 282635 473998 395842 135277 480361 251829 263127 280157
13599 280157 136522 328487 548085 478146 188398 243517 112375 505445 271024 420420
13589 420420 433234 521625 636006 391916 313944 295135 312456 336356 484643 553671 253236
13577 585563 111730 99066 246679 294773 275254 370894 200741 200299 403560 574484 365904
13566 365904 176263 448333 234103 514532 449483 279358 197288 340791 72031 201967
13556 201967 328122 110342 387135 208121 166833 539883 174152 337254 335760 324782
13546C24782A56898J37504C8147M44581B32323L28500j17558m5211j25446L06352
13536E78960j99361L159m6635J29346A04819J46499k4298j12693K54716K5821
13526C94864J35520k00809R8325G7231N3811E2539J06538R6502l8417L44230B17068
13514I5539Q3261J55616J0073K31806j04567k00840J08697j4175m7852H7486O6931
13503A54417J6284p4445J17748K69665o6460C7458K70198q7318A620J50523J24552
13492B76695j12402K77408j61519A00578j4630M4323B5193J69772n1829J37077
13482B80213r7118m6573K21973J79972k51942o5288K8178K8533J02030j18666
13472B61312J08310Q1168C0756N92185C04622i5624H3310J51408J56240A61394
$$ plain form
13546 324782 156898 294402 38147 482728 232323 560823 443265 398054 272608 578960
13536 578960 379599 382758 336123 465469 104819 251318 227020 114327 369043 394864
13526 394864 530384 329575 427900 77231 131042 52539 159077 255579 217162 561392 217068
13514 95539 178800 334416 344489 576295 471728 270888 379585 365410 317558 87486 154417
13503 154417 170701 96256 214004 483669 417209 37458 307656 220338 1620 152143 276695
13492 276695 164293 441701 280182 100578 85948 130271 25193 194965 143136 280213
13482 280213 183095 136522 358495 538467 286525 221237 249415 277948 379978 261312
13472 261312 369622 450790 30756 622941 304622 -95624 83310 234718 390958 161394
13461C84139j73614K24841j29588d4894C1556R3235J14018m0545L03745k08897
13451B93112j34932A9259K40513E0653J00034M5180k556K460c2597j1013A70835
13439a17254F08204A74503m2943M1996J3942P4119A30579R9916f9933B08373m754
13428B03619H0666L41062A68895J66830A60333l8372l5534J40552n0444K74135
13418D50670E312L79116p1011q6655l3783F0076L6644J90054a2263j34754K6285
13407a20732B16852J26677A8222a1248C45139J54142k11333k8104E027K21616
13397B26643I3891B2358M19543F7764P3446K9643R4038J89822j87925G6401O9774
13386A46175a6102n5796A23103J85716J768E5045a67787B65591K04889j23848
$$ plain form
13461 384139 210525 435366 305778 -44894 31556 124791 238809 198264 502009 293112
13451 293112 158180 19259 259772 50653 150687 195867 193311 195771 -32597 -43610 170835
13439 -117254 608204 174503 131560 173556 187498 261617 130579 230495 -69933 208373 203619
13428 203619 80666 421728 168895 335725 160333 121961 86427 226979 176535 450670
13418 450670 5312 384428 313417 226762 192979 60076 96720 286774 -12263 -147017 -120732
13407 -120732 216852 343529 18222 -11248 345139 499281 287948 259844 5027 226643
13397 226643 93891 22358 441901 67764 141210 170853 264891 454713 266788 76401 146175
13386 146175 -16102 -71898 123103 308819 310587 55045 -167787 265591 470480 346632
13376C46632o2911b2206j8425A56729K66887j03290j11449l4988k6721R1969J6678
13365B55815K08790a2499A60797K17375A86725c090B25052n9712K68865A30498
13354D9605M604d3485A77620J08443J3098r3536M7165J98172A58473G1082a912
13342C55973R9128j57635A06600J63006n8511k3455L3872J46702L2226A16581
13331B30931M4515J39470A24271C1720K31674o4384L2191K57463B28795K84030
13321E12825n733j76736n7756l6092o2130m0913O6116f3972K5161A44201B0104
13309B29839b55746g6453A24347b4032D4201K13855I2311K15860n1640A25403
13298A46676c2891A86534m6098P0155R2435m1365J10620g197j7782C26238A15007
$$ plain form
13376 346632 283721 -22206 -40631 156729 423616 320326 208877 173889 147168 239137 255815
13365 255815 464605 -12499 160797 378172 186725 -3090 225052 165340 434205 130498
13354 49605 54209 -43485 177620 286063 299161 205625 252790 450962 158473 71082 -1912
13342 355973 455101 297466 106600 269606 211095 187640 221512 368214 400440 116581
13331 230931 275446 414916 124271 31720 263394 199010 231201 488664 228795 512825
13321 512825 507092 330356 272600 236508 174378 133465 199581 -63972 -38811 144201 20104
13309 229839 -255746 -76453 124347 -24032 44201 258056 92311 308171 256531 125403
13298 146676 -32891 186534 140436 210591 303026 261661 372281 -7197 -24979 326238 115007
13286G4409b8136C57362a27501H3011R0809k8370B6127K59144a53722B03537E8350
13274I5583e8334B74726A21711m363b5254A65358L58410B22801j10868E1106K12986
13263B64092a67338P9027K9986B1159J90203M0492A13539K97038a28121A14678
13252C8989J81340K41046f8924C57692f3986B83937j41102b01110g4792K7956
13242d6836B76180A15132a37051I2815D1139h4794B8130o194J26546K62102I3324
13230A43708K4729j6092J25313j9774J8207r5422J81092j27265J82574A86631
13219B88262a13123D14649j55789m8335q1347b25446A11592l1588N5276R9755
13209B35035D8177M31180c149A89097c1308E2352K03284P0510j50584Q0702c5156
$$ plain form
13286 74409 -28136 357362 -127501 83011 173820 145450 26127 285271 -153722 203537 58350
13274 95583 -58334 274726 121711 117348 -25254 165358 523768 222801 111933 51106 264092
13263 264092 -167338 -88311 -58325 21159 211362 251854 113539 410577 -128121 114678
13252 38989 220329 461375 -68924 357692 -63986 283937 142835 -201110 -74792 -46836
13242 -46836 276180 115132 -137051 92815 41139 -84794 28130 21936 148482 410584 93324
13230 143708 168437 152345 277658 257884 276091 180669 361761 234496 417070 186631
13219 288262 -113123 414649 258860 210525 129178 -225446 111592 80004 135280 235035
13209 235035 48177 479357 -3149 189097 -31308 52352 255636 326146 175562 256264 -35156
13197c3535I9367J36629f8579j24610b0503n6366B9181K78143r4822G3385K14391
13186B87776r7798h7616A94746l6010g1913l78920f5346A13431J42626D2357P381
13175D9738f6377n6768B67677o5254e1805A94135a45020H4559J19091m70a72919
13163F2855c149k3839D07c7164A08340J21693r9212a20819G1766K68792E0599
13151C02359K9375A16047j236K54843B335c2821j12602L8885n308I9677L9985
13140A39662P3264C7430M38089a54927f9027P770a1043j9082k21634H9353a11634
13128I328h6667j96499B72425d1250C1110L2262a45959A45934d3617B17995r1259
13117A26736m8710O9835h7143I1931K001J08237G224c9915j31715d181r5787E0975
$$ plain form
13197 -33535 99367 235996 -68579 -193189 -20503 -76869 29181 307324 212502 73385 287776
13186 287776 189978 -87616 194746 158736 -71913 -450833 -65346 113431 256057 42357 49738
13175 49738 -66377 -123145 267677 202423 -51805 194135 -145020 84559 203650 203180 -172919
13163 62855 -3149 -26988 407 -37164 108340 230033 130821 -120819 71766 340558 50599
13151 302359 331734 116047 114811 369654 2335 -32821 -145423 -106538 -111846 99677 139662
13140 139662 212926 37430 475519 -154927 -69027 -61257 -11043 -30125 -251759 89353 -111634
13128 9328 -86667 -283166 272425 -41250 31110 63372 -145959 145934 -43617 217995 126736
13117 126736 78026 147861 -87143 91931 93932 202169 7224 -39915 -171630 -4181 -99968 50975
13104c04671A8823K73395g3440H2656m0928a71186A09386b13707H5201a27020
13093g3020B14169C0528K36850a55426i458F1849j0832K30125D0543g81B32783
13081A79791G939K12385D252b92353A35273b7525n2741B30622E4054K12611K35035
13070E01700A54355j9768l1071L6877j7628g9328B17073a018A43052o9978b39364
13058A469K69163K1423b79546I5521m4468R9974J87257j42497o2700K0735F8313
13046A37852b16386a0751k56175I4529a33211a0879l12278h8868A53251b86794
13035B02600l8985g107D78165F0738a06953n2749C62272A16199c8261A53473q630
13024A44843C4101J53942n0639J0261K3784f2641B1665K24896c04718F6871b81286
$$ plain form
13104 -304671 18823 292218 -73440 82656 41728 -171186 109386 -213707 85201 -127020
13093 -73020 214169 30528 267378 -155426 -9458 61849 51017 281142 40543 -781 232783
13081 179791 7939 220324 4252 -292353 135273 -27525 -80266 230622 54054 266665 501700
13070 501700 154355 134587 103516 140393 122765 -79328 217073 -1018 143052 73074 -239364
13058 1469 270632 292055 -279546 95521 51053 151027 338284 195787 133087 153822 68313
13046 137852 -216386 -10751 -266926 94529 -133211 -10879 -323157 -88868 153251 -286794
13035 202600 163615 -7107 478165 60738 -106953 -159702 362272 116199 -38261 153473 144843
13024 144843 34101 188043 137404 147665 171449 -62641 21665 246561 -304718 66871 -281286
13012a62613A6214c31115i0694C00083J57220a53845D983K1798J35286p3167r537
13001G9363J57678j11402L75425c3495B11310E8081O105c8579A88614a31579A27182
12989I9695J79333f2167a1994p9149A21684P3541l4617D4810K84294A38544e4579
12977A73049H4121D1829b03675a9097m43465b6299k549q4234m1765M6902H7856
12965i7312I724a08430A41523J87668A52483a32606D50772E3670J13424b69369
12954C58844b5689n2790B03984O3134b7250B08796J56885D9615g5587H1654b21839
12942c83264A82749a95131F182g3805B58307f8928C38784i330l79022B76662D9104
12930D38980b20140A96754B0664L1814L348J43209l1677F6524i1802L6384B1300
$$ plain form
13012 -162613 16214 -331115 -90694 300083 457303 -153845 4983 26781 162067 88900 79363
13001 79363 237041 125639 501064 -33495 211310 58081 64186 -38579 188614 -131579 127182
12989 99695 279028 -62167 -11994 -91143 121684 195225 160608 44810 329104 138544 -54579
12977 173049 84121 41829 -203675 -19097 -462562 -26299 -28848 -113082 -154847 -107945 87856
12965 -97312 9724 -108430 141523 329191 152483 -132606 450772 53670 167094 -269369
12954 358844 -25689 -78479 203984 267118 -27250 208796 365681 49615 -75587 81654 -221839
12942 -383264 182749 -195131 6182 -73805 258307 -68928 338784 -9330 -388352 276662 49104
12930 438980 -220140 196754 20664 52478 55826 199035 167358 66524 -91802 -55418 21300
12918B65466g5998F77262f6337k19985A8322O2497K30763e3806C49945F4273K28898
12907B93171j16000l9342f3090D5981J13631J3796a73643F3546a14180Q274a6188
12895b87746G1743a41546A51281a10437N4182A54873O6984O7001j5541n6760e6005
12883i951A09356L6382d07869B1233a31813j12183G657K44360k8030a6414r0914
12872a07328A50012b07447J03354A33087D9706d4336j980A92080b60016P4387
12862a85629B10515a03072j77194A68235J37668I1998c6040D7129a70251L456
12852a66795P4421r6344C1117a04223J6513F0686J69833p4717E2482b53808A38787
12840a83612F0562R7399D1696J97109I9180e5203B894K18674a11985D14463H9940
$$ plain form
12918 265466 -75998 677262 -66337 -286322 18322 80819 311582 -53806 349945 64273 293171
12907 293171 177171 137829 -63090 45981 159612 173408 -173643 63546 -114180 -105906 -16188
12895 -287746 71743 -141546 151281 -110437 -56255 154873 221857 288858 273317 216557 -56005
12883 -9951 109356 145738 -407869 21233 -131813 -243996 7657 252017 223987 -16414 -107328
12872 -107328 150012 -207447 -104093 133087 49706 -44336 -46316 192080 -260016 -185629
12862 -185629 210515 -103072 -280266 168235 305903 91998 -36040 47129 -170251 -166795
12852 -166795 -92374 -188718 31117 -104223 -87710 60686 230519 155802 52482 -253808 138787
12840 -183612 60562 157961 41696 238805 99180 -55203 2894 221568 -111985 414463 89940
12828B91945e6204l30795i1946F0861g0302H6872h7915j40105q362b9805D2255
12816b22841d7756r4158e5206H6478K1448h4127A11959K54946b8325H309k046
12805F263R8960b15007h8541A57635j0126P0568g2787A34210m9522J05477A0831
12793B58966B6412J47568C8066J38477c56868J49705I8073L19981f4574A99656
12782a31159C6526f0574A42539a91820B62462j10858N1510q7011b75154d3142
12771a01415b1223A15771J28061J01975j54441d0668A1834a25575F7395Q3088
12761A50483d2823n987q3791C02109c3663n5190L5720A10756h9368G8351c04201
12749b94341A14780J10507i159j96150B09985b2986B26182j4714k6961J31640
$$ plain form
12828 291945 -56204 -386999 -91946 60861 -70302 86872 -87915 -228020 -236382 -29805 42255
12816 -222841 -47756 -141914 -55206 86478 107926 -84127 111959 366905 -28325 8309 6263
12805 6263 105223 -215007 -88541 157635 147509 218077 -72787 134210 84688 190165 10831
12793 258966 26412 173980 38066 176543 -356868 -207163 98073 418054 -64574 199656
12782 -131159 36526 -60574 142539 -191820 262462 151604 203114 116103 -275154 -43142
12771 -101415 -21223 115771 243832 345807 191366 -40668 11834 -125575 67395 150483
12761 150483 -42823 -48810 -132601 302109 -33663 -88853 -53133 110756 -89368 78351 -304201
12749 -294341 114780 225287 -9159 -205309 209985 -22986 226182 211468 184507 316147
12739C16147m7003F3111K47482k0474h4836a154n9174A30755f6953H5901J63653
12728B49554a26904A23112E5599g2126n7966k6049c5550F0450N2931R4758q022
12717B00117G7269a99429h9375E2209Q3329K44451g0456b5428D7530J82108B7576
12705C30653E0641h0919D00917G3408N8838e7935C25201d1569j5677p6049B55598
12693C4735d1492B56788b3716j01209E5391R4875e0037j20213j66439A71395P7830
12682B49225r0986D6023a37672D90657B4723J21632b01638D32648r5690d7932
12671i6195k00538A92847e242B88734A593a14482F3139a32973j36322B0457K32144
12660B52601j18643f8952h426C58285I974L0052c60478D07511B4741a50547A06399
$$ plain form
12739 316147 269144 63111 310593 290119 -84836 -1154 -60328 130755 -66953 85901 249554
12728 249554 -126904 123112 55599 -72126 -130092 -156141 -35550 60450 113381 208139 200117
12717 200117 77269 -199429 -89375 52209 135538 379989 -70456 -25428 47530 229638 27576
12705 330653 50641 -80919 400917 73408 132246 -57935 325201 -41569 -57246 -133295 255598
12693 34735 -41492 256788 -23716 -124925 55391 150266 -50037 -170250 -336689 171395 249225
12682 249225 158239 46023 -137672 490657 24723 146355 -201638 432648 336958 -47932
12671 -96195 -296733 192847 -5242 288734 1593 -114482 63139 -132973 -269295 20457 252601
12660 252601 133958 -68952 -8426 358285 9974 40026 -360478 407511 24741 -150547 106399
12648A72556C3302J67117a22663L7869C79554a52660A76973G6627J01455J0936
12638A89018N5122a38036A08744M51439G0460a273C0424J11174h0106F7083k4343
12627D2740L28954a53130B07648a01836J651B23438N8153j23179l4829J9417C4387
12615a05166A10106L4829R5890f935A25833c7624A28581c5749n2635j00606A66655
12603G0606L76161a9243B2446o090N9266K11993j27209c1833C8829d0496A21561
12591F4263P9643l4075b78899B2535L16379h4491i712p2601m6223A8174N2173
12580G0347J85032d5563k7487H4093c1328o3707B02166E5137a49933M5480C12484
12568A1853L3111j3280J48814a49412j47668a06875l885m3613A69690K01419F3008
$$ plain form
12648 172556 33302 200419 -122663 -84794 379554 -152660 176973 76627 178082 189018
12638 189018 244140 -138036 108744 560183 70460 -1273 30424 141598 -80106 67083 42740
12627 42740 371694 -153130 207648 -101836 -100185 223438 281591 158412 123583 143000 34387
12615 -105166 110106 144935 240825 -6935 125833 -37624 128581 -35749 -88384 -188990 166655
12603 70606 446767 -19243 22446 16356 75622 287615 160406 -31833 38829 -40496 121561
12591 64263 143906 109831 -278899 22535 338914 -84491 -9712 -82313 -128536 18174 70347
12580 70347 255379 -45563 -73050 84093 -31328 -95035 202166 55137 -149933 -104453 312484
12568 11853 44964 31684 180498 -149412 -297080 -106875 -110760 -154373 169690 371109 63008
12556f2649H6750L6033J40112g8361B65351H132J05615f38k57696h4722A7564
12544B19140R7515j43754D2364K19511a88628k04569B0368J08227E8869b11331
12533a69250B50818a58262f531C31526b38908A48313a77942A63563G6982b95942
12522a14465j75006h1318k3606I6540A9831c06656d0970B73437j13412k4381l7625
12511I8019a91564i1484A09536F409K03911I5895B1604L35745A04377a18599A81428
12499e4731n8362k60955a16727N2509D4399K2756b04815F3087L25J11438D8915
12487G2506J14900a21329A84143I1576J9610e3702B46414a24992B03696I6807
12476B57110J79877A4311L08501B3794d1881C50635a15095B65255B956h892j49800
$$ plain form
12556 -62649 86750 122783 262895 -78361 265351 8132 113747 -638 -258334 -84722 17564
12544 219140 316655 172901 42364 261875 -188628 -393197 20368 128595 58869 -211331
12533 -169250 250818 -158262 -6531 331526 -238908 148313 -177942 163563 76982 -295942
12522 -114465 -289471 -81318 -104924 96540 19831 -306656 -40970 273437 160025 135644 98019
12511 98019 -191564 -91484 109536 6409 210320 95895 21604 357349 104377 -118599 181428
12499 -54731 -113093 -374048 -116727 -64218 44399 67155 -204815 63087 63412 174850 48915
12487 72506 187406 -121329 184143 91576 111186 -53702 246414 -124992 203696 96807
12476 257110 436987 14311 322812 23794 -41881 350635 -115095 265255 2956 -8892 -158692
12465a58692O2114D778J36914d2765a2983p0626K6650C685a19004m551B09896
12453B90049a78129E4940a8053k2889H8790i4669n0497d874A20559D2299j4605
12442B7694N4727g0451p1527c7073j17286B43654N732b71337A29239b76549d1678
12430H4620a82024a3089n4126b0518r8174e178j43523k5337A22465l232i5331
12418a44573B8388O0262N1041f9126g072l4345B4632J19530a21519B34489p6987
12407A57502o9780a86431Q7901a7927A03536h4845C8474Q5606E4311a59192A85095
12395a10722b8955k22791E1677a83437A35355n5383b13853A39673E3923d7053
12384F286d4229D8903J22200F1597k5718N8835B162a73388C6583L1724a16349
$$ plain form
12465 -158692 -96578 4778 141692 -42765 -12983 -83609 -56959 3685 -119004 -123555 209896
12453 290049 -178129 54940 -18053 -40942 88790 -94669 -145166 -4874 120559 42299 27694
12442 27694 82421 -70451 -141978 -37073 -154359 243654 249386 -271337 129239 -276549 -41678
12430 84620 -182024 -13089 -67215 -20518 -118692 -5178 -148701 -174038 122465 119233 -95331
12418 -144573 28388 88650 139691 -69126 -7072 -41417 24632 144162 -121519 234489 157502
12407 157502 87722 -186431 -98530 -17927 103536 -84845 38474 124080 54311 -159192 185095
12395 -110722 -28955 -251746 51677 -183437 135355 79972 -213853 139673 53923 -47053
12384 6286 -44229 48903 171103 61597 35879 94714 2162 -173388 36583 68307 -116349
12372c07061f2630k49842A12761c4527l11398n0109B15945H2842J43442E7386
12361a75321j33489B0706c81287A3220J86387f0187F4370J60682D1369a09073
12350A36297f6291B36953d6290C98383b16289a03222d8416j87006J06592d6574
12339h949F2191J12202Q193i4837j07131g3746A27265a29459e8071j80421n678
12328b44170J17214a0068k7809k12668b0239B35563p0459a76361I2612D4103R8143
12317A42246a92586A08983a21117j16933A38769F4389a27409C93791A74076a47912
12306A43342a64359B77109d98242B4085M92224B10103c37599a4602I235a07533
12295d13668B75484J34771c26173a12406j16293f168B08601b28218c27k23848
$$ plain form
12372 -307061 -62630 -312472 112761 -34527 -345925 -396034 215945 82842 226284 57386
12361 -175321 -308810 20706 -381287 13220 199607 -60187 64370 225052 41369 -109073
12350 136297 -66291 236953 -46290 398383 -216289 -103222 -48416 -235422 -128830 -46574
12339 -8949 62191 174393 182586 -94837 -201968 -73746 127265 -129459 -58071 -238492 -244170
12328 -244170 -126956 -10068 -37877 -250545 -20239 235563 165104 -176361 92612 44103 142246
12317 142246 -192586 108983 -121117 -238050 138769 64389 -127409 393791 174076 -147912
12306 143342 -164359 277109 -498242 24085 516309 210103 -337599 -14602 9235 -107533
12295 -413668 275484 410255 -326173 -112406 -228699 -6168 208601 -228218 -327 -224175
12285b24175B30165o6759a68155A75902p4798J63343B1908R6806L286n113K8098
12274A44985J2831K51872I3462K9130J76080f0598a6983B61543a31567D5229c6428
12262I4682e2416C56398a00457B1770K84525f4380j42969Q5180D74592g4606D96
12250C17404J26927F8356l3990J7193A2861J1097K34221J51098j86461a91343
12239E8613J43603e4352B07873F8243K06761A20470l4128a9384B42519O1411B5091
12227C19085K6772j55209e4636B31727j06894J98308I9405J56078L8203b26930
12216B20558b1495n8682A63245h8961B64120a69657O8867A22394a29075A22848
12205C63779A6967K46301D1916K51407G3530l6190K6620b05237a8358C42679K27096
$$ plain form
12285 -224175 230165 163406 -168155 175902 101104 264447 21908 118714 122000 116887 144985
12274 144985 157816 409688 93462 122592 298672 -60598 -16983 261543 -131567 45229 -36428
12262 94682 -52416 356398 -100457 21770 306295 -64380 -207349 -122169 474592 -74606 496
12250 317404 444331 68356 34366 51559 12861 23958 258179 409277 222816 -191343
12239 58613 202216 -54352 207873 68243 275004 120470 86342 -19384 242519 303930 25091
12227 319085 345857 190648 -54636 231727 124833 323141 99405 255483 293686 -226930
12216 220558 -21495 -80177 163245 -88961 264120 -169657 -100790 122394 -129075 122848
12205 363779 16967 263268 41916 293323 73530 37340 63960 -205237 -18358 342679 569775
12194E69775j92855G2796a76522C12702n7390I0521M1450n8743J34373J4778r3989
12183A28390b29822A28383o394d7307A57887J65853B698L35012h2175A26425a66464
12171C3918K9871l1602L7578J2025K20698G6058j3409f110q1445H5569K8647K2525
12159A36741a55637B26685l6887g0016j55875o1687C4269M6413a5440j46498A12617
12147A25331i8267B47618o5895r359K00403j56179a46969A0488J5543e4871F87
12135B46382c2920A57940F870C108J64361p5881L6981f742m6071B06635J10029
12124C16664a10453h334r9973d1817j91124E6041N4863C1595K6692g4753D2199
12112B7620i2615E8843J09929K42839b3205C7375g6198h539l73828A67489a6282
$$ plain form
12194 569775 376920 72796 -176522 312702 255312 90521 131971 73228 207601 222379 128390
12183 128390 -229822 128383 121989 -47307 157887 323740 2698 337710 -82175 126425 -166464
12171 33918 63789 32187 69765 81790 302488 76058 62649 -6110 -87555 85569 114216 136741
12159 136741 -155637 226685 189798 -70016 -225891 -287578 34269 80682 -15440 -161938 112617
12147 125331 -98267 247618 181723 172364 372767 216588 -146969 10488 26031 -54871 687
12135 246382 -32920 157940 6870 3108 167469 91588 128569 -6742 -52813 206635 316664
12124 316664 -110453 -8334 -108307 -41817 -232941 56041 110904 31595 58287 -74753 42199
12112 27620 -92615 58843 168772 411611 -23205 37375 -76198 -8539 -382367 167489 -16282
12100a06708A52197a9864j24361m1609R0138A03994k1103c40364B58773a93305
12089d7980C34271A2401J20105Q5707a52176L589H3205K00277A26627a43413j57406
12078c00819A90755a63687i266o9906F5189b74181c6323D3629a58270A24509D7438
12066A31622O1319a31500A28805m523o637J16099n4460K41047J298205J6056G84446
12054A78599n498p6964B7082b7511o879c211A0585Q4154m6222m213a67626a3413
12041h9535k46911N111g5268F5202K87849A37072a44638r049F070a10239J1680
12030i8559d7197m0842A30693a78942A97477a39106N8724D7492D282J62600H0505
12018b3394j22111C20409G6858f7069A78150a06178G9334i4390I4439e1591a7446
$$ plain form
12100 -106708 152197 -19864 -144225 -185834 -95696 103994 82891 -340364 258773 -193305
12089 -47980 334271 12401 132506 218213 -152176 -148587 83205 283482 126627 -143413 -300819
12078 -300819 190755 -163687 -9266 -79172 65189 -274181 -36323 43629 -158270 124509 47438
12066 131622 192941 -131500 128805 124282 117645 233744 179284 420331 1718536 1734592 784446
12054 178599 173101 96137 27082 -27511 -34390 -3211 10585 94739 48517 44304 -167626 -13413
12041 -89535 -336446 -331335 -75268 65202 353051 137072 -144638 -153687 6070 -110239 -98559
12030 -98559 -47197 -88039 130693 -178942 197477 -139106 -80382 47492 4282 166882 80505
12018 -23394 -145505 320409 76858 -67069 178150 -106178 79334 -94390 94439 -51591 -17446
12006A72965b2622A27239h4418A3210R0286J8537g7893j00433E5262h9629B84669
11994c93894a78452A40935b05628A00561K25273E7130c93729a7616j57070e2820
11983a6364G2954a9171C0609J44035H3595C5272D537d6633A45322e8442C4130
11971B08926i5407j49806A91994c2642J0797o9659K2004A69387b53798L1669d8463
11959h85A35057f4513j8450I2643N5687a90574O2219l11966A49252D9600K41650
11948B91250G7981h5969k00723g4087A64384A6576J54520K06569a07600B56346
11937A26033a91697j86391C5241j3881a8116j9579k59373a07841A65453N9971
11927B25424a07490G1052c30245F4972P8102d4112j98898B18857J63126a70108
$$ plain form
12006 172965 -22622 127239 -84418 13210 103496 122033 -77893 -178326 55262 -89629 284669
11994 -393894 -178452 140935 -205628 100561 325834 57130 -393729 -17616 -174686 -52820
11983 -16364 72954 -19171 30609 174644 83595 35272 4537 -46633 145322 -58442 34130
11971 208926 -95407 -245213 191994 -32642 -21845 -91504 -69500 169387 -253798 -222129 -48463
11959 -885 135057 -64513 -82963 92643 148330 -190574 -128355 -440321 149252 49600 291250
11948 291250 77981 -85969 -286692 -74087 164384 16576 171096 377665 -107600 256346
11937 126033 -191697 -378088 35241 21360 -18116 -37695 -297068 -107841 165453 225424
11927 225424 -107490 71052 -330245 64972 143074 -44112 -243010 218857 381983 -170108
11916a79879L1941f3375m77167a85637Q8635A56654J2804b57308B47318c5385
11905A25196n0153J29828e2875B57087J86043d4795m4567j77293B8007K00037
11895B28044j04668a07478C2872j4062M0699J20499G2666b91225a30957A61241
11884F3704c1712A05596c71057J79303A08590a81713F0085e6783I4827f5616m3328
11873a08944C1573a64395B02839J5099a21565F4977i9560I3109L3297D1540b03028
11861b16549k50594H9067i3667H251L07217j52363a26607n402A38265E8892a11533
11849B55755a45683E765R4266b59719J03036d4180E1138d891n5694K4988k92367
11838c27964B56099b5590D888J91205c56026A84248a95872A92361f8596A23521
$$ plain form
11916 -179879 -147938 -63375 -540542 -185637 -97002 156654 169458 -257308 247318 -35385
11905 125196 75043 204871 -52875 257087 443130 -44795 -89362 -266655 28007 228044
11895 228044 123376 -107478 32872 18810 59509 180008 72666 -291225 -130957 161241
11884 63704 -31712 105596 -371057 -191754 108590 -181713 60085 -56783 94827 -65616 -108944
11873 -108944 31573 -164395 202839 217938 -121565 64977 -99560 93109 126406 41540 -203028
11861 -216549 -467143 89067 -93667 8251 315468 163105 -126607 -132009 138265 58892 -111533
11849 255755 -145683 5765 100031 -259719 -156683 -44180 51138 -4891 -60585 -35597 -327964
11838 -327964 256099 -25590 4888 196093 -356026 184248 -195872 192361 -68596 123521
11827b54624K7566A7507f191B37155h1051L1902C57840a5378H4012J40069a22474
11815i8868l8553H9686a59075A85828A1715a83995B76577a24892A18889f77177
11804C6876Q8274a41754B09452P803b58992q8249B21672E4787a62839L8515c7528
11792d41622h964j49540A53369c8675k08170P1408J9167B43776b65939E4774a05818
11780b80000m8903C7725K74355I5756m6093O4096b31451M4023I9168B9531L63461
11769C92992e0085A07627f5796A76076b33614O395a6196C18102g3795c1945k0951
11758e2896A5974a63265A14761c63821B43387f8286C9666L30985E4048K47394
11748C01442c4382B46696B6717L29133b14705d0676j00829e1270B28334g7985
$$ plain form
11827 -254624 -227058 17507 -6191 237155 -81051 -49149 357840 -15378 84012 224081 -122474
11815 -98868 -137421 89686 -159075 185828 11715 -183995 276577 -124892 118889 -677177
11804 36876 125150 -141754 209452 217255 -258992 -347241 221672 54787 -162839 -124324 -37528
11792 -441622 -8964 -158504 153369 -38675 -246845 -175437 -156270 243776 -265939 54774 -105818
11780 -280000 -328903 37725 312080 95756 49663 113759 -231451 -187428 99168 29531 392992
11769 392992 -50085 107627 -65796 176076 -233614 -227219 -16196 318102 -73795 -31945 -52896
11758 -52896 15974 -163265 114761 -363821 243387 -68286 39666 370651 54048 301442
11748 301442 -34382 246696 26717 355850 -214705 -40676 -141505 -51270 228334 -77985
11737A74887a42130K1446n37e3774l7106B38161c38336A27498J60625A43499m5593
11726I7906b11899k5367b3252A28079b74050c8476j34230B42708a17433A77684
11715A04773c74102J56588g2261g255D990N5432a47664k00525A12234c5944o1480
11704i7424F6467A916J36141b7282A5431J83259N0821d0928A32769f1182D18266
11692B08174J0666a05988I555d7906A86387L5788b24070i9770L4199j4257c3540
11680c8597A39196m8246a39693G0871K10946D9745c40874B08281J20037a76348
11669B00970E70Q5656K56597A12089R4198m3850J445O627a26804D1147O5086B8763
11656G1652b87137H750B522J00761Q107O689a9114r7350A42500e2302q3766k11309
$$ plain form
11737 174887 -142130 -120684 -121221 -53774 -90880 238161 -338336 127498 288123 143499 97906
11726 97906 -211899 -237266 -23252 128079 -274050 -38476 -172706 242708 -117433 177684
11715 104773 -374102 -217514 -72261 -7255 4990 60422 -147664 -348189 112234 -35944 -97424
11704 -97424 66467 1916 138057 -27282 15431 198690 249511 -40928 132769 -61182 418266
11692 208174 218840 -105988 9555 -47906 186387 222175 -224070 -99770 -65571 -79828 -33540
11680 -38597 139196 90950 -139693 70871 281817 49745 -340874 208281 328318 -176348
11669 200970 570 86226 342823 112089 206287 162437 163882 170509 -126804 41147 106233 28763
11656 71652 -287137 8750 2522 103283 111390 118079 -19114 -116464 142500 -52302 -136068 -347377
11644c47377g9358I3986a87780A1753E634a78711M8249H0238K91366A78796C403
11632i3613A50315b50923B91005b94001A10751K3813b19381n1028F5122J10703
11622A75825d6481C67506c4040k0444j2852n3574c9395B31057d0186n8650L9722
11611e9114A21740a15110Q184b7003I8118K1921b34258C31822a87047j00654e6889
11599I5495j3897J04101c91102A56210b46058A06735J14263A6681g4036A40415
11588A04443J40162A7094f4629f210B47207G4046e3726I4255M6670R6540J34389
11577C71854a63584B45318a09930A28057a21201C04134A43174M40888A65991J41126
11567C07117j42742J36312A48452c4616R93p0976B06848m1424b29322j08568J48781
$$ plain form
11644 -347377 -79358 93986 -187780 11753 5634 -178711 -130462 80238 371604 178796 3403
11632 -93613 150315 -250923 291005 -294001 110751 134564 -219381 -270409 65122 175825
11622 175825 -46481 367506 -34040 -54484 -67336 -120910 -39395 231057 -40186 -98836 -59114
11611 -59114 121740 -115110 -106926 -27003 98118 120039 -234258 331822 -187047 -287701 -56889
11599 95495 81598 185699 -391102 156210 -246058 106735 220998 16681 -74036 140415
11588 104443 244605 17094 -64629 -6210 247207 74046 -53726 94255 140925 237465 371854
11577 371854 -163584 245318 -109930 128057 -121201 304134 143174 584062 165991 307117
11567 307117 164375 300687 148452 -34616 -33623 -104599 206848 165424 -229322 -337890 -189109
11556a89109I2795j3043g521k04603R4659A55131K8988G5145b12613a3329E02668
11544B42266i3476A74035o4411K26437C1022a7704H2045c6051A87812a01889a3116
11532B76857a8638A24373J7707k4670b6101I5587m4239J67944L6226q8766d9164
11520b11100B6145P6826l8587P5441M8708R0476f6488r9651D62265h6736E4876
11508D01406b0225p8265I2049i1626c8785l39659g9557A53221K08550j55749c89450
11496i1080A47833k6434A2944a27604d1364A72757p2239b33370A71433M16254
11486E87687A71496h4935B56523C5108b4871B32972o2929p9916K84737i009B28029
11474A9394b7197A74310b2338G8694g6516A78081q7250M1377O5619L1004H3496
$$ plain form
11556 -189109 92795 79752 -7521 -212124 -117465 155131 184119 75145 -212613 -13329 502668
11544 242266 -93476 174035 109624 336061 31022 -17704 82045 -36051 187812 -101889 -13116
11532 276857 -18638 124373 142080 117410 -26101 95587 51348 219292 255518 166752 -49164
11520 -211100 26145 102971 64384 139825 188533 279009 -66488 -166139 462265 -86736 54876
11508 401406 -20225 -98490 92049 -91626 -38785 -378444 -79557 153221 361771 206022 -389450
11496 -91080 147833 121399 12944 -127604 -41364 172757 100518 -233370 171433 587687
11486 587687 171496 -84935 256523 35108 -24871 232972 170043 90127 374864 -9009 228029
11474 19394 -27197 174310 -22338 78694 -76516 178081 90831 132208 197827 228831 83496
11462C15372k1524d6430A02717b14810B62221a2683B91394d0464C0507L03538
11452C34045a16215B41352a34123N0731G8181c1393A14629k120N5918b81211A82501
11440b6681H0279C7164a88462A03193E1488R7798B5056Q2027L13024A4871J83887
11429A98758C9244j4262Q2749b55914j85439a02777a5248H4121R5294d688G7312
11417a65884e1204n1700L0810A41764k3852b8247C271c3847k90514l8668A52935
11405C4101J28239o5977I602a82573B60897A09150h8869A97814q6046I440a53026
11393B43337p6376c5205k612l6277A92304c1290A04721J32759a07078j41690A6260
11381b9825A79214a5006j6506l5290A08975L8602f7584B36406j04823l3975a65567
$$ plain form
11462 315372 293848 -46430 102717 -214810 262221 -12683 291394 -40464 30507 334045
11452 334045 -116215 241352 -134123 -83392 78181 -31393 114629 112509 168427 -281211 182501
11440 -26681 80279 37164 -188462 103193 51488 149286 25056 107083 420107 14871 198758
11429 198758 39244 24982 107731 -255914 -441353 -102777 -15248 84121 179415 -4688 77312
11417 -165884 -51204 -102904 -72094 141764 117912 -28247 3271 -33847 -324361 -363029 152935
11405 34101 162340 96363 9602 -182573 260897 109150 -88869 197814 111768 9440 -153026
11393 243337 166961 -35205 -37817 -74094 192304 -31290 104721 237480 -107078 -248768 16260
11381 -29825 179214 -15006 -31512 -66802 108975 147577 -67584 236406 131583 97608 -165567
11369A44569J21057G8357a92683l02144F975a76468B53303F8405h9170o7839A64596
11357B51181L2839a9446q533G8755B416N1407a52018a580I0741j3920b45205C0594
11344E7170L2431K4921B0395m17J2676F437L24753a06924I028J42095m5959D2322
11331C41714o5988a61094I361J240a78112o2869C6032i7774B7719d7162a7007
11319C35048b36599C2660b22719B08427m9808b90301G7701J44125r4114L04612
11309D32324b13460B78b52873p0895o9126B8556J37712c42727a0719k42456I4240
11297i1875A42708a801C13943n7348c3122j08374H6807d8495C20680a60082n3268
11286b13350a04357n0924c3781F6699a23562k04403A30367d2984k52054Q3872
$$ plain form
11369 144569 265626 78357 -192683 -494827 6975 -176468 253303 68405 -89170 -157009 164596
11357 251181 284020 -19446 -27979 78755 2416 53823 -152018 -1580 90741 76821 -245205 30594
11344 57170 89601 114522 20395 19978 32654 6437 331190 -106924 9028 151123 105164 42322
11331 341714 275726 -161094 9361 10601 -178112 -240981 36032 -97774 27719 -47162 -17007
11319 335048 -236599 32660 -222719 208427 158619 -290301 77701 221826 127712 432324
11309 432324 -213460 278 -252873 -323768 -392894 28556 166268 -342727 -10719 -253175 94240
11297 -91875 142708 -1801 313943 256595 -33122 -141496 86807 -48495 320680 -160082 -213350
11286 -213350 -104357 -155281 -33781 66699 -123562 -327965 130367 -42984 -295038 -211166
11276b11166A09406m2982f4075A32606a891j39131C4587d5200e220j30292d3071
11264c20302C5907i0840a8478A49432J60767f6240f735B25880A7912b62897G4900
11252b28648d2308F40L254b02038O0782M7753l55319D276K98472b17211R0416
11241a26795d2116B02253I7452g0878B72430c23615A68260C9014d7362e671k8741
11230c4412B28416A5195K7599K51940H1751b25307A50182a13984A26128c40850
11219A69366a30258d8803k04366B6512b7463B0517f2094J5738j18880r5837g7307
11207a7767j91859c4986m40354b16526B50219c11224a7076A2918a43641c6529
11196a60801e8168g865m5564q4179k84453h6135C27917j51617a38645a7262A98532
$$ plain form
11276 -211166 109406 66424 -64075 132606 -1891 -141022 34587 -45200 -5220 -135512 -43071
11264 -320302 35907 -90840 -18478 149432 310199 -66240 -6735 225880 17912 -262897 74900
11252 -228648 -42308 640 3894 -202038 -141256 -93503 -448822 4276 302748 -217211 -126795
11241 -126795 -42116 202253 97452 -70878 272430 -323615 168260 39014 -47362 -5671 -34412
11230 -34412 228416 15195 42794 294734 81751 -225307 150182 -113984 126128 -340850
11219 169366 -130258 -48803 -253169 26512 -27463 20517 -62094 -46356 -165236 -261073 -77307
11207 -17767 -209626 -34986 -475340 -216526 250219 -311224 -17076 12918 -143641 -36529
11196 -160801 -58168 -7865 -53429 -137608 -422061 -86135 327917 176300 -138645 -17262 198532
11184f8373j16772A2119P3475a37583k33184a4142j62024Q6511A05405c8908B5281
11172c29922H5438a44260q2863R3303D6082K76327a62147B87513l1726r5366a18628
11160b62140E0647f523G8687b75497E4212h1648p9341m3324G7975j9490c11591
11148A21075a57292E0052J26381K5114h4097B5211J11078b2355i801A48480P7733
11137B26213O5742J63866I2397a06929m9364b2325D07348O8666k22617c1511m1513
11126g3024k0427F7363j2446P5644E7505K79556A14918a1163j20822L8124B00483
11114d6651n1995L6149j99846L5460E8566A1295J19649L748j4411J02866C3863
11102e3099A49375a14176A8575P6946C7746L03899B9223d1553B38194b5884m885
$$ plain form
11184 -68373 -185145 12119 85594 -137583 -370767 -14142 -176166 -89655 105405 -38908 25281
11172 -329922 85438 -144260 -227123 -133820 46082 322409 -162147 287513 255787 160421 -118628
11160 -262140 50647 -6523 78687 -275497 54212 -81648 -160989 -204313 77975 58485 -311591
11148 121075 -157292 50052 176433 201547 -84097 25211 136289 -22355 -9801 148480 226213
11137 226213 291955 455821 92397 -106929 -156293 -22325 407348 476014 253397 -31511 -73024
11126 -73024 -93451 67363 54917 130561 57505 337061 114918 -11163 -131985 -93861 200483
11114 -46651 -98646 -62497 -262343 -226883 58566 11295 130944 134692 120281 223147 33863
11102 -53099 149375 -114176 18575 95521 37746 341645 29223 -41553 238194 -25884 -30769
11091c0769o6729J7920H5623J17652K5882c6708C77194K8059J02602B15178M6012
11080B61190k4219m545J80188k1618j07433L1116D9951L14395j49187R1874J70206
11069D77239j21610l3784q6160K15839A47133L65647K83119A53191L21204L1084
11059E05479F4511N01867J67797l14987K38821j55627J16580k20309L31959l56373
11049C74239M88494l19708L39927j48999k43593K58520K81j88326k899m5295K67617
11038G80258J68954D68937J41602K56541p2338R7289Q7511k49907r0481L33259
11028I72413D39938K26835K02728j40660k8444J21607j40702R0906P3463l24238
11018E21433J46281j70588j3380R6417Q1370K32266k57233R244q4008J98162k54787
$$ plain form
11091 -30769 -97498 -79578 85623 203275 229157 -36708 377194 405253 507855 215178 261190
11080 261190 236971 232426 412614 390996 283563 314679 49951 364346 215159 307033 477239
11069 477239 355629 321845 235685 451524 147133 512780 795899 153191 474395 505479
11059 505479 64511 566378 734175 419188 658009 502382 618962 398653 730612 374239
11049 374239 862733 543025 882952 733953 490360 748880 749161 560835 557936 512641 780258
11038 780258 949212 468937 610539 867080 794742 892031 979542 729635 639154 972413
11028 972413 439938 666773 869501 728841 700397 822004 681302 772208 845671 521433
11018 521433 667714 497126 483746 580163 661533 893799 636566 645810 561802 759964 505177
11007E05177L58151k77298l9311L15658J12319l87847j75391K57611J0824K20725
10997I00618j77237m4898q4843K6813J3273q2634Q0060O9746j80969J96735N0628
10986G67292P6658n5112M25820j96121p8074J95239J82369m3275P27K97672n551
10975A567644M63951K53341k45013O72867m6728N05647m43086j15681J12368l498
10965B721812l73636o10295N7740j11133N5928q7336l1759l15816L23062J36062
10955A764629k71887J30225k65128l57198K03224C99982M33560j47729P1758C64732
10944A57917R0144D4970J49396p0581M44751A95842g718B26645J38720a07204
10933e6978C0965J8264e3166B04994p2182a18753a1004F8626f784A27789e1392
$$ plain form
11007 505177 863328 586030 546719 862377 974696 586849 411458 669069 679893 900618
10997 900618 723381 678483 593640 620453 633726 551092 631152 700898 519929 716664 767292
10986 767292 843950 788838 1214658 1018537 940463 1135702 1318071 1274796 1275523 1573195 1567644
10975 1567644 2031595 2284936 2039923 2712790 2666062 3171709 2728623 2612942 2725310 2721812
10965 2721812 2348176 1737881 1795621 1684488 1740416 1653080 1621321 1305505 1628567 1764629
10955 1764629 1492742 1622967 1357839 1000641 1203865 399982 833542 685813 757571 364732
10944 157917 248061 44970 194366 123785 568536 195842 -7718 226645 365365 -107204
10933 -56978 30965 49229 -53166 204994 132812 -118753 -11004 68626 -6784 127789 -51392
10921b05004F5001j8253L933J58571b30282J11594K5465j07565A66379a272j17374
10910a18646J7955A80063H5192k1792D763a80092D1199g9710k4564I3462E946
10898e6233G5636B6938M6064A7837b09853C55000A10268b99876A30497A4652Q3750
10887I8402c86519A89654n9004b39700B1572a68366G2077A3992R557c3099k9279
10876f2378F983J21880c4322j6551F651f3592b314B2726b81196C80445a12467
10864B25710q4020P0667d37857C88333A0424J53105f0771m268B35386a8981j01159
10853a20140A74072l9115E4419K4832J17674r8324N6262g6281E349a98577P9873
10842a18704A33565a38183G0141J59862a30956l6784o3725A84510b5853m6878
$$ plain form
10921 -205004 65001 46748 50681 209252 -230282 -118688 -93223 -200788 166379 -1272 -118646
10910 -118646 -100691 180063 85192 63400 4763 -180092 41199 -79710 -104274 93462 5946
10898 -56233 75636 26938 73002 17837 -209853 355000 110268 -299876 130497 14652 98402
10887 98402 -386519 189654 130650 -239700 21572 -168366 72077 13992 23549 -33099 -62378
10876 -62378 6983 128863 -34322 -50873 6651 -63592 -2314 22726 -281196 380445 -112467
10864 225710 141690 212357 -437857 388333 10424 163529 -60771 -65039 235386 -18981 -120140
10853 -120140 174072 134957 54419 79251 196925 98601 154863 -76281 5349 -198577 -118704
10842 -118704 133565 -138183 70141 230003 -130956 -167740 -231465 184510 -25853 -72731
10832g2731A7757c29263f8572A92049b630j15005D6370M7720C8823b05546A64387
10820c18244A01502D7970m034a8348A26505K1252c46535h7604G7988b9031m0080
10809f9111j96960B35364A550c36012f2399j63056H598f7418a7380j30748O9800
10798g8328K0140A01304b38928B1853O0900Q3489m7512d78899a05076j02753P7953
10787a29876j28133P4695g5340b7312J2125B15909A550b01075G0565b2024j09353
10776a31377n8001B7778a10566B24728b65939D9617a23752J0372k2150n2965A13307
10764A25613B3183a64572M1993k9720A10225A6907b4261c513A59675n7965c83386
10752A49111a65136F4140b4461j13604j60423J15460H2525O2876a21371N4832
$$ plain form
10832 -72731 17757 -329263 -68572 192049 -2630 -117635 46370 94090 38823 -205546 164387
10820 -318244 101502 47970 43936 -18348 126505 147757 -346535 -87604 77988 -29031 -69111
10809 -69111 -266071 235364 1550 -336012 -62399 -225455 8598 -67418 -17380 -148128 -78328
10798 -78328 -58188 101304 -238928 21853 82753 166242 118730 -478899 -105076 -207829 -129876
10787 -129876 -258009 -183314 -75340 -27312 -15187 215909 1550 -201075 70565 -22024 -131377
10776 -131377 -189378 27778 -110566 224728 -265939 49617 -123752 -113380 -135530 -188495 113307
10764 125613 23183 -164572 -122579 -152299 110225 16907 -24261 -3513 159675 101710 -383386
10752 149111 -165136 64140 -24461 -138065 -298488 -183028 82525 145401 -121371 -66539
10742f6539j2125j04778c1267j39412B05658j4664r4456K12999D2212a31999k62539
10731c94538g5006e577k6267n306k29609c9813A63990E3640a36491J5152B27951
10719a81561P8524o2255A31g5652c4236k5815A54065g8717m89651B42370j15359
10708A27011J82085h750k20980E2791J36303H1442J52963H0630a94941b1445B23521
10696B4425c00704a14586k39712i7199B3143a2376m4936o456C4754J23416K3563
10685A81733a12291G4943a0358j50005a9029j35047k99336J12807a42825j50605
10675b93430J28786e9903A55013f5226n5272L1542k51529a32811j43115A43228
10664a92691Q3287j4090d630B643b24517L5505q791H9118a47983F8453b03828
$$ plain form
10742 -66539 -78664 -183442 -31267 -170679 205658 190994 96538 309537 42212 -131999 -394538
10731 -394538 -75006 -5577 -31844 -37150 -266759 -39813 163990 53640 -136491 -121339 227951
10719 -181561 -103037 -165292 131 -75652 -34236 -60051 154065 -78717 -568368 242370 127011
10708 127011 309096 -8750 -229730 52791 189094 81442 234405 80630 -194941 -21445 223521
10696 24425 -300704 -114586 -354298 -97199 23143 -12376 -57312 -63768 34754 158170 181733
10685 181733 -112291 74943 -10358 -160363 -19029 -154076 -453412 -340605 -142825 -293430
10675 -293430 -164644 -59903 155013 -65226 -120498 -88956 -340485 -132811 -275926 143228
10664 -192691 -109404 -123494 -4630 2643 -224517 -189012 -197803 89118 -147983 68453 -203828
10652c372A87107c4530o7359D32671g9590D3529a17480d2139A14365a89354A74216
10640g7923f462A57438O160d28771J7815J33063M2361I8790A4785b71458A94582
10628i7616j03861L5463C0126e4347A81469a71163B11891f6754A09622B0875a92536
10616d47866d4143I5490J04160b258r0817j13466R6750c9272A34249c12321C2013
10604h0661K3500A11710l9464g0710A03527j8301h1791m0644A720b45929F729
10592a01690A43234E0680h9300A21495a4892p8482A06184h7854b3657p0433B99252
10580f1257l85542g6517B00409a32106j417L2152n9877A24343D3751a09485L4424
10569g5061A85279H955M3342P5347g2351A96965F7843c21626F9554f4377E392
$$ plain form
10652 -3372 187107 -34530 -101889 432671 -79590 43529 -117480 -42139 114365 -189354 174216
10640 -77923 -6462 157438 163598 -428771 -410956 -277893 -235532 98790 14785 -271458 194582
10628 -97616 -201477 -166014 30126 -54347 181469 -171163 211891 -66754 109622 20875 -192536
10616 -447866 -44143 95490 199650 -2258 -93075 -206541 -109791 -39272 134249 -312321 32013
10604 -80661 -57161 111710 72246 -70710 103527 85226 -81791 -122435 1720 -245929 6729
10592 -101690 143234 50680 -89300 121495 -14892 -93374 106184 -87854 -23657 -94090 299252
10580 -61257 -446799 -76517 200409 -132106 -133523 -101371 -161248 124343 43751 -109485 -75061
10569 -75061 185279 8955 52297 127644 -72351 196965 67843 -321626 69554 -64377 5392
10557A08192h6302b8592G2540I885N7600a11844N667k94411A78678g6063A2630
10545a87394E7101M6887a33833K9702p3357d6258C457K16321D6756J37626a20119
10533i3210H1149c3393C21022H6424l5946J75473a24744M3225C18371b41948h8628
10521a84983D5718M9694J02790F507J57827a68024K9889Q438H8191E737L14905
10510C20642b09359k39529a38136N378k4511o4791n9495H4172c9319A69883l5339
10499A34544b14104a03533r3544a8185A612a37055I9033K23261e2374l97446d1379
10487A67678p7939a31551a0606H1592C0919K42811j2397C7220N66204m7641r2490
10476D63293I0441O6097p502m7854d6627L592j85602F0563J54660C9983g5509
$$ plain form
10557 108192 -86302 -28592 72540 9885 67485 -111844 -106177 -400588 178678 -76063 12630
10545 -187394 57101 103988 -133833 -104131 -177488 -46258 3457 219778 46756 184382 -120119
10533 -93210 81149 -33393 321022 86424 50478 225951 -124744 -81519 318371 -241948 -88628
10521 -184983 45718 95412 198202 6507 164334 -168024 -138135 -129697 88191 5737 320642
10510 320642 -209359 -448888 -138136 -132758 -157269 -222060 -281555 84172 -39319 169883 134544
10499 134544 -214104 -103533 -197077 -18185 1612 -137055 99033 322294 -52374 -449820 -41379
10487 167678 89739 -131551 -10606 81592 30919 273730 261333 37220 603424 555783 463293
10476 463293 90441 156538 149036 101182 -46627 -43035 -228637 60563 215223 39983 -75509
10464g5745F741f6373J5014a6611r2687j05743b8167B83562E15b22598M6832A89389
10451A44391d2341C195a5992D670b31322H5177M64727a06676j749j38772A00957
10439A16041O3624D6697K20308b58855B6319g7039A71239b92112A24926L1976
10429A56902M9646M9850I8725j4730a28674l5915g5211A13557c38369G3674a20261
10417a06042B0926h7116h133A36097J43909d86787a35451a6248j10581q2252C43435
10405E696a41658A80936J7164J6970B547J14895b81429G3024L089C6858J9498
10394E6356K33406c82093D27444A48619Q7733e2897A9531J97550M9324c03987
10383h5568j75852A24724R4372f530B79553r1766o4664Q1851K72023A14156R4091
$$ plain form
10464 -75745 6741 -66373 -51359 -16611 -109298 -215041 -28167 283562 515 -222598 -175766 189389
10451 144391 -42341 3195 -15992 4670 -231322 85177 549904 -106676 -108425 -247197 100957
10439 116041 179665 46697 267005 -258855 26319 -77039 171239 -292112 124926 156902
10429 156902 206548 256398 98725 83995 -128674 -164589 -75211 113557 -338369 73674 -120261
10417 -106042 20926 -87116 -8133 136097 280006 -486787 -135451 -16248 -126829 -209081 343435
10405 5696 -141658 180936 198100 215070 2547 117442 -281429 73024 76113 36858 56356
10394 56356 289762 -382093 427444 148619 236352 -52897 19531 217081 266405 -303987
10383 -85568 -261420 124724 219096 -6530 279553 187787 123123 204974 476997 114156 208247
10372B08247J5718m1506K40273K0658c7232F97464L04496D80302j9188r4921M8598
10361D14791M4419K2089d1813B76718K69666E8486J38043L40911k03742D6312
10350F25539k94110K28630k44748r9949M5491q4676J61416j25331R7151H1606
10339b55159B14464p0980l4353J70460j27338O7437a39372A33867e6651A4884
10328a10528H2589b94813A14318a92765D19262B08090R2379K92213k70642A00891
10317e3381A94011o6358R9007N489D2053J67614a60471B43295l3388a29935N9519
10306g0416j37500A81261a97347e4830I4173f6486l98795j3887A31957a90241
10295D2273a48832B1158K06455e3340a7582r560A87377B7193b00768A02434a70276
$$ plain form
10372 208247 223965 182459 422732 443390 -37232 697464 1001960 480302 461114 366193 414791
10361 414791 459210 481299 -41813 276718 546384 58486 196529 537440 333698 46312
10350 625539 331429 560059 315311 215362 260853 176177 337593 212262 309413 81606
10339 -255159 214464 143484 109131 279591 152253 219690 -139372 133867 -56651 14884
10328 -110528 82589 -294813 114318 -192765 419262 208090 300469 592682 322040 100891
10317 -53381 194011 127653 226660 232149 42053 209667 -160471 243295 209907 -129935 -70416
10306 -70416 -207916 181261 -197347 -54830 94173 -66486 -465281 -479168 131957 -190241
10295 42273 -148832 21158 227613 -53340 -17582 -27142 187377 27193 -200768 102434 -170276
10283A49714e5753A1100d03052J24473I0245C2826g8481L6685k44130C1786K2703
10272E4489A251a3239A90025i1348E8810M2421c3740E0101K7141b34031j50669
10261c84700F6243b28356A51996N6281l0073Q0058p4049K20320A7412O0537b32526
10249a38635A00010O3045a53787q4762A94970F9926J94190e9070p957L2275j19671
10238a54423k09529A10461N6763a4194B06836b4860k3577A92379E541b7399F9602
10226g1851q0159H5297B5685K45322b75110F4154a03056A89981b27399k77761
10216e05160f7890A31350a9395F8870b9178B00190a63838A43311b00338b2527
10205b51274B08028r7177b60478A05116a01696A8075K5931A3696c897q3346K4486
$$ plain form
10283 149714 -55753 11100 -403052 -278579 90245 32826 -78481 -41796 -285926 31786 54489
10272 54489 1251 -13239 190025 -91348 58810 101231 -33740 50101 77242 -234031 -384700
10261 -384700 66243 -228356 151996 208277 178204 258262 184213 404533 17412 77949 -232526
10249 -138635 100010 163055 -153787 -238549 194970 69926 264116 -59070 -67027 -34752 -154423
10238 -154423 -363952 110461 167224 -14194 206836 -24860 -48437 192379 5541 -27399 69602
10226 -71851 -152010 85297 25685 271007 -275110 64154 -103056 189981 -227399 -505160
10216 -505160 -67890 131350 -19395 68870 -29178 200190 -163838 143311 -200338 -22527
10205 -251274 208028 110851 -260478 105116 -101696 18075 44006 13696 -3897 -87243 -62757
10194f2757B91842a5068C54110a47544B6417j0175a39464A11709a11083I7310
10183a25661C2825b14566h2823f556k6931A7898J84942c66665J57696m960M7490
10172a66439b2427C6648J28362B7041a82717j13694B29288b48429E9732a72193
10161b77022F6423a07615d7883l9454B16592N3668a13767M2786l04602h8776j79016
10150b67792d4588k54371B79607D1348c27634a06089B1632c35214J49373Q808
10140a77033I3516g1672k49807C04796i4899F2063b65206q083C00970C0306R9141
10129A29447O5811G7085c73332g611A35941i1215k2622p6182j9184L820l6267
10118b41650e6904k7108k1069M8054P815B3770g0684k05j46846G5754c0343A51383
$$ plain form
10194 -62757 291842 -15068 354110 -147544 26417 16242 -139464 111709 -111083 97310
10183 -125661 32825 -214566 -82823 -6556 -33487 17898 202840 -366665 -208969 -213929 -166439
10172 -166439 -22427 36648 165010 27041 -182717 -296411 229288 -248429 59732 -172193
10161 -277022 66423 -107615 -47883 -87337 216592 270260 -113767 -70981 -375583 -88776 -267792
10150 -267792 -44588 -298959 279607 41348 -327634 -106089 21632 -335214 -185841 -177033
10140 -177033 93516 -71672 -321479 304796 -94899 62063 -265206 -273289 300970 30306 129447
10129 129447 195258 77085 -373332 -7611 135941 -91215 -113837 -190019 -209203 -205383 -241650
10118 -241650 -56904 -84012 -105081 -57027 -49212 23770 -70684 -70889 -217735 75754 -30343 151383
10105b8055A61134c8986l4682J4059j64969K2882M4684D3950b07971a2527k86390
10094b98917e3179B83808E306f9182A7363a71l78175a35651G9967h2315j85715
10083b68030A42104o2326c80107l6590J92106D9839a26680C289J17796b809m80861
10072d83670D218c44462H4098m261L5237K77855a39570D62898c66580H4769a01897
10060A074c37759J32187E8851K06896a58138g7687m0164j03741C47746b45384
10049a9174B558R0363b798j61428B0215b35513J09545m2829d9447A46542c81029
10037i2601E6838h2160G3866c28028i7522G3048a2983j28807e0683A7773c48432
10025i1116k2691c4017n27922A4314K2394f2591k8750m2907C7004f655j52596
$$ plain form
10105 -28055 161134 -38986 -73668 -59609 -224578 -201696 -157012 43950 -207971 -12527 -298917
10094 -298917 -53179 283808 5306 -69182 17363 -171 -378346 -135651 79967 -82315 -268030
10083 -268030 142104 79778 -380107 -416697 -224591 49839 -126680 3289 121085 -2809 -483670
10072 -483670 4218 -344462 84098 79837 115074 392929 -139570 462898 -366580 84769 -101897
10060 1074 -337759 -205572 58851 265747 -158138 -77687 -117851 -221592 347746 -245384
10049 -19174 2558 92921 -2798 -164226 20215 -235513 -125968 -168797 -49447 146542 -381029
10037 -92601 56838 -82160 73866 -328028 -97522 73048 -12983 -141790 -50683 17773 -348432
10025 -91116 -113807 -34017 -561939 14314 36708 -62591 -91341 -134248 37004 -6655 -159251
10014a59251C92721c28295J21807c9326m0766k7308C8915e1174A80293a4502q6560
10003a01062j57404B2821a30512d584m5450l71846B04816c24360d0961E9588b43268
9991c62432J02523A09070e1439A07117c61699a37539o4313f1623A10976P3991
9981A84967I903b56534l9363A94764a8942H8940a23578q7582C87256d09522a76112
9969b76186M9523O4078m5128O4450q7818q2392B3223c4280k42785J32320O2749
9958h1996l48760a34983b7616k23151p3338J32461A22367a25140k2710C29065
9947a74034L6655j25636a25021j2273A4020N41c4632j51216G067J94963l3314
9936A68716a53069c1486B6474a60809A02046a47836b3569m8477A42491b74578
$$ plain form
10014 -159251 392721 -328295 -206488 -39326 -80092 -107400 38915 -51174 180293 -14502 -101062
10003 -101062 -258466 22821 -130512 -4584 -50034 -421880 204816 -324360 -40961 59588 -243268
9991 -362432 -259909 109070 -51439 107117 -361699 -137539 -201852 -61623 110976 184967
9981 184967 9903 -256534 -295897 194764 -18942 88940 -123578 -211160 387256 -409522 -176112
9969 -276186 -226663 -162585 -207713 -143263 -231081 -313473 23223 -34280 -277065 -144745 -81996
9958 -81996 -430756 -134983 -27616 -250767 -324105 -191644 122367 -125140 -147850 329065
9947 -174034 -137379 -263015 -125021 -137294 14020 14561 -34632 -185848 7067 202030 168716
9936 168716 -153069 -31486 26474 -160809 102046 -147836 -23569 -72046 142491 -274578
9925a64579c066k02740l4227B178a06899C8886a18021D961c8904q5987R028e538
9912F7836a34297B5244J8233c9065H2060a92637F9480H766h9526l29125J34221
9901b84430g9071n9744l9708k0095B98546e5353j86023a02434g211D7998a02658
9889b40356Q784F1575b7737A79532a51635d236j44343B739M39653A75133b03007
9877d4326j20983B97704f8666q4250q1062C0068a02972j33653J17496l3958b011
9865f3167C4570a72179a9723A96491p1908a1900l60153J74182i7241d1533m93835
9854e35368A03907a20716B9024K73060c3093A78702D3744a72811D0039a16124
9843A83735D6633N8619a4419q4411o6063J2675A93840b01861E2924a7195k92550
$$ plain form
9925 -164579 -3066 -205806 -240033 2178 -106899 38886 -118021 4961 -38904 -124891 -115863 -5538
9912 67836 -134297 25244 43477 -39065 82060 -192637 69480 8766 -89526 -418651 -284430
9901 -284430 -79071 -138815 -178523 -198618 298546 -55353 -241376 -102434 -7211 47998 -102658
9889 -240356 -231572 61575 -27737 179532 -151635 -4236 -148579 2739 442392 175133 -203007
9877 -44326 -165309 297704 -68666 -152916 -233978 30068 -102972 -236625 -119129 -153087 -2011
9865 -63167 34570 -172179 -19723 196491 124583 -11900 -372053 -197871 -97241 -41533 -535368
9854 -535368 103907 -120716 29024 302084 -33093 178702 43744 -172811 40039 -116124
9843 183735 46633 105252 -14419 -98830 -164893 -152218 193840 -201861 52924 -17195 -309745
9832c09745J54098O9188j04760A7061g5542A50849F3427N419c51229k50079C730
9820b08439A00403R7974F0416K16816a98368F0497c18246K8401C5139h970k5974
9809c4944j26354B31026a82819L8734O787p0949J03560L8383j16028L7546J3396
9798a31390j01847A16006O7167a55726F4173c22638L6080B3863g5078f802l29218
9787c36020i5574k18920a07740C63646a84325d1250C8112k085O4720l3592h5009
9775h6623j6277B87420a91069A39309d8409n4940C74419A36294c3754g622j55721
9764a63343K1702l3234g598F3209J8636f8011k37499B8737f4023n608A17368b79129
9751c14527B8803f976A21482m9577a85241E4257c06709Q7961q5386A19395d0920
$$ plain form
9832 -309745 -155647 -86459 -191219 17061 -75542 150849 63427 68846 -351229 -601308 3730
9820 -208439 100403 198377 60416 277232 -198368 60497 -318246 -289845 35139 -8970 -34944
9809 -34944 -161298 231026 -182819 -144085 -137298 -208247 -104687 -66304 -182332 -144786 -131390
9798 -131390 -233237 116006 183173 -155726 64173 -322638 -286558 23863 -75078 -6802 -336020
9787 -336020 -95574 -314494 -107740 363646 -184325 -41250 38112 36027 100747 67155 -85009
9775 -86623 -102900 287420 -191069 139309 -48409 -103349 374419 136294 -33754 -7622 -163343
9764 -163343 -141641 -174875 -7598 63209 81845 -68011 -305510 28737 -64023 -69631 117368 -279129
9751 -314527 28803 -6976 121482 71905 -185241 54257 -306709 -218748 -304134 119395 -40920
9739F3981b15505A69733e6573D50631a73214A32427k9130f7339O244r7402L3559
9728a24938E1755d1670B7951a18661M3786k36073A90289a23536k79513g8435H0320
9716A28697K32172A1147e1682a7105q6587Q709J3029m0197j22816J01991f5854
9704c4492A5439a5448C36269i9068a5927k28779B5005a11158l79496a00459M2235
9693e8224l43984A15680J5704a02741r9379a7588A09647C1253c54836Q1214a00053
9681c04038a13456b3173m0518K1026r436j72378N5664m61648b65040h1440A30927
9669A12858c76037f9382j95679g512m2941l77760e6918j07416n3910R5759E1643
9657A16602J10198a57777O3771l3992d9389A60075a18554a0074k63395f9574p5756
$$ plain form
9739 63981 -215505 169733 -56573 450631 -173214 132427 103297 -67339 -61095 -158497 -124938
9728 -124938 51755 -41670 27951 -118661 -74875 -310948 190289 -123536 -403049 -78435 80320
9716 128697 360869 11147 -51682 -17105 -103692 -94983 -81954 -122151 -244967 -142976 -65854
9704 -34492 15439 -15448 336269 -99068 -15927 -244706 25005 -111158 -490654 -100459 -58224
9693 -58224 -402208 115680 131384 -102741 -202120 -17588 109647 31253 -354836 -273622 -100053
9681 -304038 -113456 -23173 -63691 -42665 -52101 -224479 -168815 -630463 -265040 -81440 130927
9669 112858 -376037 -69382 -265061 -7512 -50453 -428213 -56918 -164334 -218244 -122485 51643
9657 116602 226800 -157777 -94006 -127998 -49389 160075 -118554 -10074 -273469 -69574 -145330
9646a45330B91732C6345K03934b94554B95756b25203k49971I0476c99783J43172
9636b56611f7620H1127a80450G0656Q2854A8939K47610j06976b3330j91895A94061
9624c35145p5507B16380a08771B5769K4750b5126B32601a83532A28273c75123
9613a41176A52625E6694J27485b10921H8812f2425B68733e70265h0500j18142
9603a98642A81211a80794o0839b326D6513a91872b695A72851J54986H8004e3617
9591E7673b46674H9931k7810a47600g1970k44093l4377i6138B85899a178o6484
9580f7662p2538e3648j92627c7763j83320e4551A71240d2484H5480a86489B16274
9568C38456A19805E8195c7694B36469A14602C238Q1717J7415N3355f9647l48012
$$ plain form
9646 -145330 291732 36345 240279 -294554 295756 -225203 -475174 90476 -399783 -256611
9636 -256611 -67620 81127 -180450 70656 153510 18939 266549 159573 -23330 -215225 194061
9624 -335145 -410652 216380 -108771 25769 50519 -25126 232601 -183532 128273 -375123
9613 -141176 152625 56694 184179 -210921 88812 -62425 268733 -570265 -80500 -198642
9603 -198642 181211 -180794 -241633 -2326 46513 -191872 -2695 172851 327837 88004 -53617
9591 57673 -246674 89931 62121 -147600 -71970 -316063 -350440 -96138 285899 -1178 -67662
9580 -67662 -140200 -53648 -246275 -37763 -221083 -54551 171240 -42484 85480 -186489 216274
9568 338456 119805 58195 -37694 236469 114602 3238 84955 102370 155725 -69647 -417659
9557d17659e1942a3333l19360i5316J0606A6837p286a12233j82287f9032A22396
9545c91022O2202D812a50872B17834b5794A27414a43148j12445g4264j12870d474
9533a16370c4352l5242B29414i6978j54715K7673R4535j23120M246A57850a66545
9521b11118B47932c65580A83672b14373O7161I0244a83549J3721j29124f6835
9510a36193j37413q7250a79760j07292E7611M3259C9398b08740A08550c01124
9499G2703J2393c65660J66131Q3941F0620Q0438m6142A3603L3918f1941D0336
9487g9115j17719L8798B63956G8945a35788J2379j39035B15744b99513a0937A73883
9475a01533l2238k03838a3722D8233D117c02468P7515a9359j79099e9969E8850
$$ plain form
9557 -417659 -51942 -13333 -332693 -95316 -84710 16837 9551 -112233 -294520 -69032 122396
9545 -391022 -328820 4812 -150872 217834 -25794 127414 -143148 -255593 -74264 -187134 -4474
9533 -116370 -34352 -69594 229414 -96978 -251693 -224020 -129485 -252605 -248359 157850 -166545
9521 -211118 247932 -365580 183672 -214373 -147212 90244 -183549 -169828 -298952 -66835
9510 -136193 -273606 -360856 -179760 -287052 57611 100870 39398 -208740 108550 -301124
9499 72703 85096 -365660 -199529 -115588 60620 141058 94916 13603 47521 -61941 40336
9487 -79115 -196834 -158036 263956 78945 -135788 -123409 -262444 215744 -299513 -10937 173883
9475 -101533 -133771 -337609 -13722 48233 4117 -302468 -224953 -19359 -198458 -59969 58850
9463D7054b00676B02123b41785b7284E7364b48891d6942l64554A82596b14181
9452f6588A34100j9253J0764a66234i865n2558F7584b33109J02911c2542r9260
9441a31802k51595a82563N1442A55792g3798C4761K68765a3391r8784a0481B09042
9429A58709b2362j43799L8262C58493a67926a5311A7479a01555A44008d36642
9418A44840b6742j35769H8395b38681A19797k751b233j55457n439L5888A27835
9406B2407a50848C0855a2599j32606E7815a77591N2559M2471F1493b90779L3405
9395b57374m9486P9070G0245a42962f7523D20391a84405j14788H3750m1737b37672
9383b16291c5207k82115N0570A07796N0950n0129A4246J85440A0658L49221a59438
$$ plain form
9463 47054 -200676 202123 -241785 -27284 57364 -248891 -46942 -411496 182596 -214181
9452 -66588 134100 114847 125611 -166234 -9865 -62423 67584 -233109 -130198 -32542 -131802
9441 -131802 -383397 -182563 -131121 155792 -73798 34761 303526 -13391 -112175 -10481 209042
9429 158709 -22362 -166161 -127899 358493 -167926 -15311 17479 -101555 144008 -436642
9418 144840 -26742 -162511 88395 -238681 119797 117046 -2233 -157690 -163129 -127241 127835
9406 22407 -150848 30855 -12599 -145205 57815 -177591 -125032 -82561 61493 -290779 -257374
9395 -257374 -306860 -227790 70245 -142962 -67523 420391 -184405 -299193 83750 42013 -237672
9383 -216291 -35207 -317322 -266752 107796 158746 108617 14246 199686 10658 359879 -159438
9371b0170l4042r1957f7765J5697q1312q8467C3657h6181a0641j46836F3001A8256
9358a73799P0746b5731k12661e3426j86217g3588B1815h124B2858a41537j9837
9347a61374B21551a48104A20452a81625e0728o6335F4596b74189J21061b258B9900
9335a9205C9732J69332b7598I8991c24945a14012l79808A03687a30995p0180p6039
9324b77214A69890H2499a53819l6820B8078a50577J8417b6173E910d15807a07870
9312f9521B12781b37015I5076a44134j11395j75936J72956M1696f9884o2584B2841
9300b20960c5792C42304A1573c6083k14531j98400a50751A18403f0170n2980j11768
9289b24918l3403e0846D3134h9828A0443e8475C58449b49550i3567b8962k15585
$$ plain form
9371 -20170 -54212 -146169 -67765 -52068 -133380 -221847 33657 -86181 -10641 -157477 63001 18256
9358 -173799 -103053 -25731 -238392 -53426 -239643 -73588 21815 -8124 22858 -141537 -161374
9347 -161374 221551 -148104 120452 -181625 -50728 -117063 64596 -274189 -153128 -2258 29900
9335 -19205 39732 209064 -27598 98991 -324945 -114012 -493820 103687 -130995 -201175 -277214
9324 -277214 169890 82499 -153819 -190639 28078 -150577 -132160 -26173 5910 -415807 -107870
9312 -69521 212781 -237015 95076 -144134 -255529 -431465 -258509 -216813 -69884 -132468 22841
9300 -220960 -35792 342304 11573 -36083 -250614 -449014 -150751 118403 -60170 -113150 -224918
9289 -224918 -258321 -50846 43134 -89828 10443 -58475 358449 -249550 -93567 -28962 -244547
9278b44547C4498L3910d7823A69290a60603e7216j06696B54357f5763A93513D3357
9266c44350A4259J37096h1663A01175J75765d132H6449c3261p8017e5490A52927
9254D1396h6921D4324a11394C5327a10105q037G0716a81508h0206C8i2215r474
9242a01689G0457b44095i7599A54373b7605r0136k17480h7643B1383a56260B180
9230i4377b8836l4357E6002b16634d7666j7983k64262J26701D2535e3534B42200
9218i2618k46466a33597p4633e8551j29941C1677c10155Q0181A48075b6625j93081
9207b19706g636E8045b31226B002i5126A03361A4602a67731E0613d7955j22086
9196a70041A79102a78578B23003a72524A79477j7756k0880B5586d45911c4008
$$ plain form
9278 -244547 34498 68408 -47823 169290 -160603 -57216 -163912 254357 -65763 193513 43357
9266 -344350 14259 151355 -81663 101175 276940 -4132 86449 -33261 -111278 -55490 152927
9254 41396 -86921 44324 -111394 35327 -110105 -118142 70716 -181508 -80206 38 -92215 -101689
9242 -101689 70457 -244095 -97599 154373 -27605 -117741 -335221 -87643 21383 -156260 2180
9230 -94377 -28836 -63193 56002 -216634 -47666 -65649 -329911 -203210 42535 -53534 242200
9218 -92618 -339084 -133597 -208230 -58551 -188492 31677 -310155 -229974 148075 -26625 -219706
9207 -219706 -7636 58045 -231226 2002 -95126 103361 14602 -167731 50613 -47955 -170041
9196 -170041 179102 -178578 223003 -172524 179477 161721 140841 25586 -445911 -34008
9185d132r1661j00360L0159C42501a25622a2189l4390k5937j85795b5181e898
9173a05030F6733K37567c8133a4156j45922E9347b93887N1216B37194d04540i5764
9161e7587C81147b33762l3715h2007B33056j07501j5798c1589i970k46070e3782
9149c50388g7813p6233A64982g3749Q23l64689F3186J92819a3563A62021a26991
9137b1105k51412d2936j21216b6634D1483h8139k18574E5382b5598l5970j87063
9126b48631a07212L8960l8480A94867a63495F9013g7439j12659R639H1086g849
9114H622O6287b83895r91C7461b61354O5535f72H9211e5946l15281H3138c12756
9101E02722D9850c81616J32918D6773A6245J0838M0600r408N8913B5954N5021
$$ plain form
9185 -4132 -95793 -196153 -165994 342501 -125622 -12189 -46579 -72516 -258311 -25181 -5898
9173 -105030 66733 304300 -38133 -14156 -160078 59347 -293887 -242671 237194 -404540 -95764
9161 -57587 381147 -233762 -267477 -82007 233056 125555 109757 -31589 -9970 -256040 -53782
9149 -350388 -77813 -154046 164982 -73749 -72926 -437615 63186 256005 -13563 162021 -126991
9137 -21105 -272517 -42936 -164152 -26634 41483 -88139 -306713 55382 -25598 -61568 -248631
9126 -248631 -107212 -68252 -106732 194867 -163495 69013 -77439 -190098 -180459 81086 -7849
9114 8622 74909 -283895 -284886 37461 -261354 -195819 -672 89211 -55946 -371227 83138 -312756
9101 502722 49850 -381616 -248698 46773 16245 27083 67683 58275 117188 25954 80975
9090H0975b9025k8965H2457c38789P6502e1434B9832a55366k178P2576l9100N3697
9078g0371j76875J16191j14551K5090D2228Q2175f9813k31293A7788P1525a07650
9066B42478E0579a35832A06980e7481A34979g8532G6933i5983B58494Q9915A25684
9054b82836h6791j30497C0313f160C9462O4494b89006A7076K20857f4918r0109
9043a55027C19401a36911A41329a11836l14037A89466i229k40956i1465o9063
9033a60528k8284M3885f3565m2620l9497r5259j86134D7652J40500b94932L3606
9022b61326m3382a15195l88j1812D0581K18940h2811j29938k56265A11812a87678
9010a16908A19637a53833L8471q8028M0374B71367a80688B16361n8385A2844b17400
$$ plain form
9090 80975 -29025 -57990 82457 -338789 -262287 -51434 29832 -155366 -157544 -84968 -124068 -70371
9078 -70371 -247246 -131055 -245606 -220516 42228 124403 -69813 -301106 17788 89313 -107650
9066 242478 50579 -135832 106980 -57481 134979 -78532 76933 -95983 258494 348409 125684
9054 -282836 -86791 -217288 30313 -6160 39462 103956 -289006 17076 237933 -64918 -155027
9043 -155027 319401 -136911 141329 -111836 -425873 189466 -9229 -250185 -91465 -160528
9033 -160528 -188812 -144927 -63565 -106185 -145682 -240941 -427075 47652 188152 -294932 -261326
9022 -261326 -304708 -115195 -115583 -127395 40581 259521 -82811 -212749 -469014 111812 -187678
9010 -116908 119637 -153833 -115362 -203390 -163016 271367 -180688 216361 157976 12844 -217400
8998a12338p9754B59249g7832A50753J43360d25223H0266c41193a40395A25736
8987a51044A8185K46917a31833H745b85420O1232f4753j41813m6685C35579a08450
8975b69222Q0169f397n3398A78189a49956e6635j22330A23214c9768j76309p4183
8964b90260F4009J55755b84937f5936F0531a63864j0855O5084A92345a02498A4627
8952g2760A08944a77446h8489A738K56111e6629J411j86267M625f3536A35544
8940a45094F1096B1733P0854J09421l3734R5563K86299k35245l7798a03822A03469
8928B37419j1979k9182K32673L7433Q77732K225717O138733O790281q203655B654419
8917G66455J61318B53867l2695F3562K20235a14326C4756a04205A95739l7224
$$ plain form
8998 -112338 -192092 259249 -77832 150753 294113 -425223 80266 -341193 -140395 125736
8987 -151044 18185 265102 -131833 8745 -285420 -224188 -64753 -206566 -253251 335579 -108450
8975 -269222 -189053 -6397 -59795 178189 -149956 -56635 -178965 123214 -39768 -216077 -290260
8964 -290260 64009 219764 -284937 -65936 60531 -163864 -174719 -109635 192345 -102498 14627
8952 -72760 108944 -177446 -88489 1738 257849 -56629 -55218 -241485 -236860 -63536 135544
8940 -145094 61096 21733 92587 202008 168274 263837 550136 314891 277093 -103822 103469
8928 237419 225440 196258 428931 466364 1344096 3569813 9708546 16498827 8295172 2654419
8917 766455 927773 253867 221172 63562 283797 -114326 34756 -104205 195739 158515
8907A58515n8400g3970j08444P5323L9583j74225i4318K7745A7761o471b6197
8895A75425a78859F0865j2061a02170L2347n5847p760E2457a26691j11977A34753
8883f9618m6573k93241B9747h9719J274D7501b2234n0821C8113a67999j27755
8872b95754a11960j62338a02347c1603j1610j06106D32157b2817l81001a73234
8861i2152j06923C13774b04862d2292j27713I3610K82341i1692c5709j95079M9090
8850a81698g540j81996Q886f5713j22680a4051B2616N8782b4802C05873a38866
$$ plain form
8907 158515 100115 -73970 -182414 -107091 -67508 -241733 -94318 -66573 17761 11290 -26197
8895 175425 -178859 60865 48804 -102170 -69823 -125670 -133430 52457 -126691 -238668 134753
8883 -69618 -116191 -409432 29747 -89719 -88445 47501 -22234 -73055 38113 -167999 -295754
8872 -295754 -111960 -274298 -102347 -31603 -43213 -149319 432157 -22817 -403818 -173234
8861 -92152 -199075 313774 -204862 -42292 -170005 93610 375951 -91692 -35709 -230788 -181698
8850 -181698 -7540 -189536 -180650 -65713 -188393 -14051 22616 81398 -24802 305873 -138866
$$ [...]
##END NTUPLES=NMR SPECTRUM
##END=
