##TITLE=AC1474_ZNESNA300_8100857_HIgwmcBgB9
##JCAMPDX= 6.0         $$ Bruker NMR JCAMP-DX V2.0
##DATA TYPE= NMR SPECTRUM
##DATA CLASS= NTUPLES
##ORIGIN= BRUKER
##OWNER= Administrator
$$ 1.72 TOPSPIN		Version 2.1
$$ 2013-08-15 15:57:54.325 -0700  Administrator@X
$$ Compression mode = diff/dup
##.OBSERVE FREQUENCY= 400.02188249412
##.OBSERVE NUCLEUS= ^1H
##.ACQUISITION MODE= SIMULTANEOUS (DQD)
##.ACQUISITION SCHEME= undefined
##.AVERAGES= 64
##.DIGITISER RES= 22
##SPECTROMETER/DATA SYSTEM= spect
##.PULSE SEQUENCE= noesygpps1d.comp
##.SOLVENT NAME= COFFEE_meoh
##.SHIFT REFERENCE= INTERNAL, COFFEE_meoh, 1, 14.96114
##AUDIT TRAIL= $$ (NUMBER, WHEN, WHO, WHERE, PROCESS, VERSION, WHAT)
$$ ##TITLE= Audit trail, TOPSPIN		Version 2.1
$$ ##JCAMPDX= 5.01
$$ ##ORIGIN= Bruker BioSpin GmbH
$$ ##OWNER= Administrator
$$ $$ E:\/data/COFFEE/nmr/AC1474_ZNESNA300_8100857_HIgwmcBgB9/32/pdata/1/auditp.txt
$$ ##AUDIT TRAIL=  $$ (NUMBER, WHEN, WHO, WHERE, PROCESS, VERSION, WHAT)
(   1,<2013-08-15 15:57:49.325 -0700>,<Administrator>,<X>,<go>,<TOPSPIN 2.1>,
      <created by zg
	started at 2013-08-15 15:46:19.318 -0700,
	POWCHK enabled, PULCHK disabled,
       configuration hash MD5:
       C8 4E 4E 5D D3 5C D8 9E 9F 52 82 E0 59 8A DE 15
       data hash MD5: 64K
       61 20 B5 8D 0B 9C 43 10 60 D9 D8 B9 B9 CE 02 52>)
(   2,<2013-08-15 15:57:52.325 -0700>,<Administrator>,<X>,<proc1d>,<TOPSPIN 2.1>,
      <Start of raw data processing
       efp LB = 0.3 FT_mod = 6 PKNL = 1 PHC0 = 0 PHC1 = 0 SI = 128K 
       data hash MD5: 128K
       CB DD 14 08 C7 65 E4 DA 5A 73 79 AA 2B 64 08 B0>)
(   3,<2013-08-15 15:57:53.325 -0700>,<Administrator>,<X>,<proc1d>,<TOPSPIN 2.1>,
      <pk PHC0 = -78.37097 PHC1 = 0 
       data hash MD5: 128K
       0B 69 40 66 15 95 2F 5B B0 87 17 4C 6D A1 54 18>)
(   4,<2013-08-15 15:57:53.763 -0700>,<Administrator>,<X>,<proc1d>,<TOPSPIN 2.1>,
      <abs ABSG = 1 
       data hash MD5: 128K
       15 86 D8 53 BB 9C DA 0B 1B 82 E3 B1 67 B4 29 67>)
(   5,<2013-08-15 15:57:53.856 -0700>,<Administrator>,<X>,<proc1d>,<TOPSPIN 2.1>,
      <abs ABSG = 2 
       data hash MD5: 128K
       9D 04 41 3B 58 65 17 9B ED 67 05 70 D5 B6 35 6A>)
(   6,<2013-08-15 15:57:53.919 -0700>,<Administrator>,<X>,<proc1d>,<TOPSPIN 2.1>,
      <abs ABSG = 3 
       data hash MD5: 128K
       B4 47 7E 74 86 46 16 98 BC 79 71 25 E2 9B DA DE>)
(   7,<2013-08-15 15:57:53.997 -0700>,<Administrator>,<X>,<proc1d>,<TOPSPIN 2.1>,
      <abs ABSG = 4 
       data hash MD5: 128K
       E3 B3 FB 21 1F 00 CE 14 14 68 8A 75 EF C6 7C 25>)
(   8,<2013-08-15 15:57:54.091 -0700>,<Administrator>,<X>,<proc1d>,<TOPSPIN 2.1>,
      <abs ABSG = 5 
       data hash MD5: 128K
       52 99 F3 BA D0 83 62 6E 48 8F 2B 16 A2 CE 50 2D>)
$$ ##END=
$$ 
$$ $$ hash MD5
$$ $$ FB B2 A6 D3 5E 8B 6F 66 99 B1 57 F8 BB FD 29 51
##$RELAX= 
##$RELAX= 
##$RELAX= 
##$RELAX= 
##$RELAX= 
##$RELAX= 
##$RELAX= 
##$RELAX= 
$$ Bruker specific parameters
$$ --------------------------
##$DU= <E:\>
##$EXPNO= 32
$$ [...]
##$TP07= 0
##$TPNAME0= <>
##$TPNAME1= <>
##$TPNAME2= <>
##$TPNAME3= <>
##$TPNAME4= <>
##$TPNAME5= <>
##$TPNAME6= <>
##$TPNAME7= <>
##$TPOAL= (0..7)
0.5 0.5 0.5 0.5 0.5 0.5 0.5 0.5
##$TPOFFS= (0..7)
0 0 0 0 0 0 0 0
##$TUNHIN= 0
##$TUNHOUT= 0
##$TUNXOUT= 0
##$USERA1= <user>
##$USERA2= <user>
##$USERA3= <user>
##$USERA4= <user>
##$USERA5= <user>
##$V9= 5
##$VALIST= <valist>
##$VCLIST= <CCCCCCCCCCCCCCC>
##$VD= 0
##$VDLIST= <DDDDDDDDDDDDDDD>
##$VPLIST= <PPPPPPPPPPPPPPP>
##$VTLIST= <TTTTTTTTTTTTTTT>
##$WBST= 1024
##$WBSW= 4
##$XGAIN= (0..3)
0 0 0 0
##$XL= 0
##$YL= 0
##$YMAX_a= 6517604
##$YMIN_a= -14626972
##$ZGOPTNS= <>
##$ZL1= 120
##$ZL2= 120
##$ZL3= 120
##$ZL4= 120
##$ABSF1= 14.96114
##$ABSF2= -5.597042
##$ABSG= 5
##$ABSL= 3
##$ALPHA= 0
##$AQORDER= 0
##$ASSFAC= 0
##$ASSFACI= 0
##$ASSFACX= 0
##$ASSWID= 0
##$AUNMP= <proc_prof1d_extract.lims>
##$AXLEFT= 0
##$AXNAME= <>
##$AXNUC= <1H>
##$AXRIGHT= 0
##$AXTYPE= 0
##$AXUNIT= <>
##$AZFE= 0.1
##$AZFW= 0.1
##$BCFW= 0
##$BC_mod= 0
##$BYTORDP= 0
##$COROFFS= 0
##$CY= 15
##$DATMOD= 1
##$DC= 0
##$DFILT= <>
##$DTYPP= 0
##$F1P= 0
##$F2P= 0
##$FCOR= 0.5
##$FTSIZE= 131072
##$FT_mod= 6
##$GAMMA= 0
##$GB= 0
##$INTBC= 1
##$INTSCL= 1
##$ISEN= 128
##$LB= 0.3
##$LEV0= 0
##$LPBIN= 0
##$MAXI= 10000
##$MC2= 0
##$MEAN= 0
##$ME_mod= 0
##$MI= 0
##$NCOEF= 0
##$NC_proc= -2
##$NLEV= 6
##$NOISF1= 0
##$NOISF2= 0
##$NSP= 0
##$NTH_PI= 0
##$NZP= 0
##$OFFSET= 14.96114
##$PC= 1
##$PHC0= -78.37097
##$PHC1= 0
##$PH_mod= 1
##$PKNL= yes
##$PPARMOD= 0
##$PPDIAG= 0
##$PPIPTYP= 0
##$PPMPNUM= 2147483647
##$PPRESOL= 1
##$PSCAL= 4
##$PSIGN= 0
##$PYNMP= <proc.py>
##$REVERSE= no
##$SF= 400.020009582325
##$SI= 131072
##$SIGF1= 0
##$SIGF2= 0
##$SINO= 400
##$SIOLD= 131072
##$SPECTYP= <>
##$SREGLST= <1H.CDCl3>
##$SSB= 0
##$STSI= 131072
##$STSR= 0
##$SW_p= 8223.68421052631
##$SYMM= 0
##$S_DEV= 0
##$TDeff= 65536
##$TDoff= 0
##$TI= <>
##$TILT= no
##$TM1= 0
##$TM2= 0
##$TOPLEV= 0
##$USERP1= <user>
##$USERP2= <user>
##$USERP3= <user>
##$USERP4= <user>
##$USERP5= <user>
##$WDW= 1
##$XDIM= 131072
##$YMAX_p= 434551567
##$YMIN_p= -11175
##$CURPLOT= <Network HP LaserJet P1505>
##$CURPRIN= <$Network HP LaserJet P1505>
##$DFORMAT= <normdp>
##$LAYOUT= <+/1D_H.xwp>
##$LFORMAT= <normlp>
##$PFORMAT= <normpl>
##$SURQMSG= 1
$$ End of Bruker specific parameters
$$ ---------------------------------
##NTUPLES= NMR SPECTRUM
##VAR_NAME=  FREQUENCY,     SPECTRUM/REAL,   SPECTRUM/IMAG
##SYMBOL=    X,             R,               I
##VAR_TYPE=  INDEPENDENT,   DEPENDENT,       DEPENDENT
##VAR_FORM=  AFFN,          ASDF,            ASDF
##VAR_DIM=   131072,        131072,          131072
##UNITS=     HZ,            ARBITRARY UNITS, ARBITRARY UNITS
##FACTOR=    0.0627417313425164, 1,          1
##FIRST=     8223.62146879497, -1714,        -71301
##LAST=      0,             1529,            -71870
##MIN=       0,             -11175,          0
##MAX=       8223.62146879497, 434551567,    0
$$ Real data points
##PAGE= N=1
##DATA TABLE= (X++(R..R)), XYDATA
$$ [...]
$$ plain form
61484 388865 388798 389396 390250 390383 389583 388811 389186 390882 393184 395450 397767 400556 403690 406320 407730 408146
61468 408146 408441 409197 410357 411629 412827 413796 414405 414708 414844 414771 414377 413818 413479 413635 414349 415516 416643
61451 416643 416891 415945 414753 414655 415809 417159 417972 418644 419740 421070 422162 422999 423784 424471 425088 426159 428271
61434 428271 431409 435055 438689 441905 444385 446179 447805 449735 451887 453845 455400 456695 458111 460193
61420 460193 463403 467656 472236 476380 479792 482565 484900 487032 489112 490940 492013 491955 490773 488776 486492
61405 486492 484516 482950 481064 478079 474259 470609 467502 464312 460599 456840 453618 450784 447887 444926
61391 444926 442253 440154 438867 438508 438648 438426 437462 436237 435396 435233 436053 438177 441105 443474 444511 444953
61375 444953 445888 447296 448439 449212 450231 451920 454224 456964 459810 462189 463829 465202 466837 468554 469957
$$ packed form
61484C88865o7N98Q54J33q00p72L75J696K302K266K317K789L134K630J410M16
61468D08146K95P56J160J272J198R69O09L03J36p3l94n59l39J56P14J167J127
61451D16643K48r46j192r8J154J350Q13O72J096J330J092Q37P85O87O17J071K112
61434D28271L138L646L634L216K480J794J626J930K152J958J555J295J416K082
61420D60193L210M253M580M144L412K773K335K132K080J828J073n8j182j997k284
61405D86492j976j566j886k985l820l650l107l190l713l759l222k834k897k961
61391D44926k673k099j287l59J40k22r64j225q41j63Q20K124K928K369J037M42
61375D44953R35J408J143P73J019J689K304K740K846K379J640J373J635J717J403
$$ plain form
61360 469957 471397 473703 477135 481258 485703 490466 495651 501434 508126 515716 523617 531430 539713 549376
61346 549376 560580 572835 585961 600158 615219 630322 644569 657268 667934 676683 684388 691681
61334 691681 697951 702004 703592 703480 702172 699515 695601 691052 686201 680787 674833 669050 664027 659631
61320 659631 655576 652032 649297 647368 646162 645713 645845 646206 646952 648913 652572 657288 662034 666629 671719
61305 671719 677769 684761 692923 703138 716189 731779 748618 765411 781475 796307 808956 818283
61293 818283 823769 825648 824233 819580 812001 802377 791617 780184 768477 757192 746776 736918 727272
61280 727272 718447 711540 706807 703498 701032 699611 699508 700484 702209 704758 708298 712662 717564 722992 729077
61265 729077 735738 742735 749993 757714 766194 775541 785530 795833 806521 818239 831642 846719 862896
$$ packed form
61360D69957J440K306L432M123M445M763N185N783O692P590P901P813Q283R663
61346E49376J1204J2255J3126J4197J5061J5103J4247J2699J0666Q749P705P293
61334F91681O270M053J588j12j308k657l914m549m851n414n954n783n023m396
61320F59631m055l544k735j929j206m49J32L61P46J961L659M716M746M595N090
61305F71719O050O992Q162J0215J3051J5590J6839J6793J6064J4832J2649R327
61293H18283N486J879j415m653p579r624j0760j1433j1707j1285j0416r858r646
61280G27272q825o907m733l309k466j421j03R76J725K549L540M364M902N428O085
61265G29077O661O997P258P721Q480R347R989J0303J0688J1718J3403J5077J6177
$$ plain form
61252 862896 879669 896743 913497 928650 940683 948530 951889 951099 946839 939827 930702 920045 908395
61239 908395 896233 884069 872489 861864 852080 842978 835110 829474 826335 824835 824067 823953 824659 825884
61225 825884 827413 829835 833913 839557 846265 854195 863895 875022 886239 896403 905094 912108 917345
61212 917345 921408 925421 929916 934504 938803 942981 947141 950951 954260 957529 961267 965615 970847 977728
61198 977728 986910 998398 1012057 1028266 1047596 1070131 1095459 1123072 1152429 1182946 1214309 1246547
61186 1246547 1279365 1311557 1341487 1368061 1390937 1409971 1424941 1435902 1443440 1448386 1451285 1452177
61174 1452177 1450753 1446721 1440032 1430766 1418861 1404069 1386260 1365656 1342662 1317553 1290454 1261632
61162 1261632 1231621 1200875 1169367 1136897 1104005 1072274 1043289 1017349 993709 971995 952738
$$ packed form
61252H62896J6773J7074J6754J5153J2033P847L359p90m260p012r125j0657j1650
61239I08395j2162j2164j1580j0625r784r102p868n636l139j500p68j14P06J225
61225H25884J529K422M078N644O708P930R700J1127J1217J0164Q691P014N237
61212I17345M063M013M495M588M299M178M160L810L309L269L738M348N232O881
61198I77728R182J1488J3659J6209J9330K2535K5328K7613K9357L0517L1363L2238
61186A246547L2818L2192K9930K6574K2876J9034J4970J0961P538M946K899Q92
61174A452177j424m032o689r266j1905j4792j7809k0604k2994k5109k7099k8822
61162A261632l0011l0746l1508l2470l2892l1731k8985k5940k3640k1714j9257
$$ plain form
61151 952738 936350 922331 910005 899538 891654 886662 884288 884206 886159 889658 893986 898375 901919 903656
61137 903656 903187 900982 897716 893689 889342 885872 884618 886080 890069 896483 905343 916469 929955 946630
61123 946630 967263 991570 1018867 1049376 1083836 1121970 1162537 1204928 1249587 1296602 1344943
61112 1344943 1393495 1441865 1489737 1536279 1580681 1622517 1661089 1695137 1723864 1747717 1767671
61101 1767671 1784065 1796518 1804522 1807665 1805565 1797889 1784205 1763808 1736208 1701963 1662553 1619316
61089 1619316 1573002 1524359 1474323 1423421 1371761 1320012 1269683 1222041 1177357 1135574 1097021
61078 1097021 1061954 1030030 1000839 974534 951412 931293 913785 898802 886354 876158 867858
61067 867858 861314 856308 852351 849193 847230 846985 848405 850892 853831 856933 860387 864814 870801 878448
$$ packed form
61151I52738j6388j4019j2326j0467p884m992k374q2J953L499M328M389L544J737
61137I03656m69k205l266m027m347l470j254J462L989O414Q860J1126J3486J6675
61123I46630K0633K4307K7297L0509L4460L8134M0567M2391M4659M7015M8341
61112A344943M8552M8370M7872M6542M4402M1836L8572L4048K8727K3853J9954
61101A767671J6394J2453Q004L143k100p676j3684k0397k7600l4245l9410m3237
61089A619316m6314m8643n0036n0902n1660n1749n0329m7642m4684m1783l8553
61078A097021l5067l1924k9191k6305k3122k0119j7508j4983j2448j0196q300
61067H67858o544n006l957l158j963k45J420K487K939L102L454M427N987P647
$$ plain form
61053 878448 887693 898894 912427 927780 943967 961075 980540 1003515 1029700 1058156 1088493 1120707
61041 1120707 1154547 1189604 1225549 1261890 1298020 1333865 1369875 1406030 1441584 1476144 1510215
61030 1510215 1544148 1577352 1609150 1639665 1669268 1697910 1725735 1753692 1782724 1812922 1844178
61019 1844178 1877036 1912059 1948848 1986480 2024583 2063514 2104294 2149187 2201711 2265129 2341232
61008 2341232 2431050 2535849 2656699 2794248 2950466 3130399 3341446 3591815 3890863 4250177
60998 4250177 4683052 5203913 5830136 6584202 7493067 8587255 9903033 11482177 13359000
60989 13359000 15534912 17953983 20491432 22957667 25121961 26765963 27762555 28141381
60981 28141381 28089641 27874915 27735349 27800554 28068146 28416227 28631671 28462394 27702592 26280179
$$ packed form
61053H78448R245J1201J3533J5353J6187J7108J9465K2975K6185K8456L0337L2214
61041A120707L3840L5057L5945L6341L6130L5845L6010L6155L5554L4560L4071
61030A510215L3933L3204L1798L0515K9603K8642K7825K7957K9032L0198L1256
61019A844178L2858L5023L6789L7632L8103L8931M0780M4893N2524O3418P6103
61008B341232Q9818J04799J20850J37549J56218J79933K11047K50369K99048L59314
60998D250177M32875N20861O26223P54066R08865J094188J315778J579144J876823
60989A3359000K175912K419071K537449K466235K164294J644002R96592L78826
60981B8141381n1740k14726j39566O5205K67592L48081K15444j69277p59802j422413
$$ plain form
60971 26280179 24288703 21938645 19466037 17060752 14842773 12870849 11159081 9693162
60963 9693162 8446334 7390823 6501072 5752855 5124022 4596178 4153961 3783015 3469838
60954 3469838 3202975 2973065 2772117 2593802 2434244 2291488 2164234 2051335 1951672 1863480
60944 1863480 1784166 1711582 1645075 1584353 1527726 1472469 1416868 1361077 1306096 1252752 1201699
60933 1201699 1153532 1108538 1066780 1028484 993864 962544 933725 907041 882752 860980 841317
60922 841317 823477 807776 794431 782689 771335 760121 750151 742545 737036 732349 727780 723886 721556
60909 721556 720944 721638 723298 725637 728078 730088 731781 733617 735484 736616 736462 735234 733482 731518 729253
60894 729253 726192 721631 715372 708211 701220 694546 687525 680022 672874 666753 661336 655972 650533 645138
$$ packed form
60971B6280179j991476k350058k472608k405285k217979j971924j711768j465919
60963I693162j246828j055511q89751p48217o28833n27844m42217l70946l13177
60954C469838k66863k29910k00948j78315j59558j42756j27254j12899r9663q8192
60944A863480p9314p2584o6507o0722n6627n5257n5601n5791n4981n3344n1053
60933A201699m8167m4994m1758l8296l4620l1320k8819k6684k4289k1772j9663
60922H41317j7840j5701j3345j1742j1354j1214r970p606n509m687m569l894k330
60909G21556o12O94J660K339K441K010J693J836J867J132j54j228j752j964k265
60894G29253l061m561o259p161o991o674p021p503p148o121n417n364n439n395
$$ plain form
60880 645138 639579 633605 627382 621171 614923 608665 602944 598285 594496 591034 587874 585490 584071 583284
60866 583284 582795 582604 582929 584086 586516 590540 596062 602675 610005 617754 625592 633391 641504 650491 660528
60851 660528 671253 682031 692114 700756 707684 713539 719436 725884 732373 738142 743004 747111 750095
60838 750095 750912 748818 744306 738841 733603 728657 723383 717389 710752 703572 695880 688138 681402 676526
60824 676526 673237 670205 666138 660755 654781 649132 644123 639403 634493 629223 623638 617797 611937 606652
60810 606652 602490 599294 596301 592980 589557 586654 584665 583569 583066 582721 582207 581657 581640 582596 584404 586621
60794 586621 589021 591718 594872 598485 602548 607252 612855 619273 625932 632326 638734 646041 654636 663880
60780 663880 673004 682129 691840 702049 712058 721747 731814 742627 753571 763979 774184 785084
$$ packed form
60880F45138n559n974o223o211o248o258n721m659l789l462l160k384j419p87
60866E83284m89j91L25J157K430M024N522O613P330P749P838P799Q113Q987J0037
60851F60528J0725J0778J0083Q642O928N855N897O448O489N769M862M107K984
60838G50095Q17k094m512n465n238m946n274n994o637p180p692p742o736m876
60824F76526l289l032m067n383n974n649n009m720m910n270n585n841n860n285
60810F06652m162l196k993l321l423k903j989j096n03l45n14n50j7R56J808K217
60794E86621K400K697L154L613M063M704N603O418O659O394O408P307Q595R244
60780F63880R124R125R711J0209J0009R689J0067J0813J0944J0408J0205J0900
$$ plain form
60768 785084 796989 809367 821519 833145 844512 856462 870004 885390 901664 917474 932346
60757 932346 946891 961931 977761 994209 1011031 1028106 1045450 1063156 1081285 1099817 1118715
60746 1118715 1137904 1157141 1176145 1195030 1214434 1234922 1256247 1277297 1296687 1313378 1327033
60735 1327033 1338028 1347098 1354718 1360846 1365276 1367962 1368778 1367163 1362436 1354459 1343716 1330694 1315452
60722 1315452 1297946 1278579 1258158 1237301 1215977 1193750 1170511 1146859 1123725 1101634 1080435
60711 1080435 1059672 1039039 1018481 998100 978141 958953 940805 923723 907482 891732 876136
60700 876136 860495 844761 828949 813087 797360 782174 767859 754347 741262 728326 715527
60689 715527 702994 690911 679461 668648 658282 648371 639314 631323 623867 616212 608513 601763 596564
$$ packed form
60768G85084J1905J2378J2152J1626J1367J1950J3542J5386J6274J5810J4872
60757I32346J4545J5040J5830J6448J6822J7075J7344J7706J8129J8532J8898
60746A118715J9189J9237J9004J8885J9404K0488K1325K1050J9390J6691J3655
60735A327033J0995R070P620O128M430K686Q16j615m727p977j0743j3022j5242
60722A315452j7506j9367k0421k0857k1324k2227k3239k3652k3134k2091k1199
60711A080435k0763k0633k0558k0381j9959j9188j8148j7082j6241j5750j5596
60700H76136j5641j5734j5812j5862j5727j5186j4315j3512j3085j2936j2799
60689G15527j2533j2083j1450j0813j0366r911r057p991p456p655p699o750n199
$$ plain form
60676 596564 592537 589114 586288 584165 582307 580047 577229 574195 571306 568847 567157 566352 566023 565622 565027
60661 565027 564359 563424 561866 559899 558315 557594 557410 557306 557534 558815 561393 564731 568233 571946 576310 581388
60645 581388 586710 591916 597170 602629 607753 611587 613736 614743 615506 616608 618276 620493 622946 625137
60631 625137 626829 628184 629280 629772 629372 628469 627873 627901 628070 627785 627042 626179 625069 622941 619166 614035 608433
60614 608433 602890 597346 591851 586904 582712 578662 574158 569709 566464 564682 563298 561103 557760 553571
60600 553571 548943 544401 540557 537633 535316 533307 531623 530157 528450 526279 524076 522387 521307 520770
60586 520770 520908 521637 522268 522138 521434 520922 521045 521722 522791 524056 525100 525668 526212 527487 529581 531851 533888
60569 533888 536067 539020 542987 547869 553549 559946 567028 575008 584298 595089 607085 619650 631983
$$ packed form
60676E96564m027l423k826k123j858k260k818l034k889k459j690q05l29m01n95
60661E65027o68r35j558j967j584p21j84j04K28J281K578L338L502L713M364N078
60645E81388N322N206N254N459N124L834K149J007P63J102J668K217K453K191
60631F25137J692J355J096M92m00r03n96K8J69k85p43q63j110k128l775n131n602
60614F08433n543n544n495m947m192m050m504m449l245j782j384k195l343m189
60600E53571m628m542l844k924k317k009j684j466j707k171k203j689j080n37
60586E20770J38P29O31j30p04n12J23O77J069J265J044N68N44J275K094K270K037
60569E33888K179K953L967M882N680O397P082P980R290J0791J1996J2565J2333
$$ plain form
60556 631983 643081 651909 657963 661534 663161 662873 660272 655477 649642 644243 639912 636282 633010 630532
60542 630532 629510 629834 630663 631455 632555 634739 638511 643865 650341 657181 663797 670316 677326 684932 692292
60527 692292 698238 702010 703351 702384 699694 696168 692392 688499 684796 682066 680806 680539 680296 679504 678063
60512 678063 676010 673672 671852 671176 671441 672123 673354 675728 679275 683326 687404 691610 696094 700902 706565
60497 706565 714218 724780 738399 754979 774777 798142 825032 855104 888011 923248 959894 996718
60485 996718 1032275 1064560 1090843 1108361 1115434 1111890 1098575 1076676 1047471 1012500 973764 933622
60473 933622 894251 857068 822643 791144 762712 737403 715016 695201 677722 662487 649346
60462 649346 637951 627739 618093 608629 599455 591070 583917 578011 573005 568467 564032 559481 554945 550977
$$ packed form
60556F31983J1098Q828O054L571J627k88k601m795n835n399m331l630l272k478
60542F30532j022L24Q29P92J100K184L772N354O476O840O616O519P010P606P360
60527F92292N946L772J341r67k690l526l776l893l703k730j260k67k43p92j441
60512F78063k053k338j820o76K65O82J231K374L547M051M078M206M484M808N663
60497G06565P653J0562J3619J6580J9798K3365K6890L0072L2907L5237L6646L6824
60485I96718L5557L2285K6283J7518P073l544j3315k1899k9205l4971l8736m0142
60473I33622l9371l7183l4425l1499k8432k5309k2387j9815j7479j5235j3141
60462F49346j1395j0212r646r464r174q385p153n906n006m538m435m551m536l968
$$ plain form
60448 550977 548148 546396 544960 543112 540869 538844 537464 536589 535830 534974 533977 532810 531484 530057 528444
60433 528444 526358 523651 520621 517823 515682 514416 514097 514475 514873 514628 513641 512319 511079 510178 509843 510147
60417 510147 510801 511491 512426 514147 516781 519925 523251 526715 530060 532644 534049 534515 534577 534593 534791 535328 536120
60400 536120 536936 537818 539041 540574 542096 543671 545826 548658 551472 553728 555759 558078 560506 562629 564690
60385 564690 567251 570190 572760 574591 576088 577829 580072 582760 585590 588038 589718 590759 591588 592523 593831
60370 593831 595934 599036 602613 605736 607965 609670 611560 614129 617424 620989 624164 626727 629120 631760
60356 631760 634336 636194 637218 637952 639016 640756 643234 646100 648644 650522 652357 655207 659536 665099
60342 665099 671623 679004 687005 695454 704651 714814 724978 733176 738087 740007 739953 738394 735226 730478
$$ packed form
60448E50977k829j752j436j848k243k025j380q75p59q56r97j167j326j427j613
60433E28444k086k707l030k798k141j266l19L78L98k45r87j322j240r01l35L04
60417E10147O54O90R35J721K634L144L326L464L345K584J405M66O2J6J98N37P92
60400E36120Q16Q82J223J533J522J575K155K832K814K256K031K319K428K123K061
60385E64690K561K939K570J831J497J741K243K688K830K448J680J041Q29R35J308
60370E93831K103L102L577L123K229J705J890K569L295L565L175K563K393K640
60356F31760K576J858J024P34J064J740K478K866K544J878J835K850M329N563
60342F65099O524P381Q001Q449R197J0163J0164Q198M911J920n4j559l168m748
$$ plain form
60328 730478 724397 717042 708418 699097 690238 682716 676398 670627 665377 661549 659812 659408 658664 656727 654265
60313 654265 652306 650990 649920 649189 649373 650729 653009 656054 660141 665828 673795 684664 698518 714739
60299 714739 732735 752594 774435 797215 818799 837258 851684 861804 867423 868477 865244 858376
60287 858376 848921 838247 827600 817701 808892 801405 795034 788796 781493 772566 762065 750045 736618
60274 736618 722437 708390 694794 681478 668706 657361 648096 640840 635236 630993 627709 624891 622369
60261 622369 620236 618371 616576 615234 615145 616443 618262 619732 620750 621553 622088 622205 622006 621621 621011 620342
60245 620342 620189 621001 622545 624159 625301 625730 625449 624703 623768 622605 621003 619226 618150 618483 620040 621978
60229 621978 623619 624929 626447 628864 632554 637403 643086 649266 655342 660410 664076 667156 670984 676034
$$ packed form
60328G30478o081p355q624r321q859p522o318n771n250l828j737m04p44j937k462
60313F54265j959j316j070p31J84J356K280L045M087N687P967J0869J3854J6221
60299G14739J7996J9859K1841K2780K1584J8459J4426J0120N619J054l233o868
60287H58376r455j0674j0647r899q809p487o371o238p303q927j0501j2020j3427
60274G36618j4181j4047j3596j3316j2772j1345r265p256n604m243l284k818k522
60261F22369k133j865j795j342q9J298J819J470J018Q03N35J17j99l85o10o69
60245F20342j53Q12J544J614J142M29k81p46r35j163j602j777j076L33J557J938
60229F21978J641J310J518K417L690M849N683O180O076N068L666L080L828N050
$$ plain form
60215 676034 681822 688004 694812 702266 709815 717137 724691 733024 741962 750879 759351 767246 774523 781341
60201 781341 788053 794807 801302 807115 811982 815663 817905 818776 818712 818057 816793 814777 811920 808067 803136
60186 803136 797469 791658 785957 780274 774721 769618 764867 759960 754780 749789 745235 740794 736299 732189
60172 732189 728849 726137 723982 722892 723305 724814 726592 728294 730175 732565 735601 739149 742643 745337
60158 745337 747077 748522 750271 751977 752697 751941 750146 748386 747768 748759 750860 753208 755653 758885 763416
60143 763416 768970 775093 781773 789066 796605 803963 811186 818601 826351 834456 843010 852034 861373 870934
60129 870934 880670 890149 898512 905050 909456 911444 910744 907728 903525 899281 895795 893861 894031 895661 897120
60114 897120 897556 897698 898354 898997 898630 897302 895678 893651 890431 885732 879949 873350 865987 858296 850965
$$ packed form
60215F76034N788O182O808P454P549P322P554Q333Q938Q917Q472P895P277O818
60201G81341O712O754O495N813M867L681K242Q71o4o55j264k016k857l853m931
60186H03136n667n811n701n683n553n103m751m907n180m991m554m441m495m110
60172G32189l340k712k155j090M13J509J778J702J881K390L036L548L494K694
60158G45337J740J445J749J706P20p56j795j760o18R91K101K348K445L232M531
60143G63416N554O123O680P293P539P358P223P415P750Q105Q554R024R339R561
60129H70934R736R479Q363O538M406J988p00l016m203m244l486j934J70J630J459
60114H97120M36J42O56O43l67j328j624k027l220m699n783o599p363p691p331
$$ plain form
60099 850965 844169 837562 831004 824797 819350 815117 812663 812187 813196 815157 818210 822677 828209 834159
60085 834159 840525 847735 855698 863883 872179 880825 889526 897415 903927 908935 912028 912486 910116 905328
60071 905328 898171 888142 875255 860658 845692 830862 816090 801529 787701 775121 764172 755112
60059 755112 747804 741556 735522 729276 722997 717230 712519 709066 706604 704641 702898 701489 700739 700989 702534
60044 702534 705705 710904 718408 727875 738116 747738 756205 763946 771346 778071 783583 787753 790550 791583
60030 791583 790521 787722 783892 779275 773616 766779 758874 749905 739681 728136 715434 701862 687861
60017 687861 674047 661056 649449 639777 632257 626278 620838 615803 612126 610387 609826 609449 609381 610248 611737
60002 611737 612875 613554 614738 617175 620723 625004 629863 635085 640431 646151 652814 660420 668227 675582
$$ packed form
60099H50965o796o607o558o207n447m233k454m76J009J961L053M467N532N950
60085H34159O366P210P963Q185Q296Q646Q701P889O512N008L093M58k370m788
60071I05328p157j0029j2887j4597j4966j4830j4772j4561j3828j2580j0949r060
60059G55112p308o248o034o246o279n767m711l453k462j963j743j409p50K50J545
60044G02534L171N199P504R467J0241R622Q467P741P400O725N512M170K797J033
60030G91583j062k799l830m617n659o837p905q969j0224j1545j2702j3572j4001
60017F87861j3814j2991j1607r672p520n979n440n035l677j739n61l77o8Q67J489
60002F11737J138O79J184K437L548M281M859N222N346N720O663P606P807P355
$$ plain form
59988 675582 682463 689126 695720 702347 708905 714748 718969 721181 721653 720646 718078 713922 708424 701732
59974 701732 693713 684438 674666 665649 658446 653250 649292 645626 642192 639843 639148 639645 640613 642042 644230
59959 644230 646917 649638 652631 656516 661101 665322 668453 670775 672909 675066 677012 678341 678768 678532 678440
59944 678440 679102 680231 681056 681156 680416 678525 675203 670750 665781 660544 655006 649315 643547 637391 630794
59929 630794 624631 619981 616999 615206 614406 614445 614564 614169 613930 614909 616841 618578 620007 622046 624705 626810
59913 626810 627998 629489 632369 636443 641397 647699 655483 663714 671376 678653 686091 693404 699899 705359
59899 705359 709837 713274 716055 719251 723537 728448 733295 738203 743659 749785 756699 764862 774159 783286
59885 783286 790859 796755 801652 805828 809257 812417 816056 820334 824842 829242 833291 836550 838663 839685
$$ packed form
59988F75582O881O663O594O627O558N843M221K212M72j007k568m156n498o692
59974G01732q019r275r772r017p203n196l958l666l434k349o95M97R68J429K188
59959F44230K687K721K993L885M585M221L131K322K134K157J946J329M27k36r2
59944F78440O62J129Q25J00p40j891l322m453m969n237n538n691n768o156o597
59929F30794o163m650k982j793q00L9J19l95k39R79J932J737J429K039K659K105
59913F26810J188J491K880M074M954O302P784Q231P662P277P438P313O495N460
59899G05359M478L437K781L196M286M911M847M908N456O126O914Q163R297R127
59885G83286P573N896M897M176L429L160L639M278M508M400M049L259K113J022
$$ plain form
59871 839685 839669 838243 835048 830159 823619 815121 804746 793488 782363 771526 760897 751062 742625
59858 742625 735177 727984 721426 716688 714048 712510 711242 710457 710569 711278 712037 713003 715091 719148 725270
59843 725270 732866 741415 751080 762331 774912 787671 799621 810625 820630 828791 834153 836968 838704
59830 838704 840847 844215 849162 855582 862465 867972 870288 868295 861585 850282 835018 816877 797219
59817 797219 777501 758975 742281 727432 714282 702838 693046 684609 677264 670948 665551 660896 657154
59804 657154 654828 654012 654097 654475 655089 655932 656572 656645 656288 655534 653820 650745 646874 643103 639642 636335 633546
59787 633546 631772 630605 629063 626899 624740 622900 620939 618578 616232 614315 612684 611135 609930 609443
59773 609443 609592 609945 610206 610476 611221 613004 615993 619668 623230 626296 629004 631584 634222 637269 641139
$$ packed form
59871H39685j6j426l195m889o540q498j0375j1258j1125j0837j0629r835q437
59858G42625p448p193o558m738k640j538j268p85J12P09P59R66K088M057O122
59843G25270P596Q549R665J1251J2581J2759J1950J1004J0005Q161N362K815J736
59830H38704K143L368M947O420O883N507K316j993o710j1303j5264j8141j9658
59817G97219j9718j8526j6694j4849j3150j1444r792q437p345o316n397m655l742
59804F57154k326q16Q5L78O14Q43O40P3l57p54j714l075l871l771l461l307k789
59787F33546j774j167j542k164k159j840j961k361k346j917j631j549j205m87
59773F09443J49L53K61K70P45J783K989L675L562L066K708K580K638L047L870
$$ plain form
59758 641139 645874 651076 656353 661557 666670 671758 677035 682654 688461 694269 700322 707046 714304 721310
59744 721310 727460 732951 738333 743655 748236 751262 752481 752341 751496 750288 748804 747277 746072 745240 744449
59729 744449 743575 743033 743251 744061 744867 745179 744817 743893 742927 742716 743719 745722 748290 751232 754330 756999 758709
59712 758709 759573 760205 761185 762933 765677 769059 772098 774109 775525 777304 779707 782093 783735 784353 784043
59697 784043 783226 782569 782467 782685 782875 783241 784170 785473 786596 787328 787601 786806 784269 780535 777315 775835 775879
59680 775879 776753 778411 781096 784369 787169 788683 788706 787262 784286 779784 774095 767864 761712 755853 750038
59665 750038 743926 737483 730946 724562 718555 713224 708785 705155 702131 699817 698644 698959 700774 703862
59651 703862 707902 712505 717331 722278 727456 732824 737871 741634 743139 742008 738717 734159 728996 723545
$$ packed form
59758F41139M735N202N277N204N113N088N277N619N807N808O053O724P258P006
59744G21310O150N491N382N322M581L026J219j40q45j208j484j527j205q32p91
59729G44449q74n42K18Q10Q06L12l62r24r66k11J003K003K568K942L098K669J710
59712G58709Q64O32R80J748K744L382L039K011J416J779K403K386J642O18l10
59697G84043q17o57j02K18J90L66R29J303J123P32K73p95k537l734l220j480M4
59680G75879Q74J658K685L273K800J514K3j444k976m502n689o231o152n859n815
59665G50038o112o443o537o384o007n331m439l630l024k314j173L15J815L088
59651G03862M040M603M826M947N178N368N047L763J505j131l291m558n163n451
$$ plain form
59637 723545 718125 713118 708730 705056 702392 701055 700876 701381 702532 704622 707289 709350 709974 709370 708024
59622 708024 706086 704034 703015 703664 705180 706413 707348 708579 709848 710211 709459 708289 707212 706299 705997 707153
59606 707153 709929 713480 716908 719975 722838 725794 729344 733683 737962 740715 741266 740162 738127 735322
59592 735322 731818 728091 724688 721836 719631 718113 716943 715462 713335 710764 707983 704954 701702 698465
59578 698465 695359 692291 689295 686517 683757 680521 676737 673025 670082 668123 667022 666551 666330 665941 665273
59563 665273 664587 664178 664226 664902 666201 667733 669063 670285 671916 674274 677291 680726 684119 686764 688349
59548 688349 689490 691035 692967 694653 696119 698259 701796 706736 712907 720297 728856 738776 751084 767104
59534 767104 786996 809382 832383 854181 872606 885517 892434 895194 896460 898127 901321 906867 914840
$$ packed form
59637G23545n420n007m388l674k664j337j79N05J151K090K667K061O24o04j346
59622G08024j938k052j019O49J516J233R35J231J269L63p52j170j077r13l02J156
59606G07153K776L551L428L067K863K956L550M339M279K753N51j104k035k805
59592G35322l504l727l403k852k205j518j170j481k127k571k781l029l252l237
59578F98465l106l068k996k778k760l236l784l712k943j959j101m71k21l89o68
59563F65273o86m09M8O76J299J532J330J222J631K358L017L435L393K645J585
59548F88349J141J545J932J686J466K140L537M940O171P390Q559R920J2308J6020
59534G67104J9892K2386K3001K1798J8425J2911O917K760J266J667L194N546P973
$$ plain form
59521 914840 924168 933459 941964 949326 954902 957949 958142 955373 949348 939825 926993 911284 893172 873513
59507 873513 853643 834639 816798 800201 785379 772868 762412 753144 744541 736894 730977 727388
59495 727388 725939 725505 724878 723980 723813 724923 726423 727036 726702 726688 728325 732035 737333 743345 749494 756014
59479 756014 763696 772934 783292 794254 805985 819028 833495 848847 864246 878794 891637 902115
59467 902115 909723 913925 914448 911975 908155 904696 902667 902698 905290 910657 918752 929789 944244 962116
59453 962116 982648 1005041 1028841 1053324 1077234 1099774 1121283 1142266 1162140 1179461 1192880
59442 1192880 1201201 1202987 1197081 1183498 1163311 1137913 1109019 1079062 1050650 1025386 1003532 984657
59430 984657 968122 953184 939369 926884 916246 907620 900994 896939 896652 901163 910887 925808 945545
$$ packed form
59521I14840R328R291Q505P362N576L047J93k769o025r523j2832j5709j8112j9659
59507H73513j9870j9004j7841j6597j4822j2511j0456r268q603p647n917l589
59495G27388j449m34o27q98j67J110J500O13l34j4J637L710N298O012O149O520
59479G56014P682R238J0358J0962J1731J3043J4467J5352J5399J4548J2843J0478
59467I02115P608M202N23k473l820l459k029L1K592N367Q095J1037J4455J7872
59453I62116K0532K2393K3800K4483K3910K2540K1509K0983J9874J7321J3419
59442A192880Q321J786n906j3583k0187k5398k8894k9957k8412k5264k1854j8875
59430I84657j6535j4938j3815j2485j0638q626o626m055k87M511R724J4921J9737
$$ plain form
59417 945545 969164 995365 1023046 1051502 1080197 1108738 1137018 1165025 1192257 1217236 1237231
59406 1237231 1248377 1246866 1231109 1203116 1167590 1129792 1094288 1064806 1043912 1032356 1029076 1031759
59394 1031759 1036843 1039269 1033656 1016921 989923 956442 920795 886320 855205 828653 806859 789117
59382 789117 774332 761678 750991 742553 736483 732364 729539 727644 726644 726459 726869 727801 729408 731750
59368 731750 734558 737492 740522 743992 748308 753530 759252 764971 770691 777100 785032 794874 806626 820363
59354 820363 836270 854261 873936 895150 918423 944547 973810 1005772 1039755 1075311 1112045
59343 1112045 1149169 1185576 1220304 1252602 1281368 1304988 1322125 1332443 1336110 1332830 1321961 1303551
59331 1303551 1278691 1248743 1214858 1178404 1141172 1104602 1069104 1034603 1001440 970433 942281
$$ packed form
59417I45545K3619K6201K7681K8456K8695K8541K8280K8007K7232K4979J9995
59406A237231J1146j511j5757k7993l5526l7798l5504k9482k0894j1556l280K683
59394A031759N084K426n613j6735k6998l3481l5647l4475l1115k6552k1794j7742
59382G89117j4785j2654j0687q438o070m119k825j895j000j85M10R32J607K342
59368G31750K808K934L030L470M316N222N722N719N720O409P932R842J1752J3737
59354H20363J5907J7991J9675K1214K3273K6124K9263L1962L3983L5556L6734
59343A112045L7124L6407L4728L2298K8766K3620J7137J0318L667l280j0869j8410
59331A303551k4860k9948l3885l6454l7232l6570l5498l4501l3163l1007k8152
$$ plain form
59320 942281 917327 895696 877271 861612 848246 836948 827555 819643 812675 806406 800868 796074 791946
59307 791946 788516 786025 784827 785181 786990 789690 792648 795821 799762 804855 810819 817150 823843 831464
59293 831464 840756 852429 867123 885159 906137 928716 950661 969195 981750 986831 984384 975682
59281 975682 963067 949480 937427 928037 921392 917747 917954 922645 931656 944532 960918 980057 1000525
59268 1000525 1021109 1041556 1061859 1081115 1097724 1110542 1119168 1123227 1122090 1115540 1104230 1089165
59256 1089165 1070975 1050006 1027010 1003431 980787 959786 940235 921847 904891 889849 876846
59245 876846 865930 857699 852956 851702 853006 856033 860700 867324 876210 887630 901483 916693 931605
59232 931605 945274 957720 968609 976535 980198 979676 975813 968801 958117 943552 925669 905417 883914
$$ packed form
59320I42281k4954k1631j8425j5659j3366j1298r393p912o968o269n538m794m128
59307G91946l430k491j198L54J809K700K958L173L941N093N964O331O693P621
59293H31464R292J1673J4694J8036K0978K2579K1945J8534J2555N081k447q702
59281I75682j2615j3587j2053r390o645l645K07M691R011J2876J6386J9139K0468
59268A000525K0584K0447K0303J9256J6609J2818Q626M059j137o550j1310j5065
59256A089165j8190k0969k2996k3579k2644k1001j9551j8388j6956j5042j3003
59245H76846j0916q231m743j254J304L027M667O624Q886J1420J3853J5210J4912
59232I31605J3669J2446J0889P926L663n22l863p012j0684j4565j7883k0252k1503
$$ plain form
59219 883914 862528 842553 824610 808486 793560 779407 766300 755210 746961 741265 736951 733141
59207 733141 729662 726321 722655 718697 715197 712596 710507 708645 707523 707618 708573 709937 712004 715154 718912
59192 718912 722601 726500 731480 737697 744438 751082 757636 764446 771889 780138 788822 797198 804966 812489
59178 812489 819867 826463 831828 836430 840958 845620 850772 857395 866037 876069 886920 899372 914521
59165 914521 932098 950969 970653 990947 1010487 1027238 1040384 1050474 1057670 1061063 1059798 1053777
59153 1053777 1043167 1028302 1010255 990561 970226 949680 929561 910588 892780 875816 860124
59142 860124 846545 834999 824535 814675 805500 796520 786956 777404 769704 764550 760460 755862 751130
59129 751130 747725 746166 745733 745673 745915 746899 749112 752589 756721 761003 765985 772784 781627 791633 802183
$$ packed form
59219H83914k1386j9975j7943j6124j4926j4153j3107j1090q249n696m314l810
59207G33141l479l341l666l958l500k601k089j862j122R5R55J364K067L150L758
59192G18912L689L899M980O217O741O644O554O810P443Q249Q684Q376P768P523
59178H12489P378O596N365M602M528M662N152O623Q642J0032J0851J2452J5149
59165I14521J7577J8871J9684K0294J9540J6751J3146J0090P196L393j265o021
59153A053777j0610j4865j8047j9694k0335k0546k0119j8973j7808j6964j5692
59142H60124j3579j1546j0464r860r175q980r564r552p700n154m090m598m732
59129G51130l405j559m33o0K42R84K213L477M132M282M982O799Q843J0006J0550
$$ plain form
59114 802183 813557 825891 838505 850837 863250 876256 889499 902111 913646 924107 933455 941499
59102 941499 948022 952740 955509 956708 956977 956385 954340 950550 945601 940381 935402 930818 926604 922532 918443
59087 918443 914641 911506 908694 905342 901160 896585 891695 885696 877811 868157 857547 846931 837069 828088
59073 828088 819174 809397 798999 789238 780907 773798 767668 762723 758817 755084 750940 746772 743221 740391
59059 740391 738118 736325 734733 732793 730323 727742 725451 723461 721689 719958 717746 714761 711798 710005
59045 710005 709246 708321 707034 706667 707936 709848 711333 712758 714891 717444 719723 721869 724380 727153 730047
59030 730047 733715 738840 745106 751900 759552 768890 780035 792537 806180 820746 835415 849381 862652
59017 862652 875309 886430 894793 900255 903413 904254 902349 898240 893384 888679 884068 879709 876534 875339
$$ packed form
59114H02183J1374J2334J2614J2332J2413J3006J3243J2612J1535J0461R348Q044
59102I41499O523M718K769J199K69n92k045l790m949n220m979m584m214m072m089
59087I18443l802l135k812l352m182m575m890n999p885r654j0610j0616r862q981
59073H28088q914r777j0398r761q331p109o130m945l906l733m144m168l551k830
59059G40391k273j793j592j940k470k581k291j990j772j731k212k985k963j793
59045G10005p59r25j287l67J269J912J485J425K133K553K279K146K511K773K894
59030G30047L668N125O266O794P652R338J1145J2502J3643J4566J4669J3966J3271
59017H62652J2657J1121Q363N462L158Q41j905m109m856m705m611m359l175j195
$$ plain form
59003 875339 876150 878734 883102 889273 897221 907264 919889 934917 951303 967986 984605 1001257 1017984
58990 1017984 1034598 1050614 1065165 1077199 1085863 1090553 1090813 1086617 1078719 1068349 1056559 1044141
58978 1044141 1032052 1021431 1013037 1006997 1003208 1001762 1002995 1007306 1014888 1025421 1038110 1052310 1068158
58965 1068158 1086388 1107463 1130993 1155928 1181209 1206161 1230256 1252517 1271383 1285393 1293866
58954 1293866 1296534 1292738 1281672 1263560 1240005 1212879 1183316 1152043 1120134 1088878 1059237 1031818
58942 1031818 1007187 985823 967874 953129 941089 931038 922410 915275 910149 907133 905518 904321
58930 904321 902850 900678 897521 893315 888072 881663 874251 866811 860527 855526 851016 846788 843690 842290
58916 842290 842000 842113 842932 845173 848902 853637 858985 864599 870091 875611 882048 890117 899737 910800 923884
$$ packed form
59003H75339Q11K584M368O171P948J0043J2625J5028J6386J6683J6619J6652J6727
58990A017984J6614J6016J4551J2034Q664M690K60m196p898j0370j1790j2418
58978A044141j2089j0621q394o040l789j446J233M311P582J0533J2689J4200J5848
58965A068158J8230K1075K3530K4935K5281K4952K4095K2261J8866J4010Q473
58954A293866K668l796j1066j8112k3555k7126k9563l1273l1909l1256k9641k7419
58942A031818k4631k1364j7949j4745j2040j0051q628p135n126l016j615j197
58930I04321j471k172l157m206n243o409p412p440o284n001m510m228l098j400
58916H42290k90J13Q19K241L729M735N348N614N492N520O437Q069R620J1063J3084
$$ plain form
58901 923884 939564 957588 977419 999003 1022274 1046510 1071055 1096329 1123336 1152449 1183418
58890 1183418 1216262 1251494 1289833 1332284 1379934 1432652 1488187 1543239 1595170 1642087 1681892
58879 1681892 1712552 1733234 1744186 1745437 1736435 1717002 1687830 1649966 1604622 1553736 1500011 1446004
58867 1446004 1393475 1343711 1297925 1256987 1220990 1189341 1161280 1136311 1114154 1094242 1075447
58856 1075447 1056818 1038674 1022354 1008585 996529 984817 972956 961392 950718 941330 933306 925985
58844 925985 918098 908940 899100 889511 880233 870768 861099 851651 842492 833360 824310 815733 807760 800150
58830 800150 792630 785083 777659 771048 766231 763580 762593 762882 764854 768907 774567 781065 788260 796287 804722
58815 804722 812829 820299 827154 833253 838458 842848 846252 848049 848017 846827 845153 842976 840397 838280 837170
$$ packed form
58901I23884J5680J8024J9831K1584K3271K4236K4545K5274K7007K9113L0969
58890A183418L2844L5232L8339M2451M7650N2718N5535N5052N1931M6917L9805
58879A681892L0660K0682J0952J251r002j9433k9172l7864m5344n0886n3725n4007
58867A446004n2529m9764m5786m0938l5997l1649k8061k4969k2157j9912j8795
58856A075447j8629j8144j6320j3769j2056j1712j1861j1564j0674r388q024p321
58844I25985p887r158r840r589r278r465r669r448r159r132r050q577p973p610
58830H00150p520p547p424o611m817k651r87K89J972M053N660O498P195Q027Q435
58815H04722Q107P470O855O099N205M390L404J797l2j190j674k177k579k117j110
$$ plain form
58800 837170 836299 834648 832339 829908 826907 822551 817238 812088 807246 802052 796713 792472 790037 789027
58786 789027 789096 790539 793663 798475 805098 813572 823143 832577 841262 849259 856414 862310 867065 871209 874690
58771 874690 876793 877122 875857 873066 868575 862687 856296 850150 844465 839197 834239 829621 826060 824887
58757 824887 826644 830132 833712 837150 841258 846167 851101 855593 859757 863515 866706 869881 873866 878611
58743 878611 883566 889039 895976 904369 913098 921424 929491 937332 944670 951862 959884 969064 978913 989428
58729 989428 1001385 1014929 1028898 1041983 1053733 1064066 1072724 1079629 1085099 1089365 1092474 1094843 1097284
58716 1097284 1100376 1104390 1109649 1116122 1122722 1127934 1131210 1132986 1133453 1132212 1128976 1123615 1115666 1104911
58702 1104911 1092280 1078939 1064430 1046906 1025296 1000206 972842 944408 916605 891182 868605
$$ packed form
58800H37170q71j651k309k431l001m356n313n150m842n194n339m241k435j010
58786G89027O9J443L124M812O623Q474R571R434Q685P997P155N896M755M144L481
58771H74690K103L29j265k791m491n888o391o146n685n268m958m618l561j173
58757H24887J757L488L580L438M108M909M934M492M164L758L191L175L985M745
58743H78611M955N473O937Q393Q729Q326Q067P841P338P192Q022R180R849J0515
58729I89428J1957J3544J3969J3085J1750J0333Q658O905N470M266L109K369K441
58716A097284L092M014N259O473O600N212L276J776M67j241l236n361p949j0755
58702A104911j2631j3341j4509j7524k1610k5090k7364k8434k7803k5423k2577
$$ plain form
58691 868605 848288 830233 815097 802618 791546 781470 773104 766278 759298 751057 742392 734557 727655
58678 727655 721380 716071 712094 709206 707348 707079 708559 711144 714787 720719 729874 741639 755096 770586
58664 770586 789022 810355 833609 857721 881395 902685 919652 931229 937061 937118 932062 923373 912462
58651 912462 899986 886283 871908 857443 843488 831049 821066 813196 806032 799026 793333 790268 789819
58638 789819 791159 793728 797153 800972 805122 810057 815802 821443 825925 828713 829491 828156 825498 822941
58624 822941 821193 820022 819626 821054 824895 830816 838930 850327 865486 883470 903545 926335 952255
58611 952255 979855 1006847 1031819 1053801 1071078 1081875 1085843 1083846 1076791 1065605 1051792 1036960
58599 1036960 1021966 1007149 992887 979223 965636 952023 939420 928996 920858 914576 910326 908665
$$ packed form
58691H68605k0317j8055j5136j2479j1072j0076q366o826o980q241q665p835o902
58678G27655o275n309l977k888j858k69J480K585L643N932R155J1765J3457J5490
58664G70586J8436K1333K3254K4112K3674K1290J6967J1577N832N7n056q689j0911
58651I12462j2476j3703j4375j4465j3955j2439r983p870p164p006n693l065m49
58638G89819J340K569L425L819M150M935N745N641M482K788P78j335k658k557
58624H22941j748j171l96J428L841N921Q114J1397J5159J7984K0075K2790K5920
58611I52255K7600K6992K4972K1982J7277J0797L968j997p055j1186j3813j4832
58599A036960j4994j4817j4262j3664j3587j3613j2603j0424q138o282m250j661
$$ plain form
58587 908665 909681 913216 919555 929161 942006 957701 975799 995358 1014730 1032546 1048619 1063365
58575 1063365 1076677 1087933 1096764 1103394 1108568 1113478 1119317 1126638 1135548 1146580 1160728 1178537 1199999
58562 1199999 1225458 1255504 1289531 1325319 1360577 1394007 1424512 1450370 1469919 1482423 1487986
58551 1487986 1487460 1482671 1475610 1466888 1455898 1442772 1429012 1415751 1402687 1389175 1375064 1359815
58539 1359815 1342166 1321569 1298837 1274701 1248980 1221960 1195249 1170313 1147407 1126801 1109742
58528 1109742 1097077 1088071 1081730 1078229 1077979 1080363 1084511 1090413 1098219 1107383 1117481 1128828 1141310
58515 1141310 1153639 1164765 1174986 1184709 1193319 1200360 1206612 1212706 1217680 1220164 1220066 1217975 1213934 1207971
58501 1207971 1200825 1192929 1183565 1172130 1159243 1145606 1130918 1115058 1099201 1084543 1071093 1058779
$$ packed form
58587I08665J016L535O339R606J2845J5695J8098J9559J9372J7816J6073J4746
58575A063365J3312J1256Q831O630N174M910N839P321Q910J1032J4148J7809K1462
58562A199999K5459L0046L4027L5788L5258L3430L0505K5858J9549J2504N563
58551A487986n26m789p061q722j0990j3126j3760j3261j3064j3512j4111j5249
58539A359815j7649k0597k2732k4136k5721k7020k6711k4936k2906k0606j7059
58528A109742j2665r006o341l501k50K384M148N902P806R164J0098J1347J2482
58515A141310J2329J1126J0221R723Q610P041O252O094M974K484r8k091m041n963
58501A207971p146p896r364j1435j2887j3637j4688j5860j5857j4658j3450j2314
$$ plain form
58489 1058779 1048510 1040790 1034650 1029318 1025773 1025206 1027274 1031392 1038446 1049494 1063861 1080204 1098435
58476 1098435 1118920 1140698 1162075 1181954 1199095 1211206 1216540 1215523 1209406 1198496 1183287 1165877
58464 1165877 1148332 1130823 1113223 1097253 1084935 1076161 1069939 1066909 1068283 1073363 1080559 1090010 1102608
58451 1102608 1117072 1130523 1141524 1150166 1155647 1156297 1151981 1144229 1134058 1121648 1107996 1094903
58439 1094903 1083320 1073372 1065653 1060825 1058411 1057712 1059277 1063684 1069651 1075440 1081383 1088989 1098290 1108375
58425 1108375 1119770 1133803 1150088 1167058 1184415 1202497 1219688 1233199 1242364 1248670 1252678 1253533
58413 1253533 1251438 1247957 1243557 1237184 1228443 1217918 1205330 1189769 1172016 1154322 1137622 1121129
58401 1121129 1104853 1090275 1078142 1067713 1058546 1051123 1045456 1040878 1037371 1035341 1034138 1032530 1030476
$$ packed form
58489A058779j0269p720o140n332l545n67K068M118P054J1048J4367J6343J8231
58476A098435K0485K1778K1377J9879J7141J2111N334j017o117j0910j5209j7410
58464A165877j7545j7509j7600j5970j2318q774o222l030J374N080P196R451J2598
58451A102608J4464J3451J1001Q642N481O50m316p752j0171j2410j3652j3093
58439A094903j1583r948p719m828k414o99J565M407N967N789N943P606R301J0085
58425A108375J1395J4033J6285J6970J7357J8082J7191J3511R165O306M008Q55
58413A253533k095l481m400o373q741j0525j2588j5561j7753j7694j6700j6493
58401A121129j6276j4578j2133j0429r167p423n667m578l507k030j203j608k054
$$ plain form
58388 1030476 1028620 1026467 1023113 1019360 1016898 1015661 1014169 1012077 1010119 1008070 1005293 1002919 1002826 1004749
58374 1004749 1007087 1010302 1016571 1026111 1036752 1047304 1058605 1071128 1084312 1098551 1115132 1133932
58362 1133932 1153624 1174186 1196594 1220141 1242872 1264532 1286078 1306302 1322110 1332378 1338457
58351 1338457 1340800 1338503 1332532 1325917 1320022 1313793 1307339 1302956 1301757 1302434 1304250 1308273 1314847 1322858
58337 1322858 1332306 1344696 1360114 1376826 1394367 1413958 1435263 1455962 1475212 1494245 1512746
58326 1512746 1528049 1538928 1546923 1553006 1556239 1556698 1556369 1556096 1554934 1553480 1554401 1558522 1563796 1569270
58312 1569270 1576582 1586387 1596829 1606955 1618218 1631270 1644658 1657954 1672713 1689051 1704824 1719540
58300 1719540 1735438 1753343 1771068 1787433 1804204 1822579 1841356 1860101 1880414 1902489 1924116
$$ packed form
58388A030476j856k153l354l753k462j237j492k092j958k049k777k374r3J923
58374A004749K338L215O269R540J0641J0552J1301J2523J3184J4239J6581J8800
58362A133932J9692K0562K2408K3547K2731K1660K1546K0224J5808J0268O079
58351A338457K343k297n971o615n895o229o454m383j199O77J816M023O574Q011
58337A322858R448J2390J5418J6712J7541J9591K1305K0699J9250J9033J8501
58326A512746J5303J0879P995O083L233M59l29k73j162j454R21M121N274N474
58312A569270P312R805J0442J0126J1263J3052J3388J3296J4759J6338J5773J4716
58300A719540J5898J7905J7725J6365J6771J8375J8777J8745K0313K2075K1627
$$ plain form
58289 1924116 1944559 1965766 1988328 2010186 2030836 2052777 2077199 2102289 2127441 2154978 2186018
58278 2186018 2218890 2253314 2291741 2334665 2378970 2422804 2467653 2513833 2558797 2602058 2647100
58267 2647100 2696168 2747774 2801396 2859623 2923412 2990169 3058699 3130877 3206222 3280378 3351484
58256 3351484 3422460 3494558 3564568 3631194 3698081 3767458 3836974 3906087 3979246 4059144 4143119
58245 4143119 4229873 4323344 4426091 4535343 4649526 4772108 4904882 5044265 5188471 5341459
58235 5341459 5505594 5677628 5856306 6046366 6250569 6465683 6691050 6932652 7193708
58226 7193708 7470140 7760789 8072828 8411287 8773023 9157455 9573113 10026692 10516113
58217 10516113 11041733 11613571 12239922 12920617 13659943 14474127 15377470 16374485 17475662
$$ packed form
58289A924116K0443K1207K2562K1858K0650K1941K4422K5090K5152K7537L1040
58278B186018L2872L4424L8427M2924M4305M3834M4849M6180M4964M3261M5042
58267B647100M9068N1606N3622N8227O3789O6757O8530P2178P5345P4156P1106
58256C351484P0976P2098P0010O6626O6887O9377O9516O9113P3159P9898Q3975
58245D143119Q6754R3471J02747J09252J14183J22582J32774J39383J44206J52988
58235E341459J64135J72034J78678J90060K04203K15114K25367K41602K61056
58226G193708K76432K90649L12039L38459L61736L84432M15658M53579M89421
58217A0516113N25620N71838O26351O80695P39326Q14184R03343R97015J101177
$$ plain form
58208 17475662 18707353 20096394 21661273 23431691 25462472 27817362 30558592 33768537
58200 33768537 37564699 42079393 47447063 53831660 61449712 70558043 81457444 94538104
58192 94538104 110293677 129271417 152051467 179271619 211490583 248733818 289932898
58185 289932898 332630629 373061176 406529934 428217447 434551567 424666091 400903031
58178 400903031 367827979 330454376 292887425 257895783 227036142 200868501 179190814
58171 179190814 161332458 146396388 133389145 121370572 109696773 98186043 87033062
58164 87033062 76559891 67025393 58569264 51217280 44900568 39499426 34892254 30969181
58156 30969181 27622461 24752937 22285731 20164397 18334135 16743955 15358295 14151105
$$ packed form
58208A7475662J231691J389041J564879J770418K030781K354890K741230L209945
58200C3768537L796162M514694N367670O384597P618052R108331J0899401J3080660
58192I4538104J5755573J8977740K2780050K7220152L2218964L7243235M1199080
58185B89932898M2697731M0430547L3468758K1687513O334120r885476k3763060
58178D00903031l3075052l7373603l7566951l4991642l0859641k6167641k1677687
58171A79190814j7858356j4936070j3007243j2018573j1673799j1510730j1152981
58164H7033062j0473171r534498q456129p351984o316712n401142m607172l923073
58156C0969181l346720k869524k467206k121334j830262j590180j385660j207190
$$ plain form
58148 14151105 13092235 12151275 11309338 10554988 9872875 9246865 8669662 8139114 7649232
58139 7649232 7193749 6773640 6391826 6044419 5725182 5433936 5172427 4936333 4719228
58130 4719228 4520144 4339463 4171503 4008822 3850272 3697946 3550156 3404486 3263883
58121 3263883 3132575 3009110 2889903 2776223 2671339 2574070 2481511 2394955 2316920 2245421
58111 2245421 2177147 2113223 2055853 2002296 1948235 1894385 1843906 1795962 1747763 1700452 1657016
58100 1657016 1616469 1575905 1536392 1501220 1469987 1439807 1410861 1385613 1363851 1343386 1324331
58089 1324331 1308052 1293222 1277358 1260947 1245826 1230953 1214015 1195712 1178209 1160747 1141094
58078 1141094 1120033 1100231 1081767 1062677 1042840 1023513 1004220 983838 963611 945519 928871
$$ packed form
58148A4151105j058870r40960q41937p54350o82113o26010n77203n30548m89882
58139G649232m55483m20109l81814l47407l19237k91246k61509k36094k17105
58130D719228j99084j80681j67960j62681j58550j52326j47790j45670j40603
58121C263883j31308j23465j19207j13680j04884r7269r2559q6556p8035p1499
58111B245421o8274o3924n7370n3557n4061n3850n0479m7944m8199m7311m3436
58100A657016m0547m0564l9513l5172l1233l0180k8946k5248k1762k0465j9055
58089A324331j6279j4830j5864j6411j5121j4873j6938j8303j7503j7462j9653
58078A141094k1061j9802j8464j9090j9837j9327j9293k0382k0227j8092j6648
$$ plain form
58067 928871 911949 895649 881953 870222 858615 847761 839368 832534 825137 817600 811634 806448 799893
58054 799893 792164 784741 776868 766878 755957 746771 739192 731072 722445 715299 709771 704146 698175 693053
58040 693053 688584 683488 677954 672885 667459 660572 653790 649445 646528 641815 634452 626113 617287 606982
58026 606982 595738 585524 576654 567801 558831 550743 543221 535242 527626 521966 517555 512485 507258 504008
58012 504008 502580 500803 498366 496953 496615 495558 493763 493355 494853 496274 496570 496957 498152 499181 499727
57997 499727 501052 503756 506938 510150 513929 517936 520886 522894 525758 530368 535814 541294 546868 552053
57983 552053 555805 558262 560598 562917 564112 563816 562577 560292 556607 552711 550432 549563 548324 546409 545234
57968 545234 545245 545531 546168 548308 551632 554294 555820 557606 560123 562164 563419 565223 567913 569824 569812 568580
$$ packed form
58067I28871j6922j6300j3696j1731j1607j0854q393o834p397p537n966n186o555
58054G99893p729p423p873r990j0921r186p579q120q627p146n528n625n971n122
58040F93053m469n096n534n069n426o887o782m345k917m713p363q339q826j0305
58026F06982j1244j0214q870q853q970q088p522p979p616n660m411n070n227l250
58012E04008j428j777k437j413l38j057j795m08J498J421K96L87J195J029N46
57997D99727J325K704L182L212L779M007K950K008K864M610N446N480N574N185
57983E52053L752K457K336K319J195k96j239k285l685l896k279q69j239j915j175
57968E45234J1K86O37K140L324K662J526J786K517K041J255J804K690J911j2j232
$$ plain form
57952 568580 566657 563240 558050 552282 546664 540460 533444 527056 522476 519138 516235 514267 514026 515227
57938 515227 517109 519473 522505 526540 532360 540686 551134 562680 575055 588369 601506 612573 621041
57925 621041 627784 632913 635373 634950 632822 629743 625340 619610 613356 606681 598729 589443 580064 571369
57911 571369 562966 554778 547661 541969 536894 531730 526535 521218 515293 508826 502317 495469 487429 478269
57897 478269 468867 459410 449657 440588 433895 429685 426445 423350 420753 418476 415768 413141 412018 412204
57883 412204 411965 411045 411220 413173 415195 415890 415917 416029 415575 414120 412542 411197 408855 404775 400203 396538
57867 396538 393595 390805 388474 386658 384403 381383 378794 377425 376354 374879 374235 375937 379715 384501
57853 384501 390253 397403 405573 414195 423426 433206 442386 450036 456824 463947 471486 478761 485429 491250
$$ packed form
57952E68580j923l417n190n768n618o204p016o388m580l338k903j968k41J201
57938E15227J882K364L032M035N820Q326J0448J1546J2375J3314J3137J1067Q468
57925F21041O743N129K460m23k128l079m403n730o254o675p952r286r379q695
57911E71369q403q188p117n692n075n164n195n317n925o467o509o848q040r160
57897D78269r402r457r753r069o693m210l240l095k597k277k708k627j123J86
57883D12204k39r20J75J953K022O95K7J12m54j455j578j345k342m080m572l665
57867C96538k943k790k331j816k255l020k589j369j071j475o44J702L778M786
57853C84501N752P150Q170Q622R231R780R180P650O788P123P539P275O668N821
$$ plain form
57839 491250 495561 497994 499075 499451 499273 498777 498387 497699 495563 491857 487965 484889 482180 479314 476602
57824 476602 473957 470429 466049 462546 461033 460379 459115 457548 456665 456285 455796 455524 455885 456212 455872 455551
57808 455551 456038 456714 456642 456163 455856 454759 451262 445198 437709 429676 421607 414424 408955 404996 401943 399782
57792 399782 398446 397014 394769 392371 390827 390000 389334 389253 390474 392582 394674 396775 399232 401309 401936
57777 401936 401544 401748 403324 405710 408218 410584 412547 414026 415524 417365 418855 419129 418366 417067 414621
57762 414621 409959 403442 396747 390776 384823 377928 370128 362156 354669 347930 341778 335877 330322 325742
57748 325742 322449 319937 317688 315945 315176 315294 315960 317022 318052 318151 316997 315479 314561 314136 313709 313453
57732 313453 313693 314023 313934 313753 314001 314354 314170 313572 313131 312972 313044 313696 315079 316579 317776 319312 321820 324602
$$ packed form
57839D91250M311K433J081L76j78m96l90o88k136l706l892l076k709k866k712
57824D76602k645l528m380l503j513o54j264j567q83l80m89k72L61L27l40l21
57808D55551M87O76p2m79l07j097l497o064p489q033q069p183n469l959l053k161
57792C99782j336j432k245k398j544q27o66q1J221K108K092K101K457K077O27
57777D01936l92K04J576K386K508K366J963J479J498J841J490K74p63j299k446
57762D14621m662o517o695n971n953o895p800p972p487o739o152n901n555m580
57748C25742l293k512k249j743p69J18O66J062J030R9j154j518r18m25m27k56
57732C13453K40L30q9j81K48L53j84n98m41j59P2O52J383J500J197J536K508K782
$$ plain form
57714 324602 326446 327198 327405 327006 325631 323817 322663 322434 322533 322590 322641 322542 322173 321995 322464 323221 323688 324083 324959
57695 324959 326272 327861 330278 333907 337655 339700 339394 337398 334324 330406 326259 322806 320490 319511 320560
57680 320560 324307 330359 337795 346633 357861 372250 390184 412463 440286 474526 515950 565980
57668 565980 626225 697161 777731 865411 955197 1038441 1104028 1141786 1145663 1115441 1057065 980915
57656 980915 897841 815620 738522 668869 607789 555185 510453 473261 442890 417520 395391
57645 395391 376295 360771 348337 337770 328624 321033 314432 308039 302391 298802 297220 296104 294458
57632 294458 292628 291013 289436 288007 287284 287261 287282 287166 287268 287367 286675 285106 283334 281477 278978 276003 273673
57615 273673 272506 271733 270561 269073 267555 265990 264604 263927 263892 263676 262754 261415 260128 259190 259015 259817
$$ packed form
57714C24602J844P52K07l99j375j814j154k29R9N7N1r9l69j78M69P57M67L95Q76
57695C24959J313J589K417L629L748K045l06j996l074l918m147l453k316r79J049
57680C20560L747O052P436Q838J1228J4389J7934K2279K7823L4240M1424N0030
57668E65980O0245P0936Q0570Q7680Q9786Q3244O5587L7758L877l0222n8376p6150
57656I80915q3074q2221p7098o9653o1080n2604m4732l7192l0371k5370k2129
57645C95391j9096j5524j2434j0567r146p591o601o393n648l589j582j116j646
57632B94458j830j615j577j429p23k3K1j16J02R9o92j569j772j857k499k975k330
57615B73673j167p73j172j488j518j565j386o77l5k16r22j339j287r38j75Q02
$$ plain form
57599 259817 260866 261015 260102 258990 258181 257414 256634 256225 256038 255262 253588 251574 249667 247734 245729 243898
57583 243898 242221 240520 239164 238684 238697 238175 236777 234903 232606 229770 227233 226192 226276 225793 224230 222987
57567 222987 223085 223659 223471 222555 221507 220324 218893 217705 217214 217201 217397 217971 218884 219597 219999 220772 222271 223880
57549 223880 225038 226102 227625 229500 231359 233132 234736 235919 236779 237746 238770 239438 240059 241608 244178
57534 244178 246537 247711 247982 247844 247091 245574 243862 242422 241070 239782 239026 238727 238005 236742 236286 237663
57518 237663 240064 242088 243570 245134 246757 248045 249392 251633 254763 257917 260433 262207 263315 264011
57504 264011 264887 266385 268348 270404 272451 274398 275867 276588 276690 276293 275357 274204 273482 273171 272327 270334
57488 270334 267845 266036 265452 265909 266799 267129 266065 263972 262254 261720 261841 261928 262105 262611 263133 263516 264214
$$ packed form
57599B59817J049J49r13j112q09p67p80m09j87p76j674k014j907j933k005j831
57583B43898j677j701j356m80J3n22j398j874k297k836k537j041Q4m83j563j243
57567B22987R8N74j88r16j048j183j431j188m91j3J96N74R13P13M02P73J499J609
57549B23880J158J064J523J875J859J773J604J183Q60R67J024O68O21J549K570
57534B44178K359J174K71j38p53j517j712j440j352j288p56k99p22j263m56J377
57518B37663K401K024J482J564J623J288J347K241L130L154K516J774J108O96
57504B64011Q76J498J963K056K047J947J469P21J02l97r36j153p22l11q44j993
57488B70334k489j809n84M57Q90L30j064k093j718n34J21Q7J77N06N22L83O98
$$ plain form
57471 264214 265300 265920 265557 265007 265249 266078 266666 266800 266728 266455 266092 266263 267343 268849 270302 272013 274276
57454 274276 276550 278324 280096 282485 285013 286782 287861 288963 290203 291134 291734 292486 293763 295786 298759
57439 298759 302322 305455 307636 309561 311952 314355 315987 317096 318430 319982 321363 322836 324853 326980
57425 326980 328546 329951 332105 334804 336921 338122 339130 340305 341151 341454 341855 342945 344587 346425 348502
57410 348502 351131 354547 358748 363335 367624 371219 374248 376763 378360 378902 379138 379988 381697 384232 387859
57395 387859 392496 397041 400379 402726 405142 408026 411058 414247 418001 422284 426705 431351 436691 442684
57381 442684 448787 454692 460350 465472 469884 474219 479368 485256 490907 495669 499663 503192 506503 509989
57367 509989 513853 517602 520628 523190 526088 529468 532746 535677 538768 542542 547034 552021 557250 562456
$$ packed form
57471B64214J086O20l63n50K42Q29N88J34p2k73l63J71J080J506J453J711K263
57454B74276K274J774J772K389K528J769J079J102J240R31O00P52J277K023K973
57439B98759L563L133K181J925K391K403J632J109J334J552J381J473K017K127
57425C26980J566J405K154K699K117J201J008J175Q46L03M01J090J642J838K077
57410C48502K629L416M201M587M289L595L029K515J597N42K36Q50J709K535L627
57395C87859M637M545L338K347K416K884L032L189L754M283M421M646N340N993
57381D42684O103N905N658N122M412M335N149N888N651M762L994L529L311L486
57367E09989L864L749L026K562K898L380L278K931L091L774M492M987N229N206
$$ plain form
57353 562456 567609 573022 578797 584492 589792 595135 601120 607711 614585 621730 629009 635752 641686 647730
57339 647730 654884 662743 670093 676549 682588 688427 694053 700020 706935 714313 721157 727499 734179 741281
57325 741281 748117 754733 762026 770206 778441 786344 794590 803669 813083 822261 831308 840466 849669 858996
57311 858996 868817 879147 889553 899949 910781 922229 933910 945541 957166 968586 979299 989263
57299 989263 999090 1009365 1020305 1032108 1044970 1058708 1072993 1087881 1103497 1119425 1135202 1151216
57287 1151216 1168184 1185862 1203305 1220386 1238033 1256893 1276710 1297067 1317762 1338422 1358729
57276 1358729 1379036 1399775 1420299 1439435 1457227 1474944 1493317 1512133 1531756 1553570 1578385
57265 1578385 1605643 1634706 1665701 1698363 1731222 1762908 1793504 1823943 1854696 1885659 1916682
$$ packed form
57353E62456N153N413N775N695N300N343N985O591O874P145P279O743N934O044
57339F47730P154P859P350O456O039N839N626N967O915P378O844O342O680P102
57325G41281O836O616P293Q180Q235P903Q246R079R414R178R047R158R203R327
57311H58996R821J0330J0406J0396J0832J1448J1681J1631J1625J1420J0713R964
57299I89263R827J0275J0940J1803J2862J3738J4285J4888J5616J5928J5777J6014
57287A151216J6968J7678J7443J7081J7647J8860J9817K0357K0695K0660K0307
57276A358729K0307K0739K0524J9136J7792J7717J8373J8816J9623K1814K4815
57265A578385K7258K9063L0995L2662L2859L1686L0596L0439L0753L0963L1023
$$ plain form
57254 1916682 1947580 1978095 2008197 2037963 2067041 2094970 2122230 2150139 2179516 2210267 2242408
57243 2242408 2276410 2312126 2348478 2384808 2421815 2460621 2501586 2544293 2587868 2631061 2672915
57232 2672915 2713778 2754814 2796322 2837464 2877854 2918249 2959237 3000447 3041536 3082778 3124089
57221 3124089 3164683 3204501 3244892 3286974 3330263 3373781 3417657 3462742 3509386 3557410 3606596
57210 3606596 3656480 3706416 3756616 3808393 3862582 3918386 3974512 4030633 4086933 4142954 4197902
57199 4197902 4251593 4304213 4355565 4405316 4453683 4501340 4549056 4597772 4648395 4700938 4754479
57188 4754479 4808407 4863018 4918479 4974081 5029165 5084062 5139460 5195635 5252872 5311863 5372937
57177 5372937 5435562 5499190 5563765 5628834 5693011 5755020 5814481 5871147 5924338 5973825 6020236
$$ packed form
57254A916682L0898L0515L0102K9766K9078K7929K7260K7909K9377L0751L2141
57243B242408L4002L5716L6352L6330L7007L8806M0965M2707M3575M3193M1854
57232B672915M0863M1036M1508M1142M0390M0395M0988M1210M1089M1242M1311
57221C124089M0594L9818M0391M2082M3289M3518M3876M5085M6644M8024M9186
57210C606596M9884M9936N0200N1777N4189N5804N6126N6121N6300N6021N4948
57199D197902N3691N2620N1352M9751M8367M7657M7716M8716N0623N2543N3541
57188D754479N3928N4611N5461N5602N5084N4897N5398N6175N7237N8991O1074
57177E372937O2625O3628O4575O5069O4177O2009N9461N6666N3191M9487M6411
$$ plain form
57166 6020236 6063765 6103421 6138375 6169011 6195772 6218013 6235063 6247477 6256297 6262040 6265485 6268332
57154 6268332 6271779 6275275 6277921 6280252 6283374 6287298 6291581 6296972 6304961 6316178 6330400 6347474 6367002
57141 6367002 6387689 6408265 6428477 6448117 6465944 6480878 6493361 6503968 6511437 6513713 6510446 6503025
57129 6503025 6492735 6480446 6467621 6456074 6447111 6442179 6443653 6453361 6470778 6493881 6520962 6550194
57117 6550194 6578723 6604418 6628089 6652315 6679054 6710315 6750121 6803266 6872783 6960959 7072201
57106 7072201 7212598 7387664 7603454 7869510 8198309 8603137 9100067 9711245 10462083
57097 10462083 11374912 12468655 13764438 15288172 17069056 19141007 21545320 24325332
57089 24325332 27515583 31137468 35199699 39690068 44561833 49732047 55082608 60429654
$$ packed form
57166F020236M3529L9656L4954L0636K6761K2241J7050J2414Q820N743L445K847
57154F268332L447L496K646K331L122L924M283N391P989J1217J4222J7074J9528
57141F367002K0687K0576K0212J9640J7827J4934J2483J0607P469K276l267p421
57129F503025j0290j2289j2825j1547q963m932J474R708J7417K3103K7081K9232
57117F550194K8529K5695K3671K4226K6739L1261L9806N3145O9517Q8176J11242
57106G072201J40397J75066K15790K66056L28799M04828M96930O11178P50838
57097A0462083R12829J093743J295783J523734J780884K071951K404313K780012
57089B4325332L190251L621885M062231M490369M871765N170214N350561N347046
$$ plain form
57081 60429654 65469037 69775596 72915993 74617848 74862599 73838271 71817204 69061154
57073 69061154 65787225 62164451 58316264 54330959 50279110 46223618 42217644 38302923
57065 38302923 34516965 30901684 27503781 24367766 21527611 19000078 16781525 14850507
57057 14850507 13175206 11720785 10453764 9344803 8370913 7515457 6765542 6109287 5534961
57048 5534961 5031356 4588319 4197359 3851774 3545663 3272893 3027737 2806303 2606323
57039 2606323 2425466 2260740 2109655 1970937 1843672 1726588 1618683 1519920 1430744 1351233
57029 1351233 1281108 1220186 1168427 1125738 1091969 1066940 1050487 1042897 1045418 1059937 1087832 1129095
57017 1129095 1182196 1243904 1308741 1368727 1414089 1434917 1423770 1378716 1304807 1212096 1111385
$$ packed form
57081F0429654N039383M306559L140397J701855K44751j024328k021067k756050
57073F9061154l273929l622774l848187l985305m051849m055492m005974l914721
57065C8302923l785958l615281l397903l136015k840155k527533k218553j931018
57057A4850507j675301j454421j267021j108961r73890q55456p49915o56255n74326
57048E534961n03605m43037l90960l45585l06111k72770k45156k21434j99980
57039B606323j80857j64726j51085j38718j27265j17084j07905r8763q9176p9511
57029A351233p0125o0922n1759m2689l3769k5029j6453p590K521J4519K7895M1263
57017A129095N3101O1708O4837N9986M5362K0828j1147m5054p3909r2711j00711
$$ plain form
57006 1111385 1011083 916666 831123 755104 687608 627590 574833 529165 489678 455445 426498
56995 426498 403348 385877 373338 365200 361305 361392 364991 371622 380651 391299 403418 417874 435389
56982 435389 455002 474187 490243 501009 504716 500385 488725 471912 452222 431281 410498 391285
56970 391285 374491 360171 348194 338640 331531 326797 324718 325876 330400 337783 347662 360289 376018
56957 376018 394730 415814 438031 459019 475506 484499 484239 474288 455633 431081 404685 379848
56945 379848 357969 338986 322736 309462 299536 293219 290464 290735 293462 298934 308301 322454 341458
56932 341458 365303 394384 428357 464782 499382 527413 544695 548367 537877 515403 484778 449888
56920 449888 413939 379398 347753 319419 294337 272530 253925 238203 225297 215504 208520 202921
$$ packed form
57006A111385j00302r4417q5543p6019o7496o0018n2757m5668l9487l4233k8947
56995D26498k3150j7471j2539q138l895Q7L599O631R029J0648J2119J4456J7515
56982D35389J9613J9185J6056J0766L707m331j1660j6813j9690k0941k0783j9213
56970C91285j6794j4320j1977r554p109m734k079J158M524P383R879J2627J5729
56957C76018J8712K1084K2217K0988J6487Q993k60r951j8655k4552k6396k4837
56945C79848k1879j8983j6250j3274r926o317k755K71K727N472R367J4153J9004
56932C41458K3845K9081L3973L6425L4600K8031J7282L672j0490k2474l0625l4890
56920D49888l5949l4541l1645k8334k5082k1807j8605j5722j2906r793o984n599
$$ plain form
56908 202921 197339 191799 187138 183479 180162 176972 174539 173459 173763 175273 177821 181038 184522 188370
56894 188370 193094 198961 205913 214183 224555 237867 254575 274707 297859 323145 349382 375141
56882 375141 398328 416012 425418 425456 417243 403269 386231 368360 351282 336250 324404 316566 312768
56869 312768 312572 316144 324568 338752 358564 383564 414125 451224 495531 547211 605949 669912
56857 669912 734428 792247 835570 858386 858225 836979 800091 754209 705192 657752 615515 580362
56845 580362 552305 531114 517776 513607 518648 532208 554701 587754 632648 689873 760077 843900
56833 843900 940138 1044428 1149426 1245213 1319916 1362309 1365879 1331215 1265047 1177699 1080592
56822 1080592 983778 893909 814130 745650 688906 643611 609135 585461 573069 571724 580379 598753
$$ packed form
56908B02921n582n540m661l659l317l190k433j080L04J510K548L217L484L848
56894A88370M724N867O952Q270J0372J3312J6708K0132K3152K5286K6237K5759
56882C75141K3187J7684R406L8q213j3974j7038j7871j7078j5032j1846p838l798
56869C12768j96L572Q424J4184J9812K5000L0561L7099M4307N1680N8738O3963
56857F69912O4516N7819M3323K2816j61k1246l6888m5882m9017m7440m2237l5153
56845E80362k8057k1191j3338m169N041J3560K2493L3053M4894N7225P0204Q3823
56833H43900R6238J04290J04998R5787P4703M2393L570l4664o6168q7348r7107
56822A080592r6814q9869p9779o8480n6744m5295l4476k3674j2392j345Q655J8374
$$ plain form
56810 598753 628064 669584 723090 787001 858852 934329 1005976 1063820 1098089 1102397 1075867 1023310
56798 1023310 953225 874810 795888 722178 656935 600864 553149 513164 481066 456987 440532
56787 440532 431278 429066 433593 444402 461562 485676 516811 553644 593502 632349 664638 684292
56775 684292 686984 671788 641087 599458 552330 504309 457979 414480 375022 340992 312634 288763
56763 288763 268137 250271 234690 220560 207596 196364 187100 179065 171662 165284 160379 156457 152784
56750 152784 149366 146502 143986 141530 139420 138019 137034 136015 135073 134451 133751 132425 130786 129804 129909 130504
56734 130504 130650 129939 128777 127972 127874 127957 127603 127174 127590 128838 129762 129659 129198 129354 130286 131780 133969 136846
56716 136846 139670 141615 142624 143123 143378 143660 144460 145921 147542 148929 150324 151918 153270 153972 154268 154439
$$ packed form
56810E98753K9311M1520N3506O3911P1851P5477P1647N7844L4269M308k6530n2557
56798A023310p0085p8415p8922p3710o5243n6071m7715l9985l2098k4079j6455
56787D40532r254k212M527J0809J7160K4114L1135L6833L9858L8847L2289J9654
56775F84292K692j5196l0701m1629m7128m8021m6330m3499l9458l4030k8358k3871
56763B88763k0626j7866j5581j4130j2964j1232r264q035p403o378m905l922l673
56750A52784l418k864k516k456k110j401r85j019r42o22p00j326j639r82J05N95
56734A30504J46p11j162q05r8Q3l54m29M16J248R24j03m61J56R32J494K189K877
56716A36846K824J945J009M99K55K82Q00J461J621J387J395J594J352P02K96J71
$$ plain form
56700 154439 154244 153696 153627 154597 155745 155752 154616 153584 153535 154213 154874 154907 153997 152354 150727 149662 148888 147924
56682 147924 146961 146510 146472 146250 145620 144870 144177 143453 142782 142452 142545 142841 143096 143132 142814 142225 141708 141520 141673 142284
56662 142284 143610 145459 147009 147687 147905 148545 150011 152024 154033 155537 156487 157579 159653 162502 164899
56647 164899 166199 167233 169125 171844 174493 176518 177967 179037 179888 180672 181379 182007 182992 184764 186663
56632 186663 187299 186459 185638 185961 186590 186141 184729 183506 182932 182830 183597 185907 189268 192087 193301 193177 192552
56615 192552 192016 191764 191580 191068 190394 190463 191780 193561 194682 195108 195630 196621 197872 199311 200887 202024 202073
56598 202073 201229 200251 199424 198455 197146 195450 193176 190403 187958 186750 186738 187172 187553 187762 187686 187436 187519 188005
56580 188005 187998 186757 184917 183702 183368 183398 183801 185069 187086 189153 190983 192713 194181 195239 196626 199400
$$ packed form
56700A54439j95n48o9R70J148Pj136j032m9O78O61L3r10j643j627j065p74r64
56682A47924r63m51l8k22o30p50o93p24o71l30R3K96K55L6l18n89n17j88J53O11
56662A42284J326J849J550O78K18O40J466K013K009J504R50J092K074K849K397
56647A64899J300J034J892K719K649K025J449J070Q51P84P07O28R85J772J899
56632A86663O36q40q21L23O29m49j412j223n74j02P67K310L361K819J214j24o25
56615A92552n36k52j84n12o74O9J317J781J121M26N22R91J251J439J576J137M9
56598B02073q44r78q27r69j309j696k274k773k445j208j2M34L81K09p6k50Q3M86
56580A88005pj241j840j215l34L0M03J268K017K067J830J730J468J058J387K774
$$ plain form
56564 199400 203548 208207 213165 219092 226303 234409 243327 253545 265067 276904 287800 296765 302884
56551 302884 305647 305753 304878 304311 304314 304795 305803 307110 307966 307654 306087 303802 301598 299915 298303 295789
56535 295789 292157 288351 285126 281954 277970 273324 268658 263830 258328 252566 247617 243842 240798 238239
56521 238239 236150 234080 231574 229149 227728 227224 226742 225996 225397 224852 223763 222150 220593 219065 217030
56506 217030 214778 213365 213054 212986 212616 212329 212348 212129 211245 209943 208503 206890 205274 204062 203213 202337 201543
56489 201543 201321 201521 201406 200867 200573 200790 200951 200630 200038 199378 198608 197998 198098 198996 200342 202058 204151 205962
56471 205962 206673 206631 207071 208477 210193 211632 212756 213343 213047 212340 212202 212639 212663 211985 211525 211942 212834 213764
56453 213764 214950 216517 218067 219400 220771 222087 222801 222865 222889 223115 223139 222831 222620 222790 223367 224647 226705
$$ packed form
56564A99400M148M659M958N927P211Q106Q918J0218J1522J1837J0896Q965O119
56551C02884K763J06q75n67LM81J008J307Q56l12j567k285k204j683j612k514
56535B95789l632l806l225l172l984m646m666m828n502n762m949l775l044k559
56521B38239k089k070k506k425j421n04m82p46n99n45j089j613j557j528k035
56506B17030k252j413l11o8l70k87J9k19q84j302j440j613j616j212q49q76p94
56489B01543k22K00j15n39k94K17J61l21n92o60p70o10J00Q98J346J716K093J811
56471B05962P11m2M40J406J716J439J124N87k96p07j38M37K4o78m60M17Q92R30
56453B13764J186J567J550J333J371J316P14O4K4K26K4l08k11J70N77J280K058
$$ plain form
56436 226705 228461 228570 227337 226431 226633 227217 227615 228058 228311 227498 225762 224535 224584 225146 225593 226400 227818
56419 227818 229066 229682 230310 231314 231958 231801 231685 232368 233331 233846 234109 234448 234471 233899 233304 233200 233348 233636
56401 233636 234600 236342 237976 238899 239578 240416 241047 241484 242685 245021 247374 248739 249586 250675 251657 251996
56385 251996 252221 253080 254282 255152 255742 256294 256519 256439 257090 259245 262165 264569 266140 267184 267669 267663 268018 269539
56367 269539 272009 274776 277650 280453 282552 283655 284314 284873 284889 284386 284555 286119 287990 288736 288573 288722
56351 288722 289609 290926 292760 295315 297958 299697 300297 300136 299515 298958 299410 301134 303046 304116 304799 306076
56335 306076 307816 309345 311000 313799 317772 321792 325045 327822 330839 334368 337986 340943 343020 345075
56321 345075 348053 351397 353468 353786 353667 354156 354675 354448 353934 353895 354134 354212 354417 355016 355515 355639 356183 357908
$$ packed form
56436B26705J756J09j233r06K02N84L98M43K53q13j736j227M9N62M47Q07J418
56419B27818J248O16O28J004O44j57j16O83R63N15K63L39K3n72n95j04J48K88
56401B33636R64J742J634R23O79Q38O31M37J201K336K353J365Q47J089R82L39
56385B51996K25Q59J202Q70N90N52K25q0O51K155K920K404J571J044M85oL55J521
56367B69539K470K767K874K803K099J103O59N59J6n03J69J564J871P46j63J49
56351B88722Q87J317J834K555K643J739O00j61o21n57M52J724J912J070O83J277
56335C06076J740J529J655K799L973M020L253K777L017L529L618K957K077K055
56321C45075K978L344K071L18j19M89N19k27n14l9K39P8K05N99M99J24N44J725
$$ plain form
56303 357908 360499 363387 366582 369890 372538 374526 377106 380846 384520 387100 389442 392623 395967 398386
56289 398386 400474 403442 406969 409975 412792 416670 421634 426601 431284 436335 441915 447627 453690 460744
56275 460744 468600 476369 483700 491006 498774 507489 517722 529377 541456 553394 565940 579965 595361
56262 595361 612081 631085 652981 676817 701618 728239 758294 792225 830008 872825 922231
56251 922231 978177 1039514 1106116 1179095 1259362 1347271 1443169 1546935 1657277 1772482 1891306
56240 1891306 2012282 2133056 2251345 2365482 2472928 2569553 2651808 2718371 2768312 2799174
56230 2799174 2808783 2797763 2768282 2721461 2658084 2580797 2493208 2397464 2294791 2187703 2079508
56219 2079508 1972158 1866644 1764855 1668844 1578690 1493205 1412346 1336984 1266870 1201058 1139941
$$ packed form
56303C57908K591K888L195L308K648J988K580L740L674K580K342L181L344K419
56289C98386K088K968L527L006K817L878M964M967M683N051N580N712O063P054
56275D60744P856P769P331P306P768Q715J0233J1655J2079J1938J2546J4025J5396
56262E95361J6720J9004K1896K3836K4801K6621L0055L3931L7783M2817M9406
56251I22231N5946O1337O6602P2979Q0267Q7909R5898J03766J10342J15205J18824
56240A891306J20976J20774J18289J14137J07446R6625Q2255O6563M9941L0862
56230B799174R609j1020k9481m6821o3377p7287q7589r5744j02673j07088j08195
56219B079508j07350j05514j01789r6011r0154q5485q0859p5362p0114o5812o1117
$$ plain form
56208 1139941 1084628 1034608 988157 944801 905305 869547 836600 806688 780873 758836 739057
56197 739057 721133 705840 692965 681190 670268 661301 654595 648958 643328 637535 631465 625027 618923
56184 618923 613992 610015 606426 603595 601860 600128 597323 594461 593234 593215 592732 591879 592199 593771 595132
56169 595132 595965 597443 599935 602678 605727 609952 615081 619960 624831 631161 639109 647270 654986 662913
56155 662913 671340 680028 689574 700825 712998 724579 735975 749143 764718 781749 800140 820960
56143 820960 844320 869305 896221 926752 961771 1001088 1045402 1096535 1155810 1224127 1303254
56132 1303254 1394722 1497565 1609028 1726869 1848570 1969048 2082132 2184436 2275778 2356612
56122 2356612 2427849 2492358 2553072 2609353 2657676 2695385 2720961 2731650 2724960 2702812 2670738
$$ packed form
56208A139941n5313n0020m6451m3356l9496l5758l2947k9912k5815k2037j9779
56197G39057j7924j5293j2875j1775j0922q967o706n637n630n793o070o438o104
56184F18923m931l977l589k831j735j732k805k862j227j9m83q53L20J572J361
56169E95132Q33J478K492K743L049M225N129M879M871O330P948Q161P716P927
56155F62913Q427Q688R546J1251J2173J1581J1396J3168J5575J7031J8391K0820
56143H20960K3360K4985K6916L0531L5019L9317M4314N1133N9275O8317P9127
56132A303254R1468J02843J11463J17841J21701J20478J13084J02304R1342Q0834
56122B356612P1237O4509O0714N6281M8323L7709K5576J0689o690k2148l2074
$$ plain form
56111 2670738 2632629 2589189 2540943 2488478 2429123 2357544 2271214 2172680 2066095 1954833 1843080
56100 1843080 1736145 1637619 1548479 1469338 1400897 1342104 1290954 1247419 1212564 1184914 1161235
56089 1161235 1140985 1126207 1116760 1109608 1103321 1099293 1097759 1096664 1095431 1095959 1098814 1102194 1105644 1111030
56075 1111030 1118750 1126747 1134349 1143366 1154417 1165863 1177259 1190025 1203908 1216873 1229348 1244292
56063 1244292 1262045 1279518 1295473 1312006 1329514 1345083 1357579 1369682 1383069 1396032 1407680
56052 1407680 1420006 1433916 1447652 1460917 1476068 1493446 1510190 1525499 1542285 1561713 1581076
56041 1581076 1599119 1618450 1640486 1663169 1686122 1712842 1745196 1780695 1817705 1858142 1902452
56030 1902452 1947400 1991655 2038246 2088531 2139226 2188409 2238868 2292277 2345737 2397541 2450727
$$ packed form
56111B670738l8109m3440m8246n2465n9355p1579q6330r8534j06585j11262j11753
56100A843080j06935r8526q9140p9141o8441n8793n1150m3535l4855k7650k3679
56089A161235k0250j4778r447p152o287m028j534j095j233N28K855L380L450N386
56075A111030P720P997P602R017J1051J1446J1396J2766J3883J2965J2475J4944
56063A244292J7753J7473J5955J6533J7508J5569J2496J2103J3387J2963J1648
56052A407680J2326J3910J3736J3265J5151J7378J6744J5309J6786J9428J9363
56041A581076J8043J9331K2036K2683K2953K6720L2354L5499L7010M0437M4310
56030A902452M4948M4255M6591N0285N0695M9183N0459N3409N3460N1804N3186
$$ plain form
56019 2450727 2507321 2564599 2620673 2678225 2739142 2801187 2863635 2930318 3003236 3079077 3155818
56008 3155818 3236649 3323484 3413081 3503793 3599596 3703126 3811352 3922550 4040584 4167670
55998 4167670 4300130 4436187 4580601 4736546 4900551 5070599 5251122 5444432 5645746
55989 5645746 5852883 6072268 6309002 6559846 6822775 7104169 7409321 7735425 8081716
55980 8081716 8456768 8867577 9311552 9787861 10306210 10875513 11495239 12167687 12907245
55971 12907245 13727495 14631948 15628872 16742390 17997597 19409944 21003766 22827847
55963 22827847 24940485 27397648 30273592 33677281 37732626 42563078 48316855 55191031
55955 55191031 63419761 73276781 85124369 99435762 116745500 137619125 162688033
$$ packed form
56019B450727N6594N7278N6074N7552O0917O2045O2448O6683P2918P5841P6741
56008C155818Q0831Q6835Q9597R0712R5803J03530J08226J11198J18034J27086
55998D167670J32460J36057J44414J55945J64005J70048J80523J93310K01314
55989E645746K07137K19385K36734K50844K62929K81394L05152L26104L46291
55980H081716L75052M10809M43975M76309N18349N69303O19726O72448P39558
55971A2907245Q20250R04453R96924J113518J255207J412347J593822J824081
55963B2827847K112638K457163K875944L403689M055345M830452N753777O874176
55955E5191031Q228730R857020J1847588J4311393J7309738K0873625K5068908
$$ plain form
55948 162688033 192569153 227483428 266709372 308204433 348542607 383162457 407090334
55941 407090334 416306023 409301953 387789545 355921256 318584891 279951919 242909363
55934 242909363 209132122 179338131 153573817 131529344 112786743 96916867 83497178
55927 83497178 72147214 62559153 54475239 47654357 41881211 36985996 32829363 29280935
55919 29280935 26229783 23599250 21330984 19364441 17645316 16139327 14820475 13655612
55911 13655612 12613889 11680361 10846272 10094971 9409518 8784735 8219229 7703403 7226514
55902 7226514 6787694 6389004 6024538 5686428 5374700 5091375 4831195 4587452 4360873
55893 4360873 4153925 3962278 3780495 3610334 3454978 3310600 3171950 3041060 2922213
$$ packed form
55948A62688033K9881120L4914275L9225944M1495061M0338174L4619850K3927877
55941D07090334R215689p004070k1512408l1868289l7336365l8632972l7042556
55934B42909363l3777241k9793991k5764314k2044473j8742601j5869876j3419689
55927H3497178j1349964r588061q083914o820882n773146m895215m156633l548428
55919B9280935l051152k630533k268266j966543j719125j505989j318852j164863
55911A3655612j041723r33528q34089p51301o85453o24783n65506n15826m76889
55902G226514m38820l98690l64466l38110l11728k83325k60180k43743k26579
55893D360873k06948j91647j81783j70161j55356j44378j38650j30890j18847
$$ plain form
55884 2922213 2813112 2708950 2610660 2521345 2438807 2359296 2284872 2219825 2163234 2111896 2066970
55873 2066970 2030750 1999824 1967925 1932740 1894193 1849379 1795662 1736226 1676658 1618362 1560391
55862 1560391 1504755 1454241 1407521 1361812 1318041 1278418 1241421 1204276 1168171 1136255 1108715
55851 1108715 1084247 1063768 1047959 1033539 1016677 997998 979996 962002 942055 921198 901349
55840 901349 881312 859412 837739 819258 802962 786359 770481 757699 746714 734563 721846
55829 721846 711355 703104 695226 688153 683374 679447 673698 666657 660536 654563 646090 635252 624400
55816 624400 613926 602726 591810 583385 577072 570816 564774 560697 558290 555874 553986 554785 558508 563747
55802 563747 570469 579439 589463 598452 606428 614388 621132 624398 624184 621770 616501 606838 593691 579452
$$ packed form
55884B922213j09101j04162r8290q9315q2538p9511p4424o5047n6591n1338m4926
55873B066970l6220l0926l1899l5185l8547m4814n3717n9436n9568n8296n7971
55862A560391n5636n0514m6720m5709m3771l9623l6997l7145l6105l1916k7540
55851A108715k4468k0479j5809j4420j6862j8679j8002j7994j9947k0857j9849
55840I01349k0037k1900k1673j8481j6296j6603j5878j2782j0985j2151j2717
55829G21846j0491q251p878p073m779l927n749p041o121n973q473j0838j0852
55816F24400j0474j1200j0916q425o313o256o042m077k407k416j888P99L723N239
55802E63747O722Q970J0024Q989P976P960O744L266k14k414n269r663j3147j4239
$$ plain form
55788 579452 564599 548544 532825 519983 510049 501452 494512 490541 488263 484811 479770 474771 469641
55775 469641 462667 454395 447487 442765 438790 435483 434787 437367 441662 446510 451908 456878 459346 458438 454636
55760 454636 447759 437400 425163 413774 403895 394268 384746 376462 369165 361280 352788 345330 339350
55747 339350 333673 328035 323361 319394 314688 309226 304611 301335 298265 295058 292678 291184 289371 286954
55733 286954 284935 283526 281925 280374 280157 281252 282100 281980 281471 280380 277492 272797 267799 263231 258508
55718 258508 253799 250481 248964 247935 246392 244818 244048 244525 246780 250935 255638 259178 261675 264415 267305
55703 267305 269071 269776 270755 271900 271355 268382 264308 260120 255264 249456 243689 238716 234214 230065 226839
55688 226839 224537 222507 221031 221303 223439 226127 228605 231270 234035 235983 237199 239139 242472 246058
$$ packed form
55788E79452j4853j6055j5719j2842r934q597o940l971k278l452n041m999n130
55775D69641o974q272o908m722l975l307o96K580M295M848N398M970K468r08l802
55760D54636o877j0359j2237j1389r879r627r522q284p297p885q492p458n980
55747C39350n677n638m674l967m706n462m615l276l070l207k380j494j813k417
55733B86954k019j409j601j551k17J095Q48j20n09j091k888m695m998m568m723
55718B58508m709l318j517j029j543j574p70M77K255M155M703L540K497K740K890
55703B67305J766P05R79J145n45k973m074m188m856n808n767m973m502m149l226
55688B26839k302k030j476K72K136K688K478K665K765J948J216J940L333L586
$$ plain form
55674 246058 248687 250386 251520 252031 252081 252048 251470 249325 245759 242261 239897 238660 238581 239929 242147 244246
55658 244246 246515 250246 255553 261033 265872 270604 275469 279755 283217 286509 289605 291285 290656 287895
55644 287895 283250 276801 269446 262526 256111 249206 241892 235563 230703 226209 221435 217207 214133 211527
55630 211527 208702 205919 203463 201135 199165 198242 198164 197812 196828 195966 195564 195231 195243 196451 198420 199524 199397
55613 199397 199438 200224 200374 198794 196288 193988 191883 189864 188504 187731 186291 183635 180898 178994 177184
55598 177184 174703 172339 171059 170344 169187 167750 166774 166282 165987 166164 167070 168177 168884 169277 169573 169632 169599
55581 169599 170084 171084 171788 172016 172704 174309 176007 177344 179429 183501 189348 196134 203772 212446 221629
55566 221629 230568 239012 246737 253122 257920 261603 264244 265010 263465 260410 256673 252068 246299 239882
$$ packed form
55674B46058K629J699J134N11N0l3n78k145l566l498k364j237p9J348K218K099
55658B44246K269L731N307N480M839M732M865M286L462L292L096J680o29k761
55644B87895m645o449p355o920o415o905p314o329m860m494m774m228l074k606
55630B11527k825k783k456k328j970r23p8l52r84q62m02l33J2J208J969J104j27
55613A99397M1P86J50j580k506k300k105k019j360p73j440k656k737j904j810
55598A77184k481k364j280p15j157j437r76m92k95J77R06J107P07L93K96N9l3
55581A69599M85J000P04K28O88J605J698J337K085M072N847O786P638Q674R183
55566B21629Q939Q444P725O385M798L683K641P66j545l055l737m605n769o417
$$ plain form
55552 239882 233314 226377 219206 212993 208567 205119 201350 197144 193137 189429 185819 182680 180564 179332
55538 179332 178515 178113 178319 178870 179314 179478 179247 178454 177385 176709 176491 176028 174989 173846 172791 171280 169141
55521 169141 167040 165264 163156 160443 157987 156402 154976 152858 150409 148466 147148 146187 145604 145268 144597
55506 144597 143445 142456 141978 141603 141324 141872 143146 143656 142569 141071 140556 140660 140374 139887 139917 140131 139790 139188
55488 139188 139039 139054 138544 137810 137613 137804 137799 137848 138503 139301 139329 138705 138271 138204 138165 138363 139158 140006 140112 139851 140222
55467 140222 141146 141603 141256 140637 139903 138790 137760 137764 138689 139290 138971 138525 138754 139388 139794 139935 140103 140287 140246
55448 140246 139920 139545 139537 140160 141040 141262 140424 139325 139136 140069 141356 142219 142372 141838 140867 139856 138988 138288
55430 138288 138298 139966 143239 146469 148093 148345 148432 148609 148248 147433 147219 148191 149791 151217 152248 153081 154019
$$ packed form
55552B39882o568o937p171o213m426l448l769m206m007l708l610l139k116j232
55538A79332q17m02K06N51M44J64k31p93j069o76k18m63j039j143j055j511k139
55521A69141k101j776k108k713k456j585j426k118k449j943j318r61n83l36o71
55506A44597j152r89m78l75k79N48J274N10j087j498n15J04k86m87L0K14l41o02
55488A39188j49J5n10p34j97J91nM9O55P98K8o24m34o7l9J98P95Q48J06k61L71
55467A40222R24M57l47o19p34j113j030MR25O01l19m46K29O34M06J41J68J84m1
55448A40246l26l75qO23Q80K22q38j099j89R33J287Q63J53n34r71j011q68p00
55430A38288J0J668L273L230J624K52Q7J77l61q15k14R72J600J426J031Q33R38
$$ plain form
55413 154019 155395 157265 159187 160747 162133 163698 165244 166320 166931 167250 166899 165325 162696 159710 156694
55398 156694 153633 150898 149053 147952 146820 145331 143933 143067 142734 142937 143856 145390 147000 148240 149067
55383 149067 149586 149849 149968 150153 150559 151253 152177 152976 153098 152346 151154 150030 149032 148010 147055 146362 145925 145654
55365 145654 145517 145368 145001 144606 144725 145507 146509 147430 148424 149418 149859 149535 148924 148248 147005 145001 143045
55348 143045 141935 141521 141403 141714 142415 142772 142540 142847 144657 147024 148167 147834 147254 147072 146731 145806 144697
55331 144697 143886 143500 143674 144448 145249 145345 144823 144414 144366 144286 143962 143540 142957 141971 140732 139637 138703 137759 137071
55312 137071 137033 137462 137905 138406 139178 139814 139795 139540 139961 141025 141746 141582 140936 140301 139780 139487 139523 139546 139154 138659
55292 138659 138675 139042 139098 138955 139465 140856 142433 143778 145202 146737 147666 147500 146726 146154 146128 146634 147551 148537
$$ packed form
55413A54019J376J870J922J560J386J565J546J076O11L19l51j574k629k986l016
55398A56694l061k735j845j101j132j489j398q66l33K03R19J534J610J240Q27
55383A49067N19K63J19J85M06O94R24P99J22p52j192j124r98j022r55o93m37k71
55365A45654j37j49l67l95J19P82J002R21R94R94M41l24o11o76j243k004j956
55348A43045j110m14j18L11P01L57k32L07J810K367J143l33n80j82l41r25j109
55331A44697q11l86J74P74Q01R6n22m09m8q0l24m22n83r86j239j095r34r44o88
55312A37071l8M29M43N01P72O36j9k55M21J064P21j64o46o35n21k93L6K3l92m95
55292A38659J6L67N6j43N10J391J577J345J424J535R29j66p74n72k6N06R17R86
$$ plain form
55274 148537 149211 149675 150384 151414 152405 153253 154221 155219 155614 154961 153434 151489 149570 148162 147570 147581 147789
55257 147789 148161 148744 149002 148223 146589 145099 144387 144297 144600 145324 146240 146780 146733 146482 146379 146390 146442 146618 146889
55238 146889 147074 147094 146956 146648 146428 146836 147888 148699 148593 148150 148273 148713 148630 148204 148344 148911 148702 147373 145996
55219 145996 145348 144912 144126 143499 143750 144715 145765 146641 147343 147791 148151 148882 150024 150911 151043 150760 150694 150979
55201 150979 151298 151343 151020 150522 150276 150408 150405 149855 149331 149686 150578 150645 149261 147182 145296 143781 142774 142782 143914
55182 143914 145578 147362 149402 151408 152289 151486 149889 148767 148404 148434 148825 149719 150753 151369 151600 151928 152535
55165 152535 153232 153914 154622 155214 155396 155069 154514 154262 154711 155633 156200 155835 154915 154188 153711 153062 152445 152649 153824
55146 153824 155177 156102 156755 157224 157048 156089 155107 154891 155309 155748 155959 155995 155720 154884 153515 151997 151008 151317
$$ packed form
55274A48537O74M64P09J030R91Q48R68R98L95o53j527j945j919j408n92J1K08
55257A47789L72N83K58p79j634j490p12r0L03P24R16N40m7k51j03J1N2J76K71
55238A46889J85K0j38l08k20M08J052Q11j06m43J23M40q3m26J40N67k09j329j377
55219A45996o48m36p86o27K51R65J050Q76P02M48L60P31J142Q87J32k83o6K85
55201A50979L19M5l23m98k46J32ln50n24L55Q92O7j384k079j886j515j007QJ132
55182A43914J664J784K040K006Q81q03j597j122l63L0L91Q94J034O16K31L28O07
55165A52535O97O82P08N92J82l27n55k52M49R22N67l65r20p27m77o49o17K04J175
55146A53824J353R25O53M69j76r59r82k16M18M39K11L6k75q36j369j518r89L09
$$ plain form
55128 151317 153077 155281 156528 156453 155807 155135 154250 153154 152483 152569 152822 152519 151594 150373 149284 149094 150497
55111 150497 152985 155021 155845 156304 157378 158821 160016 161139 162443 163111 162081 159767 157889 157667 158988
55096 158988 161253 164129 167260 169880 171154 170813 169344 167570 165993 164650 163687 163630 164563 165429 165111 164117
55080 164117 164121 165634 167271 167754 167483 167435 167564 167245 166533 165942 165463 164725 163800 163041 162473 162009 161971 162658 163646
55061 163646 164175 164026 163541 163032 162708 162854 163539 164382 165006 165433 165674 165427 164667 164100 164405 165384 166342 167014 167579
55042 167579 168125 168598 168977 169063 168467 167201 165915 165158 164891 165043 165916 167465 168829 169220 168811 168142 167220 165947
55024 165947 164884 164696 165158 165480 165339 164926 164313 163560 163155 163526 164280 164625 164419 164184 164257 164515 164784 164952 164855
55005 164855 164563 164572 165240 166282 167280 168319 169608 170902 171862 172583 173158 173222 172673 172373 173244 174965 176448 177364
$$ packed form
55128A51317J760K204J247p5o46o72q85j096o71Q6K53l03r25j221j089j90J403
55111A50497K488K036Q24M59J074J443J195J123J304O68j030k314j878k22J321
55096A58988K265K876L131K620J274l41j469j774j577j343r63n7R33Q66l18r94
55080A64117MJ513J637M83k71m8J29l19p12n91m79p38r25p59n68m64l8O87R88
55061A63646N29j49m85n09l24J46O85Q43O24M27K41k47p60n67L05R79R58O72N65
55042A67579N46M73L79Q6n96j266j286p57k67J52Q73J549J364L91m09o69r22j273
55024A65947j063j88M62L22j41m13o13p53m05L71P54L45k06k35P3K58K69J68r7
55005A64855k92RO68J042R98J039J289J294R60P21N75O4n49l00Q71J721J483R16
$$ plain form
54987 177364 178353 179837 181463 182687 183215 182925 181984 180989 180411 180075 179696 179648 180507 182033 183309 183785 183611
54970 183611 183170 182867 183063 183594 183660 182881 182061 182114 182683 182797 182542 182910 184108 185195 185540 185563 185792 186099 186255
54951 186255 186467 187059 188084 189414 190726 191446 191314 190951 191212 192025 192582 192549 192310 192075 191683 191288 191303 191563
54933 191563 191504 191410 192490 195302 198934 202224 205077 208097 211631 215776 220858 227264 234915 243227 251501
54918 251501 259238 266261 272537 277643 280675 281077 279311 276107 271406 264867 257238 250074 243910 237769
54904 237769 230864 223843 217851 213149 209310 206112 203567 201456 199507 197755 196379 195405 194909 195173 196291
54889 196291 197911 199618 201350 203261 205518 208394 212170 216723 221545 226425 231787 238182 245685 253900
54875 253900 262179 269767 276084 280943 284180 285138 283145 278531 272521 265993 258945 251347 243748 236650
$$ packed form
54987A77364R89J484J626J224N28k90r41r95n78l36l79m8Q59J526J276M76j74
54970A83611m41l03J96N31O6p79q20N3N69J14k55L68J198J087L45K3K29L07J56
54951A86255K12N92J025J330J312P20j32l63K61Q13N57l3k39k35l92l95J5K60
54933A91563n9r4J080K812L632L290K853L020L534M145N082O406P651Q312Q274
54918B51501P737P023O276N106L032M02j766l204m701o539p629p164o164o141
54904B37769o905p021n992m702l839l198k545k111j949j752j376r74m96K64J118
54889A96291J620J707J732J911K257K876L776M553M822M880N362O395P503Q215
54875B53900Q279P588O317M859L237R58j993m614o010o528p048p598p599p098
$$ plain form
54861 236650 229949 223515 217800 213325 209947 207072 204324 201656 199144 196975 195312 193908 192278 190503
54847 190503 189269 188791 188323 187273 186166 185786 185846 185380 184158 182776 181504 180044 178597 178143 179115 180484
54831 180484 180825 179967 178964 178639 178845 179170 179683 180597 181629 182226 182357 182571 183217 183999 184505 184831 185402 186389
54813 186389 187542 188543 189273 189832 190405 191006 191288 190879 190003 189438 189655 190323 190838 190970 190689 189888 188779 188137
54795 188137 188497 189335 189697 189414 189064 188894 188579 188082 187976 188673 189827 190725 190978 190814 191007 192415 195125 198170
54777 198170 200545 202363 204526 207525 211215 215555 220674 226258 231845 237950 245947 256395 268106 279306
54763 279306 289119 297586 304746 310260 313605 314309 312209 307732 301679 294651 286955 278956 270982 262907
54749 262907 254487 246282 239559 234960 231752 228668 225068 221060 217065 213627 211264 210134 209969 210405 211168
$$ packed form
54861B36650o701o434n715m475l378k875k748k668k512k169j663j404j630j775
54847A90503j234m78m68j050j107l80O0m66j222j382j272j460j447m54R72J369
54831A80484L41q58j003l25K06L25N13R14J032N97J31K14O46P82N06L26N71R87
54813A86389J153J001P30N59N73O01K82m09q76n65K17O68N15J32k81q01j109o42
54795A88137L60Q38L62k83l50j70l15m97j06O97J154Q98K53j64J93J408K710L045
54777A98170K375J818K163K999L690M340N119N584N587O105P997J0448J1711J1200
54763B79306R813Q467P160N514L345P04k100m477o053p028p696p999p974q075
54749B62907q420q205o723m599l208l084l600m008l995l438k363j130j65M36P63
$$ plain form
54734 211168 212014 212871 213927 215196 216300 217303 219439 224004 230626 237621 244118 250762 258141 265749 272898
54719 272898 279482 285170 288895 289938 288723 285849 281211 274878 267985 261730 256011 249958 243364 236751
54705 236751 230482 224697 219821 216262 213797 211926 210584 209860 209297 208200 206539 204983 204124 204050 204348 204184
54689 204184 202794 200373 198022 196384 194999 193539 192888 194006 196304 198250 199250 199846 200323 200331 199896 199658
54673 199658 199813 199721 198903 197681 196533 195375 193873 192056 190374 189405 189536 190605 191827 192329 191815 190589
54657 190589 189197 188269 188245 188764 188725 187579 186198 185851 186672 187868 189010 190119 190782 190438 189629 189838 191688
54640 191688 194191 196127 197341 198226 198730 198547 197782 196805 195747 194592 193544 192933 192881 193240 193701 193862 193455
54623 193455 192618 191783 191277 191263 191871 192977 194014 194554 194988 195982 197294 197886 197337 196357 195661 195112 194325 193385
$$ packed form
54734B11168Q46Q57J056J269J104J003K136M565O622O995O497O644P379P608P149
54719B72898O584N688L725J043j215k874m638o333o893o255n719o053o594o613
54705B36751o269n785m876l559k465j871j342p24n63j097j661j556q59p4K98j64
54689B04184j390k421k351j638j385j460o51J118K298J946J000N96M77Qm35k38
54673A99658J55r2q18j222j148j158j502j817j682r69J31J069J222N02n14j226
54657A90589j392r28k4N19l9j146j381l47Q21J196J142J109O63l44q09K09J850
54640A91688K503J936J214Q85N04j83p65r77j058j155j048o11n2L59M61J61m07
54623A93455q37q35n06j4O08J106J037N40M34R94J312N92n49r80o96n49p87r40
$$ plain form
54605 193385 192456 191382 190297 190027 191089 192714 193645 193708 193829 194634 195739 196496 196781 196856 196990 197395 198129 198817
54587 198817 198813 197936 196834 196301 196373 196366 195797 195001 194707 195162 195903 196423 196747 197178 197615 197544 196755 195757 195184 195045
54567 195045 194861 194481 194380 195048 196315 197497 198086 198098 197779 197298 196900 197103 198362 200438 202417 203526 203740
54550 203740 203441 202728 201392 199431 197262 195396 194148 193637 193752 194116 194439 195003 196403 198623 200712 201743
54534 201743 201933 202387 203836 205989 208144 209937 211336 212305 212873 213316 213863 214313 214319 214000 213835 213866 213493 212294
54516 212294 210666 209357 208681 208539 208906 209741 210575 210662 209644 207776 205621 203850 203139 203678 204745 205266 204935
54499 204935 204338 203970 203617 202851 201649 200294 199101 198417 198475 198981 199254 199009 198722 198999 199949 201318 202833
54482 202833 204197 205240 206284 207923 210111 211950 212748 212837 212950 213259 213550 213911 214635 215593 216308 216588 216717
$$ packed form
54605A93385r29j074j085k70J062J625R31O3J21Q05J105P57K85P5J34M05P34O88
54587A98817mq77j102n33P2pn69p96k94M55P41N20L24M31M37p1p89r98n73j39
54567A95045j84l80j01O68J267J182N89J2l19m81l98K03J259K076J979J109K14
54550B03740k99p13j336j961k169j866j248n11J15L64L23N64J400K220K089J031
54534B01743J90M54J449K153K155J793J399R69N68M43N47M50Ol19j65L1l73j199
54516B12294j628j309o76j42L67Q35Q34Q7j018j868k155j771p11N39J067N21l31
54499B04935n97l68l53p66j202j355j193o84N8N06K73k45k87K77R50J369J515
54482B02833J364J043J044J639K188J839P98Q9J13L09K91L61P24R58P15K80J29
$$ plain form
54465 216717 217100 217954 219213 220482 221272 221454 221242 220665 219552 218245 217686 218370 219686 220694 221031 220606 219104
54448 219104 216520 213723 211728 210732 210461 210967 212253 213556 213981 213642 213350 213384 213447 213626 214356 215420 215934
54431 215934 215477 214402 213029 211382 209849 209184 209573 210403 211190 212034 213008 213813 214333 214881 215666 216560 217551
54414 217551 218772 219920 220401 220294 220452 221274 222056 221964 221093 220207 219902 220276 220918 221030 220168 219109 219230 220685
54396 220685 221980 221863 220925 220667 221603 223075 224444 225627 226606 227255 227771 228714 230373 232314 233618 233563 232245
54379 232245 230568 229360 228469 227117 225202 223645 223163 223300 223127 222495 221991 221956 222133 222267 222536 223274 224471
54362 224471 225666 226347 226553 226983 228271 230207 232030 233340 234253 234732 234541 233952 233678 233788 233452 232206 230688
54345 230688 229566 228536 227171 226068 226132 227057 227589 227245 226854 227313 228502 229568 229707 228610 226671 224921
$$ packed form
54465B16717L83Q54J259J269P90J82k12n77j113j307n59O84J316J008L37m25j502
54448B19104k584k797j995r96k71N06J286J303M25l39k92L4O3J79P30J064N14
54431B15934m57j075j373j647j533o65L89Q30P87Q44R74Q05N20N48P85Q94R91
54414B17551J221J148M81j07J58Q22P82r2q71q86l05L74O42J12q62j059J21J455
54396B20685J295j17r38k58R36J472J369J183R79O49N16R43J659J941J304n5j318
54379B32245j677j208q91j352j915j557m82J37j73o32n04l5J77J34K69P38J197
54362B24471J195O81K06M30J288J936J823J310R13M79j91n89k74J10l36j246j518
54345B30688j122j030j365j103O4R25N32l44l91M59J189J066J39j097j939j750
$$ plain form
54329 224921 224336 225072 226637 228646 230959 233184 234689 235240 235239 235219 235531 236538 238626 241814 245711 249943
54313 249943 254381 258858 263159 267429 272208 277744 283484 288463 291984 293741 293558 291420 287749 283295
54299 283295 278568 273495 267780 261542 255435 250131 245898 242772 240817 239919 239501 238939 238228 237780 237496 236579
54283 236579 234548 231986 229956 229048 229265 230374 231874 232986 233303 233327 233838 234879 235816 236317 236668 237101 237367
54266 237367 237123 236390 235457 234700 234581 235451 237082 238613 239155 238488 237182 236158 236122 237181 238883 240650 242107
54249 242107 243040 243333 243126 242746 242187 240974 238955 236929 235877 235678 235303 234337 233544 233613 234062 233989 233505 233674
54231 233674 235111 237232 239008 240028 240643 241337 242282 243344 244268 244810 244823 244365 243688 243093 242733 242518 242187
54214 242187 241454 240206 238619 237063 235786 234755 233926 233532 233814 234414 234417 233285 231579 230460 230528 231355 232094
$$ packed form
54329B24921n85P36J565K009K313K225J505N51jk0L12J007K088L188L897M232
54313B49943M438M477M301M270M779N536N740M979L521J757j83k138l671m454
54299B83295m727n073n715o238o107n304m233l126j955q98m18n62p11m48k84r17
54283B36579k031k562k030r08K17J109J500J112L17K4N11J041R37N01L51M33K66
54266B37367k44p33r33p57j19Q70J631J531N42o67j306j024l6J059J702J767J457
54249B42107R33K93k07l80n59j213k019k026j052j99l75r66p93O9M49p3m84J69
54231B33674J437K121J776J020O15O94R45J062R24N42J3m58o77n95l60k15l31
54214B42187p33j248j587j556j277j031q29l94K82O00Lj132j706j119O8Q27P39
$$ plain form
54197 232094 232307 232208 232339 233078 234330 235635 236670 237583 238669 239774 240253 239624 238104 236384 234958 233860
54181 233860 233027 232704 233244 234466 235463 235341 234232 233334 233718 235177 236446 236583 235919 235517 235875 236385 236158
54164 236158 235152 234225 234134 234791 235653 236496 237466 238501 239161 239171 238877 238951 239714 240864 241816 242239 242269 242205 242097
54145 242097 241770 241246 240781 240400 239762 238838 238318 238877 240234 241453 242024 242078 241740 241026 240362 240384 240982 241245 240658
54126 240658 239723 239138 239058 239541 240934 243186 245324 246362 246379 246184 246269 246667 247387 248339 249147 249716 250674 252479
54108 252479 254387 255144 254653 254057 254122 254379 254102 253366 252712 252325 251958 251341 250368 249103 247862 247026 246642 246431
54090 246431 246312 246519 247019 247191 246489 245299 244705 245331 246662 247627 247743 247483 247547 248043 248625 249233 250239 251837
54072 251837 253740 255636 257455 258985 259671 259255 258229 257247 256385 255410 254392 253511 252572 251396 250408 250202
$$ packed form
54197B32094K13r9J31P39J252J305J035R13J086J105M79o29j520j720j426j098
54181B33860q33l23N40J222R97j22j109q98L84J459J269J37o64m02L58N10k27
54164B36158j006r27r1O57Q62Q43R70J035O60J0k94P4P63J150R52M23L0o4j08
54145B42097l27n24m65l81o38r24n20N59J357J219N71N4l38p14o64K2N98K63n87
54126B40658r35n85q0M83J393K252K138J038J7j95Q5L98P20R52Q08N69R58J805
54108B52479J908P57m91n96O5K57k77p36o54l87l67o17r73j265j241q36l84k11
54090B46431j19K07N00J72p02j190n94O26J331R65J16k60O4M96N82O08J006J598
54072B51837J903J896J819J530O86m16j026r82q62r75j018q81r39j176r88k06
$$ plain form
54056 250202 250655 251226 251947 253304 255108 256473 257147 257994 259737 261883 263467 264329 265118 266392 268301 270856
54040 270856 273967 277258 280295 283040 285901 289332 293549 298492 303857 309219 314284 319034 323565 327907
54026 327907 332035 335916 339491 342683 345507 348042 350280 352107 353459 354415 355181 356048 357252 358680 359826
54011 359826 360207 359773 358817 357704 356868 356788 357598 358928 360475 362547 365606 369602 374324 380298 388684 400305
53995 400305 415365 434039 456474 481838 507794 531145 548711 557844 557082 546905 529485 507415
53983 507415 482883 457833 434012 412426 393315 376975 363924 353921 345536 337402 329500 322704
53971 322704 317457 313434 310150 307312 304757 302518 300729 299156 297191 294689 292390 290978 290146 289189 288167
53956 288167 287756 288156 288933 289844 291139 292958 294970 296685 297711 297798 297154 296675 297287 298998 301073 303122
$$ packed form
54056B50202M53N71P21J357J804J365O74Q47J743K146J584Q62P89J274J909K555
54040B70856L111L291L037K745K861L431M217M943N365N362N065M750M531M342
54026C27907M128L881L575L192K824K535K238J827J352R56P66Q67J204J428J146
54011C59826L81m34r56j113q36q0Q10J330J547K072L059L996M722N974Q386J1621
53995D00305J5060J8674K2435K5364K5956K3351J7566R133p62j0177j7420k2070
53983E07415k4532k5050k3821k1586j9111j6340j3051j0003q385q134p902o796
53971C22704n247m023l284k838k555k239j789j573j965k502k299j412q32r57j022
53956B88167m11M00P77R11J295J819K012J715J026Q7o44m79O12J711K075K049
$$ plain form
53940 303122 305482 308492 312055 316063 320687 325913 331220 336037 340273 344181 347999 351852 355698 359202
53926 359202 361932 363879 365507 367189 368868 370415 371939 373553 375189 376901 379068 381944 385267 388610
53912 388610 391973 395705 399993 404733 409771 414982 420116 424843 428927 432199 434488 435828 436630 437316 437754
53897 437754 437325 435653 433087 430363 427984 425930 423808 421153 417708 413554 408935 404034 399025 394243
53883 394243 389931 385744 380874 374980 368746 363171 358489 354196 350118 346855 344967 344088 343213 341653 339427
53868 339427 336875 334284 331894 329929 328458 327336 326326 325207 323842 322279 320774 319556 318527 317407
53854 317407 316150 315035 314276 313727 313133 312570 312434 312913 313560 313546 312499 311072 310490 311441 313496 315631 317135
53837 317135 317920 318275 318637 319493 321123 323419 326188 329562 333864 339081 344847 351008 358012 366659 377675
$$ packed form
53940C03122K360L010L563M008M624N226N307M817M236L908L818L853L846L504
53926C59202K730J947J628J682J679J547J524J614J636J712K167K876L323L343
53912C88610L363L732M288M740N038N211N134M727M084L272K289J340Q02O86M38
53897D37754m29j672k566k724k379k054k122k655l445m154m619m901n009m782
53883C94243m312m187m870n894o234n575m682m293m078l263j888q79q75j560k226
53868C39427k552k591k390j965j471j122j010j119j365j563j505j218j029j120
53854C17407j257j115p59n49n94n63j36M79O47j4j047j427n82R51K055K135J504
53837C17135P85L55L62Q56J630K296K769L374M302N217N766O161P004Q647J1016
$$ plain form
53822 377675 391585 408812 429826 455247 485591 520528 558142 594963 626661 648839 658022 653138
53810 653138 636555 613247 588401 565554 546444 531661 520971 513516 508331 504617 501403 497410
53798 497410 491730 484478 476442 468241 460109 452226 444763 437610 430544 423785 418049 413842 410899 408510
53784 408510 406322 404578 403523 402823 401825 400299 398523 396499 393616 389501 384811 380595 377047 373508 369552
53769 369552 365321 360855 355973 351056 347034 344157 341533 338431 335358 333194 331857 330558 328894 326942
53755 326942 324625 321825 318926 316465 314317 311942 309329 307030 305331 304090 303321 303120 302982 302001 300111
53740 300111 298490 298410 300012 302453 304795 306569 307866 309151 310721 312224 313012 313045 313113 314108 316386 319806
53724 319806 323869 327675 330327 331697 332473 333255 333913 333987 333310 332060 330607 329548 329531 330677 332371 333861
$$ packed form
53822C77675J3910J7227K1014K5421L0344L4937L7614L6821L1698K2178R183m884
53810F53138j6583k3308k4846k2847j9110j4783j0690p455n185l714l214l993
53798D97410n680p252q036q201q132p883p463p153p066o759n736m207k943k389
53784D08510k188j744j055p00r98j526j776k024k883m115m690m216l548l539l956
53769C69552m231m466m882m917m022k877k624l102l073k164j337j299j664j952
53755C26942k317k800k899k461k148k375k613k299j699j241p69k01j38r81j890
53740C00111j621q0J602K441K342J774J297J285J570J503P88L3O8R95K278L420
53724C19806M063L806K652J370P76P82O58P4o77j250j453j059j7J146J694J490
$$ plain form
53708 333861 334912 335823 337093 339138 341980 345101 348030 351089 355033 359715 363789 366202 367539 369363
53694 369363 372548 376748 381130 385014 387955 389833 390915 391465 391380 390547 389359 388410 387727 386798 385375 383831
53678 383831 382664 382056 381947 382163 382353 382125 381415 380524 379726 379061 378517 378134 377875 377670 377569 377566 377193 375763 373204
53659 373204 370427 368553 367922 368006 368107 367936 367664 367644 368029 368522 368572 367963 367099 366586 366631 367011 367507 368131 368983
53640 368983 370116 371563 373235 374754 375576 375540 375175 375348 376568 378711 381334 384048 386588 388705 390288
53625 390288 391592 393112 395061 397063 398601 399817 401584 404602 408572 412521 415873 418903 422076 425367
53611 425367 428491 431608 435363 440193 445873 451744 457190 461860 465772 469305 472806 476068 478433 479670
53597 479670 480438 481554 483076 484540 485943 487815 490183 492056 492416 491431 490256 489726 489608 489109 487781 485802
$$ packed form
53708C33861J051R11J270K045K842L121K929L059L944M682M074K413J337J824
53694C69363L185M200M382L884K941J878J082N50q5q33j188r49o83r29j423j544
53678C83831j167o08j09K16J90k28p10q91p98o65n44l83k59k05j01ll73j430k559
53659C73204k777j874o31Q4J01j71k72k0L85M93N0o09q64n13M5L80M96O24Q52
53640C68983J133J447J672J519Q22l6l65J73J220K143K623K714K540K117J583
53625C90288J304J520J949K002J538J216J767L018L970L949L352L030L173L291
53611D25367L124L117L755M830N680N871N446M670L912L533L501L262K365J237
53597D79670P68J116J522J464J403J872K368J873L60r85j175n30j18m99j328j979
$$ plain form
53581 485802 483616 481538 479655 477986 476607 475547 474551 473080 470721 467636 464565 462350 461370 461285 461286 460705
53565 460705 459565 458521 458151 458381 458669 458669 458563 458786 459629 461094 462937 464714 465995 466704 467222 468059 469483
53548 469483 471411 473504 475274 476375 477067 478287 480901 484832 489191 493350 497561 502331 507551 512677
53534 512677 517652 523170 529931 538056 547504 558686 572165 587746 604339 620964 637684 655299
53522 655299 674172 693619 712444 729796 745341 758878 770279 779930 788935 798511 809221 820968
53510 820968 833709 847938 864369 883312 904443 927083 950605 974642 999016 1023551 1047985
53499 1047985 1072065 1095658 1118676 1141032 1162789 1184224 1205474 1226205 1245920 1264668 1283172
53488 1283172 1302127 1321633 1341382 1361093 1380572 1399621 1418200 1436495 1454560 1472088 1488853
$$ packed form
53581D85802k186k078j883j669j379j060r96j471k359l085l071k215r80q5Jn81
53565D60705j140j044l70K30K88%j06K23Q43J465J843J777J281P09N18Q37J424
53548D69483J928K093J770J101O92J220K614L931M359M159M211M770N220N126
53534E12677M975N518O761Q125R448J1182J3479J5581J6593J6625J6720J7615
53522F55299J8873J9447J8825J7352J5545J3537J1401R651R005R576J0710J1747
53510H20968J2741J4229J6431J8943K1131K2640K3522K4037K4374K4535K4434
53499A047985K4080K3593K3018K2356K1757K1435K1250K0731J9715J8748J8504
53488A283172J8955J9506J9749J9711J9479J9049J8579J8295J8065J7528J6765
$$ plain form
53477 1488853 1505250 1521985 1539179 1556047 1571533 1585068 1596658 1606499 1614593 1620640 1624203 1625008
53465 1625008 1623054 1618441 1611238 1601681 1590285 1577503 1563396 1547885 1531228 1513905 1496157 1477977
53453 1477977 1459522 1441019 1422217 1402423 1381336 1359462 1337475 1315590 1293866 1272725 1252627
53442 1252627 1233419 1214511 1195723 1177549 1160614 1145254 1131714 1120365 1111506 1105092 1100761 1097904
53430 1097904 1095768 1093877 1092585 1092932 1095589 1100104 1105487 1111385 1118320 1126830 1136866 1148156 1160705
53417 1160705 1174617 1189716 1205755 1222899 1241590 1261901 1283429 1305968 1330038 1356493 1385669
53406 1385669 1417033 1449659 1482997 1517269 1553213 1591353 1631551 1673338 1716668 1762137 1810362
53395 1810362 1861343 1914553 1969449 2025655 2082772 2140293 2197805 2255179 2312536 2370078 2427863
$$ packed form
53477A488853J6397J6735J7194J6868J5486J3535J1590R841Q094O047L563Q05
53465A625008j954m613p203r557j1396j2782j4107j5511j6657j7323j7748j8180
53453A477977j8455j8503j8802j9794k1087k1874k1987k1885k1724k1141k0098
53442A252627j9208j8908j8788j8174j6935j5360j3540j1349q859o414m331k857
53430A097904k136j891j292L47K657M515N383N898O935Q510J0036J1290J2549
53417A160705J3912J5099J6039J7144J8691K0311K1528K2539K4070K6455K9176
53406A385669L1364L2626L3338L4272L5944L8140M0198M1787M3330M5469M8225
53395A810362N0981N3210N4896N6206N7117N7521N7512N7374N7357N7542N7785
$$ plain form
53384 2427863 2485643 2542869 2598874 2652985 2704503 2752796 2797632 2839333 2878408 2914950 2948381
53373 2948381 2977674 3001770 3020019 3032571 3040411 3044786 3046320 3044524 3038135 3025898 3007067 2981277
53361 2981277 2948227 2907863 2860963 2809161 2754044 2696346 2636330 2574734 2512806 2451482 2391096
53350 2391096 2331962 2274596 2219132 2165142 2112434 2061497 2012688 1965417 1918723 1872333 1826657
53339 1826657 1782080 1738835 1697270 1657609 1619632 1583246 1549214 1518609 1491545 1467069 1444355
53328 1444355 1423438 1404728 1388337 1373959 1360920 1348318 1335597 1322977 1310876 1299029 1286840
53317 1286840 1274490 1262908 1252586 1243275 1234998 1228355 1223409 1219228 1215197 1212130 1211389 1213320 1217130
53304 1217130 1221808 1226641 1231359 1236544 1243544 1253274 1265307 1278725 1293530 1310455 1329621 1350282
$$ packed form
53384B427863N7780N7226N6005N4111N1518M8293M4836M1701L9075L6542L3431
53373B948381K9293K4096J8249J2552P840M375J534j796o389j2237j8831k5790
53361B981277l3050m0364m6900n1802n5117n7698o0016o1596o1928o1324o0386
53350B391096n9134n7366n5464n3990n2708n0937m8809m7271m6694m6390m5676
53339A826657m4577m3245m1565l9661l7977l6386l4032l0605k7064k4476k2714
53328A444355k0917j8710j6391j4378j3039j2602j2721j2620j2101j1847j2189
53317A286840j2350j1582j0322r311q277o643m946m181m031l067p41J931L810
53304A217130M678M833M718N185P000R730J2033J3418J4805J6925J9166K0661
$$ plain form
53292 1350282 1371906 1394762 1419255 1445326 1472739 1501390 1530991 1560786 1589881 1617700 1643929
53281 1643929 1668275 1690492 1710522 1728472 1744463 1758487 1770344 1779702 1786313 1790147 1791238 1789530
53269 1789530 1784930 1777388 1766849 1753311 1737111 1718899 1699102 1677571 1653976 1628442 1601559 1573874
53257 1573874 1545604 1516734 1487154 1456789 1425756 1394317 1362600 1330549 1298300 1266328 1235052
53246 1235052 1204532 1174778 1146007 1118296 1091268 1064551 1038281 1012750 987778 962898 938078
53235 938078 913852 890873 869601 850218 832413 815469 799086 783920 770855 759842 750020 740781
53223 740781 732016 723443 714444 704807 695014 685563 676403 667122 657220 646179 633913 621290 609562
53210 609562 599040 588916 578634 568670 559576 550988 542329 533907 526470 519915 513326 506304 499483
$$ packed form
53292A350282K1624K2856K4493K6071K7413K8651K9601K9795K9095K7819K6229
53281A643929K4346K2217K0030J7950J5991J4024J1857R358O611L834J091j708
53269A789530m600p542j0539j3538j6200j8212j9797k1531k3595k5534k6883k7685
53257A573874k8270k8870k9580l0365l1033l1439l1717l2051l2249l1972l1276
53246A235052l0520k9754k8771k7711k7028k6717k6270k5531k4972k4880k4820
53235I38078k4226k2979k1272j9383j7805j6944j6383j5166j3065j1013r822r239
53223G40781q765q573q999r637r793r451r160r281r902j1041j2266j2623j1728
53210F09562j0522j0124j0282r964r094q588q659q422p437o555o589p022o821
$$ plain form
53197 499483 493488 487977 482085 475449 468431 461484 454714 448100 441849 436293 431490 427180 423219 419810
53183 419810 417122 414848 412427 409593 406446 403149 399968 397467 396095 395461 394637 393386 392509 392594 392971 392529
53167 392529 391265 390345 390676 391986 393413 394515 395445 396382 397087 397091 396290 395286 394941 395492 396315 396738 396851 397241
53149 397241 398083 398879 399102 398702 397944 397032 396020 394895 393581 391948 389978 387873 385902 384157 382499 380858
53133 380858 379543 379067 379507 380158 380145 379359 378434 377739 376854 375351 373669 372721 372835 373582 374527 375568 376571
53116 376571 377327 378134 379839 382809 386153 388512 389536 390124 391155 392399 392893 392078 390284 388155 385975
53101 385975 383581 380710 377271 373418 369554 366159 363403 360954 358417 355974 354330 353902 354272 354635 354591
53086 354591 354305 354026 353751 353359 352778 351963 350863 349532 348146 346857 345668 344488 343269 342133 341368 341294
$$ packed form
53197D99483n995n511n892o636p018o947o770o614o251n556m803m310l961l409
53183D19810k688k274k421k834l147l297l181k501j372o34q24j251q77Q5L77m42
53167C92529j264r20L31J310J427J102R30R37P05Mq01j004l45N51Q23M23J13L90
53149C97241Q42P96K23m00p58r12j012j125j314j633j970k105j971j745j658j641
53133C80858j315m76M40O51j3p86r25o95q85j503j682r48J14P47R45J041J003
53116C76571P56Q07J705K970L344K359J024N88J031J244M94q15j794k129k180
53101C85975k394k871l439l853l864l395k756k449k537k443j644m28L70L63m4
53086C54591k86k79k75l92n81q15j100j331j386j289j189j180j219j136p65p4
$$ plain form
53070 341294 341989 343161 344318 345057 345235 345001 344725 344764 345141 345595 346011 346561 347241 347545 347023 346065 345700 346532
53052 346532 348262 350280 352331 354392 356362 358191 360071 362161 364264 366060 367480 368618 369459 370039 370685
53037 370685 371723 373008 374102 374841 375353 375578 375273 374477 373393 371697 368621 364120 359425 355844 353407
53022 353407 351273 349160 347607 346862 346392 345761 345355 345740 346680 347307 347130 346498 346092 346206 346608 346936 347194 347767
53004 347767 348851 350006 350565 350439 350078 349635 348732 347348 346310 346299 346819 346850 346316 346101 346664 347494 348149 349056
52986 349056 350772 353028 355087 356743 358353 360071 361635 362917 364152 365474 366646 367455 368089 368872 369826
52971 369826 370794 371841 373203 374840 376350 377449 378303 379218 380220 381242 382514 384366 386596 388431 389365
52956 389365 389754 390300 391129 391642 391168 389579 387348 385242 383844 383128 382489 381335 379589 377577 375693 374339
$$ packed form
53070C41294O95J172J157P39J78k34k76L9L77M54M16N50O80L04n22r58l65Q32
53052C46532J730K018K051K061J970J829J880K090K103J796J420J138Q41N80O46
53037C70685J038J285J094P39N12K25l05p96j084j696l076m501m695l581k437
53022C53407k134k113j553p45m70o31m06L85R40O27j77o32m06J14M02L28K58N73
53004C47767J084J155N59j26l61m43r03j384j038j1N20L1n34k15N63Q30O55R07
52986C49056J716K256K059J656J610J718J564J282J235J322J172Q09O34P83R54
52971C69826R68J047J362J637J510J099Q54R15J002J022J272J852K230J835R34
52956C89365L89N46Q29N13m74j589k231k106j398p16o39j154j746k012j884j354
$$ plain form
52940 374339 373775 373654 372975 371092 368645 366931 366457 366671 367042 367655 368529 369046 368512 366912 364833 362953 361772
52923 361772 361362 361156 360441 359292 358500 358325 357980 356791 355248 354300 354143 354404 355061 356310 357810 358909 359543
52906 359543 360098 360526 360407 359943 359979 360818 361744 361971 361411 360253 358534 356573 355203 355020 355771 356910 358376
52889 358376 360359 362654 364771 366505 367970 369234 370264 371004 371154 370115 367606 364277 361305 359397 358411
52874 358411 357807 357157 356345 355615 355394 355785 356323 356517 356467 356629 357118 357659 358166 358895 359976 361218 362505 364016
52856 364016 365917 368121 370461 372758 374611 375481 375279 374563 373891 373183 371962 370043 367614 364768 361332
52841 361332 357280 353066 349437 346915 345453 344523 343603 342616 341836 341341 340819 340067 339426 339384 339861 340340 340726
52824 340726 341553 343126 344814 345593 345064 343578 341566 339269 337112 335791 335705 336646 338268 340534 343437 346644
$$ packed form
52940C74339n64j21o79j883k447j714m74K14L71O13Q74N17n34j600k079j880j181
52923C61772m10k06p15j149p92j75l45j189j543r48j57K61O57J249J500J099O34
52906C59543N55M28j19m64L6Q39R26K27n60j158j719j961j370j83P51J139J466
52889C58376J983K295K117J734J465J264J030P40J50j039k509l329k972j908r86
52874C58411o04o50q12p30k21L91N38J94n0J62M89N41N07P29J081J242J287J511
52856C64016J901K204K340K297J853Q70k02p16o72p08j221j919k429k846l436
52841C61332m052m214l629k522j462r30r20r87p80m95n22p52o41m2M77M79L86
52824C40726Q27J573J688P79n29j486k012k297k157j321q6R41J622K266K903L207
$$ plain form
52808 346644 349919 353659 358406 363813 368642 371883 373354 373102 370936 367031 362451 358314 354675 350859
52794 350859 346791 343302 341038 339707 338626 337449 336050 334244 332085 330219 329375 329558 330034 330079 329575 328919
52778 328919 328572 328616 328675 328402 328090 328510 329958 331788 333188 334074 334874 335733 336502 337320 338551 340134 341592
52761 341592 342768 343996 345344 346200 345977 344919 343929 343829 344929 346964 349182 350824 351785 352581 353510 354188
52745 354188 354199 353859 353924 354822 356509 358822 361504 364096 366237 368005 369583 370756 371166 370911 370389 369656 368510
52728 368510 367193 366372 366247 366253 365883 365361 365122 365031 364498 363229 361530 359954 358822 357973 356895 355257 353426
52711 353426 352239 352143 352744 353280 353281 352685 351600 350289 349179 348650 348795 349383 349932 349892 349143 348341 348370 349299 350350
52692 350350 351089 352012 353566 355106 355563 354837 353892 353630 354291 355744 357595 359014 359304 358918 359273 361178 363941
$$ packed form
52808C46644L275L740M747N407M829L241J471k52k166l905m580m137l639l816
52794C50859m068l489k264j331j081j177j399j806k159j866q44J83M76M5n04o56
52778C28919l47M4N9k73l12M20J448J830J400Q86Q00Q59P69Q18J231J583J458
52761C41592J176J228J348Q56k23j058r90j00J100K035K218J642R61P96R29O78
52745C54188J1l40O5Q98J687K313K682K592K141J768J578J173M10k55n22p33j146
52728C68510j317q21j25Ol70n22k39r1n33j269j699j576j132q49j078j638j831
52711C53426j187r6O01N36Jn96j085j311j110n29J45N88N49m0p49q02K9R29J051
52692C50350P39R23J554J540M57p26r45k62O61J453J851J419K90l86L55J905K763
$$ plain form
52675 363941 366308 367781 368649 369306 370098 371501 373697 376071 377731 378606 379569 381348 383683 385700 386810
52660 386810 387002 386577 385910 385394 385297 385572 385948 386269 386640 387189 387786 388217 388565 389157 389964 390275 389295 387068 384487
52641 384487 382301 380417 378312 375880 373584 371967 371295 371614 372789 374431 376061 377488 378895 380538 382508
52626 382508 384770 387154 389224 390506 391097 391803 393236 394838 395228 393624 390653 387589 385097 382974 380898
52611 380898 378986 377557 376670 376085 375514 374807 373999 373361 373325 374142 375549 376860 377460 377279 376816 376727 377276 378090
52593 378090 378469 378016 377018 376143 375850 376182 377073 378609 380770 383070 384784 385616 386020 386682 387791 388980 389865
52576 389865 390378 390594 390559 390535 391099 392607 394583 395990 396217 395554 394596 393496 392035 390258 388668 387767 387619
52559 387619 387922 388315 388537 388453 388129 387830 387777 387924 388039 388008 387915 387753 387270 386318 385278 384812 385113 385652 385834 385683
$$ packed form
52675C63941K367J473Q68O57P92J403K196K374J660Q75R63J779K335K017J110
52660C86810J92m25o67n16r7K75L76L21L71N49N97M31L48N92Q07L11r80k227k581
52641C84487k186j884k105k432k296j617o72L19J175J642J630J427J407J643J970
52626C82508K262K384K070J282N91P06J433J602L90j604k971l064k492k123k076
52611C80898j912j429q87n85n71p07q08o38l6Q17J407J311O00j81m63q9N49Q14
52593C78090L79m53r98q75k93L32Q91J536K161K300J714Q32M04O62J109J189Q85
52576C89865N13K16l5k4N64J508J976J407K27o63r58j100j461j777j590r01j48
52559C87619L03L93K22q4l24k99n3J47J15l1r3j62m83r52j040m66L01N39J82j51
$$ plain form
52539 385683 385645 385926 386402 387012 387832 388726 389356 389688 390102 390805 391445 391556 391140 390571 390148 390024 390309 390898 391301
52520 391301 391116 390669 390830 392104 394170 396426 398754 401601 405389 409934 414474 418285 421303 423989 426527
52505 426527 428388 428926 428198 426784 424856 421886 417414 411844 406279 401748 398662 396756 395308 393534 391072
52490 391072 388278 386085 385399 386370 388082 389212 389278 389078 389626 390851 391822 392117 392345 393174 394542 396107 397962
52473 397962 400360 403115 405825 408453 411184 413872 416166 418122 420192 422640 425427 428650 432448 436347
52459 436347 439281 440552 440336 439008 436526 432950 429022 425496 422126 418041 413082 408036 403466 399086
52445 399086 394649 390760 388197 386867 386087 385655 385884 386647 387156 386953 386552 386718 387489 388259 388583 388505 388251 387905
52427 387905 387368 386475 385259 384161 383745 384040 384476 384710 385094 385934 386650 386391 385348 384746 385389 386848 388280
$$ packed form
52539C85683l8K81M76O10Q20Q94O30L32M14P03O40J11m16n69m23j24K85N89M03
52520C91301j85m47J61J274K066K256K328K847L788M545M540L811L018K686K538
52505D26527J861N38p28j414j928k970m472n570n565m531l086j906j448j774k462
52490C91072k794k193o86R71J712J130O6k00N48J225R71K95K28Q29J368J565J855
52473C97962K398K755K710K628K731K688K294J956K070K448K787L223L798L899
52459D36347K934J271k16j328k482l576l928l526l370m085m959n046m570m380
52445C99086m437l889k563j330p80m32K29P63N09k03m01J66P71P70L24p8k54l46
52427C87905n37q93j216j098m16K95M36K34L84Q40P16k59j043o02O43J459J432
$$ plain form
52410 388280 389528 391108 393558 397243 402467 409305 417526 427008 438067 450994 465356 480011 493717
52397 493717 505408 514053 518706 518869 514696 506871 496481 484926 473585 463347 454524 447162 441326
52384 441326 437030 434047 431863 429902 427929 426302 425592 425888 426688 427677 429325 432356 436792 441967 447295
52369 447295 452578 457564 461785 464984 467219 468353 467974 466173 463993 462511 461658 460473 458477 456352 455119
52354 455119 455034 455486 455766 455744 455867 456646 458153 460050 462051 464190 466487 468507 469614 469729 469609 470225 472014
52337 472014 474742 477850 480809 483416 485999 489221 493475 498621 504558 511852 521355 533095 545992 558837
52323 558837 571273 583567 595729 607258 617635 626695 634470 641097 646995 652884 659392 666789 675169
52310 675169 684732 695723 708253 722318 737879 754812 772923 792109 812323 833235 854210 874918
$$ packed form
52410C88280J248J580K450L685N224O838Q221R482J1059J2927J4362J4655J3706
52397D93717J1691Q645M653J63m173p825j0390j1555j1341j0238q823p362n836
52384D41326m296k983k184j961j973j627p10K96Q00R89J648L031M436N175N328
52369D47295N283M986M221L199K235J134l79j801k180j482q53j185j996k125j233
52354D55119q5M52K80k2J23P79J507J897K001K139K297K020J107J15j20O16J789
52337D72014K728L108K959K607K583L222M254N146N937P294R503J1740J2897J2845
52323E58837J2436J2294J2162J1529J0377R060P775O627N898N889O508P397Q380
52310F75169R563J0991J2530J4065J5561J6933J8111J9186K0214K0912K0975K0708
$$ plain form
52298 874918 895735 917077 938415 958427 976192 991728 1005225 1016301 1024482 1030104 1034199 1037533
52286 1037533 1040139 1041781 1042475 1042449 1041869 1040778 1039176 1037030 1034339 1031263 1028119 1025231 1022816 1020961 1019553
52271 1019553 1018221 1016517 1014238 1011568 1009023 1007375 1007408 1009455 1013128 1017757 1023065 1029166 1036020 1043349
52257 1043349 1051222 1060207 1070731 1082677 1095866 1110460 1126372 1142629 1157923 1171671 1184040 1195066
52245 1195066 1204339 1211640 1217304 1221801 1225386 1228349 1231157 1234110 1237153 1240181 1243135 1245595 1246741 1246131
52231 1246131 1244248 1241870 1239161 1235747 1231527 1226918 1222337 1217777 1212934 1207483 1201215 1194124 1186366 1178091
52217 1178091 1169460 1160932 1153207 1146559 1140507 1134587 1129202 1125142 1122370 1119936 1117219 1114681 1113161 1112898
52203 1112898 1113581 1114916 1116746 1118817 1120904 1123127 1125926 1129744 1134815 1141147 1148501 1156547 1165119 1174183
$$ packed form
52298H74918K0817K1342K1338K0012J7765J5536J3497J1076Q181N622M095L334
52286A037533K606J642O94k6n80j091j602k146k691l076l144k888k415j855j408
52271A019553j332j704k279k670k545j648L3K047L673M629N308O101O854P329
52257A043349P873Q985J0524J1946J3189J4594J5912J6257J5294J3748J2369J1026
52245A195066R273P301N664M497L585K963K808K953L043L028K954K460J146o10
52231A246131j883k378k709l414m220m609m581m560m843n451o268p091p758q275
52217A178091q631q528p725o648o052n920n385m060k772k434k717k538j520k63
52203A112898O83J335J830K071K087K223K799L818N071O332P354Q046Q572R064
$$ plain form
52189 1174183 1183465 1192380 1200446 1207461 1213042 1216374 1216891 1215047 1211921 1208091 1203285 1197077 1189472 1180749
52175 1180749 1171265 1161699 1153062 1146028 1140399 1135529 1131099 1127169 1123632 1120172 1116915 1114687 1114294 1115695
52161 1115695 1118147 1121057 1124370 1128084 1131747 1134619 1136190 1136354 1135289 1133420 1131478 1130219 1129983 1130664 1132216
52146 1132216 1134969 1139273 1144917 1151050 1156645 1161006 1164000 1166008 1167623 1169141 1170306 1170612 1169848 1168298
52132 1168298 1166479 1164957 1164411 1165563 1168781 1173796 1180026 1187145 1195228 1204456 1214936 1226865 1240562
52119 1240562 1256163 1273388 1291749 1310802 1329960 1348325 1365168 1380650 1395604 1410461 1424769
52108 1424769 1438070 1450949 1464748 1480443 1498202 1517884 1539377 1562436 1586755 1612394 1639618
52097 1639618 1667953 1695760 1721134 1743026 1761198 1775350 1784789 1788922 1787740 1781918 1772779 1762038
$$ packed form
52189A174183R282Q915Q066P015N581L332N17j844l126l830m806o208p605q723
52175A180749r484r566q637p034n629m870m430l930l537l460l257k228l93J401
52161A115695K452K910L313L714L663K872J571J64j065j869j942j259k36O81J552
52146A132216K753M304N644O133N595M361K994K008J615J518J165L06p64j550
52132A168298j819j522n46J152L218N015O230P119Q083R228J0480J1929J3697
52119A240562J5601J7225J8361J9053J9158J8365J6843J5482J4954J4857J4308
52108A424769J3301J2879J3799J5695J7759J9682K1493K3059K4319K5639K7224
52097A639618K8335K7807K5374K1892J8172J4152R439M133j182n822r139j0741
$$ plain form
52085 1762038 1751085 1740360 1729626 1718842 1708413 1698621 1689271 1680070 1670976 1661916 1652510 1642476
52073 1642476 1632122 1622162 1613101 1605051 1597994 1591937 1586891 1582927 1580228 1578910 1578900 1580156 1582825 1586926
52059 1586926 1592115 1598179 1605585 1614976 1626100 1637849 1649529 1661473 1674083 1686825 1698705 1709231
52047 1709231 1718311 1725508 1730256 1732784 1734083 1734806 1734810 1734026 1733133 1732964 1733661 1734818 1736136 1737378 1737903 1736771
52031 1736771 1733432 1728093 1721460 1714339 1707307 1700344 1692719 1683552 1672610 1660407 1647502 1634046 1620139
52018 1620139 1606362 1593646 1582639 1573409 1565767 1559615 1554879 1551319 1548722 1547192 1546903 1547374 1547256 1545051
52004 1545051 1539833 1531096 1518273 1500980 1479673 1455564 1429933 1403949 1379042 1356608 1337009 1319431
51992 1319431 1303002 1287539 1272919 1258441 1243436 1227917 1211959 1194933 1176236 1156520 1137312
$$ packed form
52085A762038j0953j0725j0734j0784j0429r792r350r201r094r060r406j0034
52073A642476j0354r960r061q050p057o057n046l964k699j318j0J256K669M101
52059A586926N189O064P406R391J1124J1749J1680J1944J2610J2742J1880J0526
52047A709231R080P197M748K528J299P23Mp84q93j69O97J157J318J242N25j132
52031A736771l339n339o633p121p032o963p625r167j0942j2203j2905j3456j3907
52018A620139j3777j2716j1007r230p642o152m736l560k597j530k89M71j18k205
52004A545051n218q737j2823j7293k1307k4109k5631k5984k4907k2434j9599j7578
51992A319431j6429j5463j4620j4478j5005j5519j5958j7026j8697j9716j9208
$$ plain form
51981 1137312 1119427 1102408 1085382 1067675 1048638 1027866 1005981 984508 964629 946499 929993
51970 929993 915518 903766 895148 889850 888004 889434 893536 899745 907872 917720 928585 939268 948311
51957 948311 954169 955641 952476 945351 935132 922438 907998 892982 878696 866230 856451 849849 846140
51944 846140 844549 844833 847694 853888 863270 874908 887710 900634 912802 923793 933524 941547 946958
51931 946958 949328 949137 946762 941602 932886 920948 907001 891898 875784 858756 841096 823011 804822
51918 804822 787397 771730 758054 745948 735285 726523 719988 715463 712643 711561 712496 715839 722013
51905 722013 731034 742136 754436 767989 783532 800968 818614 834245 846343 854040 856436 852726
51893 852726 842948 828182 809957 789718 768835 748774 730920 716103 704383 695432 689169 685827
$$ packed form
51981A137312j7885j7019j7026j7707j9037k0772k1885k1473j9879j8130j6506
51970I29993j4475j1752q618n298j846J430M102O209Q127R848J0865J0683R043
51957I48311N858J472l165p125j0219j2694j4440j5016j4286j2466r779o602l709
51944H46140j591K84K861O194R382J1638J2802J2924J2168J0991R731Q023N411
51931I46958K370j91k375n160q716j1938j3947j5103j6114j7028j7660j8085j8189
51918H04822j7425j5667j3676j2106j0663q762o535m525k820j082R35L343O174
51905G22013R021J1102J2300J3553J5543J7436J7646J5631J2098P697K396l710
51893H52726r778j4766j8225k0239k0883k0061j7854j4817j1720q951o263l342
$$ plain form
51881 685827 685424 687587 692236 700134 712286 728870 749177 772453 798264 825889 853734 879542
51869 879542 900991 916195 924116 924839 919460 909741 897919 886451 877285 871246 868402 868991 873636 882704
51855 882704 895877 912350 930940 949926 967276 981228 990378 993196 988165 974857 954649 930038
51843 930038 903362 876196 849516 823980 800106 778428 759450 743400 730144 719398 711000 704980
51831 704980 701524 700776 702480 705868 710107 714582 718394 719912 717674 711859 704278 696690 689742 683701
51817 683701 679368 677545 678107 680326 683931 689158 695784 702640 708217 711366 711370 707864 701153 692392 683026
51802 683026 673829 664712 655665 647680 642180 639466 638247 637130 636156 636327 637923 640073 641906 643267 644186
51787 644186 644456 644205 644258 645322 647035 648215 647886 645873 642719 639327 636425 634152 632333 631222 631593 633985
$$ packed form
51881F85827m03K163M649P898J2152J6584K0307K3276K5811K7625K7845K5808
51869H79542K1449J5204P921P23n379r719j1822j1468r166o039k844N89M645R068
51855H82704J3173J6473J8590J8986J7350J3952R150K818n031j3308k0208k4611
51843I30038k6676k7166k6680k5536k3874k1678j8978j6050j3256j0746q398o020
51831G04980l456p48J704L388M239M475L812J518k238n815p581p588o948o041
51817F83701m333j823N62K219L605N227O626O856N577L149Ml506o711q761r366
51802F83026r197r117r047p985n500k714j219j117r74J71J596K150J833J361R19
51787F44186K70k51N3J064J713J180l29k013l154l392k902k273j819j111L71K392
$$ plain form
51771 633985 638442 645198 654967 667969 683085 698584 713433 727370 739939 750151 757088 760329
51759 760329 759700 755038 746447 734634 720918 706867 693643 681473 669845 658395 647456 637649
51747 637649 629286 622337 616746 612505 609706 608787 610397 614607 620436 626528 632272 638091 644906 653572
51733 653572 664456 677054 690003 701789 711355 717992 721116 720627 717311 712495 707500 703568 701792
51720 701792 702361 704103 705329 705100 703284 699805 694661 688672 683348 679754 677900 677325 677736 678898 680455
51705 680455 682224 684441 687581 692214 699060 708670 720649 733361 744650 752923 757730 759731 760314 761057
51691 761057 763243 767705 774833 784410 795362 805837 813631 816726 814011 805959 794481 781740 769083
51678 769083 757220 746989 739302 734369 731399 729024 725746 720356 712652 703769 695192 687472 680492 674897
$$ packed form
51771F33985M457O756R769J3002J5116J5499J4849J3937J2569J0212O937L241
51759G60329o29m662q591j1813j3716j4051j3224j2170j1628j1450j0939r807
51747F37649q363o949n591m241k799r19J610M210N829O092N744N819O815Q666
51733F53572J0884J2598J2949J1786R566O637L124m89l316m816m995l932j776
51720G01792N69J742J226k29j816l479n144n989n324l594j854n75M11J162J557
51705F80455J769K217L140M633O846R610J1979J2712J1289Q273M807K001N83P43
51691G61057K186M462P128R577J0952J0475P794L095k715q052j1478j2741j2657
51678G69083j1863j0231p687m933k970k375l278n390p704q883q577p720o980n595
$$ plain form
51664 674897 672325 673879 679013 686330 694813 703801 712235 718675 721977 721695 718082 712088 705180 698784
51650 698784 693901 691349 691954 696064 702979 711170 719005 725104 728218 727215 721395 710837 696537 680105
51636 680105 663002 645929 629164 613535 600487 590838 583835 577997 572679 568372 565562 563939 562900
51623 562900 562370 562736 564138 566142 568113 569740 571114 572419 573625 574466 574573 573640 571592 568748 565713
51608 565713 562938 560444 558074 555907 554229 553137 552431 551885 551492 551496 552458 555217 560441 568134 577817 589179
51592 589179 602298 617269 633968 652097 670879 688568 702919 712651 718259 721159 722531 723386 725169
51579 725169 729354 736424 745891 757626 772726 792794 818520 849087 882775 918037 954262 991794
51567 991794 1031340 1073329 1117782 1164536 1213298 1263463 1314297 1365726 1419095 1476949 1541693
$$ packed form
51664F74897k572J554N134P317Q483Q988Q434O440L302k82l613n994o908o396
51650F98784m883k552O05M110O915Q191P835O099L114j003n820j0558j4300j6432
51636F80105j7103j7073j6765j5629j3048r649p003n838n318m307k810j623j039
51623E62900n30L66J402K004J971J627J374J305J206Q41J07r33k048k844l035
51608E65713k775k494k370k167j678j092p06n46l93MR62K759N224P693R683J1362
51592E89179J3119J4971J6699J8129J8782J7689J4351R732N608K900J372Q55J783
51579G25169M185P070R467J1735J5100K0068K5726L0567L3688L5262L6225L7532
51567I91794L9546M1989M4453M6754M8762N0165N0834N1429N3369N7854O4744
$$ plain form
51556 1541693 1614004 1692150 1772506 1850582 1921652 1980901 2023672 2046165 2046210 2023627 1980045 1918393
51544 1918393 1842295 1755605 1662223 1565937 1470083 1377137 1288708 1205857 1129369 1059876 998068
51533 998068 944777 900495 864617 835402 810832 789399 770138 752444 736215 721909 709996
51522 709996 700324 692215 685013 678312 671781 665207 658760 652995 648473 645411 643573 642321 640928 639129
51508 639129 637321 635902 634440 631859 627550 621958 615922 609828 603748 598138 593776 590904 588873 586953
51494 586953 585275 584650 585539 587487 589615 591451 593177 595326 598288 601902 605348 607630 608359 607957 606916
51479 606916 605099 602097 598127 594093 590690 587779 584874 581885 579168 576968 575099 573170 570975 568671
51465 568671 566584 564853 563280 561634 560093 559172 559172 559852 560815 562157 564551 568591 574060 579914 585154 589750
$$ packed form
51556A541693P2311P8146Q0356P8076P1070N9249M2771K2493M5k2583m3582o1652
51544A918393p6098q6690r3382r6286r5854r2946q8429q2851p6488o9493o1808
51533I98068n3291m4282l5878k9215k4570k1433j9261j7694j6229j4306j1913
51522G09996r672q109p202o701o531o574o447n765m522l062j838j252j393j799
51508F39129j808j419j462k581m309n592o036o094o080n610m362k872k031j920
51494E86953j678o25Q89J948K128J836J726K149K962L614L446K282P29m02j041
51479F06916j817l002l970m034l403k911k905k989k717k200j869j929k195k304
51465E68671k087j731j573j646j541r21%O80R63J342K394M040N469N854N240M596
$$ plain form
51449 589750 594599 600599 608013 616753 626779 637948 649967 663176 679009 698790 721944 746034
51437 746034 768586 788100 803213 812236 814660 812640 809844 808673 809059 809592 808841 805392 797628 784436
51423 784436 766202 744865 723041 703096 686580 673956 664689 657877 653048 650310 649643 650148 650375
51410 650375 649531 648121 647169 647051 647528 648708 651274 655556 660919 666415 671603 676375 680466 683723 686724
51395 686724 690481 695547 701829 709302 718403 729647 743264 759432 778563 801140 827564 858500
51383 858500 895287 939647 992832 1055107 1126153 1205855 1294474 1391911 1496931 1607270 1720234
51372 1720234 1832723 1940519 2037980 2118938 2178133 2212135 2219572 2200986 2158376 2094537 2012789
51361 2012789 1917185 1812489 1703380 1593692 1486489 1384480 1289821 1203642 1126238 1057761
$$ packed form
51449E89750M849O000P414Q740J0026J1169J2019J3209J5833J9781K3154K4090
51437G46034K2552J9514J5113R023K424k020k796j171L86N33p51l449p764j3192
51423G84436j8234k1337k1824j9945j6516j2624r267o812m829k738o67N05K27
51410F50375q44j410r52j18M77J180K566M282N363N496N188M772M091L257L001
51395F86724L757N066O282P473R101J1244J3617J6168J9131K2577K6424L0936
51383H58500L6787M4360N3185O2275P1046P9702Q8619R7437J05020J10339J12964
51372A720234J12489J07796R7461Q0958N9195L4002P437j8586m2610o3839q1748
51361B012789r5604j04696j09109j09688j07203j02009r4659q6179p7404o8477
$$ plain form
51351 1057761 998319 947382 903609 865554 832337 803497 778425 756191 735861 716867 699077
51340 699077 682593 667488 653702 641133 629704 619329 609984 601884 595413 590738 587628 585659 584383
51327 584383 583177 581354 578747 575966 573722 572043 570512 569072 568216 568432 569857 572361 575553 578731 581333
51312 581333 583479 585693 587995 589745 590562 591108 592648 595956 600751 606009 610753 614618 617720 619944 620595
51297 620595 619000 615265 609992 603426 595481 586667 578239 571058 564814 558896 553643 550042 548280 547249
51283 547249 545782 543963 542938 543632 546032 549679 554490 560693 568093 575735 582509 587920 592207 595926
51269 595926 599649 603849 608737 614163 619861 625848 632462 640067 648672 657590 665335 670163 671117 668523
51255 668523 663398 656674 649145 641559 634123 626181 617130 607569 598875 591668 585370 579288 573408 567887
$$ packed form
51351A057761n9442n0937m3773l8055l3217k8840k5072k2234k0330j8994j7790
51340F99077j6484j5105j3786j2569j1429j0375r345q100o471m675l110j969j276
51327E84383j206j823k607k781k244j679j531j440q56K16J425K504L192L178K602
51312E81333K146K214K302J750Q17N46J540L308M795N258M744L865L102K224O51
51297F20595j595l735n273o566p945q814q428p181o244n918n253l601j762j031
51283E47249j467j819j025O94K400L647M811O203P400P642O774N411M287L719
51269E95926L723M200M888N426N698N987O614P605Q605Q918P745M828R54k594
51255F68523n125o724p529p586p436p942r051r561q694p207o298o082n880n521
$$ plain form
51241 567887 562585 557529 553343 550709 549651 549638 550075 550511 550745 550951 551354 551660 551294 550395 550001 550937 552972
51224 552972 555403 557856 560077 561598 562304 562918 564281 566411 568817 571342 574020 576474 578191 579222 579866
51209 579866 579881 578892 577497 577107 578572 581729 586352 592642 600424 608721 616614 623952 630756 636521 640643
51194 640643 643122 644258 644024 642394 640041 638017 636719 635711 634649 633851 633743 634119 634339 634110 633795 633843
51178 633843 634061 633609 631763 628646 625096 621864 619035 616282 613499 611071 609560 609185 609675 610619 611917
51163 611917 613733 615951 617954 619180 619735 620112 620342 619822 618069 615282 611983 608380 604327 599734 594811
51148 594811 589962 585569 581743 578236 574781 571629 569462 568595 568449 568068 567052 565827 565127 565441 566786
51133 566786 568763 570874 572966 575340 578257 581457 584368 586760 588960 591469 594516 597936 601242 603879
$$ packed form
51241E67887n302n056m186k634j058j3M37M36K34K06M03L06l66q99l94R36K035
51224E52972K431K453K221J521P06O14J363K130K406K525K678K454J717J031O44
51209E79866J5r89j395l90J465L157M623O290P782Q297P893P338O804N765M122
51194F40643K479J136k34j630k353k024j298j008j062p98j08L76K20k29l15M8
51178F33843K18m52j846l117l550l232k829k753k783k428j511l75M90R44J298
51163F11917J816K218K003J226N55L77K30n20j753k787l299l603m053m593m923
51148E94811m849m393l826l507l455l152k167q67j46l81j016j225p00L14J345
51133E66786J977K111K092K374K917L200K911K392K200K509L047L420L306K637
$$ plain form
51119 603879 605702 607233 609222 611788 614137 615315 615246 614980 615868 618445 622120 626009 629991 634722 640571
51104 640571 646837 652267 656165 658681 660170 660620 659746 657368 653659 649173 644572 640121 635527 630537 625530
51089 625530 621174 617602 614463 611744 609920 609128 608753 608210 607653 607517 607776 608139 608653 609608 611072 613008
51073 613008 615663 619245 623343 627242 630841 634679 638996 643320 647184 650754 654551 658935 664140 670385
51059 670385 677682 685805 694686 704493 715025 725349 734383 741676 747373 751826 755683 760121 766333 774720
51045 774720 784960 796856 810601 826122 842598 858935 874456 888848 901687 912424 920878 927425
51033 927425 932452 935710 936347 933604 927248 917255 903324 885165 863373 839697 816196 794263 774568
51020 774568 757620 743940 733776 726970 723091 721486 721341 722154 724268 728544 735260 743618 752537 761744
$$ packed form
51119F03879J823J531J989K566K349J178o9k66Q88K577L675L889L982M731N849
51104F40571O266N430L898K516J489M50q74k378l709m486m601m451m594m990n007
51089F25530m356l572l139k719j824p92l75n43n57j36K59L63N14R55J464J936
51073F13008K655L582M098L899L599L838M317M324L864L570L797M384N205O245
51059F70385P297Q123Q881R807J0532J0324R034P293N697M453L857M438O212Q387
51045G74720J0240J1896J3745J5521J6476J6337J5521J4392J2839J0737Q454O547
51033I27425N027L258O37k743o356r993j3931j8159k1792k3676k3501k1933j9695
51020G74568j6948j3680j0164o806l879j605j45Q13K114M276O716Q358Q919R207
$$ plain form
51006 761744 771710 782668 794049 805042 815447 825724 836232 846601 855956 863656 869771 874924
50994 874924 879878 885252 891436 898645 907193 917806 931412 948426 968305 990016 1012818 1036392
50982 1036392 1060407 1084426 1108367 1132662 1157741 1183520 1209598 1235785 1262147 1288490 1313848
50971 1313848 1336576 1355099 1368910 1379065 1387688 1396828 1407722 1421017 1437482 1458315 1484814 1517759
50959 1517759 1556987 1601402 1649444 1699755 1751507 1804175 1857016 1908794 1957928 2002862 2042447
50948 2042447 2076136 2103931 2126111 2142944 2154694 2161969 2166065 2168789 2171697 2175353 2179311 2182573 2183852
50935 2183852 2181506 2173860 2160046 2140523 2116619 2089743 2061151 2031988 2002903 1973580 1943050 1910540
50923 1910540 1875749 1838446 1798352 1755595 1710810 1664540 1616886 1568051 1518930 1470857 1424963
$$ packed form
51006G61744R966J0958J1381J0993J0405J0277J0508J0369R355P700O115N153
50994H74924M954N374O184P209Q548J0613J3606J7014J9879K1711K2802K3574
50982A036392K4015K4019K3941K4295K5079K5779K6078K6187K6362K6343K5358
50971A313848K2728J8523J3811J0155Q623R140J0894J3295J6465K0833K6499L2945
50959A517759L9228M4415M8042N0311N1752N2668N2841N1778M9134M4934L9585
50948B042447L3689K7795K2180J6833J1750P275M096K724K908L656L958L262J279
50935B183852k346p646j3814j9523k3904k6876k8592k9163k9085k9323l0530l2510
50923A910540l4791l7303m0094m2757m4785m6270m7654m8835m9121m8073m5894
$$ plain form
50912 1424963 1381984 1342410 1306398 1273622 1243574 1216020 1190977 1168320 1147706 1128864 1111695
50901 1111695 1096077 1081807 1068864 1057586 1048386 1041309 1035925 1031705 1028447 1026253 1025031 1024199 1023119
50888 1023119 1021841 1021130 1021654 1023312 1025442 1027507 1029458 1031658 1034586 1038412 1042717 1046836 1050707 1055130
50874 1055130 1060948 1068151 1076070 1084281 1092924 1102268 1112388 1123272 1134910 1147213 1160190 1174269
50862 1174269 1190156 1208334 1228969 1252321 1278876 1308973 1342703 1380391 1422825 1470685 1524057
50851 1524057 1582884 1647745 1719789 1799932 1888452 1985338 2090626 2204240 2325682 2454044
50841 2454044 2588184 2726864 2868828 3012678 3156393 3296862 3430141 3552332 3660164
50832 3660164 3750850 3822067 3872593 3902833 3914228 3908212 3886135 3850217 3804014 3751634 3696744
$$ packed form
50912A424963m2979l9574l6012l2776l0048k7554k5043k2657k0614j8842j7169
50901A111695j5618j4270j2943j1278r200p077n384m220l258k194j222q32j080
50888A023119j278p11N24J658K130K065J951K200K928L826M305M119L871M423
50874A055130N818P203P919Q211Q643R344J0120J0884J1638J2303J2977J4079
50862A174269J5887J8178K0635K3352K6555L0097L3730L7688M2434M7860N3372
50851A524057N8827O4861P2044Q0143Q8520R6886J05288J13614J21442J28362
50841B454044J34140J38680J41964J43850J43715J40469J33279J22191J07832
50832C660164R0686P1217N0526L0240J1395o016k2077l5918m6203n2380n4890
$$ plain form
50821 3696744 3642457 3591622 3546542 3508361 3477092 3452264 3433154 3418218 3404589 3388457 3366111
50810 3366111 3334835 3293204 3240826 3177846 3104595 3021539 2929472 2829683 2724070 2615151 2505812
50799 2505812 2398747 2296035 2199212 2109598 2028286 1955879 1892453 1837831 1791761 1753874 1723732
50788 1723732 1701091 1685929 1678003 1676314 1679079 1684322 1690677 1697754 1705704 1714332 1722702 1729636 1734429
50775 1734429 1736915 1737083 1734982 1730921 1725321 1718212 1709112 1697504 1683244 1666439 1647195 1625648 1602131
50762 1602131 1577134 1551101 1524225 1496429 1467685 1438512 1410066 1383519 1359440 1337973 1319307
50751 1319307 1303574 1290395 1279125 1269653 1262556 1258438 1257603 1260360 1267077 1277704 1291763 1309091 1330121
50738 1330121 1355215 1384274 1417347 1455005 1497558 1544271 1593991 1646335 1701879 1761423 1825512
$$ packed form
50821C696744n4287n0835m5080l8181l1269k4828j9110j4936j3629j6132k2346
50810C366111l1276m1631n2378o2980p3251q3056r2067r9789j05613j08919j09339
50799B505812j07065j02712r6823q9614q1312p2407o3426n4622m6070l7887l0142
50788A723732k2641j5162p926j689K765N243O355P077P950Q628Q370O934M793
50775A734429K486J68k101m061n600p109r100j1608j4260j6805j9244k1547k3517
50762A602131k4997k6033k6876k7796k8744k9173k8446k6547k4079k1467j8666
50751A319307j5733j3179j1270r472p097m118q35K757O717J0627J4059J7328K1030
50738A330121K5094K9059L3073L7658M2553M6713M9720N2344N5544N9544O4089
$$ plain form
50727 1825512 1894326 1967398 2043494 2121245 2199869 2279027 2358194 2436493 2512761 2585224 2651361
50716 2651361 2708663 2755372 2789995 2810562 2815306 2804175 2778944 2741898 2695239 2641901 2585888
50705 2585888 2531091 2480102 2434407 2395095 2362890 2337915 2319893 2308191 2301254 2296365 2290587 2281816
50693 2281816 2268602 2249380 2222633 2187825 2145638 2097205 2043618 1986409 1928009 1871146 1817709
50682 1817709 1768381 1723381 1683314 1649221 1622010 1602109 1589637 1584569 1586648 1595466 1610952 1633538
50670 1633538 1663459 1699955 1741485 1786641 1834447 1883820 1933295 1981519 2027591 2070675 2109637
50659 2109637 2143535 2172398 2197250 2219311 2239277 2257262 2273257 2287548 2300652 2312848 2323961
50648 2323961 2333795 2342663 2351186 2359706 2368391 2377996 2390052 2406041 2426632 2451865 2481657 2515837
$$ packed form
50727A825512O8814P3072P6096P7751P8624P9158P9167P8299P6268P2463O6137
50716B651361N7302M6709L4623K0567M744j1131k5231l7046m6659n3338n6013
50705B585888n4797n0989m5695l9312l2205k4975j8022j1702o937m889n778q771
50693B281816j3214j9222k6747l4808m2187m8433n3587n7209n8400n6863n3437
50682A817709m9328m5000m0067l4093k7211j9901j2472n068K079Q818J5486K2586
50670A633538K9921L6496M1530M5156M7806M9373M9475M8224M6072M3084L8962
50659B109637L3898K8863K4852K2061J9966J7985J5995J4291J3104J2196J1113
50648B323961R834Q868Q523Q520Q685R605J2056J5989K0591K5233K9792L4180
$$ plain form
50636 2515837 2554032 2595943 2641565 2690782 2742905 2796907 2851942 2907396 2962714 3017785 3073386
50625 3073386 3130617 3189479 3247939 3301990 3346022 3373217 3376853 3352794 3301704 3229225 3144042
50614 3144042 3055245 2970285 2893920 2828234 2773638 2730110 2697628 2675583 2662211 2655016 2651689 2650275
50602 2650275 2648419 2642979 2630778 2609656 2578638 2537459 2486487 2427043 2361145 2290708 2217262 2142478
50590 2142478 2068339 1996324 1926764 1859524 1795146 1734809 1679240 1628253 1581588 1539765 1503729
50579 1503729 1473782 1449172 1428755 1411888 1398657 1389451 1384508 1383889 1387640 1395760 1407960 1423616
50567 1423616 1441997 1462318 1483465 1503881 1522076 1537390 1550196 1561413 1571986 1582771 1594636
50556 1594636 1608486 1625258 1645916 1671283 1701689 1736847 1776107 1818728 1863763 1909800 1955088
$$ packed form
50636B515837L8195M1911M5622M9217N2123N4002N5035N5454N5318N5071N5601
50625C073386N7231N8862N8460N4051M4032K7195L636k4059n1090p2479q5183
50614C144042q8797q4960p6365o5686n4596m3528l2482k2045j3372p195l327j414
50602B650275j856n440j2201k1122l1018m1179n0972n9444o5898p0437p3446p4784
50590B142478p4139p2015o9560o7240o4378o0337n5569n0987m6665m1823l6036
50579A503729k9947k4610k0417j6867j3231r206m943o19L751Q120J2200J5656
50567A423616J8381K0321K1147K0416J8195J5314J2806J1217J0573J0785J1865
50556A594636J3850J6772K0658K5367L0406L5158L9260M2621M5035M6037M5288
$$ plain form
50545 1955088 1998018 2037446 2072742 2103983 2132250 2159394 2187119 2216306 2247408 2281277 2319188
50534 2319188 2362057 2409991 2462799 2520658 2584102 2653627 2729528 2812049 2901505 2998361 3103228
50523 3103228 3216542 3338009 3466460 3600291 3737700 3876293 4012893 4144318 4268268
50514 4268268 4382980 4486004 4573869 4643111 4691320 4717087 4719552 4698547 4655013 4590820 4508170
50503 4508170 4409514 4298115 4178294 4054810 3932093 3814262 3705559 3610094 3530846 3469222
50493 3469222 3425886 3401621 3396709 3409616 3436909 3474565 3518632 3564374 3605661 3636015 3650113
50482 3650113 3644025 3614827 3561146 3484139 3387218 3274600 3150473 3019205 2885327 2752846
50472 2752846 2624830 2503563 2390502 2285923 2189237 2099929 2017923 1943010 1874521 1811714
$$ packed form
50545A955088M2930L9428L5296L1241K8267K7144K7725K9187L1102L3869L7911
50534B319188M2869M7934N2808N7859O3444O9525P5901Q2521Q9456R6856J04867
50523C103228J13314J21467J28451J33831J37409J38593J36600J31425J23950
50514D268268J14712J03024Q7865O9242M8209K5767K465k1005m3534o4193q2650
50503D508170r8656j11399j19821j23484j22717j17831j08703r5465p9248o1624
50493C469222m3336k4265m912J2907K7293L7656M4067M5742M1287L0354J4098
50482C650113o088k9198n3681p7007r6921j12618j24127j31268j33878j32481
50472B752846j28016j21267j13061j04579r6686q9308q2006p4913o8489o2807
$$ plain form
50462 1811714 1753984 1700545 1650573 1604070 1562075 1525572 1494493 1468053 1445648 1427016 1411898
50451 1411898 1400000 1391129 1385020 1381188 1379201 1378927 1380301 1383063 1386957 1392036 1398657 1407305 1418300 1431227
50437 1431227 1444628 1456800 1467132 1476191 1484523 1492083 1499013 1505939 1512929 1518994 1523525 1527585 1532883
50424 1532883 1539935 1548192 1557649 1569132 1583094 1599205 1617373 1638314 1662844 1691311 1724017 1761571
50412 1761571 1804556 1853320 1908310 1970128 2038987 2114425 2195638 2281585 2370624 2460578 2549503
50401 2549503 2636094 2719178 2797167 2868257 2930855 2983653 3025522 3055458 3072396 3075045 3062174
50390 3062174 3033096 2987778 2926893 2852414 2767968 2677695 2584569 2490552 2398378 2312039 2234870
50379 2234870 2168029 2111610 2066449 2033802 2013658 2004559 2004965 2013756 2029229 2048535 2068506 2086452
$$ packed form
50462A811714n7730n3439m9972m6503m1995l6503l1079k6440k2405j8632j5118
50451A411898j1898q871o109l832j987k74J374K762L894N079O621Q648J0995J2927
50437A431227J3401J2172J0332R059Q332P560O930O926O990O065M531M060N298
50424A532883P052Q257R457J1483J3962J6111J8168K0941K4530K8467L2706L7554
50412A761571M2985M8764N4990O1818O8859P5438Q1213Q5947Q9039Q9954Q8925
50401B549503Q6591Q3084P7989P1090O2598N2798M1869K9936J6938K649j2871
50390C062174k9078m5318o0885p4479q4446r0273r3126r4017r2174q6339p7169
50379B234870o6841n6419m5161l2647k0144r099M06Q791J5473J9306J9971J7946
$$ plain form
50367 2086452 2099833 2105895 2102266 2087792 2062461 2026818 1981853 1929283 1871465 1810854 1749550 1689168
50355 1689168 1630841 1575318 1523099 1474383 1428796 1385516 1344108 1305276 1270408 1240163 1213698
50344 1213698 1189498 1166898 1146551 1129423 1115494 1103506 1091879 1079820 1067708 1056512 1046847
50333 1046847 1038544 1031104 1024465 1019120 1015455 1013171 1011505 1009916 1008436 1007431 1007251 1008066 1009831 1012346
50319 1012346 1015446 1019167 1023624 1028753 1034286 1039965 1045639 1051131 1056184 1060696 1064884 1069142 1073785 1078978
50305 1078978 1084809 1091256 1098111 1105118 1112229 1119626 1127426 1135507 1143759 1152445 1162075 1172808 1184177
50292 1184177 1195572 1207001 1219224 1233127 1249055 1266700 1285448 1304695 1323766 1341451 1355599
50281 1355599 1363310 1361902 1350050 1328322 1298994 1265488 1231555 1200262 1173225 1150736 1132537 1118443
$$ packed form
50367B086452J3381O062l629j4474k5331l5643m4965n2570n7818o0611o1304o0382
50355A689168n8327n5523n2219m8716m5587m3280m1408l8832l4868l0245k6465
50344A213698k4200k2600k0347j7128j3929j1988j1627j2059j2112j1196r665
50333A046847q303p440o639n345l665k284j666j589j480j005j80Q15J765K515
50319A012346L100L721M457N129N533N679N674N492N053M512M188M258M643N193
50305A078978N831O447O855P007P111P397P800Q081Q252Q686R630J0733J1369
50292A184177J1395J1429J2223J3903J5928J7645J8748J9247J9071J7685J4148
50281A355599P711j408j1852k1728k9328l3506l3933l1293k7037k2489j8199j4094
$$ plain form
50269 1118443 1108383 1102276 1099918 1100812 1104084 1108849 1114582 1120918 1127153 1132478 1136749 1140572 1144507 1148669
50255 1148669 1153247 1158754 1165314 1172122 1178109 1182846 1186468 1189071 1190641 1191266 1190963 1189576 1187236 1184560
50241 1184560 1181884 1178625 1173967 1167954 1161385 1154943 1149043 1144119 1140192 1136360 1131653 1126376 1121711 1117945
50227 1117945 1114099 1109554 1105068 1101719 1099652 1098400 1097653 1097029 1095706 1093083 1089550 1085929 1082425 1078754
50213 1078754 1075090 1072230 1070804 1070844 1072139 1074595 1078156 1082735 1088458 1095813 1105465 1117935 1133385 1151675
50199 1151675 1172726 1196742 1223839 1253365 1283958 1314434 1344444 1374088 1403262 1431715 1459533
50188 1459533 1487217 1515274 1543823 1572439 1600187 1625941 1648714 1667380 1680067 1684350 1678527 1662572
50176 1662572 1637674 1605322 1567303 1526164 1484820 1445518 1409512 1377717 1351170 1330736 1316712
$$ packed form
50269A118443j0060o107k358Q94L272M765N733O336O235N325M271L823L935M162
50255A148669M578N507O560O808N987M737L622K603J570O25l03j387k340k676
50241A184560k676l259m658o013o569o442n900m924l927l832m707n277m665l766
50227A117945l846m545m486l349k067j252p47o24j323k623l533l621l504l671
50213A078754l664k860j426M0J295K456L561M579N723P355R652J2470J5450J8290
50199A151675K1051K4016K7097K9526L0593L0476L0010K9644K9174K8453K7818
50188A459533K7684K8057K8549K8616K7748K5754K2773J8666J2687M283n823j5955
50176A662572k4898l2352l8019m1139m1344l9302l6006l1795k6547k0434j4024
$$ plain form
50165 1316712 1308869 1306545 1308439 1312489 1316169 1317001 1312920 1302613 1285903 1263914 1238726 1212665 1187681
50152 1187681 1165220 1146349 1131734 1121275 1113907 1108068 1102423 1096080 1088312 1078573 1066912 1053958
50140 1053958 1040254 1025813 1010542 994763 979122 964294 951145 940897 934623 932544 933997 938022
50128 938022 943731 950250 956594 961746 964885 965746 964867 963209 961344 959218 956864 954917 953996 953894 953878 953615
50112 953615 953371 953438 953965 955301 957954 962031 967142 972963 979514 986777 994479 1002439 1010850 1020000 1029938
50097 1029938 1040580 1051911 1063977 1076890 1091012 1106908 1124975 1145279 1167880 1193140 1221515
50086 1221515 1253262 1288517 1327577 1370835 1418439 1470120 1525367 1583645 1644365 1706618 1769056
50075 1769056 1830306 1889795 1948171 2006786 2066760 2128599 2192443 2258161 2324836 2390164 2450497
$$ packed form
50165A316712p843k324J894M050L680Q32m081j0307j6710k1989k5188k6061k4984
50152A187681k2461j8871j4615j0459p368n839n645o343p768r739j1661j2954
50140A053958j3704j4441j5271j5779j5641j4828j3149j0248o274k079J453M025
50128I38022N709O519O344N152L139Q61q79j658j865k126k354j947r21j02j6k63
50112I53615k44O7N27J336K653M077N111N821O551P263P702P960Q411R150R938
50097A029938J0642J1331J2066J2913J4122J5896J8067K0304K2601K5260K8375
50086A221515L1747L5255L9060M3258M7604N1681N5247N8278O0720O2253O2438
50075A769056O1250N9489N8376N8615N9974O1839O3844O5718O6675O5328O0333
$$ plain form
50064 2450497 2501603 2539637 2561828 2566623 2553549 2523199 2477357 2418744 2350266 2274465 2193726
50053 2193726 2110652 2027778 1947004 1869651 1796919 1729884 1669085 1614637 1566827 1526062 1492068
50042 1492068 1463643 1439482 1418908 1401552 1386763 1373818 1362451 1352780 1344947 1339200 1336111 1336210 1339426
50029 1339426 1345177 1352880 1361938 1371384 1380150 1387757 1394268 1399495 1402797 1403959 1403766 1403259 1402663 1401308 1398317
50014 1398317 1392946 1384501 1372562 1357459 1340226 1322050 1303933 1286808 1271490 1258294 1246891 1236685
50002 1236685 1227286 1218849 1212327 1209357 1211262 1217842 1227482 1238644 1250796 1263582 1275758 1285747 1293031
49989 1293031 1298154 1301366 1302049 1299672 1294458 1286664 1275859 1261686 1245070 1228037 1212367 1198828 1187584
49976 1187584 1178725 1172208 1167690 1164722 1163090 1162953 1164854 1169618 1177984 1190183 1205954 1225069 1247699
$$ packed form
50064B450497N1106L8034K2191M795j3074l0350m5842n8613o8478p5801q0739
50053B193726q3074q2874q0774p7353p2732o7035o0799n4448m7810m0765l3994
50042A492068k8425k4161k0574j7356j4789j2945j1367r671p833n747l089R9L216
50029A339426N751P703R058R446Q766P607O511N227L302J162j93n07n96j355k991
50014A398317n371q445j1939j5103j7233j8176j8117j7125j5318j3196j1403j0206
50002A236685r399q437o522k970J905O580R640J1162J2152J2786J2176R989P284
49989A293031N123L212O83k377n214p794j0805j4173j6616j7033j5670j3539j1244
49976A187584q859o517m518k968j632j37J901M764Q366J2199J5771J9115K2630
$$ plain form
49963 1247699 1274239 1304870 1339493 1378065 1420836 1468160 1519984 1575539 1633505 1692530 1751727
49952 1751727 1810863 1870195 1930016 1990114 2049597 2107050 2160651 2207975 2246021 2271893 2283569
49941 2283569 2279815 2259642 2222507 2169259 2102390 2025082 1940340 1851183 1760949 1672658 1588141
$$ packed form
49963A247699K6540L0631L4623L8572M2771M7324N1824N5555N7966N9025N9197
49952A751727N9136N9332N9821O0098N9483N7453N3601M7324L8046K5872J1676
49941B283569l754k0173l7135n3248o6869p7308q4742q9157r0234q8291q4517
$$ [...]
##END NTUPLES=NMR SPECTRUM
##END=
