##TITLE=AC1475_ZNESTR301_8100901_303tCqPQpd
##JCAMPDX= 6.0         $$ Bruker NMR JCAMP-DX V2.0
##DATA TYPE= NMR SPECTRUM
##DATA CLASS= NTUPLES
##ORIGIN= BRUKER
##OWNER= Administrator
$$ 1.72 TOPSPIN		Version 2.1
$$ 2013-08-15 16:18:39.704 -0700  Administrator@X
$$ Compression mode = diff/dup
##.OBSERVE FREQUENCY= 400.02188249412
##.OBSERVE NUCLEUS= ^1H
##.ACQUISITION MODE= SIMULTANEOUS (DQD)
##.ACQUISITION SCHEME= undefined
##.AVERAGES= 8
##.DIGITISER RES= 22
##SPECTROMETER/DATA SYSTEM= spect
##.PULSE SEQUENCE= zg30
##.SOLVENT NAME= COFFEE_meoh
##.SHIFT REFERENCE= INTERNAL, COFFEE_meoh, 1, 14.98509
##AUDIT TRAIL= $$ (NUMBER, WHEN, WHO, WHERE, PROCESS, VERSION, WHAT)
$$ ##TITLE= Audit trail, TOPSPIN		Version 2.1
$$ ##JCAMPDX= 5.01
$$ ##ORIGIN= Bruker BioSpin GmbH
$$ ##OWNER= Administrator
$$ $$ E:\/data/COFFEE/nmr/AC1475_ZNESTR301_8100901_303tCqPQpd/20/pdata/1/auditp.txt
$$ ##AUDIT TRAIL=  $$ (NUMBER, WHEN, WHO, WHERE, PROCESS, VERSION, WHAT)
(   1,<2013-08-15 16:18:33.329 -0700>,<Administrator>,<X>,<go>,<TOPSPIN 2.1>,
      <created by zg
	started at 2013-08-15 16:17:26.438 -0700,
	POWCHK enabled, PULCHK disabled,
       configuration hash MD5:
       C8 4E 4E 5D D3 5C D8 9E 9F 52 82 E0 59 8A DE 15
       data hash MD5: 64K
       CC E6 43 B7 05 8F DA 48 0A 1C A2 8D F8 30 33 AC>)
(   2,<2013-08-15 16:18:36.204 -0700>,<Administrator>,<X>,<proc1d>,<TOPSPIN 2.1>,
      <Start of raw data processing
       efp LB = 0 FT_mod = 6 PKNL = 1 PHC0 = 0 PHC1 = 0 SI = 32K 
       data hash MD5: 32K
       BC F8 9F AE 52 6A FA 39 19 33 D2 18 E4 D4 9B 2D>)
(   3,<2013-08-15 16:18:36.500 -0700>,<Administrator>,<X>,<proc1d>,<TOPSPIN 2.1>,
      <pk PHC0 = 98.97583 PHC1 = 0 
       data hash MD5: 32K
       29 93 86 D0 D7 5F 59 11 39 11 B6 0F 82 97 BA EE>)
(   4,<2013-08-15 16:18:36.579 -0700>,<Administrator>,<X>,<proc1d>,<TOPSPIN 2.1>,
      <abs ABSG = 1 
       data hash MD5: 32K
       E6 6F 9B 77 C8 C4 C9 55 25 16 FD 66 18 0C CE F5>)
(   5,<2013-08-15 16:18:36.657 -0700>,<Administrator>,<X>,<proc1d>,<TOPSPIN 2.1>,
      <abs ABSG = 2 
       data hash MD5: 32K
       00 DC 96 27 BB 67 15 9D 4E EE 1A B2 34 A3 8B 95>)
(   6,<2013-08-15 16:18:36.719 -0700>,<Administrator>,<X>,<proc1d>,<TOPSPIN 2.1>,
      <abs ABSG = 3 
       data hash MD5: 32K
       8C 06 1F F4 A2 94 6F 84 3E F9 CE BD 28 35 B6 5F>)
(   7,<2013-08-15 16:18:36.766 -0700>,<Administrator>,<X>,<proc1d>,<TOPSPIN 2.1>,
      <abs ABSG = 4 
       data hash MD5: 32K
       9B 42 45 1A CA 9B 71 5C 38 4E A6 72 AA BD 4E F5>)
(   8,<2013-08-15 16:18:36.829 -0700>,<Administrator>,<X>,<proc1d>,<TOPSPIN 2.1>,
      <abs ABSG = 5 
       data hash MD5: 32K
       4F 47 60 57 1A 65 C0 53 65 B4 6A EC 39 6D 5C 2B>)
$$ ##END=
$$ 
$$ $$ hash MD5
$$ $$ 40 BE 38 EB 62 99 C5 B8 1B 88 11 D9 E9 4E DC 2E
##$RELAX= 
##$RELAX= 
##$RELAX= 
##$RELAX= 
##$RELAX= 
##$RELAX= 
##$RELAX= 
$$ Bruker specific parameters
$$ --------------------------
##$DU= <E:\>
##$EXPNO= 20
##$NAME= <AC1475_ZNESTR301_8100901_303tCqPQpd>
$$ [...]
##$TP= (0..7)
150 150 150 150 150 150 150 150
##$TP07= 0
##$TPNAME0= <>
##$TPNAME1= <>
##$TPNAME2= <>
##$TPNAME3= <>
##$TPNAME4= <>
##$TPNAME5= <>
##$TPNAME6= <>
##$TPNAME7= <>
##$TPOAL= (0..7)
0.5 0.5 0.5 0.5 0.5 0.5 0.5 0.5
##$TPOFFS= (0..7)
0 0 0 0 0 0 0 0
##$TUNHIN= 0
##$TUNHOUT= 0
##$TUNXOUT= 0
##$USERA1= <user>
##$USERA2= <user>
##$USERA3= <user>
##$USERA4= <user>
##$USERA5= <user>
##$V9= 5
##$VALIST= <valist>
##$VCLIST= <CCCCCCCCCCCCCCC>
##$VD= 0
##$VDLIST= <DDDDDDDDDDDDDDD>
##$VPLIST= <PPPPPPPPPPPPPPP>
##$VTLIST= <TTTTTTTTTTTTTTT>
##$WBST= 1024
##$WBSW= 4
##$XGAIN= (0..3)
0 0 0 0
##$XL= 0
##$YL= 0
##$YMAX_a= 660226
##$YMIN_a= -561521
##$ZGOPTNS= <>
##$ZL1= 120
##$ZL2= 120
##$ZL3= 120
##$ZL4= 120
##$ABSF1= 14.98509
##$ABSF2= -5.573092
##$ABSG= 5
##$ABSL= 3
##$ALPHA= 0
##$AQORDER= 0
##$ASSFAC= 0
##$ASSFACI= 0
##$ASSFACX= 0
##$ASSWID= 0
##$AUNMP= <proc_prof1d_extract_pilot.lims>
##$AXLEFT= 0
##$AXNAME= <>
##$AXNUC= <1H>
##$AXRIGHT= 0
##$AXTYPE= 0
##$AXUNIT= <>
##$AZFE= 0.1
##$AZFW= 0.1
##$BCFW= 0
##$BC_mod= 0
##$BYTORDP= 0
##$COROFFS= 0
##$CY= 15
##$DATMOD= 1
##$DC= 0
##$DFILT= <>
##$DTYPP= 0
##$F1P= 0
##$F2P= 0
##$FCOR= 0.5
##$FTSIZE= 32768
##$FT_mod= 6
##$GAMMA= 0
##$GB= 0
##$INTBC= 1
##$INTSCL= 1
##$ISEN= 128
##$LB= 0
##$LEV0= 0
##$LPBIN= 0
##$MAXI= 10000
##$MC2= 0
##$MEAN= 0
##$ME_mod= 0
##$MI= 0
##$NCOEF= 0
##$NC_proc= -8
##$NLEV= 6
##$NOISF1= 0
##$NOISF2= 0
##$NSP= 0
##$NTH_PI= 0
##$NZP= 0
##$OFFSET= 14.98509
##$PC= 1
##$PHC0= 98.97583
##$PHC1= 0
##$PH_mod= 1
##$PKNL= yes
##$PPARMOD= 0
##$PPDIAG= 0
##$PPIPTYP= 0
##$PPMPNUM= 2147483647
##$PPRESOL= 1
##$PSCAL= 4
##$PSIGN= 0
##$PYNMP= <proc.py>
##$REVERSE= no
##$SF= 400.02
##$SI= 32768
##$SIGF1= 0
##$SIGF2= 0
##$SINO= 400
##$SIOLD= 32768
##$SPECTYP= <>
##$SREGLST= <1H.CDCl3>
##$SSB= 0
##$STSI= 32768
##$STSR= 0
##$SW_p= 8223.68421052631
##$SYMM= 0
##$S_DEV= 0
##$TDeff= 65536
##$TDoff= 0
##$TI= <>
##$TILT= no
##$TM1= 0
##$TM2= 0
##$TOPLEV= 0
##$USERP1= <user>
##$USERP2= <user>
##$USERP3= <user>
##$USERP4= <user>
##$USERP5= <user>
##$WDW= 1
##$XDIM= 32768
##$YMAX_p= 454861695
##$YMIN_p= -823181
##$CURPLOT= <Network HP LaserJet P1505>
##$CURPRIN= <$Network HP LaserJet P1505>
##$DFORMAT= <normdp>
##$LAYOUT= <+/1D_H.xwp>
##$LFORMAT= <normlp>
##$PFORMAT= <normpl>
##$SURQMSG= 1
$$ End of Bruker specific parameters
$$ ---------------------------------
##NTUPLES= NMR SPECTRUM
##VAR_NAME=  FREQUENCY,     SPECTRUM/REAL,   SPECTRUM/IMAG
##SYMBOL=    X,             R,               I
##VAR_TYPE=  INDEPENDENT,   DEPENDENT,       DEPENDENT
##VAR_FORM=  AFFN,          ASDF,            ASDF
##VAR_DIM=   32768,         32768,           32768
##UNITS=     HZ,            ARBITRARY UNITS, ARBITRARY UNITS
##FACTOR=    0.250966925370066, 1,           1
##FIRST=     8223.43324360094, 66255,        7409
##LAST=      0,             17688,           -28824
##MIN=       0,             -823181,         0
##MAX=       8223.43324360094, 454861695,    0
$$ Real data points
##PAGE= N=1
##DATA TABLE= (X++(R..R)), XYDATA
$$ [...]
19548a18115C52782A75107i5898n3820d905q5380l10125g094j85024j85470C07343
$$ -118115 352782 175107 -95898 -149718 -4905 -90285 -400410 -7094 -192118 -377588 307343
19536i6913G2544P8051n6267a54343j80287D1229i0581q4005E8565o667b28667
$$ -96913 72544 150595 94328 -154343 -334630 41229 -90581 -174586 58565 51898 -228667
19524C844g2448B1385b50048a18867j48306n2683D955a09284L1330B46483g204
$$ 3844 -72448 21385 -250048 -118867 -267173 -319856 4955 -109284 -77954 246483 -7204
19512a97529c7496L880a428o8621m1824I9527c36887J48699O4243b3805B5896
$$ -197529 -37496 -33616 -1428 -70049 -111873 99527 -336887 -188188 -123945 -23805 25896
19500b43091A73157J10727j03471A5424b99973H9944e0227R357B00713a80433
$$ -243091 173157 283884 180413 15424 -299973 89944 -50227 -40870 200713 -180433
19489a31512C7938c23411g8619n4845C2667J2644r423b9219B589c76647C1490
$$ -131512 37938 -323411 -78619 -133464 32667 45311 35888 -29219 2589 -376647 31490
19477e0008j08549A09307b58804B2488q625b87060A06279K18840B589L7743R6071
$$ -50008 -158557 109307 -258804 22488 13863 -287060 106279 325119 2589 40332 136403
19466A36403C5379c32880i6851p2470B42066e6120A03998D6544a43287c9838k96528
$$ 136403 35379 -332880 -96851 -169321 242066 -56120 103998 46544 -143287 -39838 -336366
19455c36366b1926l51392g5562r934b9771j86729A90677i4074j8175j29971a12732
$$ -336366 -21926 -373318 -75562 -85496 -29771 -216500 190677 -94074 -112249 -242220 -112732
19443B51231c707l87012n123a23155j01716Q0301N7831b8921j90338b397k9079
$$ 251231 -3707 -390719 -395842 -123155 -224871 -144570 -86739 -28921 -219259 -2397 -31476
19432c1476A73541c1188E5599c47178R8249h0237C0107L0906h1248n4056B14268
$$ -31476 173541 -31188 55599 -347178 -248929 -80237 30107 61013 -81248 -135304 214268
19420A1968a06042B144b52720J11630j61485J39040A30822B2518b68324F76L9077
$$ 11968 -106042 2144 -252720 -141090 -302575 -163535 130822 22518 -268324 676 39753
19409C9753K55451F9245d5401j59880A18572J88420E974e7833H5873a7818j00281
$$ 39753 295204 69245 -45401 -205281 118572 306992 5974 -57833 85873 -17818 -118099
19398a18099A11929b34347E3032b46212L0072A54159b46154j90029a71548A91707
$$ -118099 111929 -234347 53032 -246212 -216140 154159 -246154 -436183 -171548 191707
19387H0708g691m36038C23007f8553A11620A999K18402G4810b29764h1494k61125
$$ 80708 -7691 -443729 323007 -68553 111620 1999 220401 74810 -229764 -81494 -342619
19376c42619g2187p7637d7113A04553c89342a41737J4688N9261d89B16573a56826
$$ -342619 -72187 -149824 -47113 104553 -389342 -141737 -127049 -67788 -489 216573 -156826
19364e425n6055r5077P6996E7240a66962O8923j6067B21879q6920a22178B02693
$$ -5425 -61480 -156557 -79561 57240 -166962 -98039 -114106 221879 134959 -122178 202693
19352a23325A24659m6364d66585b07432a997j04833o815A8111c37590a64091A59046
$$ -123325 124659 78295 -466585 -207432 -1997 -106830 -113645 18111 -337590 -164091 159046
19340b11620j04477a13861n18M6366A21390J24568j06992b30018O8485B7319a69729
$$ -211620 -316097 -113861 -114379 -68013 121390 245958 138966 -230018 -161533 27319 -169729
19328A19118e542j29389f4213A41203a07406A17717a38570N774C1605b56695i4177
$$ 119118 -5542 -134931 -64213 141203 -107406 117717 -138570 -132796 31605 -256695 -94177
19316b8048B77419e7206j838b2923j34296B37887B1079a16573A06090a99393j57499
$$ -28048 277419 -57206 -59044 -22923 -157219 237887 21079 -116573 106090 -199393 -356892
19305c56892J44750A48097B2537L14955a19461j15526C9609c32A46762b84319
$$ -356892 -212142 148097 22537 337492 -119461 -234987 39609 -332 146762 -284319
19294a32831I1705a24018r3067C1561b66685A17846h4291m02307K33296A2476
$$ -132831 91705 -124018 -217085 31561 -266685 117846 -84291 -486598 -253302 12476
19283a45948F214b14802l896B6415a20202b0024j61766E3307C130K73720b44682
$$ -145948 6214 -214802 -218698 26415 -120202 -20024 -181790 53307 3130 276850 -244682
19271e8160l1021A38878a46518m6105d0766D1067b53939K121A53912g5956C1813
$$ -58160 -89181 138878 -146518 -192623 -40766 41067 -253939 -251818 153912 -75956 31813
19259g0654j9647j90696d1757j79398N3079O5036j96535J14209j941A2421K3919
$$ -70654 -90301 -280997 -41757 -221155 -168076 -103040 -299575 -185366 -187307 12421 36340
19248C6340J32131a49930m0033q0992B01899c5186j32387f1964n9351A18574h7315
$$ 36340 168471 -149930 -189963 -270955 201899 -35186 -167573 -61964 -121315 118574 -87315
19236b26416a10313J9453K6176k70591J43665B65747a29992m1130L6336B31671
$$ -226416 -110313 -90860 -64684 -335275 -191610 265747 -129992 -171122 -134786 231671
19225C3345J47083a08411b2466k27694g8780C6416B326K4417a31812m853f1576
$$ 33345 180428 -108411 -22466 -250160 -78780 36416 2326 26743 -131812 -136665 -61576
19213b24889J0992F8093k3806a35176a2114m3676B18563c91945A38799n6618K198
$$ -224889 -213897 68093 44287 -135176 -12114 -55790 218563 -391945 138799 82181 84379
19202H4379c20263A72359c69321D6846A8321R9211g2801I918d68984a12839c9554
$$ 84379 -320263 172359 -369321 46846 18321 117532 -72801 9918 -468984 -112839 -39554
19190d19888a28480E1823b1037l65411a44175O885B1388f0049b9758H0538b72064
$$ -419888 -128480 51823 -21037 -386448 -144175 -137290 21388 -60049 -29758 80538 -272064
19178a26922n940k00843P9485J02311p7768q4329H7901b40019A2257j202b18964
$$ -126922 -132862 -333705 -254220 -151909 -229677 -314006 87901 -240019 12257 11055 -218964
19166a0537l3838B96048I8617e19618A25025M6756c83675g6053R748q1604e5326
$$ -10537 -44375 296048 98617 -519618 125025 171781 -383675 -76053 -66305 -147909 -55326
19154H1048J79586G9828a34703j38196a14483R974A4900a0259B4483b41921A10790
$$ 81048 260634 79828 -134703 -272899 -114483 -104509 14900 -10259 24483 -241921 110790
19142A67239F2174c87612d2682A3974a1361A73883g5347B70073A25819N5663E1354
$$ 167239 62174 -387612 -42682 13974 -11361 173883 -75347 270073 125819 181482 51354
19130A09868c2525k56560j27671h2547A88882F2062h7670l50001J11932B11934
$$ 109868 -32525 -289085 -416756 -82547 188882 62062 -87670 -437671 -325739 211934
19119c61437B9347a61084D4957A111f4295b174B8634J66215B1526J37660b1404
$$ -361437 29347 -161084 44957 1111 -64295 -2174 28634 194849 21526 159186 -21404
19107a17490C27520a24158j97550b0454Q988M719l81112a03348A832N1926K09641
$$ -117490 327520 -124158 -321708 -20454 -11466 -6747 -387859 -103348 1832 53758 263399
19096B63399c17583j56752a79402K1977j8562o4875a9838l57065a69861O7663
$$ 263399 -317583 -474335 -179402 -157425 -175987 -240862 -19838 -376903 -169861 -102198
19086a02198B30839a13506E0472c32475A26601d42691b3162j89695A96530d8026
$$ -102198 230839 -113506 50472 -332475 126601 -442691 -23162 -212857 196530 -48026
19075e3548C745d52408A44574b35799q305A2331N9940b70229j7549b6691b230
$$ -53548 3745 -452408 144574 -235799 -244104 12331 72271 -270229 -287778 -26691 -2230
19063b63549A56941H634e2113j06728A76530o6726d2912A37576a79442F533c08349
$$ -263549 156941 8634 -52113 -158841 176530 109804 -42912 137576 -179442 6533 -308349
19051b61334O9126b602A17951a91557a2515I7469c2183b517k431C29345c44707
$$ -261334 -192208 -2602 117951 -191557 -12515 97469 -32183 -2517 -4948 329345 -344707
19039A25626E353a03354j70905J18365C14882j32936c19919A15128A2004N1880
$$ 125626 5353 -103354 -274259 -155894 314882 181946 -319919 115128 12004 63884
19029F3884O5264K0371c01351A38311c78790F278J07729c08593f138o6072m1270
$$ 63884 129148 149519 -301351 138311 -378790 6278 114007 -308593 -6138 -72210 -113480
19018a13480c5600i020k35427A95713K8365D2323b12079B69047A07903a25847
$$ -113480 -35600 -9020 -244447 195713 224078 42323 -212079 269047 107903 -125847
19007e6159A21809b05707f0288j80235H1923d91389B65152j8640d02050i7028
$$ -56159 121809 -205707 -60288 -240523 81923 -491389 265152 246512 -402050 -97028
18996d41512a46823M9801j70988D6380a16271E1423d7375k1702i455o8663H67
$$ -441512 -146823 -97022 -268010 46380 -116271 51423 -47375 -69077 -9455 -78118 867
18984e7647A36373f297B42255m7414b1773k6463k87973a12108j76137g4448F7969
$$ -57647 136373 -6297 242255 194841 -21773 -48236 -336209 -112108 -288245 -74448 67969
18972b06959e2837A1694f659B17868J00056F8061B1927a68505N7073b7954k35858
$$ -206959 -52837 11694 -6659 217868 317924 68061 21927 -168505 -111432 -27954 -263812
18961b63812A13514n2570c16491B05045c13723a7820n1250C5072a00157E3915
$$ -263812 113514 60944 -316491 205045 -313723 -17820 -69070 35072 -100157 53915
18950b58195l8021I4954m2726Q9524o3795h4598j11427N1469A9740d5929A13405
$$ -258195 -296216 94954 52228 141752 77957 -84598 -196025 -144556 19740 -45929 113405
18938a40945M5106M0253j76580B71799d8958i376j65904B1798c53060g6745k96213
$$ -140945 -95839 -55586 -232166 271799 -48958 -9376 -175280 21798 -353060 -76745 -372958
18927c72958B1166Q160I041Q1785K9337D7316J49982L7997a49820I68a45487f3554
$$ -372958 21166 29326 9041 90826 120163 47316 197298 235295 -149820 968 -145487 -63554
18914E3126a11798c6546j49621D6048J82732e5760m312I5826a18768K2391j052
$$ 53126 -111798 -36546 -186167 46048 228780 -55760 -60072 95826 -118768 -96377 -97429
18903i7429A4490J25096J78221a37854e3546A73263P7112I823b37040j18363a8098
$$ -97429 14490 139586 317807 -137854 -53546 173263 250375 9823 -237040 -355403 -18098
18891B00534a53399f2693d092E4514a4750k1325A0705e7389E0137c21068g4490
$$ 200534 -153399 -62693 -4092 54514 -14750 -36075 10705 -57389 50137 -321068 -74490
18879b14095Q0818l3385P794K4541r5427N8778A39829a85601a2210k00229J03560
$$ -214095 -133277 -166662 -158868 -134327 -229754 -170976 139829 -185601 -12210 -212439 -108879
18868a08879j77833B40929a86285L1436F1954b48187L3832A12883J70262r9151
$$ -108879 -286712 240929 -186285 -154849 61954 -248187 -214355 112883 283145 183994
18858A83994A135R8510c38937c6759B70689g5513C69910j15107a58331F6207g3708
$$ 183994 1135 99645 -338937 -36759 270689 -75513 369910 254803 -158331 66207 -73708
18846B469O4038B5586J1890b63065l90P263J12771a0725E6884b57879a28567f3919
$$ 2469 66507 25586 37476 -263065 -263455 -256192 -143421 -10725 56884 -257879 -128567 -63919
18833A0308e2216E6804f2458l2546j1422n5825N9914J9774k0877B2004L12349
$$ 10308 -52216 56804 -62458 -95004 -106426 -162251 -102337 -82563 -103440 22004 334353
18822C34353C0834h7097o584j71651A2839n876a1273m3839j44515N2747K1482
$$ 334353 30834 -87097 -93681 -265332 12839 6963 -11273 -55112 -199627 -146880 -125398
18811a25398G7795i998E08781j92310j29536L23218a15231A6881R8973B2689a73040
$$ -125398 77795 -9998 508781 316471 186935 510153 -115231 16881 115854 22689 -173040
18799g3560k2567j8343G8465J7990B3233a0813j38878B33796e3588j73207o79
$$ -73560 -96127 -114470 78465 96455 23233 -10813 -149691 233796 -53588 -226795 -227474
18788b27474K2363B14408g383j81204O7933A02178a98883k24943J73311D2104
$$ -227474 -205111 214408 -7383 -188587 -120654 102178 -198883 -423826 -250515 42104
18777a37625j63029c0734q6334M5601A95833c07859A52593i5228D47047h5793
$$ -137625 -300654 -30734 -117068 -71467 195833 -307859 152593 -95228 447047 -85793
18766b61016j87667j33998F8281a4249j74506N5813j16414P5943B17885a23956
$$ -261016 -448683 -582681 68281 -14249 -188755 -132942 -249356 -173413 217885 -123956
18755b87601a20854c4176r0362C87515a37564D4408l340J26705D1715c0993j00090
$$ -287601 -120854 -34176 -124538 387515 -137564 44408 41068 167773 41715 -30993 -131083
18744a31083j03106i9436j8703B41015a22588a4266r0659B8467d3756D3420a56496
$$ -131083 -234189 -99436 -118139 241015 -122588 -14266 -104925 28467 -43756 43420 -156496
18732B12031j05600k0549g5646l6117a0046A20416h4234L0974k2321B70022c91176
$$ 212031 106431 85882 -75646 -111763 -10046 120416 -84234 -53260 -75581 270022 -391176
18720a90655A08068b19639d4434I5796b66354N0797A48614D0820c33572g2436
$$ -190655 108068 -219639 -44434 95796 -266354 -215557 148614 40820 -333572 -72436
18709b06362K3302A06058a12911e2816J6644J0837m95574E1265M6550a83590K1596
$$ -206362 -183060 106058 -112911 -52816 -36172 -25335 -520909 51265 97815 -183590 -161994
18698a61994f7054j69690B7321b11884e2345A1509L61642H9082b89764B33690
$$ -161994 -67054 -236744 27321 -211884 -52345 11509 373151 89082 -289764 233690
18687E0581O3653l6021f0114F9087a66892O0238D9911e026a096A80717E0276a91277
$$ 50581 114234 78213 -60114 69087 -166892 -106654 49911 -5026 -1096 180717 50276 -191277
18674b31045l90554D7116b02712J00117A7407c2641q0133j64513A11915b6784
$$ -231045 -621599 47116 -202712 -102595 17407 -32641 -112774 -277287 111915 -26784
18663a74321B41564b40523e6421k14632G8288b08736I0017b61361e7099F628J3921
$$ -174321 241564 -240523 -56421 -271053 78288 -208736 90017 -261361 -57099 6628 20549
18652B0549b27737G381a07816A00167a10357K8086l80A35912e32581b09273L5421
$$ 20549 -227737 7381 -107816 100167 -110357 -82271 -82651 135912 -532581 -209273 -173852
18641a73852B97397a07256F3431J31750J81515a77777L8765j33045h9280b0765
$$ -173852 297397 -107256 63431 195181 376696 -177777 -139012 -272057 -89280 -20765
18630c41401B0025a49249A50862g1414m1620a8802r0213J0820c1772p1367j4344
$$ -341401 20025 -149249 150862 -71414 -113034 -18802 -109015 -98195 -31772 -103139 -117483
18619a17483d9823l61712F610c12508o764f7462k76278l436A36943h4633k67771
$$ -117483 -49823 -411535 6610 -312508 -319272 -67462 -343740 -347176 136943 -84633 -352404
18608c52404e6824B26532b69109A77768b7750j50895h4818l00308J09228D2886
$$ -352404 -56824 226532 -269109 177768 -27750 -178645 -84818 -385126 -275898 42886
18597F3080L13786A36036h2461m90C64204F1509a37866d089n94915h7923o5790
$$ 63080 376866 136036 -82461 -82951 364204 61509 -137866 -4089 -599004 -87923 -153713
18586a53713O4465G4318a78446B08371e1413j12144B20490a22666B74872a27235
$$ -153713 -89248 74318 -178446 208371 -51413 -163557 220490 -122666 274872 -127235
18575A694b34039A13618a67269j2514D65119A87906N8947d6087j43695A8182a61027
$$ 1694 -234039 113618 -167269 -179783 465119 187906 246853 -46087 -189782 18182 -161027
18563h148o1743k77248A39808D3730a92752P6845B01132k6577a29458A16825J22323
$$ -8148 -69891 -347139 139808 43730 -192752 -115907 201132 174555 -129458 116825 239148
18552B39148a42216p3774K6964k5410F1409k74H740R6114a28437I8456a27111
$$ 239148 -142216 -215990 -189026 -214436 61409 61135 8740 104854 -128437 98456 -127111
18540h9212B7373R8351i7472B85902c64B55604c47700J39767N2776j19436B22483
$$ -89212 27373 125724 -97472 285902 -364 255604 -347700 -207933 -155157 -274593 222483
18528A72554f0064B46508h3531j83446A91949c70013A09486D9905Q4037j685O5692
$$ 172554 -60064 246508 -83531 -266977 191949 -370013 109486 49905 133942 132257 197949
18517A97949a48472j12577P8326n3849C77042b51610c3619j12055e7530D6392
$$ 197949 -148472 -261049 -182723 -236572 377042 -251610 -33619 -145674 -57530 46392
18506d6141A83346E2310b66045f3506F7895c6440m601j43101j04525d4655p9900
$$ -46141 183346 52310 -266045 -63506 67895 -36440 -41041 -184142 -288667 -44655 -124555
18495a24555c8849D2403a32612G2287a57140k7521A64596J04254C2489b5562B27735
$$ -124555 -38849 42403 -132612 72287 -157140 -184661 164596 268850 32489 -25562 227735
18483B20962h1216N00K4225a6868A54290g3598p1292c915l61153O5238R5094j96653
$$ 220962 -81216 -80716 -56491 -16868 154290 -73598 -144890 -3915 -365068 -299830 -204736 -401389
18471d01389a27046D0725J02738d3393j95422P1654A95364e1245k37850p0258
$$ -401389 -127046 40725 143463 -43393 -238815 -167161 195364 -51245 -289095 -359353
18461c59353E8074c55652j4436h3767k74685J58723D0889a92052O7844a8212k31043
$$ -359353 58074 -355652 -370088 -83767 -358452 -199729 40889 -192052 -124208 -18212 -249255
18450b49255D228b12955J00534N2267A3641a39254D3362d9916I1720c36581B1965
$$ -249255 4228 -212955 -112421 -60154 13641 -139254 43362 -49916 91720 -336581 21965
18438f0235A71096a89705e2024I4001c77l20546G4516P0674C90c04281i541m55370
$$ -60235 171096 -189705 -52024 94001 -377 -320923 74516 145190 390 -304281 -9541 -464911
18426d64911g8619n2616E1197b44313J05343j28289A8363J12553a15192C37788
$$ -464911 -78619 -131235 51197 -244313 -138970 -267259 18363 130916 -115192 337788
18415a36377k1472j7862A04958P2859a84266B499a0105B06420b29172A25504D914
$$ -136377 -157849 -175711 104958 177817 -184266 2499 -10105 206420 -229172 125504 4914
18403A24319M0955a32966B82424d650j29604k38532a75512P5836B83016B9477
$$ 124319 165274 -132966 282424 -4650 -134254 -372786 -175512 -99676 283016 29477
18392a51169A14885a8183k24548A43391a50122k86491g8361B61331p4402a35329
$$ -151169 114885 -18183 -242731 143391 -150122 -436613 -78361 261331 186929 -135329
18381A96747C1697g0765l55867e8391m7154b879A72739a44820k0564D5422P3397
$$ 196747 31697 -70765 -426632 -58391 -105545 -2879 172739 -144820 -165384 45422 118819
18370A18819a29468M3555c6350C10908b55976C34069e9480A16168l3289B8442
$$ 118819 -129468 -85913 -36350 310908 -255976 334069 -59480 116168 82879 28442
18359A4348d1177B36877a27933I473i0689C4237a05805l15412J37302I0879K798
$$ 14348 -41177 236877 -127933 9473 -90689 34237 -105805 -421217 -283915 90879 93677
18348I3677b26508K7483q660J5648o7396O9967A12585c1090H0775b94340a06805
$$ 93677 -226508 -199025 -207685 -192037 -259433 -189466 112585 -31090 80775 -294340 -106805
18336c2797A14082a01187H4900b02567j8722h0344A85959b12602H2010N4494a03613
$$ -32797 114082 -101187 84900 -202567 -221289 -80344 185959 -212602 82010 136504 -103613
18324b03145A24463m1577b60099b6560j28534B49358a8138j74024d1831j78820
$$ -203145 124463 82886 -260099 -26560 -155094 249358 -18138 -192162 -41831 -220651
18314b20651A32996P6374a88687A803a48589G4369M6202C7176c11842a05558A14692
$$ -220651 132996 209370 -188687 1803 -148589 74369 120571 37176 -311842 -105558 114692
18302b24281C75525j48454a50539C02162H3512a15693K4426F5269d15701A95692
$$ -224281 375525 227071 -150539 302162 83512 -115693 -91267 65269 -415701 195692
18291B18162a67282G8989a68184A83458h2569A1679P0223b73777a21913I041K8471
$$ 218162 -167282 78989 -168184 183458 -82569 11679 81902 -273777 -121913 9041 37512
18280C7512a11503A47697h8028n0483c4968F8589K85591a53496P3216p7531M2079
$$ 37512 -111503 147697 -88028 -138511 -34968 68589 354180 -153496 -80280 -157811 -115732
18269a15732A19043C9980J98d6315j18282C8974J2099b14978r996J04076A88313
$$ -115732 119043 39980 40178 -46315 -164597 38974 51073 -214978 -224974 -120898 188313
18257D8381a58845A3937g0242q2462C6644K4341H528P9020L1882c13557n4711
$$ 48381 -158845 13937 -70242 -152704 36644 60985 8528 87548 119430 -313557 -368268
18246c68268c5982B741a82179A6691g2407j60879K2970D78971c7302j18648e9646
$$ -368268 -35982 2741 -182179 16691 -72407 -233286 -210316 478971 -37302 -155950 -59646
18234a28361j33235j8523i7726H3315K10967a97616i1842j3957G1144a81008Q3594
$$ -128361 -261596 -280119 -97726 83315 294282 -197616 -91842 -105799 71144 -181008 -97414
18223i7414p3296A21037J8952b36297D7873f06560B90123d1543k2608n9834J5527
$$ -97414 -170710 121037 139989 -236297 47873 -606560 290123 -41543 -64151 -123985 -108458
18212a08458l05005B7096c09723j7638A00849b12102B00195m5089a36662D21082
$$ -108458 -413463 27096 -309723 -327361 100849 -212102 200195 155106 -136662 421082
18201c09449B4974a50934A63014i0469H2786a22854N7816n8269j51513k5271a47734
$$ -309449 24974 -150934 163014 -90469 82786 -122854 -65038 -123307 -274820 -300091 -147734
18189h0574j38464q6871h8431C5223J92602j03084a86747e074j43482M5097q7445
$$ -80574 -219038 -305909 -88431 35223 227825 124741 -186747 -5074 -148556 -103459 -190904
18178a90904H917h781B36362a81911L2583N3200B39457E736b54462B34868B2027
$$ -190904 8917 -8781 236362 -181911 -149328 -96128 239457 5736 -254462 234868 22027
18166b17941D3922d6326E6799c4230n7434j11600k0447A76343o7853b23266B67777
$$ -217941 43922 -46326 56799 -34230 -91664 -203264 -223711 176343 108490 -223266 267777
18154g6458C83312a33746o8174a9055D4088N5198h224l85024A19332R131f1754
$$ -76458 383312 -133746 -201920 -19055 44088 99286 -8224 -393248 119332 128463 -61754
18142b26612N8112C6484d0989A62951A8439J6911a61925l7782e0014j5941p1128
$$ -226612 -168500 36484 -40989 162951 18439 35350 -161925 -199707 -50014 -65955 -137083
18131a37083D2108M1733A7389L01324b62006J01307h718l22307L5875J01550K6372
$$ -137083 42108 83841 17389 318713 -262006 -160699 -8718 -331025 -295150 -193600 -167228
18120a67228L7247k55605B29270n9478a05602G0347a33035D68627b46114n914
$$ -167228 -129981 -385586 229270 169792 -105602 70347 -133035 468627 -246114 -252028
18110b52028f3926j04318A04410Q7224C0945a58817H1664a52013j84736A4083
$$ -252028 -63926 -168244 104410 191634 30945 -158817 81664 -152013 -336749 14083
18099g4091A68867i7898M4571C0572K8493d4865a9635D3884a6874k75880c5736
$$ -74091 168867 -97898 -53327 30572 59065 -44865 -19635 43884 -16874 -292754 -35736
18087A44894m8215b79618D1931Q6530h9618o875q2450A39732J5279A6355a82254
$$ 144894 96679 -279618 41931 128461 -89618 -96493 -178943 139732 155011 16355 -182254
18075a83577Q5929A65091E2438f0777G8003b5157B86292i2370F6270L9005e4152
$$ -183577 -97648 165091 52438 -60777 78003 -25157 286292 -92370 66270 105275 -54152
18063d37240B7154O0696l9956J13655O02g2967j23219N2799j05403M4425E3878
$$ -437240 27154 87850 47894 161549 162151 -72967 -196186 -143387 -248790 -204365 53878
18051g781B93185j40938E9806l754b78369K3701d3793A41232b96572A46523i9986
$$ -7781 293185 152247 59806 56052 -278369 -254668 -43793 141232 -296572 146523 -99986
18039a88711A00163c80373g5353j04120A24417N8337p4867E3410a09073k85107
$$ -188711 100163 -380373 -75353 -179473 124417 182754 107887 53410 -109073 -394180
18029c94180a18259K8493j40434m3431A06130K45769b84774b553j69747O0310
$$ -394180 -118259 -89766 -230200 -273631 106130 351899 -284774 -2553 -172300 -111990
18019a11990B0591N6006a86834H255K57077a52266c5083l832J4052j24376k28655
$$ -111990 20591 76597 -186834 8255 265332 -152266 -35083 -38915 -24863 -149239 -377894
18008c77894g0464I1999M7234K35106a72192R357J3242a7838B8905a87897P6806
$$ -377894 -70464 91999 139233 374339 -172192 -162835 -149593 -17838 28905 -187897 -111091
17997a11091j53464n3497G3605b13407A09538b32016B90113q6679j0665N0136
$$ -111091 -264555 -318052 73605 -213407 109538 -232016 290113 203434 192769 242905
17987B42905O0887I4812c21459B129e5889B16346E4505i4298b9182j56810k04809
$$ 242905 303792 94812 -321459 2129 -55889 216346 54505 -94298 -29182 -185992 -390801
17976c90801B54596c12838B7814g8206A30717m491b40869F76d9299A70616E5328
$$ -390801 254596 -312838 27814 -78206 130717 126226 -240869 676 -49299 170616 55328
17964i0833D747i039F7651a70390B17194a26680e3723I2352J37723i8756a3909
$$ -90833 4747 -9039 67651 -170390 217194 -126680 -53723 92352 230075 -98756 -13909
17952a50032B60585a57950g6927j13374A0639L1160N1464a50239p7887a02207
$$ -150032 260585 -157950 -76927 -190301 10639 41799 93263 -150239 -228126 -102207
17941A32102A4060a5682k58165P3168C87308c18366d8340k63835P4645j5952l7574
$$ 132102 14060 -15682 -273847 -200679 387308 -318366 -48340 -312175 -237530 -253482 -291056
17930b91056f3722A39643a86019N1501j7613H8819d1374F9695b10534g3644B46377
$$ -291056 -63722 139643 -186019 -134518 -152131 88819 -41374 69695 -210534 -73644 246377
17918D3247a05201A54685e0247j40032B603a80062j18629A385J65104q563a66691
$$ 43247 -105201 154685 -50247 -190279 2603 -180062 -298691 1385 166489 157926 -166691
17906H3953a04817A1865i4868k33076a06829N2856F0839b80133A41425D3847e9025
$$ 83953 -104817 11865 -94868 -327944 -106829 -53973 60839 -280133 141425 43847 -59025
17894c10266C898P4482a41682B14012a55026e3011D2483j6673b30274H1583C1812
$$ -310266 3898 78380 -141682 214012 -155026 -53011 42483 25810 -230274 81583 31812
17882E3128b94010a07868a2353A14865e1049B26204c30050b114j4137C09922A07623
$$ 53128 -294010 -107868 -12353 114865 -51049 226204 -330050 -2114 -16251 309922 107623
17870a67317A25941R7645c1773p1733A78274C6364g1220G8259a28754j22747A2472
$$ -167317 125941 223586 -31773 -103506 178274 36364 -71220 78259 -128754 -251501 12472
17858a7714n3014H9306J39298a59320A1776J94746G0523J07071q0998R7159H5763
$$ -17714 -70728 89306 228604 -159320 11776 206522 70523 177594 96596 193755 85763
17846d6250I8954b40097K532b7248A27068a70926A4777N853d4848B7093g9391
$$ -46250 98954 -240097 -237565 -27248 127068 -170926 14777 20630 -44848 27093 -79391
17834A73949M0339c84065a29527B6792j1464b9923o5118B61523d9492a1085B3996
$$ 173949 214288 -384065 -129527 26792 15328 -29923 -95041 261523 -49492 -11085 23996
17822C26182a71597A2238K94350C8854K33072G1575a99573F0192b32262C4363
$$ 326182 -171597 12238 306588 38854 271926 71575 -199573 60192 -232262 34363
17811A89629B2760J50413F7661b4840l4642n6168m5689N4852C69116b79589d4023
$$ 189629 22760 173173 67661 -24840 -59482 -115650 -161339 -106487 369116 -279589 -44023
17799b3798m6310i873B8048a57534d1536p785j87930c3718p0269C73696h1590
$$ -23798 -70108 -9873 28048 -157534 -41536 -49321 -237251 -33718 -103987 373696 -81590
17787F8468a21517e7618A31117D0273O0448b8703j44496a1061j26567p3452A25024
$$ 68468 -121517 -57618 131117 40273 100721 -28703 -173199 -11061 -137628 -211080 125024
17775a99203G15K02378a29996I5163a95915C1347O0030Q1854a85339A73635A9265
$$ -199203 715 203093 -129996 95163 -195915 31347 91377 173231 -185339 173635 19265
17763d2678j41676A69323D5705N3613m1011c7516q579B58680b247j4838r9688
$$ -42678 -184354 169323 45705 99318 58307 -37516 -46095 258680 -2247 -17085 -116773
17752a16773M6594B67325A18621b93049B7399J87492b13198a2839A09414c3616
$$ -116773 -70179 267325 118621 -293049 27399 214891 -213198 -12839 109414 -33616
17741D6337a42543D19119c19417C2474i3966C39544b14959L4859B0026c2303k3037
$$ 46337 -142543 419119 -319417 32474 -93966 339544 -214959 -180100 20026 -32303 -55340
17730e5340j03854A77288J12959j34766p2600J80222D1957P468a77912g0111n8951
$$ -55340 -159194 177288 290247 155481 82881 263103 41957 49425 -177912 -70111 -129062
17719a29062E3739J4381J49131c32677J55363I0692i2322A41032C687R6305a56056
$$ -129062 53739 68120 217251 -332677 -177314 90692 -92322 141032 3687 99992 -156056
17707D1135b25688B9251a97719c1056k0696l52131a56176A3542J88959e8671p2133
$$ 41135 -225688 29251 -197719 -31056 -51752 -403883 -156176 13542 202501 -58671 -130804
17696a30804G6274K56003r0415b07922B0743J97815G2181a11449C43382A37292
$$ -130804 76274 332277 241862 -207922 20743 218558 72181 -111449 343382 137292
17685C31241a15175A77888a93843j19510a02553B3747K0658a8875I0903c2445
$$ 331241 -115175 177888 -193843 -313353 -102553 23747 44405 -18875 90903 -32445
17674b05043B56916a98464E0498O4175M9758l2125b417I4835c4771I479M03472
$$ -205043 256916 -198464 50498 114673 164431 132306 -2417 94835 -34771 9479 412951
17663D12951j38249E2684b04640r8806H3381b8038p0721j02958B57686m7980a73368
$$ 412951 274702 52684 -204640 -303446 83381 -28038 -98759 -201717 257686 209706 -173368
17651C32912a49047B72371E1017M3341a62687Q0885c4707l2122r375K9655A50606
$$ 332912 -149047 272371 51017 94358 -162687 -81802 -34707 -66829 -76204 -46549 150606
17639b00521Q7642o4986A10683J20134b06284f724k28778h4691j1680I6290K66180
$$ -200521 -112879 -177865 110683 230817 -206284 -6724 -235502 -84691 -96371 96290 362470
17628C62470j64581L6117g7126A25833a26206A3016K00218h2044H7527b14357
$$ 362470 197889 234006 -77126 125833 -126206 13016 213234 -82044 87527 -214357
17617b16904A25729J1222e9690A72314p1905a30382H3874b9297k12547b1052A44364
$$ -216904 125729 136951 -59690 172314 100409 -130382 83874 -29297 -241844 -21052 144364
17605a68288A47646g4621j79117E1056c43620b460B57382b6675B01573b26393
$$ -168288 147646 -74621 -253738 51056 -343620 -2460 257382 -26675 201573 -226393
17594a08893D7618K32199K5822a61418d9812a5488J205A78728A9855J57330a65983
$$ -108893 47618 279817 305639 -161418 -49812 -15488 -14283 178728 19855 177185 -165983
17582A49428g3540L2930j33463C07516A7293N1539A6225K70066f3427D7722c6730
$$ 149428 -73540 -40610 -174073 307516 17293 68832 16225 286291 -63427 47722 -36730
17570f1683H6327A8043J58139a73480c4961A14605n75n761h5770B03842K23926
$$ -61683 86327 18043 176182 -173480 -34961 114605 114030 108269 -85770 203842 427768
17559D27768C8025K80649b43331i9196C55089d1245o396l913j98702B97693D8637
$$ 427768 38025 318674 -243331 -99196 355089 -41245 -47641 -51554 -250256 297693 48637
17547B51865a75629Q5581A22242J1149a98238A11853J40800D0470L9421K0149
$$ 251865 -175629 -90048 122242 133391 -198238 111853 252653 40470 79891 100040
17537A00040e8738G1047J62839c6806j36679F9089a27459D11522A31732e3316
$$ 100040 -58738 71047 233886 -36806 -173485 69089 -127459 411522 131732 -53316
17526i9353r420g430A24500J78732q4350J97231j72768d7305A21116b20805g654
$$ -99353 -108773 -7430 124500 303232 218882 416113 243345 -47305 121116 -220805 -7654
17514h9187B83616j39170b22075A95525a58211A68184i2137A84467a12460J2867
$$ -89187 283616 144446 -222075 195525 -158211 168184 -92137 184467 -112460 -99593
17504i9593k5738J3493G9156d4983A84771q4325J62282K05730B28629R6897j3457
$$ -99593 -125331 -111838 79156 -44983 184771 100446 262728 468458 228629 325526 312069
17493C12069K5351b0868G8911a72783A45434E3687b8506C85568j18253D0740b33816
$$ 312069 337420 -20868 78911 -172783 145434 53687 -28506 385568 267315 40740 -233816
17481F2212a37907p2023H5068a19824B47306J22838A42711a04320a4883L412H9691
$$ 62212 -137907 -209930 85068 -119824 247306 370144 142711 -104320 -14883 -11471 89691
17469b30427G0780J1506C49b6641H1046b376j26607E4444j7597R3389b43987f254
$$ -230427 70780 82286 349 -26641 81046 -2376 -128983 54444 36847 130236 -243987 -6254
17456G0396J50764b20941A93646j1235J31932j17213K75264k18109n5376b1286
$$ 70396 221160 -220941 193646 182411 314343 197130 472394 254285 198909 -21286
17445C35312p3600J92033A21367J42460O5603j10808l6636J97598J07523j26530
$$ 335312 261712 453745 121367 263827 329430 218622 181986 379584 487107 360577
17435C60577g4009A55013n5831O1036P7674c153F8040A581J46178K19603r0520
$$ 360577 -74009 155013 99182 160218 237892 -3153 68040 1581 147759 367362 276842
17424B76842n6882L27103h568C22845j01866R0998p4534b6254C34006K2563I6365
$$ 276842 219960 547063 -8568 322845 220979 311977 237443 -26254 334006 356569 96365
17412b05806A54569J89529b9866C83350j73802J7203R6373r8661i6380j63344
$$ -205806 154569 344098 -29866 383350 209548 226751 323124 224463 -96380 -259724
17402b59724I8850c1989A36354j2075L9781A7329N56000D8568j7704M26868D8187
$$ -259724 98850 -31989 136354 124279 164060 17329 573329 48568 30864 457732 48187
17390B78851i3273G78694B61723i690E32956A53538L2965J48822j52260K43304
$$ 278851 -93273 778694 261723 -9690 532956 153538 186503 335325 183065 426369
17380D26369F7340j1181d5708E72922a21273A03185J66616A27004g2015F4372
$$ 426369 67340 56159 -45708 572922 -121273 103185 269801 127004 -72015 64372
17369g5250A47377i4150C34171i541j11105G9279l8187J85979e5773k00549D0169
$$ -75250 147377 -94150 334171 -9541 -120646 79279 41092 227071 -55773 -256322 40169
17357A99931b70167P1537H4083j337K6857b56484E8218b6754B53752O3949b59640
$$ 199931 -270167 -198630 84083 82746 109603 -256484 58218 -26754 253752 317701 -259640
17345C23241J7005A61899J02179P5064o3441M4118h8762C67041c0252C35139G1247
$$ 323241 340246 161899 264078 339142 275701 319819 -88762 367041 -30252 335139 71247
17333D04857e9065C7763K18901k5560j10909J31020K09912B9928K35085a56523
$$ 404857 -59065 37763 256664 231104 120195 251215 461127 29928 265013 -156523
17322A18833l2360M7154F5772R8832C3885L73994A91294K5722F3348k8791f9634
$$ 118833 86473 133627 65772 164604 33885 407879 191294 217016 63348 34557 -69634
17310A30196N4605l3289K49511M2198B04056J3867J13851E6536h8099J5838B04945
$$ 130196 184801 151512 401023 443221 204056 217923 331774 56536 -88099 -72261 204945
17298I6370K41593j64230g2599C7636c26884B13311L4154a32877A97849o5690
$$ 96370 337963 173733 -72599 37636 -326884 213311 247465 -132877 197849 132159
17288A32159j2534K17633A41428d5722o4711j00221D79202k30621j01356Q154
$$ 132159 119625 337258 141428 -45722 -110433 -210654 479202 248581 147225 155379
17278A55379J48114l8809j15125l0982B428K66345A10367f3845A65290K313Q7628
$$ 155379 303493 264684 149559 118577 2428 268773 110367 -63845 165290 167603 255231
17267B55231l8619J7717J21970o5452J16491E2018K43904j43283K4000J85622
$$ 255231 216612 234329 356299 290847 407338 52018 295922 152639 176639 362261
17257C62261n4909f6203b7296B03034O7409l0699K42856a78278A41463J59374
$$ 362261 307352 -66203 -27296 203034 270443 239744 482600 -178278 141463 300837
17247C00837A0774M19605j89661A12996J45304A05555b5799J19C98472j94734
$$ 300837 10774 430379 240718 112996 258300 105555 -25799 -25680 398472 203738
17237B03738F6932Q88M9599K14676F0585O6916N8486n7071J23729a3292I3250
$$ 203738 66932 67820 117419 332095 60585 127501 185987 128916 252645 -13292 93250
17225A69437Q5988A15872K6648M39265A61634p4438K22342M0139q115j24229l8398
$$ 169437 255425 115872 142520 581785 161634 87196 309538 349677 341562 217333 178935
17214A78935K76J25191M0335Q1636j70071O9181j6784n6474r6293J98764m1487
$$ 178935 179211 304402 344737 426373 256302 325483 308699 252225 155932 354696 313209
17203C13209n6615l8407K40026A73609K7390q7122K94704A77270L45074A71593
$$ 313209 256594 218187 458213 173609 200999 113877 408581 177270 522344 171593
17192C07212p2441J25291J1155G7840L35478n6723r8725A13822J1974q542O2983
$$ 307212 234771 360062 371217 77840 413318 356595 257870 113822 125796 117254 180237
17181A80237J39859A06004C1938J13463K77763j50647K75772o2857k14308J74996
$$ 180237 320096 106004 31938 145401 423164 272517 548289 485432 271124 446120
17171D46120A23581M35537H2655K35618q4654j8684J54737M5533r2253G9285L0302
$$ 446120 123581 559118 82655 318273 233619 214935 369672 415205 322952 79285 109587
17160A09587A8376J50130n1469g1924C00595m3670A15354j2971J80272A20247
$$ 109587 18376 168506 117037 -71924 300595 256925 115354 102383 282655 120247
17149D71380k17263R7183p2945J19866K2348A58768J95941A76513M04967k33439
$$ 471380 254117 351300 278355 398221 420569 158768 354709 176513 581480 348041
17139C48041A06267M08707n3536G8294L2093Q8175J61281A45923L8360P0225e2982
$$ 348041 106267 514974 461438 78294 110387 198562 359843 145923 184283 254508 -52982
17127C94750G4714e8954B47220L5313A6988J32504K83947C3986K6325P40814k52913
$$ 394750 74714 -58954 247220 282533 16988 149492 433439 33986 60311 801125 548212
17116E48212k42442J00467P5261J97938k29202l3776J75634a2051D78791j5423
$$ 548212 305770 406237 481498 679436 450234 416458 592092 -12051 478791 463368
17106D63368n2153N793A47631K15542N8914Q9399j28287A79174K16104r8362R1429
$$ 463368 411215 417008 147631 363173 422087 511486 383199 179174 395278 296916 388345
17095C88345K69904B11033M32595C19443q704J40609l4775r5378K06689L08947
$$ 388345 658249 211033 643628 319443 310739 451348 416573 321195 527884 836831
17085H36831k14399P6365k95513j7631m3581O3979K0203l8033J73513j6698r6432
$$ 836831 622432 698797 403284 385653 342072 406051 426254 388221 561734 545036 448604
17074D48604k7441R6426p7743Q0597j1056J3658j88056J45546Q9368k51314L08359
$$ 448604 421163 517589 439846 520443 509387 523045 334989 480535 569903 318589 626948
17063F26948K4210m4997j92636J90768B89595K18299L94341k00620j72087n5338
$$ 626948 651158 606161 413525 604293 289595 507894 902235 701615 529528 474190
17053D74190L9951K14669k32066K05816k94244j31315M16597M6982l02713j54658
$$ 474190 514141 728810 496744 702560 408316 277001 693598 740580 437867 283209
17043B83209L76482l26569K04760j3564K07393L46674D31486K00056j9361L1576
$$ 283209 659691 333122 537882 524318 731711 1078385 431486 631542 612181 643757
17033F43757j79963K55311l53208K21080r8252L40255J91223D03306K25338K9034
$$ 643757 463794 719105 365897 586977 488725 828980 1020203 403306 628644 657678
17023F57678M3653Q2450J9140C12607M40269L5855l72411K87616q4604k3498l900
$$ 657678 701331 783781 802921 312607 752876 788731 416320 703936 619332 595834 591934
17012E91934J36552J05666p5661k33597M4012K370K40072J74457k67636m8021
$$ 591934 728486 834152 758491 524894 568906 571276 811348 985805 718169 670148
17002F70148K94805j68225j09037k12165k9659N91963l45494k20293L85902K8849
$$ 670148 964953 796728 687691 475526 445867 1037830 692336 472043 857945 886794
16992H86794J84009n6420m03341Q0166J38117k40624J52105J65674j63745K6165
$$ 886794 1070803 1014383 611042 691208 829325 588701 740806 906480 742735 768900
16982G68900K41994Q3677O8282j26485m22991K32485K39053K46908n60741n9244
$$ 768900 1010894 1094571 1162853 1036368 613377 845862 1084915 1331823 771082 711838
16972G11838L50420k56226J40387O5597j31140O8457m5218J47563M69437o27061
$$ 711838 1062258 806032 946419 1012016 880876 949333 904115 1051678 1521115 894054
16962H94054L57881k48165k33481L00584o911O2654m7531j0890J59351p0671k26896
$$ 894054 1251935 1003770 770289 1070873 1063962 1126616 1079085 1068195 1227546 1156875 929979
16951I29979O8864j29321J30098K31420o1446K4317K17030k55127J69796J72940
$$ 929979 998843 869522 999620 1231040 1169594 1193911 1410941 1155814 1325610 1498550
16941A498550m15966j05396K31528J99820l79533N7334J40294Q6229J41144j06127
$$ 1498550 1082584 977188 1208716 1408536 1029003 1086337 1226631 1312860 1454004 1347877
16931A347877K25048n0675k14587K80684j16484K14767l14047J83709M643j25297
$$ 1347877 1572925 1522250 1307663 1588347 1471863 1686630 1372583 1556292 1560935 1435638
16921A435638J49616o5523n1905j57217P6150K64516r7490j23817j50358L75460
$$ 1435638 1585254 1519731 1467826 1310609 1386759 1651275 1553785 1429968 1279610 1655070
16911A655070J18044k04528Q9128k1705p8518Q0713K01787j44918j31676L41700
$$ 1655070 1773114 1568586 1657714 1636009 1557491 1638204 1839991 1695073 1563397 1905097
16901A905097O3348l40568K82208L5700J5291N5927K45534k12028J53461l38511
$$ 1905097 1968445 1627877 1910085 1945785 1961076 2017003 2262537 2050509 2203970 1865459
16891A865459J07620K23759k78353K70115J20979j21241K48274N9161l36376K12164
$$ 1865459 1973079 2196838 1918485 2188600 2309579 2188338 2436612 2495773 2159397 2371561
16881B371561n2469L30629m36480J09446R7201M6566L87114j03173k56638L57543
$$ 2371561 2319092 2649721 2213241 2322687 2419888 2466454 2853568 2750395 2493757 2851300
16871B851300j53665N0058j19038M9055K10156J92877r6213L1658k35452J91604
$$ 2851300 2697635 2747693 2628655 2677710 2887866 3080743 2984530 3016188 2780736 2972340
16861B972340q6048J63231P6927K52757j00191n650R957N3384J84742K58205k91598
$$ 2972340 2886292 3049523 3126450 3379207 3279016 3273366 3283323 3336707 3521449 3779654 3488056
16850C488056K9915J69476p273n2926L83812L1791j02020l43763P15695j69040
$$ 3488056 3517971 3687447 3680174 3627248 4011060 4042851 3940831 3597068 4312763 4143723
16840D143723O3246j18505M84988j89675L90907j86298J84780J44213j99879M17278
$$ 4143723 4206969 4088464 4573452 4383777 4774684 4588386 4773166 4917379 4717500 5134778
16830E134778k77327K48541K50647o9151j52211j9976N58800k04300L44552M7490
$$ 5134778 4857451 5105992 5356639 5287488 5135277 5115301 5674101 5469801 5814353 5861843
16820E861843L14051k99724L15371K25734J53688K17593l5652K39531R116o51
$$ 5861843 6175894 5876170 6191541 6417275 6570963 6788556 6752904 6992435 7001551 7000900
16810G000900M94236M7000L08279j23363J92480L55198q6795K72664L84520K19893
$$ 7000900 7495136 7542136 7850415 7727052 7919532 8274730 8187935 8460599 8845119 9065012
16800I065012J11748j84143Q47893K71856J05197M05877J47767M61030j9073N10339
$$ 9065012 9176760 8992617 9840510 10112366 10217563 10623440 10771207 11232237 11213164 11723503
16790A1723503L80534r186K94801N78963L88503Q4629P84016M13550K62309N64253
$$ 11723503 12104037 12094851 12389652 12968615 13357118 13441747 14225763 14639313 14901622 15465875
16780A5465875M40949O50375L45212K16784R15677L20151J094976M93078Q28545
$$ 15465875 15906824 16557199 16902411 17119195 18034872 18355023 19449999 19943077 20771622
16771B0771622P24582O20612P77437P76209J029416J080307Q09147J214187P40535
$$ 20771622 21496204 22116816 22894253 23670462 24699878 25780185 26589332 27803519 28544054
16762B8544054J271910J165344J385360J336942J576915J518497J805721J243998
$$ 28544054 29815964 30981308 32366668 33703610 35280525 36799022 38604743 39848741
16754C9848741K485731J537399J962005K358740K964957K085435K848044L046727
$$ 39848741 42334472 43871871 45833876 48192616 51157573 53243008 56091052 59137779
16746E9137779K817512L456111L271697M023275L949787M321293M215016M669975
$$ 59137779 61955291 65411402 68683099 72706374 76656161 80977454 85192470 89862445
16738H9862445N070118N531677N327052N639151N959985O316908O440029O436837
$$ 89862445 94932563 100464240 105791292 111430443 117390428 123707336 130147365 136584202
16730A36584202O053609O541163N834275N701771N256610M655269L995346K771787
$$ 136584202 142637811 149178974 155013249 160715020 165971630 170626899 174622245 177394032
16722A77394032K444865J132665R7269r02997j650972l028128l856455m398313
$$ 177394032 179838897 180971562 181068831 180165834 178514862 175486734 171630279 167231966
16714A67231966n229244n531153n902610o238284o540082o657332o093002o395172
$$ 167231966 162002722 156471569 150568959 144330675 137790593 131133261 125040259 118645087
16706A18645087n684674o066755n890013n182523n060891m521765m976063m241655
$$ 118645087 112960413 106893658 101003645 95821122 90760231 86238466 81262403 77020748
16698G7020748m112018m016531l414040l400686l354660k751055k885272k543662
$$ 77020748 72908730 68892199 65478159 62077473 58722813 55971758 53086486 50542824
16690E0542824k228379k697036k220343j475405j943820k000185j891449j282042
$$ 50542824 48314445 45617409 43397066 41921661 39977841 37977656 36086207 34804165
16682C4804165j638830j163206j608382j101947j045198j219167j376441r79999
$$ 34804165 33165335 32002129 30393747 29291800 28246602 27027435 25650994 24670995
16674B4670995o45432p44347j099307o77839m87018q86875p36684o14600m40231
$$ 24670995 24025563 23281216 22181909 21504070 21017052 20130177 19393493 18778893 18338662
16665A8338662o93289n92156o35489p10502k87370n21776k84430n76965m29528
$$ 18338662 17645373 17053217 16417728 15707226 15419856 14898080 14613650 14036685 13607157
16656A3607157k14534n86057k33829k63324n90323m63453j02398m94142J20384
$$ 13607157 13392623 12806566 12572737 12309413 11719090 11255637 11153239 10659097 10779481
16647A0779481m96696j43951l40906n01720l28663o9683R1756l89163K85095r04449
$$ 10779481 10282785 10138834 9797928 9296208 8967545 8897862 8989618 8600455 8885550 7981101
16637G981101N31p7769j79229m84117J46968m31494k95661k5708J54286l51541
$$ 7981101 7981632 7903863 7724634 7240517 7387485 6955991 6660330 6634622 6788908 6437367
16627F437367j87017K7218n7731J8560m20770K15294n28359K90527j10098k20405
$$ 6437367 6250350 6277568 6219837 6238397 5817627 6032921 5504562 5795089 5684991 5464586
16617E464586k5496j77173o8691l59369K72080l60154O086j81687j55798j231
$$ 5464586 5439090 5261917 5193226 4833857 5105937 4745783 4751869 4570182 4414384 4413153
16607D413153j43905P0513j53768k1807l13798K58252J34283n74376J01614j63612
$$ 4413153 4269248 4339761 4185993 4164186 3850388 4108640 4242923 3668547 3770161 3606549
16597C606549J7297K32852l07216j9187k17775M5333j82524j1673L6756m5507
$$ 3606549 3623846 3856698 3549482 3530295 3312520 3357853 3175329 3163656 3200412 3154905
16587C154905k01663J35749L93389n24829k8708j83556k1868K35902m7279k21033
$$ 3154905 2953242 3088991 3482380 2957551 2928843 2745287 2723419 2959321 2912042 2691009
16577B691009j1909j8752J83487J5351m20531j05920Q8274l53067J74030J34181
$$ 2691009 2679100 2660348 2843835 2859186 2438655 2332735 2421009 2067942 2241972 2376153
16567B376153l6101K9017j59188l54559L38352J88518j68318j84147L9556N2592
$$ 2376153 2340052 2369069 2209881 1855322 2193674 2382192 2213874 2029727 2069283 2121875
16557B121875n46985J19422K90082l40858J32604L30920l88279R4857O4929o6741
$$ 2121875 1574890 1694312 1984394 1643536 1776140 2107060 1718781 1813638 1878567 1811826
16547A811826M7221o4202J65249k04659j92200N71239n89248L92268q4410k4425
$$ 1811826 1859047 1794845 1960094 1755435 1563235 2134474 1545226 1937494 1853084 1828659
16537A828659j03125L3142J03023k79775k92282M15776k59921o7943Q9654j39841
$$ 1828659 1725534 1758676 1861699 1581924 1289642 1705418 1445497 1377554 1467208 1327367
16527A327367N4292J43886j63067L36055j73045k56201J82453L963K99434m81561
$$ 1327367 1381659 1525545 1362478 1698533 1525488 1269287 1451740 1455703 1755137 1273576
16517A273576N9397J86100k21695j1494L6641m7427L85811k69000j46111J7940
$$ 1273576 1332973 1519073 1297378 1285884 1322525 1275098 1660909 1391909 1245798 1263738
16507A263738k78441N2596q1937J39119L88882n34436j77510K20588K82909l98237
$$ 1263738 985297 1037893 955956 1095075 1483957 949521 772011 992599 1275508 877271
16497H77271N71366l57277k75954K42851j61102j54104N48413n14011j02749R4167
$$ 877271 1448637 1091360 815406 1058257 897155 743051 1291464 777453 674704 768871
16487G68871R4958p1597Q7587P3874j26907J55154j4853k80295K70380O7703j21910
$$ 768871 863829 792232 879819 953693 826786 981940 967087 686792 957172 1024875 902965
16476I02965j92369l6109J33864j06972K79275j68633r0527K29731P1369j63565
$$ 902965 710596 674487 808351 701379 980654 812021 721494 951225 1022594 859029
16466H59029j12750K8993J45816j70943j43442J54603J17127j082p4171J37486
$$ 859029 746279 775272 921088 750145 606703 761306 878433 877351 803180 940666
16456I40666l09163m9322J05852N9986L2007p9153j76472p4972K47769m1014L51579
$$ 940666 631503 582181 688033 748019 780026 700873 524401 449429 697198 656184 1007763
16445A007763D05884M35763k67833J41134M18500l22903j44468K2588J9355J06357
$$ 1007763 405884 841647 573814 714948 1133448 810545 666077 688665 708020 814377
16435H14377k07739p0L8392j01167K0034K37436l37950B11412N23352J60432k56899
$$ 814377 606638 606568 644960 543793 563827 801263 463313 211412 734764 895196 638297
16424F38297L9563j47719J08101j1002r4595q2152L29977m4047r0349m8167L128
$$ 638297 677860 530141 638242 627240 532645 450493 780470 736423 646074 597907 601035
16413F01035K4921l8024L33302k57309K3958p2367j72608J56551o7639P5532k56031
$$ 601035 625956 587932 921234 663925 687883 615516 442908 599459 531820 607352 351321
16402C51321J71369p2385J62623k62474K00390l5960B07617J62080J58767K93246
$$ 351321 522690 450305 612928 350454 550844 514884 207617 369697 528464 821710
16392H21710B72786M75536M695j03594k87354K43667A94899J40605p3835K69206
$$ 821710 272786 748322 753017 649423 362069 605736 194899 335504 261669 530875
16382E30875p0295j60503K24032B35690J34855L45019B72387k0601K82617J0542
$$ 530875 460580 300077 524109 235690 370545 715564 272387 251786 534403 544945
16372E44945k68487n4814N1850A09121K61962L2122K53363B36576K36474k32152
$$ 544945 276458 221644 273494 109121 371083 403205 656568 236576 473050 240898
16362B40898K79468j21811J91570B05298A00761N56995B94571J15134M5314k24250
$$ 240898 520366 398555 590125 205298 100761 657756 294571 409705 455019 230769
16352B30769L52108k79103K85374B77420A4342N74904j73120A13040K01087Q0024
$$ 230769 582877 303774 589148 277420 14342 589246 416126 113040 314127 394151
16342C94151j41424D7716M96031k19785Q4251j3415J71019K6196B31068K95843
$$ 394151 252727 47716 543747 323962 408213 394798 565817 592013 231068 526911
16332E26911j54184n2994j37838N080J14564o5962E1647R7930J82862A49119n9215
$$ 526911 372727 319733 181895 186975 301539 235577 51647 149577 332439 149119 89904
16321H9904L78659i685G5195J44135L03409j97443L3205m9947J1803o6037r1823
$$ 89904 468563 -9685 75195 219330 522739 325296 358501 308554 320357 254320 162497
16310A62497L5193N5936A4309J76756N3896P534q2227J4770n6023e7777F6888
$$ 162497 197690 253626 14309 191065 244961 252495 170268 185038 129015 -57777 66888
16298C61597q9923J66601l4632q2268j12084p3894J40259K24911c4655B54726
$$ 361597 271674 438275 403643 321375 209291 135397 275656 500567 -34655 254726
16287A21340B1860L62141B8729K34703q0798J16240J4654j19813P7760K06016
$$ 121340 21860 384001 28729 263432 182634 298874 313528 193715 271475 477491
16277D77491a8269A90901M7369b8736B34426r8343N4572a78867B45398k7048K03908
$$ 477491 -18269 190901 238270 -28736 234426 136083 190655 -178867 245398 218350 422258
16266D22258H6236J38268J33650j27508G7104K87186A52415F8542K9551J15137
$$ 422258 86236 224504 358154 230646 77104 364290 152415 68542 98093 213230
16256B13230i406A79185Q8122o1068K85692E4358d399C7589J19141r20K40203
$$ 213230 -9406 179185 267307 206239 491931 54358 -4399 37589 156730 155810 396013
16245C96013B7077K2280K25922H0088K76951j77371a00611C26295D9602K32583
$$ 396013 27077 49357 275279 80088 357039 179668 -100611 326295 49602 282185
16235B82185d4314C20247A39426L03797A45961R1990a06419C32163f4925k09752
$$ 282185 -44314 320247 139426 443223 145961 237951 -106419 332163 -64925 -274677
16225b74677D35476A36695a9870B21524D603e668B51339J17669A56142O509J2956
$$ -274677 435476 136695 -19870 221524 4603 -5668 251339 369008 156142 162651 175607
16214A75607a32400I9202N717J61054j01039F6091b4829A1528f3497B06458a62863
$$ 175607 -132400 99202 104919 265973 164934 66091 -24829 11528 -63497 206458 -162863
16202A63786E7846b1536A59763J14879r2350M0859G8977e9230I6274J52524K1678
$$ 163786 57846 -21536 159763 274642 182292 223151 78977 -59230 96274 248798 270476
16191B70476C6026J42917c46148B13850F8820a19768k96529A83718k8040D8185
$$ 270476 36026 178943 -346148 213850 68820 -119768 -416297 183718 155678 48185
16180I0137o377l9521L77748a619E0801f7325C15034A01784e2893p3714j53362
$$ 90137 83760 44239 421987 -1619 50801 -67325 315034 101784 -52893 -126607 -279969
16169b79969B75986C1789J95474n8752j8129a87073e5931n2656c184r2918B61992
$$ -279969 275986 31789 227263 168511 150382 -187073 -55931 -108587 -3184 -96102 261992
16157E69989F8028J04748g3512j78681A69227l1290O5843B4993J07744J13587
$$ 569989 68028 172776 -73512 -252193 169227 137937 203780 24993 132737 246324
16147B46324J26707D0037K21348e4671B92231o2908m8053e5263A1807c0425j25378
$$ 246324 373031 40037 261385 -54671 292231 229323 181270 -55263 11807 -30425 -155803
16136a55803E9776N6666j9999g4227A17561d13955d4836F2250R6878K25592o1088
$$ -155803 59776 116442 96443 -74227 117561 -413955 -44836 62250 159128 384720 323632
16125C23632F0948K06188a39089D22846A25103a25483m11079a54381A52583h3642
$$ 323632 60948 267136 -139089 422846 125103 -125483 -536562 -154381 152583 -83642
16114A61358l6320o0859J59377a2542j15181A34003a43169a2506C36757J0500
$$ 161358 125038 64179 223556 -12542 -127723 134003 -143169 -12506 336757 347257
16104C47257f5896o860I3094K00096k0390n9879E3893a22768C70932a46227g20
$$ 347257 -65896 -72756 93094 293190 272800 212921 53893 -122768 370932 -146227 -720
16092A25398n0732a31741B27671a84767B63866a89865D32465F8164j4223h2365
$$ 125398 74666 -131741 227671 -184767 263866 -189865 432465 68164 53941 -82365
16081A62317E2675c7008C0564P6452c42283C4985c76456a06419A96667F0242a61306
$$ 162317 52675 -37008 30564 107016 -342283 34985 -376456 -106419 196667 60242 -161306
16069A43132g3754A17514L5140E1051O8573b1237B64122b60267J8538n1967B12110
$$ 143132 -73754 117514 152654 51051 119624 -21237 264122 -260267 -241729 -293696 212110
16057e3457A55231Q4469E3735c43412F0625K25899j22280E3284K09235n3172a33977
$$ -53457 155231 239700 53735 -343412 60625 286524 164244 53284 262519 209347 -133977
16045A98146d1154H1615g3330F9427g874r5216j69669E4371a56474k05844R5451
$$ 198146 -41154 81615 -73330 69427 -7874 -103090 -272759 54371 -156474 -362318 -266867
16034b66867G2881b39708a8447k92336J44672L029B4576J04140c12191H4657J6846
$$ -266867 72881 -239708 -18447 -310783 -166111 -163082 24576 128716 -312191 84657 101503
16023A01503a04852C09698B4791a04289m7154b8863p1794l5987j28784i4094j662
$$ 101503 -104852 309698 24791 -104289 -151443 -28863 -100657 -136644 -265428 -94094 -95756
16012i5756C4386a46941A53185h3560a3879l0088q4857G2033J51561H629K19204
$$ -95756 34386 -146941 153185 -83560 -13879 -43967 -128824 72033 223594 8629 227833
16001B27833a01092D8671a29619i700H7039i8641O685K8953i072j09471p3838
$$ 227833 -101092 48671 -129619 -9700 87039 -98641 -91956 -63003 -9072 -118543 -192381
15990a92381F076a13895k63416A27410c1222k17780I8975c9260j844B18287J76811
$$ -192381 6076 -113895 -377311 127410 -31222 -249002 98975 -39260 -41104 218287 395098
15979C95098q1401I3844a15027F36a47128q5902B84894b6400B04772b08872d1276
$$ 395098 313697 93844 -115027 636 -147128 -233030 284894 -26400 204772 -208872 -41276
15967c1724A9609a92671A1774j879a829k99400I5546L343J13625B0161M1960J7769
$$ -31724 19609 -192671 11774 9895 -1829 -301229 95546 98889 212514 20161 62121 79890
15955G9890C5047K9020e4861B80167B0402a65053O6106D6397b30637A22387h6024
$$ 79890 35047 64067 -54861 280167 20402 -165053 -98947 46397 -230637 122387 -86024
15943B80314q2071b80678A38695E2087c9881B81485c14792A43794l0552i8073
$$ 280314 198243 -280678 138695 52087 -39881 281485 -314792 143794 113242 -98073
15932A61499e9938e982k34190c085B00818i2836K9470G8095d2354k19806B41380
$$ 161499 -59938 -5982 -240172 -3085 200818 -92836 -63366 78095 -42354 -262160 241380
15920C4987J57263b9856D2894c40888G4917a82788B00213b39432n7724J05071
$$ 34987 192250 -29856 42894 -340888 74917 -182788 200213 -239432 -297156 -192085
15910a92085C9042e00997H5637a73934D3916c24736f256D758O7018N1333P8763
$$ -192085 39042 -500997 85637 -173934 43916 -324736 -6256 4758 71776 123109 201872
15899B01872r1979E190b59460c5897A67857l8026a6350k3501E5439K90155a52885
$$ 201872 109893 5190 -259460 -35897 167857 129831 -16350 -39851 55439 345594 -152885
15887b60819b3161l57131A9873R9429d5527l0136m7910b028j46081J2478B18053
$$ -260819 -23161 -380292 19873 119302 -45527 -75663 -123573 -2028 -148109 -135631 218053
15875A82404i9187A93429L3353c06417J23395C9831R3934D229N0910a02229B18588
$$ 182404 -99187 193429 226782 -306417 -183022 39831 133765 4229 55139 -102229 218588
15863a2849A43270J10978b21526f556F2698b27508J9849e8129A07443A2438J57563
$$ -12849 143270 254248 -221526 -6556 62698 -227508 -207659 -58129 107443 12438 170001
15852A70001J07297i2113a3507j66801B00240c14788A33694b32514C209c8671
$$ 170001 277298 -92113 -13507 -180308 200240 -314788 133694 -232514 3209 -38671
15841A4862h8787B28829f000j78793B3173a35792C08385K06430g0472r7847k2755
$$ 14862 -88787 228829 -6000 -184793 23173 -135792 308385 514815 -70472 -168319 -191074
15830a91074a6742A23770J6604a82084J3671A19693E7073a87764j7560j1291H9308
$$ -191074 -16742 123770 140374 -182084 -168413 119693 57073 -187764 -205324 -216615 89308
15818F3479Q2803m0225a70168a3877D5902b2139k50708P8428C31856B4495a73084
$$ 63479 146282 106057 -170168 -13877 45902 -22139 -272847 -194419 331856 24495 -173084
15806a76146L6040D3004i0693C8896K57460E5597a35803G4709h8932F7047P6487
$$ -176146 -140106 43004 -90693 38896 296356 55597 -135803 74709 -88932 67047 143534
15795A43534A3378L06187f1843j6958j08922d9528j24225m6996R3763F2267a54691
$$ 143534 13378 319565 -61843 -78801 -187723 -49528 -173753 -220749 -126986 62267 -154691
15783E292b06670e8573j36739o0270a21141A21557h5605B061a15353B5265a58302
$$ 5292 -206670 -58573 -195312 -255582 -121141 121557 -85605 2061 -115353 25265 -158302
15771i6119l015A67063a31943I0580a42218A1986J89549g9061A84976H9512C1004
$$ -96119 -99134 167063 -131943 90580 -142218 11986 201535 -79061 184976 89512 31004
15759C25916E7035P2633C2775R5249a35734B144d7270G4614b39415B63834a08949
$$ 325916 57035 129668 32775 128024 -135734 2144 -47270 74614 -239415 263834 -108949
15747c19363B5652c1465m1231K8729C17208a46865N7860c8793C962L57594b25788
$$ -319363 25652 -31465 -72696 -43967 317208 -146865 -89005 -38793 3962 361556 -225788
15735b86862a0134C5606b77894j88631a9708k29504d458A8269c9953o2383h515
$$ -286862 -10134 35606 -277894 -466525 -19708 -249212 -4458 18269 -39953 -102336 -8515
15723a69906h3164E424J18091M5192g2027A89981h538j45627R972k72361J66915
$$ -169906 -83164 5424 123515 168707 -72027 189981 -8538 -154165 -144193 -416554 -249639
15712b49639Q8732j22566A27713f7254C06269M6174C1359J25761b99585c0659
$$ -249639 -160907 -283473 127713 -67254 306269 352443 31359 157120 -299585 -30659
15701a15545A42312e4901c507G2273a59489B13532o0756i688C10934A5294a76161
$$ -115545 142312 -54901 -3507 72273 -159489 213532 152776 -9688 310934 15294 -176161
15689a08743B86198c9923B17455g4109k4221E7525b40931G4667a97882P8529c4384
$$ -108743 286198 -39923 217455 -74109 -98330 57525 -240931 74667 -197882 -119353 -34384
15677g8834L8770k96826O9460M5530C49380H7464k7417c0486A99697H1653M00553
$$ -78834 -40064 -336890 -267430 -221900 349380 87464 60047 -30486 199697 81653 482206
15666D82206g1811F760B480J17129b42908A21803g1131D6186a72692k3021h957
$$ 482206 -71811 6760 2480 119609 -242908 121803 -71131 46186 -172692 -195713 -8957
15654D8551a07150B80717a99642G5796f80922a35484d1572j38562B79958C9425
$$ 48551 -107150 280717 -199642 75796 -680922 -135484 -41572 -180134 279958 39425
15643F9948c6251k8317D3812g8181d740B06450B8932c85377N2202A91002a37177
$$ 69948 -36251 -64568 43812 -78181 -4740 206450 28932 -385377 -333175 191002 -137177
15631a05648j7385J5758c7174C01516a74583g7229L4385i139H4497i9062A74235
$$ -105648 -123033 -107275 -37174 301516 -174583 -77229 -42844 -9139 84497 -99062 174235
15619g4450r0778O1644A54617l5666D3587e6029j16929B9293a61384N3115A88194
$$ -74450 -165228 -103584 154617 118951 43587 -56029 -172958 29293 -161384 -108269 188194
15607a61066G1507d15279d688m2433P115C2041q949d52291A47416a04742F6474
$$ -161066 71507 -415279 -4688 -47121 -40006 32041 23092 -452291 147416 -104742 66474
15595a09932l54289E0184c17761c4984B6621i1179A54885O6249l7489r0139J29918
$$ -109932 -464221 50184 -317761 -34984 26621 -91179 154885 221134 183645 93506 223424
15584B23424O0069a95735H5819a82100C97157b32766c1653r6895A88321e1533
$$ 223424 283493 -195735 85819 -182100 397157 -232766 -31653 -128548 188321 -51533
15573A2472b61333H71b78797J14972d6889B54722b00937J2331B95246a94674C3779
$$ 12472 -261333 871 -278797 -163825 -46889 254722 -200937 -188606 295246 -194674 33779
15561B12824a80498B31234m5804J82554e7921r8802j82777J45581G1956M0234
$$ 212824 -180498 231234 185430 367984 -57921 -156723 -339500 -193919 71956 112190
15551A12190a33057R058I7412d69747F3278A545J46822M2923a89586A63439N6153
$$ 112190 -133057 -123999 97412 -469747 63278 1545 148367 191290 -189586 163439 219592
15540B19592c56802I5568A0548f8023q1680c6129D28399b13232n7741c794j46243
$$ 219592 -356802 95568 10548 -68023 -149703 -36129 428399 -213232 -270973 -3794 -150037
15529a50037N1507n9984A08898h7365c2150H979R3099B0842J74234d00000B24221
$$ -150037 -98530 -158514 108898 -87365 -32150 8979 102078 20842 195076 -400000 224221
15517a56472A0036K29557G5535J87583a3499A9853Q8761n0440f688k65295J1748
$$ -156472 10036 239593 75535 263118 -13499 19853 108614 58174 -6688 -271983 -260235
15506b60235B67239a29116I6710h8147j40557b1637k49036B44994F3590e6723
$$ -260235 267239 -129116 96710 -88147 -228704 -21637 -270673 244994 63590 -56723
15495C66691g209A0391a2886l61291A46237a21509k64356J92725E1851K6940N8166
$$ 366691 -7209 10391 -12886 -374177 146237 -121509 -385865 -193140 51851 78791 136957
15484A36957g1968l13264J01551b4121j61926j01127F5368a69277H9307B3498
$$ 136957 -71968 -385232 -283681 -24121 -186047 -287174 65368 -169277 89307 23498
15473B5962a94252A6124a26858A18503a17248E1477a50107e2366B54878J03083
$$ 25962 -194252 16124 -126858 118503 -117248 51477 -150107 -52366 254878 357961
15463C57961c2065A16175N7434g19j0566B39717a94771Q3803j40449a22062H045
$$ 357961 -32065 116175 173609 -719 -11285 239717 -194771 -110968 -251417 -122062 8045
15451B19266a12695A91823F9663L29774A05290L9141J24351k5184F2946R3366
$$ 219266 -112695 191823 69663 399437 105290 144431 268782 243598 62946 156312
15441A56312b60353A35628J46855c3777B00396b18153D8408J80375m6523M6142
$$ 156312 -260353 135628 282483 -33777 200396 -218153 48408 228783 182260 228402
15431B28402j02296a40854A18356J71430k5815m4683r588o2726i0757I6878K1465
$$ 228402 126106 -140854 118356 289786 263971 219288 209700 146974 -90757 96878 118343
15420A18343m4069b88579J44213D3839J33223b6272B05154b62881c6270A72224
$$ 118343 74274 -288579 -144366 43839 177062 -26272 205154 -262881 -36270 172224
15409A24469J11714e0870C16411j30538D4082a38546F3404J2242c9969k26589
$$ 124469 236183 -50870 316411 185873 44082 -138546 63404 75646 -39969 -266558
15399b66558r4135E5047F35a21726J4535A23434g6069A34050D4869f6490C08347
$$ -266558 -360693 55047 635 -121726 -107191 123434 -76069 134050 44869 -66490 308347
15387d2662C6178R3284i4340j07045A00826L8705i4005a6182B9344e8632P306
$$ -42662 36178 129462 -94340 -201385 100826 139531 -94005 -16182 29344 -58632 -51326
15376e1326A77475d23500C6507f8089j65199I6328j0848a40773o8353i5803C8074
$$ -51326 177475 -423500 36507 -68089 -233288 96328 85480 -140773 -209126 -95803 38074
15364d43633D7725e01913a47150p040A05718M6391n515b13686B67857i8614A96387
$$ -443633 47725 -501913 -147150 -154190 105718 152109 146594 -213686 267857 -98614 196387
15352B24781R7527B4053a49043j78616a01970A71198a44718B32523a06568A50107
$$ 224781 322308 24053 -149043 -327659 -101970 171198 -144718 232523 -106568 150107
15341A62524B8637J82152o9397E5402l053J76993f5416A90641a06687B28453j08466
$$ 162524 28637 210789 141392 55402 52349 229342 -65416 190641 -106687 228453 119987
15330A19987h3593l36320A25353a95581l6869r9161B10500a81390A11163B8065
$$ 119987 -83593 -419913 125353 -195581 -232450 -331611 210500 -181390 111163 28065
15319b04110p9281J37357B32831a59748K0238n052H8592B286K62109p6151A3201
$$ -204110 -283391 -146034 232831 -159748 -139510 -144562 88592 2286 264395 188244 13201
15307A39456a29025A41103a98890G8052i6391G5321a26885g324q3468b5086j10025
$$ 139456 -129025 141103 -198890 78052 -96391 75321 -126885 -7324 -90792 -25086 -135111
15296a35111A36210j1077i8291D27334o2075j56862f0604B31110E4207d8474E2418
$$ -135111 136210 125133 -98291 427334 365259 208397 -60604 231110 54207 -48474 52418
15284h4187B01887o3983d4301k72415i5213J8773C79479A25439R9286p0289K85908
$$ -84187 201887 137904 -44301 -316716 -95213 -76440 379479 125439 224725 154436 440344
15273D40344D4916L2365c81676H1827l992b15513I0030K96946A19528J01493c6406
$$ 440344 44916 77281 -381676 81827 77835 -215513 90030 386976 119528 221021 -36406
15261B1865L7646J07568b90448I4623K69566D6537J3609K23269A32853P413R7482
$$ 21865 59511 167079 -290448 94623 364189 46537 60146 283415 132853 140266 237748
15250B37748j05815J14041K72302N20016R83341l12779J22736m19390o81155C48484
$$ 237748 131933 245974 518276 1038292 2021633 1708854 1831590 1412200 731045 348484
15239G5087J50253a2942A86545b0633n2231k480B40790A13755m0651J24611D075
$$ 75087 225340 -12942 186545 -20633 -72864 -75344 240790 113755 73104 197715 4075
15227B11323h1298A53483J33392c2433G9478L4721a0016C22731K55666a08383
$$ 211323 -81298 153483 286875 -32433 79478 114199 -10016 322731 578397 -108383
15216B70039q8161Q0427h0113C0402a4283H9445b8582A97708R0375C2573b8916
$$ 270039 181878 262305 -80113 30402 -14283 89445 -28582 197708 288083 32573 -28916
15204a4996o5705a2914j69129H1380a82408J2919d7045j33208h7889A16007a45542
$$ -14996 -80701 -12914 -182043 81380 -182408 -169489 -47045 -180253 -87889 116007 -145542
15192d5013m1495A74031L58025B65707b13015A65531K593a47596A84033O8488
$$ -45013 -86508 174031 532056 265707 -213015 165531 168124 -147596 184033 252521
15182B52521L565D220L46835D3235e3186C10351a45205H0102l1258L41466b9049
$$ 252521 256086 4220 351055 43235 -53186 310351 -145205 80102 48844 390310 -29049
15170D79334k7442j00716a02659A80606M3578J12530E0924a38685a0062D928d0344
$$ 479334 451892 351176 -102659 180606 224184 336714 50924 -138685 -10062 4928 -40344
15158b00157A17502n2563a25346A37636J80555j29261K945J34277j23464O9174
$$ -200157 117502 64939 -125346 137636 318191 188930 191875 326152 202688 271862
15148B71862j06317K26401h2060D713M5054O6432R4144O1o6088k3942i4667F8031
$$ 271862 165545 391946 -82060 4713 49767 116199 210343 210404 144316 120374 -94667 68031
15135A07176k7419K00882B257a04794A29863k6478Q6440J42775E1110J45873k3463
$$ 107176 79757 280639 2257 -104794 129863 103385 189825 332600 51110 196983 173520
15124A73520m2669e8621m2939B71581J72707g3704A52540b02110h9589A7163J68196
$$ 173520 130851 -58621 -101560 271581 444288 -73704 152540 -202110 -89589 17163 185359
15113A85359d2818B37598h0626A98594F8677a69373A33008B3323R2704C3640M3647
$$ 185359 -42818 237598 -80626 198594 68677 -169373 133008 23323 116027 33640 77287
15102G7287k680K12520A27334L38911k14153b40709A4257c5578A28475b92132
$$ 77287 74607 287127 127334 466245 252092 -240709 14257 -35578 128475 -292132
15091A39484L951J66874F9659J33763l8149j8086f2744k21313P5589B58155b22192
$$ 139484 143435 310309 69659 203422 165273 147187 -62744 -284057 -208468 258155 -222192
15079C61159j64956E6127J67894a21137j9393A45607j1123m5860C4220c13881
$$ 361159 196203 56127 224021 -121137 -140530 145607 134484 88624 34220 -313881
15068b32184A05738N385J43806a09169N0273C25092g0890C10089a8822C49697
$$ -232184 105738 111123 254929 -109169 -58896 325092 -70890 310089 -18822 349697
15057A65993A3203b83499D13379G7111J19138F2229J1599K55207r5202N1181A24049
$$ 165993 13203 -283499 413379 77111 196249 62229 73828 329035 233833 285014 124049
15045A2823K79515j0692A8400L21146A23476b0457G0893b2224C76584r1904H3215
$$ 12823 292338 281646 18400 339546 123476 -20457 70893 -22224 376584 284680 83215
15033A18868K24340A38625O1679J27601g1327k0217B24136n0470D4339J17017
$$ 118868 343208 138625 200304 327905 -71327 -91544 224136 173666 44339 161356
15023A61356g1062B28988A10054K75773l1275A19029J1607c920a636A64861b82261
$$ 161356 -71062 228988 110054 385827 354552 119029 130636 -3920 -1636 164861 -282261
15011C05730G4898J49816a3207B88561j5647m3791q2671P6661m3414i2686A07969
$$ 305730 74898 224714 -13207 288561 272914 229123 146452 223113 179699 -92686 107969
14999B13037K68109A47130E5087a43802c5043C46358j46743a66798O7224B61825
$$ 213037 481146 147130 55087 -143802 -35043 346358 199615 -166798 -99574 261825
14988B51110l8381F6661J37864O7446n2133p2656J25905j13308K121q0325J10532
$$ 251110 212729 66661 204525 271971 219838 147182 273087 159779 161900 81575 192107
14977A92107P6908r3425J79308i7381D05752j17090N9339b03379B70238K57923
$$ 192107 269015 175590 354898 -97381 405752 288662 348001 -203379 270238 528161
14967E28161h2469B39534P7554D3839K48574B1552a1058D77851B08453J42731
$$ 528161 -82469 239534 317088 43839 292413 21552 -11058 477851 208453 351184
14957C51184f9445D13629J82559E6035a54154B12747p9004K79404F6201M7998
$$ 351184 -69445 413629 596188 56035 -154154 212747 133743 413147 66201 114199
14947A14199P4052l3218L8598J70757o4859l3321j05056o8920J15313O4027j25163
$$ 114199 188251 155033 193631 364388 299529 266208 161152 92232 207545 271572 146409
14936A46409J67102J82380B36795L9050K12774A17083K94917j55984k0080C1171
$$ 146409 313511 495891 236795 275845 488619 117083 412000 256016 235936 31171
14925H6239e3383C98362n1782m3148e9140B91774M22193B45902m4245K0230J48728
$$ 86239 -53383 398362 346580 303432 -59140 291774 713967 245902 201657 221887 370615
14914C70615P3519j16889j41615L9092K66172q1341j16015p1853j2977J3922g2080
$$ 370615 444134 327245 185630 224722 490894 409553 293538 221685 208708 222630 -72080
14902B10032J62034l5383r0020K78501B52648K47012p0903j4686Q9308k13494
$$ 210032 372066 336683 246663 525164 252648 499660 428757 414071 503379 289885
14892B89885K0202J99853k03807J6728o784j04947L41522B14166Q424J45371j13302
$$ 289885 310087 509940 306133 322861 316077 211130 552652 214166 222590 367961 254659
14881B54659K12173J0065A25164N43118A72868d0622B72630r8485L38277o4425
$$ 254659 466832 476897 125164 668282 172868 -40622 272630 174145 512422 447997
14871D47997j99031J34643K31964m8487B82085J58270j69907r4494k8393M21209
$$ 447997 248966 383609 615573 567086 282085 440355 270448 175954 147561 568770
14861E68770o5399j02670N7038J98407G9758N72963k21853m874j47276q2552O28129
$$ 568770 503371 400701 457739 656146 79758 652721 430868 425994 278718 196166 824295
14850H24295B33501M76971B58874K29221k31292A10176K11861Q6679D632L34367
$$ 824295 233501 710472 258874 488095 256803 110176 322037 408716 4632 338999
14840C38999J79335j00412j57522K41533j87172O5682M3100o0098J35590L8812
$$ 338999 518334 417922 260400 501933 314761 380443 423543 363445 499035 537847
14830E37847j13666J15638J88998H7058L30958K15640k84912J17321j48436l9476
$$ 537847 424181 539819 728817 87058 418016 633656 348744 466065 317629 278153
14820B78153M02429C14487L09156A20348M41896K21505k00412J19075k86016K9274
$$ 278153 680582 314487 623643 120348 562244 783749 583337 702412 416396 445670
14810D45670m0987L44400C50661L49584C37090K59919k33981K02440j65595j95112
$$ 445670 404683 749083 350661 700245 337090 597009 363028 565468 399873 204761
14800B04761M83273B23791N8406K24149L0486J59360k07481J17391M7268k3596
$$ 204761 688034 223791 282197 506346 536832 696192 488711 606102 653370 629774
14790F29774J33794C43928J51134l8092m4589K88965j65132J24620B46570O21936
$$ 629774 763568 343928 495062 456970 412381 701346 536214 660834 246570 868506
14780H68506l11111K8083J10700J40861k15028j43182K5120n7648K9438J16195
$$ 868506 557395 585478 696178 837039 622011 478829 503949 446301 475739 591934
14770E91934N9773k49922L68764m9352J24414D20816p0208J47614K45081C67576
$$ 591934 651707 401785 770549 721197 845611 420816 350608 498222 743303 367576
14759G44610k88934m1798j39282K26095M67183k34979N1912k63630O3437j49543
$$ 744610 455676 413878 274596 500691 967874 732895 784807 521177 584614 435071
14749D35071M00788l30944K75307l76970L01059J16481J42911N244k55032J1986
$$ 435071 835859 504915 780222 403252 704311 820792 963703 968947 713915 725901
14739G25901L7666J29818l5560j82772O4797J9818k26759J14016O0355j21290
$$ 725901 763567 893385 857825 675053 739850 759668 532909 646925 707280 585990
14729E85990J59114N7966L29001m96493j30169J12172K22761n4818K68691j85095
$$ 585990 745104 803070 1132071 635578 505409 617581 840342 785524 1054215 869120
14719H69120m6144j03475K91778N7810k02099o5091O0424o7366j9411J05523k30182
$$ 869120 822976 719501 1011279 1069089 866990 801899 862323 794957 775546 881069 650887
14708F50887L39054k33419k78337M73987l15086J57920L85708m26830O1758J51999
$$ 650887 989941 756522 478185 952172 637086 795006 1180714 753884 815642 967641
14698I67641r4598M7348K25088j93356Q8504k58506O15644l21539l36461M26396
$$ 967641 873043 920391 1145479 952123 1040627 782121 1397765 1076226 739765 1166161
14688A166161l48360K12101K4285j98029j23233L27179m3778r8260Q2917K99513
$$ 1166161 817801 1029902 1054187 856158 732925 1060104 1016326 918066 1000983 1300496
14678A300496k67393J11975j67230j13117J67912l6432j79220L78424j9941k11946
$$ 1300496 1033103 1145078 977848 864731 1032643 996211 816991 1195415 1175474 963528
14668I63528J477k05246M17983l71866N23878j63268k45995L16479k43778L20150
$$ 963528 965005 759759 1177742 805876 1329754 1166486 920491 1236970 993192 1313342
14658A313342l71786Q376J33062K66073j53906k6037n8053P5623J87484l10109
$$ 1313342 941556 949932 1082994 1349067 1195161 1169124 1111071 1186694 1374178 1064069
14648A064069N050K73596L3061j41787K50593n73419N69794k78578P9024M4810
$$ 1064069 1069119 1342715 1375776 1233989 1484582 911163 1480957 1202379 1281403 1326213
14638A326213l14141L85275q8420J5921r1034k34023K08949K28343j10113j13326
$$ 1326213 1012072 1397347 1308927 1324848 1233814 999791 1208740 1437083 1326970 1213644
14628A213644O1623m0297J15013j8403K7712K15670l45194P1483P008q4002n6548
$$ 1213644 1275267 1234970 1349983 1331580 1359292 1574962 1229768 1301251 1308259 1224257 1167709
14617A167709O9722M09859j94998J37597j18051P8105j12770k41805K06382k74677
$$ 1167709 1237431 1647290 1452292 1589889 1471838 1549943 1437173 1195368 1401750 1127073
14607A127073J46654O20269l77233M5621j20819j8077J19822K84747k69068j3801
$$ 1127073 1273727 1893996 1516763 1562384 1441565 1423488 1543310 1828057 1558989 1545188
14597A545188p2494Q4087J43316j19617J63212k01765M55340l77146L21375k73731
$$ 1545188 1472694 1556781 1700097 1580480 1743692 1541927 1997267 1620121 1941496 1667765
14587A667765k4506N6320K67350o6814M6259K7230K48207r9829l04638L23496
$$ 1667765 1643259 1699579 1966929 1900115 1946374 1973604 2221811 2121982 1817344 2140840
14577B140840j11502k47784L92235O6487Q9858m65791M29936J12253j77163P4894
$$ 2140840 2029338 1781554 2173789 2240276 2330134 1864343 2294279 2406532 2229369 2304263
14567B304263K02064n9819L07349k18995J31137r6197M0790P196J28072R0661
$$ 2304263 2506327 2446508 2753857 2534862 2665999 2569802 2610592 2617788 2745860 2836521
14557B836521K06519M6897L75000J02149L15961Q9536R09059Q64110K409166M181993
$$ 2836521 3043040 3089937 3464937 3567086 3883047 3972583 4881642 5745752 8154918 12336911
14547A2336911R436518J8429266M108111A9433074I447735j477045l640895j574169
$$ 12336911 21773429 40202695 44310806 19433074 9447735 7970690 4329795 2755626
14539B755626r4672j34705k88868r4366K7155j17664k10155L65824j5250N5271
$$ 2755626 2660954 2526249 2237381 2143015 2170170 2052506 1842351 2208175 2192925 2248196
14529B248196L8582N0478j59244J43311p1879J85964K27710O1692o0380j70765
$$ 2248196 2286778 2337256 2178012 2321323 2249444 2435408 2663118 2724810 2664430 2493665
14519B493665k2266J42650J55800J0015m37410P47630m52284L1488j42874M54792
$$ 2493665 2471399 2614049 2769849 2779864 2342454 3090084 2637800 2669288 2526414 2981206
14509B981206l60621K85018K66668p2800l48677J19183m190L47417k95958R0515
$$ 2981206 2620585 2905603 3172271 3099471 2750794 2869977 2865787 3213204 2917246 3007761
14499C007761M01389K057L2000p4445J05861J70031m28859j35460K32683K76911
$$ 3007761 3409150 3411207 3443207 3368762 3474623 3644654 3215795 3080335 3313018 3589929
14489C589929j10143J65844J22869j94624j31541J06203L70190J98675k33576
$$ 3589929 3479786 3645630 3768499 3573875 3442334 3548537 3918727 4117402 3883826
14480C883826J08657p7246O7720M426J37874N02410m07999M42894l29405k87406
$$ 3883826 3992483 3915237 3982957 3987383 4125257 4627667 4219668 4662562 4333157 4045751
14470D045751N29563K0527j78754J80633M00761l58244K30878k60671J61033j06772
$$ 4045751 4575314 4595841 4417087 4597720 4998481 4640237 4871115 4610444 4771477 4664705
14460D664705K90736j13998P72507l20245k29471L74294r8087l3929n118J15193
$$ 4664705 4955441 4841443 5613950 5293705 5064234 5438528 5340441 5306512 5301394 5416587
14450E416587k65851L74428O7378o0122K64348K5536L31054k36171K58241J77607
$$ 5416587 5150736 5525164 5592542 5532420 5796768 5822304 6153358 5917187 6175428 6353035
14440F353035K72746k58657M92119n60429q570L15235K76187Q0961j2321l6625
$$ 6353035 6625781 6367124 6859243 6298814 6290244 6605479 6881666 6962627 6950306 6913681
14430F913681L33531m97565K3845L60952j46679L30784L75047k07544M65831k60165
$$ 6913681 7247212 6749647 6773492 7134444 6987765 7318549 7693596 7486052 7951883 7691718
14420G691718K56827K36573j71377L87224r9881K13236K66396L23384k52958N24874
$$ 7691718 7948545 8185118 8013741 8400965 8301084 8514320 8780716 9104100 8851142 9376016
14410I376016P53l16409O02533K24435R3209r1401M62814j96919J70826M68435
$$ 9376016 9376769 9060360 9662893 9887328 9980537 9889136 10351950 10155031 10325857 10794292
14400A0794292K28627R1957m7196J30449M91691n4153L72726J35553R1713J24953
$$ 10794292 11022919 11114876 11067680 11198129 11689820 11635667 12008393 12143946 12235659 12360612
14390A2360612L87397k4155M74705k04050O63271J42627K57160N78910M8051N8869
$$ 12360612 12748009 12723854 13198559 12994509 13657780 13800407 14057567 14636477 14684528 14743397
14380A4743397K15070N48686K93890N2860J79981O68870M02L12336M75432M39670
$$ 14743397 14958467 15507153 15801043 15853903 16033884 16702754 16703156 17015492 17490924 17930594
14370A7930594L36184M29216K36055N19378L65394M13907N39927n967M91837L76903
$$ 17930594 18266778 18695994 18932049 19451427 19816821 20230728 20770655 20764688 21256525 21633428
14360B1633428N41486Q27311M78584M88969M79741L20999N39001J119058L84632
$$ 21633428 22174914 23002225 23480809 23969778 24449519 24770518 25309519 26428577 26813209
14351B6813209R32260K36897Q18484Q89108K54484J064273R70624O62412Q73847
$$ 26813209 27745469 27982366 28800850 29689958 29944442 31008715 31979339 32641751 33515598
14342C3515598Q85991Q17588J056702Q07340J467484R44294R60762R91102J395858
$$ 33515598 34401589 35219177 36275879 37083219 38550703 39494997 40455759 41446861 42842719
14333D2842719J174325J257057J583218J536418J536488J239008J643961J725145
$$ 42842719 44017044 45274101 46857319 48393737 49930225 51169233 52813194 54538339
14325E4538339K143246J532787K157370J938343K147858K206216K598340K383210
$$ 54538339 56681585 58214372 60371742 62310085 64457943 66664159 69262499 71645709
14317G1645709K633937K691107K842013L291604K875663L460939L495480M019846
$$ 71645709 74279646 76970753 79812766 83104370 85980033 89440972 92936452 96956298
14309I6956298L795989M189905M161333M955737M845452N237864N827024N553936
$$ 96956298 100752287 104942192 109103525 114059262 118904714 124142578 129969602 135523538
14301A35523538O696718O256623P031732P301315P752149Q227453Q966533R164724
$$ 135523538 142220256 148476879 155508611 162809926 170562075 178789528 187756061 196920785
14293A96920785R875623J0304349J1073544J1091868J2113364J2275687J2869777
$$ 196920785 206796408 217100757 228174301 239266169 251379533 263655220 276524997
14286B76524997J3504465J3823757J4356062J4220044J4623821J4527375J4431756
$$ 276524997 290029462 303853219 318209281 332429325 347053146 361580521 376012277
14279C76012277J3881983J3468963J2521403J1863254J0189206Q068593N180391
$$ 376012277 389894260 403363223 415884626 427747880 437937086 446005679 451186070
14272D51186070K006204M51920N09987P07514k347252k805487o860307q327954
$$ 451186070 453192274 453644194 454154181 454861695 452514443 449708956 442848649 434520695
14264D34520695r314021j1266686j2599747j3692567j3956882j5060413j4602127
$$ 434520695 425206674 413939988 401340241 387647674 373690792 358630379 344028252
14257C44028252j4625146j4456322j4498739j3879769j2856747j2333164j2402617
$$ 344028252 329403106 314946784 300448045 286568276 273711529 261378365 248975748
14250B48975748j1999139j1080465j1228797j0269741r880775q602074q451695
$$ 248975748 236976609 225896144 214667347 204397606 194516831 185914757 177463062
14243A77463062q046960p967414p343987o959568o585604n629892n931763n513608
$$ 177463062 169416102 161448688 154104701 147145133 140559529 134929637 128997874 123484266
14235A23484266n320398m799311n140307m016936l528789m368351l694821l512140
$$ 123484266 118163868 113364557 108224250 104207314 100678525 96310174 92615353 89103213
14227H9103213l363837l385646k930950k878120k540146l129934k031781k334282
$$ 89103213 85739376 82353730 79422780 76544660 74004514 70874580 68842799 66508517
14219F6508517k295480j741837k344950j971974j781316j714471j134020j975086
$$ 66508517 64213037 62471200 60126250 58154276 56372960 54658489 53524469 51549383
14211E1549383j568845j693170j256127r97747j012904j287324j557075j224005
$$ 51549383 49980538 48287368 47031241 46033494 45020590 43733266 42176191 40952186
14203D0952186j293603q11469j082881n05588j378703j008332q84273p90675j143808
$$ 40952186 39658583 38847114 37764233 37258645 35879942 34871610 33987337 33196662 32052854
14194C2052854n79686m02149r45182p61282o97053q92112j67746j162225m36026
$$ 32052854 31473168 31071019 30125837 29364555 28667502 27775390 27607644 26445419 26009393
14185B6009393j23237j188550k52943m46492l40920n23720p30168k43109n70483
$$ 26009393 25886156 24697606 24444663 23998171 23657251 23133531 22403363 22160254 21589771
14176B1589771o41027m63541j01593l25197m50944n67690l34161k04003o60594
$$ 21589771 20948744 20485203 20383610 20058413 19607469 19039779 18705618 18501615 17841021
14167A7841021j97895k75942l25263k00188j18251o79696k02438l52344k41186
$$ 17841021 17643126 17367184 17041921 16841733 16723482 16043786 15841348 15489004 15247818
14158A5247818O2441m13322k54961j93076m19447m43832N1848K3432o60056l41159
$$ 15247818 15310259 14896937 14641976 14448900 14029453 13585621 13637469 13660901 13000845 12659686
14148A2659686K23188o6684n04012k21965j79782l79129Q1660p5587l06607l34185
$$ 12659686 12882874 12816190 12312178 12090213 11910431 11531302 11612962 11537375 11230768 10896583
14138A0896583m4100k70175m0123k42396j79560j04631j75973j61545j8782j96318
$$ 10896583 10852483 10582308 10542185 10299789 10120229 10015598 9839625 9678080 9659298 9462980
14128I462980O2126m44608Q7827k16922l7473j77870j23435Q52J806l93416J10259
$$ 9462980 9525106 9080498 9168325 8951403 8913930 8736060 8612625 8613477 8615283 8221867 8332126
14117H332126k33510l2048r1080m61369J65993k42359K49817k85276j769P412
$$ 8332126 8098616 8066568 7975488 7514119 7680112 7437753 7687570 7402294 7400525 7407937
14107G407937p97k05043m42993L9920R4446j85702k32791K54892j82596j79950
$$ 7407937 7407140 7202097 6759104 6799024 6893470 6707768 6474977 6729869 6547273 6367323
14097F367323j50862Q7881J7067k23589j76109K40564m81385L52177n20507J66668
$$ 6367323 6216461 6304342 6321409 6097820 5921711 6162275 5680890 6033067 5512560 5679228
14087E679228K5170j85664l53699N16993k14796j28063o0731N5288m15264L69275
$$ 5679228 5704398 5518734 5165035 5682028 5467232 5339169 5278438 5333726 4918462 5287737
14077E287737n48718O62131m86964J84570l47994m0255J11189j12226k19696o6851
$$ 5287737 4739019 5401150 4914186 5098756 4750762 4710507 4821696 4709470 4489774 4422923
14067D422923L8699n4686L07481n17816J96822p3114Q0746k6466J91642m80387
$$ 4422923 4461622 4406936 4714417 4196601 4393423 4320309 4401055 4374589 4566231 4085844
14057D085844K44761k03361j19157J62322l66280j51092J60559j65603J36473
$$ 4085844 4330605 4127244 4008087 4170409 3804129 3653037 3813596 3647993 3784466
14048C784466l6781j64108K05697l66501K49843n754M3150q1877r7801n4392K51452
$$ 3784466 3747685 3583577 3789274 3422773 3672616 3666862 3710012 3628135 3530334 3475942 3727394
14037C727394m27670L0953j15458K61314q3750m4207m3555O488L1340M9135m10068
$$ 3727394 3299724 3330677 3215219 3476533 3392783 3348576 3305021 3311509 3342849 3391984 2981916
14026B981916J5480l7744L14623k66446l5835j01599k08191M46001j80881j78846
$$ 2981916 2997396 2959652 3274275 3007829 2971994 2870395 2662204 3108205 2927324 2748478
14016B748478n8674M4650K65185j99500k46353L2615L51252l89227k06618K53713
$$ 2748478 2689804 2734454 2999639 2800139 2553786 2586401 2937653 2548426 2341808 2595521
14006B595521r5053j5595k26902L60943k37784k6061J80407j36630J20647j33414
$$ 2595521 2500468 2484873 2257971 2618914 2381130 2355069 2535476 2398846 2519493 2386079
13996B386079m56312N35838k50981K39875j66036K83382M31452J111553L194972
$$ 2386079 1929767 2465605 2214624 2454499 2288463 2571845 3003297 4114850 7309822
13987G309822P866298J7819057J4613918k1553805j2849944m975295k021020r05554
$$ 7309822 15176120 32995177 47609095 26055290 13205346 8230051 6209031 5303477
13979E303477q01917n00694m04173j02169k30691o8337m04471Q6681J68122j20494
$$ 5303477 4501560 4000866 3596693 3494524 3263833 3195496 2791025 2877706 3045828 2925334
13969B925334M5605j58568j34342j5455J39001m02589L9728L20379n3500m69155
$$ 2925334 2970939 2812371 2678029 2662574 2801575 2398986 2438714 2759093 2705593 2236438
13959B236438L58472l98262l06112L55352k20143K83555K29993m55557L47410
$$ 2236438 2594910 2196648 1890536 2245888 2025745 2309300 2539293 2083736 2431146
13950B431146l35532j23870N541j52181L27582r5378j9086M32608o52816K54319
$$ 2431146 2095614 1971744 1977285 1825104 2152686 2057308 2038222 2470830 1818014 2072333
13940B072333l26309N18544k96445J32164k80146K95153k84050J03473O277l49702
$$ 2072333 1746024 2264568 1968123 2100287 1820141 2115294 1831244 1934717 1940994 1591292
13930A591292K86563j29538K8592j89831M09300l00429L5177J1125p4572L0016
$$ 1591292 1877855 1748317 1776909 1587078 1996378 1695949 1731126 1742251 1667679 1697695
13920A697695o9313R8588k26405M64352k77907j32154K21020l00170L6338J97103
$$ 1697695 1628382 1726970 1500565 1964917 1687010 1554856 1775876 1475706 1512044 1709147
13910A709147R064j52783L0783n8173k2253K2799l7513n2862K04841m48202J87208
$$ 1709147 1718211 1565428 1596211 1538038 1515785 1538584 1501071 1448209 1653050 1204848 1392056
13899A392056J90422l18348L28803J5103l74954J70218K00056k38488j69492J08610
$$ 1392056 1582478 1264130 1592933 1608036 1233082 1403300 1603356 1364868 1195376 1303986
13889A303986J065p1242J92720j03929O0424K13787l63961L52381k83545k6806
$$ 1303986 1305051 1233809 1426529 1322600 1383024 1596811 1232850 1585231 1301686 1274880
13879A274880K29756N2168k98264J16541k50996r5921R6238K82017J34811k07939
$$ 1274880 1504636 1556804 1258540 1375081 1124085 1028164 1124402 1406419 1541230 1333291
13869A333291j68705J77507n1750k70421J51407J53068m6785P8201m55296J8581
$$ 1333291 1164586 1342093 1290343 1019922 1171329 1324397 1277612 1355813 900517 919098
13859I19098J78121l3161J06561M19695n36570N2028L46910m18840N72254o88875
$$ 919098 1097219 1064058 1170619 1590314 1053744 1105772 1452682 1033842 1606096 917221
13849I17221M22949Q3179j39866k08767O414p2721L16407J25081r4973k61983
$$ 917221 1340170 1423349 1283483 1074716 1081130 1008409 1324816 1449897 1354924 1092941
13839A092941j23163O2481K4264k87463L63963p2538J86776l27788o7107J34562
$$ 1092941 969778 1032259 1056523 769060 1133023 1060485 1247261 919473 852366 986928
13829I86928Q0643j6391K55336k57196m12463L20373J8591k6205K73032l74218
$$ 986928 1067571 1051180 1306516 1049320 636857 957230 975821 949616 1222648 848430
13819H48430J02155P7199j86855j92813K03679j2382j57935K60295L33937m81188
$$ 848430 950585 1027784 840929 648116 851795 839413 681478 941773 1275710 794522
13809G94522K98564j11592k38531K90677J22531k40310K93103E55131K70581R4182
$$ 794522 1093086 981494 742963 1033640 1156171 915861 1208964 555131 825712 919894
13799I19894K26174l05492J69044k99496J96623J8947j69738O599J37393k09256
$$ 919894 1146068 840576 1009620 710124 906747 925694 755956 762555 899948 690692
13789F90692J30846L42908o3701j1249m2277k03354K68254j40079k69864K74251
$$ 690692 821538 1164446 1100745 1089496 1047219 843865 1112119 972040 702176 976427
13779I76427j81878M1737L5050j43149N4827C24395N79803k40569K94479j98169
$$ 976427 794549 836286 871336 728187 783014 324395 904198 663629 958108 759939
13769G59939J31636j16691l9910J23291C66641L27270l5145J53284j11063Q1320
$$ 759939 891575 774884 734974 858265 366641 693911 658766 812050 700987 782307
13759G82307n1617l06344K39744J83923O358j78945k32301N8285P1125R2493k20285
$$ 782307 730690 424346 664090 848013 854371 675426 443125 501410 572535 665028 444743
13748D44743K01106L1722O9739j19090J18539k69545M59001m43735J88332j96597
$$ 444743 645849 677571 747310 628220 746759 477214 936215 492480 680812 484215
13738D84215O6627K67489n8778k82434M50194m08446K06998Q9026A89309L41021
$$ 484215 550842 818331 759553 477119 927313 518867 725865 814891 189309 530330
13728E30330J62181J19698l48874J73940n8899N4087k42624K96341j39365K38297
$$ 530330 692511 812209 463335 637275 578376 632463 389839 686180 546815 785112
13718G85112M1085l02756m4801r0325M31012q1458j40605P7616j29264k52130
$$ 785112 826197 523441 478640 388315 819327 737869 597264 674880 545616 293486
13708B93486L77406L6067k17402O4133O760M8146A84176K58691K86493j51558
$$ 293486 670892 706959 489557 553690 560450 608596 184176 442867 729360 577802
13698E77802O2545K1457O5789B82218L09635L59086D36493J34950B72296L59930
$$ 577802 640347 661804 727593 282218 591853 950939 436493 571443 272296 632226
13688F32226n8366J22233j50863m2059M11079k73695K7135m1096j13557Q8065
$$ 632226 573860 696093 545230 503171 914250 640555 667690 626594 513037 601102
13678F01102r6910m2876M92585l90038j18791L12130j19925j77008j9610k883
$$ 601102 504192 461316 953901 563863 445072 757202 637277 460269 440659 437776
13668D37776J73919B97839M94483L4313k34222B5728O62833k01243K53950k11898
$$ 437776 611695 297839 792322 826635 592413 25728 688561 487318 741268 529370
13658E29370L14136k29146J24195k19868K18781l60605J93600j93424N90365C38371
$$ 529370 843506 614360 738555 518687 737468 376863 570463 377039 967404 338371
13647A66644L23576j30034N7758L2100j17918j7653J95653j48695M90874l09062
$$ 166644 490220 360186 417944 450044 332126 314473 510126 361431 852305 543243
13637E43243A26283J8493M40606J93548k60563k09604J6368J40073L79605D03438
$$ 543243 126283 144776 585382 778930 518367 308763 325131 465204 844809 403438
13626B24830r445K28270j79316J65337l1831j89470N37710l72694L2900k00803
$$ 224830 215385 443655 264339 429676 397845 208375 746085 373391 406291 205488
13616B05488J87245l9276M5544K58902k53409J5664p2764L85420k84304Q5006
$$ 205488 392733 353457 399001 657903 404494 420158 347394 732814 448510 533516
13606E33516A31002K97374J96210A00666J43536a8586D06462A39697J74673J12110
$$ 533516 131002 428376 624586 100666 244202 -18586 406462 139697 314370 426480
13596D26480J1528P0422j78303l0200o281l2720L36491H671M79331B31378L82782
$$ 426480 438008 508430 330127 299927 293646 260926 597417 8671 488002 231378 614160
13585F14160l9547p3541O7535n3845j91133J09572N0400r6836J13487Q1888B89951
$$ 614160 574613 501072 568607 514762 323629 433201 483601 386765 500252 582140 289951
13573D05046O1024P8759B67556q4402K89721J58289k34987L7003p2962N1880R4889
$$ 405046 466070 544829 267556 183154 472875 631164 396177 433180 360218 412098 506987
13562E06987j04760j0552K13653j60672B01081L34995j93155K9653j3887n5204
$$ 506987 402227 391675 605328 444656 201081 536076 342921 372574 358687 303483
13552C03483K2004L41981B50265J1829J41628N2500J34526j78714K9166A16244
$$ 303483 325487 667468 250265 262094 403722 456222 590748 412034 441200 116244
13541B55027J49271J24815A97588J03885H6586K00855L05587k32877K29614B16055
$$ 255027 404298 529113 197588 301473 86586 287441 593028 360151 589765 216055
13530D55355K77095B93013M9510L45152j12786J3137k37774l3816J81034k48480
$$ 455355 732450 293013 342523 687675 574889 588026 350252 316436 497470 248990
13520B48990J60026j07758A02807M16436N8363a9447A46441K01555m3736A35875
$$ 248990 409016 301258 102807 519243 577606 -19447 146441 347996 304260 135875
13509B73836j17630J21172k1756R4579j25777M4477o0478R3892J70298O3204n9633
$$ 273836 156206 277378 255622 350201 224424 268901 208423 302315 472613 535817 476184
13498D76184j31999K43880E7528K43812j02321K83545j71110m9848H6310K71960
$$ 476184 344185 588065 57528 301340 199019 482564 311454 261606 86310 358270
13488C58270R5530O5456B13830A923J50313j3585J10584K22629k10423J25434
$$ 358270 453800 519256 213830 1923 152236 138651 249235 471864 261441 386875
13478C86875J50437A35369L00767A5435L45321J34987A85504L3690J60353J8336
$$ 386875 537312 135369 436136 15435 360756 495743 185504 219194 379547 397883
13468C97883j0263j5026j61975L8853n4689E1716L28209j69067J62916H1352B149
$$ 397883 387620 372594 210619 249472 194783 51716 379925 210858 373774 81352 2149
13456D55909q7885j44894J13827J22802n1015K2347A30647N50016j68272C2968
$$ 455909 368024 223130 336957 459759 408744 431091 130647 680663 512391 32968
13445B61233D3765K39222H990L46557p8894E4850L00429A31392M07252A10489
$$ 261233 43765 282987 8990 355547 276653 54850 355279 131392 538644 110489
13434C1507M65A4380M16827B12105j5281L0255J22571K618P8638r2830j68051
$$ 31507 31972 14380 431207 212105 196824 227079 349650 352268 430906 338076 170025
13423A70025L92867B22829A01954J74063I4264J47132R7790L40381A55399J26294
$$ 170025 562892 222829 101954 276017 94264 241396 339186 679567 155399 281693
13413B81693A8082L39569j617L49545A08216J79858j9248K23257j39877o8184
$$ 281693 18082 357651 356034 705579 108216 288074 268826 492083 352206 284022
13403B84022J6501J65876B21771a82314D23334j31551J16201k7004j03563J1827
$$ 284022 300523 466399 221771 -182314 423334 291783 407984 380980 277417 289244
13393B89244j37534k966O325K42082I8365a81789C30248A08275j092a34131B62205
$$ 289244 151710 148744 155069 397151 98365 -181789 330248 108275 107183 -134131 262205
13381C37391c977A67857K46175d0505B64834K8882q3467D4187L15474j58483K76613
$$ 337391 -3977 167857 414032 -40505 264834 293716 210249 44187 359661 201178 477791
13370D77791I2844K57146J17802A21846B5528j1975h214A78635R1932q5020K09919
$$ 477791 92844 349990 467792 121846 25528 13553 -8214 178635 270567 185547 395466
13359C95466J20389j29661J28598c0055A04131K0491K13022a29429C57175j78214
$$ 395466 515855 386194 514792 -30055 104131 124622 337644 -129429 357175 178961
13349A78961L0058K6966L03424A91913Q0815P2970M18080l57478n707a71259D96823
$$ 178961 209019 235985 539409 191913 272728 345698 763778 406300 400593 -171259 496823
13337D15075r0502L2612P3770r5285p123g9409A97230a62619C74674j14337o4230
$$ 415075 324573 357185 430955 335670 328547 -79409 197230 -162619 374674 260337 196107
13326A96107N401i793j973A82716K32081K5715M9119j24460j50183K25956l9220
$$ 196107 201508 -9793 -11766 182716 414797 440512 489631 365171 214988 440944 401724
13315D01724A06745N14052B16440m7442L2269L633b12666B30343m7865P7873P1497
$$ 401724 106745 620797 216440 168998 201267 204900 -212666 230343 182478 260351 331848
13304C31848D8258J00155N1975R15n9440K79668A13146L11494l4226c08548a08465
$$ 331848 48258 148413 200388 201303 141863 421531 113146 424640 390414 -308548 -108465
13292I7889f7485j09072B23914F8475J50964K23643o2094j50126O941J76483I3918
$$ 97889 -67485 -176557 223914 68475 219439 443082 380988 230862 237803 414286 93918
13280B11510l0980K4364c5613A18038a59867A52550k2954C0134f9046A30072F2858
$$ 211510 180530 204894 -35613 118038 -159867 152550 129596 30134 -69046 130072 62858
13268B58757b47452C60098a402j69894G2095Q8998M8169K905n3575B0354J80368
$$ 258757 -247452 360098 -1402 -171296 72095 161093 209262 212167 158592 20354 200722
13257B00722p3236E1500a4541B20435G1045A6492i4229A02293D1436R8347M5816
$$ 200722 127486 51500 -14541 220435 71045 16492 -94229 102293 41436 139783 185599
13246A85599q4453P7800l9174p952C3307L3374a17291E8752L2521O6865Q8850
$$ 185599 101146 178946 139772 131820 33307 66681 -117291 58752 91273 158138 246988
13235B46988A04492N6980l5031j0191L25948B7513K8564K63179j688A057J92669
$$ 246988 104492 161472 126441 116250 442198 27513 56077 319256 317568 1057 193726
13224A93726O2384H4133L36306A48462e2124j18927D00392j72882K55024p4958
$$ 193726 256110 84133 420439 148462 -52124 -171051 400392 227510 482534 407576
13214D07576C6638b85895B37526e3518B38116A3391K07697J227H5061J17563k8659
$$ 407576 36638 -285895 237526 -53518 238116 13391 221088 222315 85061 202624 173965
13203A73965K7090O9887a68094k43845e7781A56685M08571A14453L3660a3498
$$ 173965 201055 270942 -168094 -411939 -57781 156685 565256 114453 148113 -13498
13192A20598r650K23449j20057L7196h9771B04057g0194b0694B99446H6264a64820
$$ 120598 110948 334397 214340 251536 -89771 204057 -70194 -20694 299446 86264 -164820
13180B53228B0966N15046c92A68853D3628M2764j8628B9429d6314B61675J66455
$$ 253228 20966 536012 -392 168853 43628 86392 67764 29429 -46314 261675 428130
13169D28130H635J58613a18822A88820c60115C1067j1875a03030B06567D5897
$$ 428130 8635 167248 -118822 188820 -360115 31067 19192 -103030 206567 45897
13158A09526m5459J29597d3777R32A84918N7813m690n8507C5674J17334E6489
$$ 109526 64067 193664 -43777 -42845 184918 242731 238041 179534 35674 153008 56489
13146e815G9636c5227I8410J27025r8682P4924n7601a71129e8140K8725B58592
$$ -5815 79636 -35227 98410 225435 126753 201677 144076 -171129 -58140 -29415 258592
13134C65692f5426a2867q200j1042j20782A0988J94645R6730D0499L16753b05878
$$ 365692 -65426 -12867 -21067 -32109 -152891 10988 205633 302363 40499 357252 -205878
13122a71864P4599A37004n8263e9530C12302b59368D21562A62626B2648a38723
$$ -171864 -97265 137004 78741 -59530 312302 -259368 421562 162626 22648 -138723
13111C12667d3262F1645K2802J1964M3639b1064B71127A05561A1632b35171C3712
$$ 312667 -43262 61645 84447 96411 140050 -21064 271127 105561 11632 -235171 33712
13099C59426A03639J86749j21002m302N6361l6478l2887j9435i7818A89556H0896
$$ 359426 103639 290388 169386 165084 221445 184967 152080 132645 -97818 189556 80896
13087A73370o4142a82847B44560o1599m5151P9859b6988B81040A25453J45293
$$ 173370 109228 -182847 244560 182961 137810 217669 -26988 281040 125453 270746
13077B70746A20047J37736i9606A06865A9512J26784J28330q9743J37034A20259
$$ 270746 120047 257783 -99606 106865 19512 146296 274626 184883 321917 120259
13066B12017a90081C05537j42347L56887E9078J59722P5008A02371c53644a9800
$$ 212017 -190081 305537 163190 520077 59078 218800 293808 102371 -353644 -19800
13055c51012a39527a0460j03184J6935C6913L9595J21041o2139J89761b07974
$$ -351012 -139527 -10460 -113644 -96709 36913 76508 197549 135410 325171 -207974
13044A96333K7415J37793A13959N0375J7463n6242M8622a0304o0473B00720h1263
$$ 196333 223748 361541 113959 164334 181797 125555 174177 -10304 -70777 200720 -81263
13032D6984M03273a74474P8509A29766N0064P5473h2556j9319A74173E1240f5316
$$ 46984 450257 -174474 -95965 129766 179830 255303 -82556 -101875 174173 51240 -65316
13020A34201J02493h6887D544J46260a47144b3140B177K43241j9766a66707H1217
$$ 134201 236694 -86887 4544 150804 -147144 -23140 2177 245418 225652 -166707 81217
13008I4458J11324D6168a52784A7403J7381K01647J137J97833A36836f9873A57852
$$ 94458 205782 46168 -152784 17403 34784 236431 237568 435401 136836 -69873 157852
12996D99M04620A14230J41688d73601B27690o2886a12907A40862m5007K39553
$$ 499 405119 114230 255918 -473601 227690 164804 -112907 140862 95855 335408
12986C35408a0691k76034A59060L37521G2084a6500q5356I6041J03986O7074j07618
$$ 335408 -10691 -286725 159060 496581 72084 -16500 -101856 96041 200027 267101 159483
12975A59483h306F3241J52167Q2544C4570K13409R5063h4172C1500J78203R6924
$$ 159483 -8306 63241 215408 297952 34570 247979 343042 -84172 31500 209703 306627
12964C06627A171Q1514i3708c0749A51961J30968j20681D1215K5405K03705q4284
$$ 306627 1171 82685 -93708 -30749 151961 282929 162248 41215 66620 270325 186041
12953A86041f8055A34340e7144A46934M5656a72413B92978A12496R6333a10304
$$ 186041 -68055 134340 -57144 146934 192590 -172413 292978 112496 208829 -110304
12942b17029A21875K38689b86028k7098P5898H8364K36748J2428c3390B87490
$$ -217029 121875 360564 -286028 -313126 -237228 88364 325112 337540 -33390 287490
12931B19130g6713I6251g523F1084R0243L37726b6986l15848c5456c094C87270
$$ 219130 -76713 96251 -7523 61084 151327 489053 -26986 -342834 -35456 -3094 387270
12919a85012N2374F1799a56544e5485B69602b05557A23460k4809P9330c41549
$$ -185012 -132638 61799 -156544 -55485 269602 -205557 123460 98651 177981 -341549
12908D52183c99A45239a43346A28798b14213B85172b48718a04212j67344f5622
$$ 452183 -399 145239 -143346 128798 -214213 285172 -248718 -104212 -271556 -65622
12897E1555N2347C5551M15344A39747b56429I9692Q9872k3597G5651N7088J64531
$$ 51555 103902 35551 450895 139747 -256429 99692 189564 165967 75651 132739 297270
12886B97270j20845a85041d0437m0448M981j41079A70843c2654l27531A36659
$$ 297270 176425 -185041 -40437 -80885 -75904 -216983 170843 -32654 -360185 136659
12875A20606e3643d370o4221F0261b97345K7058g9958A73420b72207A93597l2366
$$ 120606 -53643 -4370 -68591 60261 -297345 -270287 -79958 173420 -272207 193597 161231
12864A61231a01531B89439J10234A53112l022C4834f3890A51121L20332c5138
$$ 161231 -101531 289439 399673 153112 150090 34834 -63890 151121 471453 -35138
12853F0982K49744A3172a26592j5320j01794A39957L1678K4899J16893a14309
$$ 60982 310726 13172 -126592 -141912 -243706 139957 171635 196534 313427 -114309
12842f2730A12266J9940C3140c8474A11210J50685p2936M6511A1601b9007j26462
$$ -62730 112266 132206 33140 -38474 111210 261895 188959 235470 11601 -29007 -155469
12831a55469A78904N6490d1818D3988J42944M539k2521F4328B9225a25818m9187
$$ -155469 178904 235394 -41818 43988 186932 191471 168950 64328 29225 -125818 -175005
12820a75005B48723b09186P6379j13635B17884o1610g8406C91923A16785f4088
$$ -175005 248723 -209186 -132807 -246442 217884 156274 -78406 391923 116785 -64088
12809C83746I7874a52286B17909b51440R8564L2041B69772d9872g921j04409A36318
$$ 383746 97874 -152286 217909 -251440 -152876 -120835 269772 -49872 -7921 -112330 136318
12797A82462b05812B22946n4666i2724B56889a38534I8818E247a08817I8722A1528
$$ 182462 -205812 222946 168280 -92724 256889 -138534 98818 5247 -108817 98722 11528
12785a70130A8776B808K73587e2479A06125J33419r4754F7491d3144B03493l2928
$$ -170130 18776 2808 276395 -52479 106125 239544 144790 67491 -43144 203493 170565
12774A70565f3197A78808F9220J07861O9255J58288a58500A46411h6879j50685
$$ 170565 -63197 178808 69220 177081 246336 404624 -158500 146411 -86879 -237564
12764b37564F1740c9178j48557e5720H6402a66345A48284O396g7993A59550E1563
$$ -237564 61740 -39178 -187735 -55720 86402 -166345 148284 154680 -77993 159550 51563
12752C4857J16625J24893a08166A46163B9363b29595A03144c8409A50597C5770
$$ 34857 151482 276375 -108166 146163 29363 -229595 103144 -38409 150597 35770
12741A9219Q4096a43110D980K31643a82016P2875m3910A03985K86557a00714D04331
$$ 19219 103315 -143110 4980 236623 -182016 -109141 -153051 103985 390542 -100714 404331
12729G175Q8663b7437A42299k8121n2251E999e9592A19688O884J50345J9281e7096
$$ 7175 95838 -27437 142299 114178 61927 5999 -59592 119688 126572 276917 296198 -57096
12716G5108b3898B07834p0557k8400a55704C32183A26136a23073B354J46874n1993
$$ 75108 -23898 207834 137277 108877 -155704 332183 126136 -123073 2354 149228 97235
12705I7235c0554D27696g2943A04113Q4780l8559a72473d2872A06273L1162k6517
$$ 97235 -30554 427696 -72943 104113 188893 150334 -172473 -42872 106273 137435 110918
12694A10918j0978f4048K1404A99848a56562A14660L4070g893b125j19703B20437
$$ 110918 99940 -64048 -42644 199848 -156562 114660 148730 -7893 -2125 -121828 220437
12682C783c2081A43489K27423a94420B67959f8360l9186A5741a58841N7375L3614
$$ 3783 -32081 143489 370912 -194420 267959 -68360 -107546 15741 -158841 -101466 -67852
12671f7852J1428b143A97616p3414Q3382G1077J96793b7540B01498l5782J06797
$$ -67852 -56424 -2143 197616 124202 207584 71077 267870 -27540 201498 165716 272513
12660B72513j08430A8147M11969j95072D6558L39231B9668K32530n7902h7327
$$ 272513 164083 18147 430116 235044 46558 385789 29668 262198 204296 -87327
12649B56961A13138M8353p7254a49076G8415J52012a90520B39433d9076B25483
$$ 256961 113138 161491 84237 -149076 78415 230427 -190520 239433 -49076 225483
12638D9492R3973L44916a21177E4918b70074E41265A06747a27910F7547L8557
$$ 49492 143465 488381 -121177 54918 -270074 541265 106747 -127910 67547 106104
12628A06104L45844j28934j16698J91422H0260R7622J34001f2654B81675K71381
$$ 106104 451948 323014 206316 397738 80260 177882 311883 -62654 281675 553056
12618E53056A69236k8030b35595C44649a12390j8441N6605G6335Q2745P1682k8991
$$ 553056 169236 141206 -235595 344649 -112390 -130831 -74226 76335 159080 230762 201771
12607B01771b67754F4304d1322A70926C5053h3840B48244h145r5348B71865g2589
$$ 201771 -267754 64304 -41322 170926 35053 -83840 248244 -8145 -103493 271865 -72589
12595B39001A13276a14586G5735l0604a17906p7422R2089D80983D840J9293J46894
$$ 239001 113276 -114586 75735 45131 -117906 -195328 -103239 480983 4840 24133 171027
12584A71027H0948g4689J7211E7086Q9580e6247C2601l901J49035b5884j83274
$$ 171027 80948 -74689 -57478 57086 146666 -56247 32601 28700 177735 -25884 -209158
12573b09158O340i6540F4085J48477E0014R5812a3584A09695a5585k7150I7657
$$ -209158 -202818 -96540 64085 212562 50014 145826 -13584 109695 -15585 -42735 97657
12561A03764R6597H8884O5399n0914m1118a72577A2296J01409E6040J61478J55114
$$ 103764 200361 88884 154283 103369 62251 -172577 12296 113705 56040 217518 372632
12550C72632H7554a49248H0318J72499e9766o1055A46931a92042B15744J17983
$$ 372632 87554 -149248 80318 252817 -59766 -120821 146931 -192042 215744 333727
12540C33727G203b6331G2209K95007a52443I4172A0844J32140J2633P7586B3139
$$ 333727 7203 -26331 72209 367216 -152443 94172 10844 142984 155617 233203 23139
12528e4882E2483a39392j23066d2811q0678b063k73529E6486g8216D0684A4757
$$ -54882 52483 -139392 -262458 -42811 -123489 -2063 -275592 56486 -78216 40684 14757
12516c42656A51843g5271B17204a39352I766b60214k171I0314e1897C01288A44272
$$ -342656 151843 -75271 217204 -139352 9766 -260214 -262385 90314 -51897 301288 144272
12504B75713L98614k75620j6538b57628B54870p9850b94728J44283K3B00028G5057
$$ 275713 674327 398707 382169 -257628 254870 175020 -294728 -150445 -150422 200028 75057
12492A28494M8795c1196H1984e8864B12578c1928E2361M4602L19023a36089B07418
$$ 128494 177289 -31196 81984 -58864 212578 -31928 52361 96963 415986 -136089 207418
12480B85846A39602g8075o4016B43825a48995B58040A11429D6398J89027m4482
$$ 285846 139602 -78075 -142091 243825 -148995 258040 111429 46398 235425 190943
12470A90943F0739M7810K78111a5929c073C2608e6205j82554B26178J20553b9367
$$ 190943 60739 108549 386660 -15929 -3073 32608 -56205 -238759 226178 346731 -29367
12458b0228A07474h5374l7640b1596F1312k9050J81044A03615a56271B29357e3457
$$ -20228 107474 -85374 -123014 -21596 61312 32262 213306 103615 -156271 229357 -53457
12446A90797F3875b24716A0167h6804E7837B1943c54244a28141A06573a06281
$$ 190797 63875 -224716 10167 -86804 57837 21943 -354244 -128141 106573 -106281
12435H4115a03483C70824E442M5591J15424h3095a6073E6693Q7258b5812A32401
$$ 84115 -103483 370824 5442 51033 166457 -83095 -16073 56693 143951 -25812 132401
12423G9484g9331N351j1654c7083R616A76306o4951J73792a27727j2947B55759
$$ 79484 -79331 -73980 -85634 -37083 -27467 176306 111355 285147 -127727 -140674 255759
12411a57137A24861b3887j4626C1933J40095l1360o0413a0282B80289a01393d1416
$$ -157137 124861 -23887 -38513 31933 172028 140668 80255 -10282 280289 -101393 -41416
12399b97124L3360A4900F195K46048c5987C91951A03627L7789K8748b21679I14
$$ -297124 -263764 14900 6195 252243 -35987 391951 103627 141416 170164 -221679 914
12387a34913B69932A01067J9762L3274a68470B12319c06528M8181B71632i939
$$ -134913 269932 101067 120829 154103 -168470 212319 -306528 -258347 271632 -9939
12376B3842M03324i3649k06905b1752D53103a9632n3873c1775F5873a64571E0542
$$ 23842 427166 -93649 -300554 -21752 453103 -19632 -73505 -31775 65873 -164571 50542
12364A57234g0218C03809A22701B1264a99147A56661K9420q6396M4635m5122J49040
$$ 157234 -70218 303809 122701 21264 -199147 156661 186081 99685 144320 99198 248238
12353B48238f1926A87821J3774a05032H1447a24619A92514i2719A22722J8657
$$ 248238 -61926 187821 201595 -105032 81447 -124619 192514 -92719 122722 141379
12343A41379k6769a39957L642e5074E1543f4581o8061j75867A85645a8499A19601
$$ 141379 114610 -139957 -136315 -55074 51543 -64581 -132642 -308509 185645 -18499 119601
12331h8621j7136B99761o7703d1589B71962g0277B91699j34373a7648j35625c7735
$$ -88621 -105757 299761 232058 -41589 271962 -70277 291699 157326 -17648 -153273 -37735
12319A56224l7850E7414a01886A97460q8041h3205A41776D6828a12936L4235B9726
$$ 156224 118374 57414 -101886 197460 109419 -83205 141776 46828 -112936 -78701 29726
12307A3327g1145j21762Q523h8481A52236n929e3329a3806p8504G3095g9157j44530
$$ 13327 -71145 -192907 -184384 -88481 152236 146307 -53329 -13806 -92310 73095 -79157 -223687
12295b23687B95490r2192H4005C2619K50937i3628B66901d0653A43493k2991K71146
$$ -223687 295490 203298 84005 32619 283556 -93628 266901 -40653 143493 120502 391648
12284C91648a99802E9728l644K76907A1631K9824a96466A22925a56804C88686
$$ 391648 -199802 59728 56084 332991 11631 41455 -196466 122925 -156804 388686
12273i2352A42403J95611E6146b07229j34018a36501d8057B10291b14677D4142
$$ -92352 142403 338014 56146 -207229 -341247 -136501 -48057 210291 -214677 44142
12262F1490e2295A71929J06728Q2609q3293j26651c5966C68595A18673j5433K51000
$$ 61490 -52295 171929 278657 361266 277973 151322 -35966 368595 118673 103240 354240
12251C54240j69381B248K73001f5942A83250n2055f2225A09149M63079j44934
$$ 354240 184859 2248 275249 -65942 183250 131195 -62225 109149 572228 427294
12241D27294A50360o213M1405g9564B66549n4562a68558l3487C05804A29688a89327
$$ 427294 150360 144147 185552 -79564 266549 211987 -168558 -202045 305804 129688 -189327
12229c7111A38052R99P2313k5653r1157B2249J21303J41774P4309a15819A95259
$$ -37111 138052 139051 211364 185711 94554 22249 143552 285326 359635 -115819 195259
12217B16164L10373a5998B53865P5890a73077G4569a56466k13508A55947p0824
$$ 216164 526537 -15998 253865 329755 -173077 74569 -156466 -369974 155947 85123
12207H5123b4304A56183J25697j38224Q2505a267A30837K81515D1691K68713R9356
$$ 85123 -24304 156183 281880 143656 226161 -1267 130837 412352 41691 310404 409760
12196D09760B01910J4810J96926A76688L00774A05301J90431j5092D9473J49717
$$ 409760 201910 216720 413646 176688 477462 105301 295732 280640 49473 199190
12186A99190l0422A2891b138A00228j1516Q2267p7641J01161c06148G02160C21534
$$ 199190 168768 12891 -2138 100228 88712 170979 93338 194499 -306148 702160 321534
12174g0049D06494A78919l2119K21031A33477J4114K04641a32215F09623d0758
$$ -70049 406494 178919 146800 367831 133477 147591 352232 -132215 609623 -40758
12163I3098P0827O6134f0240q0029A61108k6928R15j210L450j3510a82527D97971
$$ 93098 163925 230059 -60240 -140269 161108 134180 135095 133885 137335 123825 -182527 497971
12150c8332a2675A65704c78310G2254a60998Q0310H561e572j50182B61820I2583
$$ -38332 -12675 165704 -378310 72254 -160998 -80688 8561 -5572 -155754 261820 92583
12138G0561A8686K7463h9868I8182g834k51810Q8284O4871A73200N453p2769A1726
$$ 70561 18686 46149 -89868 98182 -7834 -259644 -171360 -106489 173200 178653 105884 11726
12125c23496J00207A36006K65453i7624K202K8770k3032j7458I8130N8820k3488
$$ -323496 -223289 136006 401459 -97624 -95422 -66652 -89684 -107142 98130 156950 133462
12114A33462a19198B57007b70936F0163J35332i6066B00771a66567A44904J18665
$$ 133462 -119198 257007 -270936 60163 195495 -96066 200771 -166567 144904 263569
12104B63569e76A78524E4810J63655e6805n400A90823g8212i45C7556I567b43026
$$ 263569 -576 178524 54810 218465 -56805 -62205 190823 -78212 -945 37556 9567 -243026
12091a44550j65667a41439A25550b50256e6227A90287c2747p2073b1772A73454
$$ -144550 -310217 -141439 125550 -250256 -56227 190287 -32747 -104820 -21772 173454
12080f7924b5115C69717A17341c5061A9463J77727a66681A28948a01885c3740
$$ -67924 -25115 369717 117341 -35061 19463 197190 -166681 128948 -101885 -33740
12069a58316A94698c00592B82059A40591J54410A676O7217B8650a41326M1638
$$ -158316 194698 -300592 282059 140591 295001 1676 68893 28650 -141326 -99688
12059i9688B97435n4748b49140F922L49467a657k02062P6064j6052E6246C871
$$ -99688 297435 242687 -249140 6922 356389 -1657 -203719 -127655 -143707 56246 3871
12047C9955O32678J297348H59434B68817j31934o1897Q0739P9175a93812C969
$$ 39955 672633 1969981 859434 268817 136883 74986 155725 234900 -193812 3969
12036c15327h4780L0560q1359A84648L4405D8243i1436B79367m0839a71184Q0590
$$ -315327 -84780 -54220 -135579 184648 219053 48243 -91436 279367 238528 -171184 -90594
12025i0594n3136b7767G3572b2176E2228a23528A18379K23409D8521J60055k8684
$$ -90594 -143730 -27767 73572 -22176 52228 -123528 118379 341788 48521 208576 179892
12014A79892c8815C39341A64971B8954b49820d7036I6011a12409k3847B38432
$$ 179892 -38815 339341 164971 28954 -249820 -47036 96011 -112409 -136256 238432
12003B30306D0710K3642j425a27815G2023L8349a04357A07447d9828E20800C8655
$$ 230306 40710 64352 62927 -127815 72023 110372 -104357 107447 -49828 520800 38655
11991A3450d2887k33328b536C42650o5232J1803g7620n3557a6287A79674G4811
$$ 13450 -42887 -276215 -2536 342650 277418 289221 -77620 -131177 -16287 179674 74811
11979a05054j32919B4554a88172m7943A1485c27972a08974o9913O9845B5530N4039
$$ -105054 -237973 24554 -188172 -236115 11485 -327972 -108974 -178887 -109042 25530 79569
11968G9569Q685a07302A73342a7786B16167b96091C50981a70026k821F2899B7245
$$ 79569 88254 -107302 173342 -17786 216167 -296091 350981 -170026 -172847 62899 27245
11956C9626Q9629J7830a46215D1861d807I4860J60443a26930C6249g584n0073
$$ 39626 129255 147085 -146215 41861 -4807 94860 255303 -126930 36249 -7584 -57657
11945e7657A09167J38694j19909K63677d9192a9431H8199l0581J94802I5110c4002
$$ -57657 109167 247861 127952 391629 -49192 -19431 88199 57618 252420 95110 -34002
11933C66938a53342A52401o3406K32555b13813a6657E5614a45181C94090d4168
$$ 366938 -153342 152401 88995 321550 -213813 -16657 55614 -145181 394090 -44168
11922a05287G8520C3011a08669H6806C8728O6097J66580j33177A551e0259D5355
$$ -105287 78520 33011 -108669 86806 38728 104825 271405 138228 1551 -50259 45355
11910a80554A08787l665J4935a45765A55547a15485K1026n5639l8255g3223B27270
$$ -180554 108787 105122 120057 -145765 155547 -115485 -94459 -150098 -188353 -73223 227270
11898a16205A36180h1130I3438D91e0656H3090b31126m7522A06949h0249m19597
$$ -116205 136180 -81130 93438 491 -50656 83090 -231126 -278648 106949 -80249 -499846
11887d99846I823c382o4120a607k60699b1739j26463n313F9277k5449L77903A09636
$$ -499846 9823 -3382 -67502 -1607 -262306 -21739 -148202 -153515 69277 43828 421731 109636
11874D2556d7368G3173a58349q0575R5129B20813d15770A08098J61689b5078j89678
$$ 42556 -47368 73173 -158349 -238924 -143795 220813 -415770 108098 269787 -25078 -214756
11863b14756f1165A40826a97684D4635a54730A08488a32732D1557j0381c7212
$$ -214756 -61165 140826 -197684 44635 -154730 108488 -132732 41557 31176 -37212
11852d8327C6944d5465J8522C3878a29022o7224h69D7535f2856A04166J3999b0531
$$ -48327 36944 -45465 -26943 33878 -129022 -196246 -869 47535 -62856 104166 118165 -20531
11839b0867A56659a6119q4894e0304B2650L69622b16574P0236e3094l8347n5901
$$ -20867 156659 -16119 -101013 -50304 22650 392272 -216574 -146338 -53094 -91441 -147342
11828a47342K1138n1864B80022g2989j71171h2830p1376l51C0843p984J18323
$$ -147342 -126204 -178068 280022 -72989 -244160 -82830 -154206 -154557 30843 22859 141182
11817A41182C3814a43115n3004M7058B85326B8520J21745d5174j01588m3681c1644
$$ 141182 33814 -143115 -196119 -149061 285326 28520 150265 -45174 -146762 -190443 -31644
11805c02791I613K50845o8241a00318l48352A81791e5733E5554g309m74579G1355
$$ -302791 9613 260458 192217 -100318 -448670 181791 -55733 55554 -7309 -481888 71355
11793B74791b4559r8754H379d9259j745B14580e9532C77211a08425A26152j7527
$$ 274791 -24559 -123313 8379 -49259 -51004 214580 -59532 377211 -108425 126152 108625
11782A08625l4008a30556A00453h0748a5201K728A22112E0228k063O9840J77072
$$ 108625 74617 -130556 100453 -80748 -15201 -12473 122112 50228 48165 118005 295077
11771B95077H7633a37709b18j93718A31216b37291R7955A8385R6667B2407J26653
$$ 295077 87633 -137709 -218 -193936 131216 -237291 -139336 18385 115052 22407 149060
11760A49060a77294A24983D5447Q5437I578L19634l2283e6161D13624E1920K07897
$$ 149060 -177294 124983 45447 130884 9578 329212 296929 -56161 413624 51920 259817
11749B59817a86906A53667J7398b07397c9365N410k70933J37129B7418A2736b49040
$$ 259817 -186906 153667 171065 -207397 -39365 -33955 -304888 -167759 27418 12736 -249040
11737a2076k3328E9396L18799b06295C76614B6978h2274A15729A1201P803J50899
$$ -12076 -35404 59396 378195 -206295 376614 26978 -82274 115729 11201 19004 169903
11726A69903J38594b39178A90222a1034r1426m641m7364c782r3426F6859J72823
$$ 169903 308497 -239178 190222 -11034 -102460 -107101 -154465 -3782 -97208 66859 239682
11715B39682a29599q3480d5356B72532J51654I7604G338K96451e7870j17455E2459
$$ 239682 -129599 -213079 -45356 272532 424186 97604 7338 303789 -57870 -175325 52459
11703I3057d15646F4879a15208B50992a65916A3672J90240N8477b43403D4475
$$ 93057 -415646 64879 -115208 250992 -165916 13672 203912 262389 -243403 44475
11692a97506E3190c34367a52549A04127j6708B031K69610A26150a38260L3267
$$ -197506 53190 -334367 -152549 104127 87419 2031 271641 126150 -138260 -104993
11682a04993E4581a88030J8962B7283J40683b41373B01319K77964A44002J05536
$$ -104993 54581 -188030 -169068 27283 167966 -241373 201319 479283 144002 249538
11672B49538B2570i7410A40603m7564c63297c0332C26352b96751B18531J01929
$$ 249538 22570 -97410 140603 93039 -363297 -30332 326352 -296751 218531 320460
11662C20460j17515D2728f8467j13671H7718b52643C30861F787J72367N3523j01243
$$ 320460 202945 42728 -68467 -182138 87718 -252643 330861 6787 179154 232677 131434
11651A31434a82843b6420j1884k05385d7162o1231n6355o7929A66154n3629b88928
$$ 131434 -182843 -26420 -38304 -243689 -47162 -108393 -164748 -232677 166154 112525 -288928
11639a07536j818G2008b48389B2475i8585C50178j44863e07j79868B98406c04732
$$ -107536 -109354 72008 -248389 22475 -98585 350178 205315 -507 -180375 298406 -304732
11627G1688a49355B1545J551K77322b13037N0293C46054F1176J17186o3933d04043
$$ 71688 -149355 21545 23096 300418 -213037 -162744 346054 61176 178362 114429 -404043
11615A77380b45420J5831B68997a36180B0661J27725c7002k63092I4010b11040
$$ 177380 -245420 -229589 268997 -136180 20661 148386 -37002 -300094 94010 -211040
11604B20947M2866c06647M8920J06405A82183G3908K07403A24694f5841j00693
$$ 220947 263813 -306647 -257727 -151322 182183 73908 281311 124694 -65841 -166534
11594a66534B24834C4603J33252a20667D13801A38027b37880B21877b9731k77076
$$ -166534 224834 34603 167855 -120667 413801 138027 -237880 221877 -29731 -306807
11584c06807B38273b12362c2267A47035G3145J96523H7710K852Q1916a22712B46404
$$ -306807 238273 -212362 -32267 147035 73145 269668 87710 90562 172478 -122712 246404
11572e341q5151A69994l9373L5755K2849p6742A4552R4125B688M8505b76954B50833
$$ -5341 -90492 169994 130621 166376 189225 112483 14552 108677 2688 51193 -276954 250833
11559I1021a57725A27582f6067F9626K31103b42027a11541o8078A26575n0370
$$ 91021 -157725 127582 -66067 69626 300729 -242027 -111541 -179619 126575 76205
11549G6205A2080J74327p6208D5002O7766l6201j654a23908A55812B5702f9288
$$ 76205 12080 186407 110199 45002 112768 76567 74913 -123908 155812 25702 -69288
11537A23410J49483B9490f7351A89711E8620R4161c17840B15373a8434C12920
$$ 123410 272893 29490 -67351 189711 58620 152781 -317840 215373 -18434 312920
11526A64200j5998m796m4843a83288Q7426a6822A67349q1926Q4273k6690l5923
$$ 164200 148202 143406 98563 -183288 -95862 -16822 167349 85423 169696 143006 107083
11515A07083K09412R6695a50224a7896D35209f1371j4355K4689B92062A24522
$$ 107083 316495 413190 -150224 -17896 435209 -61371 -75726 -51037 292062 124522
11504E07829n168I9736J97574A32388J4804M4286m3554G3566O46935b97868A37283
$$ 507829 502661 99736 297310 132388 147192 191478 147924 73566 720501 -297868 137283
11492A34522J94027A50017c1475D73190A13046J69148m6908j16082n6177a16164
$$ 134522 328549 150017 -31475 473190 113046 282194 235286 119204 63027 -116164
11481B16946q5531P1154a31721B66406a79408A07857J31574e2957J1293A16049
$$ 216946 131415 202569 -131721 266406 -179408 107857 239431 -52957 -41664 116049
11470a9545E24764p087A13058a7958B63227G0411a04227B61521l8075b01222E5512
$$ -19545 524764 517677 113058 -17958 263227 70411 -104227 261521 223446 -201222 55512
11458b28116B11932B7049L31472m5620L083b13239E1058J62159A04714K36474
$$ -228116 211932 27049 358521 312901 315984 -213239 51058 213217 104714 341188
11448C41188j56482d0996F4247P8222J28381L5765a2385d191E39694D5861a20228
$$ 341188 184706 -40996 64247 142469 270850 306615 -12385 -4191 539694 45861 -120228
11436a20490E0143i3128A68174A1161L44888D3007P4677J21083n0592j1815b21438
$$ -120490 50143 -93128 168174 11161 356049 43007 117684 238767 188175 176360 -221438
11424A21210j6252P8308d3820A47361C7943K49916A39349d2751E2596d5497k08698
$$ 121210 104958 183266 -43820 147361 37943 287859 139349 -42751 52596 -45497 -254195
11413b54195a05210n3513f9345L4451A70810b9640A87474J60104A339K65028a85877
$$ -254195 -105210 -158723 -69345 -34894 170810 -29640 187474 347578 1339 266367 -185877
11401B0486K83970o743F7026b1409A02968L5237F5437A8269a13415K8293a1156
$$ 20486 304456 297713 67026 -21409 102968 138205 65437 18269 -113415 -85122 -11156
11389a1313l7078j51358G4684d48794g9898m8506A24227a55571A13244k6065D2482
$$ -11313 -48391 -199749 74684 -448794 -79898 -128404 124227 -155571 113244 87179 42482
11377F6927a48651D5355N6406m5333h5382l92883a07771c9925A06259D938b42342
$$ 66927 -148651 45355 101761 56428 -85382 -478265 -107771 -39925 106259 4938 -242342
11365A50603C9317K05616d3898A06066F186K63476b3148j08698k02056A82947
$$ 150603 39317 244933 -43898 106066 6186 269662 -23148 -131846 -333902 182947
11354D6694a04615l9034g1649G7299c1080o762j01268o0395e2361q858A1881K7692
$$ 46694 -104615 -143649 -71649 77299 -31080 -37842 -139110 -199505 -52361 -61219 11881 39573
11342C9573b42143a10135B98313b17154C34068b27121f0647k24519A43484J70612
$$ 39573 -242143 -110135 298313 -217154 334068 -227121 -60647 -285166 143484 314096
11332C14096I2193J6741c2813j31184A55700a9319I8371l3733b46014o2182e4210
$$ 314096 92193 108934 -32813 -163997 155700 -19319 98371 64638 -246014 -308196 -54210
11320c20153a43076k4340G7492J1999a03416A63282b90227A50483J26857B6328
$$ -320153 -143076 -167416 77492 89491 -103416 163282 -290227 150483 277340 26328
11309A43758a01469G7646I160J31590I239c4700k00754D4536L7196b7074j92324
$$ 143758 -101469 77646 9160 140750 9239 -34700 -235454 44536 81732 -27074 -219398
11298b19398q8194P6417e8581j77933N2446A11791b06903c9418A23947K86940
$$ -219398 -307592 -231175 -58581 -236514 -184068 111791 -206903 -39418 123947 410887
11288D10887g2889A53334b31394g7319A31868a97353i6954B2571J26030J12176
$$ 410887 -72889 153334 -231394 -77319 131868 -197353 -96954 22571 148601 260777
11278B60777r6210n5767e4383a1274A04655J85169D3451a17439C4656J05813c64328
$$ 260777 164567 108800 -54383 -11274 104655 289824 43451 -117439 34656 140469 -364328
11266A58555g2943k67398a55798A04196b87166f8956k12379J14214K5672A02359
$$ 158555 -72943 -340341 -155798 104196 -287166 -68956 -281335 -167121 -141449 102359
11255b41029g3875q4221o777j7706a7714A90376j3771b13297E6029b32010m5303
$$ -241029 -73875 -158096 -164873 -182579 -17714 190376 176605 -213297 56029 -232010 -277313
11244b77313i4743r9184M4092N5788m7625J3264j34202k57613E1678J47389G0171
$$ -277313 -94743 -193927 -149835 -94047 -141672 -128408 -262610 -520223 51678 199067 70171
11232A05543b93133A55630e4969J6440j7884H1891a69131A29a28068A08720l8190
$$ 105543 -293133 155630 -54969 -38529 -56413 81891 -169131 129 -128068 108720 70530
11221G0530d8269k13504D9535L5690L9723J2125a21l9111A8265a82714D4089G72
$$ 70530 -48269 -261773 49535 85225 124948 137073 -121 -39232 18265 -182714 44089 772
11208B63477f7273A66429a66870f2006A63735a33915A4890N3244o188b43813J21818
$$ 263477 -67273 166429 -166870 -62006 163735 -133915 14890 68134 61946 -243813 -121995
11197a21995j17154A17659d60501d493n0634j00472a9108A41062A7220J61925
$$ -121995 -239149 117659 -460501 -4493 -55127 -155599 -19108 141062 17220 179145
11187A79145q864H572b9177A30889a15975B10551A5042d34j35639A45414R5559
$$ 179145 170281 8572 -29177 130889 -115975 210551 15042 -434 -136073 145414 240973
11176B40973A7566a10509k50681a664B82435B8235O5690a52516A07115c41493
$$ 240973 17566 -110509 -361190 -1664 282435 28235 93925 -152516 107115 -341493
11165a52242K1604E7780A5378b59301l5745A93019b52682i4687P793a3557n1108
$$ -152242 -130638 57780 15378 -259301 -295046 193019 -252682 -94687 -86894 -13557 -64665
11154f4665j8323D274L1846a22667M5240A3541N9890L77648a89963A56619R5339
$$ -64665 -82988 4274 36120 -122667 -77427 13541 73431 451079 -189963 156619 251958
11143B51958c03994A79256c57846A57994k5944C9567J93973J57324e1370A10712
$$ 251958 -303994 179256 -357846 157994 132050 39567 233540 390864 -51370 110712
11132a3212j18946G0768H114R0747K8665n0751b80449A51830J97546F4372J54668
$$ -13212 -132158 70768 8114 98861 127526 76775 -280449 151830 349376 64372 219040
11121B19040j6182e6286q5839b506l9442E09685I1906J26711b2417A78578q4361
$$ 219040 202858 -56286 -142125 -2506 -41948 509685 91906 218617 -22417 178578 94217
11110I4217e4204C0465K7287K500J15493d0384F9468J5227k857J9190b7070L014
$$ 94217 -54204 30465 57752 60252 175745 -40384 69468 84695 81838 101028 -27070 -24056
11098b4056B33633K2234o9725a89354G6535a18718C47212h5909A41346J26416
$$ -24056 233633 255867 186142 -189354 76535 -118718 347212 -85909 141346 267762
11088B67762L91169A29780J81886c4019A03714j6928L07360B7229L64835R6732
$$ 267762 658931 129780 311666 -34019 103714 86786 394146 27229 392064 488796
11078D88796j30535j71458R5829A40050K0042J90042L01906B32955N3824K18485
$$ 488796 358261 186803 282632 140050 160092 350134 652040 232955 286779 505264
11068E05264k22399K18078R4584B67296K27288r4110J93790A45128K45609J56678
$$ 505264 282865 500943 595527 267296 494584 400474 594264 145128 390737 547415
11058E47415k1971k5697K93533J3508C07135P22443m32462J02362k04694l4609
$$ 547415 525444 499747 793280 806788 307135 1029578 597116 699478 494784 460175
11048D60175L93292O5521j32318j48280M21001k25435j32462j9043N0832J39603
$$ 460175 853467 918988 786670 638390 1059391 833956 701494 682451 733283 872886
11038H72886k04530K5416J95222l17873K98176N5278B71844P27484l89185J98611
$$ 872886 668356 693772 888994 571121 869297 924575 271844 999328 610143 808754
11028H08754r629M11917l17013j66698L19459D50757K46898K3075j00888K50806
$$ 808754 799125 1211042 894029 727331 1046790 450757 697655 720730 619842 870648
11018H70648k02197k59169L86573l93731J06920L14274j22805K32285k68143J77859
$$ 870648 668451 409282 795855 402124 509044 823318 700513 932798 664655 842514
11008H42514j70795M3922Q7256C90717K13139r4652J97952k91771M05215k73797
$$ 842514 671719 715641 802897 390717 603856 509204 707156 415385 820600 546803
10998E46803j3906K22917J34345m18820K25359k95281M97607n5688l9135k21588
$$ 546803 532897 755814 890159 471339 696698 401417 899024 843336 804201 582613
10988E82613J13491J36326j25028L03381J54227n7888R5013j24962K85031k04124
$$ 582613 696104 832430 707402 1010783 1165010 1107122 1202135 1077173 1362204 1158080
10978A158080M7074N06998J53727R9523L34656L32966K36460M48319m6047l8204
$$ 1158080 1205154 1712152 1865879 1965402 2300058 2633024 2869484 3317803 3271756 3233552
10968C233552m5806k82637k17578q6796m86864j43934k72023j57851q8892n8574
$$ 3233552 3187746 2905109 2687531 2600735 2113871 1969937 1697914 1540063 1451171 1392597
10958A392597n9261J55722l91953K97203K78240o18277n3249p8358l23494j2592
$$ 1392597 1333336 1489058 1097105 1394308 1672548 1054271 1001022 922664 599170 586578
10948E86578j48017A16565J81783P5956D0562J55234m8039J8362o0798L23867
$$ 586578 438561 116565 298348 374304 40562 195796 147757 166119 105321 429188
10938D29188A44123J72504L2793b3411j07967o8317B30795B4416K08539A1644
$$ 429188 144123 316627 349420 -23411 -131378 -199695 230795 24416 232955 11644
10927D10187b62493C06849l8170i421k3453A4189a0617D1428M7938h7695b1550
$$ 410187 -262493 306849 268679 -9421 -32874 14189 -10617 41428 89366 -87695 -21550
10915b71665k4456D27585a65379A48764F3349d0990I6643i0044l2226R307A77737
$$ -271665 -296121 427585 -165379 148764 63349 -40990 96643 -90044 -122270 -112963 177737
10903C5007A3957K77567e3393A84401c5856A12851J00084c2339k42423J09206
$$ 35007 13957 291524 -53393 184401 -35856 112851 212935 -32339 -274762 -165556
10893a65556C8181J00818j6848J61267a30910l9852c7422B59J75387f2619H05
$$ -165556 38181 138999 122151 283418 -130910 -170762 -37422 259 175646 -62619 805
10881A07372k6507L0824d3346A26730c02502J30295o4681C36786b31959f6796
$$ 107372 80865 111689 -43346 126730 -302502 -172207 -236888 336786 -231959 -66796
10870h228k07726J7192B0215P7751J51828D5013M742f9278l5j92155B00265p3033
$$ -8228 -215954 -198762 20215 97966 249794 45013 49755 -69278 -69313 -261468 200265 127232
10858A27232k3233C3360b42553A11438b76755H2572b35820j49583A29056o1031
$$ 127232 103999 33360 -242553 111438 -276755 82572 -235820 -385403 129056 68025
10848F8025J51167a79416F5548d0717F1271K85404g305I0698b7017j81095m0412
$$ 68025 219192 -179416 65548 -40717 61271 346675 -7305 90698 -27017 -208112 -248524
10837b48524J03593C0318i8847D4036d58326a45154A09992a11827d0135j1385
$$ -248524 -144931 30318 -98847 44036 -458326 -145154 109992 -111827 -40135 -51520
10827e1520C32628a61429A20521K6018a56520I6539B8172c92302i0145j80877
$$ -51520 332628 -161429 120521 146539 -156520 96539 28172 -392302 -90145 -271022
10817b71022e6627I2847J08206A199J34011b99402B48503c5805A2477d5026A67030
$$ -271022 -56627 92847 201053 1199 135210 -299402 248503 -35805 12477 -45026 167030
10805B79977h9149I9872L35146b11443Q4311B80161a95840f4108A60484O9522
$$ 279977 -89149 99872 435018 -211443 -127132 280161 -195840 -64108 160484 230006
10795B30006a78285g2498C00154c62823h1907m4388p5623B09167a37497C03246
$$ 230006 -178285 -72498 300154 -362823 -81907 -126295 -201918 209167 -137497 303246
10784c1547B013a05081K4472F201K2737d40725e3896G8462P9784O570E9834j9949
$$ -31547 2013 -105081 -80609 6201 28938 -440725 -53896 78462 158246 164816 59834 39885
10772C9885E294Q3501h2294B50017I0828f8219B85958a379m09918A05214a90107
$$ 39885 5294 88795 -82294 250017 90828 -68219 285958 -1379 -411297 105214 -190107
10760a00228A70428L8310a48594j597A70528J01025a68021N8991c8475j89610
$$ -100228 170428 208738 -148594 -150191 170528 271553 -168021 -109030 -38475 -228085
10750b28085p0983B12488c7853o8430A35245e8029B2970e8755A64679b13140A54450
$$ -228085 -299068 212488 -37853 -106283 135245 -58029 22970 -58755 164679 -213140 154450
10738b4878F6002a17592A51190a20237D1445j0840i4408k72542a62018K267k22706
$$ -24878 66002 -117592 151190 -120237 41445 30605 -94408 -366950 -162018 -159751 -382457
10727c82457i6066c2671A28178d021n0335C8343i8152B34815a27534j8432A61106
$$ -382457 -96066 -32671 128178 -4021 -54356 38343 -98152 234815 -127534 -145966 161106
10715G0027a33911A10528a43809B17429a6658A9017J13157c70721e8306a3233
$$ 70027 -133911 110528 -143809 217429 -16658 19017 132174 -370721 -58306 -13233
10704F1538b60407A4229N7124J23696b02443d9301B22638a41438j16793p98i0519
$$ 61538 -260407 14229 71353 195049 -202443 -49301 222638 -141438 -258231 -259029 -90519
10692c19807A4762M4691c2690k98211G3400a85026L5225L3119l3686A20263b77271
$$ -319807 14762 59453 -32690 -330901 73400 -185026 -149801 -116682 -150368 120263 -277271
10680f3765A20108J25913a50503A4091d33981b16768a05101N2111b532j46007
$$ -63765 120108 246021 -150503 14091 -433981 -216768 -105101 -52990 -2532 -148539
10670a48539B76960f2923i117K68k52947C14472j10102B0407B041b94894H4769
$$ -148539 276960 -62923 -9117 -8849 -261796 314472 204370 20407 2041 -294894 84769
10658A58251b26893J7660A40752f3682j02215A33396B964P4653r28a40702C41682
$$ 158251 -226893 -209233 140752 -63682 -165897 133396 2964 77617 76689 -140702 341682
10646e26172a91830A62444J86727b0269A4902b87220L3164i6879k9569A05172
$$ -526172 -191830 162444 349171 -20269 14902 -287220 -254056 -96879 -126448 105172
10635b62759a03194p7833D14585a24450b7231j70777A24986n4578b368G8373a61368
$$ -262759 -103194 -181027 414585 -124450 -27231 -198008 124986 70408 -2368 78373 -161368
10623a95279I1944a66721A18167P7120p4086a43296C1367a53181f8879A37747
$$ -195279 91944 -166721 118167 195287 121201 -143296 31367 -153181 -68879 137747
10612h5611b7340k67708A84120b61566A9472o944Q7579a00557b6607k584j46045
$$ -85611 -27340 -295048 184120 -261566 19472 12528 100107 -100557 -26607 -29191 -175236
10601a75236o0829A69058G1469K7876J32574D3721J19404n6268b03570C06529
$$ -175236 -236065 169058 71469 99345 231919 43721 163125 106857 -203570 306529
10590g2330A4898K09728a03324p4463c3856m6943l7680A18902n1523M2103c6403
$$ -72330 14898 224626 -103324 -177787 -33856 -80799 -118479 118902 67379 109482 -36403
10578h5657D01197A70064J41277b41030A67135e197k6279q1240b9556D0650a52692
$$ -85657 401197 170064 311341 -241030 167135 -5197 -31476 -112716 -29556 40650 -152692
10566a82389h8509j983p4206P2860L7676a3180k46107N4424c4834r3904A99397
$$ -182389 -88509 -90492 -164698 -91838 -54162 -13180 -259287 -204863 -34834 -128738 199397
10554A29573b25877B17711g3673j8584l36465E337L41409C5628a57m2858A9502
$$ 129573 -225877 217711 -73673 -92257 -428722 5337 346746 35628 -157 -43015 19502
10542d28926D1682a61313A8617h3518E2798b26154C566i7988j44272d4131E2621
$$ -428926 41682 -161313 18617 -83518 52798 -226154 3566 -97988 -242260 -44131 52621
10530D3897i6609j37135e6534A24591e4124j23440B6282b9112j92312b2987F4074
$$ 43897 -96609 -233744 -56534 124591 -54124 -177564 26282 -29112 -221424 -22987 64074
10518a70163G3012a16403A57776c8309j1929E265Q2560J52136G8559A4682N4351
$$ -170163 73012 -116403 157776 -38309 -50238 5265 87825 239961 78559 14682 69033
10507F9033c85311H8046a36612A07021C0878b64676A02924a07584B05682Q634
$$ 69033 -385311 88046 -136612 107021 30878 -264676 102924 -107584 205682 214316
10497B14316c6954j69791H7538k0314a68383C0732a31351B41844b29169C28916
$$ 214316 -36954 -206745 87538 67224 -168383 30732 -131351 241844 -229169 328916
10486f8595B9394a03476c7778m8761C9977g0465E82061l1361r5976L4241B8737
$$ -68595 29394 -103476 -37778 -86539 39977 -70465 582061 550700 454724 488965 28737
10474E17193C5415L9366J39417m1825a06645B29820c5693A59091J6325c23687
$$ 517193 35415 74781 214198 172373 -106645 229820 -35693 159091 175416 -323687
10463d0823n873A31693b5303B4109J5909a3757k24544A70136k2295a85449G6451
$$ -40823 -46696 131693 -25303 24109 40018 -13757 -238301 170136 147841 -185449 76451
10451b52678p2227a32783A06621k130J9514M0908c34036R538A58038K35936A65714
$$ -252678 -324905 -132783 106621 104491 124005 164913 -334036 -324498 158038 393974 165714
10439f0639j71811g9340q4533G3963O1449f1859n2352l2569A44893a0697C7162
$$ -60639 -232450 -79340 -163873 73963 135412 -61859 -114211 -146780 144893 -10697 37162
10427h9727j9331B40343b5513B09857C6257a58875b5498B95421b43052A72791
$$ -89727 -109058 240343 -25513 209857 36257 -158875 -25498 295421 -243052 172791
10416B30249A6422J5618R2030k1860a42818A19436a01020G0615B3673N7808c53431
$$ 230249 16422 32040 124070 102210 -142818 119436 -101020 70615 23673 81481 -353431
10404b25919A26387L2966b77098H2334c4554j15176A00994k8133R1547D0754P7649
$$ -225919 126387 159353 -277098 82334 -34554 -149730 100994 72861 164408 40754 118403
10393A18403J80230K12983A06436e9708D0652a79574A1710L62449C6840a4992
$$ 118403 298633 511616 106436 -59708 40652 -179574 11710 374159 36840 -14992
10382e170A81948J55521I4358L89443A70490q402M5431N3845A14483J4101R8743
$$ -5170 181948 337469 94358 483801 170490 162088 207519 261364 114483 128584 227327
10371B27327m634j05502J09434P3605L69326j82311k0539J65020l05648K40296
$$ 227327 222693 117191 226625 300230 669556 487245 466706 631726 326078 566374
10361E66374A08975b55579A05005J15480K63557j54458J44276K8991r7972l3435
$$ 566374 108975 -255579 105005 220485 484042 329584 473860 502851 404879 371444
10351C71444L81917j71011r2347A88208K98892I6690L01857K4077K1061B19129
$$ 371444 753361 582350 490003 188208 487100 96690 398547 422624 443685 219129
10340C22394j55995O7750m5101b06292E46561B49998a18444A50019b479I9324
$$ 322394 166399 234149 189048 -206292 546561 249998 -118444 150019 -2479 99324
10329a1476B63278A10402h795B43077J08288o4977N5492G4022L24178Q038A69002
$$ -11476 263278 110402 -8795 243077 351365 286388 341880 74022 398200 406238 169002
10317D70773k31002C9982J57100l1814E3927a79919a8650A77064q7264g9539B6264
$$ 470773 239771 39982 197082 165268 53927 -179919 -18650 177064 89800 -79539 26264
10305D1369b5173j46669A16940l992a99874D19262a30849p4991j33976D08383
$$ 41369 -25173 -171842 116940 112948 -199874 419262 -130849 -205840 -339816 408383
10294b90469i6437A00252a49181B27931a22405r9680f9341D3152J54259b73148
$$ -290469 -96437 100252 -149181 227931 -122405 -222085 -69341 43152 197411 -273148
10283i2175A12279a05509k01534G9703b2478C9032a14860F3314O1063a85946R2848
$$ -92175 112279 -105509 -307043 79703 -22478 39032 -114860 63314 124377 -185946 -93098
10272i3098C6391a40987d9325A25546h1819C47029A37631L5636E577O7311a28453
$$ -93098 36391 -140987 -49325 125546 -81819 347029 137631 173267 5577 72888 -128453
10260A22407l6458a89684h3453B11152a94459B02681Q1003g9992A03430R1059
$$ 122407 85949 -189684 -83453 211152 -194459 202681 283684 -79992 103430 194489
10250A94489d436k27642I6304j4837a95725j70000H0723g1743c1564F5193a27414
$$ 194489 -4436 -232078 96304 81467 -195725 -365725 80723 -71743 -31564 65193 -127414
10238A9788g4787k59424H4265b81311R3641D10235c5587q9308e9600b3152C4838
$$ 19788 -74787 -334211 84265 -281311 -187670 410235 -35587 -124895 -59600 -23152 34838
10226A97562m5716e6524j9264J5574k26404L6612G2040a59240e1943j70521B57519
$$ 197562 151846 -56524 -75788 -60214 -286618 -250006 72040 -159240 -51943 -222464 257519
10214A87192F2307N9794i8083I5219a15359A00633a21587j13324b8872j28261
$$ 187192 62307 122101 -98083 95219 -115359 100633 -121587 -234911 -28872 -157133
10204a57133l59329F6980i2099A98074a89539A56374o3145J18892c19716A388
$$ -157133 -516462 66980 -92099 198074 -189539 156374 93229 212121 -319716 1388
10193b73389h385B59192G7855a53192K7586R667b133A62555d64645J82867c6575
$$ -273389 -8385 259192 77855 -153192 -125606 -115939 -2133 162555 -464645 -281778 -36575
10181b92497A10761j6105J82305c15491I627b7226B0816J18579a22587I0516N2848
$$ -292497 110761 94656 276961 -315491 9627 -27226 20816 139395 -122587 90516 143364
10170A43364a3296A90356n7171R4678L7181a53908j29736A61070a63092B2122
$$ 143364 -13296 190356 133185 227863 265044 -153908 -283644 161070 -163092 22122
10159B36682F033J05485M7579b35991J00233L5975M0892j12781C90621a41435
$$ 236682 6033 111518 159097 -235991 -135758 -99783 -58891 -171672 390621 -141435
10148G9759l8829b40321C5420d35789A96961m1182a7139j49630k05035R7649B61440
$$ 79759 40930 -240321 35420 -435789 196961 155779 -17139 -166769 -371804 -274155 261440
10136a98346I2845b30251a8209H0160k6382k1191a06773a6896I5192a41710B8844
$$ -198346 92845 -230251 -18209 80160 53778 32587 -106773 -16896 95192 -141710 28844
10124B22759P703b59066m5753c6934A59197b05475C12281b14894a8894m9295B4360
$$ 222759 230462 -259066 -304819 -36934 159197 -205475 312281 -214894 -18894 -68189 24360
10112d7448D8069A414a23941e0683F9664b8784A20811D5806b220j69617c3854
$$ -47448 48069 1414 -123941 -50683 69664 -28784 120811 45806 -2220 -171837 -33854
10100a1975g12k35889L9525o9238M4646b0942o18428A84238f5418m3171A5579
$$ -11975 -712 -236601 -197076 -266314 -221668 -20942 -639370 184238 -65418 -108589 15579
10088I9280J24353l7567a41910B01761A00675a96362b7289G9932a21068n6478
$$ 99280 223633 186066 -141910 201761 100675 -196362 -27289 79932 -121068 -177546
10078a77546E1736a54259l72860a5334A59486b8782q7098j56761J21574A20164
$$ -177546 51736 -154259 -527119 -15334 159486 -28782 -115880 -272641 -151067 120164
10067a40050n2728P2247A95901F9659a24453B81459g6378A08515J69602g2241
$$ -140050 -192778 -120531 195901 69659 -124453 281459 -76378 108515 278117 -72241
10056g6345j15923Q5789B04561a78896e9945A13501k3557e3569B26917b11645
$$ -76345 -192268 -106479 204561 -178896 -59945 113501 89944 -53569 226917 -211645
10045a99704q6293a14387A95881D4969J21174E2811a52541I6761f1523p2053A08508
$$ -199704 -285997 -114387 195881 44969 166143 52811 -152541 96761 -61523 -133576 108508
10033h8226j36710a06285j21496d8463D7273R3805H541d0564j06379q4394l4539
$$ -88226 -224936 -106285 -227781 -48463 47273 141078 8541 -40564 -146943 -231337 -265876
10022b65876e498m7407a8779l9733p841k279B3850c59604A59164c7199C6454d21710
$$ -265876 -5498 -52905 -18779 -58512 -66353 -68632 23850 -359604 159164 -37199 36454 -421710
10009b47398r0854a51205B6000k642J43819a09068r4675A39634d27146a9982k05227
$$ -247398 -338252 -151205 26000 23358 167177 -109068 -203743 139634 -427146 -19982 -225209
9998b25209l613I0928c76810b10B22832a08270M6540B32682f1083l02090q2415
$$ -225209 -228822 90928 -376810 -210 222832 -108270 -61730 232682 -61083 -363173 -445588
9987d45588B79299a8427D7431c7091k09466a21019A46786a41185k5301p2395j8841
$$ -445588 279299 -18427 47431 -37091 -246557 -121019 146786 -141185 -166486 -238881 -257722
9976b57722C05714j17608c28833N1212P9895l309J0093M2761A07298C3733b64878
$$ -257722 305714 188106 -328833 -277621 -197726 -201035 -190942 -148181 107298 33733 -264878
9964B11645K39245C7014F574h7264A94329a60018B34131C712J48251i3556A28970
$$ 211645 450890 37014 6574 -87264 194329 -160018 234131 3712 151963 -93556 128970
9952c30651a64381k81882d3752n7100o1918h0170B59016a6172C7539a3827A86208
$$ -330651 -164381 -446263 -43752 -100852 -162770 -80170 259016 -16172 37539 -13827 186208
9940A15247b04560J01793r2408A54265F9752a0600c379j61339M5991I1807b12457
$$ 115247 -204560 -102767 -195175 154265 69752 -10600 -3379 -164718 -118727 91807 -212457
9928a0457l7945j47156k1659A13141C3845a69491A90656a17258B24110G4499M4440
$$ -10457 -48402 -195558 -217217 113141 33845 -169491 190656 -117258 224110 74499 118939
9917A18939f4035n7334H2941c08800a10801o1399A99794b28180R6667A27713K14536
$$ 118939 -64035 -121369 82941 -308800 -110801 -172200 199794 -228180 -131513 127713 342249
9906C42249C352a13871e6133k10318J9391N6852j50675H4541g3069c798j90965
$$ 342249 3352 -113871 -56133 -266451 -247060 -190208 -340883 84541 -73069 -3798 -194763
9895a94763A56839b94771J00797J596j6845I7148J84086a41742k24353g5562j09677
$$ -194763 156839 -294771 -193974 -192378 -209223 97148 281234 -141742 -366095 -75562 -185239
9884a85239b4980j29595A18237c08915J35118A24736Q1970I7748a0984o7347k40247
$$ -185239 -24980 -154575 118237 -308915 -173797 124736 206706 97748 -10984 -78331 -318578
9873c18578P3617A24293c81549B6062J00665L2789b1711k18991H0535b86473e2196
$$ -318578 -244961 124293 -381549 26062 126727 159516 -21711 -240702 80535 -286473 -52196
9861A63295a54982N4276B07006F724R6994J59708E1104b59893a6885F4102c00217
$$ 163295 -154982 -100706 207006 6724 103718 263426 51104 -259893 -16885 64102 -300217
9849a51752J8813j37549E0436R0326b24581A28620a87057B88856a20278B3149
$$ -151752 -132939 -270488 50436 140762 -224581 128620 -187057 288856 -120278 23149
9838C1449L4663J764J20784a18967b8987B45295b82517h36p8443j38506m21585
$$ 31449 66112 67876 188660 -118967 -28987 245295 -282517 -836 -79279 -217785 -639370
9827f39370b45365m1448B16873d55339a77418Q3185H0675d4865B39509G9186b63550
$$ -639370 -245365 -286813 216873 -455339 -177418 -94233 80675 -44865 239509 79186 -263550
9815A81526a55873b6691j02688e3610P826k78316a01037j76126M2122e7266a3065
$$ 181526 -155873 -26691 -129379 -53610 -45784 -324100 -101037 -277163 -235041 -57266 -13065
9803G9482b7496k75918J01820c2009r97l0940j42693i3366c1241p566j11121j2920
$$ 79482 -27496 -303414 -201594 -32009 -33006 -63946 -206639 -93366 -31241 -38807 -149928 -162848
9791a62848J2384e100l3267h906A86176E9649b1090j50471D8298a65438f6546
$$ -162848 -150464 -5100 -38367 -8906 186176 59649 -21090 -171561 48298 -165438 -66546
9779a4381l38412A16453E5279L28983a42378C6024j4676b28690B5922a67128f9679
$$ -14381 -352793 116453 55279 384262 -142378 36024 21348 -228690 25922 -167128 -69679
9767B15306a67707b6531f205C7531P062J46646b54530A36557J56813a48151N4736
$$ 215306 -167707 -26531 -6205 37531 44593 191239 -254530 136557 293370 -148151 -93415
9756i3415o037A61861a15287B27809h7823K3717B4197d18411A70008F1035c29331
$$ -93415 -99452 161861 -115287 227809 -87823 -64106 24197 -418411 170008 61035 -329331
9744b01525d1430l34275G5952b8080l47102J00842K1978F557L20547f6839c1038
$$ -201525 -41430 -375705 75952 -28080 -375182 -274340 -252362 6557 327104 -66839 -31038
9732b38766A69697b7185l10352J37254A54151e65902B89365b16540H131b38137
$$ -238766 169697 -27185 -337537 -200283 154151 -565902 289365 -216540 8131 -238137
9721d0367A74689b07732a8836A2041b55736A08437g9350F2145a63113I6136J1584
$$ -40367 174689 -207732 -18836 12041 -255736 108437 -79350 62145 -163113 96136 107720
9710A07720L0679O6335c11120A31319a18822A37578d8694j21316A8896N7114a34787
$$ 107720 138399 204734 -311120 131319 -118822 137578 -48694 -170010 18896 76010 -134787
9698F9336c89557f2929m9072o709B24637a54907D2703b55659a27285j13248i3932
$$ 69336 -389557 -62929 -112001 -118710 224637 -154907 42703 -255659 -127285 -240533 -93932
9686C509J75707a85988a5781G7705J64226a423A90570q8436f2837l49878B5799
$$ 3509 179216 -185988 -15781 77705 241931 -1423 190570 102134 -62837 -412715 25799
9674a16593a0633A4086e2987A05981c30316B95485A0000a39041j40946J26401
$$ -116593 -10633 14086 -52987 105981 -330316 295485 10000 -139041 -279987 -153586
9664a53586d6935o9252B0907g2265C5345c26259F2623a36283H0617g7596j57397
$$ -153586 -46935 -116187 20907 -72265 35345 -326259 62623 -136283 80617 -77596 -234993
9653b34993Q0942O679K0609O1225E0951h0059j43250A32840c84814C71686a18280
$$ -234993 -154051 -147372 -126763 -65538 50951 -80059 -223309 132840 -384814 371686 -118280
9641b2519j08344n0920A97451a01849c9515Q809A6825b58252J7066l903h6113
$$ -22519 -130863 -181783 197451 -101849 -39515 -30706 16825 -258252 -241186 -245089 -86113
9629a44171L9306A39105a79772A18935a63165k8167C3659b01116B03609F7781
$$ -144171 -104865 139105 -179772 118935 -163165 -191332 33659 -201116 203609 67781
9618G9486M2316d427l33247g6522C65552c79144a18380j4854E1085R0075a49886
$$ 79486 121802 -4427 -337674 -76522 365552 -379144 -118380 -133234 51085 141160 -149886
9606a39423N5363j678A9001L1127i0572k0904m1475B4448h7389h040j99452A29786
$$ -139423 -84060 -85738 19001 50128 -90572 -111476 -152951 24448 -87389 -8040 -207492 129786
9593b4F2447d6135l09935J74998A1631b16745l97531c0800j99448k5040c6280
$$ -24 62447 -46135 -356070 -181072 11631 -216745 -614276 -30800 -230248 -255288 -36280
9581a38234k01115B47366i7580A43461J29688b10392a6302k93606J20572A88712
$$ -138234 -339349 247366 -97580 143461 273149 -210392 -16302 -309908 -189336 188712
9570A21563b81352J35063O9047A00804K1895e7684B7264R8371E1367b75081p621
$$ 121563 -281352 -146289 -77242 100804 122699 -57684 27264 125635 51367 -275081 -282702
9559b82702j7786a25035E3841j3244b49361A18836L6222a99205A87151a43832
$$ -282702 -300488 -125035 53841 40597 -249361 118836 155058 -199205 187151 -143832
9548c58992b6723r7947B90932e7838k07299J13345B3481b30021a03016C0201J5997
$$ -358992 -26723 -124670 290932 -57838 -265137 -151792 23481 -230021 -103016 30201 46198
9537D6198a83738A10573a42856c1653A12539E722Q3040b01246a132G4884r363
$$ 46198 -183738 110573 -142856 -31653 112539 5722 88762 -201246 -1132 74884 65521
9526F5521b10928A36511o5668d29651g1298j96848B7592g1503j53947a9265m67433
$$ 65521 -210928 136511 70843 -429651 -71298 -268146 27592 -71503 -225450 -19265 -486698
9515d86698b35128A33159K40184A36493e843j29731A9391c68662i5608J3762b5698
$$ -486698 -235128 133159 373343 136493 -5843 -135574 19391 -368662 -95608 -81846 -25698
9503a43731r5712O1130R150L0699p3676A09419P4515B1811R3182e18115a26261
$$ -143731 -239443 -178313 -169163 -138464 -212140 109419 183934 21811 114993 -518115 -126261
9491A66567g5606E2816R3312D1744c291j70416k23335a00251K813b6908I0572
$$ 166567 -75606 52816 146128 41744 -3291 -173707 -397042 -100251 -97438 -26908 90572
9479d2824j83764J07360m522j60886H2290i2056o5230q0341A60689b42120J07708
$$ -42824 -226588 -119228 -123750 -284636 82290 -92056 -157286 -237627 160689 -242120 -134412
9468a34412j23841A68267A5913K31585K12687F9536a19894B00569b25382k8A778
$$ -134412 -258253 168267 15913 247498 460185 69536 -119894 200569 -225382 -225410 1778
9456A9752b07439g5721E210b57742C8439a18396j59273P9066A0165b61989n0126
$$ 19752 -207439 -75721 5210 -257742 38439 -118396 -277669 -198603 10165 -261989 -312115
9445c12115d5944a756j51315F5296b9658q8397o1025N2277f0256m02269b5359
$$ -312115 -45944 -1756 -153071 65296 -29658 -118055 -179080 -126803 -60256 -462525 -25359
9433d7181m9365m6228B26081b031n3954G8823b24511B12767j8400q4580g9169
$$ -47181 -96546 -142774 226081 -2031 -55985 78823 -224511 212767 194367 109787 -79169
9421G7323B8748b83959b9190g721B31989b07905f3989l17478g6072p5487A46509
$$ 77323 28748 -283959 -29190 -7721 231989 -207905 -63989 -381467 -76072 -151559 146509
9409c7098p1582b987j85466H9877A0199b66291l923f6523j87103f0449D877K6596
$$ -37098 -108680 -2987 -188453 89877 10199 -266291 -270214 -66523 -253626 -60449 4877 31473
9397C1473b94626F3776P0368h8584p9693A94080h6319A58040D0602J22021D8470
$$ 31473 -294626 63776 134144 -88584 -168277 194080 -86319 158040 40602 162623 48470
9385a45963m0774M1830m0253r4165a27793k2050A84163c05079g8436k67778a00158
$$ -145963 -186737 -144907 -185160 -279325 -127793 -149843 184163 -305079 -78436 -346214 -100158
9373C3821K0544R6278b76949B5201b09027G1987P0322n1465A2055c19003g893
$$ 33821 54365 150643 -276949 25201 -209027 71987 142309 90844 12055 -319003 -7893
9361a26405L1147A20772f2955j90084J04595b924j72084A9281a65841N31G2356
$$ -126405 -95258 120772 -62955 -253039 -148444 -2924 -175008 19281 -165841 -165310 72356
9349F8728d44337N6853C04640c51668F799J60573H2579l1515R4739a32281M7841
$$ 68728 -444337 -387484 304640 -351668 6799 167372 82579 51064 145803 -132281 -84440
9338h4440A06166L3957c71538I0758e4270C80109A17220B7363Q733d6363K1197
$$ -84440 106166 140123 -371538 90758 -54270 380109 117220 27363 36096 -46363 -25166
9327b5166l859m8934C68257f6230A67119f4426j91437j02118C9864f6352a2984
$$ -25166 -29025 -77959 368257 -66230 167119 -64426 -255863 -357981 39864 -66352 -12984
9315C4399a57335j46355a48979J3463j43874a13871k04710B206N7656H625b66162
$$ 34399 -157335 -303690 -148979 -135516 -279390 -113871 -318581 2206 59862 8625 -266162
9303a74681m1915a00566p8624j73151a9710B1032M1098b88057J43197i928l94344
$$ -174681 -216596 -100566 -179190 -352341 -19710 21032 62130 -288057 -144860 -9928 -404272
9292d04272J57829c3328B11794a5866j60779B5966i5729j33771J09466F4094b38688
$$ -404272 -246443 -33328 211794 -15866 -176645 25966 -95729 -229500 -120034 64094 -238688
9280a68425A79517J8726a17574A16067a45411I156c03641h9074G3855P2005e5762
$$ -168425 179517 198243 -117574 116067 -145411 9156 -303641 -89074 73855 145860 -55762
9268A51534Q1675b54639B8990d7782j9712k05438q4460a30111I471c17072a11124
$$ 151534 233209 -254639 28990 -47782 -67494 -272932 -357392 -130111 9471 -317072 -111124
9256b3146j91353F1750d47483B3687a55113H2430N1596a46013A58155e30141G3152
$$ -23146 -214499 61750 -447483 23687 -155113 82430 134026 -146013 158155 -530141 73152
9244A55370c77509E8707i2225A54302a22498j96246H3983d10128J93901C07117
$$ 155370 -377509 58707 -92225 154302 -122498 -318744 83983 -410128 -216227 307117
9233a11591j24259m3287I148c53760d3559E0939O0457J72614A07473e2211j58949
$$ -111591 -235850 -279137 9148 -353760 -43559 50939 111396 284010 107473 -52211 -211160
9222b11160f4840B25259A7302g8210A72333b4733A8223M3350a3292o9703j40602
$$ -211160 -64840 225259 17302 -78210 172333 -24733 18223 61573 -13292 -82995 -223597
9211b23597i0288A22612n3375J2619B6940J1222a70693G5366c2019j99655E7218
$$ -223597 -90288 122612 69237 81856 26940 38162 -170693 75366 -32019 -231674 57218
9199b91036A69642E4592b43580j20107F4544A5920K5229a71851q312g8734j61572
$$ -291036 169642 54592 -243580 -363687 64544 15920 41149 -171851 -180163 -78734 -240306
9188b40306A92769C9242f641p8940n971n2591F8124a13170C45307A00719O9923
$$ -240306 192769 39242 -6641 -85581 -91552 -144143 68124 -113170 345307 100719 170642
9177A70642A471f9987H4083L7577b65401A43428b59757J08272j59159e7981J3641
$$ 170642 1471 -69987 84083 121660 -265401 143428 -259757 -151485 -310644 -57981 -44340
9166d4340k38566a25241P393A02159K00628j01177E319h102p7004L6134j69891
$$ -44340 -282906 -125241 -117848 102159 302787 201610 5319 -8102 -85106 -48972 -218863
9155b18863C6513a69101j93098B2981c00062n1643B83883B6359a68532m0721R437
$$ -218863 36513 -169101 -362199 22981 -300062 -351705 283883 26359 -168532 -209253 -199816
9144a99816k7997g1491D73324j02792a55872g3299b9723j42109A08438i820B5097
$$ -199816 -227813 -71491 473324 370532 -155872 -73299 -29723 -171832 108438 -9820 25097
9132C6841b29996B0168f1164A62152b67940a374A25083b18375e1113k25072i9647
$$ 36841 -229996 20168 -61164 162152 -267940 -1374 125083 -218375 -51113 -276185 -99647
9120B8395c84209G9563J2714J22797a00978j07820h4475A15071J98060a96959
$$ 28395 -384209 79563 92277 215074 -100978 -208798 -84475 115071 313131 -196959
9109c44607b2842A83055D9224N2120a0080o45937H1699P4968a73502P1967m3132
$$ -344607 -22842 183055 49224 101344 -10080 -656017 81699 156667 -173502 -101535 -144667
9098a44667A8304R3120e57616C8278a85047A3441a79663L9218o2889K5143H9988
$$ -144667 18304 111424 -557616 38278 -185047 13441 -179663 -140445 -203334 -178191 89988
9086F9724g9906J8546l2468A00131k3083b54582A50333h2591H0325a19852j71095
$$ 69724 -79906 -61360 -93828 100131 77048 -254582 150333 -82591 80325 -119852 -290947
9075b90947R5414a4469I6600a02411M1376k368I9540c49244A77296a13908N3093
$$ -290947 -195533 -14469 96600 -102411 -61035 -63403 99540 -349244 177296 -113908 -60815
9064f0815j5145j40043A7597g0839D5644a5675p940D11495b12618l70669A30041
$$ -60815 -75960 -216003 17597 -70839 45644 -15675 -23615 411495 -212618 -583287 130041
9052B5435a77133N7892j93226d1787J8630j54184F8735J33680i9394L183j5149
$$ 25435 -177133 -119241 -312467 -41787 -23157 -177341 68735 202415 -99394 -96211 -111360
9041a11360A62505a22117b5500n6033C219g0427j18353R2509C1734J2112K58285
$$ -111360 162505 -122117 -25500 -81533 3219 -70427 -188780 -96271 31734 43846 302131
9030C02131e7784J2909j65136j06217J00679k04659A29228e2051B9179J6044c55257
$$ 302131 -57784 -44875 -210011 -316228 -215549 -420208 129228 -52051 29179 45223 -355257
9018A00370c45574a16751A53756B764J40207a73977A45748c7721d891m82931A73416
$$ 100370 -345574 -116751 153756 2764 142971 -173977 145748 -37721 -4891 -487822 173416
9006c08773e1782j10645C8167h0443k4174j8810L5711K2813j4863p8109A86166
$$ -308773 -51782 -162427 38167 -80443 -104617 -123427 -87716 -64903 -79766 -157875 186166
8994A41692a95212N5859H7470j5441g1895F8646a84568P1568j24158A01498a04388
$$ 141692 -195212 -139353 87470 72029 -71895 68646 -184568 -113000 -237158 101498 -104388
8982a38534j59296g7238j44003f3843B0798J44948d6493k18709f8503A16262a12629
$$ -138534 -297830 -77238 -221241 -63843 20798 165746 -46493 -265202 -68503 116262 -112629
8970B46856o8677b05008A35279d4597A33617g1946B13361a52717j58980i7284
$$ 246856 178179 -205008 135279 -44597 133617 -71946 213361 -152717 -311697 -97284
8959a33800E0660a24156m1417A7549e7216G6568f6589k59884a28471n9209b5643
$$ -133800 50660 -124156 -165573 17549 -57216 76568 -66589 -326473 -128471 -187680 -25643
8947B26836a45866A58278a39186c5366k1838e707A27808A2882J1395K52504d34044
$$ 226836 -145866 158278 -139186 -35366 -57204 -5707 127808 12882 24277 276781 -434044
8935a84284F5061M78420j40617f610B46455a08371A410b2986H14b4466A53273
$$ -184284 65061 543481 402864 -6610 246455 -108371 1410 -22986 814 -24466 153273
8923A036146J151023M550947J0113995H241527B004558o19558D73806M6109B05851
$$ 1036146 2187169 6738116 16852111 8241527 2004558 1385000 473806 519915 205851
8913a878n8572n3195A10121a144A65438J69945k6382a25903B14746k1468i1417
$$ -1878 -60450 -113645 110121 -1144 165438 335383 309001 -125903 214746 193278 -91417
8901a91505A30159b54395f7387A03958B7524b45449A6733a19076A994J34253a84674
$$ -191505 130159 -254395 -67387 103958 27524 -245449 16733 -119076 1994 136247 -184674
$$ [...]
##END NTUPLES=NMR SPECTRUM
##END=
