##TITLE=AC1475_ZNESTR301_8100901_303tCqPQpd
##JCAMPDX= 6.0         $$ Bruker NMR JCAMP-DX V2.0
##DATA TYPE= NMR SPECTRUM
##DATA CLASS= NTUPLES
##ORIGIN= BRUKER
##OWNER= Administrator
$$ 1.72 TOPSPIN		Version 2.1
$$ 2013-08-15 16:31:39.053 -0700  Administrator@X
$$ Compression mode = diff/dup
##.OBSERVE FREQUENCY= 400.02188249412
##.OBSERVE NUCLEUS= ^1H
##.ACQUISITION MODE= SIMULTANEOUS (DQD)
##.ACQUISITION SCHEME= undefined
##.AVERAGES= 64
##.DIGITISER RES= 22
##SPECTROMETER/DATA SYSTEM= spect
##.PULSE SEQUENCE= noesygpps1d.comp
##.SOLVENT NAME= COFFEE_meoh
##.SHIFT REFERENCE= INTERNAL, COFFEE_meoh, 1, 14.96128
##AUDIT TRAIL= $$ (NUMBER, WHEN, WHO, WHERE, PROCESS, VERSION, WHAT)
$$ ##TITLE= Audit trail, TOPSPIN		Version 2.1
$$ ##JCAMPDX= 5.01
$$ ##ORIGIN= Bruker BioSpin GmbH
$$ ##OWNER= Administrator
$$ $$ E:\/data/COFFEE/nmr/AC1475_ZNESTR301_8100901_303tCqPQpd/22/pdata/1/auditp.txt
$$ ##AUDIT TRAIL=  $$ (NUMBER, WHEN, WHO, WHERE, PROCESS, VERSION, WHAT)
(   1,<2013-08-15 16:31:34.271 -0700>,<Administrator>,<X>,<go>,<TOPSPIN 2.1>,
      <created by zg
	started at 2013-08-15 16:20:04.141 -0700,
	POWCHK enabled, PULCHK disabled,
       configuration hash MD5:
       C8 4E 4E 5D D3 5C D8 9E 9F 52 82 E0 59 8A DE 15
       data hash MD5: 64K
       3B BB F0 23 43 C8 F6 FC DF 24 E5 56 57 35 1B 0B>)
(   2,<2013-08-15 16:31:37.209 -0700>,<Administrator>,<X>,<proc1d>,<TOPSPIN 2.1>,
      <Start of raw data processing
       efp LB = 0.3 FT_mod = 6 PKNL = 1 PHC0 = 0 PHC1 = 0 SI = 128K 
       data hash MD5: 128K
       CB C1 B7 AC 06 E8 92 36 F7 78 E0 58 0F A5 75 FF>)
(   3,<2013-08-15 16:31:38.146 -0700>,<Administrator>,<X>,<proc1d>,<TOPSPIN 2.1>,
      <pk PHC0 = -79.07959 PHC1 = 0 
       data hash MD5: 128K
       FF DF EC 9D A5 77 17 26 7C 1A AD 70 8F 4D 2C 18>)
(   4,<2013-08-15 16:31:38.537 -0700>,<Administrator>,<X>,<proc1d>,<TOPSPIN 2.1>,
      <abs ABSG = 1 
       data hash MD5: 128K
       0E 88 3E 71 A3 46 23 8F D7 E9 CC 02 5B DB 44 BB>)
(   5,<2013-08-15 16:31:38.646 -0700>,<Administrator>,<X>,<proc1d>,<TOPSPIN 2.1>,
      <abs ABSG = 2 
       data hash MD5: 128K
       22 72 1A 2A 2A 78 5F 4A 5B 92 F4 F2 3C 7A F4 42>)
(   6,<2013-08-15 16:31:38.724 -0700>,<Administrator>,<X>,<proc1d>,<TOPSPIN 2.1>,
      <abs ABSG = 3 
       data hash MD5: 128K
       5D D7 A6 6E 57 65 11 41 DB 36 2F 78 12 78 F8 FA>)
(   7,<2013-08-15 16:31:38.803 -0700>,<Administrator>,<X>,<proc1d>,<TOPSPIN 2.1>,
      <abs ABSG = 4 
       data hash MD5: 128K
       0F 42 E2 AE 7C 8C B4 1B 40 ED F6 29 AA BF 31 54>)
(   8,<2013-08-15 16:31:38.881 -0700>,<Administrator>,<X>,<proc1d>,<TOPSPIN 2.1>,
      <abs ABSG = 5 
       data hash MD5: 128K
       EE 0F 44 64 7D 00 CC B7 52 7C A8 52 AB 41 7D 81>)
$$ ##END=
$$ 
$$ $$ hash MD5
$$ $$ 0E B8 CB 43 9E 6B D7 A4 B1 DC D7 21 39 AD EF C3
##$RELAX= 
##$RELAX= 
##$RELAX= 
##$RELAX= 
##$RELAX= 
##$RELAX= 
##$RELAX= 
##$RELAX= 
$$ Bruker specific parameters
$$ --------------------------
##$DU= <E:\>
##$EXPNO= 22
$$ [...]
##$TP07= 0
##$TPNAME0= <>
##$TPNAME1= <>
##$TPNAME2= <>
##$TPNAME3= <>
##$TPNAME4= <>
##$TPNAME5= <>
##$TPNAME6= <>
##$TPNAME7= <>
##$TPOAL= (0..7)
0.5 0.5 0.5 0.5 0.5 0.5 0.5 0.5
##$TPOFFS= (0..7)
0 0 0 0 0 0 0 0
##$TUNHIN= 0
##$TUNHOUT= 0
##$TUNXOUT= 0
##$USERA1= <user>
##$USERA2= <user>
##$USERA3= <user>
##$USERA4= <user>
##$USERA5= <user>
##$V9= 5
##$VALIST= <valist>
##$VCLIST= <CCCCCCCCCCCCCCC>
##$VD= 0
##$VDLIST= <DDDDDDDDDDDDDDD>
##$VPLIST= <PPPPPPPPPPPPPPP>
##$VTLIST= <TTTTTTTTTTTTTTT>
##$WBST= 1024
##$WBSW= 4
##$XGAIN= (0..3)
0 0 0 0
##$XL= 0
##$YL= 0
##$YMAX_a= 6543658
##$YMIN_a= -13997186
##$ZGOPTNS= <>
##$ZL1= 120
##$ZL2= 120
##$ZL3= 120
##$ZL4= 120
##$ABSF1= 14.96128
##$ABSF2= -5.596902
##$ABSG= 5
##$ABSL= 3
##$ALPHA= 0
##$AQORDER= 0
##$ASSFAC= 0
##$ASSFACI= 0
##$ASSFACX= 0
##$ASSWID= 0
##$AUNMP= <proc_prof1d_extract.lims>
##$AXLEFT= 0
##$AXNAME= <>
##$AXNUC= <1H>
##$AXRIGHT= 0
##$AXTYPE= 0
##$AXUNIT= <>
##$AZFE= 0.1
##$AZFW= 0.1
##$BCFW= 0
##$BC_mod= 0
##$BYTORDP= 0
##$COROFFS= 0
##$CY= 15
##$DATMOD= 1
##$DC= 0
##$DFILT= <>
##$DTYPP= 0
##$F1P= 0
##$F2P= 0
##$FCOR= 0.5
##$FTSIZE= 131072
##$FT_mod= 6
##$GAMMA= 0
##$GB= 0
##$INTBC= 1
##$INTSCL= 1
##$ISEN= 128
##$LB= 0.3
##$LEV0= 0
##$LPBIN= 0
##$MAXI= 10000
##$MC2= 0
##$MEAN= 0
##$ME_mod= 0
##$MI= 0
##$NCOEF= 0
##$NC_proc= -2
##$NLEV= 6
##$NOISF1= 0
##$NOISF2= 0
##$NSP= 0
##$NTH_PI= 0
##$NZP= 0
##$OFFSET= 14.96128
##$PC= 1
##$PHC0= -79.07959
##$PHC1= 0
##$PH_mod= 1
##$PKNL= yes
##$PPARMOD= 0
##$PPDIAG= 0
##$PPIPTYP= 0
##$PPMPNUM= 2147483647
##$PPRESOL= 1
##$PSCAL= 4
##$PSIGN= 0
##$PYNMP= <proc.py>
##$REVERSE= no
##$SF= 400.020009526936
##$SI= 131072
##$SIGF1= 0
##$SIGF2= 0
##$SINO= 400
##$SIOLD= 131072
##$SPECTYP= <>
##$SREGLST= <1H.CDCl3>
##$SSB= 0
##$STSI= 131072
##$STSR= 0
##$SW_p= 8223.68421052631
##$SYMM= 0
##$S_DEV= 0
##$TDeff= 65536
##$TDoff= 0
##$TI= <>
##$TILT= no
##$TM1= 0
##$TM2= 0
##$TOPLEV= 0
##$USERP1= <user>
##$USERP2= <user>
##$USERP3= <user>
##$USERP4= <user>
##$USERP5= <user>
##$WDW= 1
##$XDIM= 131072
##$YMAX_p= 398372446
##$YMIN_p= -11110
##$CURPLOT= <Network HP LaserJet P1505>
##$CURPRIN= <$Network HP LaserJet P1505>
##$DFORMAT= <normdp>
##$LAYOUT= <+/1D_H.xwp>
##$LFORMAT= <normlp>
##$PFORMAT= <normpl>
##$SURQMSG= 1
$$ End of Bruker specific parameters
$$ ---------------------------------
##NTUPLES= NMR SPECTRUM
##VAR_NAME=  FREQUENCY,     SPECTRUM/REAL,   SPECTRUM/IMAG
##SYMBOL=    X,             R,               I
##VAR_TYPE=  INDEPENDENT,   DEPENDENT,       DEPENDENT
##VAR_FORM=  AFFN,          ASDF,            ASDF
##VAR_DIM=   131072,        131072,          131072
##UNITS=     HZ,            ARBITRARY UNITS, ARBITRARY UNITS
##FACTOR=    0.0627417313425164, 1,          1
##FIRST=     8223.62146879497, 6730,         -67030
##LAST=      0,             8373,            -65948
##MIN=       0,             -11110,          0
##MAX=       8223.62146879497, 398372446,    0
$$ Real data points
##PAGE= N=1
##DATA TABLE= (X++(R..R)), XYDATA
$$ [...]
67587 73470 72430 71320 70330 69637 69121 68463 67568 66758 66477 66847 67574 68277 68780 69082 69194 69151 69041 68839 68354
67568 68354 67550 66860 66883 67783 69194 70699 72096 73181 73634 73348 72675 72144 71987 72041 72008 71748 71389 71188 71235
67549 71235 71336 71294 71171 71117 71076 70929 70781 70727 70469 69674 68702 68371 68842 69280 68912 67922 66996 66454 66285 66610
67529 66610 67583 69029 70552 71791 72334 71793 70385 69038 68397 68063 67390 66642 66594 67227 67665 67440 66979 66719
67511 66719 66484 66018 65483 65124 64956 65091 65787 66855 67487 67119 66152 65402 65117 64900 64388 63650 62992 62604 62356
67492 62356 61902 61146 60575 60802 61761 62825 63717 64756 66044 67132 67830 68656 69902 70913 71026 70731 71021
67475 71021 71900 72508 72534 72534 72770 72745 72165 71522 71275 71178 70926 70821 71160 71440 70938 69841 69124 69354 70202 71138
67455 71138 72086 73201 74455 75704 76896 77999 78875 79395 79564 79418 78935 78154 77302 76607 76086 75650 75358
67438 75358 75372 75622 75766 75578 75280 75277 75661 76155 76553 76942 77387 77623 77354 76763 76406 76512 76636 76184 75123 73939
67418 73939 72925 71827 70341 68844 68270 69139 70796 71814 71240 69436 67717 67171 67781 68595 68745 68301
67402 68301 68084 68596 69335 69407 68725 68183 68572 69676 70720 71415 72084 72850 73232 72721 71442 70008 68908 68311
67384 68311 68336 69168 70752 72593 74042 74749 74750 74204 73257 72146 71189 70528 70084 69869 70100 70813 71554 71865 71913
67365 71913 72218 72828 73236 73158 72884 72677 72372 71889 71640 72003 72656 72941 72634 71949 70999 69776 68580 67961 68219
67346 68219 69236 70731 72353 73638 74303 74528 74609 74463 73928 73398 73551 74374 75000 74691 73590 72418 71810
67329 71810 72004 72691 73119 72839 72469 73177 75178 77256 78146 77886 77493 77701 78471 79387 80050 80250 80111 79974
67311 79974 79902 79530 78625 77545 76907 77037 77940 79431 80931 81517 80659 78832 77062 76092 76196 77444 79651
67294 79651 82224 84513 86224 87247 87432 86946 86478 86477 86450 85676 84417 83728 84112 85132 86311 87574 88608
67277 88608 88682 87616 86275 85538 85247 84738 84000 83565 83509 83346 82993 83123 84191 85537 85967 85156 84094 84029
67259 84029 85224 86907 88216 88896 89133 89099 88904 88751 88887 89417 90277 91235 91787 91271 89456 86975 84948
67242 84948 84129 84529 85655 86848 87503 87396 86876 86510 86496 86557 86336 85701 84810 84122 84185 85083 86194 86836 86974
67223 86974 86956 86821 86490 86469 87530 89589 91581 92708 93197 93567 93838 93824 93623 93273 92481 91223 90149 89804
67205 89804 89810 89502 89043 89194 90173 91468 92706 93929 94999 95494 95404 95286 95458 95609 95546 95709 96402 96965 96403
67186 96403 94771 93293 93024 93851 95024 96177 97420 98712 99677 100171 100579 101263 101979 102163 101688 100993 100498
67169 100498 100251 100171 100269 100509 100786 101228 102230 103898 105690 106860 107161 106927 106683 106847 107517 108287 108515 108150
67151 108150 108034 109002 110838 112560 113598 114173 114620 114894 114899 114793 114761 114825 114998 115313 115576 115527 115385 115749 116707
67132 116707 117470 117387 116940 117199 118469 120031 121239 122279 123620 125184 126472 127287 127911 128559 129024 129040 128766
67115 128766 128682 129090 130011 131550 133974 137182 140319 142301 142773 142369 142006 142142 142709 143496 144413 145496 146797
67098 146797 148269 149724 150937 151748 152013 151636 150855 150415 151010 152462 153761 154184 154165 154811 156666 159188 161444
67081 161444 163054 164378 165911 167666 169236 170363 171239 172162 173128 174031 175145 176962 179438 181805 183370
67066 183370 184268 185135 186262 187349 188055 188500 189212 190727 193214 196344 199502 202146 204032 205248 206264
67051 206264 207831 210428 213663 216574 218673 220321 221936 223399 224642 226280 228943 232272 235298 237717
67037 237717 240041 242545 244856 246718 248399 250066 251521 252895 254925 257985 261444 264583 267633 271189
67023 271189 275041 278446 281347 284453 288118 291953 295693 299654 304017 308277 311851 314801 317623 320632
67009 320632 323956 327767 332078 336462 340436 344129 348252 353367 359366 365650 371656 377211 382498 387776
66995 387776 393168 398738 404655 411052 417783 424569 431394 438434 445495 451924 457346 462257 467566 473722
66981 473722 480530 487642 494890 502224 509577 516825 523767 530316 536866 544226 552859 562322 571802 581132
66967 581132 590930 601718 613250 624770 635728 646142 656430 666940 677621 688203 698734 709654
66955 709654 721200 733069 744983 757272 770399 784199 798227 812743 828553 845779 863448
66944 863448 880624 897393 914370 931744 949214 966560 983876 1001509 1020093 1040290 1062072
66933 1062072 1084430 1106200 1127107 1147814 1169172 1191708 1215540 1240354 1265584 1291006 1317076
66922 1317076 1344371 1372830 1401838 1430913 1459927 1488773 1517304 1545681 1574417 1603881 1633932
66911 1633932 1664141 1694223 1724266 1754584 1785290 1815979 1846039 1875431 1904916 1935140 1965729
66900 1965729 1995640 2024249 2051698 2078298 2104110 2129133 2153344 2176416 2197801 2217390 2235822
66889 2235822 2253852 2271537 2288125 2302618 2314447 2323810 2331447 2337930 2343150 2346626 2348202 2348105 2346362
66876 2346362 2342547 2336280 2327693 2317302 2305631 2293028 2279563 2264939 2248672 2230551 2210818 2189928
66864 2189928 2168287 2146098 2123091 2098414 2071313 2042104 2012123 1982471 1953132 1923526 1893502
66853 1893502 1863358 1833168 1802649 1771679 1740525 1709453 1678411 1647267 1616198 1585651 1555931
66842 1555931 1526915 1498307 1470096 1442575 1415787 1389215 1362340 1335318 1308697 1282584 1256650
66831 1256650 1231014 1206449 1183376 1161112 1138560 1115374 1092145 1069674 1048402 1028301 1008949
66820 1008949 989823 970743 951923 933478 915219 897106 879492 862543 845886 829235 812988
66809 812988 797632 782914 768289 753904 740342 727514 714659 701521 688673 676423 664169
66798 664169 651296 638098 625332 613307 601953 591418 581930 573122 564046 554051 543437 533247
66786 533247 524437 517141 510538 503508 495520 486870 478111 469551 461387 453982 447633 442155 436919 431345
66772 431345 425254 418835 412333 405764 398932 391892 385260 379719 375171 370744 365859 360859 356372 352390
66758 352390 348394 344135 339825 335702 331831 328251 324913 321436 317351 312701 308100 304144 300999 298523
66744 298523 296453 294355 291789 288734 285606 282623 279404 275464 271009 266932 263956 261932 260033 257615
66730 257615 254798 252168 249924 247521 244329 240535 237052 234481 232468 230250 227575 224816 222406 220490
66716 220490 219073 218102 217300 216203 214561 212561 210476 208240 205634 202857 200594 199335 198741 197951 196504
66701 196504 194753 193282 192104 190676 188682 186565 185162 184861 185203 185290 184544 183064 181308 179505 177486
66686 177486 175130 172805 171196 170646 170773 170696 169615 167301 164310 161754 160586 160893 161893 162679 162792 162137
66670 162137 160682 158597 156448 154874 154024 153533 153055 152549 152020 151298 150205 148763 147107 145351 143624 142028
66654 142028 140458 138632 136554 134765 133867 133838 134033 133918 133599 133545 133923 134296 133975 132673 130864 129480 129197
66637 129197 129972 131216 132255 132617 132099 130816 129170 127582 126263 125325 124921 125058 125368 125368 124956 124309 123354
66620 123354 121755 119581 117566 116385 115955 115721 115361 114841 114019 112755 111393 110598 110557 110685 110350 109588 108905
66603 108905 108618 108630 108753 109002 109548 110420 111191 111077 109687 107717 106486 106528 107049 107103 106892 107268 108244 108835 108479
66584 108479 107817 107665 107844 107563 106570 105334 104323 103674 103431 103527 103505 102795 101402 99975 99081 98789 99003 99719
66566 99719 100752 101585 101770 101261 100210 98775 97301 96287 95882 95706 95455 95326 95508 95668 95434 95076 95108 95406
66548 95406 95419 95158 95299 96168 97247 97885 98000 97814 97361 96556 95431 94079 92701 91856 92181 93541 94878
66531 94878 95295 95024 94881 95096 95200 94873 94374 94061 93917 93639 93002 92063 91140 90577 90439 90584 91045 92042 93374
66512 93374 94213 93896 92736 91645 91075 90733 90135 89038 87482 85888 85069 85539 86791 87678 87564 86749 85814
66495 85814 85054 84610 84574 84776 84902 84889 84815 84422 83417 82390 82634 84610 87202 89017 89919 90650 91466 91895
66477 91895 91642 90982 90265 89579 88891 88039 86718 85020 83869 84199 85605 86509 85959 84708 84173 84804 85973
66460 85973 87064 88063 89078 89838 89864 88929 87229 85253 83649 83087 83934 85851 87853 89059 89463 89684 89985
66443 89985 89963 89435 89070 89516 90219 89930 88354 86534 85422 84869 84403 84196 84625 85390 85849 85918 85894 85615 84680
66424 84680 83513 83327 84680 86676 87946 87988 87237 86336 85768 85822 86382 86940 87188 87347 87588 87489 86676 85740 85711
66405 85711 86649 87515 87627 87456 87633 87845 87364 86159 84805 83628 82654 82227 82828 84251 85610 86398 86919
66388 86919 87516 87994 88149 88220 88325 87941 86608 84875 83874 84032 84723 85149 85083 84760 84577 85018 86398 88436
66370 88436 90384 91694 92331 92382 91759 90464 88801 87073 85349 83700 82349 81357 80513 79859 80002 81404
66354 81404 83529 85245 86098 86739 87934 89540 90753 91094 90809 90384 90014 89707 89625 90005 90726 91224 91033 90258
66336 90258 89344 88477 87569 86742 86427 86798 87460 87924 88180 88562 89280 90291 91397 92162 92010 90876 89638 89466
66318 89466 90667 92490 93964 94568 94175 92912 91259 89875 89058 88591 88211 87936 87870 88029 88453 89111 89634
66301 89634 89664 89636 90569 92664 94695 95386 94978 94687 94890 94734 93518 91660 90108 89380 89500 90315 91494 92522
66283 92522 93020 92964 92537 92028 91868 92326 93056 93389 93208 92998 92901 92384 91267 90439 90848 92179 93257 93484 93177
66264 93177 92713 92163 91774 91928 92429 92577 92266 92309 93237 94346 94531 93655 92532 91813 91484 91331 91365 91731 92553
66245 92553 93818 95096 95554 94708 93181 92220 92324 92775 92724 92346 92568 93869 95732 97323 98380 99289 100368
66228 100368 101341 101674 101306 100757 100440 100135 99440 98478 97746 97365 96985 96476 96251 96652 97402 97960 98133 98060 97849
66209 97849 97592 97560 97982 98700 99369 99939 100595 101247 101535 101400 101315 101681 102285 102557 102211 101449 100688 100297 100433 100890
66189 100890 101125 100673 99667 98814 98830 99861 101463 103007 104091 104602 104538 103930 103007 102334 102536 103815 105748
66172 105748 107613 108813 109106 108644 107929 107511 107530 107631 107443 107009 106536 105947 105075 104297 104500 106117 108462 110309
66154 110309 111038 110924 110493 110028 109727 109849 110400 110957 111130 111060 111142 111383 111492 111553 112090 113279 114528 115175 115287
66135 115287 115389 115639 115737 115573 115454 115614 115971 116452 117176 118115 118911 119294 119403 119467 119444 119283 119302 119909 120963 121775
66115 121775 121776 121019 120058 119526 119796 120802 122137 123401 124430 125139 125351 125013 124478 124302 124787 125856 127243
66098 127243 128561 129330 129278 128678 128116 127930 128076 128432 128899 129269 129440 129805 130959 132816 134428 134922 134336 133295
66080 133295 132240 131288 130573 130232 130140 129981 129612 129160 128837 128835 129265 129954 130377 130102 129243 128271 127443 126702 126094
66061 126094 125927 126363 127126 127841 128549 129663 131333 132995 133703 133071 131828 131243 131897 133192 134146 134420 134393
66044 134393 134429 134466 134251 133671 132822 131964 131451 131493 131930 132379 132616 132667 132616 132609 133017 134259 136292 138520 140380 141786
66024 141786 142903 143740 144252 144669 145340 146262 147047 147435 147586 147719 147714 147324 146714 146442 146859 147758 148802 150072
66006 150072 151865 154040 155950 157184 158063 159275 161207 163868 167162 170857 174374 177058 178800 180189
65992 180189 181874 183925 185878 187312 188260 189070 189962 190728 190941 190433 189426 188099 186230 183520 180231 177129
65976 177129 174713 172742 170742 168761 167346 166796 166715 166428 165660 164597 163378 161887 160243 159192 159566 161324
65960 161324 163451 164903 165397 165283 165078 165319 166472 168548 171005 173316 175466 177638 179764 181794 184144
65945 184144 187273 190979 194637 198099 201788 205857 209863 213417 216587 219384 221402 222344 222626 223113 224348
65930 224348 226202 228070 229319 229862 230401 231776 233950 236022 237385 238405 239716 241323 242832 244200 245816
65915 245816 248039 251039 254869 259247 263449 266790 269120 270586 271216 271159 271085 271685 272766 273404 273119 272488
65899 272488 272387 272966 273579 273552 272786 271615 270214 268215 265037 260599 255549 250723 246542 242998 239868 236758
65883 236758 233239 229297 225490 222438 220382 219367 219329 219571 218728 216083 212709 210489 210061 210490 210978 211933
65867 211933 213998 216908 219853 222357 224117 224488 222929 219870 216499 213631 211288 209389 208332 208566 209787
65852 209787 210904 210909 209786 208474 207843 207815 207675 207202 207054 207824 209099 209855 209664 209059 208679 208432 207738 206450
65834 206450 205255 205076 206167 207933 209655 211226 213027 215310 217995 221085 224857 229426 234330 238787
65820 238787 242307 244958 247167 249354 251614 253601 254853 255316 255459 255781 256390 257095 257622 257604 256696 255047
65804 255047 253453 252696 252794 253209 253643 254310 255483 257077 258683 259700 259568 258294 256806 256320 257200 258756
65788 258756 260333 262173 264963 268876 273525 278602 284150 290231 296841 304181 312627 322248 332610 343228
65774 343228 353924 364502 374270 382243 387836 391145 392574 392387 390660 387455 382942 377475 371672 366272
65760 366272 361791 358433 356529 357001 361079 369404 381592 396819 414699 435392 458997 485166 513377
65747 513377 543253 574427 606278 638081 669249 699079 726293 749209 766555 777925 783354 782707
65735 782707 775669 762213 742865 718634 690776 660426 628270 594735 560688 527655 497027 469208
65723 469208 443823 420546 399290 379861 362036 345970 331890 319372 307594 296473 286878 279399
65711 279399 273545 268568 264410 261208 258436 255354 252044 249193 246994 245051 243351 242484 242668 243207 243248
65696 243248 242688 242080 241996 242754 244383 246536 248600 250166 251355 252709 254933 258671 264182 271136 278995
65681 278995 287632 297326 308162 319933 332790 347590 365313 386377 410642 437727 467122 498377
65669 498377 531594 567518 606708 648498 690892 731419 768117 800053 827279 850304 869449
65658 869449 884637 895726 902861 906556 907649 907203 906142 904867 903431 902104 901419 901545 901947 901814 900449
65643 900449 897074 890601 879978 864619 844355 819256 789685 756252 719501 679959 638706 597455
65631 597455 557669 519819 483839 449965 418751 390632 365907 344866 327353 312404 298965
65620 298965 286890 276708 268526 261732 255737 250348 245346 240377 235539 231486 228599 226472 224556 222916
65606 222916 221959 221669 221589 221427 221309 221388 221488 221240 220490 219574 219210 220020 222074 224912 228049 231366 235085 239509
65588 239509 244801 250842 257270 263869 270970 279294 289354 301297 315374 332200 352244 375343 401101
65575 401101 429582 461141 495511 531498 567766 603591 638588 671965 702448 728869 750442
65564 750442 766406 775785 777790 772267 759607 740433 715626 686427 654034 619064 581777 542921
65552 542921 504037 466769 432126 400526 372238 347455 326073 307678 291780 278001 266202
65541 266202 256478 248928 243312 239149 236182 234490 233986 234160 234516 234976 235574 236048 236135 236044 236163 236339 235855
65524 235855 234143 231269 227760 224228 221058 218125 214908 211194 207662 205337 204500 204469 204510 204586 205054 205970
65508 205970 206950 207576 207761 207731 207698 207558 206992 205893 204491 202995 201444 200101 199544 199920 200471 200471 200410 201562
65490 201562 204418 208294 212535 217305 222918 229081 235212 240991 246192 250356 253055 254210 253935 252456
65476 252456 250328 248213 246091 243274 239565 235813 232720 229738 225944 221587 217770 214770 211718 208124
65462 208124 204844 203061 202896 203456 203821 203548 202545 200997 199401 198299 197909 198072 198504 199019 199677 200858
65446 200858 203084 206514 210600 214357 217113 218988 220608 222316 223753 224349 224174 224024 224565 225663 226820
65431 226820 227920 229135 230320 231099 231644 232705 234565 236420 237224 236918 236334 236063 235911 235494 234887 234502 234637
65414 234637 235371 236671 238340 239947 241016 241274 240665 239316 237557 235834 234359 233025 231841 231253 231635
65399 231635 232592 233267 233407 233659 234715 236650 239387 243205 248214 253566 257835 260118 260361 258780 255633
65384 255633 251616 247810 244920 242877 241299 239916 238428 236505 234344 232817 232594 233335 234131 234512 234652
65369 234652 234852 235372 236637 238975 242022 244886 247205 249703 253425 258659 264989 272268 281046 291825
65355 291825 304202 317091 329745 342206 354674 366773 377744 387077 394525 399592 401602 400426
65343 400426 396768 391483 384934 377256 368844 360169 351339 342281 333264 324813 317081 309676 302231 294941
65329 294941 288428 283226 279433 276728 274674 273066 271996 271486 271190 270558 269207 267003 263923 260098 255938
65314 255938 251914 248097 244052 239299 233886 228576 224462 222155 221174 220302 218773 216997 215845 215440 215067
65299 215067 214250 213411 213294 214137 215664 217608 219882 222375 224878 227229 229320 230946 231829 231841 231161 230175
65283 230175 229233 228496 227966 227694 227922 228914 230609 232516 234097 235244 236309 237670 239415 241534 244300 248164
65267 248164 253093 258229 262547 265888 269051 272776 276912 280814 284289 287777 291677 295759 299230 301094
65253 301094 300515 297205 291617 284619 276907 268886 260995 253742 247271 241248 235439 230149 225824 222459
65239 222459 219747 217682 216528 216238 216411 216960 218325 220686 223327 225268 226314 226975 227441 227269 226214 224745
65223 224745 223327 221690 219400 216853 215047 214369 214205 213857 213349 213120 213353 213978 215029 216658 218817 221135
65207 221135 223022 223907 223651 222843 222418 222760 223363 223560 223289 222897 222439 221559 220039 218140 216394 215214 214701
65190 214701 214738 215283 216595 218926 221954 224823 226914 228360 229647 231036 232611 234465 236375 237557 237275
65175 237275 235652 233530 231638 230174 228931 227372 224837 221242 217584 215153 214205 213890 213421 212731 211982
65160 211982 211151 210439 210446 211471 212970 214121 214699 215019 215239 215106 214366 213221 212373 212727 214948 219180 225185
65143 225185 232591 240832 249076 256751 264214 272405 281669 291313 300531 309360 318452 328286 338939 350273
65129 350273 361911 373280 384107 394784 405899 417468 428859 439266 447984 454424 458260 459570
65117 459570 458571 455219 449269 440603 429302 415590 400072 383895 368269 353701 339911 326482
65105 326482 313381 300930 289580 279759 271639 264961 259229 254161 249766 245959 242354 238585 234759
65092 234759 231508 229537 229061 229592 230324 230830 231318 232114 233006 233314 232555 230856 228741 226720 225113 224077
65076 224077 223624 223668 224056 224566 224972 225279 225857 227164 229280 231798 234239 236494 238810 241386 244026 246174
65060 246174 247396 247827 248070 248607 249334 249811 249803 249442 248909 248183 247212 246169 245398 245062 244937 244607 243844 242726
65042 242726 241361 239659 237529 235230 233319 232125 231390 230452 228707 225966 222560 219101 215962 212928 209588
65027 209588 206057 203048 201126 200196 199829 199770 199898 200029 200110 200391 201114 202203 203597 205677 208923 213232 218013
65010 218013 222911 228025 233414 238865 244300 249997 256189 262728 269375 276136 282965 289280 294140 297010
64996 297010 298207 298544 298628 298565 298289 298024 298316 299692 302400 306424 311539 317296 323235 329232 335378 341289
64980 341289 345820 347800 346900 343490 337854 330037 320416 309908 299463 289690 281044 273940 268431 264021
64966 264021 260106 256508 253534 251654 251165 251916 253217 254181 254271 253558 252536 251885 252146 253166 253924 253414 251815
64949 251815 250278 249460 248855 247769 246318 244989 243833 242750 242144 242527 243656 244785 245700 246830 248340
64934 248340 249802 250878 251682 252233 252185 251411 250326 249250 247906 246003 243924 242292 241131 240009 238923
64919 238923 238375 238505 238692 238318 237610 237425 238332 240182 242524 245176 248283 251962 256103 260603 265634 271565
64903 271565 278678 287134 297081 308433 320511 332382 343874 355871 369239 383764 398624 413593
64891 413593 429014 444641 459401 472603 484620 495784 505193 511328 513495 511939 506765 497696 485082
64878 485082 470367 455188 440474 426711 414529 404454 396413 390015 385188 382109 380534 379648 378627
64865 378627 377030 374613 371096 366251 360074 352782 344762 336422 327855 318702 308657 298159 288256 279650
64851 279650 272223 265599 259833 255214 251705 248990 246862 245132 243300 240941 238482 237020 237086 237970 238580
64836 238580 238578 238293 237911 237373 236936 237135 238064 239178 240011 240675 241481 242516 243888 245948 248797 251837 254361
64819 254361 256506 259233 263364 268957 275569 282747 290184 297732 305433 313349 321325 328992 335945 341783
64805 341783 346116 348720 349559 348454 345095 339740 333594 327873 322683 317506 312614 309099 307418 306871 306846
64790 306846 307564 309085 310537 311242 311896 313574 316043 318131 319480 320785 322352 323589 324167 324694 325903
64775 325903 327999 331200 336064 342714 350413 358528 367429 377799 389491 401723 414087 426646 439259
64762 439259 451508 463322 475094 487047 498991 510804 522791 535374 548686 562518 576368
64751 576368 589387 600497 608726 613344 613694 609180 599572 585284 567302 547018 526036 505769 486969
64738 486969 469719 453987 440072 428508 419771 414200 411819 411895 412892 413488 413750 414889 417678 421575
64724 421575 425724 430280 436077 443249 451086 459425 469312 481622 495534 509074 520878 530683 538195
64711 538195 542429 542531 538656 531517 521440 508330 492401 474469 455537 436363 417462 399276
64699 399276 382287 367039 353975 343143 334096 326196 319069 312738 307473 303537 300932 299290 298136
64686 298136 297419 297612 299168 301985 305616 309907 315131 321510 328839 336669 344670 352689 360513 367724 373894
64671 373894 378948 383235 387019 389847 390631 388587 384030 378021 371331 364041 356233 348740 342873 339428
64657 339428 338121 338069 338648 339774 341510 343663 345902 348142 350622 353623 357217 361313 365825 370719 375944
64642 375944 381440 387308 394012 402289 412665 424963 438391 452148 465814 479122 491606 502700
64630 502700 511969 519070 523700 525815 525630 523070 517520 508633 497134 484178 470106 454648 438352
64617 438352 422823 409152 397016 385835 375946 367835 360956 354444 348601 344435 341739 338800 334385
64604 334385 329184 324772 321797 319762 318157 317158 317295 318792 321264 323939 326289 328610 331837 336756 343497
64589 343497 351812 361595 373013 386307 401549 418517 436776 456001 476096 496803 517339 536725
64577 536725 554300 569543 581615 589744 594052 595310 593737 588742 580179 569136 556960 543985 529750
64564 529750 514005 496975 479038 460873 443649 428373 415102 403363 393155 384884 378442 373126
64552 373126 368601 365182 362963 361306 359671 358476 358707 360902 364843 370003 375958 382486 389486 396709
64538 396709 403490 408917 412323 413395 411814 407323 400400 392413 384635 377298 370035 362945 356704 351665
64524 351665 347479 343731 340490 337913 335650 333064 330035 327292 325843 326096 327529 329169 330402 331321 332400
64509 332400 333982 336215 339296 343521 349009 355523 362668 370179 377953 385898 393798 401283 407844 412909
64495 412909 416040 417182 416781 415596 414294 413139 412055 410984 410130 409923 410920 413705 418630 425463 433363
64480 433363 441337 448615 454524 458294 459400 458039 454885 450306 444161 436531 428385 421220 416122 413285
64466 413285 412265 412449 413455 415450 419051 424569 431170 437085 440878 442329 441920 439749 435482 429317 422406
64451 422406 415960 410305 405212 400884 398019 396924 397132 398051 399548 401684 404415 407978 413217 420915 430915
64436 430915 442339 454675 468247 483699 501468 521833 544998 570942 599594 631427 667694
64425 667694 709918 759381 817164 884327 961806 1050333 1150718 1263969 1390784 1530798 1682194
64414 1682194 1841704 2004770 2166078 2320474 2463829 2593379 2707601 2805627 2886196 2946829
64404 2946829 2984249 2995891 2980988 2940428 2876148 2790747 2686833 2566063 2429174 2277631
64394 2277631 2115093 1946837 1778079 1613369 1457046 1313038 1183778 1069831 970746 885820
64384 885820 814027 753907 703873 662346 627579 598020 573115 553220 538339 527325 518579 511067
64372 511067 504267 497595 490401 482346 473332 463230 452085 440401 428814 417498 406251 395161
64360 395161 384863 376014 368683 362337 356452 351196 347388 345567 345120 344721 343740 342864 343121 344725 347110
64345 347110 349652 351856 353130 352962 351345 348643 345138 340971 336415 331833 327441 323378 319860 316939
64331 316939 314296 311708 309598 308685 309141 310515 312385 314629 317105 319695 322757 327015 332764 339587 346991
64316 346991 354874 363142 371333 378968 385856 391685 395613 396708 394682 389915 382926 374161 364166 353555
64302 353555 342735 331897 321306 311439 302819 295774 290234 285694 281533 277568 274165 271696 270062
64289 270062 268997 268590 269101 270306 271474 272170 272816 274292 277177 281482 286903 293053 299460 305598 311129
64274 311129 316171 321275 326990 333304 339516 344750 348625 351350 353219 354213 354207 353409 352394 351714 351587 351938
64258 351938 352550 353055 352906 351611 349101 345788 342104 337966 332803 326224 318615 310983 304189 298393 293254
64243 293254 288590 284682 281911 280197 278918 277444 275740 274430 274286 275672 278440 282184 286354 290134
64229 290134 292566 293140 292278 291004 290112 289735 289624 289527 289233 288629 287898 287411 287172 286635 285389 283755 282334
64212 282334 281175 279872 278366 277126 276544 276640 277482 279334 282177 285501 288820 291948 294567 296079 296381
64197 296381 296398 297377 299815 303400 307685 312348 317089 321967 327777 335490 345171 355803 366207 375793
64183 375793 384489 392377 399462 405319 408849 408819 404914 398015 389292 379315 368219 356414 344796 334310
64169 334310 325436 317998 311404 305134 299057 293283 287816 282561 277594 273238 269835 267557 266349 265864
64155 265864 265641 265659 266650 269482 274173 279779 285263 290206 294757 299229 303779 308148 311710 314064 315486
64140 315486 316427 316704 315676 313160 309598 305319 300365 295182 290721 287492 285148 283396 282616 283072 284122
64125 284122 284919 285538 286722 288807 291531 294741 298568 302968 307696 312723 318233 324225 330553 337268 344406
64110 344406 351467 357620 362531 366551 369990 372654 374325 375335 376437 378289 381191 385118 389817 394875
64096 394875 399762 403909 406909 408700 409289 408260 404937 399319 392414 385267 377989 370256 362356 354985
64082 354985 348238 341622 335126 329465 325020 321285 317724 314646 312723 312055 312129 312488 313126 314388 316691
64067 316691 320166 324380 328601 332394 335747 338631 340868 342593 344366 346513 348620 349933 350016 348873 346841
64052 346841 344595 342834 341575 340049 337623 334558 331514 328685 325882 323255 321402 320789 321449 323175 325664
64037 325664 328570 331784 335652 340587 346417 352342 357482 361343 363946 365861 368035 371233 375541 380497
64023 380497 385512 390023 393539 395987 397908 399866 401687 402538 401697 398935 394331 388224 381381 374759 368902
64008 368902 363745 358942 354105 348910 343450 338466 334754 332271 330247 328157 326144 324509 323429 323258
63994 323258 324394 326557 328799 330623 332538 335115 338043 340677 343018 345463 347930 350043 352030 354669
63980 354669 358265 362224 365783 368685 371078 373182 375224 377327 379329 380991 382428 384034 385954 388029
63966 388029 390368 393574 398163 404047 410739 417861 425276 433044 441470 451031 461974 474094 487082
63953 487082 501055 516608 534469 555191 579134 606668 638401 675154 717604 766007 820424
63942 820424 881164 948722 1023361 1105016 1193582 1288837 1389915 1495212 1603082 1712349 1821934
63931 1821934 1930192 2034864 2133459 2223420 2302152 2367344 2417346 2451185 2468300 2468453 2451748
63920 2451748 2418555 2369522 2305795 2229142 2141707 2045711 1943402 1837003 1728514 1619774
63910 1619774 1512811 1409728 1311925 1219739 1133317 1053595 981936 918911 863918 815972 774409
63899 774409 738796 708643 683406 662480 645060 630301 617727 607276 598888 592316 587360 583982
63887 583982 582053 581218 581059 581256 581624 582328 584082 587771 593696 601369 610133 619779 630568 642986 657575
63872 657575 674722 694475 716780 741894 770323 802324 837835 876924 919908 966936 1017895
63861 1017895 1072922 1132562 1197146 1266369 1339714 1416862 1497335 1580169 1664394 1749500 1834886
63850 1834886 1919021 1999674 2074985 2143983 2206189 2261110 2308043 2345959 2373591 2389994 2395096
63839 2395096 2389393 2373117 2345958 2307662 2258686 2200257 2133993 2061456 1983914 1902483 1818481
63828 1818481 1733439 1648591 1564561 1481733 1400734 1322369 1247328 1176241 1109696 1047811 990054
63817 990054 935933 885718 840002 798766 761393 727417 696617 668468 642318 618237 596988
63806 596988 578912 563384 549586 537105 525549 514372 503727 494873 488874 485068 481539 477065
63794 477065 472117 468076 465975 465973 467426 469230 470406 470534 469510 467015 462601 456310 448742 440313 430805
63779 430805 419921 408114 396512 386058 376969 369073 362433 357343 353704 350676 347233 343125 339096
63766 339096 336028 334026 332445 330665 328604 326506 324476 322337 319938 317522 315680 314756 314310 313422 311707
63751 311707 309887 309088 309710 311164 312583 313466 313665 313214 312390 311718 311637 312259 313572 315706 318780 322551 326501
63734 326501 330306 333985 337502 340487 342615 344233 346342 349781 354510 359773 364893 369822 374972 380684
63720 380684 386900 393250 399369 405140 410632 415804 420338 423828 426032 426835 426089 423769 420318 416530 412903
63705 412903 409286 405331 401178 397423 394474 392152 389976 387702 385518 383793 382748 382337 382443 383099 384368
63690 384368 386015 387468 388287 388560 388750 389266 390216 391391 392265 392300 391622 391222 392078 394056 396163 397896 399840
63673 399840 402733 406473 410477 414602 419167 424281 429669 435034 440091 444359 447515 450006 452627 455338
63659 455338 457091 457170 456060 454459 451983 447679 441605 435087 429299 424285 419542 414930 410677 406986 404065
63644 404065 402221 401533 401702 402529 404230 406878 409856 412445 414805 417777 421671 425882 429861 433908 438667
63629 438667 444277 450489 457284 464830 472895 480872 488543 496474 505461 515820 527446 540342 554777
63616 554777 570990 588995 608769 630426 654129 679966 707989 738213 770456 804213 838902
63605 838902 874110 909378 943682 975418 1003074 1025860 1043619 1056314 1063798 1066014 1063175 1055830
63593 1055830 1044940 1031920 1018241 1004731 991275 977267 962267 946119 928611 909395 888372
63582 888372 865947 842757 819288 795986 773612 753089 734927 719141 705855 695561 688409 683546
63570 683546 679742 676634 674888 675068 676904 679836 683741 688759 694755 701387 708494 716117 724348 733524
63556 733524 744347 757454 772986 790962 811910 836655 865569 898570 935884 978268 1026310
63545 1026310 1079846 1138126 1199839 1262376 1321339 1371458 1408330 1429396 1433758 1421907 1396111
63534 1396111 1360786 1321716 1284145 1251089 1223105 1199337 1178626 1159849 1141778 1123074 1102575
63523 1102575 1079589 1054057 1026444 997338 967032 935658 903713 872097 841475 811996 783944
63512 783944 758240 735760 716230 698368 681095 664285 648459 634218 621964 611645 602643 594261
63500 594261 586298 578828 571568 564103 556716 550286 545143 540696 536501 533010 530752 529338 527922 526330
63486 526330 525110 524686 525020 525990 527553 529495 531501 533568 536085 539457 543769 548749 553930 559014 564253
63471 564253 570120 576283 581222 583487 583210 581817 580254 578076 574427 569331 563642 558135 553107 548692
63457 548692 545089 542377 540440 539199 538756 539152 540141 541453 543349 546642 551981 559164 567420 576381 586610
63442 586610 599167 614825 633807 656120 682085 712579 748672 790928 839238 893494 953946
63431 953946 1019985 1088353 1153192 1208354 1249553 1274581 1282749 1275228 1255595 1228990 1200300 1173232
63419 1173232 1150620 1134731 1127015 1127979 1137395 1154304 1176885 1202798 1229830 1255970 1278999 1296642
63407 1296642 1307416 1311140 1308531 1300590 1288399 1273169 1256179 1238632 1221391 1204558 1187403 1168983
63395 1168983 1148709 1126044 1100001 1069742 1035817 1000217 964949 930994 898697 868433 840417
63384 840417 814386 790068 767732 747891 730687 716014 703950 694573 687544 682412 679295 678707 680695
63371 680695 684625 690007 697129 706622 718638 732691 748207 765060 783756 805153 829806 857322
63359 857322 886496 916360 947145 980073 1016146 1055235 1096222 1137716 1178363 1216670 1250939
63348 1250939 1279609 1301602 1316362 1323775 1324309 1319142 1309873 1297915 1284143 1269062 1253125 1236743
63336 1236743 1220010 1202530 1183535 1162285 1138416 1112120 1084068 1055203 1026527 998935 973154
63325 973154 949832 929679 913504 902102 896091 895823 901296 911909 925991 940368 950498 951678
63313 951678 940840 917619 883879 842510 796853 750729 707861 670530 638883 611888 588820
63302 588820 569644 554259 541931 531584 522441 514265 507067 500625 494288 487390 479859 472245 465095
63289 465095 458576 452797 448038 444322 441045 437517 433739 430258 427386 424989 422993 421600 420886 420534 420092
63274 420092 419317 418256 417234 416765 417153 418073 418757 418688 418055 417547 417849 419185 421076 422624 423277 423222 422818 421980
63256 421980 420611 419418 419550 421252 423455 424982 425766 426658 428447 431302 434767 438010 440417 442302 444795
63241 444795 448676 453573 458620 463643 469259 475905 483316 491110 499509 509134 520197 532157 544343
63228 544343 556747 569943 584212 599049 613800 628490 643606 659144 674387 688808 702769
63217 702769 717137 732412 748395 764437 779822 794170 807657 820728 833384 844873 854203 860795
63205 860795 864460 864934 861706 854363 843014 828324 811130 792076 771719 750914 730696 711557
63193 711557 693165 675242 658457 643998 632412 623484 617101 613460 612278 612647 614079 617132 622595
63180 622595 630485 640223 651248 663005 674800 686303 697910 710074 722473 734312 745254 755555
63168 755555 765495 775145 784557 793629 801904 808984 815052 820407 824478 825874 823566 817579 808398 796178
63154 796178 780777 762334 741501 719245 696501 673842 651433 629452 608535 589541 572774
63143 572774 557802 544248 532500 523260 516380 510529 504214 497065 489947 483879 479047 474916 470977
63130 470977 467151 463658 460900 459433 459573 460863 462290 463257 464097 465460 467476 469832 472369 475195 478225
63115 478225 480973 482955 484197 485295 486950 489380 492196 494921 497474 499952 502156 503814 505218 507022
63101 507022 509233 511012 511792 512096 512841 514294 516216 518597 521643 525272 529206 533430 538034 542720 546995
63086 546995 550716 553986 556556 557959 558244 558052 557861 557536 556777 555667 554650 554213 554609 555704 557121 558729
63070 558729 560828 563584 566512 569002 571270 574335 579045 585500 593328 602065 611341 621209 632369 645541
63056 645541 660552 676533 693123 710981 730968 753368 778123 805239 834543 865386 897058
63045 897058 929344 962408 996326 1030993 1066259 1101890 1137509 1172839 1207902 1242852 1277736
63034 1277736 1312559 1347427 1382446 1417518 1452339 1486394 1518808 1548350 1573862 1594658 1610391
63023 1610391 1620521 1624125 1620316 1608765 1589702 1563481 1530444 1491403 1448006 1402183 1355225 1307798
63011 1307798 1260871 1216042 1174683 1137313 1104152 1075730 1052455 1034137 1020641 1012505 1009985 1011809
62999 1011809 1015935 1021594 1029641 1040786 1054485 1069810 1086405 1104059 1122180 1140379 1159042 1178674
62987 1178674 1199055 1219560 1239880 1259877 1279020 1296499 1311735 1324384 1334078 1340441 1343131 1341619
62975 1341619 1335304 1324142 1308677 1289069 1264612 1234817 1200567 1163604 1125216 1086118 1047239
62964 1047239 1009650 973677 938921 905349 873719 844703 818197 793807 771490 751232 732512
62953 732512 714548 697017 680181 664337 649451 635359 622132 610057 599263 589443 580034 570696
62941 570696 561548 552929 545063 538023 531848 526517 521822 517431 513047 508510 503858 499394 495515 492305
62927 492305 489387 486348 483219 480315 477739 475297 472945 471034 469999 469884 470302 470869 471548 472504 473649
62912 473649 474558 475035 475549 476793 478852 481188 483540 486420 490469 495553 500779 505292 508865 511844 514736
62897 514736 517786 520784 523368 525561 527828 530444 533002 534706 535026 534016 532167 530129 528392 527089
62883 527089 526243 526173 527294 529374 531448 532857 534009 535665 537649 538731 537812 534911 531034 527332 524283
62868 524283 521370 517622 512688 507341 502723 499219 496318 493390 490231 487035 484270 482593 482428 483438
62854 483438 484711 485608 486293 487368 489162 491436 493620 495300 496559 497878 499651 501842 504095 506023 507346
62839 507346 508028 508476 509272 510449 511278 511154 510488 510300 511071 512424 513851 515263 516780 518421 520148 521936
62823 521936 523679 525307 527014 529151 531807 534684 537361 539499 540863 541493 541877 542610 543841 545220 546432
62808 546432 547535 548863 550832 553804 557814 562471 567429 572833 578900 585194 590884 595874 601056 607174
62794 607174 613867 620253 626194 632601 640592 650703 662924 677227 693895 713276 735304 759462
62782 759462 785426 813596 844747 879237 916856 957353 1000726 1046961 1095819 1146939 1199824
62771 1199824 1253719 1307835 1361739 1415140 1467203 1516444 1561363 1600820 1633736 1658927 1675415
62760 1675415 1682534 1679607 1666057 1642161 1609311 1569239 1523242 1472284 1417334 1359314 1299179 1238421
62748 1238421 1178989 1122271 1068551 1017869 970872 928142 889168 852855 818905 787900 760095
62737 760095 735011 712330 692374 675323 660611 647501 635809 625609 616627 608410 600946 594720
62725 594720 590178 587357 585895 585203 584715 584258 584134 584741 586154 588144 590465 592985 595724 599001 603454
62710 603454 609664 617729 627323 638175 650357 664121 679606 696782 715556 735867 757717 781174
62698 781174 806367 833482 862742 894317 928153 963888 1001064 1039463 1079197 1120399 1162773
62687 1162773 1205402 1246848 1285412 1319494 1347983 1370392 1386428 1395366 1396040 1387706 1370865 1346997
62675 1346997 1317520 1283238 1244810 1203315 1159979 1115577 1070507 1025509 981844 940546 901773
62664 901773 865240 831165 800339 773163 749003 726836 706382 688215 672707 659223 646556
62653 646556 634009 621870 610884 601410 593077 585145 577214 569542 562633 556618 551280 546667 543266
62640 543266 541316 540270 539347 538482 538362 539527 541722 544076 545675 546071 545526 544717 543860 542289 539355 535630
62624 535630 532615 531084 530316 529177 527397 525444 523772 522763 522973 524623 526939 528673 529398 529819 530724
62609 530724 532067 533340 534439 535884 538380 542390 548011 554942 562468 569759 576496 583290 591324 601418
62595 601418 613556 627415 643103 660971 680917 702443 725477 750465 777383 805259 833132
62584 833132 860918 888661 915246 938638 957344 971068 979988 984036 983032 976976 966030 950546
62572 950546 931220 908929 884384 858184 831069 803620 775878 747819 720216 694381 670977
62561 670977 649737 630427 613336 598523 585377 573402 562844 553985 546365 539294 532672 526692
62549 526692 521205 516052 511686 508660 506765 505410 504638 504860 505666 505910 505192 504484 504888 506343 507813 508268
62533 508268 507280 505290 503618 503604 505314 507543 509458 511594 514808 518926 523261 528019 534172 542039 550941
62518 550941 560478 571313 584259 599164 615216 632015 649915 669466 690925 714198 738906 764497
62506 764497 790557 817072 844185 871617 898460 923581 946158 965829 982466 995971 1006315
62495 1006315 1013720 1018693 1021834 1023549 1023992 1023349 1022215 1021617 1022483 1024980 1028447 1032201 1036386 1041912 1049435
62480 1049435 1058437 1067234 1073723 1076233 1074077 1067622 1057640 1044392 1027385 1006147 980956 952553 921411
62467 921411 887817 852553 816878 781655 747002 713116 681036 652108 626852 604764 585148
62456 585148 567768 552668 539736 528650 519086 510851 503914 498368 494275 491407 489220 487186 485181
62443 485181 483537 482642 482489 482615 482544 482271 482244 482868 484137 485773 487476 488908 489632 489440 488711 488131 487864 487288
62425 487288 485780 483579 481509 479888 478178 475901 473554 472178 472098 472551 472653 472309 471885 471331 470087 467877
62409 467877 465239 463138 462190 462261 462612 462422 461421 460104 459229 459144 459801 461343 464259 468753 474205 479509
62393 479509 483919 487505 490978 495154 500399 506438 512763 519238 526096 533364 540640 547611 554416 561228
62379 561228 567829 574019 580206 587103 594904 603225 611841 621028 631024 641526 652051 662652 674089
62366 674089 687301 702836 720765 741120 764267 790741 820716 853931 890373 930800 976264
62355 976264 1027110 1082642 1141686 1203165 1266091 1329207 1390766 1448626 1500682 1545335 1581506
62344 1581506 1608259 1624814 1631247 1628845 1619225 1603128 1580435 1551166 1515908 1475348 1430095 1381180
62332 1381180 1330198 1278633 1227354 1176961 1128185 1081702 1037890 997076 959669 925699 894497
62321 894497 865176 837230 810507 784981 760986 739353 720676 704524 689755 675644 662338
62310 662338 650280 639577 630015 621378 613678 607230 602457 599327 597048 594670 592074 590002 589038 588852
62296 588852 588678 588209 587794 587895 588651 589921 591483 593118 594591 595641 596054 595894 595716 596392 598465 601635
62280 601635 604957 607638 609563 611106 612626 614285 616214 618630 621720 625566 630298 636277 643979 653665
62266 653665 665149 678011 692160 708331 727861 751724 779818 811426 846329 885060 928018
62255 928018 974884 1025315 1079714 1138604 1201282 1265625 1329136 1389666 1445161 1493522 1533130
62244 1533130 1563100 1582762 1591386 1588856 1576269 1555405 1527716 1494074 1455120 1411326 1362884 1310107
62232 1310107 1254082 1196643 1139607 1084264 1031496 982051 936537 895360 858746 826684 798717
62221 798717 773942 751373 730438 711204 694131 679463 666798 655332 644569 634612 625719 617782
62209 617782 610403 603297 596429 589911 583984 579022 575341 573002 571892 571884 572811 574397 576375 578596 581021
62194 581021 583747 587098 591428 596744 602787 609553 617304 625863 634428 642549 650989 660998 672882 685703
62180 685703 698204 709543 719363 727847 735758 743835 752016 759784 767317 775750 786141 798790 813824
62167 813824 831847 853555 879164 908741 942712 981385 1024066 1069175 1115224 1161150 1205626
62156 1205626 1246613 1281983 1310388 1331291 1344353 1349244 1346056 1335542 1318755 1296543 1269566 1238567
62144 1238567 1204342 1167493 1128500 1088105 1047416 1007558 969481 934118 902377 874780 851366
62133 851366 832054 816812 805337 797040 791681 789574 790765 794462 799884 807333 817686 831053 846712
62120 846712 864226 883687 904764 926477 948243 970337 992869 1015025 1035885 1055401 1073900
62109 1073900 1091025 1105818 1117613 1126392 1132517 1136701 1140036 1143567 1147930 1153703 1161758 1172763 1186543
62096 1186543 1202407 1219799 1238072 1256009 1272459 1287441 1301895 1316243 1329883 1342144 1352890
62085 1352890 1361955 1368758 1373055 1375499 1376903 1377465 1377259 1377092 1378121 1380820 1385008 1390869 1399232 1410634
62071 1410634 1424594 1440059 1456239 1472828 1489703 1506683 1523491 1539919 1556200 1573207 1591810
62060 1591810 1611885 1632287 1652014 1670917 1688897 1704857 1717181 1725074 1728801 1728599 1724204 1715655
62048 1715655 1703768 1689211 1671496 1649412 1622166 1589668 1552080 1509790 1463661 1414740 1363742
62037 1363742 1311303 1258518 1206499 1155482 1105207 1056353 1010685 969366 931929 897486 866221
62026 866221 838890 815358 794587 775860 759077 743867 729344 715046 701468 689281 678415
62015 678415 668129 657642 646572 635254 624798 616367 610073 604995 600551 597352 596264 597121 599051
62002 599051 601823 606094 612243 619631 627252 634626 641692 648154 653361 656727 658041 657396 655065 651420
61988 651420 646829 641535 635586 628759 620580 610735 599646 588492 578338 569335 560977 553045 545906
61975 545906 539883 534743 530048 525734 522092 519360 517604 516803 516695 516611 515865 514458 513107 512492 512631 513077
61959 513077 513473 513826 514502 516140 519302 523902 529146 534348 539727 546084 553759 562295 571247 580953 592275
61944 592275 605778 621457 639172 659081 681514 706554 733812 762608 792396 823049 854712
61933 854712 887324 920257 952450 982889 1011039 1036970 1061114 1083703 1104223 1121443 1134215
61922 1134215 1142297 1146293 1146756 1143658 1136897 1127116 1115705 1104029 1092916 1082902 1074683 1069127 1067017
61909 1067017 1068957 1075428 1086664 1102369 1121591 1142968 1165249 1187680 1209855 1230945 1249136 1262194
61897 1262194 1268863 1269521 1265277 1256639 1243456 1225918 1204967 1181601 1156316 1129551 1102214 1075222
61885 1075222 1048778 1022693 997376 973894 952784 933379 914713 896730 879998 864401 848906
61874 848906 832885 817037 802489 789437 777397 766582 758157 752887 750250 749293 749796 752020 755821
61861 755821 760846 767448 776595 788735 803379 820011 838915 860800 886132 915127 947976 984627
61849 984627 1024617 1067518 1113315 1161989 1212863 1264687 1316061 1365385 1410706 1450339 1483734
61838 1483734 1511149 1532306 1545852 1550539 1546713 1536345 1521792 1504757 1486406 1468126 1451926 1439937
61826 1439937 1433496 1432881 1437992 1448947 1465463 1485800 1507029 1526709 1543835 1557737 1566533 1567442 1558584
61813 1558584 1539923 1512491 1477433 1436079 1390321 1342170 1293092 1244142 1196537 1151555 1109845
61802 1109845 1071352 1036009 1004076 975619 950154 927145 906567 888495 872407 857447 843376
61791 843376 830670 819554 809460 799826 790951 783429 776917 770106 762134 753490 745228 737630 730136
61778 730136 722384 714741 707693 701175 694876 688914 683814 679884 677020 675084 674088 673815 673681 673330 673212
61763 673212 674201 676632 679993 683609 687403 691860 697436 704156 711711 719712 727754 735334 741879 747020
61749 747020 750825 753688 756061 758369 760972 763718 765491 764743 760978 755427 749874 745016 740451 735941
61735 735941 731896 728522 725334 721960 718807 716401 714490 712423 710152 708249 707077 706554 706667 707550 708878
61720 708878 709842 710133 710522 712011 714634 717542 720059 722140 723792 724564 723907 721671 718015 713079 707155
61705 707155 701044 695764 691669 688114 684128 679302 673987 668946 664975 662508 661145 659655 656910 652939
61691 652939 648844 645679 643636 642265 641027 639495 637436 635053 632935 631534 630815 630597 630987 632183 634062
61676 634062 636308 638859 641864 645257 648756 652333 656361 661183 666795 673112 680249 688314 697071 706060
61662 706060 714983 723794 732436 740655 748118 754643 760293 765301 769899 774170 777992 781093 783187 784169
61648 784169 784305 784198 784365 784696 784462 782979 780191 776483 772113 767114 761728 756482 751620 746749 741333
61633 741333 735320 728955 722138 714458 705882 696964 688214 679614 670891 661947 652796 643507 634533 626756
61619 626756 620777 616295 612588 609339 606575 604000 601035 597557 594037 590810 587618 584018 579839 575094
61605 575094 569857 564400 559081 553863 548353 542549 537136 532673 528827 524899 520817 517047 513627 509941
61591 509941 505622 501183 497386 494254 491143 487727 484459 481826 479433 476330 472219 467846 463977 460455
61577 460455 456765 453101 450130 447816 445310 442248 439387 437523 436404 435299 434226 433900 434571 435521 435780
61562 435780 434969 433413 431755 430533 429921 429809 430156 431151 432879 435000 436907 438093 438295 437590 436598 436191
61546 436191 436658 437338 437537 437571 438442 440611 443572 446590 449318 451592 453215 454249 455200 456544 458210 459669
61530 459669 460422 460264 459276 457749 456022 454187 451975 449084 445649 442299 439653 437699 435748 433077 429606
61515 429606 425882 422429 419311 416285 413233 410328 407885 406054 404546 402714 400143 397145 394431 392307
61501 392307 390545 389006 387895 387268 386736 385914 384782 383389 381719 380137 379396 379730 380374 380446 379954 379408 378970
61484 378970 378632 378835 380050 381912 383579 384895 386400 388258 389926 391027 391845 392812 394086 395701 397461
61469 397461 398621 398434 397255 396409 396641 397318 397475 396989 396325 395767 395481 395845 397076 398789 400422 401922 403591
61452 403591 405491 407337 408741 409294 408746 407483 406505 406462 406990 407434 407874 408835 410282 411696 413111 415275
61436 415275 418573 422476 426390 430448 434929 439306 442651 444971 447504 451403 456474 461459 465355 468167
61422 468167 470590 473402 477159 481987 487364 492272 495916 498234 499646 500482 500856 500840 500408 499239 496902
61407 496902 493361 489085 484625 480140 475363 470005 464261 458900 454606 451152 447565 443357 439195 436031
61393 436031 433891 432050 430042 427902 425609 423070 420735 419465 419586 420578 421826 423116 424209 424595 424103
61378 424103 423306 422956 423343 424492 426506 429254 432011 433971 435067 436008 437535 439835 442553 445186 447507
61363 447507 449699 452035 454523 457127 460183 464119 468743 473357 477715 482345 487688 493530 499752 507082
61349 507082 516472 527953 540707 554145 568443 584018 600825 618251 635430 651674 666702 680359
61337 680359 692102 700992 706454 708776 708606 706158 701258 694076 685447 676438 667679 659141 650496 641746
61323 641746 633476 626291 620079 614147 608128 602393 597464 593410 590018 587137 584636 582331 580265 578828
61309 578828 578388 578976 580458 582706 585537 588888 593174 598967 606227 614414 623558 634344 646645 658741
61295 658741 668750 676222 681457 683865 682241 676592 668608 660048 651494 642862 634362 626577 620106 615509
61281 615509 613145 612739 613391 614334 615478 617117 619427 622450 626333 631284 637356 644381 652026 659901 667791
61266 667791 675838 684413 693809 704068 715025 726457 738376 751297 765972 782635 800733 819649
61254 819649 839395 860136 881237 901224 918664 932651 942489 947409 946842 940774 929798 915007
61242 915007 897745 879133 859806 840293 821496 804423 789540 776722 765803 756795 749584 743878
61230 743878 739492 736361 734227 732722 731819 731823 732864 734757 737453 741182 745958 751351 757051 763263 770162
61215 770162 777159 783178 787666 790982 793715 795944 797442 798499 800178 803611 809148 816331 824579 833651
61201 833651 843595 854643 867227 881750 898209 916397 936623 959849 986839 1017473 1051099 1087167
61189 1087167 1125112 1163995 1202820 1241033 1278197 1313297 1344924 1372191 1395106 1414047 1429265
61178 1429265 1440972 1449528 1455370 1458821 1459885 1458109 1452834 1443753 1431070 1414926 1395059 1371390 1344667
61165 1344667 1316006 1285935 1254378 1221417 1187582 1153501 1119760 1087045 1055909 1026459 998745
61154 998745 973297 950722 930914 913361 898278 886669 879029 874578 872055 870786 870709 871903 874451
61141 874451 878392 883421 888791 893720 897676 900251 901172 900731 899906 899887 901684 906234 914393 926564 942559
61126 942559 962071 985020 1011318 1040652 1072776 1107798 1145938 1187136 1230997 1276915 1324147
61115 1324147 1372074 1420532 1469639 1519065 1567702 1614249 1657999 1698867 1736832 1771595 1802637
61104 1802637 1829366 1851147 1867352 1877571 1881902 1880981 1875458 1865326 1849999 1829160 1803188 1772420
61092 1772420 1736472 1694958 1648771 1599950 1550199 1500056 1449621 1399475 1350576 1303693 1259250
61081 1259250 1217470 1178454 1142354 1109573 1080456 1054702 1031456 1010218 991307 975199 961718
61070 961718 950205 940288 932129 925942 921535 918434 916363 915539 916371 918857 922494 926938 932492 939693
61056 939693 948577 958729 969983 982722 997489 1014627 1034222 1056150 1080194 1106428 1135342 1167254
61044 1167254 1201714 1237823 1275023 1313205 1352238 1391875 1432060 1472816 1513799 1554385 1594173
61033 1594173 1633042 1670784 1707109 1741970 1775541 1807998 1839641 1870959 1902154 1932909 1963217
61022 1963217 1994115 2026982 2062323 2099854 2139439 2181253 2225421 2272486 2324043 2382153 2448529
61011 2448529 2525281 2615894 2724067 2851786 2999993 3171156 3369949 3601875 3873291 4193199
61001 4193199 4573369 5026551 5566328 6208918 6973070 7878196 8945499 10200947 11671633
60992 11671633 13373926 15303876 17435226 19713751 22039737 24257140 26179022 27648387
60984 27648387 28594671 29048713 29118828 28955999 28720858 28542156 28465721 28422795 28250716 27762169
60974 27762169 26820534 25380750 23490256 21269256 18883156 16506393 14282216 12296666
60966 12296666 10579952 9126411 7913323 6910119 6083387 5402222 4841235 4379263 3997337
60957 3997337 3678967 3411001 3182920 2985769 2812368 2657847 2519217 2394533 2282392
60948 2282392 2181484 2090211 2007015 1930913 1861021 1795657 1732726 1670987 1610078 1549410 1488137
60937 1488137 1426474 1365956 1307972 1252881 1200924 1152889 1109200 1069105 1031552 996295 963575
60926 963575 933283 905140 879280 855939 834818 815356 797469 781565 767924 756362 746398 737492
60914 737492 729377 722394 717265 714229 712596 711352 710008 708648 707447 706466 705748 705272 704750 703623 701329
60899 701329 697580 692462 686202 678883 670571 661829 653725 646971 641295 636022 630946 626147 621281 615898
60885 615898 610407 605996 603429 602505 602758 603965 605723 607254 608056 608352 608514 608397 607589 606068 604320 602913
60869 602913 602054 601410 600358 598568 596244 593595 590468 586900 583652 581423 579826 578075 576548 576556 578393
60854 578393 580751 582522 584039 585884 587483 587935 587591 587697 588757 590205 591642 593485 596176 599339 601996
60839 601996 603349 603263 602204 600785 599290 597683 596081 594968 594775 595492 596856 598667 600759 603012 605646
60824 605646 609143 613527 617961 621469 623930 626005 628213 630404 632109 633088 633407 633113 632007 629843 626786
60809 626786 623447 620290 617167 613737 610101 606524 602632 597602 591271 584446 577854 571360 564526 557370
60795 557370 550120 542714 535132 527897 521703 516644 512200 507844 503395 499019 495214 492580 491183 490284
60781 490284 489008 487121 484965 482907 481193 480081 479660 479672 479855 480355 481462 483138 485200 487781 491151
60766 491151 495106 499064 502914 507420 513545 521496 530530 539630 548279 556616 564903 573008 580654 588072
60752 588072 595982 604687 613510 621439 628175 634229 640130 645875 651140 655654 659172 661262 661393 659408
60738 659408 655871 651711 647378 642523 636721 630292 624039 618254 612492 606283 599600 592566 585250 577950
60724 577950 571131 564803 558449 551907 545846 540908 536762 532556 528020 523594 519619 515972 512503 509411
60710 509411 507019 505444 504520 503907 503311 502786 502784 503751 505720 508384 511426 514703 518254 522230 526631 531094
60694 531094 535192 539108 543670 549483 556196 562845 568700 573636 577937 582034 586258 590578 594624 597988
60680 597988 600292 600949 599358 595636 590885 586400 582767 579885 577532 575592 573967 572571 571255 569612
60666 569612 567162 564001 561066 559479 559796 561936 565474 569771 574275 579014 584499 590866 597523 604035
60652 604035 610857 618739 627799 637747 648640 660697 673544 686355 698765 711111 723761 736694
60640 736694 749793 763061 776503 790214 804730 820939 839470 860270 882802 906543 931379
60629 931379 957691 985957 1016188 1047922 1080846 1114960 1149826 1184141 1216670 1247377 1277012
60618 1277012 1305671 1332327 1355804 1375682 1392074 1404906 1413629 1417538 1416339 1410425 1400431 1386493
60606 1386493 1368242 1345718 1319794 1291343 1260489 1227279 1192680 1158147 1124359 1091079 1058179
60595 1058179 1026040 994990 965110 936725 910355 885904 862573 839970 818786 799936 783376
60584 783376 768153 753387 738864 724919 712085 700764 690926 682085 673686 665513 657725 650550 644010
60571 644010 637919 632198 627229 623766 622299 622591 623959 625912 628409 631672 635971 641440 647840 654592
60557 654592 661214 667561 673501 678539 681995 683333 682218 678638 673246 667224 661389 655776 650354 645642
60543 645642 642043 639099 636179 633592 632210 632224 633159 634963 638110 642533 647370 651920 656048 659473 661569
60528 661569 662213 661996 661185 659241 655873 651899 648388 645495 642770 640210 638336 637469 637476 638069 638914 639613 640054
60511 640054 640698 642088 644148 646284 648162 650121 652775 656362 660462 664326 667605 670811 674920 680547
60497 680547 687742 696516 707191 720136 735551 753691 774849 798878 824983 852195 879729 906650
60485 906650 931522 952618 968243 976727 976664 967661 950683 927349 899065 867074 832938 798446
60473 798446 765082 733886 705615 680629 658613 638830 620792 604608 590711 579349 570191 562344
60461 562344 554908 547689 541173 535728 531066 526671 522388 518325 514463 510799 507638 505249 503268 500879
60447 500879 497689 494089 490685 487660 484880 482412 480618 479715 479319 478618 477128 475204 473574 472411 471215
60432 471215 469743 468634 468725 470016 471688 473035 473918 474363 474308 473953 473958 474852 476330 477469 477692 477331 477174 477632
60414 477632 478486 479379 480289 481455 483015 484879 486879 488833 490468 491476 491672 491041 489764 488354 487636 488192
60398 488192 489774 491532 492893 493956 494994 495989 496910 498095 499944 502386 504994 507524 509989 512246 513903
60383 513903 514778 515193 515611 516187 516875 517770 519052 520577 521903 522901 524090 526076 528762 531443 533639 535469
60367 535469 537144 538569 539681 540780 542161 543707 545233 546994 549365 552143 554678 556657 558319 559891
60353 559891 561253 562240 562879 563274 563604 564250 565521 567260 569141 571344 574422 578402 582668 586975 591989
60338 591989 598431 606126 614287 622316 629860 636445 641593 645173 647224 647630 646316 643534 639573 634386
60324 634386 627993 621101 614799 609656 605507 602114 599564 597947 597067 596667 596652 596957 597420 597947 598708 600053
60308 600053 602306 605647 610015 615189 621128 628286 637418 649053 663332 680301 700015 722078 745180
60295 745180 767343 786717 802094 812747 817990 817155 810089 797561 781072 762317 742917 724465
60283 724465 708312 695005 684107 674868 667063 660919 656356 652741 649618 647345 646627 647453 648846 649692
60269 649692 649431 647832 644556 639458 633126 626544 620113 613475 606427 599565 593730 589181 585612 582629
60255 582629 579861 576907 573672 570624 568292 566612 565083 563434 561791 560343 559235 558612 558372 558041 557405
60240 557405 557032 557577 558673 559251 558938 558495 558726 559763 561629 564765 569455 575192 581061 586484 591408 596117
60224 596117 601077 606518 611964 616687 620863 625608 631480 637553 642561 646398 649830 653162 656069 658617
60210 658617 661599 665682 670694 675880 680547 684423 687725 690910 694107 696894 698882 700389 702162 704501
60196 704501 707024 709231 710866 711649 711115 708994 705577 701501 697266 693075 689035 685341 682123 679199 676188
60181 676188 672971 669846 667027 664182 660897 657463 654710 653010 652006 651453 651696 652959 654717 656333 657969
60166 657969 660320 663603 667339 670968 674232 677049 679509 681983 684828 687897 690595 692473 693626 694536
60152 694536 695708 697365 699377 701581 704195 707675 712064 716903 722016 727965 735273 743507 751639 759166
60138 759166 766422 773945 781994 790600 799657 808989 818612 828727 839033 848237 854878 858708 860681 861495
60124 861495 860644 857180 851042 843368 835695 829043 823616 819163 815563 812973 811328 809952 808011 805324
60110 805324 802408 799662 796807 793210 788567 783121 777371 771647 765941 760107 754254 748846 744341 740857
60096 740857 738275 736487 735416 734990 735312 736704 739375 743180 747898 753559 760248 767821 776100 785164 795065
60081 795065 805371 815340 824502 832709 839620 844494 846607 845634 841601 834653 824968 812849 798913 784150
60067 784150 769578 755703 742525 730162 719119 709707 701568 694192 687633 682325 678421 675757 674256
60054 674256 673861 674117 674352 674313 674301 674717 675803 677693 680232 682777 684723 686314 688513 691922 696163 700464
60038 700464 704494 708439 712517 716655 720533 723770 726041 727035 726426 724122 720500 716010 710426 703009 693650
60023 693650 683287 672670 661273 648225 633981 620222 608202 597995 589252 581784 575219 569018
60011 569018 563186 558286 554403 550794 546986 543549 541216 539767 538448 537173 536660 537476 539458 541994 544479
59996 544479 546570 548422 550640 553698 557402 561194 564958 569186 574308 580081 585760 590649 594393 596919
59982 596919 598387 599170 599717 600257 600640 600516 599598 597729 594822 590944 586461 581900 577616 573698 570194 567179
59966 567179 564619 562441 560802 560010 560082 560719 561752 563136 564386 564667 563890 563206 563806 565568 567443 568827
59950 568827 569855 570615 570926 570954 571241 571953 572594 572713 572452 572203 572079 571840 571038 569248 566516 563656 561692
59933 561692 560927 560802 560648 560232 559683 559327 559632 560845 562581 564144 565280 566239 567137 567720 567860 567841 568068 568803
59915 568803 570185 572059 573825 574971 575817 577247 579622 582511 585553 588950 592820 596704 600081 602974
59901 602974 605591 607771 609243 610259 611528 613514 616064 618742 621408 624416 628236 632897 637984 643238
59887 643238 648862 654990 661247 667237 673156 679416 685956 692534 699447 707156 715251 722630 728793 734112
59873 734112 738661 741597 742076 740122 736202 730556 723336 714965 705938 696618 687412 678693 670361 662059
59859 662059 654022 647128 641813 637570 633856 630852 628899 627863 627691 629047 632679 638432 645510 653460
59845 653460 662334 672115 682621 693880 706080 719077 732321 745285 757650 769084 779109 787270
59833 787270 793446 798066 801994 806003 810206 814103 816999 818094 816358 810851 801292 788008 771487 752506
59819 752506 732490 712943 694424 676789 660417 646256 634478 624180 614851 607109 601430 597167
59807 597167 593690 591529 591322 592304 592996 592961 592786 592624 591909 590401 588429 586031 582803 578785 574685 570924
59791 570924 567120 562785 558054 553519 549809 547470 546810 547512 548650 549283 548967 547838 546495 545733 546023 547133
59775 547133 548377 549238 549682 550145 551393 554057 557898 561731 564461 566072 567357 568925 570906 573287 576006
59760 576006 578779 581285 583508 585576 587451 589199 591338 594405 598228 602105 605646 609027 612489 616082
59746 616082 619882 623936 627894 631145 633468 635258 636988 638669 639930 640460 640337 640073 640241 640900 641500 641493
59730 641493 640863 639886 638732 637625 637055 637279 637753 637659 637005 636743 637717 639851 642422 644715 646276 646895 646695
59713 646695 646201 646136 647025 648848 651068 653128 654977 656935 659063 660980 662381 663395 664248 664927 665380 665682
59697 665682 665833 665834 666194 667773 670665 673735 675797 676862 677616 678126 677846 676741 675597 675149 675460 676226 677183
59680 677183 678196 679268 680454 681451 681514 680221 678132 676215 674710 673074 670973 668785 667130 666284 665967
59665 665967 665322 663284 659503 654834 650480 646759 643203 639665 636707 634910 634404 635071 636731 639115 642149
59650 642149 646213 651522 657321 662291 665788 668080 669396 669447 668049 665514 662118 657761 652523 647103 642388
59635 642388 638898 636819 636164 636635 637720 639203 641244 643699 645764 646696 646630 646310 646186 646208 646454 647437 649520
59618 649520 652192 654264 654922 654435 653706 653306 653200 653230 653433 653861 654609 656181 659323 664154 669825 675284 679954
59601 679954 683447 685246 685169 683708 681392 678268 674439 670532 666971 663359 659374 655745 653314 651516 648955
59586 648955 645424 642201 640201 638884 637295 635304 633372 631738 630232 628452 625929 622557 618962 615917
59572 615917 613428 610986 608631 606971 606067 605227 604256 604070 605545 608366 611481 614297 617007 620075 623697
59557 623697 627449 630362 631758 632140 632796 634398 636520 638577 640525 642430 644162 645905 648342 651798 655741
59542 655741 659662 664066 670103 678520 689344 702283 717073 733711 752575 773860 796582 818543
59530 818543 837739 853504 866114 875916 883492 890188 897566 906231 915604 924818 933332 940713 946342
59517 946342 949578 949892 946703 939407 927916 913087 896221 878017 858325 837188 815869 796271
59505 796271 779381 764802 751901 740668 731160 722895 715506 709439 705211 702394 700186 698611 698211
59492 698211 698778 699407 699775 700456 701927 704143 707093 710878 715197 719771 725445 733768 745094 758002 770984
59477 770984 783893 797450 812264 828748 847044 866385 885206 902325 917337 929580 937818 941583
59465 941583 942059 940985 939493 938563 939566 943400 949934 959254 972677 991371 1014530 1040135 1067131
59452 1067131 1095678 1125525 1155405 1184135 1211258 1236417 1259029 1278801 1295772 1309408 1318084
59441 1318084 1319686 1312449 1295391 1268727 1234215 1194791 1153515 1112907 1075002 1041373 1012667 988344
59429 988344 967190 948291 931694 918299 909126 904709 905159 910518 920640 934831 952186 972344
59417 972344 995371 1020763 1047190 1073454 1099044 1123414 1145512 1164520 1180303 1192319 1198703 1197275
59405 1197275 1187162 1168717 1142563 1110038 1074499 1040783 1012679 991383 976421 967045 962101 959233
59393 959233 955178 946985 932825 912027 885187 854478 823271 794610 769672 747891 728680 712652
59381 712652 700748 692543 686226 680313 674723 669975 666123 662951 660619 659342 658701 657911 656775 655929 656167
59366 656167 657818 660710 664498 669027 674530 681367 689584 698929 709338 721096 734487 749680 767017
59353 767017 786967 809646 834879 862824 893921 927950 963738 1000180 1036965 1073870 1109944
59342 1109944 1143915 1174897 1202147 1224540 1240843 1250223 1252079 1245919 1232001 1211654 1186353 1156785
59330 1156785 1123374 1087262 1050081 1013017 976764 942164 910131 881046 854793 831353 810847
59319 810847 793111 777701 764298 752788 743059 734974 728324 722628 717407 712815 709440 707128 704746
59306 704746 701662 698711 696972 696288 695967 696336 698521 702949 709105 716592 725439 735517 746638 759241
59292 759241 774103 791291 810046 829446 848255 864311 875257 880195 879929 875604 868078 858681 849520
59279 849520 842505 838731 838989 843980 853631 866946 883048 901753 922787 945101 967521 989542 1010924
59266 1010924 1030812 1047796 1060640 1068678 1071724 1069922 1063545 1052756 1037758 1019265 998520 976685
59254 976685 954434 932245 910785 890828 872975 857517 844428 833513 824755 818475 814928 813882
59242 813882 814951 818224 824113 832626 843261 855655 869797 885440 901649 917114 930658 941386
59230 941386 948663 952093 951383 946272 936839 923770 907926 889674 868980 846153 822158 798206 775371
59217 775371 754517 736091 719827 705075 691600 679844 670291 662803 656712 651399 646684 642676 639282
59204 639282 635946 632140 628104 624776 622794 621961 621869 622578 624294 626805 629717 632878 636103 638823 640653
59189 640653 642094 644077 647007 650685 654900 659480 664080 668573 673445 679163 685424 691762 698643 707098
59175 707098 717370 728831 741253 755253 771279 789033 808211 829097 851972 876389 901379
59164 901379 925947 949130 969847 987061 999995 1008203 1011633 1010487 1004832 994587 980242 963199
59152 963199 944804 925253 904106 881701 859368 838308 818931 801214 784987 769849 755508
59141 755508 742331 730983 721533 713439 706396 700530 695747 691601 687809 684300 680743 676827 673099 670793
59127 670793 670600 672154 674866 678646 683698 690189 698260 707847 718394 729274 740518 752633 765826
59114 765826 780023 795425 812139 829349 845852 861542 877345 893479 908725 921831 932745
59103 932745 942107 950315 957531 963832 968829 971772 972488 971631 969687 966423 961797 956716 952237 948502 944959
59088 944959 941212 937202 932895 928207 922904 916330 907641 896642 884006 870467 856226 841353 826258
59075 826258 811401 797011 783304 770551 758721 747593 737438 729017 722591 717463 712854 708719
59063 708719 705397 702951 701188 699886 698654 697065 695200 693603 692409 691014 688938 686377 683562 680151
59049 680151 675859 671278 667446 664791 662946 661439 660162 659269 658914 659138 659940 661449 663907 667276 671111
59034 671111 675156 679817 685555 692103 698954 706391 715244 725737 737474 750512 765412 782123 799809
59021 799809 818054 837127 856579 874573 889348 900658 909168 915105 918196 918465 916453 912967 909034
59008 909034 905739 903710 902997 903675 906156 910764 917499 926377 937507 950677 965404 981499 998897
58995 998897 1016756 1033514 1048147 1060794 1071896 1081407 1088974 1094074 1095662 1092486 1084274 1072017 1056890
58982 1056890 1039570 1020854 1002028 984217 968033 954149 943303 935382 929422 924977 922702 923187
58970 923187 926181 931495 939675 951069 965014 980586 997434 1015300 1033535 1051738 1070010 1087856
58958 1087856 1103536 1115187 1121934 1123400 1119024 1108685 1093293 1074001 1051464 1026481 1000557 975061
58946 975061 950482 927228 906322 888479 873192 859707 848351 840093 835247 833239 833048 833253 832382
58933 832382 830028 827004 823796 819536 813222 805091 796074 786688 777368 769005 762109 756081 750274 745144
58919 745144 741477 739197 737895 737772 739086 741409 744467 748928 755214 762375 769414 777020 786504 797675
58905 797675 809348 821592 835834 852747 871512 891296 912273 934910 959212 984876 1011578
58894 1011578 1039143 1067916 1098662 1131648 1166448 1203297 1243725 1288681 1336743 1385274 1432670
58883 1432670 1478087 1519614 1554429 1580721 1598096 1606340 1605154 1594969 1576544 1549699 1513820 1469824
58871 1469824 1420434 1368357 1315335 1263027 1213496 1168320 1128079 1092940 1062964 1037695 1016176
58860 1016176 997457 980516 964015 947105 930316 914776 900678 887409 874797 863165 852369
58849 852369 841986 832245 823605 815528 806957 797911 789302 781165 772412 762549 752388 742821 733980 725797
58835 725797 718225 710716 702662 694616 688008 683364 679898 677022 675104 674376 674249 674246 674687 676031 678372 681869
58819 681869 686772 692636 698357 703297 707637 711487 714553 716841 718705 719944 719839 718394 716598 715135
58805 715135 713711 711912 709802 707373 704422 701361 699237 698463 698357 698230 698124 698206 698417 699088 700907 703831
58789 703831 706991 710240 714832 721903 731045 741033 751184 761348 771204 780321 788490 795486 800991 805262
58775 805262 809317 813870 818438 821979 824047 824865 824609 823165 820454 816654 812161 807471 803008 799052 795950
58760 795950 794161 793734 794043 794581 795840 798802 803653 809598 815781 821725 826996 831321 835111 839178 843869
58745 843869 848997 854515 860560 866879 872964 878786 884783 891186 897978 905369 913612 922613 932385 943624
58731 943624 956942 971794 987048 1002285 1017510 1032000 1044667 1055458 1065160 1073988 1081633 1088557
58719 1088557 1095794 1103383 1110453 1117046 1124407 1133126 1142244 1150513 1157209 1161491 1162428 1160225 1156103 1150432
58705 1150432 1142208 1130853 1117114 1101499 1083189 1061429 1036909 1010841 983676 955662 927816
58694 927816 901406 877058 855061 835864 819582 805602 793332 782784 773922 766021 758197 750066
58682 750066 741574 732813 724312 716839 710586 705131 700339 696612 694253 693486 695144 700140 708045 717362
58668 717362 727554 739624 754295 770928 788820 808275 829465 851145 871311 888360 900990
58657 900990 908005 909188 905764 899286 890495 879701 867540 854764 841876 829449 818219 808519 800268
58644 800268 793801 789943 788914 789856 791783 794322 797454 801308 806300 812495 818751 823485 826402 828382
58630 828382 829623 829267 827002 823645 819823 815610 811890 810514 812403 816847 823353 832791 846023 862762
58616 862762 882580 905691 931861 959718 987929 1015849 1042312 1065192 1083106 1096355 1105341 1109429
58604 1109429 1108339 1103376 1096111 1086920 1075803 1063497 1050773 1037670 1024435 1012130 1001344 991470
58592 991470 982223 974720 970050 967945 967949 970648 976650 985472 996607 1010399 1026590 1043271 1058790 1073613
58578 1073613 1088789 1103539 1116025 1125725 1133447 1139608 1144139 1147750 1151906 1157676 1165623 1176406 1190533
58565 1190533 1207858 1228072 1251165 1276786 1303905 1331789 1360328 1388598 1414161 1434781 1449962
58554 1449962 1459993 1464684 1464098 1459333 1451310 1439825 1424954 1408222 1391089 1373359 1354449 1335055
58542 1335055 1315956 1296282 1274817 1252234 1230284 1209353 1188567 1167802 1147958 1129557 1112682
58531 1112682 1098127 1087121 1079899 1075616 1073494 1073185 1074385 1077071 1081743 1088634 1097215 1107139 1118826
58518 1118826 1132215 1145877 1158450 1170077 1181345 1191759 1200485 1207746 1214181 1219662 1224065 1228467
58506 1228467 1234320 1242048 1251503 1262815 1275514 1287802 1298076 1306363 1312971 1316734 1316134 1311343 1303631
58493 1303631 1293472 1280729 1265933 1249905 1232831 1215127 1198427 1184200 1172144 1161419 1152737
58482 1152737 1147668 1146627 1149065 1154813 1163612 1173993 1184280 1194104 1203395 1210613 1213699 1212224 1207068
58469 1207068 1198532 1186392 1171268 1154415 1136634 1118678 1102025 1087781 1075487 1064462 1055554 1050137
58457 1050137 1048141 1048530 1050911 1055175 1060464 1065984 1071921 1078044 1082519 1083791 1082562 1080147 1076083 1069305
58443 1069305 1060635 1051998 1044151 1037252 1032576 1031344 1032587 1034446 1036955 1041425 1047842 1055050 1062848 1071711
58429 1071711 1081143 1090505 1100787 1113405 1127861 1142731 1158129 1174914 1192251 1208409 1223309 1237816
58417 1237816 1251233 1262024 1270451 1277844 1283694 1286005 1284195 1279194 1271166 1259735 1246132 1232554 1219604
58404 1219604 1206686 1194456 1184346 1176071 1168234 1161066 1155958 1152541 1148896 1144449 1140075 1135574 1129655
58391 1129655 1122335 1114781 1106920 1097644 1087163 1076689 1066167 1054847 1043678 1034489 1027174 1020386 1014545
58378 1014545 1011340 1010710 1011191 1012817 1016660 1021967 1027028 1032536 1040843 1052061 1064250 1077152 1092207
58365 1092207 1108882 1124736 1139483 1155406 1173284 1191298 1208405 1225338 1241554 1254622 1263533
58354 1263533 1269638 1273579 1274331 1271958 1268352 1264506 1259793 1254509 1250375 1248097 1247207 1248487 1253622 1262151
58340 1262151 1271780 1281936 1294067 1308368 1323456 1339353 1357405 1377040 1395974 1413845 1432129
58329 1432129 1450320 1465844 1478110 1488977 1498837 1505974 1510287 1513973 1517963 1521265 1524258 1528998 1535830
58316 1535830 1543336 1551830 1563083 1576443 1589277 1601500 1615488 1631363 1646740 1661410 1677620 1695337
58304 1695337 1712017 1727588 1744740 1763614 1781231 1797080 1814171 1833532 1852752 1871086 1890812
58293 1890812 1912268 1932758 1951846 1972618 1996331 2020855 2045637 2072864 2102312 2130642 2157404
58282 2157404 2186223 2218424 2251105 2283141 2317164 2353696 2389268 2422429 2455705 2489564 2520544
58271 2520544 2547810 2575621 2607038 2641188 2678922 2724684 2780061 2841583 2907289 2979021 3055870
58260 3055870 3132271 3205504 3278440 3352232 3423373 3490783 3558439 3627895 3695721 3761599 3831198
58249 3831198 3907530 3987328 4069584 4159417 4259480 4365822 4476444 4595550 4725015 4860444
58239 4860444 5000358 5150331 5313101 5483656 5659283 5845245 6045191 6255579 6475288
58230 6475288 6710909 6966502 7237955 7523512 7829763 8161267 8515126 8892034 9301252
58221 9301252 9748125 10228866 10744566 11307478 11926231 12598933 13329120 14133871 15027424
58212 15027424 16012748 17099366 18313371 19679798 21213577 22940666 24910718 27177912
58204 27177912 29791313 32819743 36365887 40542796 45463344 51271897 58159939 66331360
58196 66331360 75985164 87359203 100759717 116521411 134972644 156449462 181241455
58189 181241455 209395292 240528559 273787620 307790117 340389398 368550144 388823918
58182 388823918 398372446 395862232 381711900 357830559 327200002 293332754 259535631
58175 259535631 228238624 200765437 177525528 158281445 142331699 128737296 116629138
58168 116629138 105411719 94762907 84563027 74869858 65873340 57768579 50643684
58161 50643684 44480830 39214770 34753906 30978392 27767311 25029448 22693388 20685682
58153 20685682 18940724 17418371 16091253 14924747 13885021 12954509 12122738 11371311
58145 11371311 10681643 10047466 9466344 8928085 8423515 7955123 7527054 7133271 6766444
58136 6766444 6429368 6126343 5851617 5597078 5363336 5152626 4958304 4771794 4593172
58127 4593172 4425236 4263859 4103838 3947992 3801182 3661209 3524384 3394147 3275292
58118 3275292 3165048 3058416 2957151 2865210 2780309 2698121 2620184 2549737 2484178 2419378 2357249
58107 2357249 2301502 2249866 2197841 2146386 2098768 2053275 2005947 1957262 1909610 1861369 1809764
58096 1809764 1756520 1704759 1653566 1601440 1551638 1508169 1469734 1433421 1400963 1375323 1354323
58085 1354323 1333797 1314173 1297898 1283067 1265682 1245874 1226224 1206175 1183651 1160064 1138202
58074 1138202 1117168 1094565 1071691 1051503 1033441 1015201 997591 982730 969494 955603 942283
58063 942283 932010 923596 914326 904972 897831 891602 883195 873026 863730 855161 845361 835050 826467
58050 826467 819001 810423 801222 793434 786471 778453 770405 764747 760743 755628 749227 743387 737960 731413
58036 731413 724355 718455 712860 705537 697213 690162 684111 677069 669168 662004 655299 647822 640427 634507
58022 634507 628757 621210 613142 607048 602067 595552 588018 582370 579100 576347 573836 572653 571916 569840
58008 569840 567511 567521 569406 570462 570551 571959 574887 577285 579058 582372 587680 593277 598894 606030 614614
57993 614614 622912 630856 639909 649556 657456 663292 668978 674868 679175 681411 682977 683976 682782 679148
57979 679148 674558 669160 661587 652209 643315 635500 626926 616810 606693 597675 589223 581278 574774 569556
57965 569556 564452 559831 557310 556546 555172 552454 550208 549436 548851 547446 545896 544574 542665 540134 538302
57950 538302 537672 537252 536612 536580 537448 538575 540103 542962 546905 550720 554560 559770 566250 572426 578143 584993
57934 584993 593335 601538 608797 616269 624655 632892 639979 646010 650758 653312 653747 653146 651450 647232 640085
57919 640085 631223 621380 610185 598011 586271 575378 564415 553197 542598 532574 522162 511769
57907 511769 503039 495954 488468 479652 470861 463169 455995 448998 442850 437223 430414 422126 414457 408990
57893 408990 404958 401361 398820 398072 398500 399445 401334 404340 407512 410325 413584 417834 422369 426730 431609
57878 431609 437338 442888 447327 450927 454057 456352 457657 458439 458700 457925 456518 455697 455487 454618 452943 452065
57862 452065 452799 453938 454377 454675 455511 456412 457075 458326 460637 463107 464910 466376 467834 468911 469858 471917
57846 471917 475383 478817 481170 483157 485493 487337 487730 487190 486595 485679 483799 481120 478004 474227 469739
57831 469739 465257 461301 457606 454122 451525 450109 449322 448891 449166 449904 450230 450418 452116 456016 460757 464931
57815 464931 468660 472408 475829 478750 481799 485012 487197 487617 486872 485245 481687 475467 467310 457856 446595
57800 446595 433491 420080 407574 395332 382608 370466 360339 351864 343695 335609 328354 322279
57788 322279 317423 314151 312399 311057 309248 307563 306990 307461 308442 310091 312771 316235 320294 325444 331822
57773 331822 338367 344005 348894 353642 358203 362440 366722 370979 374115 375438 375779 376142 376158 374841 371971
57758 371971 367702 361764 354211 346171 338724 331758 324818 318183 312166 306306 300356 295189 291615 289154
57744 289154 286981 285222 284250 283584 282634 281728 281258 280579 278930 276754 275019 273840 272749 271625 270356 268368
57728 268368 265525 262845 261377 261008 261128 261618 262325 262563 262200 262304 263605 265176 265674 265030 263935 262675
57712 262675 261586 261580 262917 264288 264426 263767 263351 263069 262349 261634 261665 262124 262477 263338 265419 267888 269469 270593
57694 270593 272731 275942 278767 280300 280843 280662 279654 278226 277185 276661 276188 275797 276046 277164 279168 282591
57678 282591 288126 295771 305258 317046 332041 350723 373417 400962 434222 473359 518359 569481
57666 569481 626076 685373 743340 795932 838537 865301 871065 854240 817205 764675 702634 637693
57654 637693 575308 518251 467488 423876 387936 358844 335214 316449 302053 290325 279375
57643 279375 269080 260565 254149 249191 245438 242860 240508 237234 233368 230216 228156 226649 225728 225766 226021
57628 226021 225248 223689 222737 222679 222472 221810 221587 222031 222122 221236 219899 218595 217202 215876 214995 213992 211731
57611 211731 208402 205548 203930 202855 201981 202052 203168 203919 203248 201900 201039 200503 199450 197896 196656 196254
57595 196254 196622 197437 198240 198604 198515 198195 197478 195935 193657 191222 188854 186357 183908 182071 180906 179923
57579 179923 178991 178428 178082 177238 175640 173769 171998 170257 168635 167390 166264 164643 162563 160717 159430
57564 159430 158470 157835 157777 158011 157951 157781 158254 159361 160274 160759 161473 162652 163621 163902 163817 163703 163520 163440 163799
57545 163799 164303 164331 164199 164979 166792 168539 169621 170652 171986 172823 172463 171390 170418 169694 169167 169132 169686
57528 169686 170349 170738 170932 170851 170225 169459 169487 170295 170676 169978 169050 168828 169117 169499 170319 171812 173194 173702 173870
57509 173870 174781 176524 178265 179411 179908 179791 179220 178656 178340 177886 176915 175783 175129 174981 174779 174057 172832
57492 172832 171514 170596 170067 169080 166777 163505 160537 158450 156604 154486 152703 152124 152714 153716 154404 154254
57476 154254 153049 151279 149878 149180 148661 147915 147134 146352 145111 143379 141927 141203 140615 139614 138732 138803 139723
57459 139723 140787 141758 142904 144314 145806 147220 148377 149130 149805 151048 152804 154034 154017 153341 153072 153482
57443 153482 154200 155017 155809 156118 155661 155020 155097 155961 156849 157198 157124 156907 156500 155734 154770 154195 154581 155845 157189
57424 157189 157928 158164 158314 158240 157493 156267 155318 154935 154767 154698 155049 155776 156365 156717 157256 157908 157944 157162 156322
57405 156322 155936 155532 154595 153397 152364 151459 150751 150744 151542 152414 152773 152870 152981 152802 152296 152239 153108 154156 154494
57386 154494 154477 155100 156536 158152 159589 160993 162478 164038 165770 167593 169078 170043 170931 172100 173179
57371 173179 173557 173083 171876 170056 168163 167168 167397 167994 168002 167423 166648 165579 164114 162874 162532 162804 162886 162597
57353 162597 162379 162472 162812 163456 164485 165680 166760 167687 168433 168873 169238 170067 171316 172180 172277 172285 172887 173831 174681
57334 174681 175694 177150 178554 179362 179884 180611 181269 181417 181372 181588 181670 181014 179979 179443 179576 179953 180491 181317
57316 181317 182088 182386 182499 182933 183514 183807 184030 184630 185344 185658 185831 186478 187442 188136 188703 189738 191016 191579
57298 191579 191126 190369 190051 190439 191733 194006 196704 198956 200486 201635 202585 203205 203514 203681 203711 203685 204008
57281 204008 204849 205710 206164 206519 207074 207338 206887 206406 206793 207735 208337 208697 209642 211239 212971 215131 218657
57264 218657 223536 228671 233397 237951 242382 246273 249655 253048 256395 259037 260945 262833 264881 266440
57250 266440 267240 267847 268667 269564 270751 272952 276319 280136 283914 287791 291575 294476 296296 297871 299855
57235 299855 301965 303904 306075 308755 311428 313650 315843 318597 321715 324576 326945 328884 330376 331559
57221 331559 332971 335098 337873 340893 343827 346510 349105 352248 356563 361886 367494 373109 378988 384993
57207 384993 390440 395177 400030 405704 411830 417518 422349 426466 430155 433772 437760 442435 447924 454325
57193 454325 461592 469305 476996 484608 492177 499289 505646 512001 519662 528997 539329 550308 562379
57180 562379 575708 589710 604050 619194 635542 652823 670789 689689 709551 729750 749822
57169 749822 770054 790829 812012 833373 854850 875932 895528 913125 929526 945849 962210
57158 962210 977809 991797 1003724 1013745 1022904 1032698 1043834 1055816 1068016 1080594 1093955 1108036
57146 1108036 1122700 1138326 1155461 1174301 1194985 1217845 1242889 1269608 1297906 1328814 1363667
57135 1363667 1402794 1445446 1490676 1537848 1586664 1637201 1689818 1744766 1802174 1862585 1927085
57124 1927085 1996701 2072029 2153573 2241840 2336909 2438589 2547399 2664834 2792372 2930816
57114 2930816 3080962 3244263 3422471 3617384 3831537 4068646 4332932 4628629 4960737
57105 4960737 5335900 5762445 6250549 6813208 7466829 8230880 9127991 10184754 11431046
57096 11431046 12897211 14611964 16602737 18895993 21515409 24480207 27805661 31502691
57088 31502691 35573263 40004899 44769075 49819952 55083618 60435590 65678149 70534881
57080 70534881 74674432 77764876 79546047 79892174 78834319 76532297 73216854 69136389
57072 69136389 64527395 59603614 54550658 49521459 44635743 39984185 35632904 31625468
57064 31625468 27984622 24716178 21813700 19261352 17035416 15106638 13443367 12013542
57056 12013542 10785285 9727883 8813715 8019576 7326378 6718158 6181457 5705035 5279713
57047 5279713 4898446 4556109 4248444 3970996 3719340 3490080 3280936 3089947 2915386
57038 2915386 2756319 2612197 2481699 2362854 2254548 2156936 2070055 1993020 1924999 1865904
57028 1865904 1815470 1772659 1736816 1708597 1688920 1677844 1675526 1683485 1703414 1734752 1774418 1818750
57016 1818750 1864341 1906380 1936985 1946376 1926631 1875270 1796067 1696742 1585798 1470967 1359124
57005 1359124 1255678 1163210 1081442 1009140 945571 890058 841336 798274 760619 728193 699906
56994 699906 674341 650843 629375 609803 592122 576948 564987 556301 550686 548250 548893 551653 555226
56981 555226 558626 560577 559000 552269 540706 525938 509168 491118 473249 457604 445203 435552
56969 435552 427836 421757 417179 413933 412252 412703 415538 420661 428274 438773 451883 466543 481756
56956 481756 496894 510940 522033 528118 527841 520883 507894 490284 469793 448197 427353 408973
56944 408973 393794 381329 370960 363024 358321 357055 358970 364257 373462 386701 403690 424346 448503
56931 448503 475032 501879 526718 546889 559172 561012 552281 535093 511814 483998 453155 421379
56919 421379 390779 362880 338726 318768 302413 288425 276098 265509 256571 248666 241412 235027
56907 235027 229610 224701 219911 215383 211347 207775 204825 203086 202990 204365 206831 210279 214784 220452 227536
56892 227536 236303 246689 258498 271915 287284 304276 321852 339154 355713 370537 381698 387395
56880 387395 387167 381847 372797 361503 349464 337904 327577 318931 312287 307863 305993 307458 313301
56867 313301 324199 340159 360837 385883 415088 448564 486602 528800 573165 616381 654855
56856 654855 685209 704224 709433 700355 678961 648856 614171 578774 545614 516451 492490 475135
56844 475135 465598 463956 469390 481447 500503 527054 561376 603936 655190 714549 780069 849173
56832 849173 918640 983388 1036226 1069974 1080094 1065581 1028425 973145 906294 835080 765607
56821 765607 702033 646794 601126 565414 539482 522806 514640 514245 521207 535544 557506 587258
56809 587258 624486 667960 715423 763835 809379 847136 871574 878389 866158 836270 791904 737590
56797 737590 678917 621161 567738 520318 480022 447655 423018 405135 393365 387565 387281 391796
56785 391796 401050 415507 434846 457679 482645 508656 533628 554071 566638 569562 562347 545126
56773 545126 519003 486377 450183 413056 377314 344854 316468 291788 270314 252030 236847
56762 236847 224241 213815 205451 198542 192016 185645 180476 177217 174977 172314 168825 164891 160611 156039
56748 156039 151961 149291 147844 146590 145043 143572 142426 141295 139975 138828 138353 138662 139449 140202 140446
56733 140446 140116 139721 139923 140910 142264 143372 143974 144457 145571 147498 149277 149659 148670 147744 148047 149242 150244
56716 150244 150642 150832 151157 151586 152166 153207 154881 156830 158324 158816 158412 157719 157187 156791 156479 156518 156993 157421
56698 157421 157433 157477 158035 158579 158240 157295 156800 156827 156347 155006 153738 153243 153134 153036 153260 153722 153411 151768 149610
56679 149610 147858 146397 145080 144815 146380 148863 150524 150858 150791 151198 152171 153495 154976 156421 157857 159511
56663 159511 161115 161791 161198 160208 159791 159823 159702 159455 159407 159358 159067 159064 159990 161549 163006 164287 165611 166508 166363
56644 166363 165681 165701 166841 168535 170446 172706 174939 176199 176204 175790 175788 176089 176098 175583 174829 174272 174125 174134 173820 173196
56624 173196 172947 173488 174219 174255 173550 172719 172085 171626 171595 172352 173618 174649 175165 175577 176330 177618 179650 182512
56606 182512 185700 188318 189902 190724 191267 191738 192082 192200 192181 192408 193218 194391 195405 196301 197630 199321 200388
56589 200388 200308 199923 200264 201179 201939 202537 203347 203990 203678 202528 201499 201069 200799 200214 199381 198621 198241 198471
56571 198471 199204 199943 200474 201268 202715 204488 206322 208822 212548 216715 219887 221908 224204 228158 233902
56556 233902 240627 247401 253681 259552 265339 270654 274407 276339 277813 280169 282885 284459 284581 284188 283721
56541 283721 282698 280907 278743 276305 273300 269922 266817 264066 261188 258170 255487 253078 250340 247235
56527 247235 244407 242043 239669 237186 235072 233323 231240 228642 226382 225214 224832 224423 223578 222382 221117
56512 221117 220085 219298 218358 217055 215885 215342 215017 214166 212890 211829 210949 209744 208488 208064 208456 208590
56496 208590 207887 206893 206154 205575 205196 205549 206711 207888 208419 208542 208739 209030 209229 209334 209375 209390 209676 210544 211770
56477 211770 212821 213512 213829 213397 212025 210622 210513 211836 213483 214612 215225 215373 214977 214541 214811 215517 215567
56460 215567 214725 213979 213980 214259 214376 214694 215506 216424 217136 217941 219018 219994 220600 221015 221248 221078 220866 221524 223304
56441 223304 225429 227221 228685 229743 229922 229222 228390 227892 227469 226997 226865 227106 227096 226567 226029 225834 225674 225403
56423 225403 225403 225745 225925 225864 226239 227342 228466 228950 229004 229119 229470 230307 232014 234365 236505 238049 239336 240388
56405 240388 240681 240303 240257 241015 241788 241790 241373 241326 241940 243224 245221 247570 249567 251081 252681 254572 256244
56388 256244 257386 258147 258337 257539 256318 256054 257136 258545 259651 261089 263290 265476 266894 267861 268876
56373 268876 269839 270804 272322 274345 275935 276715 277430 278446 279049 278938 278964 279522 279676 278927 278449 279381 281110
56356 281110 282433 283204 283638 283248 281883 280731 280850 281587 281786 281723 282400 283762 285011 286056 287328 288674
56340 288674 289680 290574 291742 292955 294069 295821 298766 302078 304584 306412 308521 311098 313521 315405
56326 315405 316666 317021 316432 315644 315445 315853 316660 318091 320173 322213 323677 324831 325877 326405 326462 327016 328418
56309 328418 329577 329747 329926 331212 332917 333805 334207 335353 337382 339551 341810 344666 347932 350945 353614
56294 353614 356142 358190 359459 360523 362052 363777 365211 366650 368482 370365 372099 374341 377333 380045
56280 380045 381865 384045 387954 392913 397367 401248 405481 410030 414250 418498 423531 428864 433423 437432
56266 437432 442023 447456 453281 459630 466804 474147 481062 488571 498072 509091 520053 530855 542794
56253 542794 556310 570739 586148 603470 622791 643291 664987 688959 715675 744487 774858
56242 774858 806755 839818 873391 907316 941484 974720 1005316 1032501 1056254 1075951 1090435
56231 1090435 1099176 1102283 1099723 1091618 1078856 1062294 1041888 1017634 990632 962066 932053 900805
56219 900805 869934 840996 813699 787164 761950 738971 717454 696154 675886 658586 644420
56208 644420 631910 620505 610786 602480 594440 586445 579103 572287 565611 560072 557089 556139 555321 553964
56194 553964 552727 551587 549986 548581 548530 549238 549144 548587 549491 552274 555440 558314 561728 565750 569099 571302
56178 571302 573354 575769 577831 579119 580010 580566 580659 581210 583450 586974 590324 593362 597157 601770 606239
56163 606239 610590 615721 621420 626648 631667 637756 645035 652764 661498 672503 685272 698073 710844
56150 710844 725014 740583 756046 771266 787827 806430 826433 848041 872415 899647 929190
56139 929190 962252 1001117 1046275 1097013 1154670 1222219 1300704 1389213 1488244 1599472 1721733
56128 1721733 1850630 1982460 2115108 2244681 2365213 2473035 2568355 2651816 2722934 2782809
56118 2782809 2834525 2879124 2914031 2936656 2946629 2943622 2926572 2896575 2857464 2811871 2759320 2699067
56106 2699067 2631451 2555150 2466640 2364449 2251449 2131807 2008718 1886376 1770620 1665459
56096 1665459 1571419 1488637 1418578 1361236 1313766 1273814 1241516 1216816 1197685 1182595 1171916
56085 1171916 1165395 1161098 1158250 1158157 1160942 1164422 1167584 1171973 1178194 1184360 1189599 1195851 1204523 1214589
56071 1214589 1225527 1238744 1254464 1270633 1286523 1303928 1323233 1341997 1359094 1376416 1394640
56060 1394640 1411333 1425312 1438904 1453719 1468099 1480956 1494129 1508629 1522585 1535358 1549554
56049 1549554 1566523 1583972 1600644 1619036 1640770 1663583 1685787 1709386 1735718 1762377 1787716
56038 1787716 1814023 1842824 1871170 1896091 1918717 1940722 1960865 1978554 1996763 2018055 2041804
56027 2041804 2068436 2101843 2144075 2192114 2243234 2298794 2359365 2421331 2482335 2545075 2611684
56016 2611684 2679480 2746380 2815280 2888681 2964235 3039964 3118571 3202244 3288806 3377409 3472019
56005 3472019 3574584 3681078 3789228 3903550 4027455 4157367 4290456 4431021 4582877
55996 4582877 4742609 4907130 5080700 5267465 5464344 5668602 5884962 6117614 6363084
55987 6363084 6619105 6892561 7190218 7509910 7849704 8216955 8618810 9052979 9518093
55978 9518093 10023774 10579705 11184919 11839757 12558193 13355945 14237452 15208366 16289857
55969 16289857 17506462 18872766 20409066 22158677 24173753 26499301 29192080 32342378
55961 32342378 36057739 40443311 45624338 51771913 59079628 67735142 77950241 90003267
55953 90003267 104218300 120923699 140460252 163160909 189187630 218313253 249825924
55946 249825924 282498953 314427506 342853568 364433542 376103663 376047809 364152864
55939 364152864 341875924 311850238 277389904 241832178 207845187 177060345 150176809
55932 150176809 127286991 108130355 92247097 79119576 68279721 59325012 51893692
55925 51893692 45676368 40439884 36008198 32227937 28970985 26151023 23707746 21579880
55917 21579880 19709764 18060933 16609377 15324545 14175129 13144569 12223923 11396475
55909 11396475 10643916 9960002 9343375 8783374 8266327 7789295 7354449 6955833 6584284
55900 6584284 6239764 5926253 5639169 5369527 5116273 4883400 4668852 4466789 4277132
55891 4277132 4102777 3940799 3785933 3639457 3505574 3382280 3264606 3153662 3053758 2963591
55881 2963591 2878745 2800128 2731705 2672497 2618735 2571402 2533703 2503226 2474055 2444490 2415351
55870 2415351 2382897 2340995 2288925 2230343 2166298 2095989 2022629 1951572 1883578 1816027 1749420
55859 1749420 1686672 1627285 1568305 1510009 1455054 1403191 1352317 1303560 1259881 1220745 1183314
55848 1183314 1147714 1116051 1087487 1059370 1032035 1007558 985062 962201 939960 921001 904488
55837 904488 887485 870196 854907 840997 826112 811093 798723 788511 777728 766667 757866 750911
55825 750911 743001 734012 726137 719125 710692 701097 692521 684442 674499 663523 654801 648568 642107 635221
55811 635221 630709 629205 628329 627392 628390 631732 635364 638854 644217 651923 659924 667370 675488 683995 690229
55796 690229 692684 692112 688565 680734 668941 655536 641567 625997 608790 591812 576240 561932
55784 561932 549683 541090 535759 531470 527364 524141 521026 515696 507641 498650 489694 480282 471185 464599
55770 464599 461028 458878 457620 458386 460852 462529 461902 459649 456088 450134 441562 431855 422131 412478 403703
55755 403703 397149 392318 387192 381390 376551 373154 369526 364569 358983 353206 346639 339596 333600 329027
55741 329027 324665 320162 316582 313989 310926 307027 303898 302598 302314 302214 302536 303151 303047 301997 300932
55726 300932 300133 298790 296717 294639 292470 289322 285491 282421 280389 278297 275972 274499 273935 272999 271472
55711 271472 270773 271603 273120 274854 277279 280059 281912 282757 283776 284907 284506 282099 279188 276662 273633
55696 273633 269567 265333 261319 256675 251364 246919 244180 242130 239866 237943 236957 236596 236796 238057 239900
55681 239900 240868 240801 241329 243406 246102 248390 250240 251388 251087 249851 249426 250186 250466 249244 247577 246564
55665 246564 245945 245616 246476 248654 250743 251955 253318 255759 258769 261949 266048 271356 276804 281768 287027
55650 287027 292729 297064 298292 296668 293243 288207 281554 274011 266204 258109 250187 243681 238940 234829
55636 234829 230604 226828 223710 220261 216108 212448 210138 208427 206609 205344 205166 205295 205055 204962 205220 204779
55620 204779 203153 201624 201305 201450 201031 200474 200412 200170 199097 198109 198181 198409 197238 194798 192424 190608 188875
55603 188875 187058 185341 183554 181618 180212 179942 180264 180075 178998 177476 176166 175668 176036 176227 175038 172994
55587 172994 172094 173198 174992 176117 176857 177898 178913 179408 179757 180387 181083 181958 183867 186975 190182 192813
55571 192813 195556 198827 201715 203656 205752 209230 213831 218789 224027 229221 233075 234871 235433 235327 233507
55556 233507 229187 223722 219018 215139 210976 206240 201291 196039 190566 185943 182972 180985 179139 177870
55542 177870 177696 177675 176673 175158 174195 173620 172824 172309 172716 173133 172229 170384 168921 167891 166404 164633 163584
55525 163584 163237 162709 162055 162170 162959 163169 162090 160129 157771 155277 153279 152329 151891 150926 149428 148354
55509 148354 148171 148528 149135 149923 150492 150414 149948 149619 149351 148813 148263 148106 148111 147941 147962 148547 149086 148784 148010 147823
55489 147823 148507 149542 150558 151355 151447 150656 149772 149728 150497 151575 152867 154190 154723 154078 153262 153351 153865 153667
55471 153667 152860 152459 152767 153360 154167 155210 155756 155134 154045 153749 154244 154502 154122 153499 152741 151701 150735 150201
55453 150201 149634 148605 147852 148188 148873 148613 147711 147570 148407 149166 149507 150129 151113 151617 151384 151065 150899 150460
55435 150460 149838 149711 150071 150193 149995 150128 150668 150985 151064 151583 152482 152802 152205 151495 151348 151710 152648 154558 157214
55416 157214 159684 161535 163166 164800 166173 167327 168643 169965 170739 171148 171931 172961 173175 172177 170747
55401 170747 169516 168288 166926 165730 164524 162549 159783 157360 156169 155884 155808 155788 155830 155566 154688 153397
55385 153397 152131 151288 151160 151547 151548 150560 149354 149240 150281 151370 151965 152448 152735 151930 149846 147624 146303
55368 146303 145755 145528 145690 146235 146588 146395 146124 146313 146818 147287 147722 148148 148258 147836 147072 146285 145852 146459 148578
55349 148578 151451 153408 153658 153074 152819 152886 152524 151590 150801 150810 151473 152032 151922 151362 150983 150838 150270 149060 148055
55330 148055 148002 148353 148080 147197 146471 146033 145437 144827 144858 145507 146053 146175 146012 145355 143990 142691 142543 143270 143619
55311 143619 143467 143945 145246 146032 145642 145315 146256 147747 148260 147527 146508 145968 145961 146231 146385 146084 145531 145385
55293 145385 145889 146650 147436 148526 149975 151308 152254 152995 153459 153244 152555 152230 152430 152259 151252 150262 150207 150811
55275 150811 151301 151633 152151 152625 152497 151773 150994 150565 150560 150911 151431 151891 152289 152763 153110 152899 152178 151514 151244
55256 151244 151252 151556 152386 153543 154437 154920 155352 155698 155434 154607 154035 154092 154135 153557 152592 151695 151013 150871 151769 153297
55236 153297 153952 152832 150829 149465 149158 149366 149814 150738 152150 153540 154241 153875 152751 151921 152337 153732
55220 153732 154846 154911 154302 153673 153293 153429 154462 156208 157864 158964 159635 159733 158770 157121 156137 156421 156936
55203 156936 156590 155769 155425 155457 154998 153761 152211 150818 149880 149702 150296 151157 151877 152533 153113 153107 152213 150941
55185 150941 150060 149921 150680 152418 154538 155821 155741 155153 155090 155522 155873 155998 155968 155602 155018 155038 156193 157847
55167 157847 159054 159750 160342 160655 160244 159330 158597 158353 158592 159528 161237 163105 164375 165049 165627 166235 166693
55150 166693 167103 167642 168011 167760 167016 166303 165829 165462 165185 165045 164883 164551 164150 163645 162668 161169 159861 159452
55132 159452 159803 160358 160967 161693 162187 161961 161115 160170 159396 158749 158304 158289 158792 159728 160895 161923 162535 162993
55114 162993 163804 164869 165586 165866 166204 166460 165681 163721 161981 161684 162285 162515 162234 162226 162802 163654 164631 165675
55096 165675 166416 166729 167222 168286 169199 169224 169097 170194 172506 174625 175615 175757 175539 175022 174316 173652 172842 171482
55078 171482 169833 168728 168491 168681 169020 169779 171071 172415 173257 173466 173187 172614 171983 171372 170448 168832 166705
55061 166705 164749 163531 163224 163720 164620 165260 165205 164669 164220 164216 164722 165614 166508 166925 166852 166746 166759 166539 166116 166268
55041 166268 167449 168972 169905 170197 170320 170439 170676 171551 173222 174780 175236 174894 174854 175504 176275 176662 176632 176314
55023 176314 176019 176243 176928 177144 176306 175263 175221 175997 176372 175891 175289 175305 176012 177180 178416 179098 179044 179012 179694
55004 179694 180542 180514 179675 179010 178922 179001 179063 179302 179551 179524 179630 180367 181111 180787 179715 179440 180641 182492 184210
54985 184210 185838 187222 187677 187237 186994 187546 188151 188016 187433 186985 186601 186102 185841 186060 186322 186314 186602 187854
54967 187854 189800 191604 192905 193914 194776 195360 195542 195329 194825 194230 193728 193363 193243 193684 194715 195665 195845
54950 195845 195501 195420 195730 195908 195857 196050 196535 196793 196719 196765 196891 196477 195637 195536 196726 198121 198419 197811 197564
54931 197564 198481 200543 203546 207249 211165 214890 218553 222540 227010 231987 237600 243764 249932 255555
54917 255555 260547 264890 268063 269326 268449 265811 261917 257115 251699 246015 240404 235142 230396 226253
54903 226253 222780 219943 217432 214914 212635 211331 211116 210935 209767 208006 206807 206384 205942 205252 205114 206030
54887 206030 207458 208859 210599 213233 216556 219996 223530 227616 232516 238081 243990 249888 255531 260905
54873 260905 265852 269550 270831 269262 265522 260533 254687 248105 241251 234930 229871 226328 223814 221305
54859 221305 218140 214741 212046 210292 208836 207084 204989 202694 200389 198542 197529 196891 195643 193574
54845 193574 191652 190895 191330 192147 192446 191819 190770 190517 191717 193414 193923 192714 190699 188850 187565 187298
54829 187298 188528 190702 192336 192704 192553 192743 193126 193213 192995 192486 191350 189712 188620 188970 190482 192267
54813 192267 193843 195117 196093 197078 198530 200171 200936 200303 199036 198100 197588 197258 197305 197851 198398 198542 198638 199028
54795 199028 199254 198813 198116 197833 197797 197385 196546 195655 194809 194098 194139 195427 197405 199037 200124 201291 202892
54778 202892 204739 206750 209112 211865 214968 218677 223225 228212 232976 237552 242676 248853 255882 263211
54764 263211 270246 276408 281389 285398 288731 291106 291724 290039 286260 281207 275787 270439 264948 259031
54750 259031 253108 248005 243824 239772 235423 231435 228511 226301 224070 221903 220526 220198 220513 221063 221632
54735 221632 221910 221625 220974 220569 221033 222872 226318 230924 235673 239948 244087 248640 253558 258553 263667
54720 263667 268823 273259 276089 277105 276436 273908 269512 264080 258626 253244 247517 241808 237142 233798
54706 233798 230866 227375 223188 218714 214442 210950 208743 207704 207042 205993 204416 202739 201562 201219 201400
54691 201400 201302 200471 199380 198861 199111 199616 199851 199679 199213 198688 198361 198207 197882 197266 196766 196759 197075 197453 198111
54672 198111 199288 200562 201276 201452 201612 201835 201669 200962 200089 199303 198399 197217 196047 195379 195502 196323 197342
54655 197342 197909 197875 197866 198541 199692 200485 200602 200677 201485 202979 204301 204659 204140 203643 203922 204802 205592 206109 206756
54636 206756 207608 208116 207981 207652 207604 207643 207353 206690 205736 204416 202889 201714 201156 200828 200438 200252 200376 200297 199782
54617 199782 199488 199951 200657 200930 201083 201715 202533 202910 203118 203866 205005 205817 206255 206768 207142 206702 205569 204560
54599 204560 203910 203155 202268 201788 201772 201679 201387 201335 201611 201925 202440 203550 204732 204841 203810 202889 202812 202950 202702
54580 202702 202626 203439 204857 206152 207117 207750 207700 206848 205931 205860 206608 207357 207518 207257 207231 208084 209902 211934 213145
54561 213145 213204 212636 212019 211586 211683 212823 214926 217027 218185 218302 217803 217015 216147 215440 214947 214501 214124 214078
54543 214078 214349 214575 214722 215271 216436 217801 219108 220803 223170 225399 226298 225810 225181 225551 226838 228120
54527 228120 228727 228697 228401 228062 227775 227778 228376 229529 230773 231721 232369 232746 232702 232373 232476 233529 234994 235768 235434
54508 235434 234465 233294 231845 230034 228147 226579 225607 225424 225976 226744 227177 227368 227874 228861 229873 230417 230346
54491 230346 229743 228886 228238 228034 228012 228029 228646 230456 233043 235352 236938 238047 238711 238788 238851 239882 241840 243518
54473 243518 244158 244231 244303 244080 243189 242035 241194 240579 239843 239156 239053 239797 241289 243239 245125 246423 247160 247812
54455 247812 248494 248779 248537 248279 248379 248550 248501 248470 248692 248860 248636 248230 247997 247837 247461 246898 246371 245921 245498
54436 245498 245153 244870 244459 243784 242847 241576 239950 238354 237311 236776 236245 235593 235211 235226 235332 235546 236338 237747
54418 237747 239100 239909 240364 240644 240519 240016 239666 239693 239664 239357 239176 239277 239143 238591 238325 238809 239437 239534 239427
54399 239427 239676 240001 239948 240001 240956 242548 243708 243962 243701 243301 242813 242430 242488 242981 243622 244270 244846 245054 244697
54380 244697 244140 243964 244350 245104 245986 246686 246925 246976 247543 248670 249358 248849 247689 246868 246548 246424 246671 247527
54362 247527 248443 248739 248784 249416 250445 250888 250587 250394 250643 250573 249610 248292 247462 247219 247101 246787 246323 246009 246278
54343 246278 247332 248780 249868 250070 249214 247370 245121 243651 243765 244828 245391 244924 244268 244250 244556 244250 242920
54326 242920 240992 239301 238475 238435 238381 237546 236022 234601 233900 233971 234592 235491 236305 236829 237271 237928 238736 239591
54308 239591 240839 242779 244808 245827 245585 244901 244486 244210 243790 243419 243286 243026 242135 240617 238868 237259
54292 237259 236125 235847 236525 237761 239073 240437 242093 243908 245222 245411 244519 243256 242354 241948 241705 241543
54276 241543 241923 243253 245214 247015 248192 248959 249841 251196 252954 254636 255762 256425 257158 258055 258464 257969
54260 257969 257222 257098 257356 256875 255086 252398 249284 245856 242590 240519 240145 240650 240789 240284 239901 240322 241355
54243 241355 242170 242090 241157 240073 239514 239493 239516 239319 239178 239419 239957 240507 241016 241635 242366 242986 243321 243444 243572
54224 243572 243825 244173 244573 245057 245577 245888 245760 245268 244672 244068 243432 242915 242635 242133 240634 238089 235499 233840
54206 233840 233116 232789 232603 232459 231985 230948 229884 229601 230134 230715 230756 230376 230061 230249 231175 232625 233906 234440
54188 234440 234336 234071 233859 233724 233832 234177 234258 233778 233396 233950 235075 235502 234742 233578 232790 232292 231812 231497
54170 231497 231373 230920 229797 228485 227639 227209 226647 225737 224734 223941 223483 223343 223354 223335 223382 223790 224517 225082 225183
54151 225183 225107 225275 225700 226165 226654 227265 227958 228622 229247 229794 230031 229789 229223 228626 228131 227773 227649 227804 228130
54132 228130 228559 229199 230076 230902 231455 232032 233200 234976 236633 237506 237845 238541 240067 241956 243453 244397 245207
54115 245207 246285 247816 250090 253430 257660 262065 266056 269470 272064 273310 273067 271965 270669 269130
54101 269130 267072 264782 262770 260945 258884 256736 255119 254145 253282 252201 251082 250002 248650 246942 245330
54086 245330 244281 243777 243524 243278 242846 242125 241300 240737 240630 240962 241716 242736 243535 243778 243863 244451 245437 246016
54068 246016 245811 245254 244782 244413 244346 245148 246825 248352 248724 248062 247184 246501 245935 245530 245432 245379 244936 244334 244499
54049 244499 245961 248095 249778 250638 251339 252669 254614 256507 257880 258886 259903 261076 262351 263613 264617
54034 264617 265159 265591 266855 269614 273571 277975 282436 286801 290601 293317 295117 296659 298228 299663 301092
54019 301092 303011 305440 307647 309011 309656 310005 310122 309776 308803 307182 305017 302648 300555 299013 297959
54004 297959 297154 296233 294718 292379 289615 287133 285274 283916 282896 282118 281354 280358 279107 277553 275394
53989 275394 272626 270093 268756 268482 268276 267682 267197 267304 267845 268529 269260 269779 269708 269201 268914 269068 269166 268824
53971 268824 268220 267501 266484 265247 264266 263608 262684 261279 260200 260384 261770 263500 264811 265392 265327 265107 265322
53954 265322 266029 266740 267196 267697 268565 269832 271642 274251 277360 280167 282484 285118 288657 292557 295950
53939 295950 298829 301879 305535 309688 313935 317775 320933 323848 327389 331885 336974 342484 348676 355388
53925 355388 361931 368311 375538 384057 392810 400735 408388 417176 427769 440271 455269 473490 494840
53912 494840 518896 546018 576681 609675 641869 669784 690692 702577 704270 695943 678833 654468
53900 654468 624781 592704 561511 533202 507992 485351 464932 446585 430330 416504 405350
53889 405350 396334 388483 381401 375275 369808 363947 357055 349798 343453 338638 334980 331724 328386 324970
53875 324970 321765 318958 316436 313975 311370 308342 304682 300779 297559 295490 294034 292563 291370 291038
53861 291038 291104 290328 288337 286194 285048 284843 284661 283905 282774 281827 281377 281248 280996 280381 279567 278853 278426 278455
53843 278455 279142 280443 281971 283382 284585 285463 285791 285726 285829 286262 286502 286259 286052 286250 286192 285129 283553
53826 283553 282588 282391 282214 281896 282224 283699 285838 287901 289537 290572 290865 290616 290198 289616 288650 287490 286597
53809 286597 285975 285392 285264 286449 288957 291745 294032 295990 297896 299526 300893 302750 305685 309296 312835
53794 312835 316183 319600 322912 325615 327513 328777 329605 330290 331425 333472 336147 338531 339770 339561 338175
53779 338175 336313 334810 334146 334198 334469 334447 333759 332291 330337 328385 326622 324800 322679 320381 318204 316308
53763 316308 314683 313221 311714 310000 308193 306586 305331 304447 304063 304252 304597 304391 303574 303091 303928 305925
53747 305925 307803 308291 307108 304976 302897 301441 300614 300254 300384 301111 302399 304222 306788 310308 314621
53732 314621 319313 324176 329269 334637 340310 346590 354016 362982 373635 386083 400422 416598 434570
53719 434570 454509 476328 498867 519870 536924 548271 552852 550201 540700 525771 507510 488044
53707 488044 469106 451851 436843 424204 413806 405392 398702 393706 390581 389290 389297 389866 390548 391245
53693 391245 392041 393150 394754 396633 398187 399068 399509 399730 399467 398485 397221 396370 396105 396201 396595 397226 397628
53676 397628 397370 396746 396399 396439 396586 396927 397733 398632 398855 398380 398051 398498 399599 401045 402678 404180 405212
53659 405212 406034 407257 408739 409455 408682 406718 404230 401533 398777 396145 393588 390881 388154 385872 384158
53644 384158 382788 381867 381770 382223 382364 382003 382014 383045 384656 386166 387557 388971 390072 390604 390986 391712 392656
53627 392656 393591 394892 397011 399686 402324 404908 407918 411629 416042 421273 427486 434616 442551 451397
53613 451397 461267 472070 483767 496397 509531 522209 533816 544599 554864 564190 571939 578004
53601 578004 582374 584372 583187 578977 572803 565630 557967 550316 543232 536928 531302 526348 522038 517893
53587 517893 513263 508209 503697 500703 499244 498332 496751 494009 490721 488001 486389 485504 484694 483602 481987
53572 481987 479591 476602 473812 471814 470290 468517 466302 463964 461682 459467 457609 456582 456452 456739 456893
53557 456893 456679 456112 455314 454451 453702 453348 453766 455026 456458 457159 457138 457453 458847 460773 462225 463099 464190
53540 464190 466168 469072 472574 476209 479622 483056 487373 493082 499512 505510 510853 516458 523325 531704
53526 531704 541193 551214 561437 572080 583733 596616 610234 624044 638183 653068 668631 684489
53514 684489 700740 718010 736802 757227 779247 802687 827055 851864 877103 903054 929717
53503 929717 956806 984077 1011206 1037510 1062404 1086166 1109702 1133498 1157172 1180129 1202266
53492 1202266 1223966 1245730 1267916 1290677 1314090 1338350 1363575 1389297 1414518 1438578 1461607
53481 1461607 1483829 1504904 1524448 1542808 1560665 1578158 1594999 1611138 1626651 1641251 1654709
53470 1654709 1667588 1680695 1693792 1705640 1715389 1723201 1729392 1733740 1735877 1735713 1733204 1728180 1720586
53457 1720586 1710328 1696800 1679190 1657524 1632805 1605845 1576526 1544568 1510502 1475462 1440477
53446 1440477 1406374 1373976 1343771 1315524 1288645 1262934 1238728 1216441 1196142 1177476 1159814
53435 1159814 1142677 1126259 1111479 1099332 1090160 1083575 1078955 1075913 1074386 1074411 1075905 1078780 1083240
53422 1083240 1089785 1098702 1109734 1122438 1136727 1152808 1170701 1190094 1210656 1232333 1255412 1280429
53410 1280429 1307744 1336979 1367145 1397689 1429126 1462264 1497126 1533235 1570708 1610321 1652526
53399 1652526 1697062 1743646 1792401 1843442 1896590 1951757 2009089 2068459 2129202 2190658 2252664
53388 2252664 2315261 2378146 2440735 2502646 2563980 2625100 2686034 2745927 2803265 2856974 2907138
53377 2907138 2954284 2998136 3037619 3072049 3101739 3127387 3149427 3168034 3183093 3193956 3199817
53366 3199817 3200627 3197154 3189794 3177751 3159739 3135066 3103648 3065397 3020210 2968519 2911428 2850258
53354 2850258 2786058 2719409 2650601 2580141 2509168 2439159 2371063 2304981 2240797 2178797 2119396
53343 2119396 2062501 2007470 1953653 1900803 1849010 1798387 1748903 1700590 1653908 1609633 1568137
53332 1568137 1529028 1491911 1457299 1426180 1398632 1373465 1349473 1326633 1305825 1287759 1272384
53321 1272384 1259049 1246972 1235808 1225866 1217528 1210506 1204112 1198267 1193617 1190456 1188224 1186493 1185821
53308 1185821 1187018 1189953 1193741 1197906 1202723 1208617 1215797 1224445 1234694 1246319 1258970 1272873 1288905
53295 1288905 1307774 1329374 1353103 1378554 1405653 1434254 1463900 1494030 1524323 1554705 1585042
53284 1585042 1614947 1643980 1672010 1699165 1725378 1750137 1772774 1792936 1810668 1826068 1838953
53273 1838953 1848879 1855451 1858620 1858635 1855744 1850033 1841560 1830510 1817124 1801617 1784233 1765193 1744427
53260 1744427 1721538 1696161 1668239 1637857 1605133 1570532 1534872 1498668 1461700 1423656 1384893
53249 1384893 1346064 1307338 1268752 1231171 1195972 1163554 1132885 1102810 1073179 1044404 1016529
53238 1016529 989208 962233 935659 909674 884633 860899 838389 816606 795365 775139 756424
53227 756424 739199 723323 708988 696243 684403 672570 660652 649428 639587 631054 623174 615235
53215 615235 606750 597574 587881 578006 568271 558951 550159 541638 532911 523886 515213 507787 501935 497256
53201 497256 493146 489227 485291 481102 476471 471510 466619 462036 457425 452177 446195 440063 434206 428253
53187 428253 421670 414812 408751 404118 400608 397623 394840 392076 389170 386265 383801 382013 380701 379515
53173 379515 378108 376104 373506 371184 370224 370610 371169 371078 370710 370714 371027 371323 371689 372185 372259 371366 369823 368368
53155 368368 367236 366281 365624 365443 365364 364889 364334 364616 366105 368312 370638 372806 374587 375761 376505 377226 377946
53138 377946 378374 378688 379599 381403 383536 385407 387203 389471 392196 394732 396479 397336 397552 397443 397272 397265 397682
53121 397682 398789 400541 402331 403285 403026 401994 400886 399981 399176 398470 397972 397416 396114 393713 390794 388352
53105 388352 386705 385275 383448 381198 378633 375489 371584 367487 364073 361476 359117 356808 355189 354749
53091 354749 354947 354716 353597 352030 350724 350008 349654 349162 348274 347278 346660 346511 346521 346505 346523 346492 346176 345703 345570
53072 345570 345970 346546 346980 347275 347194 346099 343852 341358 339610 338563 337505 336233 335224 334790 334672 334425
53056 334425 333807 332771 331461 330154 329024 328108 327628 328002 329213 330558 331449 332134 333176 334521 335630 336336
53040 336336 336970 337766 338623 339460 340338 341272 342249 343283 344149 344311 343589 342720 342716 343718 344951 345713 345994 346192
53022 346192 346691 347689 349032 350268 351173 352078 353312 354592 355466 356066 356787 357385 357157 355992 354552 353321
53006 353321 352175 351062 350442 350753 351891 353522 355470 357523 359213 360110 360157 359587 358710 357858 357203 356501 355289
52989 355289 353463 351489 349994 349318 349390 349790 349955 349668 349296 349347 349858 350489 351021 351412 351575 351644 352282 354081
52971 354081 356614 358662 359499 359459 359255 359318 359902 361179 362966 364841 366668 368516 369948 370130 368944 367370
52955 367370 366273 365383 363975 362143 360702 360084 359913 359598 358874 357808 356661 355678 354685 352964 349971 346227
52939 346227 343075 341378 340762 340342 339897 339907 340532 341158 341271 341311 342036 343266 344056 344224 344744 346152 347382 347079
52921 347079 345562 344449 344576 345315 345893 346274 346550 346508 346331 346874 348587 350748 352308 353086 353567 353991 354170
52904 354170 353920 353132 351714 349914 348425 347641 347091 346155 345151 345035 346030 347153 347303 346421 345334 344785 344871
52887 344871 345268 345692 346029 346151 345898 345331 344880 344932 345264 345125 343974 341997 339846 338065 336851 336152 335825
52870 335825 335732 335792 335922 336028 336127 336337 336605 336646 336399 336291 336653 337132 337276 337495 338657 340680 342365 342957 343105
52851 343105 343792 344949 345793 346081 346231 346400 346198 345460 344766 344917 346100 347701 348885 349295 349212 349012 348602 347568
52833 347568 345822 343708 341477 339088 336680 334802 333873 333756 334075 334630 335238 335577 335510 335256 334912 334190 333016
52816 333016 332075 332209 333465 335209 337070 339320 342391 346423 351247 356437 361395 365672 369133 371548 372150
52801 372150 370108 365477 359365 353057 347183 341718 336497 331550 327041 323023 319397 316238 314061 313372
52787 313372 313836 314290 313846 312671 311383 310147 308890 308075 308509 310332 312741 314838 316397 317728 319117
52772 319117 320493 321395 321266 320041 318411 317226 316709 316573 316747 317430 318461 319240 319477 319511 319695 319914 320061
52755 320061 320480 321448 322480 322761 322213 321674 321926 322893 323926 324627 325153 325818 326609 327165 327187 326810 326521 326655
52737 326655 327088 327498 327840 328332 328990 329453 329479 329421 329895 330965 332013 332573 333003 334033 335802 337685 339036
52720 339036 339727 339891 339458 338216 336213 334001 332402 331997 332629 333492 333851 333670 333273 332602 331264 329345 327600
52703 327600 326565 325934 325180 324367 323859 323531 322867 321777 320804 320507 321039 322296 324018 325711 326927 327770 328762
52686 328762 330054 331169 331745 332161 333080 334617 336263 337464 338006 338019 337936 338264 339042 339619 339423 338854 338898 339830
52668 339830 340877 341400 341794 342745 344061 344886 344867 344455 344150 344155 344766 346361 348767 351222 353299 355274 357299
52651 357299 358849 359514 359786 360373 361133 361378 360958 360299 359532 358314 356533 354503 352461 350475 348877 348156
52635 348156 348270 348603 348721 348695 348677 348782 349439 351151 353700 356204 358156 359742 360939 361152 360173 358779 357759
52618 357759 356925 355717 354291 353287 352806 352311 351423 350297 349301 348763 348879 349445 349871 349802 349537 349472 349426 349010
52600 349010 348428 348343 349014 350015 350783 351067 350917 350669 350897 351987 353650 355125 355869 355916 355709 355812 356598 357946
52582 357946 359323 360425 361548 363063 364729 365947 366540 366942 367599 368524 369407 369911 369890 369510 369159 369139 369513
52565 369513 370256 371279 372241 372714 372767 373057 374053 375479 376679 377180 376693 375111 372926 371149 370301 369785 368781
52548 368781 367359 366255 365948 366533 368056 370257 372275 373362 373692 373785 373453 372130 370131 368680 368642 369878
52532 369878 371789 373747 375007 375064 374258 373413 372793 372055 371211 370836 371206 372020 373126 374718 376597 378099 379168
52515 379168 380697 383308 386448 389228 391611 394191 397225 400437 403457 405982 407749 408642 408637 407496 404914
52500 404914 401158 396983 392625 387547 381665 376206 372579 370808 369845 369182 369288 370414 371784 372373 372103
52485 372103 371892 372630 374285 375952 376711 376439 375837 375744 376563 378269 380650 383380 386049 388336 390176 391753
52469 391753 393423 395533 398053 400439 402140 403295 404602 406528 408984 411723 414503 416777 417742 417019 414876
52454 414876 411608 407243 402172 397540 394402 392690 391450 389966 388283 386839 385951 385583 385353 384910 384431
52439 384431 384480 385112 385528 385001 383851 382993 382775 382808 382764 382692 382479 381609 379720 377094 374440 372410 371368 371247
52421 371247 371459 371199 370209 369078 368634 369111 370126 371430 373367 376366 380134 383746 386702 389663 393813
52406 393813 399606 406494 413878 421901 431131 441748 453258 464741 475153 483518 489082 491298 489744
52393 489744 484373 475970 466042 455985 446468 437694 429936 423508 418449 414600 411907 410345 409643 409336
52379 409336 409105 408864 408641 408582 409030 410385 412877 416548 421241 426471 431437 435483 438504 440749 442349 443248
52363 443248 443427 442919 441700 439839 437740 435944 434689 433837 433239 432946 433040 433466 434041 434516 434680 434676 435149 436738
52345 436738 439262 441741 443476 444874 446846 449542 452146 454062 455835 458548 462625 467709 473553 480363
52331 480363 488135 496265 504223 512196 520627 529506 538551 547752 557100 566002 573654 579966 585490 590499
52317 590499 594808 598488 601995 605505 608983 613098 619122 627381 636642 645663 654649 664436 675004 685806
52303 685806 697177 710174 725009 740590 755834 770686 785575 800468 814750 827588 838192
52292 838192 846175 851952 856518 860659 864535 868003 870934 873124 874376 874881 875198 875640 875968 875893 875573 875344
52276 875344 875194 874758 873743 872186 870457 869197 869098 870429 872787 875469 878015 880386 882776 885542 889231
52261 889231 894335 900895 908482 916641 925215 934154 943237 952211 961131 970261 979601 988780 997505 1005844
52247 1005844 1013882 1021401 1028173 1034338 1040061 1044985 1048554 1050867 1052676 1054496 1056285 1058193 1060881 1064566
52233 1064566 1068220 1070408 1070812 1070416 1070239 1070381 1070242 1069203 1067030 1063980 1060688 1057691 1054930 1051823 1047852
52218 1047852 1042955 1037488 1032031 1027155 1023080 1019541 1016205 1013187 1010918 1009563 1008868 1008602 1008845 1009737 1011215
52203 1011215 1013140 1015498 1018280 1021346 1024584 1028147 1032358 1037393 1043157 1049484 1056398 1064061 1072419 1080965
52189 1080965 1088944 1095787 1101293 1105456 1108357 1110193 1111098 1110751 1108474 1104036 1098242 1092412 1087313 1082771
52175 1082771 1078223 1073403 1068523 1064008 1060123 1056690 1053215 1049429 1045696 1042707 1040844 1040028 1040162 1041426
52161 1041426 1043997 1047607 1051561 1055183 1058177 1060502 1062031 1062560 1062192 1061483 1060950 1060612 1060342 1060505 1061713 1063942
52145 1063942 1066454 1068809 1071377 1074448 1077379 1079216 1079845 1079892 1079600 1078477 1076135 1072983 1069876 1067376 1065539
52130 1065539 1064232 1063540 1063918 1065859 1069298 1073567 1078241 1083877 1091517 1101439 1112752 1124200 1135077 1145322
52116 1145322 1155159 1164854 1174657 1184775 1195400 1206723 1218757 1231193 1243666 1256245 1269574 1284470
52104 1284470 1301414 1320331 1340720 1362044 1384060 1406796 1430191 1453871 1477205 1499248 1518593
52093 1518593 1533675 1543578 1548425 1548926 1545968 1540785 1534980 1529743 1525196 1520871 1516593 1512521 1508613 1504651
52079 1504651 1500668 1496846 1493069 1489021 1484639 1480057 1475229 1470045 1464623 1459046 1453089 1446815 1441218 1437443
52065 1437443 1435412 1434067 1433036 1433147 1435073 1438371 1442392 1447400 1454031 1462059 1470379 1478089 1485108 1491819
52051 1491819 1498484 1505009 1511090 1516563 1521563 1526126 1529759 1531843 1532622 1533312 1535056 1538114 1542215 1547138
52037 1547138 1552584 1557920 1562557 1566343 1569184 1570545 1569834 1567218 1563601 1559768 1555756 1551069 1545245 1538248
52023 1538248 1530534 1522821 1515668 1509191 1503134 1497267 1491807 1487517 1485190 1484849 1485688 1487094 1489416 1493181
52009 1493181 1497700 1501213 1502474 1501432 1498076 1491438 1480378 1464875 1445945 1424588 1401476 1377447
51997 1377447 1353635 1330985 1309953 1290678 1273127 1257090 1242191 1227896 1213501 1198502 1183124
51986 1183124 1168128 1153795 1139478 1124492 1108988 1093368 1077274 1059935 1041413 1022719 1004634
51975 1004634 987038 969605 952606 936731 922598 910656 901245 894449 890147 888361 889275 892708 897898
51962 897898 904113 911173 918970 926563 932154 934060 931575 924977 915029 902646 888826 874619 860988
51949 860988 848650 838006 829223 822462 818044 816330 817420 821051 826843 834594 844136 854897 865721
51936 865721 875250 882532 887295 889784 890424 889499 886996 882717 876590 868799 859593 849017 836970 823452
51922 823452 808783 793671 779063 765645 753369 741729 730672 720975 713474 708231 704797 702980
51910 702980 702861 704362 707422 712540 720432 731105 743836 758044 773460 789285 804030 816591 826829
51897 826829 834496 838262 836555 829131 817171 802025 784539 765548 746348 728395 712810 700250
51885 700250 690975 684978 682206 682689 686361 692963 702344 714670 730034 747956 767597 788389 810055
51872 810055 831935 852548 869880 881950 887248 885104 875934 861126 842551 822123 801603 782463
51860 782463 765668 751571 740075 731001 724396 720426 718857 718754 718975 719030 719239 719972 720989 721629 721357
51845 721357 719971 717513 714175 710175 705573 700437 695239 690792 687601 685559 684454 684489 686066 689360 694399
51830 694399 701268 709862 719641 729960 740494 751073 761385 771265 781152 791885 804128 818194
51818 818194 834149 851607 869486 886384 901152 912819 920111 921574 916295 904321 886485 864186
51806 864186 839253 813581 788617 765165 743539 723724 705609 689326 675241 663473 653739 645908
51794 645908 640317 637083 635444 634397 633770 634020 635140 636492 637726 639088 640657 641913 642349 641941 640817
51779 640817 638987 636687 634480 632621 630833 629150 628621 630658 635814 643512 652816 663138 674287 686134
51765 686134 698159 709233 717939 723320 725161 723512 718259 709441 697726 684250 670094 656174 643404
51752 643404 632545 623818 616949 611624 607700 604970 602988 601359 600153 599941 601416 604943 610413 617463
51738 617463 625793 635252 645670 656736 668069 679354 690316 700574 709536 716432 720571 721693 720171
51725 720171 716901 712977 709351 706589 704804 703870 703678 704033 704319 703612 701437 698337 695502 693874 693667 694502
51709 694502 695782 697130 698708 701065 704543 709103 714983 723075 734112 747505 761369 773638 782914
51696 782914 788591 790906 790941 790143 789724 790741 794343 801045 809631 817518 822451 823415 819978 811852 799725
51681 799725 785711 772098 759851 748849 739113 731035 724554 718845 712927 706239 698680 690577 682622
51668 682622 675515 669669 665492 663758 665188 669663 676254 684019 692385 700685 707862 712926 715486 715685
51654 715685 713879 710669 707099 704500 703950 705807 709661 714715 720283 725891 730919 734270 734666 731282 724045
51639 724045 713399 700006 684685 668425 652324 637489 624897 615110 608058 603252 600215 598611
51627 598611 598020 597889 597876 598047 598543 599194 599692 600044 600520 601092 601192 600243 598246 595668 592898 590111 587512
51610 587512 585213 582780 579394 574833 569962 565827 562515 559424 556493 554513 554127 555144 557090 559924
51596 559924 563827 568760 574719 582152 591558 602807 615272 628527 642381 656235 668976 679718
51584 679718 688339 695165 700604 705390 710881 718683 729965 745331 765215 790145 820594 856727 898194
51571 898194 943970 992552 1042680 1094068 1147178 1202095 1257772 1312639 1365968 1418457 1471522
51560 1471522 1526322 1583737 1645025 1711865 1785167 1863610 1943335 2019008 2085157 2136826 2169762
51549 2169762 2180785 2168369 2132878 2076305 2001925 1913954 1816916 1714834 1610984 1508343 1409802
51538 1409802 1317591 1232818 1156039 1088072 1029721 980781 939964 905920 877794 854680 835259
51527 835259 818404 803676 790802 779138 768194 758294 750090 743631 738443 734274 731056 728272 725112
51514 725112 721296 717133 712701 707663 702086 696634 691568 686108 679344 671373 663053 654937 646963 639013
51500 639013 631290 624154 617969 613079 609647 607487 606258 605797 606073 606848 607634 608045 608051 607828 607450 606751 605485
51483 605485 603567 601152 598430 595447 592218 588859 585415 581672 577429 572974 568966 565778 563205 560863
51469 560863 558550 556165 553585 550859 548233 545835 543512 541140 538865 536928 535468 534635 534588 535253 536371
51454 536371 537984 540567 544477 549628 555988 564051 574387 586944 601272 617383 636037 658175 684282
51441 684282 714116 746651 780157 812547 841773 866055 884124 895637 901375 902878 901872 899783
51429 899783 897199 893385 886594 875299 859110 838629 814956 789833 765694 744727 727739 714254
51417 714254 703568 695249 688840 683807 679925 677308 675874 675192 674858 674699 674543 674286 674273 675172 677315 680458
51401 680458 684321 689011 694818 701956 710601 720852 732474 745123 758929 774476 792018 811250
51389 811250 832215 856063 884393 918040 956955 1001159 1051333 1108439 1173129 1245743 1326712
51378 1326712 1416659 1515837 1623226 1736160 1851016 1964272 2072699 2172538 2258996 2326945
51368 2326945 2372125 2391730 2384463 2350698 2292627 2213815 2118407 2010635 1894688 1774498 1653489
51357 1653489 1534647 1420748 1314348 1217556 1131851 1057832 994900 941521 896280 858519 827534
51346 827534 801502 778039 755910 735446 717100 700465 685127 671658 660859 652487 645543 639574
51334 639574 634793 630968 627102 622416 616984 611182 605203 599369 594211 589720 585122 579934 574839 570885
51320 570885 568126 565638 562681 559274 555869 553113 551830 552493 554596 557054 559429 562322 566439 571692
51306 571692 577398 582972 588243 593364 598578 603901 608948 613308 616973 620007 621831 621392 618204 612843
51292 612843 606340 599582 593420 588709 585747 584024 582782 581634 580532 579717 579903 581852 585256 588588 590579
51277 590579 591420 591934 592127 591382 589738 587972 586405 584506 581981 579496 577978 577601 577819 578116 578461 579146
51261 579146 580354 581876 583264 584245 584822 584963 584603 584166 584547 586047 587801 588998 590356 593480 598819 605182
51245 605182 611325 617069 622552 627399 631256 634379 636854 637682 635490 630073 622669 614769 607128 599816
51231 599816 592747 586014 579966 575025 571312 568551 566442 564963 564131 563706 563418 563329 563604 564025 564068 563502 562668
51214 562668 562136 562267 563122 564628 566715 569327 572342 575542 578821 582436 586829 592069 597607 602727 607106
51199 607106 610817 614012 616805 619358 621794 624071 626074 627796 629273 630455 631371 632395 634155 637083
51185 637083 641149 645999 651240 656575 661744 666439 670335 673260 675268 676329 675973 673458 668452 661435
51171 661435 653310 644791 636306 628276 621125 614935 609316 603800 598380 593617 590078 587662 585621 583438
51157 583438 581556 580888 581615 582859 583726 584291 585273 587093 589652 592799 596471 600372 603983 607054 609743
51142 609743 612126 613774 613983 612351 609067 604793 600246 595656 590597 584579 577952 571965 567708 565108
51128 565108 563242 561537 560397 560607 562376 565127 568110 571053 574271 578237 583006 587969 592226 595392
51114 595392 598049 601232 605438 610302 615204 619871 624222 627966 630827 632970 634764 636104 636426 635519 633907
51099 633907 632161 630225 627812 625245 623426 622904 623369 624242 625547 627882 631523 635773 639448 642044 644164
51084 644164 646617 649268 651129 651527 650697 649080 646521 642610 637540 632138 627093 622541 618493 615202 612926
51069 612926 611598 611000 611138 612172 614070 616626 619873 624228 630048 637083 644572 651838 658682 665246 671718
51054 671718 678225 684672 690517 694996 697925 700148 702829 706420 710685 715546 721281 727827 734594 741340
51040 741340 748703 757366 767066 777046 787239 798381 810909 824271 837411 849464 859766 867547
51028 867547 872005 872686 869675 863433 854439 842969 829292 814146 798796 784401 771390 759716 749599
51015 749599 741697 736514 733951 733514 734735 737380 741562 747699 756031 766000 776415 786458 796302 806471
51001 806471 816800 826396 834570 841460 847618 853232 857973 861502 863874 865376 866151 866247 866068 866543 868662
50986 868662 872883 879161 887530 898506 912888 931235 953509 979099 1007166 1036995 1068046 1099714
50974 1099714 1131207 1161795 1191071 1218816 1244790 1268895 1291431 1312939 1333866 1354665 1376017
50963 1376017 1398497 1421993 1445984 1470546 1496546 1524570 1554108 1584202 1614419 1644583 1673837
50952 1673837 1700779 1724581 1745330 1763155 1777708 1788899 1797594 1804943 1811266 1816229 1820096 1824184
50940 1824184 1829781 1836904 1844329 1850458 1853733 1852488 1845169 1831119 1811000 1786192 1757943 1727271 1695373
50927 1695373 1663563 1632621 1602534 1572968 1543638 1514051 1483303 1450674 1416339 1381070 1345326
50916 1345326 1309116 1272862 1237870 1205532 1176214 1149183 1123563 1099120 1076290 1055749 1037994
50905 1037994 1023080 1010590 999897 990497 982083 974398 967191 960371 954127 948803 944586 941246 938240
50892 938240 935246 932631 931165 931120 931854 932497 932865 933461 934824 937228 940784 945192 949427 952382 954138 956055
50876 956055 959252 963458 967808 972244 977402 983427 989756 996151 1003147 1011270 1020422 1030376 1041351 1053647
50862 1053647 1067130 1081519 1097004 1114182 1133654 1156037 1182094 1212262 1246186 1283312 1323983
50851 1323983 1369431 1420562 1477212 1538794 1605189 1676678 1753402 1835319 1922419 2014497 2110721
50840 2110721 2209789 2310391 2411152 2510224 2605432 2694861 2776864 2849470 2910459 2958452 2993511
50829 2993511 3016282 3026994 3025892 3014392 2995000 2970046 2941123 2909865 2878499 2849126 2822900
50818 2822900 2800293 2781749 2767464 2756663 2747509 2737690 2724859 2706851 2682163 2650352 2611578 2565779
50806 2565779 2512647 2452395 2386042 2314913 2240361 2164148 2088534 2015595 1946712 1882956 1825552
50795 1825552 1775495 1732957 1697534 1669025 1647569 1633123 1625273 1623634 1628008 1637881 1652051 1668992
50783 1668992 1687525 1706932 1726475 1745111 1761741 1775634 1786401 1793680 1797076 1796578 1792851 1786834
50771 1786834 1779029 1769324 1757399 1743015 1725895 1705720 1682473 1656540 1628221 1597335 1563681 1527786
50759 1527786 1490915 1454400 1419213 1386071 1355459 1327396 1301513 1277673 1256342 1238146 1223205
50748 1223205 1211103 1201475 1194370 1190069 1188733 1190321 1194697 1201773 1211678 1224803 1241528 1261799 1285153
50735 1285153 1311339 1340897 1374870 1413874 1457528 1504749 1554468 1606060 1659304 1714135 1770328
50724 1770328 1827357 1884532 1941240 1996944 2050930 2102277 2150161 2193981 2233033 2266244 2292371
50713 2292371 2310390 2319594 2319662 2311002 2294985 2273580 2248759 2222305 2195826 2170509 2146917 2125374
50701 2125374 2106483 2090876 2078580 2068968 2061196 2054214 2046529 2036693 2024146 2008997 1990854 1968590
50689 1968590 1941602 1910689 1877386 1843076 1809207 1777625 1749859 1726336 1706952 1692161 1682913
50678 1682913 1679828 1683141 1693260 1710615 1734988 1765735 1802701 1846214 1896136 1951589 2011724 2075971
50666 2075971 2143182 2211198 2277701 2341106 2400340 2454359 2502498 2544915 2582157 2614383 2641487
50655 2641487 2663835 2682384 2698036 2711142 2721622 2729262 2733891 2735492 2734328 2731037 2726739 2722922 2720896
50642 2720896 2721246 2724172 2730487 2741786 2759342 2783209 2812790 2847796 2887983 2932246 2978803 3026318
50630 3026318 3074250 3122120 3169255 3215424 3260998 3306013 3349456 3389458 3423232 3446272 3452629
50619 3452629 3437416 3399364 3340721 3265410 3178359 3086206 2996712 2916156 2847435 2790841 2745975
50608 2745975 2712367 2689004 2674267 2666310 2663050 2661939 2660272 2655689 2645999 2628860 2602296 2565624
50596 2565624 2519456 2464801 2402622 2334236 2261553 2186646 2111315 2037092 1965200 1896400 1831246
50585 1831246 1770578 1715370 1665961 1621848 1582422 1547495 1516965 1490517 1468091 1450219 1437396
50574 1437396 1429255 1424836 1423595 1425715 1431442 1440493 1452293 1466564 1483513 1503410 1526033 1550686
50562 1550686 1576799 1604390 1633641 1664119 1694811 1725059 1755091 1785590 1817132 1850341 1886187
50551 1886187 1925678 1969356 2017275 2069140 2124131 2180718 2237022 2291355 2342501 2389882 2433802
50540 2433802 2475237 2515051 2553720 2592115 2632116 2675813 2724189 2777090 2834374 2896451 2963727
50529 2963727 3036172 3113775 3197008 3286565 3382933 3486404 3597239 3715377 3839924 3968996
50519 3968996 4100099 4230649 4358140 4479906 4592905 4694022 4780583 4850313 4900871 4929914
50509 4929914 4935965 4918865 4879160 4817519 4735285 4635270 4521383 4397564 4267623 4135916
50499 4135916 4007354 3886450 3776691 3680947 3601982 3542215 3503110 3484870 3486409 3505423 3538560
50488 3538560 3581665 3629904 3678011 3720771 3753260 3770620 3768103 3742080 3691201 3616475 3520482
50477 3520482 3406869 3280190 3145284 3006381 2866970 2730289 2599292 2476093 2361872
50468 2361872 2257387 2163028 2078411 2002614 1934984 1875191 1822332 1774661 1730621 1689727 1652125
50457 1652125 1617664 1585752 1555801 1527459 1500575 1475149 1451185 1428605 1407612 1389020 1373667
50446 1373667 1361390 1351093 1341957 1334017 1327460 1322080 1317773 1314864 1313497 1313297 1314136 1316635 1321281 1327564
50432 1327564 1334705 1342872 1352911 1365110 1379010 1394356 1411492 1430756 1452043 1475159 1500152 1527206
50420 1527206 1556448 1587924 1621588 1657446 1695925 1737862 1783796 1833533 1886773 1943833 2005214
50409 2005214 2070829 2140384 2214202 2292645 2374557 2457307 2538795 2618646 2696911 2772291 2842463
50398 2842463 2905731 2961540 3009482 3048520 3077263 3094366 3098554 3088892 3065390 3029048 2981056 2922317
50386 2922317 2854062 2778558 2698748 2617360 2536802 2459698 2388748 2325878 2271962 2227575 2193486
50375 2193486 2170049 2156561 2151575 2153562 2160826 2171186 2182262 2191963 2198201 2198448 2190294 2172495 2145056
50362 2145056 2108399 2063106 2010473 1952603 1891694 1829559 1767748 1707439 1648955 1591923 1536129
50351 1536129 1481939 1429902 1380571 1334739 1293084 1255424 1220994 1189729 1162484 1139676 1120531
50340 1120531 1104122 1090317 1079118 1069848 1061807 1055033 1049581 1044598 1039080 1033118 1027390 1021686 1014958
50327 1014958 1006807 998033 989655 982109 975425 969465 963885 958479 953684 950217 948229 947267 946993 947434 948692
50312 948692 951066 955281 961868 970318 979560 989225 999743 1011235 1023162 1035119 1047156 1059106 1070364
50299 1070364 1080536 1089606 1097353 1103447 1108289 1112859 1117338 1120764 1122441 1122649 1121406 1117567 1110198 1100209
50285 1100209 1089612 1079566 1069995 1060638 1051446 1042244 1033079 1024865 1018682 1014339 1010567 1006881 1004400
50272 1004400 1004437 1007006 1011202 1016452 1022740 1029990 1037910 1046418 1055678 1065617 1075683 1085199 1093782 1101389
50258 1101389 1108089 1113938 1119089 1123956 1129085 1134644 1139957 1143762 1145153 1144313 1142274 1140003 1137863 1135918
50244 1135918 1134577 1134738 1137269 1142429 1149876 1159132 1169915 1181958 1194613 1206773 1217167 1224640 1228222
50231 1228222 1227205 1221428 1211515 1198676 1184138 1168824 1153523 1139060 1126010 1114285 1103284 1092517
50219 1092517 1081889 1071365 1060671 1049558 1038208 1027083 1016354 1005651 994460 982796 971533
50208 971533 961956 954742 949330 944440 939209 933575 927641 921310 914830 909142 904985 901854 898501 894480
50194 894480 890632 887908 886220 884728 882934 881161 880110 880175 881130 882409 883735 885507 888462 893064 899345
50179 899345 907254 916803 927878 940240 953825 968753 984878 1001658 1018695 1036309 1055296 1076193
50167 1076193 1098945 1123257 1149124 1176926 1207159 1240205 1276452 1316507 1361021 1410173 1463469
50156 1463469 1520148 1579649 1641637 1705804 1771786 1838919 1905701 1969669 2028300 2080201 2125394
50145 2125394 2164701 2199129 2229517 2256107 2278249 2294712 2304156 2304967 2295002 2272386 2236895 2190096
50133 2190096 2134003 2070172 2000319 1927102 1853556 1781898 1713304 1648661 1588997 1535217 1487768
50122 1487768 1446716 1411891 1382899 1359112 1339790 1324163 1311402 1300485 1290089 1278630 1264587
50111 1264587 1246892 1225163 1199851 1172364 1144804 1119097 1096094 1075602 1057175 1040643 1025980
50100 1025980 1013139 1002307 994023 988702 986014 984883 984155 983290 982538 982495 983537 985676 988833 992962 997813
50085 997813 1002884 1007804 1012460 1016577 1019592 1021330 1022388 1023390 1024295 1025111 1026875 1030902 1037159 1044331 1051642
50070 1051642 1059666 1069116 1079774 1091066 1102900 1115395 1128440 1142059 1156640 1172232 1188160 1203864
50058 1203864 1219629 1235975 1252890 1270384 1289274 1310580 1334409 1360236 1388161 1419158 1454182
50047 1454182 1493659 1537873 1587242 1642150 1703040 1770742 1846213 1929863 2021419 2120376 2226058
50036 2226058 2337149 2451605 2567162 2681732 2793454 2901021 3004303 3104420 3202817 3300136
50026 3300136 3395719 3487856 3574319 3652681 3720076 3772792 3806585 3817927 3805135 3768324 3708642
50015 3708642 3627799 3528079 3412323 3283920 3146916 3005832 2864856 2727184 2595174 2470785
50005 2470785 2355462 2249844 2154110 2068572 1993662 1929578 1876338 1833882 1801575 1777700 1759993
49994 1759993 1746573 1735811 1725481 1712896 1696249 1675472 1651636 1625792 1598372 1569164 1537627
49983 1537627 1503549 1467546 1430743 1394130 1358495 1324831 1294127 1266750 1242556 1221627 1204315
49972 1204315 1190512 1179621 1171528 1166919 1166166 1168457 1172536 1177888 1184617 1192520 1201034 1210083 1220424
49959 1220424 1232982 1248122 1265655 1285364 1307355 1331945 1359231 1388769 1419712 1451108 1481921
49948 1481921 1510889 1536775 1558784 1576368 1588630 1594508 1593889 1588142 1579120 1567773 1554001 1537473
49936 1537473 1518090 1495805 1470704 1443525 1415869 1389671 1366475 1347204 1332434 1322746 1318788 1321058
49924 1321058 1329815 1345381 1368370 1399244 1437669 1482774 1534201 1592327 1656993 1726382 1797744
49913 1797744 1869009 1939094 2006892 2070958 2130668 2187173 2242721 2299260 2357897 2419090 2482401
49902 2482401 2545764 2605344 2656433 2694574 2716102 2718285 2699587 2660026 2601212 2525963 2437796
49891 2437796 2340498 2237809 2133124 2029226 1928085 1830849 1738152 1650624 1569193 1494857
49881 1494857 1428188 1369048 1316688 1269971 1227566 1188201 1151068 1116076 1083727 1054699 1029411
49870 1029411 1007818 989519 974119 961544 951963 945395 941533 940039 940939 944591 951335 961283 974409
49857 974409 990649 1009782 1031292 1054460 1078644 1103329 1127757 1150579 1170141 1185342 1196105
49846 1196105 1202885 1205888 1205037 1200524 1192933 1182629 1169337 1152507 1131974 1108186 1082094 1054962
49834 1054962 1028099 1002609 979477 959819 944642 934155 927646 924254 923662 925808 930360 936910 945550
49821 945550 956860 971352 989196 1010301 1034268 1060271 1087277 1114330 1140443 1164369 1184888
49810 1184888 1201418 1214120 1223468 1229935 1233928 1235578 1234461 1229770 1220910 1207924 1191451 1172506 1152325
49797 1152325 1132195 1113262 1096255 1081113 1066906 1052579 1038035 1024133 1011538 1000118 989843
49786 989843 981564 976154 973302 971998 971939 973523 976590 980208 983907 988236 993746 1000210 1007314 1015450 1025342
49771 1025342 1037346 1051524 1067903 1086098 1104971 1123054 1139109 1152054 1160830 1164871 1164611 1161250
49759 1161250 1156129 1150241 1143729 1135498 1123793 1107612 1087321 1063771 1037472 1009086 980067 952029
49747 952029 925767 901575 880189 862571 848809 837969 829123 821966 816437 812406 809892 809061 809726
49734 809726 811302 813421 816287 820264 825473 831890 839452 847940 857127 867205 878653 891483 905096
49721 905096 919246 934759 952759 973248 994816 1015599 1034149 1049506 1061077 1068806 1073222 1074975
49709 1074975 1074260 1070752 1063992 1053733 1040079 1023495 1004714 984500 963468 942320 922273 904901
49697 904901 891256 881126 873437 867389 862965 860341 859172 858788 858945 860075 862826 867612 874553 883568
49683 883568 894331 906325 919123 932584 946746 961662 977487 994583 1013201 1033042 1053396
49672 1053396 1073825 1094382 1114736 1133275 1147631 1156367 1159868 1159526 1156397 1150976 1143822 1135671 1126820
49659 1126820 1116800 1104810 1090316 1073164 1053406 1031173 1006670 980314 953035 926279 901404
49648 901404 879047 859292 842315 828382 817205 807867 799664 792618 786936 782360 778464 775255 772955
49635 772955 771306 769532 767038 763845 760373 757046 754101 751459 748697 745369 741440 737293 733320 729692
49621 729692 726517 723966 722043 720408 718634 716633 714708 713158 712022 711282 711118 711644 712389 712479 711607 710552
49605 710552 710356 711122 712064 712673 713304 714442 715858 716823 716891 716169 715043 713959 713336 713379 713893 714438 714646 714388
49587 714388 713752 712997 712447 712303 712598 713339 714581 716381 718788 721814 725217 728437 731119 733706 737143 742002
49571 742002 748288 756065 765651 776928 789147 801899 815801 831683 849452 868231 887186 905504
49559 905504 921828 934634 943317 948384 950472 949696 946086 940121 932559 924059 915146 906282 897782 889807
49545 889807 882513 875976 869950 863959 857721 851307 844953 838915 833508 828938 825131 822016 819991 819731
49531 819731 821522 825111 830236 836793 844351 852081 859624 867730 877558 889458 902808 916883 931465
49518 931465 946489 961437 975401 987691 998273 1007549 1015778 1022877 1028915 1034588 1040815 1047690 1054080
49505 1054080 1058535 1060402 1059785 1056564 1049935 1039179 1024633 1007638 989630 971630 954567 939553
49493 939553 927336 917628 909445 902221 896241 891838 888582 885707 883062 881175 880241 879524 878038 875719
49479 875719 873651 873031 873966 875408 876291 876622 877296 878968 881473 884343 887547 891433 896316 902427 910079
49464 910079 919434 930146 941522 952998 964258 975021 985069 994319 1002473 1008675 1011992 1012288 1010145
49451 1010145 1005851 999058 989685 978689 967375 956191 944625 932226 919310 906673 894955 884498
49439 884498 875687 869161 865478 864499 865305 867022 869691 874065 880515 888614 897918 908777 921944 937789
49425 937789 956321 977719 1002133 1029025 1057401 1086781 1117050 1146770 1172161 1188634 1193380 1186254
49413 1186254 1168719 1143014 1112440 1081331 1053670 1031696 1015994 1006447 1002599 1003472 1007861 1015049
49401 1015049 1024928 1037436 1052248 1068974 1087193 1106196 1125139 1143630 1161784 1179466 1195781
49390 1195781 1209598 1220321 1227906 1232299 1233197 1230313 1223738 1214057 1202125 1188594 1173576 1156943 1138985
49377 1138985 1120637 1103137 1087690 1075330 1066611 1061298 1058805 1059076 1062589 1069336 1078333 1088402 1098817
49364 1098817 1108847 1117342 1123436 1127197 1128878 1127864 1123276 1115484 1106199 1096918 1087851 1078405 1068156
49351 1068156 1057247 1046445 1036926 1029482 1023821 1019044 1014876 1011874 1010333 1009622 1008912 1008069 1007529 1007669 1008506
49336 1008506 1009650 1010259 1009498 1007379 1004877 1002909 1001575 1000648 1000376 1001228 1003111 1005391 1007629 1009800 1011776
49321 1011776 1013066 1013220 1012278 1010723 1009194 1008303 1008397 1009315 1010505 1011638 1013083 1015593 1019364 1023524 1026784
49306 1026784 1028697 1030175 1032599 1036541 1041478 1046641 1051848 1057439 1063691 1070521 1077611 1084591 1091009 1096355
49292 1096355 1100326 1103106 1105159 1106592 1106869 1105424 1102494 1098928 1095130 1090617 1084884 1078280 1071676 1065631
49278 1065631 1060388 1056413 1054277 1053935 1054649 1055823 1057585 1060468 1064840 1070797 1078309 1087246 1097388 1108549
49264 1108549 1120669 1133705 1147349 1160790 1172866 1182912 1191630 1200743 1211562 1224283 1238954 1256458
49252 1256458 1277711 1302236 1328304 1354284 1378981 1400735 1417314 1427148 1430112 1426866 1418198 1405347
49240 1405347 1390235 1374656 1359472 1344919 1331357 1319311 1309106 1300832 1294560 1290414 1288656 1289799
49228 1289799 1294349 1302324 1313342 1327139 1343479 1361453 1379503 1396456 1412136 1426731 1440061 1451681
49216 1451681 1461125 1467682 1470483 1469268 1464740 1457900 1449560 1440829 1433337 1428339 1426050 1426509 1430541 1439106
49202 1439106 1452072 1468484 1487866 1510294 1535120 1560427 1584069 1604787 1622131 1635711 1644812
49191 1644812 1648644 1646921 1640425 1630974 1620546 1610317 1600575 1591465 1583621 1578186 1576309 1578520 1584524
49178 1584524 1593885 1607002 1625020 1648591 1677027 1708972 1743470 1780087 1818323 1857300 1895669
49167 1895669 1931339 1961562 1983737 1996059 1997518 1988148 1969998 1947207 1924121 1903343 1886017 1873332
49155 1873332 1866588 1865870 1869700 1876278 1884482 1893639 1903057 1912031 1919742 1925136 1927529 1927484 1926504 1925725 1925447
49140 1925447 1925902 1927747 1931518 1937213 1944724 1954121 1965246 1977524 1990487 2004027 2017814 2030938 2042445
49127 2042445 2051931 2059433 2065142 2069454 2072912 2075798 2078136 2080278 2083031 2086936 2091898 2097921 2105793 2116643
49113 2116643 2131108 2149388 2171901 2199432 2232732 2272256 2318259 2370966 2430635 2497295 2569859
49102 2569859 2645301 2719398 2788986 2853452 2913506 2968426 3014660 3047012 3061056 3054915 3029692
49091 3029692 2988822 2936974 2878944 2818622 2758156 2698003 2638261 2580223 2526334 2478617 2437645
49080 2437645 2403247 2375468 2354213 2338374 2326023 2315415 2305292 2294475 2281969 2267692 2252587
49069 2252587 2237732 2223549 2209982 2197030 2184879 2173704 2163512 2154123 2145259 2136819 2129074 2122503
49057 2122503 2117405 2113819 2111720 2111030 2111465 2112704 2114784 2118037 2122517 2127773 2133411 2139640 2146967 2155511
49043 2155511 2165013 2175451 2187261 2200724 2215442 2230762 2246658 2263947 2283572 2305913 2330843
49032 2330843 2358238 2388114 2420304 2454157 2488567 2522155 2553347 2580375 2601423 2615027 2620634
49021 2620634 2618898 2611312 2599443 2584612 2568354 2552727 2539624 2529682 2522262 2516644 2512987 2511944 2513617
49008 2513617 2517219 2521780 2526977 2533264 2541201 2550706 2561000 2571424 2582231 2594286 2607910 2622284
48996 2622284 2636191 2649107 2661267 2672877 2683713 2693602 2702834 2711793 2720386 2728236 2735380 2742355 2749340
48983 2749340 2755509 2759614 2761151 2760496 2757849 2752502 2743537 2731017 2716063 2699771 2682447 2663956 2644525
48970 2644525 2625028 2606620 2590127 2575636 2562587 2550414 2539238 2529876 2523096 2518917 2516701 2515908
48958 2515908 2516676 2519602 2524913 2532070 2540477 2550526 2563366 2579341 2597107 2614868 2632207 2650084
48946 2650084 2669198 2689172 2709449 2730136 2751546 2773580 2796184 2820005 2845990 2874520 2905460
48935 2905460 2938845 2974920 3013538 3054077 3096076 3139578 3184747 3231518 3279674 3328927 3378771
48924 3378771 3428696 3478911 3530643 3585393 3643863 3705677 3769849 3835148 3900169 3963494 4024138
48913 4024138 4081716 4136161 4187500 4236095 4282846 4328810 4374523 4419913 4464791 4509153 4553021
48902 4553021 4596409 4639729 4683890 4729560 4776324 4822875 4868021 4911267 4952424 4991070 5026635
48891 5026635 5058892 5088144 5114936 5139611 5162120 5182213 5199858 5215400 5229251 5241422 5251507
48880 5251507 5259090 5264066 5266474 5265976 5261450 5251038 5232789 5205401 5168431 5121911 5066103 5001812
48868 5001812 4930616 4854483 4775220 4694453 4613803 4534618 4457602 4383048 4311361 4242999 4178048
48857 4178048 4116315 4057761 4002373 3949683 3899029 3850435 3804664 3762192 3722646 3685546 3651123
48846 3651123 3620069 3592832 3569555 3550309 3534951 3522916 3513502 3506219 3500571 3495772 3491089 3486453
48834 3486453 3482456 3479874 3479389 3481518 3486409 3493701 3502946 3514132 3527661 3543896 3562984 3584937 3609538
48821 3609538 3636162 3664062 3692927 3722956 3754355 3786966 3820508 3854954 3890503 3927249 3965004
48810 3965004 4003508 4042741 4082952 4124363 4166972 4210641 4255234 4300553 4346404 4393032 4441320
48799 4441320 4492055 4544946 4598675 4651825 4703326 4752022 4796546 4836035 4870515 4900286 4925382
48788 4925382 4946058 4963376 4978733 4992997 5006357 5018530 5028481 5034312 5034323 5028319 5017361 5002285
48776 5002285 4983084 4959807 4933319 4904781 4874755 4843112 4809485 4773473 4734724 4693249 4649609
48765 4649609 4604470 4557966 4509727 4459590 4408105 4356136 4304024 4251290 4197332 4142365 4087500
$$ [...]
##END NTUPLES=NMR SPECTRUM
##END=
